##TITLE=AC1582_13IEXT2718_8214273_05kkdScx9Q
##JCAMPDX= 6.0         $$ Bruker NMR JCAMP-DX V2.0
##DATA TYPE= NMR SPECTRUM
##DATA CLASS= NTUPLES
##ORIGIN= BRUKER
##OWNER= Administrator
$$ 1.72 TOPSPIN		Version 2.1
$$ 2013-10-12 15:52:49.758 -0700  Administrator@X
$$ Compression mode = diff/dup
##.OBSERVE FREQUENCY= 400.02188249412
##.OBSERVE NUCLEUS= ^1H
##.ACQUISITION MODE= SIMULTANEOUS (DQD)
##.ACQUISITION SCHEME= undefined
##.AVERAGES= 64
##.DIGITISER RES= 22
##SPECTROMETER/DATA SYSTEM= spect
##.PULSE SEQUENCE= noesygpps1d.comp
##.SOLVENT NAME= COFFEE_meoh
##.SHIFT REFERENCE= INTERNAL, COFFEE_meoh, 1, 14.96057
##AUDIT TRAIL= $$ (NUMBER, WHEN, WHO, WHERE, PROCESS, VERSION, WHAT)
$$ ##TITLE= Audit trail, TOPSPIN		Version 2.1
$$ ##JCAMPDX= 5.01
$$ ##ORIGIN= Bruker BioSpin GmbH
$$ ##OWNER= Administrator
$$ $$ E:\/data/COFFEE/nmr/AC1582_13IEXT2718_8214273_05kkdScx9Q/32/pdata/1/auditp.txt
$$ ##AUDIT TRAIL=  $$ (NUMBER, WHEN, WHO, WHERE, PROCESS, VERSION, WHAT)
(   1,<2013-10-12 15:52:43.832 -0700>,<Administrator>,<X>,<go>,<TOPSPIN 2.1>,
      <created by zg
	started at 2013-10-12 15:41:11.259 -0700,
	POWCHK enabled, PULCHK disabled,
       configuration hash MD5:
       C8 4E 4E 5D D3 5C D8 9E 9F 52 82 E0 59 8A DE 15
       data hash MD5: 64K
       91 48 13 73 BD 7B E7 9C 2D 00 C1 B6 C1 DA FD AB>)
(   2,<2013-10-12 15:52:47.514 -0700>,<Administrator>,<X>,<proc1d>,<TOPSPIN 2.1>,
      <Start of raw data processing
       efp LB = 0.3 FT_mod = 6 PKNL = 1 PHC0 = 0 PHC1 = 0 SI = 128K 
       data hash MD5: 128K
       E3 73 6B B0 E3 2B A0 A9 E9 33 AC E5 67 EC 0D 95>)
(   3,<2013-10-12 15:52:48.646 -0700>,<Administrator>,<X>,<proc1d>,<TOPSPIN 2.1>,
      <pk PHC0 = -80.98572 PHC1 = 0 
       data hash MD5: 128K
       86 26 4A BB E1 64 B8 84 18 60 D6 D8 6F 73 E8 F0>)
(   4,<2013-10-12 15:52:49.087 -0700>,<Administrator>,<X>,<proc1d>,<TOPSPIN 2.1>,
      <abs ABSG = 1 
       data hash MD5: 128K
       28 68 90 5E E6 4A A9 F7 56 1F 13 5B EE B4 F9 F4>)
(   5,<2013-10-12 15:52:49.221 -0700>,<Administrator>,<X>,<proc1d>,<TOPSPIN 2.1>,
      <abs ABSG = 2 
       data hash MD5: 128K
       25 B1 3A 14 1E 6F D7 11 8B 27 C5 26 A4 B3 4F 63>)
(   6,<2013-10-12 15:52:49.336 -0700>,<Administrator>,<X>,<proc1d>,<TOPSPIN 2.1>,
      <abs ABSG = 3 
       data hash MD5: 128K
       39 D0 BF F5 91 B6 03 17 F4 FD 1F 29 43 AE FC 95>)
(   7,<2013-10-12 15:52:49.413 -0700>,<Administrator>,<X>,<proc1d>,<TOPSPIN 2.1>,
      <abs ABSG = 4 
       data hash MD5: 128K
       FC 5A 10 BB 35 CF 4A 79 AF 1E 9A 26 2C 21 07 5E>)
(   8,<2013-10-12 15:52:49.509 -0700>,<Administrator>,<X>,<proc1d>,<TOPSPIN 2.1>,
      <abs ABSG = 5 
       data hash MD5: 128K
       63 15 B6 45 E7 E9 E3 F6 56 01 38 1C 29 FD C8 D2>)
$$ ##END=
$$ 
$$ $$ hash MD5
$$ $$ 4A 40 44 6A CD 47 EA 50 7B 40 CA 1D 3E 03 23 75
##$RELAX= 
##$RELAX= 
##$RELAX= 
##$RELAX= 
##$RELAX= 
##$RELAX= 
##$RELAX= 
##$RELAX= 
$$ Bruker specific parameters
$$ --------------------------
##$DU= <E:\>
##$EXPNO= 32
$$ [...]
##$TP07= 0
##$TPNAME0= <>
##$TPNAME1= <>
##$TPNAME2= <>
##$TPNAME3= <>
##$TPNAME4= <>
##$TPNAME5= <>
##$TPNAME6= <>
##$TPNAME7= <>
##$TPOAL= (0..7)
0.5 0.5 0.5 0.5 0.5 0.5 0.5 0.5
##$TPOFFS= (0..7)
0 0 0 0 0 0 0 0
##$TUNHIN= 0
##$TUNHOUT= 0
##$TUNXOUT= 0
##$USERA1= <user>
##$USERA2= <user>
##$USERA3= <user>
##$USERA4= <user>
##$USERA5= <user>
##$V9= 5
##$VALIST= <valist>
##$VCLIST= <CCCCCCCCCCCCCCC>
##$VD= 0
##$VDLIST= <DDDDDDDDDDDDDDD>
##$VPLIST= <PPPPPPPPPPPPPPP>
##$VTLIST= <TTTTTTTTTTTTTTT>
##$WBST= 1024
##$WBSW= 4
##$XGAIN= (0..3)
0 0 0 0
##$XL= 0
##$YL= 0
##$YMAX_a= 6108340
##$YMIN_a= -11900910
##$ZGOPTNS= <>
##$ZL1= 120
##$ZL2= 120
##$ZL3= 120
##$ZL4= 120
##$ABSF1= 14.96057
##$ABSF2= -5.597611
##$ABSG= 5
##$ABSL= 3
##$ALPHA= 0
##$AQORDER= 0
##$ASSFAC= 0
##$ASSFACI= 0
##$ASSFACX= 0
##$ASSWID= 0
##$AUNMP= <proc_prof1d_extract.lims>
##$AXLEFT= 0
##$AXNAME= <>
##$AXNUC= <1H>
##$AXRIGHT= 0
##$AXTYPE= 0
##$AXUNIT= <>
##$AZFE= 0.1
##$AZFW= 0.1
##$BCFW= 0
##$BC_mod= 0
##$BYTORDP= 0
##$COROFFS= 0
##$CY= 15
##$DATMOD= 1
##$DC= 0
##$DFILT= <>
##$DTYPP= 0
##$F1P= 0
##$F2P= 0
##$FCOR= 0.5
##$FTSIZE= 131072
##$FT_mod= 6
##$GAMMA= 0
##$GB= 0
##$INTBC= 1
##$INTSCL= 1
##$ISEN= 128
##$LB= 0.3
##$LEV0= 0
##$LPBIN= 0
##$MAXI= 10000
##$MC2= 0
##$MEAN= 0
##$ME_mod= 0
##$MI= 0
##$NCOEF= 0
##$NC_proc= -2
##$NLEV= 6
##$NOISF1= 0
##$NOISF2= 0
##$NSP= 0
##$NTH_PI= 0
##$NZP= 0
##$OFFSET= 14.96057
##$PC= 1
##$PHC0= -80.98572
##$PHC1= 0
##$PH_mod= 1
##$PKNL= yes
##$PPARMOD= 0
##$PPDIAG= 0
##$PPIPTYP= 0
##$PPMPNUM= 2147483647
##$PPRESOL= 1
##$PSCAL= 4
##$PSIGN= 0
##$PYNMP= <proc.py>
##$REVERSE= no
##$SF= 400.020009808784
##$SI= 131072
##$SIGF1= 0
##$SIGF2= 0
##$SINO= 400
##$SIOLD= 131072
##$SPECTYP= <>
##$SREGLST= <1H.CDCl3>
##$SSB= 0
##$STSI= 131072
##$STSR= 0
##$SW_p= 8223.68421052631
##$SYMM= 0
##$S_DEV= 0
##$TDeff= 65536
##$TDoff= 0
##$TI= <>
##$TILT= no
##$TM1= 0
##$TM2= 0
##$TOPLEV= 0
##$USERP1= <user>
##$USERP2= <user>
##$USERP3= <user>
##$USERP4= <user>
##$USERP5= <user>
##$WDW= 1
##$XDIM= 131072
##$YMAX_p= 340141207
##$YMIN_p= -11233
##$CURPLOT= <Network HP LaserJet P1505>
##$CURPRIN= <$Network HP LaserJet P1505>
##$DFORMAT= <normdp>
##$LAYOUT= <+/1D_H.xwp>
##$LFORMAT= <normlp>
##$PFORMAT= <normpl>
##$SURQMSG= 1
$$ End of Bruker specific parameters
$$ ---------------------------------
##NTUPLES= NMR SPECTRUM
##VAR_NAME=  FREQUENCY,     SPECTRUM/REAL,   SPECTRUM/IMAG
##SYMBOL=    X,             R,               I
##VAR_TYPE=  INDEPENDENT,   DEPENDENT,       DEPENDENT
##VAR_FORM=  AFFN,          ASDF,            ASDF
##VAR_DIM=   131072,        131072,          131072
##UNITS=     HZ,            ARBITRARY UNITS, ARBITRARY UNITS
##FACTOR=    0.0627417313425164, 1,          1
##FIRST=     8223.62146879497, 270,          -61745
##LAST=      0,             1906,            -61544
##MIN=       0,             -11233,          0
##MAX=       8223.62146879497, 340141207,    0
$$ Real data points
##PAGE= N=1
##DATA TABLE= (X++(R..R)), XYDATA
$$ [...]
61743D97496j207j629j725j593j145m69Q9L99P43J280J758J944K023K304K713
61728E02981K901K718K382K244K547L320M369N408O215O667O658O101N068L844
61714E63423K802K189J937J614P14r12k904m784o296p316p684p418o900o531o275
61699E15659n872n415n290n595n906n749n052m110l347l091l192k954j837l33
61685D57916L63k67j445k105k076j870j758j558j179p39k64K88O58M51k44q43
61669D45328j008r82j011r38o58n25p82r52m43L95N89o9o84n77j88j76k40M45
61651D37524J922L340M082M281M266M211M409N180O196O530N765M540L611K842
61637D98699J613j88k136l915n325o010n837n481n771o432o267m838l197k492
$$ y = [497496, 496289, 494660, 492935, 491342, 490197, 489728, 489817, 490216, 490959, 492239, 493997, 495941, 497964, 500268, 502981, 505882, 508600, 510982, 513226, 515773, 519093, 523462, 528870, 535085, 541752, 548410, 554511, 559579, 563423, 566225, 568414, 570351, 571965, 572679, 571767, 568863, 564079, 557783, 550467, 542783, 535365, 528465, 521934, 515659, 509787, 504372, 499082, 493487, 487581, 481832, 476780, 472670, 469323, 466232, 463040, 460086, 458249, 457916, 458279, 458012, 456567, 454462, 452386, 450516, 448758, 447200, 446021, 445282, 445018, 445306, 445964, 446415, 446171, 445328, 444320, 443338, 442327, 441389, 440731, 440206, 439424, 438472, 438029, 438424, 439013, 438944, 438260, 437683, 437495, 437319, 437079, 437524, 439446, 442786, 446868, 451149, 455415, 459626, 464035, 469215, 475411, 481941, 487706, 492246, 495857, 498699, 500312, 500124, 497988, 494073, 488748, 482738, 476901, 471420, 465649, 459217, 452950, 448112, 444915, 442423]
61623D42423k439j881m01J305K526L192L440L203K582K066J903J600N28j196k944
61608D55907m482o053p599q620r009r297r677r531q541p610p783q617q723p700
61594C42665o510n843n307m556m079m223m412m064l581l531l596l202k693k768
61580B84300l205l166k614k296k419k396j985j623j489j230q77j046j756k028
61566B56170j302m08l69q94r32l22J04j57o53p60m58q2J62K33J59R6L31J022J923
61547B53863K482K266J405N49K44M06O25R22J705K902L728L646L125K915K953
61532B83736K653K053J874K307K533J772L15r86j829k547l256l591l356k904k680
61517B76094k646k465j998j354o94k52l58j049j748j807j340j078j312j552j372
$$ y = [442423, 439984, 438103, 437702, 439007, 441533, 444725, 448165, 451368, 453950, 456016, 457919, 459519, 460047, 458851, 455907, 451425, 445372, 437773, 429153, 420144, 410847, 401170, 391639, 383098, 375488, 367705, 359088, 350365, 342665, 336155, 330312, 325005, 320449, 316370, 312147, 307735, 303671, 300090, 296559, 292963, 289761, 287068, 284300, 281095, 277929, 275315, 273019, 270600, 268204, 266219, 264596, 263107, 261877, 261000, 259954, 258198, 256170, 254868, 254460, 254091, 253197, 252265, 251943, 252047, 251890, 251237, 250477, 250019, 249937, 250099, 250332, 250491, 250587, 250918, 251940, 253863, 256345, 258611, 260016, 260565, 260809, 261215, 261840, 262762, 264467, 267369, 271097, 274743, 277868, 280783, 283736, 286389, 288442, 290316, 292623, 295156, 296928, 297243, 296257, 294428, 291881, 288625, 285034, 281678, 278774, 276094, 273448, 270983, 268985, 267631, 266937, 266685, 266327, 265278, 263530, 261723, 260383, 259305, 257993, 256441, 255069]
61502B55069j073j104j296j167o92k60j24k93o97r87m66J037K433K306P05p85
61486B52606r37j52M39M50L37M64P29R16R68Q90P21N69N72P63J024J096P15o1
61468B62109o94o48RP30J144J219R37K94l39m49p7K41L42N96J040J072M50j11
61450B67865J09P78J100J050J278J990K637K749K517K526L204M507N920O793O950
61435C11973O786O687O665O736P121P619P356N791L660K170J560J148O41N04J031
61420C77448J931K947M117N174N361M294K535R36j85r53j491j868k211k531k695
61405C92809k816l325m378n392n540m625l261k346k363l027l496l207k519k242
61391C44272k478k444j654p04m52q10j011p94o83j022j370j132m40j4k41o52m41
$$ y = [255069, 253996, 252892, 251596, 250429, 249737, 249477, 249353, 249060, 248363, 247376, 246910, 247947, 250380, 252686, 253391, 252606, 251669, 251517, 251956, 252406, 252743, 253207, 253936, 254852, 255820, 256710, 257431, 258000, 258572, 259335, 260359, 261455, 262170, 262109, 261415, 260767, 260776, 261506, 262650, 263869, 264806, 265100, 264761, 264312, 264235, 264476, 264818, 265414, 266454, 267526, 267976, 267865, 267974, 268752, 269852, 270902, 272180, 274170, 276807, 279556, 282073, 284599, 287803, 292310, 298230, 305023, 311973, 318759, 325446, 332111, 338847, 345968, 353587, 360943, 366734, 370394, 372564, 374124, 375272, 375913, 376417, 377448, 379379, 382326, 386443, 391617, 396978, 401272, 403807, 404743, 404558, 403605, 402114, 400246, 398035, 395504, 392809, 389993, 386668, 382290, 376898, 371358, 366733, 363472, 361126, 358763, 355736, 352240, 349033, 346514, 344272, 341794, 339350, 337696, 336992, 336540, 335730, 334719, 333925, 333242, 332220, 330850, 329718, 329278, 329264, 329023, 328371, 327930]
61374C27930N54J593J885J603J706K590L409L078J751O96P81J627K424K995L704
61359C58326M639N448N857N943N889N848O084O940Q437J0180J1758J3067J4079
61346D62495J4544J4263J3487J2738J2256J1881J1409J0790R932Q713P260N946
61334E95714M906L833K429Q77m35j488k668m257o050p484q067p754p043o599o654
61319E49260o865o759o175n205m079l227l162l879m608m549l724k716j729m48
61305D92135J161K531L160L221L203L193K892K148J194L79j76o36j313k381l623
61290E07088m531m727m318l760l417l315l193k743j821n96N24J172J351J483K051
61275D81248L151M386N279N734N974O155O279O459O917P627Q229Q490Q605Q853
$$ y = [327930, 328484, 330077, 331962, 333565, 335271, 337861, 341270, 344348, 346099, 346795, 347576, 349203, 351627, 354622, 358326, 362965, 368413, 374270, 380213, 386102, 391950, 398034, 404974, 413411, 423591, 435349, 448416, 462495, 477039, 491302, 504789, 517527, 529783, 541664, 553073, 563863, 573795, 582508, 589768, 595714, 600620, 604453, 606882, 607759, 607324, 605836, 603168, 598911, 592861, 585377, 577310, 569556, 562513, 555914, 549260, 542395, 535636, 529461, 524256, 520177, 516950, 513788, 509909, 505301, 500752, 497028, 494312, 492583, 492135, 493296, 495827, 498987, 502208, 505411, 508604, 511496, 513644, 514838, 515217, 515041, 514405, 513092, 510711, 507088, 502557, 497830, 493512, 489752, 486335, 483020, 479827, 477084, 475263, 474667, 475191, 476363, 477714, 479197, 481248, 484399, 488785, 494064, 499798, 505772, 511927, 518206, 524665, 531582, 539209, 547438, 555928, 564533, 573386]
61261E73386R273R971J1332J3502J5836J7398J7915J7785J7265J6180J4438J2247
61249G46528R712O757L557N35k250n180q251j0738j2112j2817j3581j4352j4518
61236F73290j3983j3317j2902j2530j1930j1227j0620j0034r280q338p224n922
61224E45983m562l483k865k502k184k110k537l127l095k159j009n33p61r02l77
61209E13777N30J092R49L80j6J92Q95J530J762K104L402N577P411Q048Q140Q884
61193E64657J0285J1351J1824J2560J3887J4686J3806J1666R633Q327P410O704
61181F96796O442O432N937M694L386K662K232J398J42q74j313j666k603m074n379
61166G14212o057o475p398r034j0797j2010j2573j2828j3016j3134j3112j2821
$$ y = [573386, 582659, 592630, 603962, 617464, 633300, 650698, 668613, 686398, 703663, 719843, 734281, 746528, 756240, 762997, 766554, 767089, 764839, 759659, 751408, 740670, 728558, 715741, 702160, 687808, 673290, 659307, 645990, 633088, 620558, 608628, 597401, 586781, 576747, 567467, 559129, 551905, 545983, 541421, 537938, 535073, 532571, 530387, 528277, 525740, 522613, 519518, 517359, 516350, 515817, 515056, 514154, 513777, 514307, 515399, 516348, 516728, 516712, 516904, 517799, 519329, 521091, 523195, 526597, 532174, 539585, 547633, 555773, 564657, 574942, 586293, 598117, 610677, 624564, 639250, 653056, 664722, 674355, 682682, 690092, 696796, 703238, 709670, 715607, 720301, 723687, 726349, 728581, 729979, 730121, 729247, 727934, 726268, 723665, 719591, 714212, 708155, 701680, 694282, 685248, 674451, 662441, 649868, 637040, 624024, 610890, 597778, 584957]
61154E84957j2083j0909r626q446p106n323l491k389k232k535k952l650m655n498
61140E04062n905o325p205q133q263p476o449n690n024m146l122k157j199p8J264
61125D34154K864M805O993Q996J0382J1098J1429J1674J1962J2311J2716J3202
61113E52586J3826J4517J4988J4968J4578J4203J3898J3246J1959J0368Q978P809
61101G05924O534N063L521J752n79l258n518p030q463j0586j3146j5159j6162
61088F42893j6615j7022j7125j6345j4717j3079j2253j2215j2172j1484j0402
61077D89464r734r850j0257j0267r738q928p889o530n157m375m318m433m248l953
61063C89787l912l935l479k375j047PO22R16J119J411J761K016K315L200M903
$$ y = [584957, 572874, 561965, 552339, 543893, 536787, 531464, 527973, 525584, 523352, 520817, 517865, 514215, 509560, 504062, 498157, 491832, 484627, 476494, 468231, 460755, 454306, 448616, 443592, 439446, 436324, 434167, 432968, 432890, 434154, 437018, 441823, 448816, 457812, 468194, 479292, 490721, 502395, 514357, 526668, 539384, 552586, 566412, 580929, 595917, 610885, 625463, 639666, 653564, 666810, 678769, 689137, 698115, 705924, 712458, 717521, 721042, 722794, 722215, 718957, 713439, 706409, 697946, 687360, 674214, 659055, 642893, 626278, 609256, 592131, 575786, 561069, 547990, 535737, 523522, 511350, 499866, 489464, 479730, 469880, 459623, 449356, 439618, 430690, 422801, 416271, 411114, 406739, 402421, 397988, 393740, 389787, 385875, 381940, 378461, 376086, 375039, 375046, 375668, 376584, 377703, 379114, 380875, 382891, 385206, 388406, 393309]
61048C93309O739P687P573P256P544Q416R400J0211J0728J0874J0856J1161J1809
61035E13563J2116J1640J1055J1281J2050J2221J1516J1004J1558J2714J3623
61024F44341J4453J6111J9096K3367K9029L6311M4986N4548O4933P6469Q9223
61013A112867J03128J18355J33962J45649J46634J32689J06416P5543M7252K5138
61003B147633J1009O744J2177K1898K6531J8517l287l4221o7615r7527j19520
60992A922339j31178j32893j27463j18163j07172r5645q4512p4514o5918n8698
60982I26183n2845m8014m3308l8178l3370l0171k8607k7276k5099k2478k0294
60971E56543j8593j6910j5197j3660j2039r982q029p226p680q175p580o079m667
$$ y = [393309, 400048, 407735, 415308, 422564, 430108, 438524, 447924, 458135, 468863, 479737, 490593, 501754, 513563, 525679, 537319, 548374, 559655, 571705, 583926, 595442, 606446, 618004, 630718, 644341, 658794, 674905, 694001, 717368, 746397, 782708, 827694, 882242, 947175, 1023644, 1112867, 1215995, 1334350, 1468312, 1613961, 1760595, 1893284, 1999700, 2075243, 2122495, 2147633, 2158642, 2165386, 2177563, 2199461, 2225992, 2244509, 2241222, 2207001, 2139386, 2041859, 1922339, 1791161, 1658268, 1530805, 1412642, 1305470, 1209825, 1125313, 1050799, 984881, 926183, 873338, 825324, 782016, 743838, 710468, 680297, 651690, 624414, 599315, 576837, 556543, 537950, 521040, 505843, 492183, 480144, 470162, 462133, 454907, 447227, 439052, 431472, 425393, 420726]
60958D20726l847l226k233q21N84J620K305K819L108L018K820L192M375N656O070
60943D46166N483M532L706K933K091J323P68K92l15j148k124k891k941k231j528
60928D54116j606k176k273j656j044q88p82m76n28j312k047j739n66M52Q82J048
60912D39405J014L72p93j651j662j226r50p89l83J88M89L67R2k3J78P33J468J861
60894D38690J424K99p33j011o01o2K08J50j87o76q83k27J275K742L269L020L034
60877D49731L946N315O393P090P859Q834R601R850R846J0057J0466J0543R991
60864E59522R366R584J0783J1986J2339J2282J2914J4309J5246J4964J4357J4832
60852G12484J6478J8096J8821J8919J9021J9267J9502J9664J9690J9245J7932
$$ y = [420726, 416879, 413653, 411420, 410599, 411183, 412803, 415108, 417927, 421035, 424053, 426873, 430065, 434440, 440096, 446166, 451649, 456181, 459887, 462820, 464911, 466234, 467002, 467294, 466979, 465831, 463707, 460816, 457875, 455644, 454116, 452510, 450334, 448061, 446405, 445361, 444473, 443691, 443215, 442687, 441375, 439328, 437589, 437023, 437475, 438357, 439405, 440419, 440791, 439998, 438347, 436685, 435459, 434509, 433720, 433337, 433525, 434014, 434381, 434473, 434450, 434628, 435361, 436829, 438690, 440114, 440413, 439680, 438669, 438068, 438006, 438214, 438364, 438177, 437501, 436618, 436391, 437666, 440408, 443677, 446697, 449731, 453677, 458992, 465385, 472475, 480334, 489168, 498769, 508619, 518465, 528522, 538988, 549531, 559522, 568888, 578472, 589255, 601241, 613580, 625862, 638776, 653085, 668331, 683295, 697652, 712484, 728962, 747058, 765879, 784798, 803819, 823086, 842588, 862252, 881942, 901187, 919119]
60841I19119J5721J3024J0373P964N448K249j714n794r326j2383j5500j8706k1320
60828H89155k2762k3175k3102k2931k2864k3021k3274k3134k2147k0407j8522
60817F43816j7131j6418j6008j5284j3980j2485j1379j0712r959q751p292n959
60805D98458m798l652k565j740j247r47o22n1Q30J726K081J653Q55L27L21O22
60789D91251R08R40N47k23j037j595j966k346k628k567k256k025j903j602j169
60774D72329j118j695k416k713k728l049l882m868n638o106o306o315o392o803
60760D12300p403p686p328o404n121l686k550k263k741l042k327q38M32R09R26
60745C63178J100J630K260K612K453J809Q87j15r72j225m17J175K462K737K556
$$ y = [919119, 934840, 947864, 958237, 966201, 971649, 973898, 972184, 966390, 957064, 944681, 929181, 910475, 889155, 866393, 843218, 820116, 797185, 774321, 751300, 728026, 704892, 682745, 662338, 643816, 626685, 610267, 594259, 578975, 564995, 552510, 541131, 530419, 520460, 511709, 504417, 498458, 493660, 490008, 487443, 485703, 484456, 483509, 482887, 482836, 483666, 485392, 487473, 489126, 489981, 490308, 490629, 491251, 492159, 493099, 493646, 493423, 492386, 490791, 488825, 486479, 483851, 481284, 479028, 477003, 475100, 473498, 472329, 471211, 469516, 467100, 464387, 461659, 458610, 454728, 449860, 444222, 438116, 431810, 425495, 419103, 412300, 404897, 397211, 389883, 383479, 378358, 374672, 372122, 369859, 367118, 364076, 361749, 360911, 361343, 362252, 363178, 364278, 365908, 368168, 370780, 373233, 375042, 375929, 375814, 374842, 373617, 373200, 374375, 376837, 379574, 382130]
60730C82130K851L456L431K692K209K341K125Q57o39j185r84j146k031l038l807
60715C89262m499m978m860m456m736n938p001o853n665m418l707l421l218k936
60701C22576k710k896l585m140l651k063l60N45O26K59m39j261j571r87r7K78
60685C00524K00M03J031J406J051L83J10M01Q22Q99O08M76J087K265L003K583
60669C17252J566J140J600K128K089J798J809K190K862L984N419O326O046N138
60655C61347M812N413O147O319O154O197O427O388N784M575K761N33j495k744
60641D18618l395m177n289n953n449m266l696m280n170n254m493l762l705m157
60627C55572m552m449l673k450j536j699k813l764l554k308q88J28P07Q50M65
$$ y = [382130, 384981, 388437, 391868, 394560, 396769, 399110, 401235, 402092, 401453, 400268, 399284, 398138, 396107, 393069, 389262, 384763, 379785, 374925, 370469, 365733, 359795, 352794, 345941, 340276, 335858, 332151, 328730, 325512, 322576, 319866, 316970, 313385, 309245, 305594, 303531, 303171, 303716, 304342, 304601, 304162, 302901, 301330, 300343, 300246, 300524, 300724, 301127, 302158, 303564, 304615, 304998, 305108, 305509, 306331, 307230, 307838, 308314, 309401, 311666, 314669, 317252, 318818, 319958, 321558, 323686, 325775, 327573, 329382, 331572, 334434, 338418, 343837, 350163, 356209, 361347, 366159, 371572, 377719, 384038, 390192, 396389, 402816, 409204, 414988, 419563, 422324, 422857, 421362, 418618, 415223, 411046, 405757, 399804, 394355, 390089, 386393, 382113, 376943, 371689, 367196, 363434, 359729, 355572, 351020, 346571, 342898, 340448, 338912, 337213, 334400, 330636, 327082, 324774, 323886, 324014, 324721, 325571, 326036]
60612C26036j96n51m05k55n55r98q87j35N43M82j57o63o88o18r63j558j671r72
60594C15789j41j29r44j534j003L64J547J884J532R94O62P19J157J723K096K229
60578C26945K362K671L090L569M208M990N571N643N359N194N332N411M974L995
60564C89314K839J753O33o78j968k693k481j483j52J176K442L660M779N743O530
60549D09414P129P597Q102Q816R630J0173J0125R418Q106O252M070K010L68j037
60535E00173k562m075m875m468l305k447k467k892k861k193j520j368j458j102
60521D62580m3J391K758L759M129L811L298L324L985M649N033N893Q097J1298
60507E23962J4317J6709J9184K2284K5396K7592K8851K9706K9929K8479K4791
$$ y = [326036, 325840, 325289, 324884, 324629, 324074, 323076, 322189, 322054, 322597, 323079, 322922, 322259, 321571, 320953, 319990, 318432, 316761, 315789, 315648, 315519, 314575, 313041, 312038, 312402, 313949, 315833, 317365, 318359, 319021, 319740, 320897, 322620, 324716, 326945, 329307, 331978, 335068, 338637, 342845, 347835, 353406, 359049, 364408, 369602, 374934, 380345, 385319, 389314, 392153, 393906, 394539, 393861, 391893, 389200, 386719, 385236, 385084, 386260, 388702, 392362, 397141, 402884, 409414, 416543, 424140, 432242, 441058, 450688, 460861, 470986, 480404, 488510, 494762, 498832, 500842, 501210, 500173, 497611, 493536, 488661, 484193, 480888, 478441, 475974, 473082, 470221, 468028, 466508, 465140, 463682, 462580, 462537, 463928, 466686, 470445, 474574, 478385, 481683, 485007, 488992, 493641, 498674, 504567, 512664, 523962, 538279, 554988, 574172, 596456, 621852, 649444, 678295, 708001, 737930, 766409, 791200]
60496G91200J9486J3505P163M62o192j2297j7969k3578k8645l1837l2402l1009
60484F47887k8865k6518k4039k1765k0073j8651j6871j4851j3403j2725j2034
60473D38092j0782r496q820q360p295n758m771m826n277n258m668m038l829m025
60459C50889m178l753k715j726j481j896k323k524k838l354l505k881j873j096
60445C14746n54J16Q59J265J266J175J066P12J85pL19O37M06j63m56k98l5R0J84
60426C21513K77R3n76j510k220k344j834r52j56K63M75Q48J313J349P93K54L55
60409C17941Q52R55L82m30r81j066n70M64J420J444M49o23q78l77K81P92J164
60392C21219J359J410J519J611J105k15j402j172N02K304L093K932K486K117J838
$$ y = [791200, 810686, 824191, 831354, 831816, 825624, 813327, 795358, 771780, 743135, 711298, 678896, 647887, 619022, 592504, 568465, 546700, 526627, 507976, 491105, 476254, 462851, 450126, 438092, 427310, 417814, 408994, 400634, 393339, 387581, 382810, 377984, 372707, 367449, 362781, 358743, 354914, 350889, 346711, 342958, 340243, 338517, 337036, 335140, 332817, 330293, 327455, 324101, 320596, 317715, 315842, 314746, 314192, 314308, 315167, 316432, 317698, 318873, 319939, 320651, 320836, 320829, 321148, 321785, 322191, 322028, 321572, 321274, 321239, 321329, 321513, 321790, 321883, 321307, 319797, 317577, 315233, 313399, 312447, 312291, 312554, 313029, 313877, 315190, 316539, 317332, 317586, 317941, 318793, 319748, 320130, 319700, 318719, 317653, 317083, 317547, 318967, 320411, 320860, 320237, 319359, 318982, 319263, 320055, 321219, 322578, 323988, 325507, 327118, 328223, 328008, 326606, 325434, 325936, 328240, 331333, 334265, 336751, 338868, 340706]
60377C40706J650J491J264J147J541K410L046K856K099J461J160R01N27K37J58
60362C62654J67K47O22J345K016K233K177K424L166L910M074L651L020K266J133
60347C95105l58j666k359k594k672k471j823j150j073j380j154q5R37R79K57l10
60331C78183l66l02m09m81l31j56k08m25n78n11n9R19K229L218L424L177L378
60314C90702M515O146P431Q046Q472R459J1198J2997J3726J2713J0270P310M430
60301E07415J593j420m439p071r154j0713j1623j1618j0710r351q125p344o929
60288D10511o402n242l525k104j742k120k257j770j138o84j29O01R57O07j2n19
60272C85032j188k068k298j295l9Pj033j663j218o01o62j006q82k85L89R97J477
$$ y = [340706, 342356, 343847, 345111, 346258, 347799, 350209, 353255, 356111, 358210, 359671, 360831, 361732, 362259, 362496, 362654, 362821, 363068, 363690, 365035, 367051, 369284, 371461, 373885, 377051, 380961, 385035, 388686, 391706, 393972, 395105, 394747, 393081, 390722, 388128, 385456, 382985, 381162, 380012, 378939, 377559, 376405, 376320, 377257, 378236, 378493, 378183, 377817, 377515, 377106, 376625, 376294, 376138, 375930, 375505, 374927, 374416, 374357, 375276, 377505, 380723, 384147, 387324, 390702, 395217, 401363, 408794, 416840, 425312, 434771, 445969, 458966, 472692, 485405, 495675, 502985, 507415, 509008, 507588, 503149, 496078, 486924, 476211, 464588, 452970, 442260, 432909, 424784, 417440, 410511, 404109, 398867, 395342, 393238, 391496, 389376, 387119, 385349, 384211, 383527, 383398, 383999, 384956, 385563, 385551, 385032, 383844, 381776, 379478, 378183, 378144, 378151, 377118, 375455, 374237, 373636, 372974, 371968, 371086, 370801, 371190, 372187, 373664]
60255C73664J524J049M34kl49o32n74k06j27o88j375j470q89J7J009J832K101
60238C75318J795J459J382J119L31l95l09M31J181J855K648L096K521J313O93
60223C94438J055J475J179N57K97L22K78L65R66J775K039J621J149J068J145J063
60207D10792R98J270J652J568R34L84M82R93J249J016O98O85R40J277J664K071
60191D28673K236J878J070K64p9J29M29J44q18j610j313j80N68K85l20l40M3N0
60173D31109l55m16K22R56J060N66J40K82Q11J063N95k40n93m2R61J705J979J940
60155D41743J661J190Q24Q45J115J322J517J950K567L153L856M997O307O961O584
60140D86592N767N341N436N528N183M384L252J754l5j589k228j958j736k450l705
$$ y = [373664, 375188, 376237, 376671, 376669, 376320, 375688, 375114, 374908, 374781, 374093, 372718, 371248, 370359, 370376, 371385, 373217, 375318, 377113, 378572, 379954, 381073, 381404, 381009, 380700, 381131, 382312, 384167, 386815, 389911, 392432, 393745, 394438, 395493, 396968, 398147, 398704, 399001, 399323, 399601, 399966, 400932, 402707, 404746, 406367, 407516, 408584, 409729, 410792, 411790, 413060, 414712, 416280, 417214, 417598, 418080, 419073, 420322, 421338, 422036, 422721, 423661, 424938, 426602, 428673, 430909, 432787, 433857, 434121, 434042, 434171, 434600, 434744, 433926, 432316, 431003, 430823, 431391, 431676, 431356, 431016, 431059, 431109, 430754, 430338, 430560, 431516, 432576, 433142, 433282, 433564, 434375, 435438, 436033, 435793, 435200, 435158, 436119, 437824, 439803, 441743, 443404, 444594, 445418, 446263, 447378, 448700, 450217, 452167, 454734, 457887, 461743, 466740, 473047, 480008, 486592, 492359, 497700, 503136, 508664, 513847, 518231, 521483, 523237, 523202, 521613, 519385, 517427, 515691, 513241, 509536]
60125E09536m219l451k254j670j775k106k547l161l598l426k814k210j650r86
60111D73669n60q39j522j865j793j934k513l018l006k567j789n95P33J558J792
60096D55751K103K883L623L707L323L158L550M303M989N178M695L964L695L987
60082E08909M091L372K076Q90J04m20p47q05o86o83j076j942l086m003m290m122
60066D97582m082m412m795m975n145n458n553m995l968l162l054l469l795l548
60052D37171k812k075j571r52P1J031J248Q31N63P97J196J526J856J909J153r6
60036D41846o94k28K87q5r19j392j703k516l664m434m777n240n944o536o886o944
60020C90171o212m427k509j767k131k338j886j603k064k616k499j923j363p34
$$ y = [509536, 505317, 501866, 499612, 497942, 496167, 494061, 491514, 488353, 484755, 481329, 478515, 476305, 474655, 473669, 473109, 472270, 470748, 468883, 467090, 465156, 462643, 459625, 456619, 454052, 452263, 451668, 452401, 453959, 455751, 457854, 460737, 464360, 468067, 471390, 474548, 478098, 482401, 487390, 492568, 497263, 501227, 504922, 508909, 513000, 516372, 518448, 519338, 519442, 519022, 518275, 517470, 516784, 516101, 515025, 513083, 509997, 505994, 501704, 497582, 493500, 489088, 484293, 479318, 474173, 468715, 463162, 458167, 454199, 451037, 447983, 444514, 440719, 437171, 434359, 432284, 430713, 429761, 429832, 430863, 432111, 432942, 433505, 434302, 435498, 437024, 438880, 440789, 441942, 441846, 441152, 440924, 441211, 441126, 440207, 438815, 437112, 434596, 430932, 426498, 421721, 416481, 410537, 404001, 397115, 390171, 383959, 379532, 377023, 375256, 373125, 370787, 368901, 367298, 365234, 362618, 360119, 358196, 356833, 356099]
60006C56099K5K84l98j313j417p85l58m29l53K49Q10P41L87N83J541K551K780
59989C60997K165J422J241J545J722J548J517K031K620K477J680J238J713K315
59975C86231J897N06n70l48P33J442J140K63l60l80r5J2j98l78j59L55O55M82
59957C91228J51M9Q6j5j74r4J24P4k38l32n3R9k61q22j140j296j550j689j399
59938C82748j033j317k291l133l167k557j856j315q50l69J53O75R97Q67L69l6
59922C67885OL16M81L90L02M57R09J649K600L466L781L376K741K686L527M643
59906C99215N023M292L005J999J535J260Q43L91K49N45J062J449J507J256Q44
59891D24475M63L24N55J030J395J470J525J917K508K821K756K726K950L096K809
$$ y = [356099, 356124, 356408, 356010, 354697, 353280, 352495, 352137, 351708, 351355, 351604, 352414, 353155, 353542, 354125, 355666, 358217, 360997, 363162, 364584, 365825, 367370, 369092, 370640, 372157, 374188, 376808, 379285, 380965, 382203, 383916, 386231, 388128, 388634, 388064, 387716, 388449, 389891, 391031, 391294, 390934, 390554, 390459, 390471, 390273, 389895, 389736, 390091, 390746, 391228, 391379, 391428, 391514, 391499, 391325, 391231, 391355, 391429, 391191, 390859, 390806, 390905, 390644, 389822, 388682, 387386, 385836, 384147, 382748, 381715, 380398, 378107, 374974, 371807, 369250, 367394, 366079, 365229, 364860, 365013, 365688, 366685, 367552, 367921, 367885, 367891, 368207, 368688, 369078, 369380, 369837, 370746, 372395, 374995, 378461, 382242, 385618, 388359, 391045, 394572, 399215, 404238, 408530, 411535, 413534, 415069, 416329, 417172, 417563, 417812, 418357, 419419, 420868, 422375, 423631, 424475, 424938, 425262, 425817, 426847, 428242, 429712, 431237, 433154, 435662, 438483, 441239, 443965, 446915, 450011, 452820]
59876D52820K203J461M29q54j779j932j960k715l810l996l082k355k680l269l004
59861D25477k152j692j636j224n41o12j703k688k595j835j273r14l12K92K67k68
59845D06591n52m38n70j138j376p50M7l8r42j489p87Q48K336K852K432J831J718
59828D10575J950J785R19j13p08r35j076r84n58l98j080j950j727m02N05J4r61
59811D04856j016k18K32j32n89m70k5K23J87O2j15m05p45j044j394j932k612l153
59793C91710l216k699j889j227q59n55j93n0m01r96j300j138p79l87J76R58J602
59776C78757J671J186O22M30N66N60J45k66O9J190K164K167J540J283J610J674
59760C95368Q92j50n30k55j33n27q56m01P62J851K159J641Q54M71P35J313J699
$$ y = [452820, 455023, 456484, 456913, 456059, 454280, 452348, 450388, 447673, 443863, 439867, 436785, 434430, 431750, 428481, 425477, 423325, 421633, 419997, 418773, 418232, 417620, 415917, 413229, 410634, 408799, 407526, 406612, 406300, 406592, 406859, 406591, 406039, 405601, 405031, 403893, 402517, 401767, 401814, 401776, 400834, 399345, 398558, 399406, 401742, 404594, 407026, 408857, 410575, 412525, 414310, 415229, 415116, 414408, 413473, 412397, 411413, 410855, 410457, 409377, 407427, 405700, 405298, 405803, 405817, 404856, 403840, 403622, 403854, 403722, 403133, 402663, 402638, 402861, 403048, 403110, 402995, 402590, 401845, 400801, 399407, 397475, 394863, 391710, 388494, 385795, 383906, 382679, 381820, 381265, 381072, 381022, 380621, 379625, 378325, 377187, 376408, 376021, 376197, 377155, 378757, 380428, 381614, 382236, 382666, 383232, 383792, 383937, 383671, 383740, 384930, 387094, 389261, 390801, 392084, 393694, 395368, 396260, 396110, 395580, 395325, 395192, 394665, 393809, 393408, 394170, 396021, 398180, 399821, 400675, 401146, 401881, 403194, 404893]
59743D04893J736J586J290O87o0k77N10J836K689K614K040J554J304J205J178
59728D24785R68J92r92j686j251k18L10L4l12l4P62J473J600R94o3q89r03j92
59710D24578O35J143J285J060N47K02N39J306J579Q82k66j070j273j071p82q02
59694D28492j383k093k083j174j70K39L09N37P69O14K28J8j40o77j501k027j974
59677D17984j691j673k093k760l229l182k790k484k293j804j026o07r04j406j548
59662C88494j439j257o69M19J206J029M92N79J103J154P42P19J243J520J194P95
59646C97324O20L13j59j69M90J046Q28N3p72j535k142k157j389k94N87J088J075
59629C94807L36p75j340r55k88m8q4jo5p30j682k137j908j544j468j488j134k74
$$ y = [404893, 406629, 408215, 409505, 410192, 410132, 409855, 410365, 412201, 414890, 417504, 419544, 421098, 422402, 423607, 424785, 425753, 425945, 424953, 423267, 422016, 421798, 422108, 422142, 421830, 421796, 422558, 424031, 425631, 426625, 426562, 425673, 424770, 424578, 425213, 426356, 427641, 428701, 429248, 429450, 429989, 431295, 432874, 433756, 433490, 432420, 431147, 430076, 429294, 428492, 427109, 425016, 422933, 421759, 421589, 421828, 422137, 422674, 423443, 424057, 424285, 424303, 424163, 423486, 421985, 419958, 417984, 416293, 414620, 412527, 409767, 406538, 403356, 400566, 398082, 395789, 393985, 392959, 392352, 391448, 390042, 388494, 387055, 385798, 385129, 385548, 386754, 387783, 388275, 388854, 389957, 391111, 391853, 392572, 393815, 395335, 396529, 397324, 397944, 398257, 398098, 397929, 398419, 399465, 400293, 400346, 399574, 398039, 395897, 393740, 392351, 392057, 392644, 393732, 394807, 395143, 394368, 393028, 392073, 391785, 391737, 391653, 391652, 391587, 390857, 389175, 387038, 385130, 383586, 382118, 380630, 379496, 379222]
59611C79222O82J082P83N47J232K555L261K719J697J232J317J246P10m1o87r62
59595C96595o68m7K07j41m50j37M27O11O10R72J383R32m84j902k547k520k151
59578C90690j461o19k53q07j921k845l212l150k858k360j559m60O31J121O55l92
59562C71200j129r53OJ103J685J424O03M8M18J463K256K323K203K749M182O037
59546C95618P784R140R982J0375J0782J1870J3787J5616J5839J3515R115M127
59534E27550r1l116n175o439o751n992m404k448n46R85J844J889J355P07J38n85
59518D98921j610k572l012l165l784n117o519p293p455p351o996o331n695n441
59504D26580n193m326l080k432k726l168k963k320j970k160k548k752k622k202
$$ y = [379222, 379904, 380986, 381769, 382316, 383548, 386103, 389364, 392083, 393780, 395012, 396329, 397575, 398285, 398244, 397557, 396595, 395927, 395880, 396087, 395946, 395496, 395359, 395786, 396397, 397007, 397979, 399362, 400294, 399810, 397908, 395361, 392841, 390690, 389229, 388610, 388357, 387550, 385629, 382784, 379572, 376422, 373564, 371204, 369645, 369185, 369816, 370937, 371592, 371200, 370071, 369118, 369124, 370227, 371912, 373336, 373939, 373987, 374405, 375868, 378124, 380447, 382650, 385399, 389581, 395618, 403402, 412542, 422524, 432899, 443681, 455551, 469338, 484954, 500793, 514308, 523423, 527550, 527459, 524343, 519168, 512729, 505978, 499986, 495582, 493134, 492588, 493573, 495417, 497306, 498661, 499368, 499506, 498921, 497311, 494739, 491727, 488562, 484778, 479661, 473142, 465849, 458394, 451043, 444047, 437716, 432021, 426580, 421387, 417061, 413981, 411549, 408823, 405655, 402692, 400372, 398402, 396242, 393694, 390942, 388320, 386118]
59490C86118j680j242q45l82p3k57p24q14l31J41K11L29J027K023K618K705K724
59473C91548K841K768K348J885J772K060K467K682K744L003L574L954L616K914
59459D30176K765L380M060M466N184O524P625P540O576N659M891L710K135P80
59445D95471k37j369k665l596m035m495n243n888o117o099n865n014l435j789
59431D39624p70k23N55J836L171M053M642N687P585R689J0931J1295J2027J3942
59417E24044J6187J7475J7935J8593J9208J8060J4105Q197J807m262r299j2050
59405F30000j1826r557o689l623k12K621L084M17m309r452j3998j7372j8967j8518
59391E21599j6559j4104j1983j0618r984r546q552o819n006l870l367k837j880
$$ y = [386118, 384438, 383196, 382351, 381969, 381896, 381639, 380915, 380101, 379770, 379911, 380122, 380451, 381478, 383501, 386119, 388824, 391548, 394389, 397157, 399505, 401390, 403162, 405222, 407689, 410371, 413115, 416118, 419692, 423646, 427262, 430176, 432941, 436321, 440381, 444847, 450031, 456555, 464180, 471720, 478296, 483955, 488846, 492556, 494691, 495471, 495234, 493865, 491200, 487604, 483569, 479074, 473831, 467943, 461826, 455727, 449862, 444848, 441413, 439624, 438854, 438631, 439186, 441022, 444193, 448246, 452888, 458575, 466160, 475849, 486780, 498075, 510102, 524044, 540231, 557706, 575641, 594234, 613442, 631502, 645607, 653804, 655611, 651349, 642050, 630000, 618174, 608617, 601928, 598305, 598093, 600714, 603798, 604215, 599906, 590454, 576456, 559084, 540117, 521599, 505040, 490936, 478953, 468335, 458351, 448805, 440253, 433434, 428428, 424558, 421191, 418354, 416474]
59378D16474p22K27P54P19M9q70j119o9J775L151L360K917K803L423M446N318
59362D42636N658N356M668M133M122M562N257O206P314Q077Q123P928Q318R307
59348E31665J0017R931R578R626R813R341P991O341M945L765K418O88j228k893
59334F11998m077n083o444q145r440r736r358r124r278r317q783p801o748n801
59320E02863m985m357l920l546l144k825k760k968l330l709l914l725l065k156
59306D54459j357r12q15q51o94j32O46J132J031O27M31N34N68L08o4k89l67l01
59288D53954J55J116K074K227J344Q1p16p55l15K73R49J839K981M140M832M749
59272D78928M201L961M491N422N983N850N352M818M055K669P63r26j784j999k290
$$ y = [416474, 415752, 415979, 416733, 417452, 417501, 416631, 415512, 415443, 417218, 420369, 423729, 426646, 429449, 432872, 437318, 442636, 448294, 453650, 458318, 462451, 466573, 471135, 476392, 482598, 489912, 497989, 506112, 514040, 522358, 531665, 541682, 551613, 561191, 570817, 580630, 589971, 597962, 604303, 609248, 613013, 615431, 616119, 614891, 611998, 607921, 602838, 596394, 588249, 578809, 569073, 559715, 550591, 541313, 531996, 523213, 515412, 508664, 502863, 497878, 493521, 489601, 486055, 482911, 480086, 477326, 474358, 471028, 467319, 463405, 459680, 456615, 454459, 453102, 452190, 451375, 450524, 449830, 449698, 450344, 451476, 452507, 453134, 453565, 454099, 454667, 454975, 454911, 454622, 454255, 453954, 454109, 455225, 457299, 459526, 460870, 460951, 460235, 459480, 459165, 459438, 460387, 462226, 465207, 469347, 474179, 478928, 483129, 487090, 491581, 497003, 502986, 508836, 514188, 519006, 523061, 525730, 526493, 525567, 523783, 521784, 519494]
59257E19494k970l619l832l934m507n403n782n249m387l922l755l274k331j428
59243D65101r43o01J49J475K969L986M178L755L272L055K934K549J755O26o52
59228D93608j674j938j470j152j902l525m894n352n372n522n420m311k368p26
59214D47982j58k87l65k67l53o10n05K49J157J406P90m3k93J22M69R2p29j035
59196D47622l54O59J006N50O9K11Q35J383J515J249Q94R57J707K661K906K276
59180D66146J715K066K917L165K443J413Q73J123K074L408M577N183N350N434
59166E07887N485N364N127M791M038K756J661J547K016J861O82p39j700k285k567
59151E35924k282j625j468k131k796k758k464k676l264l630l654l553l263k781
$$ y = [519494, 516524, 512905, 509073, 505139, 500632, 495229, 489447, 484198, 479811, 475889, 472134, 468860, 466529, 465101, 464158, 463557, 463706, 465181, 468150, 472136, 476314, 480069, 483341, 486396, 489330, 491879, 493634, 494260, 493608, 491934, 489996, 488526, 487374, 485472, 481947, 477053, 471701, 466329, 460807, 455387, 451076, 448708, 447982, 447824, 447537, 447172, 446905, 446552, 445942, 445437, 445686, 446843, 448249, 449039, 448996, 448703, 448825, 449294, 449386, 448657, 447622, 447268, 447927, 448933, 449483, 449552, 449763, 450598, 451981, 453496, 454745, 455639, 456596, 458303, 460964, 463870, 466146, 467861, 469927, 472844, 476009, 478452, 479865, 480738, 481861, 483935, 487343, 491920, 497103, 502453, 507887, 513372, 518736, 523863, 528654, 532692, 535448, 537109, 538656, 540672, 542533, 543215, 542476, 540776, 538491, 535924, 533642, 532017, 530549, 528418, 525622, 522864, 520400, 517724, 514460, 510830, 507176, 503623, 500360, 497579]
59137D97579k592k992l360k964k113j688j788j694j031j60N20R80J279J513J961
59122D83450K735L408L618L868N051P177R240J0476J1164J2111J3756J5831J7515
59109E99400J7965J7129J5964J5498J5771J6085J6002J5525J4527J2804J0667
59098G67337Q793P352N858M091K560J784J549J192M24l79o70m23l28j160k951
59083G95029n080p138r210j1161j2344j2511j2385j2703j3194j3212j2823j2521
59071F60747j2242j1629j0897j0465r981q829p469p107p897q484p756o110m693
59058E47188m128m351n022n634n653m930l727k352j149n82p59r30l01P62J155
59043E09587O52J33J41K65K47O43J740K801L046K763K750L186L797M689O239Q286
$$ y = [497579, 494987, 491995, 488635, 485671, 483558, 481870, 480082, 478388, 477357, 477197, 477717, 478697, 479976, 481489, 483450, 486185, 489593, 493211, 497079, 502130, 509307, 518547, 529023, 540187, 552298, 566054, 581885, 599400, 617365, 634494, 650458, 665956, 681727, 697812, 713814, 729339, 743866, 756670, 767337, 776130, 783482, 789340, 793431, 795991, 797775, 799324, 800516, 800940, 800561, 799891, 799468, 799140, 797980, 795029, 789949, 782811, 773601, 762440, 750096, 737585, 725200, 712497, 699303, 686091, 673268, 660747, 648505, 636876, 625979, 615514, 605533, 596704, 589235, 582128, 574231, 565747, 557991, 551881, 547188, 543060, 538709, 533687, 528053, 522400, 517470, 513743, 511391, 510242, 509660, 508901, 507971, 507670, 508432, 509587, 510239, 510372, 510513, 510778, 511025, 511668, 513408, 516209, 519255, 522018, 524768, 527954, 531751, 536440, 542679, 550965]
59027E50965J0032J0897J1108J1369J2121J3116J3781J3938J3964J4103J3938
59016F89332J3015J1573J0100Q445O173L594J597M50m06j226j543j008L7J150
59002G41283K257L280L979M323M543M652M477M152L821K969R31j833m036n285
58988G69513o494q248r912j0774j1073j1233j1142j0808j0840j1381j1445j0075
58976F46088p646n227l291j737o32m1M15J078J663J773J648J829K436L296M367
58961F46019N513O244O265N843N257M345L072J876Q44p66l375o021p351p345p174
58946F53246p543p996p832p029o092n475n229n024m640m462n131o568p834q232
58932E64159q027p751p403o750n874m948l949l026k618k762k831k435k007k037
$$ y = [550965, 560997, 571894, 583002, 594371, 606492, 619608, 633389, 647327, 661291, 675394, 689332, 702347, 713920, 724020, 732465, 738638, 742232, 743829, 744279, 743873, 742647, 741104, 740096, 740133, 741283, 743540, 746820, 750799, 755122, 759665, 764317, 768794, 772946, 776767, 779736, 780667, 778834, 774798, 769513, 763019, 754771, 744859, 734085, 723012, 711779, 700637, 689829, 678989, 667608, 656163, 646088, 638442, 633215, 629924, 628187, 627555, 627514, 627929, 629007, 630670, 632443, 634091, 635920, 638356, 641652, 646019, 651532, 657776, 664041, 669884, 675141, 679486, 682558, 684434, 685278, 684512, 681137, 675116, 667765, 660420, 653246, 645703, 637707, 629875, 622846, 616754, 611279, 606050, 601026, 596386, 591924, 586793, 580225, 572391, 564159, 556132, 548381, 540978, 534228, 528354, 523406, 519457, 516431, 513813, 511051, 508220, 505785, 503778, 501741]
58918E01741k300k330k064j483l65J061J902J820J720K499L765M706N417O400
58904E22489P324P478P091P039P490P844P895Q042Q410Q711Q944R470J0352J1304
58890F39883J2221J3207J4265J5472J7049J8615J8911J7148J4269J1851J0096
58879H02987P948M948J763j048l673o293q756j1125j3574j5596j6242j5483j4372
58866G11484j3603j2738j1250r481q083p172o629o646p361q316q867q928q904
58853E93506q995q973q638q150p769p448o824n726m554l901l888m101m176m108
58839E06255l959l718l490l402l169k367j219n43o83j150j537k033k662k932k652
58824D70739k330k135j423rJ014O89l84r94r71q22m35N60J654J996J744J707J897
$$ y = [501741, 499441, 497111, 495047, 493564, 493199, 494260, 496162, 497982, 499702, 502201, 505966, 510672, 516089, 522489, 529813, 537291, 544382, 551421, 558911, 566755, 574650, 582692, 591102, 599813, 608757, 618227, 628579, 639883, 652104, 665311, 679576, 695048, 712097, 730712, 749623, 766771, 781040, 792891, 802987, 810935, 815883, 817646, 816598, 812925, 806632, 797876, 786751, 773177, 757581, 741339, 725856, 711484, 697881, 685143, 673893, 664412, 656329, 649157, 642528, 635882, 628521, 620205, 611338, 602410, 593506, 584511, 575538, 566900, 558750, 550981, 543533, 536709, 530983, 526429, 522528, 518640, 514539, 510363, 506255, 502296, 498578, 495088, 491686, 488517, 486150, 484931, 484388, 483705, 482555, 481018, 478985, 476323, 473391, 470739, 468409, 466274, 464851, 464842, 465856, 466545, 466161, 465167, 464196, 463374, 462939, 463499, 465153, 467149, 468893, 470600, 472497]
58807D72497J660R96N30L24j08o33n84RL34N1m11q40j459k123k275j913j617j541
58789D62897j257o54p0N08J443K553L187L280L439L847M091M133M480N128N354
58774E02359M781L801K683J246l63j452j742j749j897k063k229k757l603m062
58760D92953l708k963k416k198k209k283j874m18J691L171L364K994L002L307
58746D92413L179K446J701J583K240L295M137M378M199M159M659N673O802P489
58732E48353P445P080P111P541P571O925O429O643O785N935M579L784L462K803
58718F32446K016K183L471M823N503N731N758N510N215N273N366M680L133J394
58704F92502l05k322m624o673q332r872j1222j2217j3301j4766j5618j4659j2548
$$ y = [472497, 474157, 475153, 475683, 476007, 475899, 475266, 474682, 474691, 475025, 475076, 474665, 473825, 472366, 470243, 467968, 466055, 464438, 462897, 461640, 460986, 460916, 461424, 462867, 465420, 468607, 471887, 475326, 479173, 483264, 487397, 491877, 497005, 502359, 507140, 510941, 513624, 514870, 514507, 513055, 511313, 509564, 507667, 505604, 503375, 500618, 497015, 492953, 489245, 486282, 483866, 481668, 479459, 477176, 475302, 474884, 476575, 479746, 483110, 486104, 489106, 492413, 495592, 498038, 499739, 501322, 503562, 506857, 510994, 515372, 519571, 523730, 528389, 534062, 540864, 548353, 555798, 562878, 569989, 577530, 585101, 592026, 598455, 605098, 611883, 617818, 622397, 626181, 629643, 632446, 634462, 636645, 640116, 644939, 650442, 656173, 661931, 667441, 672656, 677929, 683295, 687975, 691108, 692502, 692197, 689875, 685251, 678578, 670246, 660374, 649152, 636935, 623634, 608868, 593250, 578591, 566043]
58691E66043j1156j0918j0462r018p424o435n807n428n689o190n714m158k933
58678D74711k746k596j678p05l50N9J251K699L712M639N924P033P386P420P711
58663E14470P983P896P836P971P485N727L354J396p2j472k723l556m068m241l664
58648E44322k422j499j526j944k007j829j770j726j613j679j699r59L68R67L26
58633E25310l06K05J223J632J599J841K126J892J584K040L009L512L343L269L986
58618E56265N575P572R042R226Q538Q138Q137P358N358L371K369J548j14k042
58604F30341l174l753m569n346n386n093n344n894n773m889l968l283k657k193
58590E69019k055j860j260n80j5J054K891M440M728M493N034O109O434N831N334
$$ y = [566043, 554887, 543969, 533507, 524489, 517065, 510630, 504823, 499395, 493706, 487516, 481802, 477644, 474711, 471965, 469369, 467691, 466986, 466636, 466695, 467946, 470645, 474357, 478996, 484920, 491953, 499339, 506759, 514470, 522453, 530349, 538185, 546156, 553641, 559368, 562722, 564118, 564046, 562574, 559851, 556295, 552227, 547986, 544322, 541900, 540401, 538875, 536931, 534924, 533095, 531325, 529599, 527986, 526307, 524608, 523649, 524017, 524984, 525310, 525004, 525209, 526432, 528064, 529663, 531504, 533630, 535522, 537106, 539146, 542155, 545667, 549010, 552279, 556265, 561840, 569412, 578454, 587680, 596218, 604356, 612493, 619851, 625209, 628580, 630949, 632497, 632383, 630341, 627167, 623414, 618845, 613499, 608113, 603020, 597676, 591782, 586009, 581120, 577152, 573869, 571212, 569019, 566964, 565104, 563844, 563264, 563249, 564303, 567194, 571634, 576362, 580855, 585889, 591998, 598432, 604263, 609597]
58575F09597N439N647N653N667N633N294N021N575O935Q286R142R806J0712J1921
58561G10328J3154J3930J3974J3745J3954J4302J3612J1712J0002R377Q830P133
58549H54053M776K910J450l49k275l634m652n911p036p430p758r054j0768j1283
58535G93039j0268r008q461q304p925p202o186m952l726k518r29R86K276K441
58521G29263K535L836O036P806Q570Q559P771O283M983M595M337K953O85j102
58507G97110j990k781l987n377o768q041q593q034p222p319q049q126p210o251
58493G07362n940n997n881n317m229k967k272k305k201j352k87N60J933M332O545
58478F81984P141O576O209O062N299M237L884L948L158J388k95j459k468l133
$$ y = [609597, 615036, 620683, 626336, 632003, 637636, 642930, 647951, 653526, 660461, 668747, 677889, 687695, 698407, 710328, 723482, 737412, 751386, 765131, 779085, 793387, 806999, 818711, 828713, 838090, 846920, 854053, 858829, 861739, 863189, 862840, 860565, 856931, 852279, 846368, 839332, 831902, 824144, 815090, 804322, 793039, 782771, 773763, 765302, 756998, 749073, 741871, 735685, 730733, 727007, 724489, 723560, 724546, 726822, 729263, 731798, 735634, 741670, 749476, 758046, 766605, 774376, 780659, 785642, 790237, 794574, 797527, 798212, 797110, 795120, 792339, 788352, 782975, 776207, 768166, 759573, 751539, 744317, 736998, 728949, 720823, 713613, 707362, 701422, 695425, 689544, 684227, 679998, 677031, 674759, 672454, 670253, 668901, 668614, 669174, 671107, 675439, 681984, 689125, 695701, 701910, 707972, 713271, 717508, 721392, 725340, 728498, 729886, 729591, 728132, 725664, 722531]
58464G22531k944k479k812l572l375k138j194j093r30p2J004J806K407K724K530
58449G12393K220K422K843K640J819J078N77R4L9R87K434L331L576L767L971L997
58433G48188M293N107N523M839M209N151P125Q476R061R940J1121J1788J2199
58420H47020J3072J3537J2139R530P628O380M054O37j789k474l023m455n741o049
58406H90466o105o387o102m873l613k878k043p35M68J421K789M502N423N130M547
58391H82010M344M162L705L145K271P89m91m57L02J12j169k032j868j635j783
58376H91405j629j054q02p66M6J513K295K076K057K866L834M655N880P428Q367
58361I28171Q459Q300P986P323P011P707Q317P412N839N516O187O099N450O038
$$ y = [722531, 719587, 717108, 714296, 710724, 707349, 705211, 704017, 702924, 701994, 701922, 702926, 704732, 707139, 709863, 712393, 714613, 717035, 719878, 722518, 724337, 725415, 725992, 726086, 726125, 727112, 729546, 732877, 736453, 740220, 744191, 748188, 752481, 757588, 763111, 767950, 772159, 777310, 784435, 792911, 801972, 811912, 823033, 834821, 847020, 860092, 873629, 885768, 895298, 902926, 909306, 913360, 913997, 912208, 909734, 906711, 902256, 896515, 890466, 884361, 877974, 871872, 866999, 863386, 860508, 858465, 857730, 858198, 859619, 862408, 866910, 872333, 877463, 882010, 886354, 890516, 894221, 897366, 899637, 900426, 899935, 899478, 899780, 899892, 898723, 896691, 894823, 893188, 891405, 889776, 888722, 887920, 887154, 887200, 888713, 891008, 893084, 895141, 898007, 901841, 906496, 912376, 919804, 928171, 936630, 944930, 952916, 960239, 967250, 974957, 983274, 990686, 996525, 1002041, 1008228, 1014327, 1019777, 1025815]
58347A025815P723Q507Q257Q920J0758J1752J1395J1688J3499J5227J5923J6639
58335A166103J7665J7604J6294J5588J6034J5712J3528J0812Q634O435M335L698
58323A312442M291L920K180J457K972M910N851O917Q990J0865J1780J2901J4718
58310A404194J5860J5957J6714J8671J9828J9195J8696J9917K1704K2621K2948
58299A616305K2817K1298J8786J7379J7462J6897J5002J4010J5144J6583J6980
58288A808663J7640J9456K1038K1626K2641K4714K6382K7260K8987L1628L2839
58277B082874L2214L2468L4707L6612L7062L8224M1050M3103M3213M3895M6737
58266B512159M9655N1103N2726N5372N6991N7022N8277O1873O4882O5663O6666
$$ y = [1025815, 1033538, 1042045, 1050302, 1059222, 1069980, 1081732, 1093127, 1104815, 1118314, 1133541, 1149464, 1166103, 1183768, 1201372, 1217666, 1233254, 1249288, 1265000, 1278528, 1289340, 1297974, 1304409, 1308744, 1312442, 1316733, 1320653, 1322833, 1324290, 1327262, 1332172, 1338023, 1344940, 1353930, 1364795, 1376575, 1389476, 1404194, 1420054, 1436011, 1452725, 1471396, 1491224, 1510419, 1529115, 1549032, 1570736, 1593357, 1616305, 1639122, 1660420, 1679206, 1696585, 1714047, 1730944, 1745946, 1759956, 1775100, 1791683, 1808663, 1826303, 1845759, 1866797, 1888423, 1911064, 1935778, 1962160, 1989420, 2018407, 2050035, 2082874, 2115088, 2147556, 2182263, 2218875, 2255937, 2294161, 2335211, 2378314, 2421527, 2465422, 2512159, 2561814, 2612917, 2665643, 2721015, 2778006, 2835028, 2893305, 2955178, 3020060, 3085723, 3152389]
58255C152389O9306P1208P1432P3158P7884Q2281Q4149Q6207R0560R4914R7914
58244D051402J02533J10372J18214J24067J30839J40142J48682J54861J62448
58235E243560J73384J83746J91469K00949K14995K29503K41493K54941K72919
58226G206959K91745L08975L29210L55636L83961M11324M42630M81182N22347
58217A0733969N63925O12936O74250P42968Q16623R03566J009843J130124J262317
58208A8450521J418181J607723J827501K078260K379018K747233L180028L674481
58200C7362946M255093M966017N852638O967068Q367572J0085022J2104607J4394269
58192A04355232J6912748J9560846K2177873K4633018K6825709K8438310K8699450
$$ y = [3152389, 3221695, 3292903, 3364335, 3437493, 3515377, 3597658, 3681807, 3768014, 3858574, 3953488, 4051402, 4153935, 4264307, 4382521, 4506588, 4637427, 4777569, 4926251, 5081112, 5243560, 5416944, 5600690, 5792159, 5993108, 6208103, 6437606, 6679099, 6934040, 7206959, 7498704, 7807679, 8136889, 8492525, 8876486, 9287810, 9730440, 10211622, 10733969, 11297894, 11910830, 12585080, 13328048, 14144671, 15048237, 16058080, 17188204, 18450521, 19868702, 21476425, 23303926, 25382186, 27761204, 30508437, 33688465, 37362946, 41618039, 46584056, 52436694, 59403762, 67771334, 77856356, 89960963, 104355232, 121267980, 140828826, 163006699, 187639717, 214465426, 242903736, 271603186]
58185B71603186K6610118K1608633J4061320N104983l926479j1933785j8164294
58178C04963682k2231139k4165254k4366139k3387373k1723848j9745889j7719332
58171A51624708j5806654j4067306j2504357j1115057r892584q811678p844856
58164G1582216o983534o226241n559267m965420m439548l979602l572987l205899
58156C2649718k876612k586719k328402k092431j880080j695336j532835j384280
58148A6273023j249726j132268j028097r31506q43728p67778p00139o36012n77385
58139H406384n27797m84341m42509m03921l71755l43361l14673k87444k65049
58130D965534k45413k24895k05145j89590j76837j63750j51415j42125j34105
$$ y = [271603186, 298213304, 319821937, 333883257, 338988240, 335061761, 323127976, 304963682, 282732543, 258567289, 234201150, 210813777, 189089929, 169344040, 151624708, 135818054, 121750748, 109246391, 98131334, 88238750, 79427072, 71582216, 64598682, 58372441, 52813174, 47847754, 43408206, 39428604, 35855617, 32649718, 29773106, 27186387, 24857985, 22765554, 20885474, 19190138, 17657303, 16273023, 15023297, 13891029, 12862932, 11931426, 11087698, 10319920, 9619781, 8983769, 8406384, 7878587, 7394246, 6951737, 6547816, 6176061, 5832700, 5518027, 5230583, 4965534, 4720121, 4495226, 4290081, 4100491, 3923654, 3759904, 3608489, 3466364, 3332259]
58121C332259j24892j16401j11054j06484r9610r2387q8010q4836p9705p3933
58111B354947p0500o8281o4615o0737n9212n8542n5710n1807m9897m9429m7746
58100A718471m5193m3933m3392m1454l8547l6439l4693l2219l0356l0470l0530
58089A311245k8137k4816k3324k2774k0743j8177j7783j9124j9705j9499k0232
58078A076931k1447k1308k0327k0346k0883k0165j8780j8627j9189j8433j6568
58067H60858j5455j5053j3852j2135j1537j1832j1192r270p345n965m929m802
58055G37491o003p225p092o405o547o938o433n862o662q215r074r479j0222j0423
58041F30911r122p656p762q598q348p296o637n763l701j912k431m369n310n127
$$ y = [3332259, 3207367, 3090966, 2979912, 2873428, 2773818, 2681431, 2593421, 2508585, 2428880, 2354947, 2284447, 2216166, 2151551, 2090814, 2031602, 1973060, 1917350, 1865543, 1815646, 1766217, 1718471, 1673278, 1629345, 1585953, 1544499, 1505952, 1469513, 1434820, 1402601, 1372245, 1341775, 1311245, 1283108, 1258292, 1234968, 1212194, 1191451, 1173274, 1155491, 1136367, 1116662, 1097163, 1076931, 1055484, 1034176, 1013849, 993503, 972620, 952455, 933675, 915048, 895859, 877426, 860858, 845403, 830350, 816498, 804363, 792826, 780994, 769802, 760532, 753187, 747222, 742293, 737491, 731488, 724263, 717171, 710766, 704219, 697281, 690848, 684986, 678324, 670109, 661035, 651556, 641334, 630911, 621789, 614133, 606371, 597773, 589425, 582129, 575492, 569729, 566028, 564116, 561685, 557316, 552006, 546879]
58027E46879n386o062n956n483n909o574n893m397l847m076l704l165l960n473
58013D76994n672m531l770l653k997j939j717j977j267KM0j030j304m58j73j051
57997D45497j900k225k879l957m525m566m970n441m730k997j693j093j85J055
57983D05391J518J125Q91Q41R3j067j440j209j684k797l199k790k797l308l129
57968C86439k264k022k437k022n84K23k81o94J9R86J170Q23M44q9p25r82r17j059
57950C76028j198o62L13R24J395K494L693L736K969L063M345N470N886O532P791
57935D22779Q763R045R351R972J0269J0049R683Q771O508L541J524N39r59l365
57921E06470n110n274m980n495o694q029r358j0195r820q693q132q213p669o289
$$ y = [546879, 541493, 535431, 529475, 523992, 518083, 511509, 505616, 501219, 497372, 493296, 489592, 486427, 482467, 476994, 471322, 466791, 463021, 459368, 456371, 454432, 452715, 450738, 449471, 449473, 449513, 448483, 447179, 446721, 446548, 445497, 443597, 441372, 438493, 434536, 430011, 425445, 420475, 415034, 410304, 407307, 405614, 404521, 404336, 405391, 406909, 408034, 408925, 409766, 409859, 408792, 407352, 406143, 404459, 401662, 398463, 395673, 392876, 389568, 386439, 384175, 382153, 379716, 377694, 377110, 377333, 377052, 376358, 376377, 377363, 378533, 379356, 379800, 379711, 378986, 378004, 377087, 376028, 374830, 374168, 374481, 375405, 376800, 379294, 382987, 386723, 389692, 392755, 397100, 402570, 408456, 414988, 422779, 431542, 440587, 449938, 459910, 470179, 480228, 489911, 498682, 505190, 508731, 510255, 510794, 509835, 506470, 501360, 496086, 491106, 485611, 478917, 470888, 461530, 451335, 441515, 432822, 424690, 416477, 408808, 402519]
57907D02519n476n842o148n441m399l674k745j388o58j183j948j828j165p50l76
57892C59498N18J706K580L024L199L175L193L581M045L919L233K665K350J761
57878C98447Q03j51j261k953m691n422n320n567o318o532n947n524n598n340m478
57863C34148l862l768l419k661k448k948k847j398L88J377J714J901J830J590
57849C19597J831K513K597J647N74J22o9l25l14j72p66k079k779k210j459j558
57833C17150j973j762r73r3P62J298J003K72L23J256J643Q18K9M32J432K087K664
57816C26368L550L995L277K039J187N11m39j146j059p75j117j747j877j612j557
57801C29598j793k196k956l914m150l220k087j922k648l368l518k972j874r68
$$ y = [402519, 397043, 391201, 385053, 379612, 375213, 371539, 368794, 367406, 366748, 365565, 363617, 361789, 360624, 359874, 359498, 360016, 361722, 364302, 367326, 370525, 373700, 376893, 380474, 384519, 388438, 391671, 394336, 396686, 398447, 399250, 399099, 397838, 394885, 390194, 384772, 379452, 373885, 367567, 361035, 355088, 349564, 343966, 338626, 334148, 330286, 326518, 323099, 320438, 317990, 315042, 312195, 310797, 311185, 312562, 314276, 316177, 318007, 319597, 321428, 323941, 326538, 328185, 328759, 328881, 328812, 328487, 328173, 328001, 327235, 325156, 322377, 320167, 318708, 317150, 315177, 313415, 312442, 312349, 313111, 314409, 315412, 315684, 316007, 317263, 318906, 319724, 319753, 320185, 321617, 323704, 326368, 329918, 333913, 337190, 339229, 340416, 340927, 340488, 339342, 338283, 337508, 336391, 334644, 332767, 331155, 329598, 327805, 325609, 322653, 318739, 314589, 311369, 309282, 307360, 304712, 301344, 297826, 294854, 292980, 292012]
57787B92012j128j968k019q92O9L7R7J311K811L259L064L559M798N702N787N456
57771C21955M992M410L920L629L217K551K017J641Q19m53j204j092j194k200l099
57756C39909k882k344k667l370l214k371k043k541l211l798m397m642m210l752
57742B94467l953m251l780l060l217m005m105l203k232j709j233o70m79p88j170
57727B56612j476j908k256k010j283p43o23n22k07R3J70L8k38m61l53j11l78j248
57709B43096j831j485p27l14j16K02K63k86p86m16M25P27L44j22m71q46r94o16
57691B36047q9O2K9J64K03m5J18J280K711L338L451M186N772P565R381J1571J4000
57674B99744J6316J8892K2354K6374L0145L3648L7163L9666L9094L4236K5424
$$ y = [292012, 290884, 288916, 286897, 286005, 286074, 286111, 286208, 287519, 290330, 293589, 296653, 300212, 305010, 310712, 316499, 321955, 326947, 331357, 335277, 338906, 342123, 344674, 346691, 348332, 349151, 348698, 347494, 346402, 345208, 343008, 339909, 337027, 334683, 332016, 328646, 325432, 323061, 321018, 318477, 315266, 311468, 307071, 302429, 298219, 294467, 290514, 286263, 282483, 279423, 276206, 272201, 268096, 264893, 262661, 260952, 259719, 259049, 258570, 257782, 256612, 255136, 253228, 250972, 248962, 247679, 246936, 246313, 245791, 245584, 245677, 245847, 245885, 245647, 245186, 244833, 244722, 244344, 243096, 241265, 239780, 239053, 238739, 238623, 238825, 239088, 238802, 238016, 237600, 238025, 238752, 239096, 238974, 238503, 237657, 236663, 236047, 235958, 236020, 236049, 236213, 236416, 236371, 236489, 237769, 240480, 243818, 247269, 251455, 257227, 264792, 274173, 285744, 299744, 316060, 334952, 357306, 383680, 413825, 447473, 484636, 524302, 563396, 597632, 623056]
57663F23056J3718O74j1431k0576k6428k9841l1171l0293k7857k5153k2708k0259
57651C91731j7935j6215j4735j2662j0210q529p976p735p176o333n058l165j461
57638B72541j169k063k573j958j093p40n29j19k3n46j033r06n28m11m12k57j28
57621B58053k30l83l68j19M71J267J475M69r99j497q66l36n05n78N6P74R26R09
57603B58519J293J761J670J007K08l86n04l7N26M71k9PQ66J571J317O29M90J027
57585B70406J557J425M76p73j243k44J424K145J433M22J82M87O38N27L49J26O8
57568B79405O45J733K397K044J161N08K97N35J364K497L055K629J829J351J160
57553C02610J057J238J684J759J140N15N84R91R72O12O48J360K277K814K682J950
$$ y = [623056, 636774, 637448, 626017, 605441, 579013, 549172, 518001, 487708, 459851, 434698, 411990, 391731, 373796, 357581, 342846, 330184, 319974, 311445, 303469, 295734, 288558, 282225, 277167, 274002, 272541, 271372, 269309, 266736, 264778, 263685, 262945, 262416, 262297, 262274, 261728, 260695, 259789, 259261, 258850, 258438, 258181, 258053, 257823, 257440, 257072, 256953, 257424, 258691, 260166, 260635, 259636, 258139, 257273, 256937, 256432, 255854, 255910, 256684, 257610, 258519, 259812, 261573, 263243, 264250, 264458, 264072, 263568, 263531, 264057, 264528, 264499, 264506, 265372, 266943, 268260, 268889, 269379, 270406, 271963, 273388, 273864, 273091, 271848, 271604, 273028, 275173, 276606, 277028, 277210, 277697, 278335, 278862, 279211, 279337, 279405, 280050, 281783, 284180, 286224, 287385, 287893, 288190, 288725, 290089, 292586, 295641, 298270, 300099, 301450, 302610, 303667, 304905, 306589, 308348, 309488, 310003, 310587, 311578, 312550, 313162, 313810, 315170, 317447, 320261, 322943, 324893]
57537C24893J130Q80J300J774J797J528J391J572K104K847L226K692J686J343
57523C50163J924K382J938J162R57J252J511J702K007K195K119K230K831L318
57509C77691L050K425K251K487K545K489K910L727M067L436K303J440J218J604
57495D13643K337K988L220L033K634K237K069K295K675K698K323K145K502K883
57481D49682K714K244K113K386K604K520K244J890J514J305J411J754K258K982
57467D79621L754M029L562K833K504K723L297M056M786N127M992M663M248L589
57453E33784K915K844L279L180K196J629K743M729N611M849L787L616M100M521
57439E83783M801N126N296N024M483M138M197M494M724M697M470M279M253M287
$$ y = [324893, 326023, 326903, 328203, 329977, 331774, 333302, 334693, 336265, 338369, 341216, 344442, 347134, 348820, 350163, 352087, 354469, 356407, 357569, 358526, 359778, 361289, 362991, 364998, 367193, 369312, 371542, 374373, 377691, 380741, 383166, 385417, 387904, 390449, 392938, 395848, 399575, 403642, 407078, 409381, 410821, 412039, 413643, 415980, 418968, 422188, 425221, 427855, 430092, 432161, 434456, 437131, 439829, 442152, 444297, 446799, 449682, 452396, 454640, 456753, 459139, 461743, 464263, 466507, 468397, 469911, 471216, 472627, 474381, 476639, 479621, 483375, 487404, 490966, 493799, 496303, 499026, 502323, 506379, 511165, 516292, 521284, 525947, 530195, 533784, 536699, 539543, 542822, 546002, 548198, 549827, 552570, 557299, 562910, 567759, 571546, 575162, 579262, 583783, 588584, 593710, 599006, 604030, 608513, 612651, 616848, 621342, 626066, 630763, 635233, 639512, 643765, 648052]
57425F48052M319M442M552M288L646L336L967N141N837N628N023M718M972N639
57411G13560O375O816O843O734O778O873O705O213N585N043M833N178N958O675
57397H00169P041P264P438P191O361N575N529O071O574O945P514Q209Q625Q810
57383H99316R207R791R967R465Q681Q078P765P816Q329Q993R098Q370P394O975
57369A019245P279P875Q379Q832R446J0187J0689J0649J0279J0090J0183J0114
57357A133247R621R103R025R235R311R274R400R573R469R278R575J0434J1191
57344A257736J1305J0973J0697J0657J0729J0943J1530J2510J3385J3452J2599
57333A386516J1635J1518J2236J2924J3032J2856J2817J2875J3011J3563J4503
$$ y = [648052, 652371, 656813, 661365, 665653, 669299, 672635, 676602, 681743, 687580, 693208, 698231, 702949, 707921, 713560, 719935, 726751, 733594, 740328, 747106, 753979, 760684, 766897, 772482, 777525, 782358, 787536, 793494, 800169, 807210, 814474, 821912, 829103, 835464, 841039, 846568, 852639, 859213, 866158, 873672, 881881, 890506, 899316, 908523, 918314, 928281, 937746, 946427, 954505, 962270, 970086, 978415, 987408, 996506, 1004876, 1012270, 1019245, 1026524, 1034399, 1042778, 1051610, 1061056, 1071243, 1081932, 1092581, 1102860, 1112950, 1123133, 1133247, 1142868, 1151971, 1160996, 1170231, 1179542, 1188816, 1198216, 1207789, 1217258, 1226536, 1236111, 1246545, 1257736, 1269041, 1280014, 1290711, 1301368, 1312097, 1323040, 1334570, 1347080, 1360465, 1373917, 1386516, 1398151, 1409669, 1421905, 1434829, 1447861, 1460717, 1473534, 1486409, 1499420, 1512983, 1527486]
57322A527486J5040J4619J3815J3474J3491J3246J2868J3011J3669J4141J4207
57311A679067J4282J4494J4511J4349J4393J4479J3935J2819J2183J2705J3811
57300A831028J4607J4925J4974J4741J4351J4389J5142J5975J6045J5433J4861
57289A996471J4679J4681J4763J5144J5891J6657J6980J6671J6012J5714J6360
57278B170023J7615J8278J7603J6349J6009J7033J8438J9189J9389J9715K0214
57267B369855K0215J9338J8101J7459J7977J9511K1385K2724K2932K2103K0886
57256B592486J9825J9042J8658J9048K0223K1313K1347K0465J9710J9590J9577
57245B811284J9188J8733J8573J8402J7842J7247J7120J7187J6814J6043J5501
$$ y = [1527486, 1542526, 1557145, 1570960, 1584434, 1597925, 1611171, 1624039, 1637050, 1650719, 1664860, 1679067, 1693349, 1707843, 1722354, 1736703, 1751096, 1765575, 1779510, 1792329, 1804512, 1817217, 1831028, 1845635, 1860560, 1875534, 1890275, 1904626, 1919015, 1934157, 1950132, 1966177, 1981610, 1996471, 2011150, 2025831, 2040594, 2055738, 2071629, 2088286, 2105266, 2121937, 2137949, 2153663, 2170023, 2187638, 2205916, 2223519, 2239868, 2255877, 2272910, 2291348, 2310537, 2329926, 2349641, 2369855, 2390070, 2409408, 2427509, 2444968, 2462945, 2482456, 2503841, 2526565, 2549497, 2571600, 2592486, 2612311, 2631353, 2650011, 2669059, 2689282, 2710595, 2731942, 2752407, 2772117, 2791707, 2811284, 2830472, 2849205, 2867778, 2886180, 2904022, 2921269, 2938389, 2955576, 2972390, 2988433, 3003934]
57234C003934J5395J5331J5093J4913J4868J4664J4170J3648J3311J3108J3054
57223C161489J3289J3600J3346J2199J0672R659R589J0194J0930J1346J1239J0731
57211C298283J0262J0364J1232J2461J3334J3470J3089J2537J1814J0911J0337
57200C428094J0661J1541J1953J1511J0860J0501J0030Q968P545O113M512K767
57188C535056J745K119L196L699L434L150L100K819K307K261K923L603L711L478
57174C576601L385L409L188K525J488L40n93j164j572k039k608l452m910o704
57160C567894p720p260o041n088m125k162O88L215M767N738O349O192N159L696
57146C571302J935l89k935m737n520n931o267o078n366m925m969m572l139j407
$$ y = [3003934, 3019329, 3034660, 3049753, 3064666, 3079534, 3094198, 3108368, 3122016, 3135327, 3148435, 3161489, 3174778, 3188378, 3201724, 3213923, 3224595, 3234254, 3243843, 3254037, 3264967, 3276313, 3287552, 3298283, 3308545, 3318909, 3330141, 3342602, 3355936, 3369406, 3382495, 3395032, 3406846, 3417757, 3428094, 3438755, 3450296, 3462249, 3473760, 3484620, 3495121, 3505151, 3514119, 3521664, 3527777, 3532289, 3535056, 3536801, 3538920, 3542116, 3545815, 3549249, 3552399, 3555499, 3558318, 3560625, 3562886, 3565809, 3569412, 3573123, 3576601, 3579986, 3583395, 3586583, 3589108, 3590596, 3590936, 3590343, 3589179, 3587607, 3585568, 3582960, 3579508, 3574598, 3567894, 3560174, 3552914, 3546873, 3541785, 3537660, 3535498, 3536186, 3539401, 3544168, 3549906, 3556255, 3562447, 3567606, 3571302, 3573237, 3572848, 3569913, 3565176, 3559656, 3553725, 3547458, 3541380, 3536014, 3531089, 3526120, 3521548, 3518409, 3517002]
57132C517002k54M97J365K200K663K971L463M101N024O791R443J2148J4418J6873
57118C598705K0170K4112K8525L4070M1314M9943N9778P1570Q5774J01510J17998
57107D233469J36230J57987J84032K14690K51467K96605L51629M17889M98142
57098F742140N96063P14534Q55712J022130J215612J434858J675262J930549K193030
57089A8379890K453153K701637K932610L143128L329942L487556L604663L653511
57081D3686090L581126L323043K842167K162435J364056N43921k23050q95467
57073E6384321j456286j902257k238615k474665k619652k682985k677687k620908
57065C7711266k529728k417066k291313k158003k021003j883292j747894j618069
$$ y = [3517002, 3516748, 3517245, 3518610, 3520810, 3523473, 3526444, 3529907, 3534008, 3539032, 3545823, 3555266, 3567414, 3581832, 3598705, 3618875, 3642987, 3671512, 3705582, 3746896, 3796839, 3856617, 3928187, 4013961, 4115471, 4233469, 4369699, 4527686, 4711718, 4926408, 5177875, 5474480, 5826109, 6243998, 6742140, 7338203, 8052737, 8908449, 9930579, 11146191, 12581049, 14256311, 16186860, 18379890, 20833043, 23534680, 26467290, 29610418, 32940360, 36427916, 40032579, 43686090, 47267216, 50590259, 53432426, 55594861, 56958917, 57502838, 57279788, 56384321, 54928035, 53025778, 50787163, 48312498, 45692846, 43009861, 40332174, 37711266, 35181538, 32764472, 30473159, 28315156, 26294153, 24410861, 22662967, 21044898]
57057B1044898j496456j384518j282915j191662j109692j035039r66116r02381
57049A1676119q43465p88235p35345o84300o35535n89780n47703n09696m75377
57040E866683m43618m13521l85053l58283l32590l07372k83081k60733k40552
57031B841880k21920k04401j87982j72524j57868j44462j32804j22248j11424
57022A386247j00058q9351q0240p2331o4923n8046n1889m6136m0683l6259l3422
57011G12909l1474k9164k6107k2855j9963j7681j6155j5260j4467j3474j2635
57000D93674j2295j2174j1970j2040j2603j2757j1412q937o808n608m499k811
56988C79760j090m8N95J564K850L769L883L223J753p51m164p697j0466j2230j3369
$$ y = [21044898, 19548442, 18163924, 16881009, 15689347, 14579655, 13544616, 12578500, 11676119, 10832654, 10044419, 9309074, 8624774, 7989239, 7399459, 6851756, 6342060, 5866683, 5423065, 5009544, 4624491, 4266208, 3933618, 3626246, 3343165, 3082432, 2841880, 2619960, 2415559, 2227577, 2055053, 1897185, 1752723, 1619919, 1497671, 1386247, 1286189, 1196838, 1116598, 1044267, 979344, 921298, 869409, 823273, 782590, 746331, 712909, 681435, 652271, 626164, 603309, 583346, 565665, 549510, 534250, 519783, 506309, 493674, 481379, 469205, 457235, 445195, 432592, 419835, 408423, 399486, 392678, 387070, 382571, 379760, 378670, 378622, 379217, 380781, 383631, 387400, 391283, 394506, 396259, 395508, 391344, 383647, 373181, 360951, 347582]
56973C47582j4120j4138j2936j0632p947n589l854k725j931q76R92L600O384R095
56959B92905J1921J4685J6520J6730J5430J2977R289M274j404o632j0657j3214
56947C62824j4158j3519j1808r819q150p017o212n082l015k09K505M882P585J0949
56933C09756J4235J6750J8749K0288J9986J6382J0131L498k213p454j2612j6849
56921C90647j9219j9839j9349j8030j6070j4045j2501j1399j0458r746r514r622
56909B20855r459q476o736n005m064l774l156j705k11K84j04m43l35M1R40K890
56893A81542N457P344Q081Q668J0063J1982J3644J4795J5333J4686J2351Q713
56881C12659M642O02l263o546q726r720r787q975p149m456j433J437M117P022
$$ y = [347582, 333462, 319324, 306388, 295756, 287809, 282220, 278366, 275641, 273710, 272834, 273826, 277426, 283810, 292905, 304826, 319511, 336031, 352761, 368191, 381168, 390457, 394731, 393327, 386695, 376038, 362824, 348666, 335147, 323339, 313520, 305370, 298353, 292141, 287059, 284044, 283835, 286340, 291222, 298807, 309756, 323991, 340741, 359490, 379778, 399764, 416146, 426277, 429775, 427562, 420108, 407496, 390647, 371428, 351589, 332240, 314210, 298140, 284095, 271594, 260195, 249737, 239991, 230477, 220855, 211396, 202920, 196184, 191179, 187115, 183341, 180185, 178480, 178269, 178553, 178449, 178006, 177671, 177712, 178652, 181542, 186999, 194343, 202424, 211092, 221155, 233137, 246781, 261576, 276909, 291595, 303946, 312659, 317301, 317903, 314640, 308094, 299368, 289648, 279861, 270886, 263737, 259281, 257848, 259285, 263402, 270424]
56867B70424J0717J5353K0396K5036K8983L2595L6224L9614M1895M1838L8306
56856F01381L0931K0629R074k218j2081j9363k3295k4254k3416k1432j8102j3394
56844E04460p976k352L631J0028J6392K2673K9732L8109M6897N4628O0668O4733
56832H41623O5415O0472M8970L2360J3304n939k3676l8131m7601n1518n1083m8448
56820G95748m5066m0891l5278k8337k0981j3760o332J628R630J6946K3541K9892
56808F86740L5984M0804M2730M0167L2296J9771M680j0505k3989l4697m1899m5398
56796G46684m5914m4637m2168l8322l2977k6881k1252j6774j3040r093m420O31
56784D51837N466R958J4219J7798J9574J8606J4790Q678J056p090j4750k1296
$$ y = [270424, 281141, 296494, 316890, 341926, 370909, 403504, 439728, 479342, 521237, 563075, 601381, 632312, 652941, 662015, 659797, 647716, 628353, 605058, 580804, 557388, 535956, 517854, 504460, 496484, 494132, 497763, 507791, 524183, 546856, 576588, 614697, 661594, 716222, 776890, 841623, 907038, 967510, 1016480, 1048840, 1062144, 1056205, 1032529, 994398, 946797, 895279, 844196, 795748, 750682, 709791, 674513, 646176, 625195, 611435, 605103, 606731, 616361, 633307, 656848, 686740, 722724, 763528, 806258, 846425, 878721, 898492, 903172, 892667, 868678, 833981, 792082, 746684, 700770, 656133, 613965, 575643, 542666, 515785, 494533, 477759, 464719, 455626, 451206, 451837, 457303, 467261, 481480, 499278, 518852, 537458, 552248, 560926, 561982, 554892, 540142, 518846]
56772E18846k6507l0072l1480l0686k8444k5710k3064k0874j9528j8921j8194
56761B45366j6548j4225j2128j0741r820r032q306p576o689n665m775m280m246
56748A31335m530m765m575m030l665l736l713k982j822j140j290j756k009k091
56734H9231k137j901j167k80K22L02L39M36K65k85o94l85M73J100R96M29p5l36
56716H6533m74m97k81J10M21N15M87M85N60O46N60J09n99j117j089o44j25L43
56698H5943P09P24K82j48P0Q44J363J075K11o46j088r48l00M32P24M36j54p08
56680H8821r61o69kK79m14j523j928j430r59j137j452j164l41M31Q77J087J197
56663H0712J289J360J257R24P27J018J460J395R01P21J083J455J631K047K763
$$ y = [518846, 492339, 462267, 430787, 400101, 371657, 345947, 322883, 302009, 282481, 263560, 245366, 228818, 214593, 202465, 191724, 181904, 172872, 164566, 156990, 150301, 144636, 139861, 135581, 131335, 126805, 122040, 117465, 113435, 109770, 106034, 102321, 99339, 97517, 96377, 95087, 93331, 91322, 89231, 87094, 85193, 84026, 83746, 83968, 84270, 84609, 85045, 85310, 85025, 84331, 83946, 84419, 85519, 86515, 86944, 86869, 86533, 86059, 85562, 85281, 85391, 85812, 86327, 86814, 87299, 87859, 88505, 89065, 89174, 88575, 87458, 86369, 85725, 85600, 85943, 86652, 87376, 87658, 87510, 87580, 88424, 89787, 90862, 91073, 90427, 89339, 88391, 88091, 88523, 89247, 89683, 89529, 88821, 87860, 87191, 87189, 87468, 87054, 85531, 83603, 82173, 81214, 80077, 78625, 77461, 77120, 77551, 78428, 79515, 80712, 82001, 83361, 84618, 85542, 86269, 87287, 88747, 90142, 91043, 91764, 92847, 94302, 95933, 97980, 100743]
56648A00743L103K781K421K368J959P46m53o22k4L47K60K85O71J089J288J306
56632A18268J132P63L72Q9j66l07r9K14o0r27j383q22l3Nm42n28l03m22q52r60
56612A13539o58m71n74o33m95l12j20M6j19p08j131q57k60p1l17n60p31r31q15
56593A03822j40N65P21P14J149J603J328P51Q83J519J479O22J46N99J093Q43K32
56576A17929j14k30j50N25J741K570K346J564J029Q27P66J144K337L914M862M657
56560A45717L738L032L107L673L909L429K786K704L038L116K836K726K969L113
56546A89893K827K268J572O72k55p48o38k12J80K70k33j236j932j646q31n13q12
56529A88626r50o07k69k48l51o33j433k523l162l247l368l579l236k361j920k234
$$ y = [100743, 103846, 106627, 109048, 111416, 113375, 114121, 113668, 113046, 113022, 113369, 113629, 113914, 114585, 115674, 116962, 118268, 119400, 120163, 120535, 120624, 120458, 120151, 120052, 120266, 120206, 119279, 117896, 117074, 117041, 117046, 116604, 116076, 115773, 115351, 114499, 113539, 112881, 112410, 111836, 111203, 110708, 110396, 110276, 110322, 110203, 109495, 108364, 107507, 107247, 107176, 106859, 106299, 105568, 104637, 103822, 103682, 104247, 104968, 105682, 106831, 108434, 109762, 110513, 111396, 112915, 114394, 115016, 115162, 115761, 116854, 117697, 117929, 117815, 117585, 117435, 117960, 119701, 122271, 124617, 126181, 127210, 128037, 128803, 129947, 132284, 136198, 141060, 145717, 149455, 152487, 155594, 159267, 163176, 166605, 169391, 172095, 175133, 178249, 181085, 183811, 186780, 189893, 192720, 194988, 196560, 197232, 196977, 196229, 195591, 195379, 195559, 195829, 195596, 194360, 192428, 190782, 189951, 189438, 188626, 187676, 187069, 186800, 186552, 186201, 185568, 184135, 181612, 178450, 175203, 171835, 168256, 165020, 162659, 160739, 158505]
56513A58505k255j141M02J135Q18M8p07j190j128o54l61l81j05O51J013L10p26
56496A54234r36l57P1m5k91l37j76K57Q88J034K3j705k834k649j670p12N6Q55
56478A45706J548J760J517J369J655K014J867J249P26N28L62J88N07J417K046
56463A64459J599N26j79l90o56r60p64j93m2n02q68o74j69L91J013J325P75k97
56445A64394p39j17P52J109J077R38N68J19K36R95J485J008j1p69r42m29P58J917
56427A72349J945Q69J04N42J324J283O28L08M97P59J027J362J308M81n45q70m88
56410A82883j18r4j31M6M63J061J537J370M35o27j117r68m16M44J363J750J374
56393A89255P90N70N88N44O11J006J353J103L05m87p50k23R43K034K284J793J349
$$ y = [158505, 156250, 155109, 155511, 156646, 157464, 157512, 156805, 155615, 154487, 153833, 153472, 153091, 152986, 153637, 154650, 154960, 154234, 153298, 152941, 153012, 152967, 152676, 152339, 152163, 152420, 153308, 154342, 154365, 152660, 149826, 147177, 145507, 144795, 144851, 145706, 147254, 149014, 150531, 151900, 153555, 155569, 157436, 158685, 159411, 159939, 160301, 160489, 160996, 162413, 164459, 166058, 166584, 166405, 166015, 165359, 164399, 163635, 163442, 163400, 162898, 162030, 161356, 161187, 161578, 162591, 163916, 164691, 164394, 163655, 163538, 164290, 165399, 166476, 167414, 167982, 168101, 168337, 169332, 170817, 171825, 171814, 171045, 170103, 169674, 170432, 172349, 174294, 175163, 175267, 175809, 177133, 178416, 179044, 179352, 179849, 180608, 181635, 182997, 184305, 184786, 184241, 183371, 182883, 182765, 182671, 182540, 182586, 183049, 184110, 185647, 187017, 187452, 186825, 185708, 184740, 184324, 184768, 186131, 187881, 189255, 190045, 190615, 191203, 191747, 192358, 193364, 194717, 195820, 196125, 195638, 194888, 194665, 195608, 197642, 199926, 201719, 203068]
56376B03068J210Q80K53m1K85O53P22R43J487J663J089M98O35J147J298R87M55
56359B17232j64m19K85J485J761P59m5M63J395J400O42Nm61r44q34K14J113P89
56341B24676p3k26P4j45n04R7J310J761J332J150J472J407Q57Q96J868K693K536
56324B41181J876J437J243J139J262J520J420P93R4k25r6L54Q59J014P75P48J377
56307B56771K209K587K561K428J967J071M54O92J089O97p2q6O53J180J298J651
56291B77150K292K524K185J822J630J355J215J661K313K373K039K285L194L782
56277C07820L574L143K910K644K266K127K247K282K375L012L997M549M547M659
56263C52152N163N657O055O790P880Q675Q831Q745Q917R571J0867J2779J4782
$$ y = [203068, 204278, 205158, 205411, 205370, 205655, 206308, 207030, 207973, 209460, 211123, 212212, 212710, 213345, 214492, 215790, 216777, 217232, 217068, 216649, 216934, 218419, 220180, 220939, 220894, 221357, 222752, 224152, 224794, 224799, 224338, 223394, 222560, 222774, 223887, 224676, 224603, 224377, 224451, 224306, 223802, 223899, 225209, 226970, 228302, 229452, 230924, 232331, 233188, 234084, 235952, 238645, 241181, 243057, 244494, 245737, 246876, 248138, 249658, 251078, 251871, 251965, 251740, 251644, 251998, 252857, 253871, 254646, 255394, 256771, 258980, 261567, 264128, 266556, 268523, 269594, 270048, 270740, 271829, 272526, 272454, 272368, 273021, 274201, 275499, 277150, 279442, 281966, 284151, 285973, 287603, 288958, 290173, 291834, 294147, 296520, 298559, 300844, 304038, 307820, 311394, 314537, 317447, 320091, 322357, 324484, 326731, 329013, 331388, 334400, 338397, 342946, 347493, 352152, 357315, 362972, 369027, 375817, 383697, 392372, 401203, 409948, 418865, 428436, 439303, 452082, 466864]
56250D66864J6368J7751J9418K1272K2954K4586K6418K8117K9293L0267L1357
56239G34665L2021L1673L0787L0018K8846K6406K3051J9619J5790J0740M980j30
56227I88466m406q667j2881j6163j8451k0431k1941k2215k1652k1606k2270k2559
56215G75224k2067k1479k0950j9838j8258j7153j6598j5649j4060j2588j1506
56204E85078j0444r704r898j0246r180o909n356n225n184m373l593l334k686j177
56190D97769J04K71rJ33N21Q22J309J942K055J620J520J986K141J636J308J634
56174E16762J983K007K288L028L525L515L635M082M268M300N102O565P278O817
56160E75155O546P377Q420Q746Q854R413J0027J0293J0747J1812J2965J3857J5059
$$ y = [466864, 483232, 500983, 520401, 541673, 564627, 589213, 615631, 643748, 673041, 703308, 734665, 766686, 798359, 829146, 859164, 888010, 914416, 937467, 957086, 972876, 983616, 988596, 988466, 984060, 975393, 962512, 946349, 927898, 907467, 885526, 863311, 841659, 820053, 797783, 775224, 753157, 731678, 710728, 690890, 672632, 655479, 638881, 623232, 609172, 596584, 585078, 574634, 564930, 555032, 544786, 535606, 528697, 523341, 518116, 512932, 508559, 504966, 501632, 498946, 497769, 497873, 498144, 498135, 498268, 498789, 499611, 500920, 502862, 504917, 506537, 508057, 510043, 512184, 513820, 515128, 516762, 518745, 520752, 523040, 526068, 529593, 533108, 536743, 540825, 545093, 549393, 554495, 561060, 568338, 575155, 581701, 589078, 597498, 606244, 615098, 624511, 634538, 644831, 655578, 667390, 680355, 694212, 709271]
56147G09271J7068J9626K2543K6040K9850L3391L7170M2551M9692N7178O4018
56136A108398P0400P6193Q0405Q2568Q2872Q0685P4960O6633N8535N2246M6917
56125A880812M1782L7536L4371L0699K5042J7560R054K40p450j2488j5485j9013
56113B022660k4580l1623l9678m9031n8617o5913o9867p1530p1247o7951o2033
56102A410590n5801n0020m3115l5000k8433k4771k1708j7297j3097j0972r690
56091A100686p381m867l735l300k201j123j242j607o14J319K808L865N180O423
56077A094211P107P817Q977R867J0278J1331J3308J4678J4662J4683J5741J6699
56065A239359J6723J6944J8044J8632J7847J7099J7488J8062J8284J9426K1606
$$ y = [709271, 726339, 745965, 768508, 794548, 824398, 857789, 894959, 937510, 987202, 1044380, 1108398, 1178798, 1254991, 1335396, 1417964, 1500836, 1581521, 1656481, 1723114, 1781649, 1833895, 1880812, 1922594, 1960130, 1994501, 2025200, 2050242, 2067802, 2076856, 2077096, 2069646, 2057158, 2041673, 2022660, 1998080, 1966457, 1926779, 1877748, 1819131, 1753218, 1683351, 1611821, 1540574, 1472623, 1410590, 1354789, 1304769, 1261654, 1226654, 1198221, 1173450, 1151742, 1134445, 1121348, 1110376, 1100686, 1093305, 1088438, 1084703, 1081403, 1079202, 1078079, 1076837, 1075230, 1074616, 1075935, 1078743, 1082608, 1087788, 1094211, 1101318, 1109135, 1118112, 1127979, 1138257, 1149588, 1162896, 1177574, 1192236, 1206919, 1222660, 1239359, 1256082, 1273026, 1291070, 1309702, 1327549, 1344648, 1362136, 1380198, 1398482, 1417908, 1439514]
56054A439514K2513K1211K0093K0882K1796K1196K0736K2101K3757K3961K4046
56043A681806K5655K7512K8058K8517L0290L2020L2310L2515L3891L4902L4399
56032B021875L4408L6522L8699L8910L8821M0437M2387M3117M4368M7721N1032
56021B478297N2213N3226N6373N9972O1855O3661O7428P1416P3636P5944Q0321
56010C194342Q4772Q7388R0477R6044J01374J04115J07297J13980J21409J26285
56000D227483J31222J39780J49577J56908J63719J73179J82837J89395J95922
55991E710022K06909K20337K32178K44375K60632K78825K95703L14465L39293
55982H102739L67087L93308M21061M55416M94133N33440N77270O30850O91286
$$ y = [1439514, 1462027, 1483238, 1503331, 1524213, 1546009, 1567205, 1587941, 1610042, 1633799, 1657760, 1681806, 1707461, 1734973, 1763031, 1791548, 1821838, 1853858, 1886168, 1918683, 1952574, 1987476, 2021875, 2056283, 2092805, 2131504, 2170414, 2209235, 2249672, 2292059, 2335176, 2379544, 2427265, 2478297, 2530510, 2583736, 2640109, 2700081, 2761936, 2825597, 2893025, 2964441, 3038077, 3114021, 3194342, 3279114, 3366502, 3456979, 3553023, 3654397, 3758512, 3865809, 3979789, 4101198, 4227483, 4358705, 4498485, 4648062, 4804970, 4968689, 5141868, 5324705, 5514100, 5710022, 5916931, 6137268, 6369446, 6613821, 6874453, 7153278, 7448981, 7763446, 8102739, 8469826, 8863134, 9284195, 9739611, 10233744, 10767184, 11344454, 11975304, 12666590]
55973A2666590P55014Q27918R16767J018261J128955J258083J417198J606023
55965B1594809J823693K084649K407393K798619L267882L847516M578399N489153
55957D7892113O610932P993482R674304J1645677J3878929J6349209J8988022
55950A33032668K1647696K4183562K6513431K8423433K9262483K8011946K3889724
55943C14964943J6969054Q207210j063917r635389j6607100k1434443k4009123
55936B67391235k4658330k3944673k2410816k0468080j8412544j6438560j4632681
55929A26425551j3008346j1562814j0291121r169787q167085p269971o479382
55922F0477045n785180n167523m617450m135296l712323l332411k989088k684616
$$ y = [12666590, 13421604, 14249522, 15166289, 16184550, 17313505, 18571588, 19988786, 21594809, 23418502, 25503151, 27910544, 30709163, 33977045, 37824561, 42402960, 47892113, 54503045, 62496527, 72170831, 83816508, 97695437, 114044646, 133032668, 154680364, 178863926, 205377357, 233800790, 263063273, 291075219, 314964943, 331933997, 340141207, 339077290, 329441901, 312834801, 291400358, 267391235, 242732905, 218788232, 196377416, 175909336, 157496792, 141058232, 126425551, 113417205, 101854391, 91563270, 82393483, 74226398, 66956427, 60477045, 54691865, 49524342, 44906892, 40771596, 37059273, 33726862, 30737774, 28053158]
55914B8053158k414958k170520j949170j754535j583559j428283j287536j164998
55906A4299599j058056r59753q69553p91397p23326o59254n99078n47142n02460
55897G589580m59830m18935l83372l52282l21498k91518k66005k43840k20653
55888D631647j96871j76570j59658j42668j25966j12892j02953r3092q4545q1358
55878C355074q2992q5209q7303r1772r7656j00967j01312j01651j01908r9119
55868B405185r3647q9139q6304q2404p6914p2237o8785o4585n9761n6433n4206
55857A600770n0611m5838m2429m0576l8306l5891l5291l5647l4080l0819k8844
55846A182438k8690k8090k6624k6047k6171k4995k2981k2593k3533k2903k0388
$$ y = [28053158, 25638200, 23467680, 21518510, 19763975, 18180416, 16752133, 15464597, 14299599, 13241543, 12281790, 11412237, 10620840, 9897514, 9238260, 8639182, 8092040, 7589580, 7129750, 6710815, 6327443, 5975161, 5653663, 5362145, 5096140, 4852300, 4631647, 4434776, 4258206, 4098548, 3955880, 3829914, 3717022, 3614069, 3520977, 3436432, 3355074, 3272082, 3186873, 3099570, 3007798, 2910142, 2809175, 2707863, 2606212, 2504304, 2405185, 2311538, 2222399, 2136095, 2053691, 1976777, 1904540, 1835755, 1771170, 1711409, 1654976, 1600770, 1550159, 1504321, 1461892, 1421316, 1383010, 1347119, 1311828, 1276181, 1242101, 1211282, 1182438, 1153748, 1125658, 1099034, 1072987, 1046816, 1021821, 998840, 976247, 952714, 929811, 909423]
55835I09423j8857j9325j9557j8309j7057j6747j6394j5515j4840j4174j2631
55824G26017j0956j0657j1099j0553r558r916j0951j0446q691p853p857o873n480
55811F05127o026q075q769p721p276p761o945m648l445l918l573j521j8j22K05
55796E35514K047L458L134K703L512M160L158J348o3j525l659n915p963j0393
55782E29516j3020j4552j4706j4616j4594j3749j2234j1373j1078r765p401n947
55770C86481o084o244n595n184n250m356k369j457k726m337m432l623l208l132
55756C28484l191m197o423q555r374r099q216o698n053m393m591m222k927k020
55742B49525k110k154j550j110j163q37m8r6j320k159j589n94k27r8J84j09j379
$$ y = [909423, 890566, 871241, 851684, 833375, 816318, 799571, 783177, 767662, 752822, 738648, 726017, 715061, 704404, 693305, 682752, 673194, 663278, 652327, 641881, 633190, 625337, 617480, 610607, 605127, 599101, 591026, 582257, 574536, 567260, 559499, 552554, 547906, 544461, 540543, 536970, 535449, 535431, 535309, 535514, 537561, 541019, 544153, 546856, 550368, 554528, 557686, 559034, 558971, 557446, 553787, 547872, 539909, 529516, 516496, 501944, 487238, 472622, 458028, 444279, 432045, 420672, 409594, 399829, 392428, 386481, 380397, 374153, 368558, 363374, 358124, 353768, 351399, 349942, 347216, 342879, 338447, 334824, 331616, 328484, 325293, 321096, 314673, 306118, 296744, 287645, 279429, 272731, 267678, 263285, 258694, 254472, 251545, 249525, 247415, 245261, 243711, 242601, 241438, 240601, 240553, 240457, 239137, 236978, 235389, 234795, 234568, 234470, 234654, 234545, 233166]
55725B33166k715l386l788m185l982l074k402k494k820k983l063k646j246K55
55711A94637M99J1M19J418J133k59l64J411K665J855L73m57j411k943l608k768
55695A92611k255l327m424l895k766k581k689j906j038j333k001j600n58j46j87
55680A61905J94O38L99N0M74J068P78J8j97j57q12k026l010l695m186l792k113
55663A45536l13K17k63o26o64o98l45Q02J952K076J516J356J796K321K747L034
55647A60444K762J891J234J165Q14m27j674k036k181l056m079m167l668l671m107
55632A39244l999l116k068j267r20j357k243k304j009K83J51p93j060o53p08j472
55616A16709k180k524k705k463j494m89l89r00r93n66l43m47l47j3Jm60j039j517
$$ y = [233166, 230451, 227065, 223277, 219092, 215110, 212036, 209634, 207140, 204320, 201337, 198274, 195628, 194382, 194637, 195136, 195147, 195566, 196984, 198117, 197858, 197494, 198905, 201570, 203425, 203798, 203341, 201930, 198987, 195379, 192611, 190356, 187029, 182605, 178710, 175944, 173363, 170674, 168768, 167730, 166397, 164396, 162796, 162238, 162092, 161905, 162099, 162737, 163136, 163186, 163660, 164728, 165506, 165524, 165327, 165170, 164358, 162332, 159322, 155627, 151441, 147649, 145536, 145223, 145440, 145177, 144551, 143887, 143189, 142844, 143646, 145598, 147674, 149190, 150546, 152342, 154663, 157410, 160444, 163206, 165097, 166331, 167496, 168310, 167883, 166209, 164173, 161992, 158936, 154857, 150690, 147022, 143351, 139244, 135245, 132129, 130061, 128794, 127874, 126517, 124274, 121970, 120961, 121244, 121395, 120602, 119542, 118889, 118181, 116709, 114529, 112005, 109300, 106837, 105343, 104854, 104465, 103565, 102572, 102006, 101663, 101216, 100869, 100856, 100857, 100397, 99358, 97841]
55598I7841j719j230n0R23R57M79J78j94j056j751j392m07N5j49k30Q6M03O71
55580I3415J161J651J699J493J506J552J228R27J259J840J676O28m97j117j285
55565A07136j171j086j637k946l953l499j888m95m9j75l86o09q64j160j579j931
55549H3708j683p85o3j32n18m79q5K34M88O60K27q26j407p70K15L83R1L65J003
55530H0626J016M16j0l16j115j956j656k89O79M21l71q74j139j493j896k195k227
55513F7621j681n60L44L37r8m3L95M68K59M56Q00K74j064j829j196P1R12J193
55495F6659J245J094O51M5n78j051j031m19J29m7n12k90N86J121R54P43Q52P39
55477G0890Q0o29r63j191j435j153j02Q79Q31l9o69n54j57r6l56m30mO77J094
$$ y = [97841, 96122, 94892, 94842, 95765, 96722, 97201, 97379, 97185, 96129, 94378, 92986, 92579, 92634, 92485, 92255, 92341, 92744, 93415, 94576, 96227, 97926, 99419, 100925, 102477, 103705, 104632, 105891, 107731, 109407, 110035, 109538, 108421, 107136, 105965, 104879, 103242, 100296, 96343, 92844, 90956, 90461, 90412, 90237, 89851, 89242, 88378, 87218, 85639, 83708, 82025, 81240, 81177, 81045, 80527, 80048, 79963, 80197, 80685, 81345, 81572, 80746, 79339, 78569, 78784, 79167, 79258, 79623, 80626, 81642, 82058, 82048, 81732, 80617, 78661, 77005, 76716, 77395, 77816, 77445, 76571, 75432, 73939, 72043, 69848, 67621, 65940, 65380, 65724, 66061, 65963, 65920, 66315, 66783, 67042, 67498, 68298, 68572, 67508, 65679, 64483, 64554, 65466, 66659, 67904, 68998, 69649, 69694, 69116, 68065, 67034, 66615, 66744, 66697, 66185, 65895, 66481, 67602, 68556, 69299, 70151, 70890, 70970, 70341, 69378, 68187, 66752, 65599, 65497, 66376, 67207, 67168, 66499, 65945, 65788, 65692, 65336, 64906, 64902, 65579, 66673]
55458F6673R93N08j43q07j236j188q01m72k64N7L42Q6o26r46m99L6P1OL31O32
55438F2753L45k40n45o02n49MJ099J653P93o16j081n33m3J09N24J109R21k20j307
55419F3574j498q85J43J270J877J413L11l73l76l93p61r58n82N6M59L37m71j682
55401F1461k277j428K36J246J132P14O30O61O08P46J077J120P42M15L60K37j51
55384F7529n52q36j139j301r40k22J76N7p7P9K30J44L3O6J42K05K90K68P0L3M17
55363F4672P68N02j11l60k63m30r23j205j119r88p73j57N45N81n9n71n02j23L37
55344E9821R03J303J161P55O79Q27O41K05O9J06k49p43n23L46Q53N50q3p75j554
55325F4292j763n60J367K191J442N95O91R90O03j27o50j166j650j324p5Q20M66
$$ y = [66673, 67666, 68174, 68031, 67224, 65988, 64800, 63999, 63527, 63263, 63320, 63662, 63748, 63122, 62176, 61677, 61713, 61784, 61790, 62121, 62753, 63098, 62858, 62313, 61711, 61162, 61166, 62265, 63918, 64711, 64095, 63014, 62481, 62438, 62547, 63071, 64180, 65101, 64881, 63574, 62076, 61191, 61334, 62604, 64481, 65894, 66205, 65832, 65456, 65063, 64302, 63344, 62762, 62818, 63277, 63614, 63143, 61461, 59184, 57756, 57992, 59238, 60370, 61084, 61714, 62375, 62983, 63729, 64806, 65926, 66668, 67083, 67443, 67680, 67529, 66977, 66141, 65002, 63701, 62761, 62539, 62715, 62772, 62695, 62774, 63004, 63148, 63181, 63247, 63389, 63594, 63884, 64152, 64222, 64255, 64672, 65440, 65942, 65831, 65471, 65208, 64778, 63855, 62650, 61531, 60543, 59770, 59613, 60158, 60739, 60680, 60109, 59607, 59484, 59821, 60724, 62027, 63188, 63943, 64622, 65449, 66090, 66295, 66364, 66470, 66221, 65478, 64955, 65301, 66154, 66704, 66621, 65846, 64292, 62529, 61969, 63336, 65527, 66969, 67564, 68255, 69245, 69848, 69721, 69071, 67905, 66255, 64931, 64856, 65676, 66142]
55308F6142k63j94L70M29l4l69m69o13o20k65M7p3j70L44J077J175N91J9r3J67
55288F7198O09J031J157R12N06J7n99r49l97Q20J568J324Q16P05N91L9l83l5O10
55269G5540O60J47k59l37l63l97l20j97m8L38R11J131P54K73O2j88o67q54l88
55250G5798K00L32K42K82J20n31j128j111q80j040j314j146p76p01o39n1P84J236
55232F9677J394J626J639J002J94o0n1m86j043q90l28m16j051j037j87K14m79
55215F9718j182q06J29N67N74R08J495J460M92p04j316j270r38n49n8M81P12L06
55197G0019n17r95n46O01J629J875J245J22q97j352j228q12k21O45J545J767R41
55180G3821l35j095r95l88K83P24P26L71P9J03J59m5k28K5N40Q23Q18P92O55P4
$$ y = [66142, 65879, 65685, 66055, 66484, 66450, 66081, 65612, 64999, 64379, 64114, 64161, 64088, 63918, 64262, 65339, 66514, 67105, 67124, 67031, 67198, 67807, 68838, 69995, 70907, 71413, 71430, 70831, 69882, 69485, 70305, 71873, 73197, 74013, 74718, 75309, 75348, 74965, 74930, 75540, 76200, 76347, 76088, 75751, 75388, 74991, 74671, 74474, 74426, 74764, 75675, 76806, 77560, 77833, 77895, 77707, 77040, 76186, 75798, 75998, 76330, 76572, 76854, 76974, 76443, 75315, 74204, 73324, 72284, 70970, 69824, 69048, 68347, 67708, 67657, 68441, 69677, 71071, 72697, 74336, 75338, 75532, 75472, 75421, 74935, 73892, 73002, 72674, 72258, 71207, 70170, 69983, 70197, 69718, 68536, 67730, 67859, 68426, 69000, 69908, 71403, 72863, 73355, 72651, 71335, 70065, 69127, 68578, 68520, 69001, 69713, 70019, 69502, 68507, 67961, 68562, 70191, 72066, 73311, 73433, 72536, 71184, 69956, 69144, 68923, 69568, 71113, 72880, 73821, 73486, 72391, 71396, 71008, 71291, 72015, 72741, 73112, 73191, 73294, 73453, 73408, 73180, 73205, 73745, 74568, 75386, 76178, 76833, 76907]
55160G6907p71j244j117q05o43m47l1L84N29N28O06O73M44q4n63o97n32k95j01
55141G2741N1R6koM11J017J079M22j7O11J668J737O41l19l05j1k91p68n70K56
55121G8441R29J067Q67N36K15J44K70N4p08j294j002l06k26p55q57K1J227J828
55103H0451J585Q12p2o92q68q25r29j099q44j1Q32R64L15m56o28j47L47K22m49
55084G8508j025j066o86j91K43M75M28L25M78P55O88K68O0L03N44M32L21O08J072
55065H2540J312J296J061L61q06j821k112j795j211l62O90J415J381Q61L10j66
55049H2954m37j10O80J004M40j04K05O73K52n50m52L51L71p43j574j102q5L51
55031H2124K74L59O49P28N37K88O0k4L59J165J664J272L93o3J52M18J96k73l67
$$ y = [76907, 76136, 74892, 73775, 72970, 72327, 71880, 71849, 72233, 72762, 73290, 73896, 74569, 75013, 74929, 74366, 73669, 73137, 72842, 72741, 72792, 72888, 72886, 72880, 73291, 74308, 75387, 75809, 75792, 76403, 78071, 79808, 80449, 80130, 79825, 79814, 79523, 78755, 78185, 78441, 79370, 80437, 81304, 81840, 82055, 82199, 82469, 82523, 81815, 80521, 79519, 79213, 78987, 78232, 77375, 77396, 78623, 80451, 82036, 82848, 82776, 82084, 81216, 80391, 79462, 78363, 77519, 77508, 78340, 79304, 79619, 79163, 78535, 78388, 78735, 78957, 78508, 77483, 76417, 75731, 75540, 75783, 76258, 76686, 77011, 77489, 78244, 78932, 79200, 79260, 79563, 80107, 80539, 80860, 81468, 82540, 83852, 85148, 86209, 86570, 85764, 83943, 81831, 80036, 78825, 78463, 79153, 80568, 81949, 82810, 83120, 82954, 82517, 82407, 83087, 84091, 84531, 84427, 84632, 85305, 85557, 85007, 84555, 84906, 85277, 84534, 82960, 81858, 81773, 82124, 82398, 82757, 83406, 84134, 84671, 84959, 85019, 84995, 85354, 86519, 88183, 89455, 89848, 89785, 89937, 90355, 90551, 90278, 89911]
55012H9911R9O03N16k37j145j668j556p94L60J207J039L7q06r75j047j482j538
54995H2524k98J602K403J390l06j223j022k07P49J476J559R03L8l79k46J1j8l58
54977H8598o98o47j00O04R62P81L10j29l99m82k45M70J511K242K014R67J30K82
54959I6171R17R47K64q6N40J541K032J876J309L93n78q86l84n9o93j605j653r77
54941I9069o31p97o21K11Q74O59l2l33R6R31J568J497P18j53m62j56M68J300K259
54922A06465K919K996K910L208L750M104M417M919M928L487R97r52j568j591j867
54907A39122k252k430k768l564m206l853k639j567j351j827k297k174j419n68
54893A06207k61o26j258j690j624r00L38J451J801J482J176J301J736K323L079
$$ y = [89911, 90010, 90613, 91129, 90892, 89747, 88079, 86523, 85729, 86089, 87296, 88335, 88372, 87566, 86591, 85544, 84062, 82524, 82226, 83828, 86231, 87621, 87315, 86092, 85070, 84863, 85612, 87088, 88647, 89550, 89588, 89209, 88963, 88974, 88956, 88598, 87900, 87253, 87153, 87757, 88719, 89500, 89810, 89681, 89282, 88800, 88555, 89025, 90536, 92778, 94792, 95759, 95889, 96171, 97088, 98035, 98299, 98213, 98753, 100294, 102326, 104202, 105511, 105904, 105326, 104440, 104056, 103997, 103304, 101699, 100046, 99069, 98438, 97641, 97020, 97231, 98105, 98764, 98732, 98399, 98495, 99426, 100994, 102491, 103209, 103056, 102594, 102438, 102906, 104206, 106465, 109384, 112380, 115290, 118498, 122248, 126352, 130769, 135688, 140616, 144103, 145100, 144148, 142580, 140989, 139122, 136870, 134440, 131672, 128108, 123902, 120049, 117410, 115843, 114492, 112665, 110368, 108194, 106775, 106207, 105946, 105320, 104062, 102372, 100748, 99848, 100186, 101637, 103438, 104920, 106096, 107397, 109133, 111456, 114535]
54878A14535L803M125M061M079M360M458L924K931J983J293O83o8r80j902k735
54863A44550l509m247m705m547l862l178k819k574k257k088k214k286k007j695
54849A02562j733j831j437o36lK38L36M18L86K15ok90n61n82l32j54j73n6L14
54830I6675N46N36Q11J475J649P59l62o13j27K74L99L51k85j615k487j851n17
54813I5618p6n27n87L3M11L05L76O12K06p36j134p45m43m64m0Q81J293R39Q26
54794I6748J392J757J359Q00M83l5p14o58J72N03j80p34l98l5k25J26J869L696
54776A05926L827K516J365J088J277J597J827J491P37Q19K457M446N135M552L885
54761A42945L581L318L108K971K150J13k095k983k712k651l165l404l098k992
$$ y = [114535, 118338, 122463, 126524, 130603, 134963, 139421, 143345, 146276, 148259, 149552, 150235, 150167, 149187, 147285, 144550, 141041, 136794, 132089, 127542, 123680, 120502, 117683, 115109, 112852, 110764, 108550, 106264, 104257, 102562, 100829, 98998, 97561, 96925, 96922, 97160, 97496, 97914, 98300, 98515, 98509, 98219, 97658, 97076, 96744, 96590, 96417, 96361, 96675, 97221, 97757, 98568, 100043, 101692, 102451, 102089, 101476, 101349, 101623, 102022, 102373, 102088, 100473, 97986, 96135, 95618, 95542, 95015, 94428, 94461, 94872, 95177, 95553, 96165, 96371, 95635, 94501, 93756, 93313, 92849, 92809, 93690, 94983, 95922, 96748, 98140, 99897, 101256, 102056, 102539, 102504, 101790, 101132, 101304, 101807, 101627, 100893, 100495, 100460, 100235, 100361, 102230, 105926, 109753, 112269, 113634, 114722, 115999, 117596, 119423, 120914, 121651, 122470, 124927, 129373, 134508, 139060, 142945, 146526, 149844, 152952, 155923, 158073, 158186, 156091, 153108, 150396, 147745, 144580, 141176, 138078, 135086]
54747A35086l345l360k537j457q03n79n74q64j395j713j477q50k03L33Q52J387
54731A18501J651J146j26j164q25O77J968K354K543L109L488L256L192L929M577
54716A48276L955K437J222L59r86k734l903m224m345m472m145l375k810k604k244
54701A20407j642j321j332j085m21K8q2l50m65p24j318j821j783j282o74j66J93
54684A06162M33O46P57M71j86n81l19M0k21p53o11K50Q41N06m10j272j757j700
54666A02296j087k84K61N28O56M01l24p83k02R44J468J207J099J477J535P90j06
54649A09876m76n49o72n43R0O42M13l90r86j010o90l11oJ38J95L73O54O80K79
54630A07707j59j92N0L7m09q14n95K58J040J009K18n29n93j55L13P69J356J725
$$ y = [135086, 131741, 128381, 125844, 124387, 123584, 123005, 122431, 121567, 120172, 118459, 116982, 116132, 115929, 116262, 117114, 118501, 120152, 121298, 121172, 120008, 119183, 119860, 121828, 124182, 126725, 129834, 133322, 136578, 139770, 143699, 148276, 152231, 154668, 155890, 156249, 155263, 152529, 148626, 144402, 140057, 135585, 131440, 128065, 125255, 122651, 120407, 118765, 117444, 116112, 115027, 114606, 114634, 114552, 114202, 113737, 113013, 111695, 109874, 108091, 106809, 106135, 105969, 106162, 106595, 107241, 107998, 108469, 108283, 107702, 107383, 107423, 107202, 106449, 105838, 106088, 106929, 107435, 107025, 105753, 103996, 102296, 101209, 100925, 101186, 101714, 102370, 102771, 102447, 101664, 101462, 102406, 103874, 105081, 106180, 107657, 109192, 109982, 109876, 109400, 108851, 108179, 107636, 107726, 108368, 108781, 108391, 107405, 106395, 105705, 105394, 105388, 105526, 105721, 106094, 106748, 107428, 107707, 107548, 107356, 107406, 107443, 107034, 106220, 105625, 105883, 106923, 107932, 108150, 107621, 107028, 106873, 107186, 107955, 109311, 111036]
54612A11036J275Q1r46r61J3J157J543Q50k91q25m15K03K89J13L24P41N94j43
54594A14638n81k15L31J76p11j598j852j427o78L5O00R87J012N56P3L06J246J891
54576A14789J532O59J21q6m16o49j83P68J307J160R39J003R00K73m56o57k61L37
54558A21080Q00R96R35P08M19J36j7O0K07J06j48j06K87N19M69P50J609K179J661
54539A32650N58j05k01k19j80R8K43n1r6P65J706J368K1p93o39n41r73j171p93
54520A31647o28j001r98n2R44J005M72J89J52j30o06q12o23k47Q9J56j02k10L32
54501A29577J099J118L77n8K10K51n33j227p37N48J408J430J112Q55P09P14P98
54484A37651O68L54M15J080J672J477Q07M93P43J123J305J237Q73L13J2L12R04
$$ y = [111036, 112311, 112392, 111446, 110485, 110498, 111655, 113198, 114048, 113757, 112932, 112517, 112720, 113009, 113122, 113446, 114187, 114781, 114638, 114057, 113842, 114173, 114349, 113638, 112040, 110188, 108761, 108083, 108118, 108718, 109705, 110717, 111273, 111346, 111652, 112898, 114789, 116321, 116980, 117101, 117015, 116599, 115950, 115767, 116535, 117842, 119002, 119941, 120944, 121844, 122117, 121661, 121004, 120743, 121080, 121880, 122876, 123811, 124519, 124938, 125074, 125057, 125117, 125324, 125430, 125282, 125176, 125463, 125982, 126451, 127201, 128810, 130989, 132650, 133208, 133103, 132902, 132683, 132503, 132601, 132844, 132793, 132697, 133462, 135168, 136536, 136557, 135764, 135125, 134584, 133611, 132440, 131647, 131019, 130018, 129020, 128968, 129912, 130917, 131389, 131578, 131730, 131600, 130994, 130182, 129559, 129312, 129401, 129557, 129455, 129245, 129577, 130676, 131794, 132171, 132113, 132323, 132574, 132041, 130814, 130077, 130625, 132033, 133463, 134575, 135430, 136139, 136853, 137651, 138319, 138673, 139088, 140168, 141840, 143317, 144124, 144617, 145360, 146483, 147788, 149025, 149898, 150211, 150223, 150535, 151439]
54467A51439J168Q24P3o81r86n71K62Q26Q47O91O31M14j63q13j182j265j083n12
54449A49919K62O74N19K17L2l17r13j273j181j201j696j986j321j46M01k8p38
54432A41224j025p96l37k4j76p56j259j216p01j19K85M72M49L15K97N18R17J380
54414A39448J719J620J079P28J107J704J549O88J15J63J08l74n89j01M71N64N34
54397A50533P32P41L10K4K30K64k78n80kN42q8j372j960j707j451j256m83O08
54379A44807R08J75n76n64K6P86J567K025J821J353J362J697J478N71j43k83n95
54362A56415j652k765k856j805m21N10P46N35K98K32J11k47m52l2O75P86Q0o99
54344A49459q81o00k52J06N53R19J011R04P59N87L43M7k69n63o92n83m45o06j098
$$ y = [151439, 152607, 153431, 153504, 152823, 151837, 151266, 151528, 152354, 153201, 153892, 154523, 154937, 154774, 153961, 152779, 151514, 150431, 149919, 150181, 150855, 151374, 151591, 151623, 151306, 150393, 149120, 147939, 146738, 145042, 143056, 141735, 141589, 141990, 141962, 141224, 140199, 139403, 139066, 139042, 138866, 138110, 136851, 135635, 134934, 134815, 135100, 135572, 136021, 136336, 136633, 137151, 138068, 139448, 141167, 142787, 143866, 144594, 145701, 147405, 148954, 149642, 149757, 149920, 150028, 149654, 149065, 148964, 149435, 149999, 150533, 151265, 152006, 152316, 152340, 152570, 152834, 152556, 151976, 151974, 152516, 152428, 151056, 149096, 147389, 145938, 144682, 144199, 144807, 145715, 145890, 145314, 144750, 144776, 145562, 147129, 149154, 150975, 152328, 153690, 155387, 156865, 157436, 157293, 157010, 156415, 154763, 151998, 149142, 147337, 146916, 147426, 148172, 148707, 149005, 149237, 149348, 149101, 148649, 148617, 149292, 150078, 150158, 149459, 148578, 147978, 147726, 147832, 148385, 149304, 150315, 151219, 151978, 152565, 152908, 152955, 152686, 152123, 151431, 150848, 150403, 149797, 148699]
54325A48699j618j857j702j222p46o87j058j305r46j72M54O84O28M45L45O33J239
54308A41814J529J023P9o26r39j092j061p53n00o77j043j150j116j264j304p31
54292A32189J06K97k77q57j045j186j357r88P5J049J206Q03M99M53M13K85J66
54275A31831J17J87M32O80O08K41k8M3K35K60Q9j58k88j0P84J675K084J973J723
54256A42478J395P65L5k00R8J68m79j346j693j468j189j190j401j521j226m35
54240A32791M23P47N20L21M90P02N87K61j0k46m81m89j41K39K42j30o12j032j276
54221A32906j137n60J49O30Q08P71M98K1l83m05q4K63M23M22L50K11o4m36o84
54202A33699n82k24O0K00N24J122J422Q60k10q83r13q06q18n88j0K86j80r13j017
$$ y = [148699, 147081, 145224, 143522, 142300, 141554, 140867, 139809, 138504, 137558, 137386, 137840, 138524, 139152, 139597, 139942, 140575, 141814, 143343, 144366, 144445, 143819, 142880, 141788, 140727, 139974, 139474, 138797, 137754, 136604, 135488, 134224, 132920, 132189, 132295, 132592, 132315, 131458, 130413, 129227, 127870, 126882, 126957, 128006, 129212, 130015, 130514, 130967, 131380, 131665, 131831, 131948, 132135, 132567, 133247, 133855, 134096, 134068, 134111, 134346, 134606, 134695, 134537, 134249, 134239, 135023, 136698, 138782, 140755, 142478, 143873, 144638, 144673, 144473, 144571, 144739, 144260, 142914, 141221, 139753, 138564, 137374, 135973, 134452, 133226, 132791, 133214, 133961, 134481, 134802, 135292, 135994, 136581, 136842, 136832, 136586, 136105, 135616, 135475, 135714, 135956, 135826, 135214, 134182, 132906, 131769, 131209, 131358, 131988, 132796, 133567, 134065, 134086, 133703, 133298, 133214, 133477, 133900, 134322, 134672, 134883, 134819, 134383, 133699, 133117, 132893, 132953, 133153, 133677, 134799, 136221, 137081, 136871, 135988, 135075, 134269, 133451, 132863, 132853, 133139, 132959, 132046, 131029]
54183A31029l21M99P16J23r31j762j740q87J8J72l93q86o11L17J095J003J14p68
54165A26787r66n56QN55J092J309Q26m3m45r5L78M06K19K22K58j8l95l72O3M50
54145A29683M97K75o7l69l20K02P81Q58N74O82J478K279K255J431N20j7l20n64
54127A39858n51p7N54P37K37n75j134j109m88N14J463J874J569P85r2p62j026
54110A41777q60n66n76q90j018o51j23R6kj46l15n93p03k47N85J022O02k42o95
54091A36455m61j5N1j84k9Q27J695J642P95J74K53M22J85j1L22P07M41k54o59
54072A42356p12q22q95n46l4k0m30n30q4M32P76J125J336R98L71K85Q95J452J545
54053A47498J615J912J982J701J835K919M359N306N823O477P351Q171Q938R855
$$ y = [131029, 130708, 131207, 131923, 132046, 131115, 129353, 127613, 126726, 126744, 126916, 126523, 125637, 125026, 125343, 126438, 127441, 127555, 126787, 125821, 125265, 125273, 125828, 126920, 128229, 129055, 129012, 128567, 128472, 128850, 129256, 129475, 129697, 129955, 129937, 129542, 129170, 129233, 129683, 130180, 130455, 130388, 130019, 129699, 129901, 130682, 131540, 132114, 132796, 134274, 136553, 138808, 140239, 140759, 140742, 140422, 139858, 139307, 139230, 139784, 140521, 140758, 140183, 139049, 137940, 137452, 137966, 139429, 141303, 142872, 143657, 143565, 142803, 141777, 140917, 140351, 139775, 138885, 137867, 137216, 137093, 137189, 137187, 137041, 136726, 136133, 135430, 135183, 135768, 136790, 137392, 137150, 136455, 135994, 135979, 136030, 135846, 135817, 136644, 138339, 139981, 140776, 140950, 141203, 141625, 141810, 141799, 142121, 142828, 143269, 143015, 142356, 141644, 140822, 139927, 139381, 139347, 139327, 138897, 138367, 138283, 138715, 139491, 140616, 141952, 142950, 143321, 143606, 144501, 145953, 147498, 149113, 151025, 153007, 154708, 156543, 159462, 163821, 169127, 174950, 181427, 188778, 196949, 205887, 215742]
54039B15742J0902J1973J2996J3505J2546R679N632J524k175n411p857r152r553
54026B60351r657r635r303q697q000p126n952m793m076l647l042k400k423l277
54012A78323m120l990k940j954j868k494k769j838K3J600J860Q26o44j588j517
53997A56910n91M47Q20M07k30n91p57j041j455j781j909j783j311n48J50M80N77
53980A47794P37R65R38N12p9n07p65j135j658j803j002M19J361J308R74J102J190
53963A50351L99p34p17O98K036K137J513J106Q31J79n07m54L39J137J443J295
53947A61052Q77M26K62M43O63R01J621K880L793L585K720K210K311K616L063L859
53931A93282M673M851M410L994L880L760L494L373L493L627L727L983M296M287
$$ y = [215742, 226644, 238617, 251613, 265118, 277664, 287343, 292975, 294499, 292324, 286913, 279056, 269904, 260351, 250694, 241059, 231756, 223059, 215059, 207933, 201981, 197188, 193112, 189465, 186423, 184023, 181600, 178323, 174203, 170213, 167273, 165319, 163451, 160957, 158188, 156350, 156373, 157973, 159833, 160659, 160015, 158427, 156910, 156319, 156766, 157586, 157993, 157763, 157172, 156415, 155374, 153919, 152138, 150229, 148446, 147135, 146587, 146737, 147217, 147794, 148531, 149496, 150434, 150946, 150867, 150360, 149595, 148460, 146802, 144999, 143997, 144416, 145777, 147085, 148059, 149161, 150351, 150750, 150016, 149299, 149997, 152033, 154170, 155683, 156789, 157620, 157799, 157292, 156838, 157177, 158314, 159757, 161052, 161929, 162355, 162617, 163060, 163723, 164624, 166245, 169125, 172918, 176503, 179223, 181433, 183744, 186360, 189423, 193282, 197955, 202806, 207216, 211210, 215090, 218850, 222344, 225717, 229210, 232837, 236564, 240547, 244843, 249130]
53917B49130L939L563L070J929P5j759k889l418l853m413m941n187m903m063l117
53902B23163k728k993l235k874k194j906k096k009j001O12J830K106J924K117
53888B10716K887L856M940O514Q525R986R796P771M582J042k189m590o079p090
53874B50667p936q284p728o611n733n380n196m971m893m952m705l803k446j188
53860A76841m60l12l97l04n0o3m96q77q56p66j018j294j039m77l54p77j090q51
53842A65360k38N21J300J680J182J29n30m67k99m47n17k13l7m58j027j024n28
53825A64387j05J35M85Q67Q06K15m39o93m78M9P08J271J573J667J685J600J381
53808A75114J182J114J013P45N87Q37J229J188P09M06O28R84J040R65J121J377
$$ y = [249130, 253069, 256632, 259702, 261631, 261706, 259947, 257058, 253640, 249787, 245374, 240433, 235246, 230343, 226280, 223163, 220435, 217442, 214207, 211333, 209139, 207233, 205137, 203128, 202127, 202739, 204569, 206675, 208599, 210716, 213603, 217459, 222399, 228913, 237438, 247424, 257220, 264991, 269573, 270615, 268426, 263836, 257757, 250667, 242731, 234447, 226719, 220108, 214375, 208995, 203799, 198828, 193935, 188983, 184278, 180475, 178029, 176841, 176381, 176069, 175672, 175368, 175318, 175255, 174759, 173882, 173026, 172260, 171242, 169948, 168909, 168432, 168078, 167301, 166211, 165360, 165122, 165643, 166943, 168623, 169805, 169934, 169404, 168937, 168638, 168191, 167674, 167461, 167424, 166966, 165939, 164915, 164387, 164282, 164417, 164902, 165769, 166575, 166790, 166351, 165658, 165180, 165229, 165937, 167208, 168781, 170448, 172133, 173733, 175114, 176296, 177410, 178423, 179168, 179755, 180592, 181821, 183009, 183718, 184124, 184752, 185736, 186776, 187741, 188862, 190239]
53792A90239J272P04M9l38l50L3P07J216J001O6r45j444j397j021m34J33K27k61
53774A89457p23n50m2k2o19j112r80n13j51J16M00M63J18k67j84K94N67K23n90
53755A85885j429j867j669r43j56J91o6o83j182j100l43O40J168J007N02P3j11
53738A79917M6O47J453J868J608J059P54P55Q03P60O38N33O98J320K034K125J499
53721A98517R36J023J357J304R53P66P94R19J375K245K918K885K708L214M044
53706B25958M085L228K509K401K235J604J216J704K517K735K348K024K099K453
53692B59116K951L359L131J932K94p91q68k95L04N47M01J18%j3l20j000j523j430
53674B65913j049j014j287j228o01Q1L66M61P12R02N49k95j021j279j313j388
$$ y = [190239, 191511, 192215, 192264, 191926, 191576, 191609, 192316, 193532, 194533, 194599, 193654, 192210, 190813, 189792, 189358, 189491, 189718, 189457, 188734, 188184, 188142, 188120, 187501, 186389, 185409, 184896, 184745, 184861, 185261, 185724, 185842, 185575, 185391, 185685, 186252, 186475, 185885, 184456, 182589, 180920, 179977, 179821, 180012, 179946, 179263, 178081, 176981, 176638, 177278, 178446, 179453, 179955, 180028, 179917, 179963, 180610, 182063, 183931, 185539, 186598, 187352, 188107, 188910, 189670, 190308, 190841, 191539, 192859, 194893, 197018, 198517, 199453, 200476, 201833, 203137, 204090, 204856, 205650, 206569, 207944, 210189, 213107, 215992, 218700, 221914, 225958, 230043, 233271, 235780, 238181, 240416, 242020, 243236, 244940, 247457, 250192, 252540, 254564, 256663, 259116, 262067, 265426, 268557, 270489, 270783, 269992, 269124, 268829, 269133, 269680, 270081, 270199, 270199, 270186, 269866, 268866, 267343, 265913, 264864, 263850, 262563, 261335, 260734, 260815, 261181, 261642, 262354, 263256, 263805, 263510, 262489, 261210, 259897, 258509]
53658B58509j318q47k21P1m1k10l01n17q87j094r67p41n54j86M90J117J341J306
53640B54950J279J061L57n29r57p85m08L5Q34K005K966L230L031K981L313L697
53624B77060L663L029K073J430J630K580L532L759L236K620K556L081L707M004
53610C17960L966L813L678L605L691L905L907L411K630K032J729J555J589J999
53596C59470K369K042J149N65N79N44K34L91J338K049J594O60N15J121J561J702
53580C77883K126K656K473J621J035Q79K31j321k964l961m543n028n145m764m395
53565C56783m247l715k494j406j302j713j562p27q3j42m22k15N65J372J609J237
53549C43538Q81J181J974K495K432K334K738L409L766L666L474L624M447N999
$$ y = [258509, 257191, 256344, 256123, 256194, 256153, 255943, 255642, 255125, 254238, 253144, 252177, 251436, 250882, 250696, 251186, 252303, 253644, 254950, 256229, 257290, 257647, 257118, 256161, 255376, 254968, 255003, 255837, 257842, 260808, 264038, 267069, 270050, 273363, 277060, 280723, 283752, 285825, 287255, 288885, 291465, 294997, 298756, 301992, 304612, 307168, 310249, 313956, 317960, 321926, 325739, 329417, 333022, 336713, 340618, 344525, 347936, 350566, 352598, 354327, 355882, 357471, 359470, 361839, 363881, 365030, 365595, 366174, 366718, 366952, 367343, 368681, 370730, 372324, 372984, 373499, 374620, 376181, 377883, 380009, 382665, 385138, 386759, 387794, 388673, 388904, 387583, 384619, 380658, 376115, 371087, 365942, 361178, 356783, 352536, 348821, 346327, 344921, 343619, 341906, 340344, 339617, 339534, 339392, 338970, 338755, 339320, 340692, 342301, 343538, 344419, 345600, 347574, 350069, 352501, 354835, 357573, 360982, 364748, 368414, 371888, 375512, 379959, 385958]
53535C85958P747Q776Q726Q263Q342R253J0658J2144J3395J4085J4147J3978J4093
53522E29565J4631J5458J6559J7995J9594K0963K1795K2112K2206K2479K3096
53511G46453K3821K4276K4464K4779K5470K6335K6987K7290K7425K7708K8240
53500A033248K8627K8265K7154K6151K5920K5951K5227K3699K2298K1527K0956
53489A309023K0250J9789J9783J9626J8743J7639J7376J8281J9574K0111J9241
53478A519436J7147J4648J2532J0897R273P259M748J655j912n280p676r245j0934
53465A562548j3172j5356j6862j7898j8977k0212k1448k2572k3333k3488k3422
53454A345808k3963k5169k6031k5832k5116k4712k4568k4171k3509k2818k1873
$$ y = [385958, 393705, 402481, 411207, 419470, 427812, 437065, 447723, 459867, 473262, 487347, 501494, 515472, 529565, 544196, 559654, 576213, 594208, 613802, 634765, 656560, 678672, 700878, 723357, 746453, 770274, 794550, 819014, 843793, 869263, 895598, 922585, 949875, 977300, 1005008, 1033248, 1061875, 1090140, 1117294, 1143445, 1169365, 1195316, 1220543, 1244242, 1266540, 1288067, 1309023, 1329273, 1349062, 1368845, 1388471, 1407214, 1424853, 1442229, 1460510, 1480084, 1500195, 1519436, 1536583, 1551231, 1563763, 1574660, 1583933, 1591192, 1595940, 1597595, 1595683, 1590403, 1582727, 1573482, 1562548, 1549376, 1534020, 1517158, 1499260, 1480283, 1460071, 1438623, 1416051, 1392718, 1369230, 1345808, 1321845, 1296676, 1270645, 1244813, 1219697, 1194985, 1170417, 1146246, 1122737, 1099919, 1078046]
53443A078046k0370j8631j7210j6004j4474j2489j0370q298o286m475k949j455
53431I45035J74J603K568L569N387Q067J0950J3451J5358J6573J7251J8028J9507
53418A077521K1577K3636K5399K7015K8592L0075L1530L3088L4688L6224L7860
53407A407205L9840M2171M4674M7197M9547N1547N3404N5602N8154O0397O1881
53396A971619O2875O3673O4035O3916O3911O4253O3966O2036N8983N6323N4707
53385B650297N3591N2423N1127M9440M6933M3765M0631L7740L4619L1019K7192
53374C118777K3067J7869J0940K435o894j6167k4616l1967l8676m5306n1565n6578
53362B901319o0047o2505o4346o5370o5488o5254o5257o5487o5604o5393o4758
$$ y = [1078046, 1057676, 1039045, 1021835, 1005831, 991357, 978868, 968498, 960200, 953914, 949439, 946490, 945035, 945209, 946812, 949380, 952949, 958336, 966403, 977353, 990804, 1006162, 1022735, 1039986, 1058014, 1077521, 1099098, 1122734, 1148133, 1175148, 1203740, 1233815, 1265345, 1298433, 1333121, 1369345, 1407205, 1447045, 1489216, 1533890, 1581087, 1630634, 1682181, 1735585, 1791187, 1849341, 1909738, 1971619, 2034494, 2098167, 2162202, 2226118, 2290029, 2354282, 2418248, 2480284, 2539267, 2595590, 2650297, 2703888, 2756311, 2807438, 2856878, 2903811, 2947576, 2988207, 3025947, 3060566, 3091585, 3118777, 3141844, 3159713, 3170653, 3173088, 3166194, 3150027, 3125411, 3093444, 3054768, 3009462, 2957897, 2901319, 2841272, 2778767, 2714421, 2649051, 2583563, 2518309, 2453052, 2387565, 2321961, 2256568, 2191810]
53351B191810o3672o2463o1732o1712o1903o1557o0315n8253n5616n2725m9894
53340A541968m7256m4654m1805l8538l5052l1861k9300k6995k4277k1297j9093
53329A181840j8175j7634j6388j4720j3606j3009j1963j0247q720p801o798n200
53317A037579l568k545j747l91J548L458M950O006O687P278Q460J0644J3236J5151
53303A106746J6105J6972J8755K1503K4349K6424K7557K8139K8586K9066K9655
53292A373857L0383L0983L0888K9877K8548K7817K7953K8317K7999K6482K3922
53281A687026K1004J8406J6070J3263R670O043L286J195j251m553q383j2415j6643
53268A732718k0805k4359k7238k9947l2652l4822l6064l6730l7305l7709l7648
$$ y = [2191810, 2128138, 2065675, 2003943, 1942231, 1880328, 1818771, 1758456, 1700203, 1644587, 1591862, 1541968, 1494712, 1450058, 1408253, 1369715, 1334663, 1302802, 1273502, 1246507, 1222230, 1200933, 1181840, 1163665, 1146031, 1129643, 1114923, 1101317, 1088308, 1076345, 1066098, 1057378, 1049577, 1042779, 1037579, 1034011, 1031466, 1029719, 1029328, 1030876, 1034334, 1039284, 1045290, 1051977, 1059255, 1067715, 1078359, 1091595, 1106746, 1122851, 1139823, 1158578, 1180081, 1204430, 1230854, 1258411, 1286550, 1315136, 1344202, 1373857, 1404240, 1435223, 1466111, 1495988, 1524536, 1552353, 1580306, 1608623, 1636622, 1663104, 1687026, 1708030, 1726436, 1742506, 1755769, 1765439, 1771482, 1774768, 1775963, 1774712, 1770159, 1761776, 1749361, 1732718, 1711913, 1687554, 1660316, 1630369, 1597717, 1562895, 1526831, 1490101, 1452796, 1415087, 1377439]
53257A377439l7156l6444l5519l4385l3333l2724l2607l2838l3298l3880l4415
53246A000840l4792l4935l4621l3715l2499l1379l0109k8035k5261k2956k1890
53235F70648k1229j9501j6525j3631j1991j1369j0767r818r078r143r838j0423
53223E17335j0380r881r465r476r875j0403j0790j0837j0474r756q784p709o779
53210C92726o238o061o026o072o306o584o539o131n806n790n754n511n471n910
53196C08527o244n736m576l543k958k660k677l048l242k697j840j632k087k250
53182B63337j650q65m12j17J46K2n50r88r55q81j099j251j021p93r64j241j240
53165B49478j221j576k003j944j482j179j219j301j220j105j102j240j465j551
$$ y = [1377439, 1340283, 1303839, 1268320, 1233935, 1200602, 1167878, 1135271, 1102433, 1069135, 1035255, 1000840, 966048, 931113, 896492, 862777, 830278, 798899, 768790, 740755, 715494, 692538, 670648, 649419, 629918, 613393, 599762, 587771, 576402, 565635, 555817, 546739, 537596, 527758, 517335, 506955, 497074, 487609, 478133, 468258, 457855, 447065, 436228, 425754, 415998, 407214, 399505, 392726, 386488, 380427, 374401, 368329, 362023, 355439, 348900, 342769, 336963, 331173, 325419, 319908, 314437, 308527, 302283, 296547, 291971, 288428, 285470, 282810, 280133, 277085, 273843, 271146, 269306, 267674, 265587, 263337, 261687, 260822, 260410, 260293, 260439, 260461, 259911, 258923, 257968, 257087, 255988, 254737, 253716, 252923, 251959, 250718, 249478, 248257, 246681, 244678, 242734, 241252, 240073, 238854, 237553, 236333, 235228, 234126, 232886, 231421, 229870]
53151B29870j206m97O1J21o4j05%O0J25K98M30L66L08M99P19M74l61j322j736
53132B28040j288l19L69L00j42k34Q5K75J70K13O01R03Q17N61J67q26k340l262
53114B24090k712j345m96m69n26k38J35M22P35Q32K02r93j827j731j145p14m54
53097B13766m7M34O19M13J01k4J71P07J381J679J109k02j466j938j572r00l19
53080B13912K00P04R52P81M84N09Q42J070R93P68N30K14k33q05j568k434k911
53063B14008k534j564p55l54K8M94N04j91r45j049o47l44k61p5K80M67J50p10
53045B06502j826k576k343j244k34j28p20j215j302j259j265j093n50J72P40R94
53029A92653R82P68L17l86j031j022j12J071J630J443J127R27L81o60j377r33
$$ y = [229870, 228664, 228167, 228228, 228349, 228285, 228180, 228180, 228240, 228365, 228663, 229093, 229459, 229767, 230266, 230985, 231459, 231098, 229776, 228040, 226752, 226433, 226802, 227102, 226960, 226726, 226811, 227086, 227256, 227469, 228070, 228973, 229790, 230351, 230518, 229692, 227352, 224090, 221378, 220033, 219537, 219068, 218542, 218304, 218439, 218861, 219596, 220428, 220630, 219637, 217810, 216079, 214934, 214220, 213766, 213719, 214153, 214772, 215185, 215286, 215262, 215433, 216140, 217521, 219200, 220309, 220107, 218641, 216703, 215131, 214231, 213912, 214112, 214816, 215768, 216549, 217033, 217542, 218384, 219454, 220447, 221215, 221745, 221959, 221726, 220921, 219353, 216919, 214008, 211474, 209910, 209155, 208801, 208829, 209323, 209827, 209636, 208691, 207642, 206995, 206651, 206390, 206315, 206595, 207062, 207212, 206502, 204676, 202100, 199757, 198513, 198279, 198151, 197431, 196216, 194914, 193655, 192390, 191297, 190747, 190919, 191659, 192653, 193635, 194403, 194720, 194334, 193303, 192281, 192169, 193240, 194870, 196313, 197440, 198367, 198748, 198088, 196711, 195778]
53013A95778L96J510J700J073J55n18o46m08k86l67j87M83J155J360J347J498
52997B04043J483P53m05j093r87n92l20K3O63J340J559J118K52n17o52p1O65Q99
52979B08161O09M13P90J573K202K272J871J426J258J250J076P12L94J34k99p95
52963B23047q19k26L30K09m38j026j347j504j463j209j029j095j030n08n8m98
52947B11336j649k334j820o57J02K2n38r73q70k46M14N00j30j028j696k034k209
52930A96190k249j956j237l51K68M44M33N51P47O92K08n44j181j213l12J130J977
52913A93597J500L69j67Mj38r70j480q24L79J002Q99O72M45r4q05j104p90k24
52895A92271L06Q05J258J519J566J506J393J261J148Q95K75n01p98l81K44N87
$$ y = [195778, 196174, 197684, 199384, 200457, 200612, 200094, 199448, 199040, 198754, 198387, 198200, 198683, 199838, 201198, 202545, 204043, 205526, 206279, 205874, 204781, 203794, 203202, 202882, 202905, 203568, 204908, 206467, 207585, 207837, 207320, 206668, 206597, 207262, 208161, 208770, 209183, 209973, 211546, 213748, 216020, 217891, 219317, 220575, 221825, 222901, 223613, 224007, 224141, 223842, 223047, 222228, 222002, 222332, 222541, 222103, 221077, 219730, 218226, 216763, 215554, 214525, 213430, 212400, 211892, 211834, 211336, 209687, 207353, 205533, 204876, 204978, 205000, 204462, 203489, 202619, 202373, 202787, 203287, 203157, 202129, 200433, 198399, 196190, 193941, 191985, 190748, 190397, 190665, 191109, 191542, 192093, 192840, 193532, 193740, 193196, 192015, 190802, 190490, 191620, 193597, 195097, 195466, 195299, 195303, 195165, 194195, 192715, 191891, 192270, 193272, 194171, 194843, 195288, 195194, 194389, 193285, 192495, 192271, 192577, 193382, 194640, 196159, 197725, 199231, 200624, 201885, 203033, 203928, 204203, 203702, 202904, 202523, 202767, 203354]
52879B03354O63M43m03j602j960q15P74J291P51L89P13J033Q87P63J164J744J799
52862B10988J115J43l81mQ88J227L21j360k764l328l129k472j858j886k516k821
52846A92163k167j180p46o57k43K00j45r90j160m46M3l32p96m66M22J062J135
52829A85697Q59N59N55R23J190P83q1n82l89R9O39J406K247K522K042J366R40
52812B00775O41M33O92J410J817J224j35j505k307k305j654j033j139j790k092
52797A93032j689j179j072j110r49p82q00o91k47J44R4j73l02m01n98n42N8P92
52779A83585J063R01P53O87M54J12k2M3o6m87r24j071q97m46K75J052J409J058
52761A87479L52%K42N51L10l49p85p89q02j133j484j461j019j84J083K394K924
$$ y = [203354, 204017, 204460, 204057, 202455, 200495, 199680, 200454, 201745, 202496, 202885, 203598, 204631, 205518, 206281, 207445, 209189, 210988, 212103, 212246, 211865, 211861, 212749, 213976, 214297, 212937, 210173, 206845, 203716, 201244, 199386, 197500, 194984, 192163, 189996, 188816, 188070, 187413, 187170, 187370, 187225, 186235, 185075, 184629, 184672, 184340, 183544, 183078, 183500, 184562, 185697, 186556, 187115, 187670, 188593, 189783, 190566, 190485, 189903, 189514, 189613, 190252, 191658, 193905, 196427, 198469, 199835, 200775, 201416, 201849, 202541, 203951, 205768, 206992, 206857, 205352, 203045, 200740, 199086, 198053, 196914, 195124, 193032, 191343, 190164, 189092, 187982, 187033, 186251, 185451, 184760, 184513, 184657, 184751, 184578, 184276, 183875, 183277, 182735, 182793, 183585, 184648, 185549, 186302, 186989, 187443, 187555, 187533, 187576, 187510, 187023, 186099, 185028, 184131, 183685, 183960, 185012, 186421, 187479, 187831, 187831, 188073, 188624, 188934, 188585, 187800, 187011, 186209, 185076, 183592, 182131, 181112, 180928, 182011, 184405, 187329]
52744A87329K359J351N79k2o39r69q94r46j310j213k48N75L27j75L20J279J278
52727A88981M52J63M93K69m60k85R29J484O15l44m10m69j180j413k84R43P56j58
52709A90082k02N23P38L01J38L26L1p74j108n36K48M78J5q92j729j743p13N62
52691A85745J153J095R56Q69P47Q97J434J664J057L15L50O18k02k051l327k907
52675A88413j276M65J685K166J910J304Q50N79K66Q5L54P84Q05N85Q03J437J664
52658B02879J140N17L43K64k91j149j621j355o37QL05L59L98M41L10j2l66p07
52640B00826j015r05M4J392K033J598Q92N57J89n72j037m77O68J546K081K475
52624B10295K271J162nl25l71j183k239k120q67Q1K47N31J115R01l26r83k8J262
$$ y = [187329, 189688, 191039, 191618, 191596, 190957, 189988, 189094, 188148, 186838, 185625, 185377, 185952, 186279, 186104, 186424, 187703, 188981, 189433, 189596, 190089, 190358, 189898, 189613, 190542, 192026, 192641, 192297, 191887, 191418, 190238, 188825, 188541, 189484, 190240, 190082, 189880, 190403, 191141, 191442, 191580, 191906, 191937, 191163, 190055, 189519, 189767, 190245, 190260, 189368, 187639, 185896, 185183, 185745, 186898, 187993, 188949, 189818, 190565, 191462, 192896, 194560, 195617, 195932, 196282, 196900, 196698, 194647, 191320, 188413, 187137, 187602, 189287, 191453, 193363, 194667, 195517, 196096, 196362, 196447, 196801, 197585, 198390, 198975, 199778, 201215, 202879, 204019, 204536, 204879, 205143, 204852, 203703, 202082, 200727, 200090, 200098, 200403, 200762, 201160, 201601, 201911, 201899, 201533, 200826, 199811, 198906, 198950, 200342, 202375, 203973, 204865, 205422, 205611, 205039, 204002, 203525, 204193, 205739, 207820, 210295, 212566, 213728, 213723, 213398, 213027, 211844, 209605, 207485, 206618, 206699, 206946, 207477, 208592, 209493, 209167, 208184, 208156, 209418]
52606B09418J108k46j050m90N38Q74L80j66%P94J308Q97J62J66Q05R01J02m66
52588B15035N6Q77P80j43q15p35k83R2K26m0p11j367j544j266p89j21P19J279
52570B11250J144O28L99N36N32J95m2J44M38L32k09p08o79l1Q89J506J371N37
52552B18232l21m03L60J072Q15j25n73p1M03j02j059j259o54k80m89m76J49M36
52534B15655m67j841k134q44J010K036J578Mj635k298j809q75j74L07P62R53N73
52517B10801o3l33j20J95M59Q83J480J907J969J876J830J761J589J424J223O14
52501B27495n81j831k351k003j383r21l92M38J104R24Kq27j005o61k1Q72J617
52484B20476J435K76o79l48Q05J398R66K70m4k50p28j197j132n31J77O67R45J176
$$ y = [209418, 210526, 210280, 209230, 208740, 209278, 210152, 210532, 210366, 210366, 211160, 212468, 213365, 213527, 213693, 214498, 215399, 215501, 215035, 215091, 215968, 216748, 216605, 215790, 215055, 214772, 214864, 215090, 215050, 214339, 212972, 211428, 210162, 209373, 209252, 209971, 211250, 212394, 213022, 213421, 213957, 214489, 214684, 214642, 214786, 215224, 215556, 215347, 214639, 213960, 213929, 214818, 216324, 217695, 218232, 217911, 217508, 217868, 218940, 219755, 219630, 219057, 218986, 219389, 219287, 218228, 216969, 216315, 216035, 215546, 215070, 215219, 215655, 215188, 213347, 211213, 210369, 211379, 213415, 214993, 214997, 213362, 211064, 209255, 208380, 208206, 208513, 209275, 210228, 210801, 210738, 210405, 210285, 210480, 210939, 211822, 213302, 215209, 217178, 219054, 220884, 222645, 224234, 225658, 226881, 227495, 226914, 225083, 222732, 220729, 219346, 218425, 218033, 218471, 219575, 220499, 220501, 219674, 218669, 218008, 217987, 218859, 220476, 221911, 222187, 221508, 221160, 221965, 223363, 224329, 224599, 224555, 224305, 223577, 222380, 221248, 220717, 220894, 221561, 222506, 223682]
52466B23682J476J758J804J596J353J156P32L9l67n8M32K21o13j126q80m09j68
52449B30628Q6N75Q71N40k02q42j199j300j073n69j62j30k85l12k37k67m38o34
52431B25050p42o56l18R3L00K78K34K26K59O75J808L213L908L685L470M036M978
52414B50497N462N432N424N622N667N178L960J967m71k604l877m443m702m638
52400B68474m009l006k205j952k099k258k080j506r50r64j460j603q23L81J087
52385B45027J066P89O49P12J078J845K745L239L109K585J957J397J086J161J574
52370B70019K239L147M017M135L084J483M18J91K02P0J42O99J314J509J572K220
52354B96461L546M797N202M758M169M108M635N232N441N401N665O457P355P825
$$ y = [223682, 225158, 226916, 228720, 230316, 231669, 232825, 233557, 233596, 233229, 233171, 233603, 233824, 233211, 232085, 231205, 230796, 230628, 230714, 231289, 232160, 232700, 232498, 231656, 230457, 229157, 228084, 227515, 227353, 227223, 226938, 226626, 226389, 226122, 225684, 225050, 224308, 223652, 223334, 223427, 223727, 224005, 224239, 224465, 224724, 225399, 227207, 230420, 234328, 238013, 241483, 245519, 250497, 255959, 261391, 266815, 272437, 278104, 283282, 287242, 289209, 288738, 286134, 282257, 277814, 273112, 268474, 264465, 261459, 259254, 257302, 255203, 252945, 250865, 249359, 248409, 247445, 245985, 244382, 243559, 243940, 245027, 246093, 246882, 247531, 248243, 249321, 251166, 253911, 257150, 260259, 262844, 264801, 266198, 267284, 268445, 270019, 272258, 275405, 279422, 283557, 286641, 288124, 288542, 288733, 288935, 289005, 289147, 289846, 291160, 292669, 294241, 296461, 300007, 304804, 310006, 314764, 318933, 323041, 327676, 332908, 338349, 343750, 349415, 355872, 363227, 371052]
52340C71052P964Q392R477J0850J1788J1983J1794J1808J2334J3260J4201J4676
52328E09579J4341J3360J2426J2166J2458J2569J1990J0954R975R166Q191O828
52316F44003N256L836K750J944J288O91P6o59j573k543l274l503l242k797k562
52301F39691k691k914k715j820n54M45Q84J003J125J289J491J960K910M175N345
52286F49624O197O774P222P708Q366R074R463R383R209R368R752R892R504Q544
52272G70080P040N312M076L655L249J713q36k968l660l414l288l494l504l138
52258G70823k865l036l423l650l777m144m716m907m272l191k538k619k883k795
52244G22007k540k496k446j892q75P8P23J194J528J663J790K176K616K677K458
$$ y = [371052, 379016, 387408, 396885, 407735, 419523, 431506, 443300, 455108, 467442, 480702, 494903, 509579, 523920, 537280, 549706, 561872, 574330, 586899, 598889, 609843, 619818, 628984, 637175, 644003, 649259, 653095, 655845, 657789, 659077, 659768, 659844, 659185, 657612, 655069, 651795, 648292, 645050, 642253, 639691, 637000, 634086, 631371, 629551, 628997, 629442, 630326, 631329, 632454, 633743, 635234, 637194, 640104, 644279, 649624, 655821, 662595, 669817, 677525, 685891, 694965, 704428, 713811, 723020, 732388, 742140, 752032, 761536, 770080, 777120, 782432, 786508, 790163, 793412, 795125, 794289, 791321, 787661, 784247, 780959, 777465, 773961, 770823, 767958, 764922, 761499, 757849, 754072, 749928, 745212, 740305, 736033, 732842, 730304, 727685, 724802, 722007, 719467, 716971, 714525, 712633, 711758, 711836, 712559, 713753, 715281, 716944, 718734, 720910, 723526, 726203, 728661]
52229G28661K530L099L794M311M683M908M941N077N652O277O111N174M593N176
52215G94987O301O706N966M786M070M052M160L650K480J481J315J556J356P82
52201H43648O80J299J949K130K087J993J498M98m66r60j221j478j475j095q16
52186H48271j028j503j913k343k909l423l759l964l796k866j551r27j349j981
52172H14959k093j899j685j129k40J52k96n61K93J556J956J532J319J640J952
52157H17456K050K202K330K029J410J010J043J413K226L522M799N563O030O500
52143H59583O542N709M678M603N558O636P329P767P900P556P221P653Q746R756
52129I57237J0505J1292J1790J1372J0521J0566J1636J2202J1102Q949O992N521
$$ y = [728661, 731191, 734290, 738084, 742395, 747078, 751986, 756927, 762004, 767656, 773933, 780044, 785218, 789811, 794987, 801288, 807994, 813960, 818746, 822816, 826868, 831028, 834678, 837158, 838639, 839954, 841510, 842866, 843648, 844328, 845627, 847576, 849706, 851793, 853786, 855284, 855782, 855316, 854356, 853135, 851657, 850182, 849087, 848271, 847243, 845740, 843827, 841484, 838575, 835152, 831393, 827429, 823633, 820767, 819216, 818289, 816940, 814959, 812866, 810967, 809282, 808153, 807913, 808065, 807769, 807208, 807501, 809057, 811013, 812545, 813864, 815504, 817456, 819506, 821708, 824038, 826067, 827477, 828487, 829530, 830943, 833169, 836691, 841490, 847053, 853083, 859583, 866125, 871834, 876512, 881115, 886673, 893309, 900638, 908405, 916305, 923861, 931082, 938735, 947481, 957237, 967742, 979034, 990824, 1002196, 1012717, 1023283, 1034919, 1047121, 1058223, 1067172, 1074164, 1079685]
52117A079685M154K880K087J841J708J134j88k018l579m305m475m649m682m101
52103A065492l158k606k390j710m98K95K23J43R29K293L413M047M412M602M673
52088A080160M878N363N973O617P327P933Q225Q574R511J0636J0860J0060R400
52075A185517R498R401Q151O344N155M582L752K338O43j340l794o221p767q366
52061A207893q706r184r625j0090j1047j2581j4105j5056j5354j5122j4448j3642
52049A058933j3149j3015j2739j1900j0640r382q396p733p305o800n733l865j567
52036I46709L54J207Q48k97j530k330k658k929l615m806o153p228p948q491q855
52021H92278q809q389q090q266q669q926r220r945j0902j1427j1320j1011j0779
$$ y = [1079685, 1083839, 1086719, 1088806, 1090647, 1092355, 1093489, 1093301, 1091283, 1087704, 1083399, 1078924, 1074275, 1069593, 1065492, 1062334, 1059728, 1057338, 1055628, 1055130, 1055425, 1055648, 1055791, 1056720, 1059013, 1062426, 1066473, 1070885, 1075487, 1080160, 1085038, 1090401, 1096374, 1102991, 1110318, 1118251, 1126476, 1135050, 1144561, 1155197, 1166057, 1176117, 1185517, 1195015, 1204416, 1212567, 1218911, 1224066, 1228648, 1232400, 1234738, 1235381, 1234041, 1230247, 1224026, 1216259, 1207893, 1199187, 1190003, 1180378, 1170288, 1159241, 1146660, 1132555, 1117499, 1102145, 1087023, 1072575, 1058933, 1045784, 1032769, 1020030, 1008130, 997490, 988108, 979712, 971979, 964674, 957874, 952141, 948276, 946709, 947063, 948270, 949118, 948821, 947291, 944961, 942303, 939374, 935759, 930953, 924800, 917572, 909624, 901133, 892278, 883469, 875080, 866990, 858724, 850055, 841129, 831909, 821964, 811062, 799635, 788315, 777304, 766525]
52008G66525j0436r926r598r655r884j0171j0697j1299j1326j0512r458q750q131
51995F36682p179o272o117o601o914o717o426o357o275n997n804o019o536p082
51981E46386p585q044q313q239p845p228o469n834n734o147o304n364l445j520
51967D58315k69N31J258J712J564J205J338J896K056J452N93j52j143k573l737
51952D64046l975l712l737l843l192j804o28j34K59J149K424L776N101O089O183
51937D68002N373M415L839L307K310R16o14k319m167n682o502o890p171p130o590
51922D41097o093o295o888o911o067n061m539m366m045l400k528j509m64L90R70
51907C84291J559K566M086N851P575R203J0726J1914J2444J2307J1848J1321J0674
$$ y = [766525, 756089, 746163, 736565, 726910, 717026, 706855, 696158, 684859, 673533, 663021, 653563, 644813, 636682, 629503, 623231, 617114, 610513, 603599, 596882, 590456, 584099, 577824, 571827, 566023, 560004, 553468, 546386, 538801, 530757, 522444, 514205, 506360, 499132, 492663, 486829, 481095, 474948, 468644, 463280, 459835, 458315, 458046, 458577, 459835, 461547, 463111, 464316, 465654, 467550, 469606, 471058, 471651, 471499, 470356, 467783, 464046, 460071, 456359, 452622, 448779, 445587, 443783, 443155, 443021, 443280, 444429, 446853, 450629, 455730, 461819, 468002, 473375, 477790, 481629, 484936, 487246, 488162, 487548, 485229, 481062, 475380, 468878, 461988, 454817, 447687, 441097, 435004, 428709, 421821, 414910, 408843, 403782, 399243, 394877, 390832, 387432, 384904, 383395, 382931, 383321, 384291, 385850, 388416, 392502, 398353, 405928, 415131, 425857, 437771, 450215, 462522, 474370, 485691, 496365]
51894D96365R904R280Q819P829N497J869k157n767q687j0792j1818j1678j0617
51881D78047q956o911m782k854j155L83J531K002K021K096K170J632K68j427l069
51866D60996m779o529p741q014p690p242o643n720m685l800k940j932j010m68
51852C91803k49k45o20j422k195k497k477k521k609k489k263k297k622k778k284
51837C62235j115J76P72M12k23k63K00M10L03N62J151R75l79j669j679r98r87
51820C59883j715k122j733r56O4J540L009L483K799J839J242Q05L07l6k53q03
51804C67353j708k341k438k595l243l853l772l269l059l197l088k441j689j390
51790C29270j592j777j300q4J123J346M60o34j043q71q66j335j777j601r09l13
$$ y = [496365, 506269, 515549, 524368, 532197, 537694, 539563, 537406, 531639, 522952, 512160, 500342, 488664, 478047, 469091, 462180, 457398, 454544, 453389, 453772, 455303, 457305, 459326, 461422, 463592, 465224, 465492, 464065, 460996, 456217, 449688, 441947, 433933, 426243, 419001, 412358, 406638, 401953, 398153, 395213, 393281, 392271, 391803, 391554, 391309, 390689, 389267, 387072, 384575, 382098, 379577, 376968, 374479, 372216, 369919, 367297, 364519, 362235, 361120, 361296, 362068, 362480, 362257, 361994, 362194, 362604, 362907, 363469, 364620, 365595, 365216, 363547, 361868, 360870, 359883, 358168, 356046, 354313, 353357, 353421, 354961, 357970, 361453, 364252, 366091, 367333, 368138, 368445, 368409, 368156, 367353, 365645, 363304, 360866, 358271, 355028, 351175, 347403, 344134, 341075, 337878, 334790, 332349, 330660, 329270, 327678, 325901, 324601, 324517, 325640, 326986, 327446, 326812, 325769, 324898, 324032, 322697, 320920, 319319, 318410, 318097]
51774C18097l6M88J902L895N332N601N340N451N748N242L646J849P44K00n09j678
51758C61312k956l883m238m026l384k579j911j566j537j671j731j558j113l90
51744C28769O00J658K434K893L569M939O580P372O667N014L525K811K686K702
51730C82219K618K336J682M84j122k664l794m630n376n701m978l308j791j374
51716C54601j703j623o58N33J148J195J291J893K896L794M093L705L033K499K101
51701C78798J563R15N85Q65J542K236K823L311L377K424K89k220l873m263m227
51686C84145m729n551n577m369k814j918j532p60O80K104K786K771K595K553K450
51671C72834J969J207P03Q54J369J591J301Q83O64N82O59J235K333L194K951J603
$$ y = [318097, 318061, 318549, 320451, 324346, 329678, 335279, 340619, 346070, 351818, 357060, 360706, 362555, 363299, 363499, 362990, 361312, 358356, 354473, 350235, 346209, 342825, 340246, 338335, 336769, 335232, 333561, 331830, 330272, 329159, 328769, 329369, 331027, 333461, 336354, 339923, 344862, 351442, 358814, 365481, 370495, 374020, 376831, 379517, 382219, 384837, 387173, 388855, 389339, 388217, 385553, 381759, 377129, 371753, 366052, 361074, 357766, 355975, 354601, 352898, 351275, 350617, 351150, 352298, 353493, 354784, 356677, 359573, 363367, 367460, 371165, 374198, 376697, 378798, 380361, 381276, 381861, 382726, 384268, 386504, 389327, 392638, 396015, 398439, 398728, 396508, 392635, 388372, 384145, 379416, 373865, 368288, 363919, 361105, 359187, 357655, 356895, 357575, 359679, 362465, 365236, 367831, 370384, 372834, 374803, 376010, 376713, 377567, 378936, 380527, 381828, 382711, 383375, 383957, 384616, 385851, 388184, 391378, 394329, 395932]
51655C95932p3j352k010k222k422l022l920m428m071l229k697k822l336l774l765
51640C52789l150k175j328p53k47Ko05j951k765k055m11Q75J455J724J591O51
51624C43647o44j283j146j074j425j703j756k146k963l389k916k057j298l67Q42
51609C20322J585J395J157K092M096N925O715O532N703M501L365K702K282J424
51595C69796r3j721k796l126k822j918m11J446L093M005M226M429N271O635P822
51580C93836Q590R598J1405J3379J4154J3222J1619J0820J1195J1796J1530J0228
51568E31372Q534P147O481O848Q495J1244J4534J7982K1646K5355K8111K8665
51556G16414K6623K2639J7649J2260O792J462l605q247j2187j5351j8143k1015
$$ y = [395932, 395859, 394507, 392497, 390275, 387853, 384831, 380911, 376483, 372412, 369183, 366486, 363664, 360328, 356554, 352789, 349639, 347464, 346136, 345383, 345136, 345138, 344533, 342582, 339817, 337762, 337351, 338226, 339681, 341405, 342996, 343647, 343003, 341720, 340574, 339500, 338075, 336372, 334616, 332470, 329507, 326118, 323202, 321145, 319847, 319480, 320322, 321907, 323302, 324459, 326551, 330647, 336572, 343287, 349819, 355522, 360023, 363388, 366090, 368372, 369796, 369703, 367982, 365186, 362060, 359238, 357320, 356909, 358355, 361448, 365453, 369679, 374108, 379379, 386014, 393836, 402426, 412024, 423429, 436808, 450962, 464184, 475803, 486623, 497818, 509614, 521144, 531372, 539906, 547053, 553534, 560382, 568877, 580121, 594655, 612637, 634283, 659638, 687749, 716414, 743037, 765676, 783325, 795585, 802377, 803839, 800234, 791987, 779800, 764449, 746306, 725291]
51544G25291k3775k5781k6676k6630k5886k4541k2785k0867j8818j6605j4525
51533D78402j2988j1837j0498q863p491o778o406n915n270m610l845k938k262
51520C88701k281k935l666l992l968m012m357m664m318l240k109j568j462j260
51506C44869r28q18r01p70l77j09p8N1M26Q52J290J954K670K809K118J138M77
51489C54673J35k05o78j211j667j777j385q58r35j867l168m185m591m271l353
51474C24657k389j996k154k390k591k927l064k373j082k50k47k92J65N63M56N21
51458C04607J513K954L803L868L640L282K709K375K985M530O324P902R264J0422
51444C70178J1238J1546J1045R426P058N081M184L798L052K001J096N1j744l971
$$ y = [725291, 701516, 675735, 649059, 622429, 596543, 572002, 549217, 528350, 509532, 492927, 478402, 465414, 453577, 443079, 434216, 426725, 419947, 413541, 407626, 402356, 397746, 393901, 390963, 388701, 386420, 383485, 379819, 375827, 371859, 367847, 363490, 358826, 354508, 351268, 349159, 347591, 346129, 344869, 343941, 343123, 342222, 341452, 341075, 340966, 340888, 340939, 341365, 342217, 343507, 345461, 348131, 350940, 353058, 354196, 354673, 354808, 354603, 353925, 352714, 351047, 349270, 347885, 347027, 346092, 344225, 341057, 336872, 332281, 328010, 324657, 322268, 320272, 318118, 315728, 313137, 310210, 307146, 304773, 303691, 303441, 303194, 302902, 303067, 303630, 304086, 304607, 306120, 309074, 312877, 316745, 320385, 323667, 326376, 328751, 331736, 336266, 342590, 350492, 359756, 370178, 381416, 392962, 404007, 413433, 420491, 425572, 429756, 433554, 436606, 438607, 439703, 439754, 438010, 434039]
51430D34039n656o547p234p955q232p813p067o334n597m922m477m014l131k058
51416C53002j490j516j539j369j439j687j254J76J570J809J120N74O57J054J438
51401C51106J708J667J241R58J515K805L908M253M315M898O108P367Q305R298
51387D09452J1028J3674J6692J9387K1615K3803K6300K8872L0909L2106L2652
51376F66490L2766L2230L0577K7645K3693J8987J3590P592J288n116j1584j7800
51364H20358k2982k6631k9194l1393l3036l3251l1831k9663k7565k5439k2861
51353E06512j9954j7256j5130j3641j2539j1170r000o553n148n227n655n255m368
51340C75616m028m228m102l458l013l029k861k027r56l28l25p54j351j721j543
$$ y = [434039, 428383, 421836, 414602, 406647, 398415, 390602, 383535, 377201, 371604, 366682, 362205, 358191, 355060, 353002, 351512, 349996, 348457, 347088, 345649, 343962, 342708, 342884, 344454, 346263, 347383, 347957, 348614, 349668, 351106, 352814, 354481, 355722, 356680, 358195, 361000, 364908, 369161, 373476, 378374, 384482, 391849, 400154, 409452, 420480, 434154, 450846, 470233, 491848, 515651, 541951, 570823, 601732, 633838, 666490, 699256, 731486, 762063, 789708, 813401, 832388, 845978, 853570, 854858, 849742, 838158, 820358, 797376, 770745, 741551, 710158, 677122, 643871, 612040, 582377, 554812, 529373, 506512, 486558, 469302, 454172, 440531, 427992, 416822, 407822, 401269, 396121, 390894, 385239, 379984, 375616, 371588, 367360, 363258, 359800, 356787, 353758, 350897, 348870, 347914, 347586, 347261, 346507, 345156, 343435, 341892]
51325C41892j094j090j792k668l176l352l446l384k918k052j081m02l60r33j496
51310C12648j322m83J88K47K66R23J865K066J266M47P29K047L215L189K089R48
51294C30328N93R45J382J592J823K410L259L826L615K621J363L68k93q98j654
51279C51280k534l465m249m377l406j721m46k22m61j57Q87J962K323J764O02m93
51263C37287q80n72l08o64j367j789j789j624j334p58OO87J204J577J685J549
51247C32910J504J659J522P94P1J7K10k71j321j913j632j104p61k49O45J421J640
51230C35142J569J631J816J990K144K098J498N27p1k1N9l43q68j003r99j364j948
51213C41857k111j653r79n04l39l57l11j2M04N90N30N62P39O94L80L48Q67J330
$$ y = [341892, 340798, 339708, 337916, 335248, 332072, 328720, 325274, 321890, 318972, 316920, 315839, 315437, 315077, 314144, 312648, 311326, 310843, 311031, 311278, 311544, 312467, 314332, 316398, 317664, 318111, 318840, 320887, 324102, 327291, 329380, 330328, 330921, 331866, 333248, 334840, 336663, 339073, 342332, 346158, 349773, 352394, 353757, 354125, 353832, 352934, 351280, 348746, 345281, 341032, 336655, 333249, 331528, 331082, 330860, 330399, 330242, 331129, 333091, 335414, 337178, 337780, 337287, 336407, 335835, 335527, 334863, 333496, 331707, 329918, 328294, 326960, 326202, 326208, 326895, 328099, 329676, 331361, 332910, 334414, 336073, 337595, 338389, 338460, 338477, 338687, 338416, 337095, 335182, 333550, 332446, 331685, 331436, 332081, 333502, 335142, 336711, 338342, 340158, 342148, 344292, 346390, 347888, 348415, 348344, 348323, 348382, 348039, 347171, 346168, 345169, 343805, 341857, 339746, 338093, 337114, 336610, 336271, 335914, 335603, 335591, 335995, 336585, 337115, 337677, 338416, 339110, 339490, 339838, 340705, 342035]
51195C42035J139P21R87K022L024L348L016K291J373N92L52O82J105J059L88n10
51179C63624r23m75K86L47n57j549j786j546j605k037k307k231k007j454k06J269
51163C46843J788R36k78o94k81K50N39O85O65L60pl9K44M27K39k49r41j711k113
51144C46663j700p55j80l88o85k63O77J320J500J803K443K761K229J307Q18R10
51128C58460J096J070Q58L41o19j550j522k58J285J868J242K03m48o06n74m74
51112C60372k02K52O32P70Q65J232J786K087J917J522J141O89K29K42R94J809
51096C76337J764R86N21Q59J317J196Q08Q04J004O94j76q42q39o16p95j322j687
51079C80013j691j547j348r68n22m69r00j114l96R10J705J585J371J916K993L862
$$ y = [342035, 343174, 343895, 344882, 346904, 349928, 353276, 356292, 358583, 359956, 360548, 360900, 361582, 362687, 363746, 364134, 363624, 362701, 362226, 362512, 362859, 362302, 360753, 358967, 357421, 355816, 353779, 351472, 349241, 347234, 345780, 345574, 346843, 348631, 349567, 349289, 348595, 348314, 348564, 349103, 349788, 350453, 350813, 350806, 350767, 351011, 351438, 351677, 351428, 350487, 348776, 346663, 344963, 344208, 344028, 343640, 342955, 342692, 343369, 344689, 346189, 347992, 350435, 353196, 355425, 356732, 357550, 358460, 359556, 360626, 361484, 361825, 361206, 359656, 358134, 357876, 359161, 361029, 362271, 362474, 362026, 361420, 360846, 360372, 360170, 360422, 361054, 361824, 362689, 363921, 365707, 367794, 369711, 371233, 372374, 373063, 373292, 373534, 374528, 376337, 378101, 379087, 379608, 380467, 381784, 382980, 383788, 384592, 385596, 386290, 386114, 385272, 384433, 383817, 383022, 381700, 380013, 378322, 376775, 375427, 374459, 373937, 373468, 372568, 371454, 371058, 371968, 373673, 375258, 376629, 378545, 381538, 385400]
51063C85400M397M955N436N367M834M566M927N542O111O928Q210R514J0267J0524
51049D76978J0690J0779J0393R221P324N029K835J138j23j405k948m506n874p225
51035E12306q656r744j0051r834r743r896r748q809p169n260l522k277j588j109
51021D14900l56P57J855K599L069L564M232N007N741O278O549O684O973P628Q612
51006D84092R754J0911J1983J2874J3583J4316J5359J6668J7760J8124J7725J6851
50994F60000J5555J3622J1183Q977P554O428M583J851p40k231k870l647m891n890
50980G09484n852m803l320j645M64L100N877Q440J1010J4010J7339K0429K3004
50967G97537K5286K7493K9627L1854L4387L6707L7656L6871L5533L4943L4812
$$ y = [385400, 389797, 394752, 400188, 405555, 410389, 414955, 419882, 425424, 431535, 438463, 446673, 456187, 466454, 476978, 487668, 498447, 508840, 518061, 525385, 530414, 533249, 534387, 534264, 532859, 529911, 525405, 519531, 512306, 503650, 493906, 483855, 474021, 464278, 454382, 444634, 435825, 428656, 423396, 419874, 417597, 416009, 414900, 414544, 415301, 417156, 419755, 422824, 426388, 430620, 435627, 441368, 447646, 454195, 460879, 467852, 475480, 484092, 493846, 504757, 516740, 529614, 543197, 557513, 572872, 589540, 607300, 625424, 643149, 660000, 675555, 689177, 700360, 709337, 716891, 723319, 727902, 729753, 729013, 726782, 723912, 720265, 715374, 709484, 703632, 698829, 695509, 693864, 694328, 697428, 703305, 711745, 722755, 736765, 754104, 774533, 797537, 822823, 850316, 879943, 911797, 946184, 982891, 1020547, 1057418, 1092951, 1127894, 1162706]
50956A162706L3815L1525K8846K6643K4893K3283K1789K0372J8876J7359J5955
50945A426062J4158J1033O476J635k278m991o787p761q021q051q365r150j0546
50932A393414j2846j5972j9191k1867k4151k6571k9264l1909l4080l5308l5273
50921A106982l4316l3318l2674l1852l0359k8510k6750k4805k2328j9785j7915
50910H04370j6583j5085j3319j1797j0644r512q454p956p924p592o650n675n069
50897F78110m406l307k289k035k292k208j543q97p76j006j146j040o95m9R41K081
50881F57443L045L710M163M455M505M334M254M619N472O567P673Q697R619J0521
50867G39077J1672J3357J5492J7615J9339K0703K2108K4043K6814L0323L4100
$$ y = [1162706, 1196521, 1228046, 1256892, 1283535, 1308428, 1331711, 1353500, 1373872, 1392748, 1410107, 1426062, 1440220, 1451253, 1457729, 1459364, 1457086, 1452095, 1445308, 1437547, 1429526, 1421475, 1413110, 1403960, 1393414, 1380568, 1364596, 1345405, 1323538, 1299387, 1272816, 1243552, 1211643, 1177563, 1142255, 1106982, 1072666, 1039348, 1006674, 974822, 944463, 915953, 889203, 864398, 842070, 822285, 804370, 787787, 772702, 759383, 747586, 736942, 727430, 718976, 711020, 703096, 695504, 688854, 683179, 678110, 673704, 670397, 668108, 666073, 663781, 661573, 660030, 659133, 658357, 657351, 656205, 655165, 654470, 654421, 655362, 657443, 660488, 664198, 668361, 672816, 677321, 681655, 685909, 690528, 696000, 702567, 710240, 718937, 728556, 739077, 750749, 764106, 779598, 797213, 816552, 837255, 859363, 883406, 910220, 940543, 974643]
50856I74643L7792M1613M6051N1137N6446O1686O6786P1356P4758P7028P9071
50845A638367Q1422Q3296Q3486Q1869P9253P5931P1191O4402N5984M7033L8339
50834B400573L0083K2204J4796Q257L232L22l55P05K741N244Q012J0691J2607
50821B519112J3200J2525J0895Q024L068m222j2847k1591l0254l9235m8172n5853
50809B354650o1539o5540o8280o9489o8707o6049o2086n7292n1869m5785l8893
50798A699121l1371k3982j7296j0775l493M139J0419J4433J7035J9252K0797K0989
50786A719268K0139J8897J6957J3601R171M850J182k160n403q441j1469j4930
50774A761662j8801k2731k6760l1160l5689l9782m3315m6352m8329m8501m7173
$$ y = [974643, 1012435, 1054048, 1100099, 1151236, 1207682, 1269368, 1336154, 1407510, 1482268, 1559296, 1638367, 1719789, 1803085, 1886571, 1968440, 2047693, 2123624, 2194815, 2259217, 2315201, 2362234, 2400573, 2430656, 2452860, 2467656, 2475913, 2479145, 2479467, 2479112, 2479817, 2482558, 2487802, 2495814, 2506505, 2519112, 2532312, 2544837, 2555732, 2563756, 2566824, 2562602, 2549755, 2528164, 2497910, 2458675, 2410503, 2354650, 2293111, 2227571, 2159291, 2089802, 2021095, 1955046, 1892960, 1835668, 1783799, 1738014, 1699121, 1667750, 1643768, 1626472, 1615697, 1612204, 1616343, 1626762, 1641195, 1658230, 1677482, 1698279, 1719268, 1739407, 1758304, 1775261, 1788862, 1798033, 1802883, 1804065, 1801905, 1796502, 1788061, 1776592, 1761662, 1742861, 1720130, 1693370, 1662210, 1626521, 1586739, 1543424, 1497072, 1448743, 1400242, 1353069]
50763A353069m5470m3790m1518l8423l5233l2420k9431k5725k1788j8436j5654
50752A005181j2821r709o668m030j809J61K147M477P354J0761J4601J8721K2813
50739A051179K6591L0126L3693L7283M0615M3603M6407M8958N0917N2199N3035
50728A514606N3344N2546N0270M6896M3088L9017L4303K8569K1848J4596P440
50717A906523Q74m845r446j2573j4134j4491j3931j2204r011m736k69L791P230
50704A822778R793J1284J1885J1704J0143O554J468l727q388j2938j7459k1036
50692A822061k2955k3533k3149k1408j8061j3998j0198o229p86O382J4120K1452
50680A723698K8693L6700M5665N4984O3849P1597P7678Q1714Q3638Q3588Q1613
$$ y = [1353069, 1307599, 1263809, 1222291, 1183868, 1148635, 1116215, 1086784, 1061059, 1039271, 1020835, 1005181, 992360, 982651, 975983, 971953, 970144, 970305, 972452, 976929, 984283, 995044, 1009645, 1028366, 1051179, 1077770, 1107896, 1141589, 1178872, 1219487, 1263090, 1309497, 1358455, 1409372, 1461571, 1514606, 1567950, 1620496, 1670766, 1717662, 1760750, 1799767, 1834070, 1862639, 1884487, 1899083, 1906523, 1907397, 1902552, 1893106, 1880533, 1866399, 1851908, 1837977, 1825773, 1816762, 1812026, 1811757, 1815548, 1822778, 1832571, 1843855, 1855740, 1867444, 1877587, 1884141, 1885609, 1881882, 1873494, 1860556, 1843097, 1822061, 1799106, 1775573, 1752424, 1731016, 1712955, 1698957, 1688759, 1682530, 1681744, 1688126, 1702246, 1723698, 1752391, 1789091, 1834756, 1889740, 1953589, 2025186, 2102864, 2184578, 2268216, 2351804, 2433417]
50669B433417P7673P2024O5519N9093N2930M6453L9407L2507K6585K1419J6002
50658B943029R757K816m658j2619k0516k7399l2903l7333m0595m1859m0819l8435
50646B658466l5675l2159k6856j9793j2279n575m1M534Q372J1529J3832J4987
50634B579342J5084J4866J5044J5255J3955R358M99j2247k7039m1003n1439n7023
50622B474652n8021n5529n0700m4403l7200k9476k1708j4519q420l604j38J949
50610B152883K913L271L070J440k532q552j5266k1686k7947l4481m1057m6988
50598A965068n1913n5785n8264n8776n7282n4646n1845m9074m5790m1578l6679
50587A403436l1794k7544k4053k0831j7166j2936q955o160m496l106j617n79m15
$$ y = [2433417, 2511090, 2583114, 2648633, 2707726, 2760656, 2807109, 2846516, 2879023, 2905608, 2927027, 2943029, 2952786, 2955602, 2950944, 2938325, 2917809, 2890410, 2857507, 2820174, 2779579, 2737720, 2696901, 2658466, 2622791, 2590632, 2563776, 2543983, 2531704, 2526129, 2526088, 2530622, 2538994, 2550523, 2564355, 2579342, 2594426, 2609292, 2624336, 2639591, 2653546, 2662904, 2663403, 2651156, 2624117, 2583114, 2531675, 2474652, 2416631, 2361102, 2310402, 2265999, 2228799, 2199323, 2177615, 2163096, 2154676, 2151072, 2150934, 2152883, 2155796, 2159067, 2162137, 2163577, 2161045, 2152493, 2137227, 2115541, 2087594, 2053113, 2012056, 1965068, 1913155, 1857370, 1799106, 1740330, 1683048, 1628402, 1576557, 1527483, 1481693, 1440115, 1403436, 1371642, 1344098, 1320045, 1299214, 1282048, 1269112, 1260157, 1253997, 1249501, 1246395, 1244778, 1244199, 1243784]
50574A243784n68k18P03J828L232N310P984J0756J3442J6391K0026K4622L0289
50561A377581L6642M2729M7951N2769N7873O2857O6591O8620O9273O8525O5986
50550B017397O2082N8122N4735N1367M7752M4891M3856M4438M5633M6784M7609
50539B564666M7802M7321M6613M6074M5811M6304M8390N1956N5562N8249O0928
50528C119676O4885O9612P3393P5448P6050P4912P1131O4838N7293M8786L7975
50517C833999K4097Q643o339k0730l5828n1690o6413p8146q6723r2834r6511r7235
50505C234290r5015r0414q3566p4015o1837m8257l4755k1961r959Q71J0050J7654
50493B743086K3846K7690K7449K2409J3711K959r259k2957l7504n1598o4132p4567
$$ y = [1243784, 1243216, 1242998, 1243701, 1245529, 1248761, 1254071, 1262055, 1272811, 1286253, 1302644, 1322670, 1347292, 1377581, 1414223, 1456952, 1504903, 1557672, 1615545, 1678402, 1744993, 1813613, 1882886, 1951411, 2017397, 2079479, 2137601, 2192336, 2243703, 2291455, 2336346, 2380202, 2424640, 2470273, 2517057, 2564666, 2612468, 2659789, 2706402, 2752476, 2798287, 2844591, 2892981, 2944937, 3000499, 3058748, 3119676, 3184561, 3254173, 3327566, 3403014, 3479064, 3553976, 3625107, 3689945, 3747238, 3796024, 3833999, 3858096, 3866739, 3860400, 3839670, 3803842, 3752152, 3685739, 3607593, 3520870, 3428036, 3331525, 3234290, 3139275, 3048861, 2965295, 2891280, 2829443, 2781186, 2746431, 2724470, 2714511, 2715382, 2725432, 2743086, 2766932, 2794622, 2822071, 2844480, 2858191, 2861150, 2851891, 2828934, 2791430, 2739832, 2675700, 2601133]
50481B601133q2628q8229r1624r3142r2954r1380q9123q6659q3696p9722p4935
50470A647041p0057o5376o0601n5669n1027m6903m2820l8189l3173k8600k5082
50459A129544k2469k0166j7863j5746j4005j2344j0297p867n548l718k368j387
50447I95766o44K28J574L114M128M435M631N155N789O463P765J0059J2680J4802
50433A075945J6608J8897K1803K4649K6824K8201K8921K9480L0797L3431L6837
50422A372393L9999M2620M5018M7216M8988N0699N3035N5789N7815N8474N8200
50411A930246N7413N5749N2904M9395M5751M1553L6098K9625K3063J6678R762
50400B348237J759p014j6009k5205l4722m3964n1741n7322o0996o3379o4492o3767
$$ y = [2601133, 2518505, 2430276, 2338652, 2245510, 2152556, 2061176, 1972053, 1885394, 1801698, 1721976, 1647041, 1576984, 1511608, 1451007, 1395338, 1344311, 1297408, 1254588, 1216399, 1183226, 1154626, 1129544, 1107075, 1086909, 1069046, 1053300, 1039295, 1026951, 1016654, 1008787, 1003239, 999521, 997153, 995766, 995122, 995350, 996924, 1000038, 1004166, 1008601, 1013232, 1018387, 1024176, 1030639, 1038404, 1048463, 1061143, 1075945, 1092553, 1111450, 1133253, 1157902, 1184726, 1212927, 1241848, 1271328, 1302125, 1335556, 1372393, 1412392, 1455012, 1500030, 1547246, 1596234, 1646933, 1699968, 1755757, 1813572, 1872046, 1930246, 1987659, 2043408, 2096312, 2145707, 2191458, 2233011, 2269109, 2298734, 2321797, 2338475, 2348237, 2349996, 2342982, 2326973, 2301768, 2267046, 2223082, 2171341, 2114019, 2053023, 1989644, 1925152, 1861385]
50388A861385o0847n5998m9873m3121l6259k9510k2724j5765r053l326J185M928
50376A541022Q167J0315J0417Q023L443k498q766j4630k0103k5545l0679l4509
50364A444657l6571l7610l8541l9263l9146l8209l7063l5948l4619l3051l1537
50353A043099l0123k8572k6840k5087k3270k1207j9043j7117j5428j3681j1792
50342H10939r978q442p302o690o461o073n192m156l358k501j128N01J823K981
50328G54963M528O246P329P745Q398R707J0966J1395J0947R672P264L909R40k16
50314H53793M82J811K698L180M078N939Q293R927J0091R325Q679Q354P742O753
50300I41145O178O480O992O807N861M560K916O74j963m370o117p206p882q508
$$ y = [1861385, 1800538, 1744540, 1694667, 1651546, 1615287, 1585777, 1563053, 1547288, 1538235, 1534909, 1536094, 1541022, 1549189, 1559504, 1569921, 1577944, 1581387, 1578889, 1570123, 1555493, 1535390, 1509845, 1479166, 1444657, 1408086, 1370476, 1331935, 1292672, 1253526, 1215317, 1178254, 1142306, 1107687, 1074636, 1043099, 1012976, 984404, 957564, 932477, 909207, 888000, 868957, 851840, 836412, 822731, 810939, 800961, 792519, 785217, 778527, 772066, 765993, 760801, 756645, 753287, 750786, 749658, 750159, 751982, 754963, 759491, 765737, 773066, 780811, 789209, 798916, 809882, 821277, 832224, 841896, 849160, 853069, 854009, 853793, 854275, 856086, 858784, 861964, 866042, 871981, 880274, 890201, 900292, 909617, 918296, 926650, 934392, 941145, 947323, 953803, 960795, 967602, 973463, 978023, 980939, 981613, 979650, 975280, 969163, 961957, 954075, 945567]
50286I45567r386j0306j0530r583p944o569n884n580n302n121n234n498n418m626
50272H48586l282j915q37J55J329K519L394M065M985O294P704R020J0221J0956
50258I03194J0647R322P887P138O951O747O406O227O323O564O948P619Q609R896
50244A010478J1629J3937J6598J9311K2315K6342L1774L8106M4396N0111N5280
50233A340277N9909O3608O5862O6521O5732O3566O0037N5524N0832M6696M3462
50222A982026M1126L9193L6377L1064K2591J1646r15j5002l0462m5912n9444p0197
50210A942091p8247q3213q4199q1389p6529p1213o5555n9049n2065m5776m1066
50199A203790l8148l6862l6742l6960l6802l6067l4815l2923l0309k7319k4485
$$ y = [945567, 936181, 925875, 915345, 905762, 897818, 891249, 885365, 879785, 874483, 869362, 864128, 858630, 853212, 848586, 845304, 843389, 842552, 842707, 844036, 846555, 849949, 854014, 858999, 865293, 872997, 882017, 892238, 903194, 913841, 923163, 931050, 938188, 945139, 951886, 958292, 964519, 970842, 977406, 984354, 991973, 1000582, 1010478, 1022107, 1036044, 1052642, 1071953, 1094268, 1120610, 1152384, 1190490, 1234886, 1284997, 1340277, 1400186, 1463794, 1529656, 1596177, 1661909, 1725475, 1785512, 1841036, 1891868, 1938564, 1982026, 2023152, 2062345, 2098722, 2129786, 2152377, 2164023, 2163108, 2148106, 2117644, 2071732, 2012288, 1942091, 1863844, 1780631, 1696432, 1615043, 1538514, 1467301, 1401746, 1342697, 1290632, 1244856, 1203790, 1165642, 1128780, 1092038, 1055078, 1018276, 982209, 947394, 914471, 884162, 856843, 832358]
50188H32358k2007j9849j8125j6991j6185j5097j3375j1233r149p456o247n468
50176F71176m894m107k728q55Q05J568J593J811K878M461N805O646P196P604P924
50161G06883Q422R315J0335J1060J1559J2223J3066J3697J3879J3570J2592J0924
50149H47525R171P991P114N787M076K892K621K805L333M839P481J0304J2399J3865
50135I42203J5098J6023J6769J8203K0850K3910K6310K8301L1074L5120L9971
50124A213832M5374N1712N9222O7593P6618Q6561R7517J08745J18937J27040J32689
50113B185840J35996J36969J35315J30995J24966J18940J14277J11184J08889
50104C303371J05979J00526R0622P5452N5509L1613M394k4865n3628p9265j00622
$$ y = [832358, 810351, 790502, 772377, 755386, 739201, 724104, 710729, 699496, 690347, 682891, 676644, 671176, 666282, 662175, 659447, 658592, 659397, 660965, 662558, 664369, 667247, 671708, 677513, 684159, 691355, 698959, 706883, 715305, 724620, 734955, 746015, 757574, 769797, 782863, 796560, 810439, 824009, 836601, 847525, 856696, 864687, 871801, 877588, 881664, 884556, 887177, 889982, 893315, 898154, 905635, 915939, 928338, 942203, 957301, 973324, 990093, 1008296, 1029146, 1053056, 1079366, 1107667, 1138741, 1173861, 1213832, 1259206, 1310918, 1370140, 1437733, 1514351, 1600912, 1698429, 1807174, 1926111, 2053151, 2185840, 2321836, 2458805, 2594120, 2725115, 2850081, 2969021, 3083298, 3194482, 3303371, 3409350, 3509876, 3600498, 3675950, 3731459, 3763072, 3767466, 3742601, 3688973, 3609708, 3509086]
50093C509086j17869j31202j40462j45794j47785j46832j43011j36782j29234
50084B270115j21377j13490j05398r7169q9254q2040p5419o8929o2385n6277n1293
50073A347084m7492m4180m0693l6928l3074k9237k5550k2312j9739j7764j6193
50062A013922j4815j3362j1763j0396r626r078q075o764o045o119o045n188m158
50049I02488l673l367k631j891j936k442k347j537j045j441k003j753o82L44N62
50034H76646On54m13K19M08k23r43j024q66j272k063k238j418k62N27Q70R65R49
50016H69314J053J583K607L975N597P353Q934J0278J1958J4567J7882K1366K5262
50003A001729L0468L7184M4534N1697N8699O5836P2892P9199Q4054Q6824Q7148
$$ y = [3509086, 3391217, 3260015, 3119553, 2973759, 2825974, 2679142, 2536131, 2399349, 2270115, 2148738, 2035248, 1929850, 1832681, 1743427, 1661387, 1585968, 1517039, 1454654, 1398377, 1347084, 1299592, 1255412, 1214719, 1177791, 1144717, 1115480, 1089930, 1067618, 1047879, 1030115, 1013922, 999107, 985745, 973982, 963586, 953960, 944882, 936807, 930043, 923998, 917879, 911834, 906646, 902488, 898815, 895448, 892817, 890926, 888990, 886548, 884201, 882664, 881619, 880178, 878175, 876422, 875740, 876084, 876646, 876652, 876098, 875685, 875904, 876312, 876089, 875146, 874122, 873256, 871984, 869921, 867683, 866265, 866003, 866530, 867400, 868365, 869314, 870367, 871950, 874557, 878532, 884129, 891482, 900416, 910694, 922652, 937219, 955101, 976467, 1001729, 1032197, 1069381, 1113915, 1165612, 1224311, 1290147, 1363039, 1442238, 1526292, 1613116, 1700264]
49992A700264Q5274Q1837P7116P0962O3692N6546N0841M6824M3529L9598L3925
49981B350408K5746J4482j83j7914l7428n6782p4191q8538r9200j05765j08141
49970A802494j06700j02131r5387q7781q0496p3655o6374n8245n0195m3352l7638
49959A000540l2294k7269k3097j9690j6355j3022j0398q783p624o553n930o045
49947H23480o507o855p157p651q273q902r650j0604j1726j3187j5250j7498j8737
49934F81483j8155j6265j4299j2944j1962j0853r474q094o991o093m998l527k052
49921E55776j021l38M01J148J470J291J033R03P15O07J243K938N031O535P141
49906E84873P316P668Q461R432R881R241P751O264N226M258K912J379N8j143k594
$$ y = [1700264, 1785538, 1867375, 1944491, 2015453, 2079145, 2135691, 2186532, 2233356, 2276885, 2316483, 2350408, 2376154, 2390636, 2390453, 2372539, 2335111, 2278329, 2204138, 2115600, 2016400, 1910635, 1802494, 1695794, 1593663, 1498276, 1410495, 1329999, 1256344, 1189970, 1131725, 1081530, 1038178, 1000540, 968246, 940977, 917880, 898190, 881835, 868813, 858415, 849632, 842008, 835455, 829525, 823480, 816973, 810118, 802961, 795310, 787037, 778135, 768485, 757881, 746155, 732968, 717718, 700220, 681483, 663328, 647063, 632764, 619820, 607858, 597005, 587531, 579437, 572446, 566353, 561355, 557828, 555776, 554755, 554417, 554818, 555966, 557436, 558727, 559760, 560663, 561378, 561985, 563228, 566166, 571197, 577732, 584873, 592189, 599857, 608318, 617750, 627631, 636872, 644623, 650887, 656113, 660371, 663283, 664662, 664720, 663577, 660983]
49891F60983m227n626o721p935r457j0780j1212j0772j0265j0405j1007j1316
49879E51260j0972j0283r485q267o387m329k868k180j899j795j761j318J19K271
49865D92106M020M649M611M784N439O226O863P424Q095Q868R428R318Q368O959
49851E87158N659M691L904L170K419J419o9j904l669n071n995o320o176o151o593
49836E66472o879n996l968j906n86K82J157J848K054K083K437L080L674M290N327
49821E73369O879Q552R912J0822J1344J1465J0922R438P222N126L946L583L203
49808F75783K172N32j370l220m717n685o304o878p349p509p535p792q119p967
49794F04042p362o986p112p192o781o200n807n308m324l226k716k880l156l108
$$ y = [660983, 656756, 651130, 644409, 636474, 627017, 616237, 605025, 594253, 583988, 573583, 562576, 551260, 540288, 530005, 520520, 512253, 505866, 501537, 498669, 496489, 494590, 492795, 491034, 489716, 489835, 492106, 496126, 500775, 505386, 510170, 515609, 521835, 528698, 536122, 544217, 553085, 562513, 571831, 580199, 587158, 592817, 597508, 601412, 604582, 607001, 608420, 608351, 606447, 602778, 597707, 591712, 585392, 579216, 573065, 566472, 559593, 553597, 549629, 547723, 547137, 547419, 548576, 550424, 552478, 554561, 556998, 560078, 563752, 568042, 573369, 580248, 588800, 598712, 609534, 620878, 632343, 643265, 652703, 659925, 665051, 668997, 672580, 675783, 677955, 678487, 677117, 673897, 669180, 663495, 657191, 650313, 642964, 635455, 627920, 620128, 612009, 604042, 596680, 589694, 582582, 575390, 568609, 562409, 556602, 551294, 546970, 543744, 541028, 538148, 534992, 531884]
49780E31884k708k069j288n04J92R19J859L040M239N092N264M835M377M330M334
49765E63796L726K590J727J458J214N87N7R1J32q60l060n571p439q377q569q187
$$ y = [531884, 529176, 527107, 525819, 525315, 525507, 526426, 528285, 531325, 535564, 540656, 545920, 550755, 555132, 559462, 563796, 567522, 570112, 571839, 573297, 574511, 575098, 575155, 575246, 575378, 574518, 571458, 565887, 558448, 550071, 541502, 533315]
$$ [...]
##END NTUPLES=NMR SPECTRUM
##END=
