##TITLE=AC1583_13IEXT2754_8214317_CFdQjpgJHK
##JCAMPDX= 6.0         $$ Bruker NMR JCAMP-DX V2.0
##DATA TYPE= NMR SPECTRUM
##DATA CLASS= NTUPLES
##ORIGIN= BRUKER
##OWNER= Administrator
$$ 1.72 TOPSPIN		Version 2.1
$$ 2013-10-04 22:52:13.386 -0700  Administrator@X
$$ Compression mode = diff/dup
##.OBSERVE FREQUENCY= 400.02188249412
##.OBSERVE NUCLEUS= ^1H
##.ACQUISITION MODE= SIMULTANEOUS (DQD)
##.ACQUISITION SCHEME= undefined
##.AVERAGES= 8
##.DIGITISER RES= 22
##SPECTROMETER/DATA SYSTEM= spect
##.PULSE SEQUENCE= zg30
##.SOLVENT NAME= COFFEE_meoh
##.SHIFT REFERENCE= INTERNAL, COFFEE_meoh, 1, 14.98509
##AUDIT TRAIL= $$ (NUMBER, WHEN, WHO, WHERE, PROCESS, VERSION, WHAT)
$$ ##TITLE= Audit trail, TOPSPIN		Version 2.1
$$ ##JCAMPDX= 5.01
$$ ##ORIGIN= Bruker BioSpin GmbH
$$ ##OWNER= Administrator
$$ $$ E:\/data/COFFEE/nmr/AC1583_13IEXT2754_8214317_CFdQjpgJHK/10/pdata/1/auditp.txt
$$ ##AUDIT TRAIL=  $$ (NUMBER, WHEN, WHO, WHERE, PROCESS, VERSION, WHAT)
(   1,<2013-10-04 22:52:07.121 -0700>,<Administrator>,<X>,<go>,<TOPSPIN 2.1>,
      <created by zg
	started at 2013-10-04 22:51:01.480 -0700,
	POWCHK enabled, PULCHK disabled,
       configuration hash MD5:
       C8 4E 4E 5D D3 5C D8 9E 9F 52 82 E0 59 8A DE 15
       data hash MD5: 64K
       25 63 66 42 D2 85 0D E7 4F 9F 11 42 FC F8 FA F0>)
(   2,<2013-10-04 22:52:09.871 -0700>,<Administrator>,<X>,<proc1d>,<TOPSPIN 2.1>,
      <Start of raw data processing
       efp LB = 0 FT_mod = 6 PKNL = 1 PHC0 = 0 PHC1 = 0 SI = 32K 
       data hash MD5: 32K
       36 6A 36 CD 2E 55 FE AC 26 9D E1 E8 07 29 E8 C1>)
(   3,<2013-10-04 22:52:10.152 -0700>,<Administrator>,<X>,<proc1d>,<TOPSPIN 2.1>,
      <pk PHC0 = 94.53186 PHC1 = 0 
       data hash MD5: 32K
       8F 00 1C 62 48 2C 3E 98 E2 6D 22 66 46 84 E8 9F>)
(   4,<2013-10-04 22:52:10.261 -0700>,<Administrator>,<X>,<proc1d>,<TOPSPIN 2.1>,
      <abs ABSG = 1 
       data hash MD5: 32K
       FD 63 30 66 C3 53 91 4F 6B 96 70 40 02 49 C6 69>)
(   5,<2013-10-04 22:52:10.324 -0700>,<Administrator>,<X>,<proc1d>,<TOPSPIN 2.1>,
      <abs ABSG = 2 
       data hash MD5: 32K
       67 B8 6B 6A 88 CF FD 37 0F 53 79 0E 56 DA 29 CA>)
(   6,<2013-10-04 22:52:10.386 -0700>,<Administrator>,<X>,<proc1d>,<TOPSPIN 2.1>,
      <abs ABSG = 3 
       data hash MD5: 32K
       7D 61 5B 81 8A D6 8E BF F4 78 82 7E 72 6D 0C 0D>)
(   7,<2013-10-04 22:52:10.433 -0700>,<Administrator>,<X>,<proc1d>,<TOPSPIN 2.1>,
      <abs ABSG = 4 
       data hash MD5: 32K
       8A 7F 30 BD BC CB 9B 37 7E D4 36 DB EC 72 40 ED>)
(   8,<2013-10-04 22:52:10.496 -0700>,<Administrator>,<X>,<proc1d>,<TOPSPIN 2.1>,
      <abs ABSG = 5 
       data hash MD5: 32K
       E7 9D 6B EF F9 A2 A9 90 E3 62 AC 89 16 9E DA AF>)
$$ ##END=
$$ 
$$ $$ hash MD5
$$ $$ 03 AF 35 8D C4 70 D0 D3 97 0F 29 34 BE 5F 3B B0
##$RELAX= 
##$RELAX= 
##$RELAX= 
##$RELAX= 
##$RELAX= 
##$RELAX= 
##$RELAX= 
$$ Bruker specific parameters
$$ --------------------------
##$DU= <E:\>
##$EXPNO= 10
##$NAME= <AC1583_13IEXT2754_8214317_CFdQjpgJHK>
$$ [...]
150 150 150 150 150 150 150 150
##$TP07= 0
##$TPNAME0= <>
##$TPNAME1= <>
##$TPNAME2= <>
##$TPNAME3= <>
##$TPNAME4= <>
##$TPNAME5= <>
##$TPNAME6= <>
##$TPNAME7= <>
##$TPOAL= (0..7)
0.5 0.5 0.5 0.5 0.5 0.5 0.5 0.5
##$TPOFFS= (0..7)
0 0 0 0 0 0 0 0
##$TUNHIN= 0
##$TUNHOUT= 0
##$TUNXOUT= 0
##$USERA1= <user>
##$USERA2= <user>
##$USERA3= <user>
##$USERA4= <user>
##$USERA5= <user>
##$V9= 5
##$VALIST= <valist>
##$VCLIST= <CCCCCCCCCCCCCCC>
##$VD= 0
##$VDLIST= <DDDDDDDDDDDDDDD>
##$VPLIST= <PPPPPPPPPPPPPPP>
##$VTLIST= <TTTTTTTTTTTTTTT>
##$WBST= 2048
##$WBSW= 25
##$XGAIN= (0..3)
0 0 0 0
##$XL= 0
##$YL= 0
##$YMAX_a= 646503
##$YMIN_a= -549346
##$ZGOPTNS= <>
##$ZL1= 120
##$ZL2= 120
##$ZL3= 120
##$ZL4= 120
##$ABSF1= 14.98509
##$ABSF2= -5.573092
##$ABSG= 5
##$ABSL= 3
##$ALPHA= 0
##$AQORDER= 0
##$ASSFAC= 0
##$ASSFACI= 0
##$ASSFACX= 0
##$ASSWID= 0
##$AUNMP= <proc_prof1d_extract_pilot.lims>
##$AXLEFT= 0
##$AXNAME= <>
##$AXNUC= <1H>
##$AXRIGHT= 0
##$AXTYPE= 0
##$AXUNIT= <>
##$AZFE= 0.1
##$AZFW= 0.1
##$BCFW= 0
##$BC_mod= 0
##$BYTORDP= 0
##$COROFFS= 0
##$CY= 15
##$DATMOD= 1
##$DC= 0
##$DFILT= <>
##$DTYPP= 0
##$F1P= 0
##$F2P= 0
##$FCOR= 0.5
##$FTSIZE= 32768
##$FT_mod= 6
##$GAMMA= 0
##$GB= 0
##$INTBC= 1
##$INTSCL= 1
##$ISEN= 128
##$LB= 0
##$LEV0= 0
##$LPBIN= 0
##$MAXI= 10000
##$MC2= 0
##$MEAN= 0
##$ME_mod= 0
##$MI= 0
##$NCOEF= 0
##$NC_proc= -8
##$NLEV= 6
##$NOISF1= 0
##$NOISF2= 0
##$NSP= 0
##$NTH_PI= 0
##$NZP= 0
##$OFFSET= 14.98509
##$PC= 1
##$PHC0= 94.53186
##$PHC1= 0
##$PH_mod= 1
##$PKNL= yes
##$PPARMOD= 0
##$PPDIAG= 0
##$PPIPTYP= 0
##$PPMPNUM= 2147483647
##$PPRESOL= 1
##$PSCAL= 4
##$PSIGN= 0
##$PYNMP= <proc.py>
##$REVERSE= no
##$SF= 400.02
##$SI= 32768
##$SIGF1= 0
##$SIGF2= 0
##$SINO= 400
##$SIOLD= 32768
##$SPECTYP= <>
##$SREGLST= <1H.CDCl3>
##$SSB= 0
##$STSI= 32768
##$STSR= 0
##$SW_p= 8223.68421052631
##$SYMM= 0
##$S_DEV= 0
##$TDeff= 65536
##$TDoff= 0
##$TI= <>
##$TILT= no
##$TM1= 0
##$TM2= 0
##$TOPLEV= 0
##$USERP1= <user>
##$USERP2= <user>
##$USERP3= <user>
##$USERP4= <user>
##$USERP5= <user>
##$WDW= 1
##$XDIM= 32768
##$YMAX_p= 457359992
##$YMIN_p= -680715
##$CURPLOT= <Network HP LaserJet P1505>
##$CURPRIN= <$Network HP LaserJet P1505>
##$DFORMAT= <normdp>
##$LAYOUT= <+/1D_H.xwp>
##$LFORMAT= <normlp>
##$PFORMAT= <normpl>
##$SURQMSG= 1
$$ End of Bruker specific parameters
$$ ---------------------------------
##NTUPLES= NMR SPECTRUM
##VAR_NAME=  FREQUENCY,     SPECTRUM/REAL,   SPECTRUM/IMAG
##SYMBOL=    X,             R,               I
##VAR_TYPE=  INDEPENDENT,   DEPENDENT,       DEPENDENT
##VAR_FORM=  AFFN,          ASDF,            ASDF
##VAR_DIM=   32768,         32768,           32768
##UNITS=     HZ,            ARBITRARY UNITS, ARBITRARY UNITS
##FACTOR=    0.250966925370066, 1,           1
##FIRST=     8223.43324360094, -86741,       228505
##LAST=      0,             13266,           -55027
##MIN=       0,             -680715,         0
##MAX=       8223.43324360094, 457359992,    0
$$ Real data points
##PAGE= N=1
##DATA TABLE= (X++(R..R)), XYDATA
$$ [...]
19541A01552a83553D2040a85955e7082A1417P391e0533A1602N3226R4872b66605
$$ 101552 -183553 42040 -185955 -57082 11417 18808 -50533 11602 64828 159700 -266605
19529a11416C32247j44706H687c46595d6214j03615p8581A44792b72742p6805
$$ -111416 332247 187541 8687 -346595 -46214 -149829 -228410 144792 -272742 -349547
19519c49547m3603g9348l8892A70520b11593R1686o0860P7557A17984k4269K40757
$$ -349547 -393150 -79348 -118240 170520 -211593 -119907 -180767 -103210 117984 93715 334472
19508C34472A10848k2978K54565c1665r7001A52863a34455i351j46106D4993L1369
$$ 334472 110848 87870 342435 -31665 -128666 152863 -134455 -9351 -155457 44993 76362
19497G6362a69298A15007J84492H9970a19826M4748K7628j77291I0372c8530D9728
$$ 76362 -169298 115007 299499 89970 -119826 -75078 -47450 -224741 90372 -38530 49728
19485c5081j60041Q6125j71236B7911c07001e2301F1533A0615K5139d38596c1781
$$ -35081 -195122 -108997 -280233 27911 -307001 -52301 61533 10615 35754 -438596 -31781
19473i8800o2907n143J2329n7122Q2922J8114e219j86817A5175h9862A75384e244
$$ -98800 -161707 -166850 -154521 -211643 -128721 -110607 -5219 -192036 15175 -89862 175384 -5244
19460A20177a5445r7550A5067K07570e29336J38044F4445b19211d7959k68911
$$ 120177 -15445 -112995 15067 222637 -529336 -391292 64445 -219211 -47959 -316870
19450c16870J4212B25422J13942B1967J79882a17548j21243H1179f9589J5423
$$ -316870 -302658 225422 339364 21967 201849 -117548 -238791 81179 -69589 -54166
19440e4166j55004o8479A08751d8368C4472P0232K7736a37133B51426B1806b7407
$$ -54166 -209170 -277649 108751 -48368 34472 104704 132440 -137133 251426 21806 -27407
19428a58154D1985d26426J75813I6747b22098D94b80111i5405j86244i6932a6889
$$ -158154 41985 -426426 -250613 96747 -222098 494 -280111 -95405 -281649 -96932 -16889
19416i6629j20015q7386N4791a8739j92971j33211a23677A3488L1513A7934J1295
$$ -96629 -216644 -304030 -249239 -18739 -211710 -344921 -123677 13488 45001 17934 29229
19405B9229A3889a38958m5416e136k37586b7668m584o4478k68811R7677m2611
$$ 29229 13889 -138958 -184374 -5136 -242722 -27668 -32252 -96730 -365541 -267864 -310475
19394c10475J20096A56767b45651i3992l97881A23478c3714A34333a38789M0951
$$ -310475 -190379 156767 -245651 -93992 -491873 123478 -33714 134333 -138789 -97838
19384i7838o549C88742f248o2467j8728j02511E0290P1706f779k12383j42966
$$ -97838 -104387 388742 -6248 -68715 -87443 -189954 50290 121996 -6779 -219162 -362128
19373c62128A25521b95770J30519I0129b3340k85631i6653j00127k6279F5725
$$ -362128 125521 -295770 -165251 90129 -23340 -308971 -96653 -196780 -223059 65725
19362B14210b64987L9265A5069g7246q130B5401J53032F2316a64245B51353a59019
$$ 214210 -264987 -225722 15069 -77246 -85376 25401 178433 62316 -164245 251353 -159019
19350i5194A4019J05189a20122j7128j41282J9271a9605E5470n368a51507D1766
$$ -95194 14019 119208 -120122 -137250 -278532 -259261 -19605 55470 50102 -151507 41766
19338g4045m44468A78782E7340a47193d4090l38746i9796k6915A03947R4930K0530
$$ -74045 -518513 178782 57340 -147193 -44090 -382836 -99796 -126711 103947 198877 219407
19327B19407a55425b5B17291c42357a55252f8272a93j14478r533d4551D8448K96440
$$ 219407 -155425 -25 217291 -342357 -155252 -68272 -193 -114671 -124204 -44551 48448 344888
19315C44888A6581K15756a51589k03718J10308J17251j68601A282b14040P8468
$$ 344888 16581 232337 -151589 -355307 -244999 -127748 -296349 1282 -214040 -135572
19305a35572f685D67782a69840d4632C18674b94789A11555f3613j66743k989n4761
$$ -135572 -6685 467782 -169840 -44632 318674 -294789 111555 -63613 -230356 -233345 -288106
19294b88106J05360B433L5664b79063R0889r2138J6868d8268k16902A21856b48700
$$ -288106 -182746 2433 38097 -279063 -188174 -280312 -263444 -48268 -265170 121856 -248700
19282B57530j6265m8283a79303h0704H2444L0829k6847H834a47407a521j14941
$$ 257530 241265 192982 -179303 -80704 82444 113273 86426 8834 -147407 -1521 -116462
19271a16462A28309c272E8223a11673e0064a8777j60672a8898k01683b5838B58308
$$ -116462 128309 -3272 58223 -111673 -50064 -18777 -179449 -18898 -220581 -25838 258308
19259H2844L5170b50691i14m1950A4941c6236l3153a7894k8381j13169C15346
$$ 82844 118014 -250691 -914 -42864 14941 -36236 -69389 -17894 -46275 -159444 315346
19247a01925m3476n7289n3054A4170J44429b35963e3227H2597k2819O000a2541
$$ -101925 -145401 -202690 -255744 14170 158599 -235963 -53227 82597 59778 65778 -12541
19235F3289b55286G0160a13463m2671A85512a62083D8596b96034F0243g3925L6573
$$ 63289 -255286 70160 -113463 -156134 185512 -162083 48596 -296034 60243 -73925 -37352
19224c7352r8924L0399B36512J3914d14785a07705j94079A22934m3920c64465
$$ -37352 -136276 -105877 236512 250426 -414785 -107705 -301784 122934 79014 -364465
19213A2673a26142O572M5842E6512K7393J89341a85400g0034j36681j07241g0121
$$ 12673 -126142 -119570 -73728 56512 83905 273246 -185400 -70034 -206715 -313956 -70121
19201B3385N0171J86042a08459A05207m9139k6502g5195k07144f5168I064K207
$$ 23385 73556 259598 -108459 105207 56068 29566 -75195 -282339 -65168 9064 11271
19190A1271b7458E0870g3118j74438A82479b00458A24462a07706j01120c1493
$$ 11271 -27458 50870 -73118 -247556 182479 -200458 124462 -107706 -208826 -31493
19179a22027j19838G4151c2303n4317l0766j51471p3013a56771j12238Q4094Q1323
$$ -122027 -241865 74151 -32303 -86620 -117386 -268857 -341870 -156771 -269009 -184915 -103592
19168a03592j49517I2017h673j86554B0311J54459a63882B71682p6487a20758
$$ -103592 -253109 92017 -8673 -195227 20311 174770 -163882 271682 195195 -120758
19157d5569l8664A727c91963C33557D3194K6269A8118f294k70830J25117k022
$$ -45569 -84233 1727 -391963 333557 43194 69463 18118 -6294 -277124 -152007 -154029
19146a54029H6550b00538a6447B4344L194a53126d5481q4026E6219R6223b06443
$$ -154029 86550 -200538 -16447 24344 27538 -153126 -45481 -129507 56219 152442 -206443
19134A42817b77996g1413j77301k6019G2116J74544J94513i8686j73582a06858
$$ 142817 -277996 -71413 -248714 -274733 72116 246660 441173 -98686 -272268 -106858
19123I7879b36867M1453P9318F6823B2266A0709f5827B10868d55625C41151a77066
$$ 97879 -236867 -195414 -116096 66823 22266 10709 -65827 210868 -455625 341151 -177066
19111d9499r3922a2751p8378K2358F2720a02039D3256a83802I0654h5265G2704
$$ -49499 -143421 -12751 -91129 -68771 62720 -102039 43256 -183802 90654 -85265 72704
19099g3105o6305B5657c0084A03645J05390l3634d4032q8307m4424I2666P0163
$$ -73105 -139410 25657 -30084 103645 209035 175401 -44032 -132339 -176763 92666 162829
19088A62829a66399I5238M9011d4901k18122r6293N9541J29712a6453j27396A27668
$$ 162829 -166399 95238 144249 -44901 -263023 -359316 -299775 -170063 -16453 -143849 127668
19076d85921g1192q2514k6843A95155o7660b56465e2198F6035L1434j9784J97802
$$ -485921 -71192 -153706 -180549 195155 127495 -256465 -52198 66035 97469 77685 275487
19065B75487a02078M5613J3792j369C74794a45474k9697g50l7022k14433D2030
$$ 275487 -102078 -56465 -42673 -44042 374794 -145474 -175171 -750 -37772 -252205 42030
19053b01044H1523g5466E1624h7680A14062l6075R4239b35364a982n3972m5462
$$ -201044 81523 -75466 51624 -87680 114062 77987 172226 -235364 -1982 -55954 -101416
19042a01416k46885a63860P5860g831D739E7a35735j36784g0724j7080B71088
$$ -101416 -348301 -163860 -88000 -7831 4739 57 -135735 -272519 -70724 -87804 271088
19030A24970K4968e1314C33362A9468a35324A02316a75731D55915h2882R653r3725
$$ 124970 149938 -51314 333362 19468 -135324 102316 -175731 455915 -82882 -73229 -166954
19019a66954k04883A89411a56894k52017a37575j67654h2535j7913C70864c3792
$$ -166954 -371837 189411 -156894 -408911 -137575 -305229 -82535 -100448 370864 -33792
19008C2038A4698b32145M905F2059k6373i9444K625k12729a11695q731G4343O2298
$$ 32038 14698 -232145 -227240 62059 35686 -99444 -96819 -309548 -111695 -120426 74343 136641
18996A36641J2429H414b30362k52137J53033E0676a04249j80767J11603Q0377
$$ 136641 149070 8414 -230362 -482499 -329466 50676 -104249 -285016 -173413 -93036
18986i3036q7278h9137q0580B3330a14622j9120E1557a30438r8670h1367p2859
$$ -93036 -180314 -89137 -169717 23330 -114622 -133742 51557 -130438 -229108 -81367 -154226
18975a54226C4647K2395k6247c13850B8792c4400I668a36329a7037B0794c14996
$$ -154226 34647 57042 30795 -313850 28792 -34400 9668 -136329 -17037 20794 -314996
18963b8099m0451J1366j47197C0210A1991a25591d6164n6712C7709a456k15108
$$ -28099 -68550 -57184 -204381 30210 11991 -125591 -46164 -102876 37709 -1456 -216564
18952b16564J1640k436n3861D3047O047J31779m5630O8606a84921b3973e178p6529
$$ -216564 -204924 -207360 -261221 43047 49094 180873 135243 203849 -184921 -23973 -5178 -81707
18940h1707B94339a83597B9384K42046f8587n3411j5304P43O5300K4344J3806
$$ -81707 294339 -183597 29384 271430 -68587 -121998 -137302 -136559 -71259 -46915 -33109
18929c3109A45105a7194B67110d9146j31921H6372a4841j47279k34544a48779
$$ -33109 145105 -17194 267110 -49146 -181067 86372 -14841 -162120 -396664 -148779
18918d45411B3323L3642a02434M8143K4151l03598E0636b10540R6500C9525h2922
$$ -445411 23323 56965 -102434 -54291 -30140 -333738 50636 -210540 -114040 39525 -82922
18906A54884g687F2511a25456m8482K1508j01809R3327a5795C13288a93808i1663
$$ 154884 -7687 62511 -125456 -173938 -152430 -254239 -160912 -15795 313288 -193808 -91663
18894b11684A19733e9062l74020A47154J6402a61105M3403j61389N6923P4880
$$ -211684 119733 -59062 -433082 147154 163556 -161105 -117702 -279091 -222168 -147288
18884a47288A76664K7516K31398b91716B7002a83028r9877A28174a71689O3174
$$ -147288 176664 204180 435578 -291716 27002 -183028 -282905 128174 -171689 -108515
18874a08515j37391F239b37826L451d8852K710j15270j32274G6922a26198A51674
$$ -108515 -245906 6239 -237826 -234375 -48852 -46142 -161412 -293686 76922 -126198 151674
18862c876H163J96655a2589o8843A24614b88891J15653E1839d0315C3246b4795
$$ -3876 8163 204818 -12589 -81432 124614 -288891 -173238 51839 -40315 33246 -24795
18850a20357o6952d2740l0767D1937j7480a23698A55015l2758a07243B83890E6660
$$ -120357 -187309 -42740 -73507 41937 24457 -123698 155015 122257 -107243 283890 56660
18838c66275J37118B98342A15011a53415k83774J14757B6811J36922a29975A60104
$$ -366275 -229157 298342 115011 -153415 -437189 -322432 26811 163733 -129975 160104
18827A71825a87245O1198j7177A863a89241B22397a2273j03847A36929J16140
$$ 171825 -187245 -126047 -143224 1863 -189241 222397 -12273 -116120 136929 253069
18817B53069m1164a09377F4306d0521B3552P0016g4977J3353r5896N88H3281J75363
$$ 253069 211905 -109377 64306 -40521 23552 93568 -74977 -61624 -157520 -156932 83281 258644
18805B58644A11580b15673B38231P7752d7170j50733e4924m48436b19887A06125
$$ 258644 111580 -215673 238231 315983 -47170 -197903 -54924 -503360 -219887 106125
18794A35565J1736a92471A28037c4481A24559i7497A7434J06458b63414n5768
$$ 135565 147301 -192471 128037 -34481 124559 -97497 17434 123892 -263414 -319182
18784c19182j79362b01903B75379b990F3786e9138E0723b9546k3473a7195k07748
$$ -319182 -498544 -201903 275379 -2990 63786 -59138 50723 -29546 -53019 -17195 -224943
18773b24943j65667b8988k38064d7560I0658R4168b12531D9827a36949a7130j50553
$$ -224943 -390610 -28988 -267052 -47560 90658 184826 -212531 49827 -136949 -17130 -167683
18762a67683j41634Q7590L9874C9611E074f8353j13418H266b13815R6457l9022
$$ -167683 -309317 -221727 -181853 39611 5074 -68353 -181771 8266 -213815 -117358 -156380
18751a56380n2137I0209K8676a57373A86427b51121I1549a14835A92410q3668
$$ -156380 -208517 90209 118885 -157373 186427 -251121 91549 -114835 192410 108742
18741A08742a63699N0955e5240B4935L2022a27535b796A6128a7379J738E7953
$$ 108742 -163699 -112744 -55240 24935 56957 -127535 -2796 16128 -17379 -15641 57953
18729a47437k56984f0849a2468j63107C4650a96083h5973m6792M8034j00841C9785
$$ -147437 -404421 -60849 -12468 -175575 34650 -196083 -85973 -132765 -84731 -185572 39785
18717b607A70361O2360D9175M1205L28642c4766B64255c684j54065j72910M0729
$$ -2607 170361 232721 49175 90380 419022 -34766 264255 -3684 -157749 -330659 -289930
18706b89930k07870A41816j6379A617a08261q1606A77131a348A38715A3119N7856
$$ -289930 -497800 141816 125437 1617 -108261 -189867 177131 -1348 138715 13119 70975
18695G0975b33271D3840d8323C56899a11563j6029p2632m0236n3824C523J39390
$$ 70975 -233271 43840 -48323 356899 -111563 -127592 -200224 -240460 -294284 3523 142913
18684A42913c1452j8555I7651N2919b48066g5945k89745l3761c0525j52705l4862
$$ 142913 -31452 -50007 97651 150570 -248066 -75945 -365690 -399451 -30525 -183230 -218092
18673b18092d1478j21556P9415A15410f6527A0484a71071q5m2823k65365b19215
$$ -218092 -41478 -163034 -83619 115410 -66527 10484 -171071 -171156 -213979 -479344 -219215
18661B85b62907h3174b1650j20050B4774b81372b6717L313j42571E2441a1758
$$ 285 -262907 -83174 -21650 -141700 24774 -281372 -26717 -23404 -165975 52441 -11758
18649i822k53835e3695n7285G1555a43659F9691J6531b61490D6849a53605B11755
$$ -9822 -263657 -53695 -110980 71555 -143659 69691 86222 -261490 46849 -153605 211755
18637A11790c37749a52447I9129h5646j08496R0141I4571a56537A20181A3320
$$ 111790 -337749 -152447 99129 -85646 -194142 -104001 94571 -156537 120181 13320
18626C01021c6846k4592j6708A26742N5871a21332n0186L0958e0826j61282k26296
$$ 301021 -36846 -61438 -78146 126742 182613 -121332 -171518 -140560 -50826 -212108 -438404
18615d38404G0162c1892j56549q7661h5399G7561B0703a33909k3160H793a06435
$$ -438404 70162 -31892 -188441 -276102 -85399 77561 20703 -133909 -157069 8793 -106435
18603A54369a16538C8743b62978a5293l16866i6359J4688A22399L7957O0352h6760
$$ 154369 -116538 38743 -262978 -15293 -332159 -96359 -81671 122399 160356 220708 -86760
18591c9729A41947c0380j37774E8530a56334j52209E9339J47906b23878H2041
$$ -39729 141947 -30380 -168154 58530 -156334 -308543 59339 207245 -223878 82041
18580b99094R2031B2968a80043D91929c45573g6026j33122a4841m4472j52309
$$ -299094 -207063 22968 -180043 491929 -345573 -76026 -209148 -14841 -59313 -211622
18570b11622G2373K1598a93938f2725k56742A29445k7804b57267J04481i393q4313
$$ -211622 72373 93971 -193938 -62725 -319467 129445 101641 -257267 -152786 -9393 -93706
18559i3706G7529a45481D2614e15314K44257a0224A7324J6291b98142A85497j5662
$$ -93706 77529 -145481 42614 -515314 -271057 -10224 17324 33615 -298142 185497 169835
18548A69835a16064j55481B9996b44100K568d7314p2076B72879d8775j34218B32232
$$ 169835 -116064 -271545 29996 -244100 -241532 -47314 -119390 272879 -48775 -182993 232232
18536a56874e2225j55702R9211M7814E4862a93492A77354e8380b7128j07912R959
$$ -156874 -52225 -207927 -108716 -60902 54862 -193492 177354 -58380 -27128 -135040 -125081
18525a25081a1602A75331R0647c27740h7737j91061M4341e3910D7296d8382k06522
$$ -125081 -11602 175331 265978 -327740 -87737 -278798 -234457 -53910 47296 -48382 -254904
18514b54904g0187k67108N3897B21909q8258j5316K39546D5398A1118e85081a16117
$$ -254904 -70187 -337295 -283398 221909 133651 118335 357881 45398 11118 -585081 -116117
18502I7872d4111A27453b29670A10565a9046j8376k39517a2721C37128j19300
$$ 97872 -44111 127453 -229670 110565 -19046 -37422 -276939 -12721 337128 217828
18492B17828g7884A93585a72213B84249E873P2814b02006B44348G4952a62960
$$ 217828 -77884 193585 -172213 284249 5873 78687 -202006 244348 74952 -162960
18481G6939B4308j1175c3635l49183d8386a7806p4448A26167k6855A7478f1331
$$ 76939 24308 13133 -33635 -382818 -48386 -17806 -92254 126167 99312 17478 -61331
18469a17628A77687a46274Q498C0710f3835B18124e2959p5999j81800j87387b05949
$$ -117628 177687 -146274 -137776 30710 -63835 218124 -52959 -128958 -310758 -498145 -205949
18457i5735b9118l63099J09994a26675A07999a17895C0518g3072m0194I8464a54254
$$ -95735 -29118 -392217 -282223 -126675 107999 -117895 30518 -73072 -113266 98464 -154254
18445f9147K39a1749k95076G2035a45951O4530j17882A09705b7134l66386C5325
$$ -69147 -68908 -11749 -306825 72035 -145951 -81421 -199303 109705 -27134 -393520 35325
18433a72419a8379n9741n5498A26551l8945N8566J31269d5157l10985A4514a26597
$$ -172419 -18379 -78120 -133618 126551 87606 146172 277441 -45157 -356142 14514 -126597
18421b08811f1762k8875B36244A13872E3696a51274f1191j10025B36716O1064
$$ -208811 -61762 -90637 236244 113872 53696 -151274 -61191 -171216 236716 297780
18411B97780j6754F8319K30672b94622C1376g047B24063e7522k08755F6611J6217
$$ 297780 281026 68319 298991 -294622 31376 -7047 224063 -57522 -266277 66611 82828
18400H2828c60813B53498a31022M4341k74808a00809j36499C42384a10281E511
$$ 82828 -360813 253498 -131022 -86681 -361489 -100809 -237308 342384 -110281 5511
18389c30575J29110N8231B62050c40658D25e6742D156K85847j23303a42908B83102
$$ -330575 -201465 -143234 262050 -340658 425 -56742 4156 290003 166700 -142908 283102
18377e1536B42591a87710d8355j43849B3433f1523F4795Q2005n5113P7389f4512
$$ -51536 242591 -187710 -48355 -192204 23433 -61523 64795 146800 91687 169076 -64512
18365C13L48107e23947a63690A48406a21841A93608M5248m7672h4329A90499g4437
$$ 313 348420 -523947 -163690 148406 -121841 193608 238856 191184 -84329 190499 -74437
18353I393J59834J72393a46741d9018o8379A00206b00731c8347n2457b3699A46149
$$ 9393 169227 341620 -146741 -49018 -117397 100206 -200731 -38347 -90804 -23699 146149
18341e09949H1797A9632J5730h9227j99743R7127d006k19717b0823C3740J48505
$$ -509949 81797 19632 35362 -89227 -288970 -191843 -4006 -223723 -20823 33740 182245
18330A82245l9938b49077d7507b3716j15155A32880b56558A94823m4072d02592
$$ 182245 142307 -249077 -47507 -23716 -138871 132880 -256558 194823 150751 -402592
18319b8648A67794b43693Q4189f6852N166l10868B5306c4279k53011A32525a9231
$$ -28648 167794 -243693 -159504 -66852 -61686 -372554 25306 -34279 -287290 132525 -19231
18307a71681N3895k54286G07J54594a83165C9677a19001d2196j61730L1093O3792
$$ -171681 -117786 -372072 707 155301 -183165 39677 -119001 -42196 -203926 -172833 -109041
18296a09041N3841C7975M9243a55908j8872C2224L9006N2075h4120n35789A22121
$$ -109041 -55200 37975 87218 -155908 -174780 32224 71230 123305 -84120 -619909 122121
18284a27921O298A49018O4431b61236a02732B88869a04679M3994B244K11549h074
$$ -127921 -121623 149018 213449 -261236 -102732 288869 -104679 -60685 2244 213793 -8074
18272A13203i5638A54068m3631c52813d1658B56423a39884n3621j8343G7837N8581
$$ 113203 -95638 154068 110437 -352813 -41658 256423 -139884 -193505 -211848 77837 136418
18261A36418f5996l3340J0390O591H4955l3244H285a65900A38740c41517P1860
$$ 136418 -65996 -99336 -88946 -82355 84955 51711 8285 -165900 138740 -341517 -269657
18250b69657F4348c2226j075j75539G3172c27466i08A54844g788j3055A66365
$$ -269657 64348 -32226 -33301 -208840 73172 -327466 -908 154844 -7788 -20843 166365
18238G7174k9583E81P1797M5364a02757d2065B1199a29665I0341a21983d3843
$$ 77174 47591 581 72378 117742 -102757 -42065 21199 -129665 90341 -121983 -43843
18226h7869k2659E6979A0065a3133F3807i1752m03511a46465O8864r408q4925
$$ -87869 -110528 56979 10065 -13133 63807 -91752 -495263 -146465 -77601 -87009 -171934
18215a71934A0627J27925D1737i3847a6022j51312g2659o9375a4721A05877D06
$$ -171934 10627 138552 41737 -93847 -16022 -167334 -72659 -142034 -14721 105877 406
18203d581A98707F7154e3670k16319A30950f3211l2143d1907K363j41882A58477
$$ -4581 198707 67154 -53670 -269989 130950 -63211 -95354 -41907 -39544 -181426 158477
18191E2d47971H7619b35612c6667A5141J67991c91871A18639b05077L4521b9081
$$ 52 -447971 87619 -235612 -36667 15141 183132 -391871 118639 -205077 -170556 -29081
18179F5342g9017A47917Q7738D9580a84587A10058a09704M699C82187d0903P72
$$ 65342 -79017 147917 235655 49580 -184587 110058 -109704 -105005 382187 -40903 -40131
18168d0131j16166P2719B697J6959J44003p0730c6943j79745c3265A96285a99148
$$ -40131 -156297 -83578 2697 19656 163659 92929 -36943 -216688 -33265 196285 -199148
18156b15888j31952A04098B96d396l31404G1357J99360d67414A37227O2553l506
$$ -215888 -347840 104098 296 -4396 -335800 71357 270717 -467414 137227 199780 196274
18145A96274I7546f4728A52564A9212N487b6745j96962J325j87864J85710R9358
$$ 196274 97546 -64728 152564 19212 24699 -26745 -223707 -222382 -410246 -224536 -125178
18134a25178I9402D5606b30411N1231e8965j64024A59361a45564j506N9374G5728
$$ -125178 99402 45606 -230411 -179180 -58965 -222989 159361 -145564 -147070 -87696 75728
18122d8601m1590A55626c8273o7400B03489a71047j20235G1074d15658a75337
$$ -48601 -90191 155626 -38273 -105673 203489 -171047 -291282 71074 -415658 -175337
18111A90054i2861A13900e5538b3335q3579e703F9853Q5948a16913j71311A54405
$$ 190054 -92861 113900 -55538 -23335 -106914 -5703 69853 155801 -116913 -288224 154405
18099A38630F1877P766b36269A7307a95247B12944a93761E5907Q4744c17375B58465
$$ 138630 61877 69643 -236269 17307 -195247 212944 -193761 55907 140651 -317375 258465
18087c6294j21276b2657m63016A29259D6059J26822e3345m8588j39737r7880f2165
$$ -36294 -157570 -22657 -485673 129259 46059 172881 -53345 -101933 -241670 -339550 -62165
18075a5685A88434O4018d28772J26940B06020d17171J17561c3265A14432J97137
$$ -15685 188434 252452 -428772 -301832 206020 -417171 -299610 -33265 114432 311569
18065C11569d1971m4141a9821m44330C02940F5153B0501a56469j24656A57545
$$ 311569 -41971 -86112 -19821 -464151 302940 65153 20501 -156469 -281125 157545
18054C1470h6561B29816f8672o246J6427j54466K5072Q8033j68164f2916K0130
$$ 31470 -86561 229816 -68672 -74918 -58491 -212957 -187885 -99852 -268016 -62916 -42786
18043d2786a0038k47233a26223A6957Q0418h5150k2685A57734D9696h2122k33600
$$ -42786 -10038 -257271 -126223 16957 97375 -85150 -107835 157734 49696 -82122 -315722
18032c15722J07852c5263A10317l0819a44122j23077I9617b11702J01967p186
$$ -315722 -207870 -35263 110317 79498 -144122 -267199 99617 -211702 -109735 -116921
18022a16921C5406J4410B1438e4774l0128b7459J2534j6049B03733a98822L5087
$$ -116921 35406 49816 21438 -54774 -84902 -27459 -14925 -30974 203733 -198822 -163735
18011a63735B73472b80168R9231A41340d9285j6115j78901a13895M1658o699m7734
$$ -163735 273472 -280168 -180937 141340 -49285 -65400 -244301 -113895 -72237 -78936 -126670
18000a26670C9183J80313a92233C66353E1587J54509a14206A37272n5468f322
$$ -126670 39183 219496 -192233 366353 51587 206096 -114206 137272 81804 -6322
17989F0078b58634A16733a47351O5867B64157c40138a63637L8178o4998G8650
$$ 60078 -258634 116733 -147351 -81484 264157 -340138 -163637 -125459 -190457 78650
17978i1416j75291b9646I6980a25296l5564A17086g4264A46800A5186J5999J55586
$$ -91416 -266707 -29646 96980 -125296 -160860 117086 -74264 146800 15186 31185 186771
17967A86771c15118d2632j14891J1470j6857E9576b20472A01554c46206b1935
$$ 186771 -315118 -42632 -157523 -146053 -162910 59576 -220472 101554 -346206 -21935
17956B67726a55705j21020A30340f9586B15642a88228B84165G3713c42396M9182
$$ 267726 -155705 -276725 130340 -69586 215642 -188228 284165 73713 -342396 -293214
17946b93214b1154A50883k1831K9393r709a25827B63020a4625A29799K7695D8941
$$ -293214 -21154 150883 129052 158445 148736 -125827 263020 -14625 129799 157494 48941
17934e0841A10933m4336J02649f5400a9481E7479g8221B1907K6503a93581C7440
$$ -50841 110933 66597 169246 -65400 -19481 57479 -78221 21907 48410 -193581 37440
17922a98833A01994c1711j33734A45292P0173c73368A05480a73632B77674b11768
$$ -198833 101994 -31711 -165445 145292 215465 -373368 105480 -173632 277674 -211768
17911A48153P9940C5189M6887j9353a96448q904c453F6766K26833a28676L4401
$$ 148153 228093 35189 82076 62723 -196448 -205352 -3453 66766 293599 -128676 -94275
17900i4275j22715C12623d3726H906f7286m2181j69877O0438K989q0359C6660
$$ -94275 -216990 312623 -43726 8906 -67286 -109467 -279344 -218906 -215917 -296276 36660
17888b18941B17298D8188b09043F8043a08471o5302d9584B10354a03316k01923
$$ -218941 217298 48188 -209043 68043 -108471 -173773 -49584 210354 -103316 -305239
17878c05239G6075a27668a7980C1108J4822h4170r0697N5617J0685J7240A32223
$$ -305239 76075 -127668 -17980 31108 45930 -84170 -174867 -119250 -108565 -91325 132223
17866E5782a2766I3469c5839k4118B90928b30434A26777a00059k53695j133B14109
$$ 55782 -12766 93469 -35839 -59957 290928 -230434 126777 -100059 -353754 -354887 214109
17854A18936a0944A09284d8552k23674D5610a7683r869m9006L0182C66019F1247
$$ 118936 -10944 109284 -48552 -272226 45610 -17683 -27552 -76558 -46376 366019 61247
17842B99704a25071A52699i2591E0347b37246A28536b469A3485k806b49746F8918
$$ 299704 -125071 152699 -92591 50347 -237246 128536 -2469 13485 10679 -249746 68918
17830a57523j57687C37832B3973K34497G1231a89899A11893j1778b01435A2344
$$ -157523 -315210 337832 23973 258470 71231 -189899 111893 100115 -201435 12344
17819D05370A29876h4976r0560A05194g0971D484b52013J222a05276D7864L7595
$$ 405370 129876 -84976 -175536 105194 -70971 4484 -252013 -250791 -105276 47864 85459
17808H5459l6028K4471L44838a01455f120A6572N1953Q5025K0285a19618b1203
$$ 85459 49431 73902 418740 -101455 -6120 16572 68525 153550 173835 -119618 -21203
17796A41911n4675a33586D9650d2071k46440A98514P1219b77491B54857A24010
$$ 141911 87236 -133586 49650 -42071 -288511 198514 269733 -277491 254857 124010
17785A37639a64020e6296j31821H9356D3757b5049A39774C0415J89462Q2543G7570
$$ 137639 -164020 -56296 -188117 89356 43757 -25049 139774 30415 219877 302420 77570
17773b98536A77004G8614b06471a4932A65752d8934o8130j90153J40540O1398
$$ -298536 177004 78614 -206471 -14932 165752 -48934 -117064 -307217 -166677 -105279
17763a05279f033H7027c45018C61012f0861B8434a69096O9005p7284l8670B58185
$$ -105279 -6033 87027 -345018 361012 -60861 28434 -169096 -100091 -177375 -216045 258185
17751E8687r275Q1178a14058m4343j27489P8715e4521J4587A19112a45529N109
$$ 58687 49412 130590 -114058 -158401 -285890 -207175 -54521 -39934 119112 -145529 -140420
17740a40420l3734g2769a0546j44826a8497p6043n1343L4582A27293J4672l1351
$$ -140420 -174154 -72769 -10546 -155372 -18497 -94540 -145883 -111301 127293 141965 110614
17729A10614a50011j0273O6688m2013F3278a9429j13959p3033A85090C1419c2189
$$ 110614 -150011 -160284 -93596 -135609 63278 -19429 -133388 -206421 185090 31419 -32189
17717A42122i5515B38360C6051J974P7275Q3846A8167J618a45287k18953a05871
$$ 142122 -95515 238360 36051 38025 115300 199146 18167 19785 -145287 -364240 -105871
17705A78865a14557j05129A01805a38452A29545F4618h6599F6984C3417b70516
$$ 178865 -114557 -219686 101805 -138452 129545 64618 -86599 66984 33417 -270516
17694B86231j37836a27642B1795d8937m2623L0314C47307A4318Q0726b6327k36515
$$ 286231 148395 -127642 21795 -48937 -91560 -61246 347307 14318 95044 -26327 -262842
17683b62842h9468l7154F3789a45995f1818k508l4345C9692M00518k17260J8395
$$ -262842 -89468 -126622 63789 -145995 -61818 -64326 -98671 39692 440210 222950 241345
17672B41345M700H9768a26388J2226A73201e2691B21903D5631A5816b33045g5395
$$ 241345 246045 89768 -126388 -114162 173201 -52691 221903 45631 15816 -233045 -75395
17660A85185B9786J08802a84632I0868a17374C72197e8400K1548C37917A09393
$$ 185185 29786 138588 -184632 90868 -117374 372197 -58400 -36852 337917 109393
17649A279L07479D1744a34844A9088L24652d54163d7298j65740n1851A8265K7784
$$ 1279 308758 41744 -134844 19088 343740 -454163 -47298 -213038 -264889 18265 46049
17638D6049b29318H4867K81934a20380J3227J5649B84514J04088c189l7361B83409
$$ 46049 -229318 84867 366801 -120380 -107153 -91504 284514 388602 -3189 -40550 283409
17626C69587a57735j33995A31540C6912a59778C49671B8004J38469R9672f6398
$$ 369587 -157735 -291730 131540 36912 -159778 349671 28004 166473 266145 -66398
17615C83042A47744E5793L7697R4071C3136J10003a16974j38145m0933g8184C7268
$$ 383042 147744 55793 93490 187561 33136 143139 -116974 -255119 -296052 -78184 37268
17603C0191e4086A28424a90560C73024A52919e7537g862D44012a34770A39478
$$ 30191 -54086 128424 -190560 373024 152919 -57537 -7862 444012 -134770 139478
17592a25373r5368M1576D3569c7687k37951a583B52491A24435J16249A3549c52462
$$ -125373 -220741 -179165 43569 -37687 -275638 -1583 252491 124435 240684 13549 -352462
17580b54067A36400b22584L6655B11284j0649a68675H0872j3456B1878L2086c8445
$$ -254067 136400 -222584 -185929 211284 200635 -168675 80872 67416 21878 53964 -38445
17568A69398f1429A8846a23827A5013h1687C9942c96963B09864o7723J66358b57662
$$ 169398 -61429 18846 -123827 15013 -81687 39942 -396963 209864 142141 308499 -257662
17556C52543e7492C82079g3137H1671a69772C08591d1860c458m439n12918D4188
$$ 352543 -57492 382079 -73137 81671 -169772 308591 -41860 -3458 -7897 -520815 44188
17544e6944B38474a630B19407a64075D22003A64549J9244g075k6195A07968C7540
$$ -56944 238474 -1630 219407 -164075 422003 164549 183793 -7075 -33270 107968 37540
17532b65044J15628N8179A06093h1467A86860M0235B0267b84313a8280j43929
$$ -265044 -149416 -91237 106093 -81467 186860 227095 20267 -284313 -18280 -162209
17522a62209A2285N0854a32924c5889N089B44551a6439A64961j4084a8838k19156
$$ -162209 12285 63139 -132924 -35889 -30800 244551 -16439 164961 150877 -18838 -237994
17511b37994D51930B04949a4722A81745D3328R0375P1189b03530A31900B9176
$$ -237994 451930 204949 -14722 181745 43328 133703 204892 -203530 131900 29176
17500B78117G6202a2729l5202m8724L7568F0762K5230P273J30287f9351A65839
$$ 278117 76202 -12729 -47931 -96655 -59087 60762 85992 93265 223552 -69351 165839
17488B52799e131A01782Q7094E2579K09408q3176D3405K20477b06225D53217D8330
$$ 252799 -5131 101782 188876 52579 261987 178811 43405 263882 -206225 453217 48330
17476A53128l5824a07037B49115j8381a88004i3587B65906F4116b0775B9408K85284
$$ 153128 117304 -107037 249115 230734 -188004 -93587 265906 64116 -20775 29408 314692
17465C14692a08842k8349B43264a04346B89065b02202G7510M49508d9516G3763
$$ 314692 -108842 -137191 243264 -104346 289065 -202202 77510 527018 -49516 73763
17454H3571K53198K6981J4611M2867a56446C28750j20720G3689J82041k7243k8233
$$ 83571 336769 363750 378361 421228 -156446 328750 208030 73689 255730 228487 200254
17443B00254m1429a9418B65434H5640a28956C28934l9083E6851N6456N7302D8433
$$ 200254 158825 -19418 265434 85640 -128956 328934 289851 56851 113307 170609 48433
17431B60500q1057G8884a44A35728M4541L04577j57837K0991j03334H6881e908
$$ 260500 179443 78884 -144 135728 180269 484846 327009 348000 244666 86881 -5908
17419C50122F2747L20088m8965K9157p3967n363h930B8125a92056B60992A07297
$$ 350122 62747 382835 333870 363027 289060 283697 -8930 28125 -192056 260992 107297
17407C95921L7423b11139G7702a09289B81747a68478I9488L9095e2389A90915
$$ 395921 433344 -211139 77702 -109289 281747 -168478 99488 138583 -52389 190915
17396A14939J56990L9781n7112l4673P9017J28738A40543N8578K08582j28336
$$ 114939 271929 311710 254598 219925 298942 427680 140543 199121 407703 279367
17386B79367C4737a28435n5212A65841k0885J18452j26809N9676b8140j52561
$$ 279367 34737 -128435 -183647 165841 144956 263408 136599 196275 -28140 -180701
17376a80701B38218K1995F2032J95685R4500A08399k8762e3474A79936J24154
$$ -180701 238218 260213 62032 257717 352217 108399 79637 -53474 179936 304090
17366C04090A33857b57640B44703J01540Q2542a25426A67551J64986j46182L4670
$$ 304090 133857 -257640 244703 346243 428785 -125426 167551 332537 186355 221025
17356B21025a20693C27600G2483J21375J35836A0468K82704E6781K70663A18164
$$ 221025 -120693 327600 72483 193858 329694 10468 293172 56781 327444 118164
17345A29429j9275a6688B62777a5652G0312P867a04922K4449A46708K17806D3595
$$ 129429 110154 -16688 262777 -15652 70312 78179 -104922 -80473 146708 364514 43595
17333B76399N6956j07154l0370E0170J30007J60554a61500C20873H3003J61180
$$ 276399 333355 226201 195831 50170 180177 340731 -161500 320873 83003 244183
17323B44183A0222b07935C68247m7345A5657J02601M4283L70814j43512C2586
$$ 244183 10222 -207935 368247 320902 15657 118258 162541 533355 389843 32586
17312D6291J23685M3324q1286o5906N0656A6416h413A69306l1095c0242A73390
$$ 46291 169976 213300 132014 66108 116764 16416 -8413 169306 138211 -30242 173390
17300A57605a12324e4557l184A18967L5700B5817J79696J288K37520F0019J40984
$$ 157605 -112324 -54557 -57741 118967 154667 25817 205513 206801 444321 60019 201003
17289B01003F3673Q8396J5986K2776B1182J93508J07684q7990D8074o719h508
$$ 201003 63673 152069 168055 190831 21182 214690 322374 234384 48074 41355 -8508
17277b4219A1333L10157H8569R1731h6251H6017a65483D0931K98799d6923A84924
$$ -24219 11333 321490 88569 180300 -86251 86017 -165483 40931 339730 -46923 184924
17265B94392a10542C12282O0042L0321j92891j01184m24L0192R4965r4126a64785
$$ 294392 -110542 312282 372324 402645 209754 108570 108146 138338 233303 139177 -164785
17253A16675a77970A33279J77097k2802F3039K3421K08205O7086O7531o4148k2421
$$ 116675 -177970 133279 310376 287574 63039 86460 294665 361751 429282 365134 342713
17242C42713j38263F6023f4411A05864K26115K0120e1659B73105c9065o9876C52352
$$ 342713 204450 66023 -64411 105864 331979 352099 -51659 273105 -39065 -108941 352352
17230B98696A36809L1312J02926g489E2260K14108d3898A77991N0850f4432A34146
$$ 298696 136809 168121 271047 -7489 52260 266368 -43898 177991 228841 -64432 134146
17218C08057C376J34626K03780j29501b7106C49502B9107K02038q3360J51769
$$ 308057 3376 138002 341782 212281 -27106 349502 29107 231145 147785 299554
17208B99554H4765J22686J14848A38661J61956B3326P99080B18359j2226p746
$$ 299554 84765 207451 322299 138661 300617 23326 822406 218359 206133 198387
17198A98387A3806J13507l6286O6137M3691F8891K33760Q6552J19202A84168L9534
$$ 198387 13806 127313 91027 157164 200855 68891 302651 389203 508405 184168 223702
17187B23702G8752b3515C38331A34087J83946k6908K41985k47739j20113K26973
$$ 223702 78752 -23515 338331 134087 318033 291125 533110 285371 165258 392231
17177C92231a52700B06072A6739q025M15296N3889j46126j23822J69468K64122
$$ 392231 -152700 206072 16739 8714 424010 477899 331773 207951 377419 641541
17167F41541k89841M686G1273K38677H8426D1791J81235m0893N9155K36192k37046
$$ 641541 351700 356386 71273 309950 88426 41791 223026 182133 241288 477480 240434
17156B40434J16019l9113K03584k29275G8270b21117B11785D2647N32288l6871
$$ 240434 356453 317340 520924 291649 78270 -221117 211785 42647 574935 538064
17146E38064D8079O42979B14709K26644j83101J68028j76342J42322m6700O1084
$$ 538064 48079 691058 214709 441353 258252 426280 249938 392260 345560 406644
17136D06644A5778J69828K85641j06475j03059J31839j15596J96323A59849K17203
$$ 406644 15778 185606 471247 364772 261713 393552 277956 474279 159849 377052
17126C77052n3756A15398J13647J81342B03339J33137J00877j95003K21428m9375
$$ 377052 323296 115398 229045 410387 203339 336476 437353 242350 463778 414403
17116D14403r7314L37072B89896K29615k28894J58250o4151k1383K23100j15152
$$ 414403 317089 654161 289896 519511 290617 448867 384716 363333 586433 471281
17106D71281j19569K89703B57986Q8370j62241K23208L9248B303L80778p7519
$$ 471281 351712 641415 257986 346356 184115 407323 446571 2303 383081 305562
17096C05562j48681J97678M2625L12184A89405J40510m1554J44792A33426L57461
$$ 305562 156881 354559 397184 709368 189405 329915 288361 433153 133426 490887
17086D90887r8011J77864P3399C11434j0979j5360K78819o5522O1062J70551l60694
$$ 490887 392876 570740 644139 311434 300455 285095 563914 498392 559454 730005 369311
17075C69311M0101K64724J56794l73854J18038j11958j92152O4876n4907k62J16729
$$ 369311 409412 674136 830930 457076 575114 463156 271004 335880 280973 280711 397440
17064C97440J68716Q1820j08974n8937R2990r4347j99392M42420B64859L8884
$$ 397440 566156 647976 539002 480065 573055 478708 279316 721736 264859 303743
17054C03743J94182J93094A88497q6358M06335A59737M10971m0329m4996J35829
$$ 303743 497925 691019 188497 102139 508474 159737 570708 530379 485383 621212
17044F21212j34251k3369j29800K43032L1034j21487o4270J71346k20385j11475
$$ 621212 486961 463592 333792 576824 607858 486371 422101 593447 373062 261587
17034B61587K45176M04816C68274J48009N2869J94683j03762k40183M34124o3783
$$ 261587 506763 911579 368274 516283 569152 763835 660073 419890 854014 790231
17024G90231j79521Q2535J6618j52816q1447K74648j86296j03984J95484O4131
$$ 790231 610710 693245 709863 557047 475600 750248 563952 459968 655452 719583
17014G19583j57521J1654L12257k45722m2136K55553k85112j76859N78855l6635
$$ 719583 562062 573716 885973 640251 598115 853668 568556 391697 970552 933917
17004I33917n9454D24413J06321K75545j80670K53286k70426J58232K3981p1297
$$ 933917 874463 424413 530734 806279 625609 878895 608469 766701 790682 719385
16994G19385q7492Q4373j03923K57152p4186n4116J40273p0382j5777J5787J27966
$$ 719385 631893 716266 612343 869495 795309 741193 881466 811084 795307 811094 939060
16983I39060k70431K14215j10212J59849j07267K02121l91992L24406K6143D69020
$$ 939060 668629 882844 772632 932481 825214 1027335 635343 959749 985892 469020
16972A092341k97397m2876J86941K66316j76217q6083j12607K19697j23285L46449
$$ 1092341 794944 752068 939009 1205325 1029108 943025 830418 1050115 926830 1273279
16962A273279m05737N09892n57620j7990M59881l99887M13133m46276L04685M6900
$$ 1273279 867542 1377434 819814 801824 1261705 861818 1274951 828675 1133360 1180260
16952A180260n8824n9823O5532J39447n44495K19039J51422K67448k47331k50677
$$ 1180260 1121436 1061613 1127145 1266592 722097 941136 1092558 1360006 1112675 861998
16942H61998O3629N08870m75627J8944N79733k77189r8728M69903o62445L83215
$$ 861998 925627 1434497 958870 977814 1557547 1280358 1181630 1651533 989088 1372303
16932A372303r1231J554l041J39180k9365l5896j77008J62872O9116j70493K94477
$$ 1372303 1281072 1282626 1279585 1418765 1389400 1353504 1176496 1339368 1408484 1237991 1532468
16921A532468n0308L7995q9712R776p5642j65524J80144K54000Q5001k0579M9502
$$ 1532468 1482160 1520155 1430443 1440219 1364577 1199053 1379197 1633197 1718198 1697619 1747121
16910A747121m19269K64143j81273J67432J63032J06520k81904J48861M3517L04930
$$ 1747121 1327852 1591995 1410722 1578154 1741186 1847706 1565802 1714663 1758180 2063110
16900B063110l40096J60725n5916r8274R4972L1533l0839Q2754n2806K62778J06338
$$ 2063110 1723014 1883739 1827823 1729549 1824521 1856054 1825215 1907969 1855163 2117941 2224279
16889B224279m9237J7438K31448n7574m35253J59850Q3740j20384N64360k24980
$$ 2224279 2175042 2192480 2423928 2366354 1931101 2090951 2174691 2054307 2618667 2393687
16879B393687P2060J18066j50215r4254M46415p148k18691j05611O683j8645L9083
$$ 2393687 2465747 2583813 2433598 2339344 2785759 2778611 2559920 2454309 2460992 2442347 2481430
16868B481430J38321n0808L26045n1746m711J56611k8842J44791l63815K26958
$$ 2481430 2619751 2568943 2894988 2843242 2838531 2995142 2966300 3111091 2747276 2974234
16858B974234o3926N13441k33462K04149j76472k80439L96173K0810K13211j93156
$$ 2974234 2910308 3423749 3190287 3394436 3217964 2937525 3333698 3354508 3567719 3374563
16848C374563J91723j031K47812J81088k29819J30645j22355R1272J4291j14068
$$ 3374563 3566286 3565255 3813067 3994155 3764336 3894981 3772626 3863898 3878189 3764121
16838C764121L92353K23764O0978L48885p46736L85763J91884M27205j63361j34434
$$ 3764121 4156474 4380238 4441216 4790101 4043365 4429128 4621012 5048217 4884856 4750422
16828D750422N00091k93018K8425n410J21380M95148J1204j38312J53708M15029
$$ 4750422 5250513 4957495 4985920 4980510 5101890 5597038 5608242 5469930 5623638 6038667
16818F038667N8605O0190K64995j66369K92596K84095K05361k46798J78499J58468
$$ 6038667 6097272 6157462 6422457 6256088 6548684 6832779 7038140 6791342 6969841 7128309
16808G128309K70228J09797J83654L23999j84262M4108Q23467j33730L75047o7362
$$ 7128309 7398537 7508334 7691988 8015987 7831725 7875833 8699300 8565570 8940617 8873255
16798H873255K33508M96890K23982K54867K11573K56058O43283L05723o490K58459
$$ 8873255 9106763 9603653 9827635 10082502 10294075 10550133 11193416 11499139 11492649 11751108
16788A1751108M54037j8418O84481L84879L69156J85566N97051O22335L00235
$$ 11751108 12205145 12186727 12871208 13256087 13625243 13810809 14407860 15030195 15330430
16779A5330430M22108O67759J70310P21615N19736N68558R21102M25010P34053
$$ 15330430 15752538 16420297 16590607 17312222 17831958 18400516 19321618 19746628 20480681
16770B0480681J085123N49145R14498Q74754R11321O01202J431887R17095J295025
$$ 20480681 21565804 22114949 23029447 23904201 24815522 25416724 26848611 27765706 29060731
16761B9060731Q45397J737456J093235J264776J887552J580535J417193J955955
$$ 29060731 29906128 31643584 32736819 34001595 35889147 37469682 38886875 40842830
16753D0842830K113829K002993K225131K409152K626008K625378K587159L220312
$$ 40842830 42956659 44959652 47184783 49593935 52219943 54845321 57432480 60652792
16745F0652792L143089L525108L744003L774682M116327M783854N131799M786772
$$ 60652792 63795881 67320989 71064992 74839674 78956001 83739855 88871654 93658426
16737I3658426M932383N550783N946592N809434O380090N959928O804551O262903
$$ 93658426 98590809 104141592 110088184 115897618 122277708 128237636 135042187 141305090
16729A41305090O434130O229749N806684N374227N021792M168856L059027K547173
$$ 141305090 147739220 153968969 159775653 165149880 170171672 174340528 177399555 179946728
16721A79946728J244098N65715p70918j712235k528471m045544m662764m700458
$$ 179946728 181190826 181756541 180985623 179273388 176744917 172699373 168036609 163336151
16713A63336151n492195o150509o340126o138622o370168o466127o324298o487212
$$ 163336151 157843956 151693447 145353321 139214699 132844531 126378404 120054106 113566894
16705A13566894n967908n692946n176277n448415n009318m388575m347161m314005
$$ 113566894 107598986 101906040 96729763 91281348 86272030 81883455 77536294 73222289
16697G3222289l807102l588447l340408l814113k398916k615954l039097k535072
$$ 73222289 69415187 65826740 62486332 58672219 56273303 53657349 50618252 48083180
16689D8083180k087847k197991j927992j849683j847273j668962j644117j671046
$$ 48083180 45995333 43797342 41869350 40019667 38172394 36503432 34859315 33188269
16681C3188269j228925j501191j149780j252750r63550r86116j021688q51292
$$ 33188269 31959344 30458153 29308373 28055623 27092073 26105957 25084269 24232977
16673B4232977j087261r38387o83516q85307m97591o76726j139973n77719J28777
$$ 24232977 23145716 22207329 21523813 20638506 20140915 19464189 18324216 17746497 17875274
16664A7875274r79565o54825m53820m74173j80674n69100n85276m78382k99868
$$ 17875274 16895709 16240884 15787064 15312891 15132217 14563117 13977841 13499459 13199591
16655A3199591n68320j45963q70622K33666l25080n13850j14279n91334p4011
$$ 13199591 12631271 12485308 11614686 11848352 11523272 11009422 10895143 10303809 10229798
16646A0229798l3630o32431l29947L19904o83265o5503q4365l63929p9514k18514
$$ 10229798 10196168 9563737 9233790 9553694 8870429 8804926 8720561 8356632 8277118 8058604
16636H058604r2912k07114m45399K73444m85370k80553J45147j02565k22695k32814
$$ 8058604 7965692 7758578 7313179 7586623 7101253 6820700 6965847 6863282 6640587 6407773
16626F407773J74004m61571N6868p0995l42284l76677M51035m70129K34628n06437
$$ 6407773 6581777 6120206 6177074 6106079 5763795 5387118 5838153 5368024 5602652 5096215
16616E096215K11637m33554K97076p3628l68563r7282J2106J43478k93633k77597
$$ 5096215 5307852 4874298 5171374 5097746 4729183 4631901 4644007 4787485 4493852 4216255
16606D216255q5729j37666o0910K48536k52881j42708K24287j25276j01539j42732
$$ 4216255 4130526 3992860 3931950 4180486 3927605 3784897 4009184 3883908 3782369 3639637
16596C639637q7719j7396k66968N14370o10915R1063n9523m2537J20729m08318
$$ 3639637 3551918 3534522 3267554 3781924 3171009 3262072 3202549 3160012 3280741 2872423
16586B872423L23025m2155r3124n9262j28510j4293m2440p798j1066k27095L42322
$$ 2872423 3195448 3153293 3060169 3000907 2872397 2858104 2815664 2807866 2796800 2569705 2912027
16575B912027l07966j08712J42352k63848M29138j98415j82211J1094K09772l26040
$$ 2912027 2604061 2495349 2637701 2373853 2802991 2604576 2422365 2433459 2643231 2317191
16565B317191k3542j04475L7895P496k80021J59491j61913j91507K84384P3935
$$ 2317191 2293649 2189174 2227069 2234565 1954544 2114035 1952122 1760615 2044999 2118934
16555B118934l0147k98929J64294n5344k70065K42021N494J05573J73070l52025
$$ 2118934 2088787 1789858 1954152 1898808 1628743 1870764 1876258 1981831 2154901 1802876
16545A802876k43966J34442m8232M04294l40577j9330N628j71711N15047j49887
$$ 1802876 1558910 1693352 1645120 2049414 1708837 1689507 1695135 1523424 2038471 1888584
16535A888584l18279Q9051K13746k43767k96880Q5526K80920N9134l32170j4529
$$ 1888584 1570305 1659356 1873102 1629335 1332455 1417981 1698901 1758035 1425865 1411336
16525A411336L7125j52267N31422m42279k17595L97719l26594J91058j02394R8342
$$ 1411336 1448461 1296194 1827616 1385337 1167742 1565461 1238867 1429925 1327531 1425873
16515A425873r993M406M9895k45841j63515L16817j28439j54680j19506L28576
$$ 1425873 1415880 1420286 1470181 1224340 1060825 1377642 1249203 1094523 975017 1303593
16505A303593j33500J31140k85528M220l5740R896N649J23553j19803K16806m04617
$$ 1303593 1170093 1301233 1015705 1019925 984185 994081 999730 1123283 1003480 1220286 815669
16494H15669K67646k53436J65957J43203m1689j06004k27082L06135o8615J26929
$$ 815669 1083315 829879 995836 1139039 1097350 991346 764264 1070399 1001784 1128713
16484A128713j81606l2985J20863l35719M03911l11968J18034K43128l31118o8806
$$ 1128713 947107 914122 1034985 699266 1103177 791209 909243 1152371 821253 752447
16474G52447M32924n55630J37690J01531j01084K5918K3084P8909l55670K87411
$$ 752447 1185371 629741 767431 868962 767878 793796 816880 895789 540119 827530
16464H27530j47589j23651J82053O4243j43815K13117J77121k56460J69280j79560
$$ 827530 679941 556290 738343 802586 658771 871888 1049009 792549 961829 782269
16454G82269K8292o1194O1980J8902L189K1217C94141N63315k58902J95537l88037
$$ 782269 810561 749367 811347 830249 833438 854655 394141 957456 698554 894091 506054
16443E06054M02543n7228j05725B71091O15276k33170o4162J67603Q5350j79060
$$ 506054 908597 851369 745644 271091 886367 653197 589035 756638 841988 662928
16433F62928o2016k29669L19020q3940K13771J08171C33356L59138m0915C25405
$$ 662928 600912 371243 690263 606323 820094 928265 333356 692494 651579 325405
16422G03116k83558L01265o2680J00738k86978M92303k52070k78071M24365k21133
$$ 703116 419558 720823 658143 758881 471903 964206 712136 434065 858430 637297
16412F37297j48057p8161J54403A71237M87360A82746N02078k89929m1926M32195
$$ 637297 489240 411079 565482 171237 658597 182746 684824 394895 352969 785164
16402G85164C84418L7932K56079n5925B64435L95803B02491K76416r5896A78857
$$ 785164 384418 422350 678429 622504 264435 660238 202491 478907 383011 178857
16391A78751K60224j87415K17985j8380K94227k06300j03380j35233K98979K77939
$$ 178751 438975 251560 469545 451165 745392 539092 435712 300479 599458 877397
16381H77397D20431L76052k91398K63104B78529J04295q4356L6439A32053M02465
$$ 877397 420431 796483 505085 768189 278529 382824 298468 334907 132053 534518
16371E34518J03206k61971K22343k93889R7789L43342A65640K14376k5427j50826
$$ 534518 637724 375753 598096 304207 401996 745338 165640 380016 354589 203763
16361B03763J88318A4552N27639O1890J9873r6610m4091o1429K27650k02419j47039
$$ 203763 392081 14552 542191 604081 623954 527344 483253 421824 649474 447055 300016
16350C00016K38538j44243A53368k9182J59757J27373j35444j26112J50872J08144
$$ 300016 538554 394311 153368 124186 283943 411316 275872 149760 300632 408776
16340D08776j63619J40790A68075P1887M2108B4061N34995k27051k2011K01110
$$ 408776 245157 385947 168075 239962 282070 24061 559056 332005 309994 511104
16330E11104j8830l3401j02202R6233H89N53115H0951M44281k37158L50879k58056
$$ 511104 492274 458873 356671 452904 889 554004 80951 525232 288074 638953 380897
16319C80897K59563k96803o3071L08930k86203o0032J98645k18571J5901J21528
$$ 380897 640460 343657 280586 589516 303313 243281 441926 223355 239256 360784
16309C60784j10258K70007j39834J26135a3876B07596J33226J8615j03126r257
$$ 360784 250526 520533 380699 506834 -13876 207596 340822 359437 256311 247054
16299B47054J0501r7021K76853o1686J16085f2559r1328B28638R7877p8622r002
$$ 247054 257555 160534 437387 375701 491786 -62559 -153887 228638 326515 247893 238891
16288B38891J72764A0372K31287N494L4821O6092K6791m3851N4198j41030D6129
$$ 238891 411655 10372 241659 247153 281974 348066 374857 331006 385204 244174 46129
16276B13772F7207M401J35193P1620J3749o0845J50941j81556O3069l3558O0241
$$ 213772 67207 71608 206801 278421 292170 231325 382266 200710 263779 230221 290462
16265B90462B054K00811J31434p966j11533r3789K79184r6146r2588N3517J49426
$$ 290462 2054 202865 334299 326333 214800 121011 400195 304049 211461 264978 414404
16254D14404k05762R0607d0185J0845f046C50239E4116Q0823P6833N3935i1800
$$ 414404 208642 299249 -40185 -29340 -6046 350239 54116 134939 211772 265707 -91800
16242C6843M4591K79689g1369A34487O7947f8232A8185f6199F4485L30025A02389
$$ 36843 81434 361123 -71369 134487 202434 -68232 18185 -66199 64485 394510 102389
16230A26756J75648C3974L13657A37561J05024C7832M954M00835H8942c2345B19756
$$ 126756 302404 33974 347631 137561 242585 37832 42786 443621 88942 -32345 219756
16218a34854A60041K46704j68359J72425M5686G4449e8188I9091L47805j51339
$$ -134854 160041 406745 238386 410811 456497 74449 -58188 99091 446896 295557
16208B95557b01626G8964J17426Q1549b30727B70082O7627B8046b7391H2455b4407
$$ 295557 -201626 78964 196390 277939 -230727 270082 337709 28046 -27391 82455 -24407
16196B64403A19936j0248J6349B358a42961A85492P6921a5384A41123b0668A72167
$$ 264403 119936 109688 126037 2358 -142961 185492 262413 -15384 141123 -20668 172167
16184c90099C04636a50555A11028O1678L3627I8962e7783B7776L56739q550e1001
$$ -390099 304636 -150555 111028 172706 206333 98962 -57783 27776 384515 375965 -51001
16172C0647L09927a56549C16850c6530B9556c61997H7621Q0122m0607J78584E1598
$$ 30647 340574 -156549 316850 -36530 29556 -361997 87621 167743 127136 305720 51598
16160E3968b2639D17353f5627o5753D75400E4474d7744A61907F7863K63457f4896
$$ 53968 -22639 417353 -65627 -131380 475400 54474 -47744 161907 67863 331320 -64896
16148C75479A66780g3367r6831B42228A04658B4314M5938e5372C59882g4787j79395
$$ 375479 166780 -73367 -170198 242228 104658 24314 70252 -55372 359882 -74787 -254182
16137b54182A22926K09271j48462O5588k0550r2482C3111a01604D2134N1438N224
$$ -254182 122926 332197 183735 249323 228773 136291 33111 -101604 42134 93572 98796
16126I8796H346J74142J26687h5236j4393A14538K65685C8193K27222j00591J4771
$$ 98796 8346 182488 309175 -85236 -99629 114538 380223 38193 265415 164824 179595
16115A79595a05437A49195b05298I0464A068J66440j0965J7507p9446J93638c03364
$$ 179595 -105437 149195 -205298 90464 1068 167508 156543 174050 94604 288242 -303364
16103a33992A26315K73215j15271I83c204k05616A18353J85313m9341c37714i4986
$$ -133992 126315 399530 284259 983 -3204 -208820 118353 303666 254325 -337714 -94986
16091b58823C25061c7476A11772C6576L3558g9404a5337A49164D6338q342a90586
$$ -258823 325061 -37476 111772 36576 70134 -79404 -15337 149164 46338 37996 -190586
16079c89555i5340j40537B60730b44387B78831a10597J0245C0072h9070E0620
$$ -389555 -95340 -235877 260730 -244387 278831 -110597 -100352 30072 -89070 50620
16068a20062A1096K37695a13492E3285c2041E7444J21710D9400N418g1878J0811
$$ -120062 11096 248791 -113492 53285 -32041 57444 179154 49400 54818 -71878 -61067
16057f1067B55061a85059K0859A51187b58397m1633f2120n5570c0263F3152K09660
$$ -61067 255061 -185059 -164200 151187 -258397 -300030 -62120 -117690 -30263 63152 272812
16046B72812A18334O5366R1478a13319d6934C06316A47869b79849F0422i0767
$$ 272812 118334 183700 275178 -113319 -46934 306316 147869 -279849 60422 -90767
16035C06769a81515A7460K27966A05355J11778C6884N8927a72131A89435j2754
$$ 306769 -181515 17460 245426 105355 217133 36884 95811 -172131 189435 176681
16025A76681b3998A61770m3281a45402d569l5909l22127A49557g7421k97015A7903
$$ 176681 -23998 161770 118489 -145402 -4569 -40478 -362605 149557 -77421 -374436 17903
16013b02859P1624k2116g2094f94B22077a77157g014B66851b6028m5965n139K062
$$ -202859 -131235 -153351 -72094 -694 222077 -177157 -7014 266851 -26028 -71993 -77132 -75070
16001g5070I735c6329j00706I5934K0543k8461a16644A51632f2971m224B9792
$$ -75070 9735 -36329 -137035 95934 116477 88016 -116644 151632 -62971 -67195 29792
15989i5967I1980N6342a78326A9050L14848g8105D85755B15515b57706C749b39582
$$ -95967 91980 148322 -178326 19050 333898 -78105 485755 215515 -257706 3749 -239582
15977A99109J34994H5199b65542L2358f8458l4644j73915A60081J39770d3323
$$ 199109 334103 85199 -265542 -233184 -68458 -103102 -277017 160081 299851 -43323
15966A03337g0937A63921l1976c7241J0282A41692j247b57797a16955A86492a94759
$$ 103337 -70937 163921 131945 -37241 -26959 141692 140445 -257797 -116955 186492 -194759
15954A81453H7892b00437E4014Q058c42991a11352c7937r6529f923I8361f3743
$$ 181453 87892 -200437 54014 62072 -342991 -111352 -37937 -134466 -6923 98361 -63743
15942a88276K9319j11616b5530G4068j8993d26134J99543O2331B6152a16054A47446
$$ -188276 -158957 -270573 -25530 74068 55075 -426134 -226591 -164260 26152 -116054 147446
15930a17102A6506a00672I2664d74387D54499D4169d1731r5346j53781N211A28133
$$ -117102 16506 -100672 92664 -474387 454499 44169 -41731 -137077 -290858 -285647 128133
15918f9531a8147p806A92186C1177a68256E73470H1602a2153q557l53664R9384
$$ -69531 -18147 -25953 192186 31177 -168256 573470 81602 -12153 -20710 -374374 -274990
15907b74990D51309a94086h9249n2988k12704A01613m5389J51455a22321A44016
$$ -274990 451309 -194086 -89249 -142237 -354941 101613 56224 207679 -122321 144016
15896b2405q4739q4096B40082B5391b91550K0932a32816B18769N0911a88894L9158
$$ -22405 -107144 -191240 240082 25391 -291550 -270618 -132816 218769 269680 -188894 -149736
15885a49736m27638e7658K8807I1753f2191j241j10332A7610b1077D3788b45299
$$ -149736 -577374 -57658 -28851 91753 -62191 -63432 -173764 17610 -21077 43788 -245299
15873B00116a66864j20057d1691m7963L2930I986e706F7845b70801R9223A40516
$$ 200116 -166864 -286921 -41691 -89654 -56724 9986 -5706 67845 -270801 -171578 140516
15861a19450A64161a52640o349c1480k91126g0893A78782D7779P9036a26570k7301
$$ -119450 164161 -152640 -158989 -31480 -322606 -70893 178782 47779 126815 -126570 -153871
15850a53871I9074d4840F3430Q7022n1470b66041a4030j26573a8174E8103h7690
$$ -153871 99074 -44840 63430 150452 98982 -266041 -14030 -140603 -18174 58103 -87690
15838b53731A98890b09837f590K72F7712K1167P4397a36273H835c8039E3197h9500
$$ -253731 198890 -209837 -6590 -6318 67712 88879 163276 -136273 8835 -38039 53197 -89500
15825h7996p0897j02592B82492a31769e7360B69802b10701l1869a4413n22A57998
$$ -87996 -158893 -261485 282492 -131769 -57360 269802 -210701 -242570 -14413 -14935 157998
15813A844J34833J8689N8677a16817j03127b7075B26338b48024A76920J98603
$$ 1844 136677 155366 214043 -116817 -219944 -27075 226338 -248024 176920 375523
15803C75523j08792a17117A82114a71912e5160B04186n4903k850a08796K9748
$$ 375523 266731 -117117 182114 -171912 -55160 204186 149283 146433 -108796 -79048
15793g9048A77048F5640L288b03155C8372h4089a8082j76924g5182j86992F1855
$$ -79048 177048 65640 68928 -203155 38372 -84089 -18082 -195006 -75182 -262174 61855
15781b1069p0995L7329B5690a59228j65619B20775A10200b16736q1483a6408j1665
$$ -21069 -92064 -54735 25690 -159228 -324847 220775 110200 -216736 -298219 -16408 -28073
15770b8073j04729q1659B59338p0734g2637J6935j13208m6141f0454q6928J1722
$$ -28073 -132802 -214461 259338 188604 -72637 -55702 -168910 -215051 -60454 -147382 -135660
15759a35660B46856b3849A88094q8832l3558a37877I7875J59127a26431G3297
$$ -135660 246856 -23849 188094 99262 65704 -137877 97875 257002 -126431 73297
15748B3453h5386B98963D0350a07245A4238a12747H1554R6566q0570m0167B6020
$$ 23453 -85386 298963 40350 -107245 14238 -112747 81554 178120 97550 57383 26020
15736a8651D6631J17945b88175J2913h0819D1225a6437E7781k6048d2338A81236
$$ -18651 46631 164576 -288175 -275262 -80819 41225 -16437 57781 31733 -42338 181236
15724a38087B21074a5957A17559i6994d5898q3594A34995c6988B58384d3931G4866
$$ -138087 221074 -15957 117559 -96994 -45898 -129492 134995 -36988 258384 -43931 74866
15712a59532O9059B4024d81457b6013m3663j23544B00326c73435R9815a09469
$$ -159532 -90473 24024 -481457 -26013 -69676 -193220 200326 -373435 -273620 -109469
15701a03833M3276j45132A63907a83505L3921j7289A43843G193b4163B54168a08157
$$ -103833 -60557 -205689 163907 -183505 -149584 -166873 143843 7193 -24163 254168 -108157
15689b51821g6271L2972o4397H7840J1670b42598a08891K1822A11348a81685R0722
$$ -251821 -76271 -43299 -107696 87840 99510 -242598 -108891 -87069 111348 -181685 -90963
15678i0963A28208b07103g9223j611f367q3059a4274B76437l6456k5249b11469
$$ -90963 128208 -207103 -79223 -80834 -6367 -89426 -14274 276437 239981 214732 -211469
15666G9024B3011L10501o1245a9972I7263Q6803a78805a0856A99317D9612M3684
$$ 79024 23011 333512 272267 -19972 97263 184066 -178805 -10856 199317 49612 93296
15655I3296b29587Q342A37885d27535A6310R7245K71943a09243A4980a63344a1198
$$ 93296 -229587 -221245 137885 -427535 16310 113555 385498 -109243 14980 -163344 -11198
15643b20511g1259H5033C2600C502b48084c7300j2079j26175A94181i7377B6291
$$ -220511 -71259 85033 32600 3502 -248084 -37300 -49379 -175554 194181 -97377 26291
15631a51188F2290g3134n0090c2425m1012A77483b22568C3829b40855C23890a99785
$$ -151188 62290 -73134 -123224 -32425 -73437 177483 -222568 33829 -240855 323890 -199785
15619B52194b1287A01817b48367i0621n932A01648a54198r8034H3443j6041M6810
$$ 252194 -21287 101817 -248367 -90621 -96553 101648 -154198 -252232 83443 67402 114212
15608A14212b71194f3665n6425q5752o3394J29221B3697c24670J00842B2604L29630
$$ 114212 -271194 -63665 -120090 -205842 -269236 -140015 23697 -324670 -223828 22604 352234
15597C52234j07268C7647M16632f7808h161j9947k49601C189J5223i2397A01931
$$ 352234 244966 37647 454279 -67808 -8161 -28108 -277709 3189 18412 -92397 101931
15585d5959B10863n0945l7193a5539j37963n8843D5861b6476k16934p559d8149
$$ -45959 210863 159918 122725 -15539 -153502 -212345 45861 -26476 -243410 -250969 -48149
15573c12986c8816A28521L7633I001c22148A44158a85087J0407D2488P7027a29925
$$ -312986 -38816 128521 166154 9001 -322148 144158 -185087 -174680 42488 119515 -129925
15561a91367A1756J0573O2988g6400A09790E4790k0806i0997p9294J1123A12789
$$ -191367 11756 22329 85317 -76400 109790 54790 33984 -90997 -170291 -159168 112789
15549a24739A86999K0680A5645a06490M8226m9650q4752A81273A3420R3328C3321
$$ -124739 186999 207679 15645 -106490 -58264 -107914 -192666 181273 13420 106748 33321
15537A09991G138a20938A84723b20081g4486B20470e7101A34446e0473A40959
$$ 109991 7138 -120938 184723 -220081 -74486 220470 -57101 134446 -50473 140959
15526B3566a90185I4387a79781b2936j15259i375m76975D636b34081H8465e7039
$$ 23566 -190185 94387 -179781 -22936 -138195 -9375 -486350 4636 -234081 88465 -57039
15514B06455h2063n3781A3009c2638H524b93783D3132K14218A1502h2827j96457
$$ 206455 -82063 -135844 13009 -32638 8524 -293783 43132 257350 11502 -82827 -279284
15503b79284g0297k35658Q6306r4878E4446a11857A27474a2599B20897a86787
$$ -279284 -70297 -305955 -219649 -314527 54446 -111857 127474 -12599 220897 -186787
15492B16265a24139C9101b09181K2882G0200R8832E2233b56081a2313D6421A73
$$ 216265 -124139 39101 -209181 -186299 70200 169032 52233 -256081 -12313 46421 173
15480C3498M4756i9898c0198p2687a6802l0757B65695f1633q1741A44480f2278
$$ 33498 78254 -99898 -30198 -102885 -16802 -47559 265695 -61633 -143374 144480 -62278
15468D785b08644g4339l1725b9362j41132e0618j06842C1394K42134I2805c1332
$$ 4785 -208644 -74339 -106064 -29362 -170494 -50618 -157460 31394 273528 92805 -31332
15456G3189J3018J90843e9201C63364F5318a68665Q1830B52932A2875f013j80468
$$ 73189 86207 277050 -59201 363364 65318 -168665 -86835 252932 12875 -6013 -186481
15445a86481g8678A69746K48309c8596H8082J7867j9492J01897a91836g8575L9022
$$ -186481 -78678 169746 418055 -38596 88082 105949 86457 188354 -191836 -78575 -39553
15434c9553A68870f5099q7336O8889D8570D104a74729B9480d02400B97170A6621
$$ -39553 168870 -65099 -152435 -83546 48570 4104 -174729 29480 -402400 297170 16621
15422H5769a7396j56924o6950G3897N5278h0150j34864K8764A87848e4764A08830
$$ 85769 -17396 -174320 -241270 73897 129175 -80150 -215014 -186250 187848 -54764 108830
15410F598K29018d7983o7113j6410k21171a8887o1023K5603C02770F0881a9799
$$ 6598 235616 -47983 -115096 -131506 -352677 -18887 -79910 -54307 302770 60881 -19799
15398d4965b1894j66764c3906q2014o489L0635a5671H7633j1577j5579Q4117A5194
$$ -44965 -21894 -188658 -33906 -115920 -122409 -91774 -15671 87633 76056 60477 144594 15194
15385A93673d9674l12587a59015L1121F7924e5410k9005B43479J498J78591j98446
$$ 193673 -49674 -362261 -159015 -127894 67924 -55410 -84415 243479 244977 423568 225122
15374B25122f9934A18287L5342a46997j87538P4237A11947J55647a30067j6602
$$ 225122 -69934 118287 153629 -146997 -334535 -260298 111947 267594 -130067 -146669
15364a46669A07529a37086j99661G3440b22840P4878a9623p1040B62655p2150
$$ -146669 107529 -137086 -336747 73440 -222840 -147962 -19623 -90663 262655 190505
15354A90505l5299c9995B05686E8149c70569Q0894B03547a91025A86939H9754
$$ 190505 155206 -39995 205686 58149 -370569 -289675 203547 -191025 186939 89754
15343a18346E162b43135B67310b39665A88391H323a43605O0826B12160D5755a54003
$$ -118346 5162 -243135 267310 -239665 188391 8323 -143605 -82779 212160 45755 -154003
15331A58121e5713j78243G3042a13586B31978c77330a55300n3065A06247J51784
$$ 158121 -55713 -233956 73042 -113586 231978 -377330 -155300 -208365 106247 258031
15321B58031A20007h3710j44036a4621B60561b07489o1445M5951f071l72354a81703
$$ 258031 120007 -83710 -227746 -14621 260561 -207489 -268934 -222983 -6071 -378425 -181703
15309A03759K9864R0462H2981R1903J35546j07382c93442a5274j72A91262a8317
$$ 103759 133623 224085 82981 174884 310430 203048 -393442 -15274 -15446 191262 -18317
15297d3222C34326h6584b4756B10523G4332k2053J53567R374e4514I9948m4155
$$ -43222 334326 -86584 -24756 210523 74332 52279 205846 215220 -54514 99948 55793
15286E5793c0734B33107j08084f9747l08045h7389C9768g5672a7407k2467D2238
$$ 55793 -30734 233107 125023 -69747 -377792 -87389 39768 -75672 -17407 -39874 42238
15274A3921a6783A99356A3905J48085a3103A41489N4861F5661a0901A24221D4380
$$ 13921 -16783 199356 13905 161990 -13103 141489 196350 65661 -10901 124221 44380
15262D2778a35506E9786a69615B97897j34223Q2093d66842B08616a80015A88013
$$ 42778 -135506 59786 -169615 297897 163674 245767 -466842 208616 -180015 188013
15251A00525d9539A63735J18446j5779a28891B96713A26501D4440i0496C39523
$$ 100525 -49539 163735 282181 266402 -128891 296713 126501 44440 -90496 339523
15240B65200a76687c0619A46133a23184a2671k05498p5538A46974h9498A82829
$$ 265200 -176687 -30619 146133 -123184 -12671 -218169 -293707 146974 -89498 182829
15229a08583A13958c48130B5452b42884A75774K23650b26777k7798A21957a33259
$$ -108583 113958 -348130 25452 -242884 175774 399424 -226777 -254575 121957 -133259
15218A12146c9651C90337a7642C93616a8982C50369I5860j0153K16548A17582
$$ 112146 -39651 390337 -17642 393616 -18982 350369 95860 85707 302255 117582
15207E1450a70115B02726E8731b9188A06219a05107A42449c34132A43784K92860
$$ 51450 -170115 202726 58731 -29188 106219 -105107 142449 -334132 143784 436644
15197D36644A42919j6582n1198c08408a46016A4843e9657A95080N7756l600a05238
$$ 436644 142919 126337 75139 -308408 -146016 14843 -59657 195080 252836 249236 -105238
15185E8313M8617K74204q8460A17895a38829I544g5936A41468j9561N4102a21368
$$ 58313 106930 381134 292674 117895 -138829 9544 -75936 141468 121907 176009 -121368
15173d5761k00546C6793b10339A64721b73960o7834a182j94396A62168J13661
$$ -45761 -246307 36793 -210339 164721 -273960 -341794 -1182 -195578 162168 275829
15163B75829D6563N9823R368J94613B2399J1078b226B30626a0716A25968J7379
$$ 275829 46563 106386 115754 310367 22399 33477 -2226 230626 -10716 125968 143347
15152A43347h3280B7570a00659A76647l6954g1189D93575i8979A80143c9306B00943
$$ 143347 -83280 27570 -100659 176647 139693 -71189 493575 -98979 180143 -39306 200943
15140A36597J82069d8294B16158b57989A7820J17800k2898A6477N14804a82820
$$ 136597 318666 -48294 216158 -257989 17820 135620 112722 16477 531281 -182820
15129e3632I535a45077K8036L3165G9903J55403L9530A10723a84627J8316P5815
$$ -53632 9535 -145077 -117041 -83876 79903 235306 274836 110723 -184627 -166311 -90496
15118i0496L5282A73251a00860A09636q247K17987A23434C7873L4028J65072I5237
$$ -90496 -55214 173251 -100860 109636 101389 319376 123434 37873 71901 236973 95237
15106B88542b526D86744A37788D3191k0861K55901I3589M23834j81745G1984M3724
$$ 288542 -2526 486744 137788 43191 22330 278231 93589 517423 335678 71984 115708
15095A15708b44246C88476a12242A53754n3095a56004D0660J69452p2023L6700
$$ 115708 -244246 388476 -112242 153754 100659 -156004 40660 210112 138089 174789
15085A74789G5636J19220J34166A21135J72054q6920J99966l0146A67785G6568
$$ 174789 75636 194856 329022 121135 293189 206269 406235 376089 167785 76568
15074A13144K64455B53K52566J01903A17131C3001N6438M9419O988a59643A22126
$$ 113144 377599 253 252819 354722 117131 33001 89439 138858 145846 -159643 122126
15062A03972i6829E01826h0289A0457J53215a0809E0721L29149A21810J86778
$$ 103972 -96829 501826 -80289 10457 163672 -10809 50721 379870 121810 308588
15052C08588B2607K49447a75598A17517J75587N6549A32976A0008N4214O0646
$$ 308588 22607 272054 -175598 117517 293104 349653 132976 10008 64222 124868
15042A24868A8650K59341b38178B9972Q3246J3379M6578B4705K1235K08303i2860
$$ 124868 18650 277991 -238178 29972 113218 126597 173175 24705 45940 254243 -92860
15030D65334A73301J98769N5882A74831n4613C6638K00692Q3140a71172A26687
$$ 465334 173301 372070 427952 174831 120218 36638 237330 320470 -171172 126687
15019H7230L21243j49907j07940e2505B96900d5384B32875L07375B38199K96135
$$ 87230 408473 258566 150626 -52505 296900 -45384 232875 540250 238199 534334
15009E34334a0950F7283L86022A22899J416J54673j11574L44519A55566f1727
$$ 534334 -10950 67283 453305 122899 124315 278988 167414 511933 155566 -61727
14998A33310n551L00536j27519n1924J9120r6211j7699k0686J43909l9426r0697
$$ 133310 127759 428295 300776 248852 267972 171761 154062 133376 277285 237859 147162
14987A47162J24459K15275B5943L46708F3637K06540j16114R8274r5379J98363
$$ 147162 271621 486896 25943 372651 63637 270177 154063 252337 156958 355321
14977C55321q4789K7210j12023n64e914C46686n8374c0769B83846M5304Q3748
$$ 355321 270532 297742 185719 185155 -5914 346686 288312 -30769 283846 329150 412898
14966D12898j93071j2092l8103J26174A35532N5526L32862j49861m802j27167
$$ 412898 219827 207735 169632 295806 135532 191058 523920 374059 369257 242090
14956B42090o5549E8855K48060I3018L07768H2012J38897j03394J56674j08949
$$ 242090 176541 58855 306915 93018 400786 82012 220909 117515 274189 165240
14946A65240P7213J33020A00659K32306J01973j01002A34509K29869A70956L04099
$$ 165240 242453 375473 100659 332965 434938 333936 134509 364378 170956 475055
14936D75055B13262b82502i6815C20662M37183c408A26900J84222J9653A21751
$$ 475055 213262 -282502 -96815 320662 757845 -3408 126900 311122 330775 121751
14925E77690j41794a132B70343C4566P8763K64654m2574A59894J91370J2865A23215
$$ 577690 435896 -1132 270343 34566 113329 377983 335409 159894 351264 364129 123215
14913b5825B28123B8241K12586m5681F4394a6703C72956j64051K55109r7818r6663
$$ -25825 228123 28241 240827 195146 64394 -16703 372956 208905 464014 366196 269533
14902B69533q9191M208K08594K89412A90308B044M99721P8089B21801R1145i7997
$$ 269533 180342 184550 393144 682556 190308 2044 501765 579854 221801 312946 -97997
14890D60550j63320J99565j48594K23817B05896J48558P3601j19919p8417m8201
$$ 460550 297230 496795 348201 572018 205896 354454 428055 308136 229719 181518
14880A81518O1393K40221p4306A96948h3941D48698j73723J81638J4095A47993
$$ 181518 242911 483132 408826 196948 -83941 448698 274975 456613 470708 147993
14869E76385m9169A10149N37899B24386J57872J92458k85115J1524M15867B56685
$$ 576385 527216 110149 648048 224386 382258 574716 289601 301125 716992 256685
14858D58249A90802K67485j57811P706j20286M39671l07377n3088J49576M0554
$$ 458249 190802 458287 300476 308182 187896 627567 320190 267102 416678 457232
14848D57232r9072j4479L077J18711M7612B50203J94618R8499j89125n3024N8634
$$ 457232 358160 343681 346758 465469 513081 250203 444821 543320 354195 301171 359805
14837C59805J83526r3583M4819j02129r8110M3173K28058B60623Q212P9455K93309
$$ 359805 543331 449748 494567 392438 294328 337501 565559 260623 268835 348290 641599
14826F41599B83039M75902j74135k75749m3726K80657A55651N51371k81021m9114
$$ 641599 283039 758941 584806 309057 265331 545988 155651 707022 426001 376887
14816C76887o9702J75225q8575J65759B45156J87332K37759n9418B56970k7760
$$ 376887 307185 482410 393835 559594 245156 432488 670247 610829 256970 229210
14806B29210J76652j42402O01115k12971k26737Q9909r8808L21306l55427M3234
$$ 229210 405862 263460 864575 651604 424867 514776 415968 737274 381847 425081
14796D25081K28238C01029L18960q0664J31142k03019k29992j00160L75931P2807
$$ 425081 653319 301029 619989 539325 670467 467448 237456 137296 513227 586034
14786E86034M9974R892l08052J03231M3912l0355L94470j46113l30056J20265
$$ 586034 636008 645900 337848 441079 484991 454636 849106 702993 372937 493202
14776D93202J8828L3050j23342j3848L2537K46349n1750J57216j14359r7143J762
$$ 493202 512030 545080 421738 407890 440427 686776 635026 792242 677883 580740 582502
14765E82502j94488J55184K4905k631r6608J8614R6947q5202O9702B73160P24260
$$ 582502 388014 543198 568103 565472 468864 487478 584425 499223 568925 273160 997420
14754I97420k42067j94005q0297j68126L92415k18070N86646m62407j65128M42631
$$ 997420 755353 561348 481051 312925 705340 487270 1073916 611509 446381 889012
14744H89012C94575o5370O63916k42639j52580N9494l8386P7965r7219J08701
$$ 889012 394575 329205 993121 750482 597902 657396 619010 696975 599756 708457
14734G08457J50808l29958J10591M1276m2006k1911L00931l73631K02833J43184
$$ 708457 859265 529307 639898 681174 639168 617257 918188 544557 747390 890574
14724H90574j93285J90774l35283L15493j3820Q3179k09591M02734k07473r0343
$$ 890574 697289 888063 552780 868273 854453 937632 728041 1130775 923302 832959
14714H32959j84263j13091Q3513K44636k06654K16344J3645J98626j71374o0038
$$ 832959 648696 535605 619118 863754 657100 873444 887089 1085715 914341 854303
14704H54303o995n5744K64905m50291K65781j9010J94198j57579k05325N00631
$$ 854303 847308 791564 1056469 606178 871959 852949 1047147 889568 684243 1184874
14694A184874n5477l90099L277k94482N67133j41122j08473k3855j06960k22591
$$ 1184874 1129397 739298 742575 448093 1015226 874104 765631 741776 634816 412225
14684D12225M76535k61931L92394M9529K92214k60008m64864M61920J47453k91716
$$ 412225 888760 626829 1019223 1068752 1360966 1100958 636094 1098014 1245467 953751
14674I53751J20747r8352K09902m74021J58526M94848q1400j99132k00178n4631
$$ 953751 1074498 976146 1186048 712027 870553 1365401 1284001 1084869 884691 830060
14664H30060N13565q7400k42910K12216j31663K71265n99323Q6447K45839M19058
$$ 830060 1343625 1256225 1013315 1225531 1093868 1365133 765810 852257 1098096 1517154
14654A517154l61786r4392j9092J93621J28365k77671j09128l49921O69332l03064
$$ 1517154 1155368 1060976 1041884 1235505 1363870 1086199 977071 627150 1296482 993418
14644I93418J26156l00719L47650J8170p8509J11517l5236m1699K94343J32652
$$ 993418 1119574 818855 1166505 1184675 1106166 1217683 1182447 1140748 1435091 1567743
14634A567743m43825L39041j97208n1977j96806K71653Q9073q8304J14938L69136
$$ 1567743 1123918 1462959 1265751 1213774 1016968 1288621 1377694 1289390 1404328 1773464
14624A773464n15260J194J86635j58375K71485K40067l16730m8918K506K44791
$$ 1773464 1258204 1259398 1446033 1287658 1559143 1799210 1482480 1433562 1436068 1680859
14614A680859k59078o7892J82741k17347J18121Q5449J4579r6841M67981n83495
$$ 1680859 1421781 1353889 1536630 1319283 1437404 1522853 1537432 1440591 1908572 1325077
14604A325077O07228n18945J49650J45272j50741J22825r8358k44o5948K22393
$$ 1325077 1932305 1413360 1563010 1708282 1557541 1680366 1582008 1581764 1515816 1738209
14594A738209M3269j10786n4634L5159J72008l14757K91054L67095n31545J57839
$$ 1738209 1781478 1670692 1616058 1651217 1823225 1508468 1799522 2166617 1635072 1792911
14584A792911J899L03137p2771j8317k05241j28409K74784r2746K84768k18723
$$ 1792911 1794810 2097947 2025176 2006859 1801618 1673209 1947993 1855247 2140015 1921292
14574A921292n8056j2306K31554m431J91072n8923K11981l02533l8559K20789
$$ 1921292 1863236 1850930 2082484 2078053 2269125 2210202 2422183 2119650 2081091 2301880
14564B301880J69952k30615O29914k11676J55294m54390P06848J84761j62361
$$ 2301880 2471832 2241217 2871131 2659455 2814749 2360359 3067207 3251968 3089607
14555C089607L44132k29956O18846K2429J487621P75522J629606M002603R942749
$$ 3089607 3433739 3203783 3822629 3845058 5332679 6108201 7737807 11740410 21683159
14546B1683159J8041933j862128j8659520I549211m090110j475961r05409o96118
$$ 21683159 39725092 37862964 19203444 9549211 5459101 3983140 3077731 2381613
14538B381613O4071m87544L25136P370l56699J26870J30555j0358J22370k84357
$$ 2381613 2445684 1958140 2283276 2290646 1933947 2060817 2191372 2181014 2303384 2019027
14528B019027M31361j23952J71120m0810J26244K79046n11966J97959k12207J72998
$$ 2019027 2450388 2326436 2497556 2456746 2582990 2862036 2350070 2548029 2335822 2508820
14518B508820q0241K35145l74095N17458q5662Q3812j89229K43837j74514O2830
$$ 2508820 2428579 2663724 2289629 2807087 2721425 2805237 2616008 2859845 2685331 2748161
14508B748161j23589M42189k38063o2487l22405M66472K32949J09597r3552J15306
$$ 2748161 2624572 3066761 2828698 2766211 2443806 2910278 3143227 3252824 3159272 3274578
14498C274578P6088k15893K12076j15015j99294L77518M3147P1509k03822M65852
$$ 3274578 3350666 3134773 3346849 3231834 3032540 3410058 3453205 3524714 3320892 3786744
14488C786744j77163J80791l89845J35579j56523O25006j10372n3799j05738J77351
$$ 3786744 3609581 3790372 3400527 3536106 3379583 4004589 3894217 3840418 3734680 3912031
14478C912031K59359J28223l46367K49655L08507n44219K07444M40310l57316
$$ 3912031 4171390 4299613 3953246 4202901 4511408 3967189 4174633 4614943 4257627
14469D257627n1602j1908N12837j89745j66400M81743o8788n44630L76525l7036
$$ 4257627 4206025 4194117 4706954 4517209 4350809 4832552 4763764 4219134 4595659 4558623
14459D558623o6568J43642L29152K52035j97525o3329J76626J04728l2890J75416
$$ 4558623 4492055 4635697 4964849 5216884 5019359 4956030 5132656 5237384 5204494 5379910
14449E379910m5808M42308K0050j33654q8645j5008O54724l39741Q7063J3041
$$ 5379910 5334102 5776410 5796460 5662806 5574161 5559153 6213877 5874136 5961199 5974240
14439E974240k06393L35182K68160k63044L75460J53157j86189M02404J6151j12656
$$ 5974240 5767847 6103029 6371189 6108145 6483605 6636762 6450573 6852977 6869128 6756472
14429F756472K75149L36163m78056M15158Q2746J60848J84899j90309L042M67200
$$ 6756472 7031621 7367784 6889728 7304886 7387632 7548480 7733379 7543070 7546112 8013312
14419H013312k13730L08031L08322J09857l0106J70122J22994K35494M2431K02499
$$ 8013312 7799582 8107613 8415935 8525792 8495686 8665808 8788802 9024296 9066727 9269226
14409I269226M5190j750R042L95241o4888L17999J00248N26649K32016l10986
$$ 9269226 9314416 9312666 9321708 9716949 9652061 9970060 10070308 10596957 10828973 10517987
14399A0517987K85199M48977J14935j51834N19388K8592J11037N11043k92417
$$ 10517987 10803186 11252163 11367098 11215264 11734652 11763244 11874281 12385324 12092907
14390A2092907N15123J82593J96208n3245K80837M15833M24445p7836O15046K11101
$$ 12092907 12608030 12790623 12986831 12933586 13214423 13630256 14054701 13976865 14591911 14803012
14380A4803012K18687J85300K46246O23583k87372L94958M06955M36916K64978
$$ 14803012 15021699 15206999 15453245 16076828 15789456 16184414 16591369 17028285 17293263
14371A7293263O66160P7223L31647R7022O76944L61977L79579M67381O07517L18367
$$ 17293263 17959423 18036646 18368293 18465315 19142259 19504236 19883815 20351196 20958713 21277080
14361B1277080N63872L91597N80295M06689O00332N93252L13056N68547M70306
$$ 21277080 21840952 22232549 22812844 23219533 23819865 24413117 24726173 25294720 25765026
14352B5765026J055498N69563O33418M05983J078770Q62344P58515O55917P10136
$$ 25765026 26820524 27390087 28023505 28429488 29508258 30370602 31129117 31785034 32495170
14343C2495170Q15610N95849J174233Q83708J344276J061705O72660J204056J183032
$$ 32495170 33310780 33906629 35080862 35964570 37308846 38370551 39043211 40247267 41430299
14334D1430299J311124J152794J391048J447375J110515J854346J322192J891429
$$ 41430299 42741423 43894217 45285265 46732640 47843155 49697501 51019693 52911122
14326E2911122J393576J936749J700668K337367K063209J771805K473794K503422
$$ 52911122 54304698 56241447 57942115 60279482 62342691 64114496 66588290 69091712
14318F9091712K431993K727975K818577K626802L138037L155677L361031L960620
$$ 69091712 71523705 74251680 77070257 79697059 82835096 85990773 89351804 93312424
14310I3312424L580926M193946M518617M137349M831647N183397N202532N941237
$$ 93312424 96893350 101087296 105605913 109743262 114574909 119758306 124960838 130902075
14302A30902075N922560O179187O925997P221937P617035Q011170Q544115Q978067
$$ 130902075 136824635 143003822 149929819 157151756 164768791 172779961 181324076 190302143
14294A90302143R634354R941806J0473733J1308633J1794317J2024793J2637031
$$ 190302143 199936497 209878303 220352036 231660669 243454986 255479779 268116810
14287B68116810J3219228J3896948J3868635J4385631J4590569J4534873J4685205
$$ 268116810 281336038 295232986 309101621 323487252 338077821 352612694 367297899
14280C67297899J4094800J3693815J3110087J2170534J0855634R742633P927104
$$ 367297899 381392699 395086514 408196601 420367135 431222769 440965402 448892506
14273D48892506N952472K515014j099667j233433l227495n444384m700864o359924
$$ 448892506 454844978 457359992 456260325 455026892 451799397 446355013 441654149 435294225
14265D35294225p324479r331060j0530898j2325351j3007078j3906179j4472127
$$ 435294225 427969746 418638686 408107788 395782437 382775359 368869180 354397053
14258C54397053j4693090j4897996j4720706j4454412j3843986j3199454j2875709
$$ 354397053 339703963 324805967 310085261 295630849 281786863 268587409 255711700
14251B55711700j2485324j2137024j0987349j0652582j0319473r161327q996456
$$ 255711700 243226376 231089352 220102003 209449421 199129948 189968621 180972165
14244A80972165q341631q007051p876432p190149o596826o469530n645117n469384
$$ 180972165 172630534 164623483 156747051 149556902 142960076 136490546 130845429 125376045
14236A25376045n378834n065332m746950m702284m080135m005625l751750l705624
$$ 125376045 119997211 114931879 110184929 105482645 101402510 97396885 93645135 89939511
14228H9939511l438199l418322l064808k864525l011416k668611k174272k619729
$$ 89939511 86501312 83082990 80018182 77153657 74142241 71473630 69299358 66679629
14220F6679629j955310k506507j882472k040587j572427j883192j650217j243569
$$ 66679629 64724319 62217812 60335340 58294753 56722326 54839134 53188917 51945348
14212E1945348j842897j718213j369867j544972r24754q20887j373379j402502
$$ 51945348 50102451 48384238 47014371 45469399 44544645 43723758 42350379 40947877
14204D0947877j133544j409905o29870j231930n61062j008609j012571p54841
$$ 40947877 39814333 38404428 37774558 36542628 35981566 34972957 33960386 33205545
14196C3205545r85577o96981q78913o62109r50694n53427o95456n65577n36772
$$ 33205545 32219968 31522987 30644074 29981965 29031271 28477844 27782388 27216811 26680039
14187B6680039p40865p50472k96410n86130o18512m31201n60812p30830k71365
$$ 26680039 25939174 25188702 24892292 24306162 23687650 23256449 22695637 21964807 21693442
14178B1693442m04637k95196p83875j89444n16809k54067k68423n44188l99984
$$ 21693442 21288805 20993609 20209734 20020290 19503481 19249414 18980991 18436803 18036819
14169A8036819J8126o79249k39192l26093l95008m37613l06935K9989q3248o53145
$$ 18036819 18054945 17375696 17136504 16810411 16415403 15977790 15670855 15700844 15617596 14964451
14159A4964451l17061n6530k60444k04892m42869l35134K38101m93316j71972
$$ 14964451 14647390 14590860 14330416 14125524 13682655 13347521 13585622 13092306 12920334
14150A2920334l61392O2821k20378m98084q8553k85687M2235l25551k36930J55017
$$ 12920334 12558942 12621763 12401385 11903301 11814748 11529061 11571296 11245745 11008815 11163832
14140A1163832j52470k88010L4045l80838k14536p7809j21089n55710K46025j90553
$$ 11163832 11011362 10723352 10757397 10376559 10162023 10084214 9963125 9407415 9653440 9462887
14130I462887P9885k78926J15926k99806m27981J80625j06124k1770m48107K84431
$$ 9462887 9542772 9263846 9379772 9079966 8651985 8832610 8726486 8704716 8256609 8541040
14120H541040l80048k28726N0765M8291J15471k54152n9857k33527j70070J11037
$$ 8541040 8160992 7932266 7983031 8031322 8146793 7892641 7832784 7599257 7429187 7540224
14110G540224m8350n04402J50651l8450m55236L79420k31055j60056Q8588m54096
$$ 7540224 7491874 6987472 7138123 7099673 6644437 7023857 6792802 6632746 6721334 6267238
14100F267238K50188k77169K61239l37069P7350m82944K24836J21795j03572k67307
$$ 6267238 6517426 6240257 6501496 6164427 6241777 5758833 5983669 6105464 6001892 5734585
14090E734585j21527K66600l54519K17869K1546l37743P0404j21267r3689j25591
$$ 5734585 5613058 5879658 5525139 5743008 5764554 5426811 5497215 5375948 5282259 5156668
14080E156668K10601n09064J50959J32414k40712q4353K71521l08475J9470l09395
$$ 5156668 5367269 4858205 5009164 5141578 4900866 4816513 5088034 4779559 4799029 4489634
14070D489634K27457k64553n6320P003k6846j38602J45423P6861j52679r5979
$$ 4489634 4717091 4452538 4396218 4403221 4376375 4237773 4383196 4460057 4307378 4211399
14060D211399j97624P9304K4811J78831m08397R1463j18892O2096j36306j47671
$$ 4211399 4013775 4093079 4117890 4296721 3888324 3979787 3860895 3922991 3786685 3639014
14050C639014P9768q7006R3467M6792j80018l10860L27230l37942K16649j64488
$$ 3639014 3718782 3631776 3725243 3772035 3592017 3281157 3608387 3270445 3487094 3322606
14040C322606J48267j73000k34823N14609k26289J2811m1844l39802k1589K49782
$$ 3322606 3470873 3297873 3063050 3577659 3351370 3364181 3322337 2982535 2960946 3210728
14030C210728L17374m65203R9487M08811m19062m66692J12488J52162k61487J7299
$$ 3210728 3528102 3062899 3162386 3571197 3152135 2685443 2797931 2950093 2688606 2705905
14020B705905q9390K4171Q481P7078n2004j73038L54174k87058J31394l0038l50716
$$ 2705905 2616515 2640686 2649167 2726245 2674241 2501203 2855377 2568319 2699713 2669675 2318959
14009B318959J72031k11052P7544K84182n36891J61798K20856k25129R922N762
$$ 2318959 2490990 2279938 2357482 2641664 2104773 2266571 2487427 2262298 2272220 2277982
13999B277982L01305l14055j91110j992K35953J54096k5830J92784l38611O80600
$$ 2277982 2579287 2265232 2074122 2072130 2308083 2462179 2436349 2629133 2290522 2971122
13989B971122R44051K880863P874670J9195813O763671j5135346j1185549m485714
$$ 2971122 3915173 6796036 14670706 33866519 40630190 25494844 14309295 9823581
13981I823581l022960j227826j070247p36071j59191j33673m87671n7302p2013
$$ 9823581 6800621 5572795 4502548 3766477 3607286 3473613 2985942 2928640 2856627
13972B856627p6802N6617m86449M23327q6471m00748L59254k77903J1800J29094
$$ 2856627 2779825 2836442 2349993 2773320 2686849 2286101 2645355 2367452 2379252 2508346
13962B508346J05n1971l66001k473R5094n7604P7972k17581K2462M64943k54764
$$ 2508346 2508451 2456480 2090479 2088006 2183100 2125496 2203468 1985887 2008349 2473292 2218528
13951B218528k92127K65524l31393K20258J0772j79438N020J78218l94449m0280
$$ 2218528 1926401 2191925 1860532 2080790 2091562 1912124 1917144 2095362 1700913 1660633
13941A660633N27868k65238j39431o8996j13133J71023L60305n05669R7324L93810
$$ 1660633 2188501 1923263 1783832 1714836 1601703 1772726 2133031 1627362 1724686 2118496
13931B118496m63600K54310k64370j17658J85923j08644K40048l27446J20631
$$ 2118496 1654896 1909206 1644836 1527178 1713101 1604457 1844505 1517059 1637690
13922A637690K4632j58203K43686j8816l15102J62248K17276J46978m04254J65120
$$ 1637690 1662322 1504119 1747805 1728989 1413887 1576135 1793411 1940389 1536135 1701255
13912A701255m16041J6734j25453N27082k99586K90486n97960M10157Q0480j38096
$$ 1701255 1285214 1301948 1176495 1703577 1403991 1694477 1096517 1506674 1587154 1449058
13902A449058K17232l49547K98726k71279j55384L91020J55825m36821l25914
$$ 1449058 1666290 1316743 1615469 1344190 1188806 1579826 1735651 1298830 972916
13893I72916N28714q2194j74192L54535j87167K1404j86318M93956m43557k0513
$$ 972916 1501630 1419436 1245244 1599779 1412612 1434016 1247698 1741654 1298097 1277584
13883A277584N9323L2365M3877m11162K84603j74571K47773j13322M6841j9233
$$ 1277584 1336907 1369272 1413149 1001987 1286590 1112019 1359792 1246470 1293311 1274078
13873A274078J55695k44118J70492r7116J62806n9843R6686m540K7704k15149
$$ 1274078 1429773 1185655 1356147 1259031 1421837 1361994 1458680 1454140 1481844 1266695
13863A266695J66426j52695k3916j89912J44652L1644k1862m52344N19182j85876
$$ 1266695 1433121 1280426 1256510 1066598 1211250 1242894 1221032 768688 1287870 1101994
13853A101994l19029J22437J62585J50143m31717K33311j04357Q7580q0366K09104
$$ 1101994 782965 905402 1067987 1218130 786413 1019724 915367 1002947 922581 1131685
13843A131685r6524k25314K21105j01184J22103K47480j82000l51670J9443K11346
$$ 1131685 1035161 809847 1030952 929768 1051871 1299351 1117351 765681 785124 996470
13833I96470K50199L4359r1703p3700J65973j36538p2210k76702J55659Q9704
$$ 996470 1246669 1281028 1189325 1115625 1281598 1145060 1072850 796148 951807 1041511
13823A041511p2995N3209M2839l38290J12865P4175K0776j53292N13660F05700
$$ 1041511 968516 1021725 1064564 726274 839139 913314 934090 780798 1294458 605700
13812I12363j59831j6623K02990j74317N8130L18060l91176j33788M22356D44394
$$ 912363 752532 735909 938899 764582 822712 1140772 749596 615808 1038164 444394
13801E76972K93137l27270N72191k97819K3558J86450k77061J06666j1224R9759
$$ 576972 870109 542839 1115030 817211 840769 1027219 750158 856824 845600 945359
13791I45359L604j11633l1146l9610J5938K19652J1674k08318R7505j58062p1601
$$ 945359 948963 837330 806184 766574 782512 1002164 1013838 805520 903025 744963 673362
13780F73362K80139j86740p2469K78290j52531L89019n58194R4785j5066q8280
$$ 673362 953501 766761 694292 972582 820051 1209070 650876 745661 730595 642315
13770F42315M06138l59587J14145J05611l68058K47228j54875K56184l19562K63093
$$ 642315 1048453 688866 803011 908622 540564 787792 632917 889101 569539 832632
13760H32632o7368K99916k95301k0994j27868K38142k41657K10256n1777O8527
$$ 832632 765264 1065180 769879 748885 621017 859159 617502 827758 775981 844508
13750H44508m09959N00853j73636J99356l31057k35691J30978J21502J39458C48713
$$ 844508 434549 935402 761766 961122 630065 394374 525352 646854 786312 348713
13739E01569L27161j80915l1918O4527O24L26107m77904r1647M41371m07722L75015
$$ 501569 828730 647815 615897 680424 681048 1007155 529251 437604 878975 471253 846268
13728H46268J93910m82897L06522q156j78093B49870N09622j09078o1238k07296
$$ 846268 1040178 557281 863803 855647 677554 249870 759492 650414 589176 381880
13718C81880L22886p0973L50798D42932L40766L7162j64064k81199O39232m18663
$$ 381880 704766 633793 984591 442932 783698 820860 656796 375597 1014829 596166
13708E96166q6133N9767K23954k47623R1351j64763M082J95781j17887q2319J50783
$$ 596166 510033 569800 793754 546131 637482 472719 476801 672582 554695 472376 623159
13697F23159k77095P31697E36880J60048J75136l29608P9611K1279k33411L540
$$ 623159 346064 1077761 536880 696928 872064 542456 622067 643346 409935 413475
13687D13475k541K06025k71800o9701K29864J7261K03918k61930j81825O08548
$$ 413475 410934 616959 345159 275458 505322 522583 726501 464571 282746 891294
13677H91294l75459m6376j96506R8972j58732M8910J79999O8634L75020B98332
$$ 891294 515835 469459 272953 371925 213193 262103 442102 510736 885756 298332
13666E77915n2776J79836C49681J73575J06409A61758N5918K25447j45966J58266
$$ 577915 525139 704975 349681 523256 629665 161758 217676 443123 297157 455423
13656D55423j54916o3675A12264K89719j13391J58107K35731C30462L71380k61850
$$ 455423 300507 236832 112264 401983 288592 446699 682430 330462 701842 439992
13646D39992K02773p4134l4118A36352J03387A04197L15048M9378A45964P34665
$$ 439992 642765 568631 534513 136352 239739 104197 419245 468623 145964 880629
13636H80629l06077o7049R1893q4570J43112k78784K45798C05997J18132j13816
$$ 880629 574552 507503 599396 514826 657938 379154 624952 305997 424129 310313
13626C10313P3701M16299l77977P4419J23100l4660n0040A20853L09090A42235
$$ 310313 384014 800313 422336 496755 619855 585195 535155 120853 429943 142235
13615C45592J02493R3018A81785M19073B31458K20090J55872B94185J33563Q4834
$$ 345592 448085 541103 181785 600858 231458 451548 607420 294185 427748 512582
13605E12582j24416L53885k47035o851j77632A34897K43827R2227j67866J97116
$$ 512582 388166 742051 495016 488165 310533 134897 378724 470951 303085 500201
13595E00201k18767m1242J50986j31405K05091o1245Q949I2408K39609J03650
$$ 500201 281434 240192 391178 259773 464864 403619 412568 92408 332017 435667
13585D35667l8274j74918L87026A23380J66381K27091K31340k54297o2714n1150
$$ 435667 397393 222475 609501 123380 289761 516852 748192 493895 431181 380031
13575C80031j03002q2428K77623j70508m3376J22430j74632L57119n9316k14689
$$ 380031 277029 194601 472224 301716 258340 380770 206138 563257 503941 289252
13565B89252M9855Q5816O0382E6280K19131j563R4447L19374l27685l3512M80800
$$ 289252 339107 424923 485305 56280 275411 273848 368295 687669 359984 326472 807272
13554H07272B37032L43453L5557A66733K43823J15346k9791B03290Q5065m8724
$$ 807272 237032 580485 616042 166733 410556 525902 496111 203290 288355 239631
13544B39631J95033j12697J38211r2153K14924A96462J07001N1458j9238j04018
$$ 239631 434664 321967 460178 368025 582949 196462 303463 354921 335683 231665
13534B31665K4752J09525a19042D20282K14609C02772m4756J24845o4382K879
$$ 231665 256417 365942 -119042 420282 634891 302772 258016 382861 318479 321358
13524C21358O5063j11979A16879J03902r149Q2262K22409d3886C31376l9496L4410
$$ 321358 386421 274442 116879 220781 211632 293894 516303 -43886 331376 291880 326290
13513C26290j8945J27517j44894m1934H1193M86033g0317B60115K18783k35085
$$ 326290 307345 434862 289968 248034 81193 567226 -70317 260115 478898 243813
13503B43813K91335B66503M38217A06876K3311F1138M9552L6300J11770j1578
$$ 243813 535148 266503 704720 106876 130187 61138 110690 146990 258760 247182
13493B47182M7871b6202B748M83782o6252A03110P8237a39531C88607j53889M51408
$$ 247182 295053 -26202 2748 486530 420278 103110 181347 -139531 388607 234718 686126
13482F86126A79107R5760R7237k7850J11300A44891J10938a4909I2095J48880
$$ 686126 179107 274867 372104 344254 455554 144891 255829 -14909 92095 240975
13472B40975e2127B78068A22357K35928j66507J47A069L30698j57109L77832k00965
$$ 240975 -52127 278068 122357 358285 191778 191925 1069 331767 174658 552490 351525
13461C51525q4601J78150j31347q1627h9519D2715K80284j13159H8685L69603
$$ 351525 266924 445074 313727 232100 -89519 42715 322999 209840 88685 458288
13451D58288j56548j02095O3579J10896K6745q2174A00840L48115q8695k0069
$$ 458288 301740 199645 263224 374120 400865 318691 100840 448955 360260 340191
13441C40191a0068B7736K28459J47077j82648R9298l9753l5539d1360A46117h7130
$$ 340191 -10068 27736 256195 403272 220624 319922 280169 244630 -41360 146117 -87130
13429A36606B4608J82471a10611L8249B52018j6559L10993A92181J9076L02560
$$ 136606 24608 207079 -110611 -72362 252018 235459 546452 192181 211257 513817
13419E13817k36435n9259N2275P6039P6718j52201m5008n081a20095B17621M8400
$$ 513817 277382 218123 270398 346437 423155 270954 225946 220865 -120095 217621 266021
13408B66021J7255L92999k89939J50663k17323k3980K90645A78677J2795H8009
$$ 266021 283276 676275 386336 536999 319676 295696 586341 178677 191472 88009
13397B37874J52644A66969a53860C26194A18643K72871j33520b577F1471J39885
$$ 237874 390518 166969 -153860 326194 118643 391514 257994 -2577 61471 201356
13387B01356J63498b3296j5458B05137M5028J45468j45845j9742J37950A48538
$$ 201356 364854 -23296 -38754 205137 250165 395633 249788 230046 367996 148538
13376B32627a55817C91995j76897C6141J85274o2990J99465j28146J09648J14550
$$ 232627 -155817 391995 215098 36141 221415 158425 357890 229744 339392 453942
13366D53942A46871J62352F0818J39071J83405m7953f5357B56032h5791H3149
$$ 453942 146871 309223 60818 199889 383294 335341 -65357 256032 -85791 83149
13355B40853a2270A44856K07561A29130J99195J43174h2762A67688K0426R0530
$$ 240853 -12270 144856 352417 129130 328325 471499 -82762 167688 188114 278644
13345B78644L58653B44291K28143B29904P1087j46695a20A21797R868L09628O811
$$ 278644 637297 244291 472434 229904 300991 154296 -120 121797 131665 441293 448104
13334D48104A37549P3671G7901c8780H4076K0874N01854a30136d206D43073j1852
$$ 448104 137549 211220 77901 -38780 84076 104950 606804 -130136 -4206 443073 431221
13323D31221A40406a75385C48170r2266M5603j47873J2284k7632J106c5625A77850
$$ 431221 140406 -175385 348170 255904 301507 153634 165918 138286 139392 -35625 177850
13311B43016G8879K15463R1992n245p4443q3698a52035A73628J45918j19432H2412
$$ 243016 78879 294342 386334 381089 306646 222948 -152035 173628 319546 200114 82412
13299A99649n0154l3400a96412A11153K0305K27012D2563J75575C1320f5609A40026
$$ 199649 149495 116095 -196412 111153 131458 358470 42563 218138 31320 -65609 140026
13287A03703A0909M70868H6569Q9031D0870b62437D39244j37794J87706j24444
$$ 103703 10909 481777 86569 175600 40870 -262437 439244 301450 489156 364712
13277C64712g516D0107J70775q1173K49616J09378j44528D7834O5590O425Q8658
$$ 364712 -7516 40107 210882 129709 379325 488703 344175 47834 113424 119849 208507
13266B08507J43130G2092N901J07511F0838R6714J3739e0821C18254A23032A1365
$$ 208507 351637 72092 77993 185504 60838 157552 171291 -50821 318254 123032 11365
13254A19142a27300M642d9305E15540A45555K83838G5425K01503f4901A83426
$$ 119142 -127300 -122658 -49305 515540 145555 429393 75425 276928 -64901 183426
13243A71088D8669K22316j34046M7893n8504L14035A38180a38515f5779D2488
$$ 171088 48669 270985 136939 184832 126328 440363 138180 -138515 -65779 42488
13232B94269a08176B62739J14007D4697R5384j6508f9263j19362C11936H4365
$$ 294269 -108176 262739 376746 44697 140081 123573 -69263 -188625 311936 84365
13221I5620a2759B42656j10155K64778a2789k75f31E80225B67382J1279M1173
$$ 95620 -12759 242656 132501 397279 -12789 -13064 -631 580225 267382 278661 319834
13210C19834A45446J35205J00020j68622d501A968f4608D32720c71044a21430
$$ 319834 145446 280651 380671 212049 -4501 1968 -64608 432720 -371044 -121430
13199B19706b64135B1744a25491A52619B7035a27688j1796A1989K28013k4509
$$ 219706 -264135 21744 -125491 152619 27035 -127688 -139484 11989 240002 215493
13189B15493J4661C8308K01183b2021A59739a25047G2865J23105O8514c7875C87315
$$ 215493 230154 38308 239491 -22021 159739 -125047 72865 195970 264484 -37875 387315
13177D92905B45637J86660E4938J42635b8404E27369k10229r2542a50564A677
$$ 492905 245637 432297 54938 197573 -28404 527369 317140 224598 -150564 1677
13166B93032A0847J29485J91123m341J47348j09000j59221a65546g8960C47574
$$ 293032 10847 140332 331455 327114 474462 365462 206241 -165546 -78960 347574
13155I2339N3884j3340e6945C6194J1952J70547A0602M63689f6657B7853R7299
$$ 92339 146223 132883 -56945 36194 48146 218693 10602 474291 -66657 27853 125152
13144A25152h1637j26620J03056J9371C11038r8787O4392o6436A04522f77A94655
$$ 125152 -81637 -208257 -105201 -85830 311038 212251 276643 210207 104522 -677 194655
13132A01347b6358A36810Q3826p2596R6575A2904K81545b214B51998O3569c8292
$$ 101347 -26358 136810 220636 148040 244615 12904 294449 -2214 251998 315567 -38292
13120b9711q1771k1635M3118B80306e5813A09067d8266A56978b42468B40175b7676
$$ -29711 -111482 -133117 -89999 280306 -55813 109067 -48266 156978 -242468 240175 -27676
13108g5255B83586A14163J59707b36803A13023K7217m1785L25956B1630L33376
$$ -75255 283586 114163 273870 -236803 113023 140240 98455 424411 21630 355006
13098C55006c3138c658j886B46506d2155r5067C20789d19606B5887P8597J0961
$$ 355006 -33138 -3658 -5544 246506 -42155 -137222 320789 -419606 25887 104484 115445
13087A15445L6261Q1346o1894a62170g0176c3755A26771k7731p29j3011J17962
$$ 115445 151706 233052 171158 -162170 -70176 -33755 126771 99040 98311 85300 203262
13076B03262J48333f1318j27788C82777J01828A73942O9480b20984A64938d7600
$$ 203262 351595 -61318 -189106 382777 484605 173942 243422 -220984 164938 -47600
13065I0699f1147B7948N8922M1815a7692E4791I527J4850b44495A6638i4575M5937
$$ 90699 -61147 27948 86870 128685 -17692 54791 9527 24377 -244495 16638 -94575 -48638
13053d8638D6758K12249a35480C03507A42069F744N7665e6039G4511j4585a71026
$$ -48638 46758 259007 -135480 303507 142069 6744 64409 -56039 74511 59926 -171026
13041a8720C3505c2197R861C87965I5649J65003M7845A44696f3202G42479c8220
$$ -18720 33505 -32197 -22336 387965 95649 260652 308497 144696 -63202 742479 -38220
13029F4492l438c2518k0122e303j76163G6040L3124M42557a63563C4547K93590
$$ 64492 61054 -32518 -52640 -5303 -181466 76040 109164 551721 -163563 34547 328137
13018C28137J5494a05806C48250a9794j74716A34986c6218C51091A61073l9232
$$ 328137 343631 -105806 348250 -19794 -194510 134986 -36218 351091 161073 121841
13008A21841b33028A70087K2662G6597l6588a560j04724J422A82990r0743b39942
$$ 121841 -233028 170087 192749 76597 40009 -1560 -106284 -104862 182990 92247 -239942
12996D2313i6883I4069b02788A59972a44491G4819K25365m3007E8283K90141j67030
$$ 42313 -96883 94069 -202788 159972 -144491 74819 300184 257177 58283 348424 181394
12985A81394E78M4302O9449D3092J41161a93559D3710q166e7844B18976n4079
$$ 181394 578 44880 114329 43092 184253 -193559 43710 35544 -57844 218976 164897
12974A64897p1123a27392D60037I083J48068P8351f1873o9857O4219K6265B84160
$$ 164897 93774 -127392 460037 9083 157151 235502 -61873 -131730 -67511 -41246 284160
12962a70239A63857P6516c48875A81697l9775i8080c6064o9541I5663A1043d7663
$$ -170239 163857 240373 -348875 181697 141922 -98080 -36064 -105605 95663 11043 -47663
12950a94335G140J3312a11448h774B28041M6544o7092g3380F6543J40415A6438
$$ -194335 7140 20452 -111448 -8774 228041 274585 207493 -73380 66543 206958 16438
12938E820J93835a52202e8703A90145a17806H9287L089a54556a2153B37177a79911
$$ 5820 199655 -152202 -58703 190145 -117806 89287 92376 -154556 -12153 237177 -179911
12926b47749A31878J43867p8425a21836b9453A06893d09702a40953e8677o2173
$$ -247749 131878 275745 197320 -121836 -29453 106893 -409702 -140953 -58677 -120850
12916a20850B22005e4768A55172n2684J39293J4799H2486J25638a76760E7699
$$ -120850 222005 -54768 155172 102488 241781 256580 82486 208124 -176760 57699
12905a70005A70683b15582d9589H2971N8000a30972f5034a5118j45256A73297
$$ -170005 170683 -215582 -49589 82971 140971 -130972 -65034 -15118 -160374 173297
12894F7243c06053A85594L7435b57316c3000C58863c7496B03553P6674j30321
$$ 67243 -306053 185594 223029 -257316 -33000 358863 -37496 203553 280227 149906
12884A49906G2818A3038b41874G3441L71230p3951j29805a541I7198k021N9375
$$ 149906 72818 13038 -241874 73441 444671 370720 240915 -1541 97198 95177 154552
12873A54552g5499O623B64276b72843g2090H6766J69129j20001a91349C79825
$$ 154552 -75499 -68876 264276 -272843 -72090 86766 255895 135894 -191349 379825
12862a40291I8792L45108i5708J6958A57193M5526a10327C06730K0863j60464
$$ -140291 98792 443900 -95708 -78750 157193 202719 -110327 306730 327593 167129
12852A67129a86299P6341K4384B57374r4670D5670o794b8870G657J93963C7067
$$ 167129 -186299 -109958 -85574 257374 162704 45670 38876 -28870 7657 201620 37067
12840b4982A40180J51668k8839f15738E5967J98077n2407j0956a30398a8974A16897
$$ -24982 140180 291848 263009 -615738 55967 254044 201637 190681 -130398 -18974 116897
12828b3367j1236p4510A82680D8054P3638J32019a96350e7317m7169q9278B25545
$$ -23367 -34603 -109113 182680 48054 121692 253711 -196350 -57317 -104486 -193764 225545
12816H832a63976B5185e0776D785d7583l9477B76864b27142c4412C1859M9240
$$ 8832 -163976 25185 -50776 4785 -47583 -87060 276864 -227142 -34412 31859 81099
12805H1099e712E44501E0310J81252h6134C86883A3090J34608c2544j06668e1702
$$ 81099 -5712 544501 50310 231562 -86134 386883 13090 147698 -32544 -139212 -51702
12793c14208A7044e8377A35945A0821J53932J32343G5284b11158n0706B62372
$$ -314208 17044 -58377 135945 10821 164753 297096 75284 -211158 -261864 262372
12782D1924b64076n1213i9319l2538j959n1661B22973I3564J18736H7692j7958
$$ 41924 -264076 -315289 -99319 -131857 -133816 -185477 222973 93564 212300 87692 69734
12771F9734K7548J17826a9429j01105L3579B72391a33241k43221a69509b246C34346
$$ 69734 97282 215108 -19429 -120534 -86955 272391 -133241 -376462 -169509 -2246 334346
12759e9719A31325l7375O1476e00249A27128b18940D18646e1976C63596b8136
$$ -59719 131325 93950 155426 -500249 127128 -218940 418646 -51976 363596 -28136
12748D91147F2453Q7739K547D2598c27430D1155a81315N0784j59578B13024j7144
$$ 491147 62453 150192 152739 42598 -327430 41155 -181315 -130531 -290109 213024 195880
12737A95880m1022L2559m0984e435B0443Q2545a0817B55847G6249e8340E4907
$$ 195880 154858 187417 146433 -5435 20443 102988 -10817 255847 76249 -58340 54907
12725C1483a55964G9544J28621m6091g8119B8333b3718q3550B98310E3893j1171
$$ 31483 -155964 79544 208165 162074 -78119 28333 -23718 -107268 298310 53893 42722
12714D2722J76596J68470d4090A74266N6724j7021P315m805I3433L33836j72034
$$ 42722 219318 387788 -44090 174266 230990 213969 221284 216479 93433 427269 255235
12703B55235B3220L2069a22884H5389A7419h5156n0288B02873Q8130b8255j9883
$$ 255235 23220 55289 -122884 85389 17419 -85156 -135444 202873 291003 -28255 -48138
12692d8138d660j4270r4429B8704P0316a92067H859J51281a41810F816g3727E8104
$$ -48138 -4660 -18930 -113359 28704 99020 -192067 8859 160140 -141810 6816 -73727 58104
12679I7534q008i4247C24778F9244G518e5617B14396l3040a764n8680l74764A51771
$$ 97534 89526 -94247 324778 69244 7518 -55617 214396 181356 -1764 -60444 -435208 151771
12666c24132a9976C0533j3614i4201A82117J6555G5268a82378B34795m9362J77019
$$ -324132 -19976 30533 16919 -94201 182117 198672 75268 -182378 234795 185433 362452
12655C62452o3281I8288J00790L5841j08542Q3241b44019A64573r808J86241E7901
$$ 362452 299171 98288 199078 234919 126377 209618 -244019 164573 154765 341006 57901
12643c53082a22o4814j63741Q353a00545J2880A83900A5991K01260g4285K955
$$ -353082 -122 -64936 -228677 -220324 -100545 -87665 183900 15991 217251 -74285 -71330
12632g1330B04607M3230A04866K24061R3384A20039n8726K70274m6237L603B9811
$$ -71330 204607 247837 104866 328927 422311 120039 61313 331587 285350 288953 29811
12620a68020K3918f5717a8663j80066d0446A68993a40054B40627a30408E6969
$$ -168020 -144102 -65717 -18663 -198729 -40446 168993 -140054 240627 -130408 56969
12609a11801c1445l4026A74668A4018J13522l1563c8463A21383j8550M6204N4616
$$ -111801 -31445 -65471 174668 14018 127540 95977 -38463 121383 102833 149037 203653
12598B03653d2152A89540J95618A08083k5551O9267J7252d1515A08059k4714i1228
$$ 203653 -42152 189540 385158 108083 82532 151799 169051 -41515 108059 83345 -91228
12586a64511F3655O2655P5742D054K07235j8316i4190d023G3314i0730c4035B72668
$$ -164511 63655 126310 202052 4054 211289 192973 -94190 -4023 73314 -90730 -34035 272668
12573B22658L0204a12948N1931H8486O0213f909b929k62282a20626N3757a0550
$$ 222658 252862 -112948 -61017 88486 148699 -6909 -2929 -265211 -120626 -66869 -10550
12561G7873k4466b5904A02685O8630G2769J41074G928R2383Q6378a33177B21058
$$ 77873 53407 -25904 102685 171315 72769 213843 7928 100311 186689 -133177 221058
12549A08671d5187B84868a57553b9712I5043C3493b20375A3582b02672r8121B9156
$$ 108671 -45187 284868 -157553 -29712 95043 33493 -220375 13582 -202672 -300793 29156
12537b03919B28589b88064A62563K86052b40350B73861q1565a22685D4235K44643
$$ -203919 228589 -288064 162563 448615 -240350 273861 192296 -122685 44235 288878
12527B88878b90615A44669J0059L37916D7982K8041J35856B7771K12344J1934
$$ 288878 -290615 144669 154728 492644 47982 76023 211879 27771 240115 252049
12517B52049E8398e0475a3664k73206P8598n693c092B4111f4945j01694O1473
$$ 252049 58398 -50475 -13664 -286870 -208272 -213965 -3092 24111 -64945 -166639 -105166
12506a05166C3940a66042c7925n4986E2817J68752H1153j0045e5572C1510L24039
$$ -105166 33940 -166042 -37925 -92911 52817 221569 81153 71108 -55572 31510 355549
12495C55549H7384g0632G9348K85659A63319O9042a84523Q11A59002p1863a91987
$$ 355549 87384 -70632 79348 365007 163319 232361 -184523 -183712 159002 87139 -191987
12483C22920j01040m4846M1617K7674o2865c7787B40493f5702I2336J76889F6470
$$ 322920 221880 177034 218651 246325 183460 -37787 240493 -65702 92336 269225 66470
12471a13178B40520c02783A82979a2907D64684I8454H641Q9172K1937J06600e02986
$$ -113178 240520 -302783 182979 -12907 464684 98454 8641 97813 119750 226350 -502986
12459a55456D2924m902K19978a64138A87088D0686J69511a88126A38887J64071
$$ -155456 42924 38022 258000 -164138 187088 40686 210197 -188126 138887 302958
12449C02958g2142F6368a85514B25430e4775n2031B2667b6707A39669F5875P3998
$$ 302958 -72142 66368 -185514 225430 -54775 -106806 22667 -26707 139669 65875 139873
12438A39873F0452K5965a48863N3531A67397b97960D1943K49033A35215J14645
$$ 139873 60452 86417 -148863 -95332 167397 -297960 41943 290976 135215 249860
12428B49860d5138G7839b87920e399m456A8738a8984j00892A02997K9274m9440
$$ 249860 -45138 77839 -287920 -5399 -9855 18738 -18984 -119876 102997 132271 82831
12417H2831K0887a47478e1656C18751a5030A06136a86639B75284a5398k5706A49534
$$ 82831 103718 -147478 -51656 318751 -15030 106136 -186639 275284 -15398 -41104 149534
12405A23854i4733q9224k5059e7929j21308N6292m7345A28141L26709A10568B436
$$ 123854 -94733 -183957 -209016 -57929 -179237 -122945 -170290 128141 454850 110568 2436
12393a26379A35692M583J99327c2916G8709d53653c3201E1637a05762f754A9581
$$ -126379 135692 140275 339602 -32916 78709 -453653 -33201 51637 -105762 -6754 19581
12381A61466p401M4850r2649l2653k7758a4989B6233M2951P2704F8887i7168c8410
$$ 161466 154065 198915 106266 73613 45855 -14989 26233 69184 141888 68887 -97168 -38410
12368E313b22636c6512j46714A83391A1402b90920J31286J7385F1749a66676C20585
$$ 5313 -222636 -36512 -183226 183391 11402 -290920 -159634 -142249 61749 -166676 320585
12356a85942N2524A4366J25958J06888n7943O446a46293E6401c89026G2844a51806
$$ -185942 -133418 14366 140324 247212 189269 195715 -146293 56401 -389026 72844 -151806
12344b52504J05417H4444B1279d0053A59238A221K9905j236a22822D8578J91402
$$ -252504 -147087 84444 21279 -40053 159238 1221 31126 29890 -122822 48578 239980
12333B39980C6274O3279f452j3257A76526e8033B42734d6129j87031I8982a52492
$$ 239980 36274 99553 -6452 -19709 176526 -58033 242734 -46129 -233160 98982 -152492
12321A59042i500n5749H1048H555a62729P4052C495e3486A09405b54877a23639
$$ 159042 -9500 -65249 81048 8555 -162729 -88677 3495 -53486 109405 -254877 -123639
12309H4334P7381E8700b5113G9183d3648A77331b11767h8437G5021J73908a9630
$$ 84334 161715 58700 -25113 79183 -43648 177331 -211767 -88437 75021 248929 -19630
12297B40588a51744G1362a70950D29536C8492J2520K81025e9535C24035C7214
$$ 240588 -151744 71362 -170950 429536 38492 51012 332037 -59535 324035 37214
12286A61910k8834c0476k88500A96601a29871B36101D9954K59897C3011P492J35394
$$ 161910 133076 -30476 -318976 196601 -129871 236101 49954 309851 33011 40503 175897
12275A75897D3574K02763G0624a0978D74513G0672e8865n5012k34380A22552J81277
$$ 175897 43574 246337 70624 -10978 474513 70672 -58865 -113877 -348257 122552 303829
12264C03829f3854A6404J74509b0178A94700g7958A01040P2811G1531K19425E1580
$$ 303829 -63854 16404 190913 -20178 194700 -77958 101040 173851 71531 290956 51580
12252A12637K83649b0253l4783B20881A8015Q4446a1415j0976m6980A5841K31445
$$ 112637 396286 -20253 -55036 220881 18015 102461 -11415 -22391 -69371 15841 247286
12241B47286h0954G3659J81210g4435A95048H9735R5305K9820a34756G583f3470
$$ 247286 -80954 73659 254869 -74435 195048 89735 185040 214860 -134756 7583 -63470
12229A67340o8553j7389L06526p4907j27249J18330K14976O4949B36158P423i845
$$ 167340 98787 81398 387924 313017 185768 304098 519074 584023 236158 243581 -9845
12217C17428F433R3357a28593E4311K22331a70231H0120a64860F4001K46482j04438
$$ 317428 6433 99790 -128593 54311 276642 -170231 80120 -164860 64001 310483 206045
12206B06045G6102M11339A2697J55065o6473j6728e0650A90276J53742H0717l761
$$ 206045 76102 487441 12697 167762 101289 84561 -50650 190276 344018 80717 76956
12195G6956c0969j55816B67248D3725K20966o1570i8534A37499K0984a27657G0733
$$ 76956 -30969 -186785 267248 43725 264691 203121 -98534 137499 158483 -127657 70733
12183a28715A16597e5286H5764J42745p9334m1209L1716N6762q3426L46950j21641
$$ -128715 116597 -55286 85764 228509 149175 107966 139682 196444 113018 459968 338327
12172C38327A7908b88344d1659D6355R7953R7126b7868r8467l2809o9156k8985
$$ 338327 17908 -288344 -41659 46355 144308 241434 -27868 -126335 -159144 -228300 -257285
12161b57285B52258J90115A68806d7094B53873b090j08395A31688a09464C69964
$$ -257285 252258 442373 168806 -47094 253873 -2090 -110485 131688 -109464 369964
12150A19578e4681C0090J55047k9577m446g2014A11518j1673g0791C4449A6206
$$ 119578 -54681 30090 185137 155560 151114 -72014 111518 99845 -70791 34449 16206
12138C08938a94616j97353B85774a8114G7341J6084h6225D29223j20803c4174
$$ 308938 -194616 -391969 285774 -18114 77341 93425 -86225 429223 308420 -34174
12127b02927A5711d3734A80555L0769c6594k16166h4769j57973A4153a87803f4419
$$ -202927 15711 -43734 180555 211324 -36594 -252760 -84769 -242742 14153 -187803 -64419
12115C00566i0715b498A69268a01294j5535A52985L7329M6826a12706A47021a18344
$$ 300566 -90715 -2498 169268 -101294 -116829 152985 190314 237140 -112706 147021 -118344
12103g8993A8079c5132r4623j96622L1776a18389A58241d90248b9150A41774k1176
$$ -78993 18079 -35132 -129755 -326377 -294601 -118389 158241 -490248 -29150 141774 120598
12092A20598a79872B9643L9336b86761k3475f491A17152b57711C46971b1164q7040
$$ 120598 -179872 29643 68979 -286761 -310236 -6491 117152 -257711 346971 -21164 -108204
12081a08204k53051h1429A4738J08703b24653A71778a40368l1864M9547m2628
$$ -108204 -361255 -81429 14738 123441 -224653 171778 -140368 -172232 -122685 -165313
12071a65313G2560K54974L02353L83993M12815E37012j76126A52342b182A26572
$$ -165313 72560 327534 629887 1013880 1426695 537012 360886 152342 -2182 126572
12060b48748I1152b52192A1311J56655B4881J18112b41058j2436F6825J64332
$$ -248748 91152 -252192 11311 167966 24881 142993 -241058 -253494 66825 231157
12050B31157d9492A16685a0277A3122J39247a07677A35564C8333a49034K6840
$$ 231157 -49492 116685 -10277 13122 152369 -107677 135564 38333 -149034 -122194
12040a22194l5261A90633B7310a85199M0449J5824j5649N254B96977A05674e5486
$$ -122194 -157455 190633 27310 -185199 -144750 -128926 -144575 -139321 296977 105674 -55486
12028c56457B1881a72189e6294I6858Q4511c49915L4632F6949b00977Q8085R433
$$ -356457 21881 -172189 -56294 96858 181369 -349915 -315283 66949 -200977 -112892 -103459
12017a03459A95967d431A45400E417K30353h223A21823F864J85141e6070D7227
$$ -103459 195967 -4431 145400 5417 235770 -8223 121823 6864 192005 -56070 47227
12005E3355J64011b94542J36138k3643G5210b79097a32893i433k17616E2865J21468
$$ 53355 217366 -294542 -158404 -182047 75210 -279097 -132893 -9433 -227049 52865 174333
11994A74333J39057E7544g2276k6271L7425j7279A74662K9165D5555K10265d4383
$$ 174333 313390 57544 -72276 -98547 -61122 -78401 174662 203827 45555 255820 -44383
11982H6459a85175H5091R8896h8303A07131a56130E7620K77817a64202A30220
$$ 86459 -185175 85091 183987 -88303 107131 -156130 57620 335437 -164202 130220
11971g3540j83289R2213P6062B00914p3490c3512l33769D20789b58973A97770
$$ -73540 -256829 -164616 -88554 200914 127424 -33512 -367281 420789 -258973 197770
11960G9962a5239p4280J3526J8077m4828A26690f5780q2122H335K22278B612O7693
$$ 79962 -15239 -89519 -75993 -57916 -102744 126690 -65780 -147902 8335 230613 2612 70305
11948G0305R6282J79653c67946d2623A94701d0038A03596e5534K7300G835l576
$$ 70305 166587 346240 -367946 -42623 194701 -40038 103596 -55534 -28234 7835 4259
11937D259R1514l6285a31960f2465a6502j35738J1848b0532C0442d5461l0546
$$ 4259 95773 59488 -131960 -62465 -16502 -152240 -140392 -20532 30442 -45461 -76007
11926g6007g476A47705a22139C439b8345A67393P4690g5688K0329A5682K15791
$$ -76007 -7476 147705 -122139 3439 -28345 167393 242083 -75688 -55359 15682 231473
11915B31473j13603e7921j08277M6540K2920k32380B07666o1518j6101d4B67118
$$ 231473 117870 -57921 -166198 -119658 -96738 -329118 207666 146148 130047 -44 267118
11903F5828f1926j04889A16034K12153F0101b39827j61315A64573C172b34989
$$ 65828 -61926 -166815 116034 328187 60101 -239827 -401142 164573 3172 -234989
11892g5199G5190B1802a51055B76080A12159Q589D4568d7638K3557A35686K12563
$$ -75199 75190 21802 -151055 276080 112159 120748 44568 -47638 -24081 135686 348249
11881C48249F2777M3464a28709A98670f6349B65564A22428b00458a5253k78349
$$ 348249 62777 106241 -128709 198670 -66349 265564 122428 -200458 -15253 -293602
11871b93602G3524a55928k9991j7691j56787a58810P4996j06958C8710O0738l7065
$$ -293602 73524 -155928 -185919 -203610 -360397 -158810 -83814 -190772 38710 99448 62383
11860F2383e493D4068O5871m6997a41025j9597e3043D56721i0871A47740g5688
$$ 62383 -5493 44068 109939 62942 -141025 -160622 -53043 456721 -90871 147740 -75688
11848i2731a8047A25752a85824o9611O3490H5224B0119c02120O0290b5147k60519
$$ -92731 -18047 125752 -185824 -255435 -191945 85224 20119 -302120 -241830 -25147 -285666
11837b85666A42388n0551a6915r1462j07741G4996a7598q1692I4793b18151A73995
$$ -285666 142388 91837 -16915 -108377 -216118 74996 -17598 -99290 94793 -218151 173995
11825B10c30482R0333G6115h2750k80346D9148a100I3942i7180G8555a11893l3256
$$ 210 -330482 -240149 76115 -82750 -363096 49148 -1100 93942 -97180 78555 -111893 -145149
11813a45149M0818A19045m7795b11902A0970b41093M6558I9562i0970C27765j04632
$$ -145149 -104331 119045 71250 -211902 10970 -241093 -194535 99562 -90970 327765 223133
11802B23133H990J1772a77965R528M5485n924G9568K5253h8543B30769c68467
$$ 223133 8990 20762 -177965 -168437 -122952 -128876 79568 104821 -88543 230769 -368467
11790A07254L83901D7309G372J4380M0714K5897b54952R4948O8614A36597J14056
$$ 107254 491155 47309 7372 21752 62466 88363 -254952 -160004 -91390 136597 250653
11779B50653I0234a26938K5533A20772f1437j4856j58973j24482a12587A0090
$$ 250653 90234 -126938 -101405 120772 -61437 -76293 -235266 -359748 -112587 10090
11768d2402a4472C0581M2515B5669J43497e7315j06276A23721a17576o9493B32645
$$ -42402 -14472 30581 73096 25669 169166 -57315 -163591 123721 -117576 -187069 232645
11756B7579g0106d557B1901D898Q9074c03199E2839A8916K5124J08022N1159r6464
$$ 27579 -70106 -4557 21901 4898 93972 -303199 52839 18916 44040 152062 203221 106757
11744A06757c96479a84609M439A87044d9093B62842k0633a34695C4086L9467a74133
$$ 106757 -396479 -184609 -180170 187044 -49093 262842 242209 -134695 34086 73553 -174133
11732B0304b06230A60008J91271a23997j10839A83695b30563F5943J62917B6390
$$ 20304 -206230 160008 351279 -123997 -234836 183695 -230563 65943 228860 26390
11721h5490B14099G0616A3437L4149J66699r8194j0790a88960C02887j05770J84350
$$ -85490 214099 70616 13437 47586 214285 116091 105301 -188960 302887 197117 381467
11710C81467A90292I34K74117j10484c8492k83831A19619e7223B62730A20964
$$ 381467 190292 934 275051 164567 -38492 -322323 119619 -57223 262730 120964
11699B14928h906p1050j82495C6198R428J49799a14131b4379p4450k78841a32008
$$ 214928 -8906 -79956 -262451 36198 45626 195425 -114131 -24379 -98829 -377670 -132008
11687A89320K03599A32388A1764J49831E4098c6882j99160C16761a31926K9684
$$ 189320 392919 132388 11764 161595 54098 -36882 -236042 316761 -131926 -102242
11677a02242C07124c90662A69218F2760N903b83967d1592A37100A4655N8644c2467
$$ -102242 307124 -390662 169218 62760 68663 -283967 -41592 137100 14655 73299 -32467
11665F2246k4126i7284A45630b94562g8899G5841e4128k21050j16812F3307J41138
$$ 62246 38120 -97284 145630 -294562 -78899 75841 -54128 -275178 -391990 63307 204445
11654B04445j7292B8511i5539B16838a64271B02498J11354o1348b00373k04165
$$ 204445 187153 28511 -95539 216838 -164271 202498 313852 252504 -200373 -404538
11644d04538D8851i1071B1814J15870a5054D470J90286a26308M9569q9020l338
$$ -404538 48851 -91071 21814 137684 -15054 4470 194756 -126308 -76739 -165759 -169097
11633a69097g908j16679o9491R6487k05616A44355a01986b447j3063C9470b46497
$$ -169097 -7908 -124587 -194078 -97591 -303207 144355 -101986 -2447 -15510 39470 -246497
11621B78819o7345h8836N574F7389L43871A78863p4447a42585A21980g6772A80698
$$ 278819 211474 -88836 -83262 67389 411260 178863 104416 -142585 121980 -76772 180698
11609b35979j4453A41632k1823a57554e5952k014j1081H0539c3420k531a5679
$$ -235979 -250432 141632 119809 -157554 -55952 -57966 -69047 80539 -33420 -35951 -15679
11597b602j83151g2741j54238k0657G9200J41492o0192M2590p1712a99560D11645
$$ -2602 -185753 -72741 -226979 -247636 79200 220692 160500 203090 131378 -199560 411645
11585C65085M352D5808h4527c9923E1485a01496C2038c8491o947B5257j278a13344
$$ 365085 369437 45808 -84527 -39923 51485 -101496 32038 -38491 -45438 25257 23979 -113344
11572A32875C5325b0077o7797A11075n1022L23331c01484B29506m7063c48970
$$ 132875 35325 -20077 -87874 111075 60053 383384 -301484 229506 182443 -348970
11561a9615F2902g4215C15852c5587A02860M53578A17011g4073A03224M1331m941
$$ -19615 62902 -74215 315852 -35587 102860 556438 117011 -74073 103224 144555 139614
11550A39614e4715B11634L3952g1341C4866J37931e07456A18389E1731d3085B16896
$$ 139614 -54715 211634 245586 -71341 34866 172797 -507456 118389 51731 -43085 216896
11538A11568c0140A06589k0488J03247b0959C82416D8921g1087A01234J38226
$$ 111568 -30140 106589 86101 189348 -20959 382416 48921 -71087 101234 239460
11528B39460h0378D15446o8911A32265h6967B50308f5490A88013K537L2853B0409
$$ 239460 -80378 415446 346535 132265 -86967 250308 -65490 188013 190550 223403 20409
11516f2086C73583a81341G873L66532g708j16804K6952H7805J23114e4318A61894
$$ -62086 373583 -181341 7873 374405 -7708 -124512 -97560 87805 210919 -54318 161894
11504C87252I7681P5528K7718C4163R7056o3128P1884F1048J11371m4314J2428
$$ 387252 97681 173209 200927 34163 131219 68091 139975 61048 172419 128105 140533
11493A40533J08301G074J00447l7652b0661C84824A14670a18066B82477J63394
$$ 140533 248834 7074 107521 69869 -20661 384824 114670 -118066 282477 445871
11483D45871B03073b35916A68189n228p2478j1655K18208Q6463l6387A875N06435
$$ 445871 203073 -235916 168189 162961 90483 78828 297036 383499 347112 1875 508310
11472E08310r3210a0201j8036B64911a73344A06838H460J35307a51543b2946A1064
$$ 508310 415100 -10201 -28237 264911 -173344 106838 8460 143767 -151543 -22946 11064
11460h5764A58619P1425A02910a5356A81946H7102b55416E1035a7066C0503K71127
$$ -85764 158619 230044 102910 -15356 181946 87102 -255416 51035 -17066 30503 301630
11449C01630r4252G5582L1193j0987l6609J293J20136K32456q9417c31190G8519
$$ 301630 207378 75582 106775 95788 59179 60472 180608 413064 323647 -331190 78519
11437a34560Q923B32295b8891C94577a55559a2975B35414f1755n018A52629a72487
$$ -134560 -125637 232295 -28891 394577 -155559 -12975 235414 -61755 -66773 152629 -172487
11425A13070g8986b884B36256D7631M0968M3431J87983L1361a71802r4066B7733
$$ 113070 -78986 -2884 236256 47631 88599 132030 320013 351374 -171802 -265868 27733
11413a68848F5574e459A94094b3475B7692f505B53392A6864K01734c7370k9562
$$ -168848 65574 -5459 194094 -23475 27692 -6505 253392 16864 218598 -37370 -66932
11402f6932j94400r0206b5487A4616J5207b71916A81127p5327e5323D7367J84693
$$ -66932 -261332 -351538 -25487 14616 29823 -271916 181127 105800 -55323 47367 232060
11391B32060a00118c5887A71625o0587c1020l01795d1276j33088B17802a35800
$$ 232060 -100118 -35887 171625 111038 -31020 -332815 -41276 -174364 217802 -135800
11380a88980H8844a4045B23964e6488A02190J53297F1455a14965A44086l256a58627
$$ -188980 88844 -14045 223964 -56488 102190 255487 61455 -114965 144086 140830 -158627
11368C2678J99959l8080j3737a20068r1213A57793A3866K16257q4997h5679L0056
$$ 32678 232637 194557 180820 -120068 -211281 157793 13866 230123 145126 -85679 -55623
11357e5623C00321F2296f4919F6289j3545A5140J23777a82543B50428f1699C5308
$$ -55623 300321 62296 -64919 66289 52744 15140 138917 -182543 250428 -61699 35308
11345B02955b1478A0629b60021A23692i1930c9526n646L42B22129a0545j40752
$$ 202955 -21478 10629 -260021 123692 -91930 -39526 -45172 -44830 222129 -10545 -151297
11334a51297B7525b5918k56546b9425k96107a01041A08969J46886h9307G2207
$$ -151297 27525 -25918 -282464 -29425 -325532 -101041 108969 255855 -89307 72207
11323B02780N3661H3596J35328a4847A342b06600A21514b1187j13620n2326n7288
$$ 202780 256441 83596 218924 -14847 1342 -206600 121514 -21187 -134807 -187133 -244421
11312b44421d5228j24407d8819j36931O4025A20776i9833A05484L08751a53975
$$ -244421 -45228 -169635 -48819 -185750 -121725 120776 -99833 105484 414235 -153975
11301A10629M8188G4017h9347B73917r6106K3732o9088Q7103G3596b21487G4184
$$ 110629 158817 74017 -89347 273917 177811 201543 132455 219558 73596 -221487 74184
11289B80530a97987a6193n8633D8617J69348A8789d5164E3204b40016B21785J34058
$$ 280530 -197987 -16193 -74826 48617 217965 18789 -45164 53204 -240016 221785 355843
11278C55843a34984D6510J5522a78556F4641b80194A8848c40375A53518G6138
$$ 355843 -134984 46510 62032 -178556 64641 -280194 18848 -340375 153518 76138
11267b81940A225K84626e5662J4914j34308O1795j35565L038a25C35834b0790
$$ -281940 1225 285851 -55662 -40748 -175056 -113261 -248826 -245788 -125 335834 -20790
11255a09616C6193L7279A1117J85814b08313F6417a99225b618I5768a010A95819
$$ -109616 36193 73472 11117 196931 -208313 66417 -199225 -2618 95768 -1010 195819
11243F1147M1358b43206m074a7365j27232j31212E7302a34009M7703a5068N93
$$ 61147 102505 -243206 -247280 -17365 -144597 -275809 57302 -134009 -86306 -15068 -14475
11232a4475l85A4344J16182c83216A86551b52931a11312o9770j06744I3230a80498
$$ -14475 -14860 14344 130526 -383216 186551 -252931 -111312 -181082 -287826 93230 -180498
11220A22280a95107A12416a27090A22677J822A6022N8865f562C61364A34129c6802
$$ 122280 -195107 112416 -127090 122677 124499 16022 74887 -6562 361364 134129 -36802
11208A58109b35849b5213l34021j977F9049b60330B1563c9845B03253b10146E7554
$$ 158109 -235849 -25213 -359234 -361211 69049 -260330 21563 -39845 203253 -210146 57554
11196g6044Q091j27251j51377J44515B6547a87523j72646D6662b7869q4897c4518
$$ -76044 -67953 -195204 -346581 -202066 26547 -187523 -360169 46662 -27869 -112766 -34518
11184C54952A29075o2586l2843J014b02826P1138A22434R1568a6452k88755j2400
$$ 354952 129075 66489 33646 34660 -202826 -131688 122434 214002 -16452 -305207 -317607
11173c17607d9120A10617r719K1728C1770L91824b87091A39711J42328a77322
$$ -317607 -49120 110617 100898 122626 31770 423594 -287091 139711 282039 -177322
11162b15190j76448f6272F2985b00561L870d987o9941K9347A63310I098J0334
$$ -215190 -391638 -66272 62985 -200561 -196691 -4987 -74928 -45581 163310 9098 19432
11151A9432J25056O8985a97289b1171k7820G557K96841j5454a85057C91287a20007
$$ 19432 144488 213473 -197289 -21171 -48991 7557 304398 288944 -185057 391287 -120007
11139a05289H9382b32604d0654C486e2855b3020r0254j06572F1017J09807k5317
$$ -105289 89382 -232604 -40654 3486 -52855 -23020 -113274 -219846 61017 170824 145507
11128A45507K5261D2980b74906A08380h498A02766a90264C37445n0759A11296
$$ 145507 170768 42980 -274906 108380 -8498 102766 -190264 337445 286686 111296
11117a47354F9619a32690e9752F6273j948M09a05574A26146c09455A77528a48243
$$ -147354 69619 -132690 -59752 66273 64325 64734 -105574 126146 -309455 177528 -148243
11105D20405b92363B20929J5700i4023B25258j8984E4065g2507I5841I256P1521
$$ 420405 -292363 220929 236629 -94023 225258 206274 54065 -72507 95841 9256 80777
11094H0777C4417J22757m1436a2934B59589j14647O4788l5310O8417A5491g3095
$$ 80777 34417 157174 115738 -12934 259589 144942 209730 174420 242837 15491 -73095
11082D46321i6835C68480o6497i0571k7481F2776L0307K67228I7428M0276P7800
$$ 446321 -96835 368480 301983 -90571 -118052 62776 93083 360311 97428 137704 215504
11071B15504A01910J63560J6318j35447P1692J50386n1288J11449l4838m9898
$$ 215504 101910 265470 281788 146341 218033 368419 317131 428580 393742 343844
11061C43844L17481j53235R4846J9791K51239l25685j17795J70890K41577j81364
$$ 343844 661325 508090 602936 622727 873966 548281 430486 601376 842953 661589
11051F61589p8954o0728L05285j71057p4414K42166k27984J39857n7805N0089
$$ 661589 582635 521907 827192 656135 581721 823887 595903 735760 677955 728044
11041G28044k55936L20262n8661R8983j95904J80115o8828j02165J65487k92830
$$ 728044 472108 792370 733709 832692 636788 816903 748075 645910 811397 518567
11031E18567M30274l74050q1592K05297O0907k18421J00109k92772J77188L23636
$$ 518567 948841 574791 493199 698496 759403 540982 641091 348319 525507 849143
11021H49143R9627l22522B98909O57951m45565K37385l28697j30923O04538C69317
$$ 849143 948770 626248 298909 956860 511295 748680 419983 289060 893598 369317
11010E43944J9693J60809l09174J71901p1637J70345k44898L87321j88490l17792
$$ 543944 563637 724446 415272 587173 515536 685881 440983 828304 639814 322022
11000C22022J98224J88858C54326J19651k1109k1337J92559L33793j38410Q6340
$$ 322022 520246 709104 354326 473977 452868 431531 624090 957883 819473 905813
10990I05813R3811j49377j07240K81200l35552M25542n2767J22412k7876p3488
$$ 905813 999624 850247 743007 1024207 688655 1114197 1061430 1183842 1155966 1082478
10980A082478J43469j83359J014782j66057R8407L39680M6259L72367P5016L5202
$$ 1082478 1225947 1042588 2057370 1891313 1989720 2329400 2375659 2748026 2823042 2858244
10970B858244j78426J92832m71428l78668Q724l20295k79354K44662L9271j05469
$$ 2858244 2679818 2872650 2401222 2022554 2031278 1710983 1431629 1676291 1715562 1610093
10960A610093m23460L65439l23071J33882l09679k6445J13455l02741m0531j21425
$$ 1610093 1186633 1552072 1229001 1362883 1053204 1026759 1140214 837473 796942 675517
10950F75517J4123B88979K07385K1524j99168C9997L64209j77089a05003B50700
$$ 675517 689640 288979 496364 517888 318720 39997 404206 227117 -105003 250700
10939c3969D72100p1254A6114J68026J51774F6023Q2927r937o2585i004B05274
$$ -33969 472100 400846 16114 184140 335914 66023 148950 139013 76428 -9004 205274
10927B154M0283a7077j7656l0674C8806L7760Q4188a77165C2259Q1285b56503
$$ 2154 42437 -17077 -34733 -65407 38806 76566 160754 -177165 32259 113544 -256503
10915b36703c9135C8253g3312K234k9590M1343A09070a9934r3729j18643J855
$$ -236703 -39135 38253 -73312 -71078 -100668 -59325 109070 -19934 -113663 -232306 -230451
10904b30451R5922M6705K015C14367e433j87787A28146a19231o0069a3849l7849
$$ -230451 -134529 -87824 -85809 314367 -5433 -193220 128146 -119231 -179300 -13849 -51698
10893e1698l49139K2205a78153D0401i9504c3641a0869j75659D8468J03066P9283
$$ -51698 -400837 -378632 -178153 40401 -99504 -33641 -10869 -186528 48468 151534 230817
10882B30817A4328a1976q398B43192b07770H8040A7405J55838D7276l472a2876
$$ 230817 14328 -11976 -20374 243192 -207770 88040 17405 173243 47276 43804 -12876
10870D1417j4170H932e3398I3881l9381e862m7753A65907J41689A09968a91682
$$ 41417 27247 8932 -53398 93881 54500 -5862 -53615 165907 307596 109968 -191682
10858a39757e0474j30051p865j35062B38998a17539C6210g5242C78038A25549
$$ -139757 -50474 -180525 -188390 -323452 238998 -117539 36210 -75242 378038 125549
10847b9961F1952a3884A43420n5784c1591q5806L350k4579O0550A03385m7968
$$ -29961 61952 -13884 143420 87636 -31591 -117397 -114047 -138626 -78076 103385 55417
10836E5417J46986A1258M066K07219O6384b1816j75718R6053j27243P0493K4219
$$ 55417 202403 11258 15324 222543 288927 -21816 -197534 -101481 -228724 -158231 -134012
10825a34012O834e6834k8332K5379A10421J24800H9914O7509P0445C7661j2055
$$ -134012 -127178 -56834 -85166 -59787 110421 235221 89914 157423 227868 37661 25606
10814B5606b08452j26793a45931N4504k011j42763E0984c46923A84334C5910L2146
$$ 25606 -208452 -335245 -145931 -91427 -93438 -236201 50984 -346923 184334 35910 68056
10803F8056A5487M36301b93351P1787A40691a28765N079d0363l8116A33077a62938
$$ 68056 15487 451788 -293351 -221564 140691 -128765 -123686 -40363 -78479 133077 -162938
10791a44581c0887j59140R4390C19752a4938A11720K22478j27869a6338A83027
$$ -144581 -30887 -190027 -95637 319752 -14938 111720 334198 206329 -16338 183027
10780F6850e9243n4189p7499A43523h3226A041b29542O5381g4560A02951b1972
$$ 66850 -59243 -113432 -190931 143523 -83226 1041 -229542 -164161 -74560 102951 -21972
10768g5133A4203b91755E1821b11583b5462F2880b24429A26120i9901D1008a50730
$$ -75133 14203 -291755 51821 -211583 -25462 62880 -224429 126120 -99901 41008 -150730
10756b35070G4402A1257K06921b13379b5718D90a99623A2640K15178b09977B58424
$$ -235070 74402 11257 218178 -213379 -25718 490 -199623 12640 227818 -209977 258424
10744A40749g0003G6344b34477A65010H1170K4965L3285o4268J3869i3079B00802
$$ 140749 -70003 76344 -234477 165010 81170 106135 139420 75152 89021 -93079 200802
10732A18480a17042B9865J69598G2936c34926A63818B7009B171b39379c509j67968
$$ 118480 -117042 29865 199463 72936 -334926 163818 27009 2171 -239379 -3509 -171477
10721a71477c9686A03813a2911k2591l14792a18567G9144e4688j41528j35512
$$ -171477 -39686 103813 -12911 -35502 -350294 -118567 79144 -54688 -196216 -331728
10711c31728E1983d0986o9699B03697c7258j75312E2873c85787a32391l5880n5529
$$ -331728 51983 -40986 -110685 203697 -37258 -212570 52873 -385787 -132391 -168271 -223800
10700b23800C3133a25137E8434a50906C85852G6351K34547j38075h6807j56803
$$ -223800 33133 -125137 58434 -150906 385852 76351 310898 172823 -86807 -243610
10690b43610a4046k6873k59681J09357p9247J31655f0453K4348j44609A62193
$$ -243610 -14046 -40919 -300600 -191243 -270490 -138835 -60453 -36105 -180714 162193
10679E21510c60661A09218K21348F0780a1276D2156J36143a76259R578j38438
$$ 521510 -360661 109218 330566 60780 -11276 42156 178299 -176259 -166681 -305119
10669c05119C3042a12289H8684l9916b28050H2701i0130d1454J7843r1006G4538
$$ -305119 33042 -112289 88684 48768 -228050 82701 -90130 -41454 -23611 -114617 74538
10657a68274C1198A807K35690P5099c7189k53822m5253A55323B4128K1690h9766
$$ -168274 31198 1807 237497 312596 -37189 -291011 -336264 155323 24128 45818 -89766
10645C1129C462c8451k60748A61317m9270A9408J70657G5876a48476i995A76783
$$ 31129 3462 -38451 -299199 161317 112047 19408 190065 75876 -148476 -9995 176783
10633C0570a76077F6428b52416L146O4899D3926A654b25407q3478a53368J8645
$$ 30570 -176077 66428 -252416 -249270 -184371 43926 1654 -225407 -308885 -153368 -134723
10622a34723A90813D434e4846q4954f4226r6309A83976D2143b11675A33671a74779
$$ -134723 190813 4434 -54846 -139800 -64226 -160535 183976 42143 -211675 133671 -174779
10610f9974K6307m35908I8140d6475A1965b0131j66856A50595b5860m4562a7857
$$ -69974 -43667 -479575 98140 -46475 11965 -20131 -186987 150595 -25860 -70422 -17857
10598a30908B79704A3218a36594o8138A41475b59163n6079E0423d9816p840B79509
$$ -130908 279704 13218 -136594 -204732 141475 -259163 -315242 50423 -49816 -57656 279509
10586A37317g2123j13983p4891J09676d2478l51629P2933A7715c99296H0785R6335
$$ 137317 -72123 -186106 -260997 -151321 -42478 -394107 -321174 17715 -399296 80785 177120
10575A77120c40949C9584d00339H8518b3783h007k18603B30192I7189a21758m0277
$$ 177120 -340949 39584 -400339 88518 -23783 -8007 -226610 230192 97189 -121758 -162035
10564a62035c9611l8958A74562c8244a4370q7959l0185C8815P2028a13034M9936
$$ -162035 -39611 -78569 174562 -38244 -14370 -102329 -132514 38815 110843 -113034 -63098
10553f3098k716A24028I486J27368i958j02691a721k29046e6883O125p1026K8013
$$ -63098 -65814 124028 9486 136854 -9958 -112649 -1721 -230767 -56883 -50758 -121784 -93771
10541i3771A06195K34352f2083E324j218L26328F1072b08358m9017B07611F6768
$$ -93771 106195 340547 -62083 5324 4106 330434 61072 -208358 -257375 207611 66768
10529g8630k87646A92443a06917A64220l0533h1673r2654O121F2073O6537b44199
$$ -78630 -366276 192443 -106917 164220 133687 -81673 -174327 -168206 62073 128610 -244199
10517G1017J46822a33525m118O8561A53290a73995O9295o1640F3365K57970p9962
$$ 71017 217839 -133525 -137643 -69082 153290 -173995 -104700 -166340 63365 321335 241373
10506B41373b18525N2511B8482e9572b2460j89005B1429a225r1178B59861A28069
$$ 241373 -218525 -166014 28482 -59572 -22460 -211465 21429 -1225 -92403 259861 128069
10494h9559H3024g6596A9280Q4475a79443c9666A11910l5633K48653j07164L55583
$$ -89559 83024 -76596 19280 103755 -179443 -39666 111910 76277 324930 217766 573349
10483E73349G0976K73649J27799r0383j39009e291B72988a08820C3444R7356D4094
$$ 573349 70976 344625 472424 382041 243032 -5291 272988 -108820 33444 130800 44094
10471F0165J38123a29733B55874a14840B98718f4549A07937n2754L15448f1594
$$ 60165 198288 -129733 255874 -114840 298718 -64549 107937 55183 370631 -61594
10460A28705c66480A97277d48815A7720a52021A31610C3078i1507C24234a30626
$$ 128705 -366480 197277 -448815 17720 -152021 131610 33078 -91507 324234 -130626
10449D09281g3995F2179J04774b05174b5128j36451j00084H2753J73530j9635
$$ 409281 -73995 62179 166953 -205174 -25128 -161579 -261663 82753 256283 236648
10439B36648i5682A06341I824K20734b82528H832K33692E3787K38763A31984h5779
$$ 236648 -95682 106341 9824 230558 -282528 8832 242524 53787 292550 131984 -85779
10427c2943j35735C9820R4276K07455I9559Q4123i1838B5527R7025c50177J30268
$$ -32943 -168678 39820 134096 341551 99559 183682 -91838 25527 122552 -350177 -219909
10416b19909A7373K70107g766p5009a91F7400c7382j5974A60843d06556A4087
$$ -219909 17373 287480 -7766 -82775 -191 67400 -37382 -53356 160843 -406556 14087
10404G1847b88244d3325p6736l1672A07989l1613a50886J7543e8123C85140B6859
$$ 71847 -288244 -43325 -120061 -151733 107989 76376 -150886 -133343 -58123 385140 26859
10392A96361O4070h8978A46650i0946K7412H6053J43834b52535e816A07723O4001
$$ 196361 260431 -88978 146650 -90946 -63534 86053 229887 -252535 -5816 107723 171724
10381A71724a5445B35464a28131C14456p9635j5517b956A18057C742L84175A71586
$$ 171724 -15445 235464 -128131 314456 234821 219304 -2956 118057 3742 387917 171586
10369e5069D18795j2410j83127M8352K05226k03489j05706A1136N00296k5303
$$ -55069 418795 406385 223258 271610 476836 273347 167641 11136 511432 486129
10359D86129j56423b5944B81665A25644N6170H1855J99411L62035m9793l8341
$$ 486129 329706 -25944 281665 125644 181814 81855 281266 643301 593508 555167
10349E55167j61763j56247D0809J35070B96N82345k65922l9240a22566D09538
$$ 555167 393404 237157 40809 175879 296 582641 316719 277479 -122566 409538
10338B09184r4103b4260B55320A6906c4858G4211a21735L1338I0675a82301B70764
$$ 209184 115081 -24260 255320 16906 -34858 74211 -121735 -90397 90675 -182301 270764
10326I4460b28229A81354J25119j185a0580B60515l8851o4644J00904a23658C16618
$$ 94460 -228229 181354 306473 305288 -10580 260515 221664 157020 257924 -123658 316618
10314A74759B7905b21609A50551f0304A37427C7692f9483C8300a42875A16871
$$ 174759 27905 -221609 150551 -60304 137427 37692 -69483 38300 -142875 116871
10303a28996j11101A12112C2813N14545A7831O8922a47183K1512k13180N9511
$$ -128996 -240097 112112 32813 547358 17831 86753 -147183 -125671 -338851 -279340
10293b79340g7746B3596e7778I8231L8087a32991F5598b50941l5490o7796a33898
$$ -279340 -77746 23596 -57778 98231 136318 -132991 65598 -250941 -286431 -354227 -133898
10281E6619N4469b18135E4419d0806j15263B24546a79786N9639A33349R4499b25922
$$ 56619 111088 -218135 54419 -40806 -156069 224546 -179786 -120147 133349 227848 -225922
10269A07492B5657K9344a77498d9173J8843B20470Q3773j6856K89554k33349J8012
$$ 107492 25657 55001 -177498 -49173 -30330 220470 304243 287387 576941 343592 361604
10258C61604i9814D22555a5316H6598K16195f9667j01433c5274k50480E0306k4546
$$ 361604 -99814 422555 -15316 86598 302793 -69667 -171100 -35274 -285754 50306 25760
10247B5760L0549b01310O9265j46955H5703b22600A88289D0775i6894D9457i0969
$$ 25760 56309 -201310 -132045 -279000 85703 -222600 188289 40775 -96894 49457 -90969
10235B15501b46374g1918a23j62234D03109b96606h6137A23914b62379a04363
$$ 215501 -246374 -71918 -123 -162357 403109 -296606 -86137 123914 -262379 -104363
10224d3082j19510N1673a3716A88457e7621B13417a36705L0930A1674a21442M7453
$$ -43082 -162592 -110919 -13716 188457 -57621 213417 -136705 -105775 11674 -121442 -73989
10213g3989B28847j045d2766p8605E4540a0184D5055a41538A88656L2905b21124
$$ -73989 228847 227802 -42766 -121371 54540 -10184 45055 -141538 188656 221561 -221124
10201a40279o9432b8267m2828k17612A4812c37990J0080A54707o2702a61227H0479
$$ -140279 -209711 -28267 -71095 -288707 14812 -337990 -327910 154707 92005 -161227 80479
10189g601B70820a09148K8208L570G3396L7603O8809L3213G3553e26395a29905
$$ -7601 270820 -109148 -80940 -77370 73396 110999 179808 213021 73553 -526395 -129905
10177c519H6066m1162b63333q4546A63115a38424C0700P5304J7934R8950d54728
$$ -3519 86066 44904 -263333 -347879 163115 -138424 30700 106004 123938 222888 -454728
10165I000R466a25622C6443b28309g132j89197q5357C1911a9543m4656B5879j2294
$$ 9000 18466 -125622 36443 -228309 -7132 -196329 -281686 31911 -19543 -64199 25879 13585
10153A3585J06819K6063J1881b01447g6007o3738M1187A80960a29229k3402c308
$$ 13585 120404 146467 158348 -201447 -76007 -139745 -98558 180960 -129229 -152631 -3308
10141B24990a59234O1918j71129B3116b10191c7987j64027C37476E8102J27255
$$ 224990 -159234 -97316 -268445 23116 -210191 -37987 -202014 337476 58102 185357
10131A85357J10114C3933a40754A43150a80100d5202q5596L1315B29062f9396
$$ 185357 295471 33933 -140754 143150 -180100 -45202 -130798 -99483 229062 -69396
10120b67839a10306e4377A11997K66141a74956G9609B7446J95072r9472B064a07446
$$ -267839 -110306 -54377 111997 378138 -174956 79609 27446 222518 123046 2064 -107446
10108h3110n8720f0236p3064A78476f6504k40883C3971j4059a49769L8892G4702
$$ -83110 -141830 -60236 -133300 178476 -66504 -307387 33971 19912 -149769 -110877 74702
10096b5760r5418j2524B22552b31867E2364e50l63859e563l08667A69319b32878
$$ -25760 -121178 -133702 222552 -231867 52364 -550 -364409 -5563 -314230 169319 -232878
10084a17780D1191a32510m42164a97731F5899b60365C7512M3590B4799a699E3613
$$ -117780 41191 -132510 -574674 -197731 65899 -260365 37512 81102 24799 -1699 53613
10072b45933C6525a7329j11487C25558A07504J14821h3462B75863a01747C47801
$$ -245933 36525 -17329 -128816 325558 107504 222325 -83462 275863 -101747 347801
10061D2448a60306A37636B7111a1076k29358a5523E6080b27323K5654j10536R4714
$$ 42448 -160306 137636 27111 -11076 -240434 -15523 56080 -227323 -201669 -312205 -217491
10050b17491A32535f73386a58116E4349J2989c85544k75307d274m6197C66782
$$ -217491 132535 -673386 -158116 54349 67338 -385544 -660851 -4274 -50471 366782
10039B51289i469m25779g2153m5819l56425H8162h1104C9388K3528a81791E9558
$$ 251289 -9469 -435248 -72153 -117972 -474397 88162 -81104 39388 62916 -181791 59558
10027b03430A21016a7590l24329b5022B77564e2173I3330f9240l3219A1867L4011
$$ -203430 121016 -17590 -341919 -25022 277564 -52173 93330 -69240 -102459 11867 45878
10016D5878J85597b90946A53154J52303A03028c836A09133J09116a85555J6930
$$ 45878 231475 -290946 153154 305457 103028 -3836 109133 218249 -185555 -168625
10006a68625a0428n5049A61457b31885M2899j93747a00224j46736d3023o6219
$$ -168625 -10428 -65477 161457 -231885 -188986 -382733 -100224 -246960 -43023 -109242
9996a09242A01839a15596k4352G9570A2688J64050b10805B48519J80024a10126
$$ -109242 101839 -115596 -139948 79570 12688 176738 -210805 248519 428543 -110126
9985B62733g2740p1587N3332A44967a29265N4998j54282k18093K18186J7077f8200
$$ 262733 -72740 -144327 -90995 144967 -129265 -74267 -228549 -446642 -228456 -211379 -68200
9973c17687J14251e1023A06962f8167b0652j68453d4689k100D15557A61855b8018
$$ -317687 -203436 -51023 106962 -68167 -20652 -189105 -44689 -46789 415557 161855 -28018
9961a67847l5292J999e4231I4614L6561a31818l7428C3445g0134k16400A15405
$$ -167847 -203139 -201140 -54231 94614 131175 -131818 -169246 33445 -70134 -286534 115405
9949a42787B11016e15A13883J47558a98790C1824J22510e5426k0120C0486a58944
$$ -142787 211016 -515 113883 261441 -198790 31824 154334 -55426 -75546 30486 -158944
9937b40954n5054I440b481k9660J5526j28757L8107Q030D2350L8096b9848j1744
$$ -240954 -296008 9440 -2481 -32141 -16615 -145372 -107265 -99235 42350 80446 -29848 -41592
9925d1592l157H8854a60021q424q5809N5068B13451b42906g0380o5216k06489
$$ -41592 -44749 88854 -160021 -168445 -254254 -199186 213451 -242906 -70380 -135596 -342085
9914c42085d3612j81448A05850m6687g1626m0634K489N4205K6812C18975a9770
$$ -342085 -43612 -225060 105850 59163 -71626 -112260 -109771 -55566 -28754 318975 -19770
9902a07388m1481A09430a06538A6754a48564H6875a44924j70426K7004O5441D6662
$$ -107388 -148869 109430 -106538 16754 -148564 86875 -144924 -315350 -288346 -222905 46662
9890B00810J16243F8273b03451j7848J4965B9309J6444a76096H7648a03720j68412
$$ 200810 317053 68273 -203451 -221299 -206334 29309 45753 -176096 87648 -103720 -272132
9879b72132R2130G1285b7981k00041J02764I0745b31087A18408g5751j44456J03069
$$ -272132 -180002 71285 -27981 -228022 -125258 90745 -231087 118408 -75751 -220207 -117138
9868a17138A66102D8194b02761j27166i0536j07135c032n1781l6976o4945j54677
$$ -117138 166102 48194 -202761 -329927 -90536 -197671 -3032 -54813 -91789 -156734 -311411
9857c11411Q3703a05274B16898c3721j98796c0833A38982c8030j79223A42907
$$ -311411 -227708 -105274 216898 -33721 -232517 -30833 138982 -38030 -217253 142907
9846A42204O1444c42271a47444h616I0727a55478P4900L6054C12777j17146a3416
$$ 142204 203648 -342271 -147444 -8616 90727 -155478 -80578 -44524 312777 195631 -13416
9834a59802a1317k33794f2811B21312l3099e840B98265b71147d9489A95109b41845
$$ -159802 -11317 -245111 -62811 221312 188213 -5840 298265 -271147 -49489 195109 -241845
9822A18444P3992b55747R7398j9913A85874b96916J39769j96G6998e9069B15193
$$ 118444 192436 -255747 -158349 -178262 185874 -296916 -157147 -157343 76998 -59069 215193
9810a27783A26143b49477c0206k39514A63469b04329i6720B85196E2027e509A3096
$$ -127783 126143 -249477 -30206 -269720 163469 -204329 -96720 285196 52027 -5509 13096
9798H7066d6913A55137b6145k74066A58180a3694I6432h7440H8332J18479e7129
$$ 87066 -46913 155137 -26145 -300211 158180 -13694 96432 -87440 88332 206811 -57129
9786a38221o7851E9763P6754d1118I5026a62864j86024J54616i0460C3976R3401
$$ -138221 -206072 59763 136517 -41118 95026 -162864 -348888 -194272 -90460 33976 127377
9775A27377A2364c12577C0023Q0017J2026d54164A37821c3770G895K53389a69068
$$ 127377 12364 -312577 30023 110040 122066 -454164 137821 -33770 7895 261284 -169068
9763D7093J46700d1572l92712A96290D8587b7562l77257J77973h9018E9585j0567
$$ 47093 193793 -41572 -434284 196290 48587 -27562 -404819 -226846 -89018 59585 49018
9752D9018h4812c342j78477M1178a3308k56004B4266E963b60707n7035J02753
$$ 49018 -84812 -3342 -181819 -140641 -13308 -269312 24266 5963 -260707 -317742 -214989
9741b14989g091l34586B18476H5138J45218f8792G6768f3746m6072k19161f9989
$$ -214989 -7091 -341677 218476 85138 230356 -68792 76768 -63746 -109818 -328979 -69989
9729d04429J16094A50424a54704b0299j62318A58978h852I330b92908h2550r0444
$$ -404429 -288335 150424 -154704 -20299 -182617 158978 -8852 9330 -292908 -82550 -172994
9718a72994g1101A06190k4629d13187A6275e6569A38990a20193j48986J16221
$$ -172994 -71101 106190 81561 -413187 16275 -56569 138990 -120193 -269179 -152958
9708a52958k81660A27851l9454b2104A21946h8735L4016C42970a8960k60468i6041
$$ -152958 -434618 127851 88397 -22104 121946 -88735 -54719 342970 -18960 -279428 -96041
9696I6966m8166N8927h9405A7662d0435k05347f9217F1606a65634k06452R6705
$$ 96966 48800 107727 -89405 17662 -40435 -245782 -69217 61606 -165634 -372086 -275381
9685b75381b1947B9517M0302M2055e9750I9086b01176c912n2133j06093f1l33706
$$ -275381 -21947 29517 69819 111874 -59750 99086 -201176 -3912 -56045 -162138 -61 -333767
9673c33767A34778E5149J13261b26398a5462o375l5128K380j01965c3768A12112
$$ -333767 134778 55149 168410 -226398 -15462 -21837 -56965 -54585 -156550 -33768 112112
9661c56203A3776c17843D0776j5769a67779O2245m8442A575N9810B702b83885
$$ -356203 13776 -317843 40776 25007 -167779 -105534 -153976 1575 61385 2702 -283885
9649A4043J85191b26753k6967J6824f7445A09136m8779r428c23387a18222j27087
$$ 14043 199234 -226753 -253720 -236896 -67445 109136 60357 50929 -323387 -118222 -245309
9638b45309G177g4430k65084h1469D7417a60871E9533e44444H4068J0569a01140
$$ -245309 7177 -74430 -339514 -81469 47417 -160871 59533 -544444 84068 94637 -101140
9626A02074M816a66355A99145b93092A84286b04698A2484a1821k04015A07723
$$ 102074 106890 -166355 199145 -293092 184286 -204698 12484 -11821 -215836 107723
9615H272a65475l5114Q1614B88521I1436b44510k91410b26242h8375j30425h3748
$$ 8272 -165475 -200589 -118975 288521 91436 -244510 -535920 -226242 -88375 -218800 -83748
9603E1742d8324G1282r810B6236L08060F1187a28364B86288F4457G977J99489
$$ 51742 -48324 71282 61472 26236 334296 61187 -128364 286288 64457 7977 207466
9592B07466b77500A4615M20925I686a2486j13941N2887j90724B63051c02179g5265
$$ 207466 -277500 14615 435540 9686 -12486 -126427 -73540 -264264 263051 -302179 -75265
9580H8622b79093J8485j00760a71020o3224b196B18573a1078D10820a4241l28
$$ 88622 -279093 -260608 -361368 -171020 -234244 -2196 218573 -11078 410820 -14241 -14569
9569a4569o1342c2122j26137K8914r290l0982C7018q410O8458E196a37719C23107
$$ -14569 -75911 -32122 -158259 -129345 -138635 -169617 37018 28608 97066 5196 -137719 323107
9556A81108e9636j25234a9043D0818b60165J12389e1661k28793A35883a12260
$$ 181108 -59636 -184870 -19043 40818 -260165 -147776 -51661 -280454 135883 -112260
9545B31742a45547e1193G7659G44a85179Q5229g347n9813j62979a07962p3713
$$ 231742 -145547 -51193 77659 744 -185179 -99950 -7347 -67160 -230139 -107962 -181675
9534a81675L0392D6551R0965C0556a20657a6253k38811d7638l6952A19911a03209
$$ -181675 -151283 46551 137516 30556 -120657 -16253 -255064 -47638 -84590 119911 -103209
9522a08102A824J58099a76597I1543m4878j5761R3813a67051J268B56177B5247
$$ -108102 1824 159923 -176597 91543 46665 30904 124717 -167051 -165783 256177 25247
9510A10019A428c11110J30661B6684J14943C4236J73771C6380h6969p363m490
$$ 110019 1428 -311110 -180449 26684 141627 34236 208007 36380 -86969 -94332 -98822
9499i8822B84072a31559d7668H6352c25259c5562k28802J01406N8816j24251k73996
$$ -98822 284072 -131559 -47668 86352 -325259 -35562 -264364 -162958 -104142 -228393 -502389
9488e02389A69526A7217a07522n0967C5501b07706e2281J6668j31337G0031c93913
$$ -502389 169526 17217 -107522 -158489 35501 -207706 -52281 -35613 -166950 70031 -393913
9476h7716k6176K0301l25677A19780l6823a67868b5961m2979a4836p7723k26001
$$ -87716 -113892 -93591 -419268 119780 82957 -167868 -25961 -68940 -14836 -92559 -318560
9465c18560a12198j37531n3066E32034b51263d9447D9420H994a10692J4181K8655
$$ -318560 -112198 -249729 -302795 532034 -251263 -49447 49420 8994 -110692 -96511 -67856
9454f7856B8081i1374K956C1127M7600a11683j86658e7199j53761A32433b4942
$$ -67856 28081 -91374 -88418 31127 78727 -111683 -298341 -57199 -210960 132433 -24942
9442b70647E7021A8185J9665M6383J46442g5290j14909M979A59295Q1415A9127
$$ -270647 57021 18185 37850 84233 230675 -75290 -190199 -185220 159295 240710 19127
9430f3903l44094A31441A4308c6868D4614a38795A41935a20936p9786P1241B2408
$$ -63903 -407997 131441 14308 -36868 44614 -138795 141935 -120936 -200722 -129481 22408
9418b7891n6621k15992a30123e1463k44643A15627b65341P2569R4895d7691j30618
$$ -27891 -84512 -300504 -130123 -51463 -296106 115627 -265341 -192772 -97877 -47691 -178309
9407a78309N2572Q323e7793E4304i1574A47192b88997F056d9659A30202J52146
$$ -178309 -125737 -117414 -57793 54304 -91574 147192 -288997 6056 -49659 130202 282348
9396B82348A27344a3760j50904C35388j63026o5138a50092B51784G5252e773G5629
$$ 282348 127344 -13760 -164664 335388 172362 107224 -150092 251784 75252 -5773 75629
9384C7447a3888o3323L7970C72926a78467A50143B6877J55447K1261H1321c21862
$$ 37447 -13888 -77211 -39241 372926 -178467 150143 26877 182324 203585 81321 -321862
9372a46778A51789b95281h4212C87775i3497c7114n4276A27799d0625j83691a04617
$$ -146778 151789 -295281 -84212 387775 -93497 -37114 -91390 127799 -40625 -224316 -104617
9360e4309B67429E1954J657b26783A68089a84586F478c92900a59822f5288k06214
$$ -54309 267429 51954 53611 -226783 168089 -184586 6478 -392900 -159822 -65288 -271502
9349b71502H3184a09682o3784Q1139b2970j39030j135j62570H857a17431M338
$$ -271502 83184 -109682 -173466 -92327 -22970 -162000 -163135 -325705 8857 -117431 -113093
9338a13093l9110j22290E9605e5544J0447j70201m5338A18238a43881F277b07687
$$ -113093 -152203 -274493 59605 -55544 -45097 -215298 -260636 118238 -143881 6277 -207687
9326A43820a26050j61658A69148c01618G6302R2621B0935a12031B22277f5639
$$ 143820 -126050 -287708 169148 -301618 76302 168923 20935 -112031 222277 -65639
9315f4258E6319a79495L876A5428i7470p1120a1302A03448a64168L900a9810j4063
$$ -64258 56319 -179495 -175619 15428 -97470 -168590 -11302 103448 -164168 -160268 -19810 -33873
9303c3873a648B57458A20961e0745A18290J05219A5028a12559m8364j736f9666
$$ -33873 -1648 257458 120961 -50745 118290 223509 15028 -112559 -160923 -162659 -69666
9291c40245i2013q3261j45955r0414J41908e2940n3521l5629L4455H6321J76121
$$ -340245 -92013 -175274 -321229 -411643 -269735 -52940 -106461 -142090 -107635 86321 262442
9280B62442i0347j58407o0656h8709A37035C5603a47142l49725D4691a24186e7219
$$ 262442 -90347 -248754 -309410 -88709 137035 35603 -147142 -496867 44691 -124186 -57219
9268a85731N0612c964l30328M6124N8960A09534c33417d9602B07146F7794b76565
$$ -185731 -135119 -3964 -334292 -288168 -229208 109534 -333417 -49602 207146 67794 -276565
9256b1011H7015C0628L52662b19041C42602d6583j82723O6641f7235j12726N3160
$$ -21011 87015 30628 383290 -219041 342602 -46583 -229306 -162665 -67235 -179961 -126801
9245a26801A44679n7184b79880B34583a49434l3517E6364b27858P9136E7845b47459
$$ -126801 144679 87495 -279880 234583 -149434 -182951 56364 -227858 -148722 57845 -247459
9233B18197Q451c61348E7477J05063G9853a42545B0373i5035g735O43A11646D3169
$$ 218197 226648 -361348 57477 162540 79853 -142545 20373 -95035 -7735 -7092 111646 43169
9220e09132f2151A7573J22069a5299j29237f5812A02335M381e8315a3414l963
$$ -509132 -62151 17573 139642 -15299 -144536 -65812 102335 106716 -58315 -13414 -17377
9209a7377q7183A67189c55496g5025o7262g0550o7320F1578a33788j09076a20508
$$ -17377 -104560 167189 -355496 -75025 -142287 -70550 -137870 61578 -133788 -242864 -120508
9197B42106J54112G872d09088d8525k6799c1325A8157f7751n9946N8987l4822
$$ 242106 396218 7872 -409088 -48525 -75324 -31325 18157 -67751 -127697 -68710 -103532
9186a03532A04540P5144b41739A22796l1585f9041d749o4426p6453A11534a16703
$$ -103532 104540 179684 -241739 122796 91211 -69041 -4749 -69175 -145628 111534 -116703
9174i6959D0054b21202B06364B9172b31366o9195a42736b3798F3885c26158J08412
$$ -96959 40054 -221202 206364 29172 -231366 -300561 -142736 -23798 63885 -326158 -217746
9163b17746A01073b00329J6672Q4101F056R0428c10669A3725K94842D9098J2526
$$ -217746 101073 -200329 -183657 -99556 6056 96484 -310669 13725 308567 49098 61624
9152F1624b24686A95432a10996D4830d64112a65838C306M9959a46850B7223c73542
$$ 61624 -224686 195432 -110996 44830 -464112 -165838 3306 53265 -146850 27223 -373542
9140a66106n8284g4423F6122J61923a18034j23048A86478G1431c8498m407k64362
$$ -166106 -224390 -74423 66122 228045 -118034 -241082 186478 71431 -38498 -42905 -307267
9129c07267a09231B1351K0529a12909I8803b30561F5430K3193b28004B37993G6594
$$ -307267 -109231 21351 41880 -112909 98803 -230561 65430 88623 -228004 237993 76594
9117a38705j20034C1281c49714A4516J8047j0346b28589A81835J1201B564b34204
$$ -138705 -258739 31281 -349714 14516 32563 22217 -228589 181835 193036 2564 -234204
9105c91658H8182a96308j87091H8251B7878J5349b1350j11856a4272k29531A56747
$$ -391658 88182 -196308 -383399 88251 27878 43227 -21350 -133206 -14272 -243803 156747
9093B63868c20756B47112b45184A15122D7966a84861e4317j37560a775l02291
$$ 263868 -320756 247112 -245184 115122 47966 -184861 -54317 -191877 -1775 -304066
9083c04066C35099H338h6865j46955H6540a63292E669r92L14146B2127a05921
$$ -304066 335099 8338 -86865 -233820 86540 -163292 5669 4677 318823 22127 -105921
9071b74272a9883l16701M1466J14516J0334I5655h5903B55335b16327L8151J5681
$$ -274272 -19883 -336584 -295118 -180602 -170268 95655 -85903 255335 -216327 -178176 -162495
9060a62495G8477c0739l6158B51725F7150c2108E6824K7547J50812a8739A5416
$$ -162495 78477 -30739 -66897 251725 67150 -32108 56824 84371 235183 -18739 15416
9048I899M8490Q6767a72310k6472F9479J7055b21738A3716b6359G1124c04346
$$ 9899 58389 145156 -172310 -198782 69479 86534 -221738 13716 -26359 71124 -304346
9036A43272a29599A28622F1753J98405B4558R6924B1983K79044B6443i5312F6995
$$ 143272 -129599 128622 61753 260158 24558 121482 21983 301027 26443 -95312 66995
9024A25217c5840l9905K223A77939f3365F0357b75630a37395O6551I9880A9792
$$ 125217 -35840 -75745 -73522 177939 -63365 60357 -275630 -137395 -70844 99880 19792
9012C8212J17933B8173a81266j01961P1505I4585J09049h8498L5117A17407M2631
$$ 38212 156145 28173 -181266 -283227 -211722 94585 203634 -88498 -53381 117407 160038
9001A60038P1636d9028l43923k9726a26929A1704J56675c3598j13060B41111b5579
$$ 160038 231674 -49028 -392951 -422677 -126929 11704 168379 -33598 -146658 241111 -25579
8989d3814B13426b10774m097P6431k28093J02420J24189D3091J36007B2220r696
$$ -43814 213426 -210774 -214871 -138440 -366533 -264113 -139924 43091 179098 22220 12524
8978A2524b30677k49886B15348d7292B43069m6096a54587j48767J50513l5867
$$ 12524 -230677 -480563 215348 -47292 243069 196973 -154587 -303354 -152841 -188708
8968a88708l6981b666B4142O2848a38933a3636F2139J17847a49036B15736c2303
$$ -188708 -225689 -2666 24142 86990 -138933 -13636 62139 179986 -149036 215736 -32303
8956a24207J8270j48109B20193a06636C3486b50323a0824b338E7797b66365B60151
$$ -124207 -105937 -254046 220193 -106636 33486 -250323 -10824 -2338 57797 -266365 260151
8944b46976h8034l8267M6B70953b21838g7318j55247E0218K78850a11930C58399
$$ -246976 -88034 -126301 -126255 270953 -221838 -77318 -232565 50218 329068 -111930 358399
8932e7642A32176c7556j28785r3905J13903C82556J16440j40022J258710M860494
$$ -57642 132176 -37556 -166341 -260246 -146343 382556 498996 358974 1617684 6478178
8922F478178J2654261r524052C237372A467624o39711r5329A09688K56304f86
$$ 6478178 19132439 9608387 3237372 1467624 827913 732584 109688 365992 -686
8912d8459A46807a65343F26112l9174j35966B23622n4115i6615l6482d1042I2476
$$ -48459 146807 -165343 626112 586938 450972 223622 169507 -96615 -133097 -41042 92476
8900a78948l0099I0167L741L00619H6444l7777a27457A00190k754A9099a67057
$$ -178948 -209047 90167 93908 394527 86444 48667 -127457 100190 97436 19099 -167057
8888A23236e7379o5245L6359n5644o4816K8612a0493k51338a11073G6068J26006
$$ 123236 -57379 -122624 -86265 -141909 -206725 -178113 -10493 -261831 -111073 76068 202074
$$ [...]
##END NTUPLES=NMR SPECTRUM
##END=
