##TITLE=AC1583_13IEXT2754_8214317_CFdQjpgJHK
##JCAMPDX= 6.0         $$ Bruker NMR JCAMP-DX V2.0
##DATA TYPE= NMR SPECTRUM
##DATA CLASS= NTUPLES
##ORIGIN= BRUKER
##OWNER= Administrator
$$ 1.72 TOPSPIN		Version 2.1
$$ 2013-10-04 23:05:10.794 -0700  Administrator@X
$$ Compression mode = diff/dup
##.OBSERVE FREQUENCY= 400.02188249412
##.OBSERVE NUCLEUS= ^1H
##.ACQUISITION MODE= SIMULTANEOUS (DQD)
##.ACQUISITION SCHEME= undefined
##.AVERAGES= 64
##.DIGITISER RES= 22
##SPECTROMETER/DATA SYSTEM= spect
##.PULSE SEQUENCE= noesygpps1d.comp
##.SOLVENT NAME= COFFEE_meoh
##.SHIFT REFERENCE= INTERNAL, COFFEE_meoh, 1, 14.96062
##AUDIT TRAIL= $$ (NUMBER, WHEN, WHO, WHERE, PROCESS, VERSION, WHAT)
$$ ##TITLE= Audit trail, TOPSPIN		Version 2.1
$$ ##JCAMPDX= 5.01
$$ ##ORIGIN= Bruker BioSpin GmbH
$$ ##OWNER= Administrator
$$ $$ E:\/data/COFFEE/nmr/AC1583_13IEXT2754_8214317_CFdQjpgJHK/12/pdata/1/auditp.txt
$$ ##AUDIT TRAIL=  $$ (NUMBER, WHEN, WHO, WHERE, PROCESS, VERSION, WHAT)
(   1,<2013-10-04 23:05:06.107 -0700>,<Administrator>,<X>,<go>,<TOPSPIN 2.1>,
      <created by zg
	started at 2013-10-04 22:53:36.136 -0700,
	POWCHK enabled, PULCHK disabled,
       configuration hash MD5:
       C8 4E 4E 5D D3 5C D8 9E 9F 52 82 E0 59 8A DE 15
       data hash MD5: 64K
       D8 FF AE FE EE 1E 73 1C 8C 8C AC 75 EA 1E 37 42>)
(   2,<2013-10-04 23:05:08.998 -0700>,<Administrator>,<X>,<proc1d>,<TOPSPIN 2.1>,
      <Start of raw data processing
       efp LB = 0.3 FT_mod = 6 PKNL = 1 PHC0 = 0 PHC1 = 0 SI = 128K 
       data hash MD5: 128K
       7C 25 D4 FA 24 74 6B 2C 19 A4 18 1C 60 8D FB 48>)
(   3,<2013-10-04 23:05:09.888 -0700>,<Administrator>,<X>,<proc1d>,<TOPSPIN 2.1>,
      <pk PHC0 = -83.27637 PHC1 = 0 
       data hash MD5: 128K
       7A 7E 1B 2A 9E 72 0C 26 97 C1 FE 6D DD D7 BB 4F>)
(   4,<2013-10-04 23:05:10.263 -0700>,<Administrator>,<X>,<proc1d>,<TOPSPIN 2.1>,
      <abs ABSG = 1 
       data hash MD5: 128K
       BD 65 FF EB 62 5E 61 7B 81 32 18 8C 90 73 35 4A>)
(   5,<2013-10-04 23:05:10.373 -0700>,<Administrator>,<X>,<proc1d>,<TOPSPIN 2.1>,
      <abs ABSG = 2 
       data hash MD5: 128K
       27 6C 78 07 FC 70 E9 B8 0E 59 E9 D4 35 01 30 1F>)
(   6,<2013-10-04 23:05:10.466 -0700>,<Administrator>,<X>,<proc1d>,<TOPSPIN 2.1>,
      <abs ABSG = 3 
       data hash MD5: 128K
       EB 6E A5 FA 1D B5 1D CA FF B0 8C 6C 9B 85 D2 88>)
(   7,<2013-10-04 23:05:10.544 -0700>,<Administrator>,<X>,<proc1d>,<TOPSPIN 2.1>,
      <abs ABSG = 4 
       data hash MD5: 128K
       F9 40 AD 51 C8 B8 45 19 A3 09 9E 93 51 69 64 58>)
(   8,<2013-10-04 23:05:10.623 -0700>,<Administrator>,<X>,<proc1d>,<TOPSPIN 2.1>,
      <abs ABSG = 5 
       data hash MD5: 128K
       7E A1 93 65 AC 43 10 D1 D7 B4 FB 5C 63 B9 7B 46>)
$$ ##END=
$$ 
$$ $$ hash MD5
$$ $$ DB A0 AE B3 F0 06 B9 82 B3 57 89 7F 7C 7F CB CC
##$RELAX= 
##$RELAX= 
##$RELAX= 
##$RELAX= 
##$RELAX= 
##$RELAX= 
##$RELAX= 
##$RELAX= 
$$ Bruker specific parameters
$$ --------------------------
##$DU= <E:\>
##$EXPNO= 12
$$ [...]
##$TP07= 0
##$TPNAME0= <>
##$TPNAME1= <>
##$TPNAME2= <>
##$TPNAME3= <>
##$TPNAME4= <>
##$TPNAME5= <>
##$TPNAME6= <>
##$TPNAME7= <>
##$TPOAL= (0..7)
0.5 0.5 0.5 0.5 0.5 0.5 0.5 0.5
##$TPOFFS= (0..7)
0 0 0 0 0 0 0 0
##$TUNHIN= 0
##$TUNHOUT= 0
##$TUNXOUT= 0
##$USERA1= <user>
##$USERA2= <user>
##$USERA3= <user>
##$USERA4= <user>
##$USERA5= <user>
##$V9= 5
##$VALIST= <valist>
##$VCLIST= <CCCCCCCCCCCCCCC>
##$VD= 0
##$VDLIST= <DDDDDDDDDDDDDDD>
##$VPLIST= <PPPPPPPPPPPPPPP>
##$VTLIST= <TTTTTTTTTTTTTTT>
##$WBST= 2048
##$WBSW= 25
##$XGAIN= (0..3)
0 0 0 0
##$XL= 0
##$YL= 0
##$YMAX_a= 6283268
##$YMIN_a= -11316564
##$ZGOPTNS= <>
##$ZL1= 120
##$ZL2= 120
##$ZL3= 120
##$ZL4= 120
##$ABSF1= 14.96062
##$ABSF2= -5.597562
##$ABSG= 5
##$ABSL= 3
##$ALPHA= 0
##$AQORDER= 0
##$ASSFAC= 0
##$ASSFACI= 0
##$ASSFACX= 0
##$ASSWID= 0
##$AUNMP= <proc_prof1d_extract.lims>
##$AXLEFT= 0
##$AXNAME= <>
##$AXNUC= <1H>
##$AXRIGHT= 0
##$AXTYPE= 0
##$AXUNIT= <>
##$AZFE= 0.1
##$AZFW= 0.1
##$BCFW= 0
##$BC_mod= 0
##$BYTORDP= 0
##$COROFFS= 0
##$CY= 15
##$DATMOD= 1
##$DC= 0
##$DFILT= <>
##$DTYPP= 0
##$F1P= 0
##$F2P= 0
##$FCOR= 0.5
##$FTSIZE= 131072
##$FT_mod= 6
##$GAMMA= 0
##$GB= 0
##$INTBC= 1
##$INTSCL= 1
##$ISEN= 128
##$LB= 0.3
##$LEV0= 0
##$LPBIN= 0
##$MAXI= 10000
##$MC2= 0
##$MEAN= 0
##$ME_mod= 0
##$MI= 0
##$NCOEF= 0
##$NC_proc= -2
##$NLEV= 6
##$NOISF1= 0
##$NOISF2= 0
##$NSP= 0
##$NTH_PI= 0
##$NZP= 0
##$OFFSET= 14.96062
##$PC= 1
##$PHC0= -83.27637
##$PHC1= 0
##$PH_mod= 1
##$PKNL= yes
##$PPARMOD= 0
##$PPDIAG= 0
##$PPIPTYP= 0
##$PPMPNUM= 2147483647
##$PPRESOL= 1
##$PSCAL= 4
##$PSIGN= 0
##$PYNMP= <proc.py>
##$REVERSE= no
##$SF= 400.020009787706
##$SI= 131072
##$SIGF1= 0
##$SIGF2= 0
##$SINO= 400
##$SIOLD= 131072
##$SPECTYP= <>
##$SREGLST= <1H.CDCl3>
##$SSB= 0
##$STSI= 131072
##$STSR= 0
##$SW_p= 8223.68421052631
##$SYMM= 0
##$S_DEV= 0
##$TDeff= 65536
##$TDoff= 0
##$TI= <>
##$TILT= no
##$TM1= 0
##$TM2= 0
##$TOPLEV= 0
##$USERP1= <user>
##$USERP2= <user>
##$USERP3= <user>
##$USERP4= <user>
##$USERP5= <user>
##$WDW= 1
##$XDIM= 131072
##$YMAX_p= 370395858
##$YMIN_p= -11760
##$CURPLOT= <Network HP LaserJet P1505>
##$CURPRIN= <$Network HP LaserJet P1505>
##$DFORMAT= <normdp>
##$LAYOUT= <+/1D_H.xwp>
##$LFORMAT= <normlp>
##$PFORMAT= <normpl>
##$SURQMSG= 1
$$ End of Bruker specific parameters
$$ ---------------------------------
##NTUPLES= NMR SPECTRUM
##VAR_NAME=  FREQUENCY,     SPECTRUM/REAL,   SPECTRUM/IMAG
##SYMBOL=    X,             R,               I
##VAR_TYPE=  INDEPENDENT,   DEPENDENT,       DEPENDENT
##VAR_FORM=  AFFN,          ASDF,            ASDF
##VAR_DIM=   131072,        131072,          131072
##UNITS=     HZ,            ARBITRARY UNITS, ARBITRARY UNITS
##FACTOR=    0.0627417313425164, 1,          1
##FIRST=     8223.62146879497, -338,         -60260
##LAST=      0,             880,             -60587
##MIN=       0,             -11760,          0
##MAX=       8223.62146879497, 370395858,    0
$$ Real data points
##PAGE= N=1
##DATA TABLE= (X++(R..R)), XYDATA
$$ [...]
$$ plain form
63987 245723 247002 248630 251610 256211 261754 267325 272468 277243 282027 287350 293580 300519 307534 314249
63973 314249 320931 328045 335625 343291 350743 358095 365873 374776 385323 397510 410918 425255 440765
63960 440765 458028 477492 499241 523146 549238 578147 611307 650510 697144 751954 815538
63949 815538 888726 972279 1066532 1171593 1287691 1414882 1552510 1699228 1853517 2013930
63939 2013930 2178860 2346338 2513959 2678636 2836453 2983193 3115229 3229739 3324180 3396095
63929 3396095 3443746 3466531 3464371 3436959 3384122 3306859 3207626 3089614 2956229 2811205 2658501
63918 2658501 2501484 2342443 2183307 2026648 1875474 1732010 1597133 1471121 1354608
63909 1354608 1248564 1153582 1069388 994920 928763 869758 817393 771517 731569 696362 664835
$$ packed form
63987B45723J279J628K980M601N543N571N143M775M784N323O230O939P015O715
63973C14249O682P114P580P666P452P352P778Q903J0547J2187J3408J4337J5510
63960D40765J7263J9464K1749K3905K6092K8909L3160L9203M6634N4810O3584
63949H15538P3188Q3553R4253J05061J16098J27191J37628J46718J54289J60413
63939B013930J64930J67478J67621J64677J57817J46740J32036J14510R4441P1915
63929C396095M7651K2785k160k7412n2837p7263r9233j18012j33385j45024j52704
63918B658501j57017j59041j59136j56659j51174j43464j34877j26012j16513
63909A354608j06044r4982q4194p4468o6157n9005n2365m5876l9948l5207l1527
$$ plain form
63898 664835 636758 612394 591654 573962 558761 545647 534065 523426 513716 505554 499434 495201
63886 495201 492507 491394 492137 494800 499307 505799 514537 525585 538906 554733 573461 595075 618912
63873 618912 644069 669894 696103 722628 749413 776131 802038 826242 848204 867842 885074
63862 885074 899491 910707 918932 924868 928963 930932 930139 926317 919608 909948 896800 879739 859147
63849 859147 835974 810894 784029 755571 726336 697389 669239 641593 613884 585963 558337
63838 558337 531895 507356 484869 464124 444807 426844 410160 394381 378979 363722 348938
63827 348938 335344 323598 313839 305528 297839 290317 283132 276642 270861 265448 260108 254856 249928 245570
63813 245570 241877 238700 235725 232628 229214 225495 221808 218820 217084 216491 216309 215811 214605 212425 209105
$$ packed form
63898F64835k8077k4364k0740j7692j5201j3114j1582j0639r710q162o120m233
63886D95201k694j113P43K663M507O492Q738J1048J3321J5827J8728K1614K3837
63873F18912K5157K5825K6209K6525K6785K6718K5907K4204K1962J9638J7232
63862H85074J4417J1216Q225N936M095J969p93l822o709r660j3148j7061k0592
63849H59147k3173k5080k6865k8458k9235k8947k8150k7646k7709k7921k7626
63838E58337k6442k4539k2487k0745j9317j7963j6684j5779j5402j5257j4784
63827C48938j3594j1746r759q311p689p522p185o490n781n413n340n252m928m358
63813B45570l693l177k975l097l414l719l687k988j736n93j82m98j206k180l320
$$ plain form
63798 209105 205063 201408 199064 197943 197271 196500 195526 194322 192961 191868 191399 191127 190151 188327 186631 186020
63782 186020 186316 186560 186116 185104 184002 183236 183029 183267 183457 183072 182039 180862 180283 180725 181894 182889 182932
63765 182932 182084 181054 180330 179784 179227 178894 179099 179704 180339 180923 181563 182095 182193 181952 181908 182343 182944 183341 183690
63746 183690 184427 185620 186892 187931 188840 189972 191635 194026 197143 200572 203557 205643 207278 209463 212714
63731 212714 216585 220341 223792 227259 231073 235507 241002 247793 255219 261885 266802 270189 273000 275884
63717 275884 278646 280424 280310 278140 274856 271745 269128 266182 262217 257693 253623 250433 247933 246048
63703 246048 244863 244064 243096 241973 241383 241818 243052 244624 246378 248278 250142 251918 253922 256457 259370
63688 259370 262284 265067 267756 270137 271849 272992 274306 276493 279436 282295 284387 285807 287117 288611
$$ packed form
63798B09105m042l655k344j121o72p71r74j204j361j093m69k72r76j824j696o11
63782A86020K96K44m44j012j102p66k07K38J90l85j033j177n79M42J169R95M3
63765A82932q48j030p24n46n57l33K05O05O35N84O40N32R8k41m4M35O01L97L49
63746A83690P37J193J272J039R09J132J663K391L117L429K985K086J635K185L251
63731B12714L871L756L451L467L814M434N495O791P426O666M917L387K811K884
63717B75884K762J778j14k170l284l111k617k946l965m524m070l190k500j885
63703B46048j185p99r68j123n90M35J234J572J754J900J864J776K004K535K913
63688B59370K914K783K689K381J712J143J314K187K943K859K092J420J310J494
$$ plain form
63674 288611 290217 292039 294461 297403 299889 300909 300627 300215 300465 301053 301209 300574 299132 296785 293461 289452
63658 289452 285280 281287 277465 273527 269042 263868 258666 254599 252156 250621 249064 247534 246704 246618 246557
63643 246557 246147 245905 246451 247713 249251 250930 252902 255193 257691 260444 263745 267949 273305 279755 286815
63628 286815 293896 300911 308339 316553 325386 334627 344629 356030 369043 383391 398852 415392 432853
63615 432853 451031 470275 491605 515873 542945 571787 601167 630038 657414 682216 703395
63604 703395 720203 732341 739881 743076 742337 738504 732935 726976 721195 715283 708715 701276 692824 682909
63590 682909 670969 656875 640995 623773 605433 586137 566281 546551 527739 510459 494938
63579 494938 481056 468600 457445 447556 439036 432309 427939 425986 425675 426024 426837 428832 432784 438811
$$ packed form
63674B88611J606J822K422K942K486J020k82m12K50N88J56o35j442k347l324m009
63658B89452m172l993l822l938m485n174n202m067k443j535j557j530q30q6o1
63643B46557m10k42N46J262J538J679J972K291K498K753L301M204N356O450P060
63628B86815P081P015P428Q214Q833R241J0002J1401J3013J4348J5461J6540J7461
63615D32853J8178J9244K1330K4268K7072K8842K9380K8871K7376K4802K1179
63604G03395J6808J2138P540L195p39l833n569n959n781n912o568p439q452r915
63590F82909j1940j4094j5880j7222j8340j9296j9856j9730j8812j7280j5521
63579D94938j3882j2456j1155r889q520o727m370j953l11L49Q13J995L952O027
$$ plain form
63565 438811 446453 455109 464340 474115 484946 497540 512076 527987 544584 561784 580122 600310
63553 600310 622962 648540 677219 708863 743233 779957 817916 854659 886760 911020 925582
63542 925582 930418 927177 918454 906704 893575 880190 867750 857393 849488 843416 838094 832446 825421
63529 825421 816026 803595 787830 768535 745702 719951 692476 664258 635630 606806 578485 551556
63517 551556 526492 503369 482188 462776 444689 427842 413080 401444 392690 385112 377087 368417
63505 368417 360026 352775 346860 341989 337800 334195 331398 329463 327707 325184 321980 319478 318802 319350 319482
63490 319482 318467 317114 316565 317171 318631 320602 322890 325522 328913 333554 339279 345231 350762 355894 360580
63475 360580 364094 365794 366141 366187 366171 365318 363075 359778 355832 350995 345010 338468 332364 326946 321594 315899
$$ packed form
63565D38811P642Q656R231R775J0831J2594J4536J5911J6597J7200J8338K0188
63553F00310K2652K5578K8679L1644L4370L6724L7959L6743L2101K4260J4562
63542I25582M836l241q723j1750j3129j3385j2440j0357p905o072n322n648p025
63529H25421r395j2431j5765j9295k2833k5751k7475k8218k8628k8824k8321k6929
63517E51556k5064k3123k1181j9412j8087j6847j4762j1636q754p578q025q670
63505C68417q391p251n915m871m189l605k797j935j756k523l204k502o76N48J32
63490C19482j015j353n49O06J460J971K288K632L391M641N725N952N531N132M686
63475C60580L514J700L47M6j6q53k243l297l946m837n985o542o104n418n352n695
$$ plain form
63459 315899 310344 305773 302568 300637 299883 300290 301582 303198 304794 306635 309340 313312 318624 325394 334030
63444 334030 344957 358208 373544 390899 410591 433085 458689 487375 518497 550464 580909
63433 580909 607529 628839 644205 653589 657744 658572 658698 660249 664185 670878 681009 695545 714949
63420 714949 738815 766211 796017 826870 857229 885773 911519 933394 950061 960580 965138 964824
63408 964824 960864 954400 946725 938956 931219 922675 912527 900589 886561 869413 848096 822650 794103
63395 794103 763526 731770 699985 669593 641501 615781 592253 570894 551582 533952 517867
63384 517867 503677 491774 482193 474886 469904 466983 465373 464562 464949 467294 471709 477716 485151 494405
63370 494405 505643 518302 531656 545597 560720 577816 597395 619497 643847 670238 698714
$$ packed form
63459C15899n555m571l205j931p54M07J292J616J596J841K705L972N312O770Q636
63444C34030J0927J3251J5336J7355J9692K2494K5604K8686L1122L1967L0445
63433E80909K6620K1310J5366R384M155Q28J26J551L936O693J0131J4536J9404
63420G14949K3866K7396K9806L0853L0359K8544K5746K1875J6667J0519M558l14
63408I64824l960o464p675p769p737q544j0148j1938j4028j7148k1317k5446k8547
63395G94103l0577l1756l1785l0392k8092k5720k3528k1359j9312j7630j6085
63384E17867j4190j1903r581p307m982k921j610q11L87K345M415O007P435R254
63370D94405J1238J2659J3354J3941J5123J7096J9579K2102K4350K6391K8476
$$ plain form
63359 698714 729196 761062 793341 825284 856355 885544 911081 931084 944463 951244 952400 949521
63347 949521 944276 937728 930083 921113 910729 899113 886504 873030 858539 842405 823654 801590
63335 801590 776384 749079 721119 693902 668487 645362 624484 605715 589284 575753 565624
63324 565624 559028 555636 554597 554449 553186 548629 539106 524284 505570 485461 466158 448594 432711
63311 432711 418308 405415 394105 384362 376168 369386 363538 357980 352400 346920 341645 336426 331261
63298 331261 326702 323476 321735 320862 319990 318546 316369 313634 310819 308469 306673 304776 301902 297883 293519
63283 293519 289769 286820 284208 281790 280150 279788 280184 280122 278980 277311 276013 275277 274680 274114 274069 274912 276307
63266 276307 277581 278422 278947 279333 279790 280770 282690 285353 288082 290597 293336 296675 300297 303788 307492
$$ packed form
63359F98714L0482L1866L2279L1943L1071K9189K5537K0003J3379O781J156k879
63347I49521n245o548p645q970j0384j1616j2609j3474j4491j6134j8751k2064
63335H01590k5206k7305k7960k7217k5415k3125k0878j8769j6431j3531j0129
63324E65624o596l392j039j48j263m557r523j4822j8714k0109j9303j7564j5883
63311D32711j4403j2893j1310r743q194o782n848n558n580n480n275n219n165
63298C31261m559l226j741q73q72j444k177k735k815k350j796j897k874m019m364
63283B93519l750k949k612k418j640l62L96o2j142j669j298p36n97n66m5Q43J395
63266B76307J274Q41N25L86M57R80J920K663K729K515K739L339L622L491L704
$$ plain form
63251 307492 312087 317432 322574 327079 331755 337771 345514 354659 364915 376192 388322 401166 414916
63238 414916 429877 445956 462791 480321 498746 517819 536717 554900 572765 591061 609845
63227 609845 628458 646531 664608 683597 703787 724653 745500 765990 785915 804671 821243
63216 821243 834738 844795 851429 854624 854138 849565 840537 826971 809249 788089 764247 738499 711924
63203 711924 685881 661407 638827 618196 599980 584910 573139 563864 555970 548996 543552 540835
63191 540835 541671 545788 552110 559897 569393 581097 594688 609154 623949 639374 655763 672873 690324
63178 690324 708039 725820 742966 758916 773935 788562 802498 814645 824225 831183 835403 836153
63166 836153 832789 825548 815154 801764 784810 763975 739945 714009 687134 659723 632162 605217
$$ packed form
63251C07492M595N345N142M505M676O016P743R145J0256J1277J2130J2844J3750
63238D14916J4961J6079J6835J7530J8425J9073J8898J8183J7865J8296J8784
63227F09845J8613J8073J8077J8989K0190K0866K0847K0490J9925J8756J6572
63216H21243J3495J0057O634L195m86m573r028j3566j7722k1160k3842k5748k6575
63203G11924k6043k4474k2580k0631j8216j5070j1771r275p894o974n444k717
63191E40835Q36M117O322P787R496J1704J3591J4466J4795J5425J6389J7110J7451
63178F90324J7715J7781J7146J5950J5019J4627J3936J2147R580O958M220P50
63166H36153l364p241j0394j3390j6954k0835k4030k5936k6875k7411k7561k6945
$$ plain form
63154 605217 579733 556154 534585 515152 497947 482700 468941 456635 446272 438080 431486 425687
63142 425687 420556 416545 413828 411880 409925 407451 404291 400538 396432 392117 387495 382539 377733 373805
63128 373805 370988 368834 366898 365322 364606 365010 366267 367694 368619 369017 369689 371379 373665 375305 375884 376540
63112 376540 378581 381884 385255 387965 390177 392037 393222 393625 393900 394948 397144 400195 403421 406059 407718
63097 407718 408805 410157 412004 413594 414163 413963 413895 414285 414554 414164 413407 413022 413330 414120 415213 416751 418863
63080 418863 421410 424343 427999 432715 438214 443892 449733 456472 464592 473620 482840 492361 502960 515092
63066 515092 528691 543851 560966 579983 600169 621012 642909 666611 692396 720318 750907
63055 750907 784967 822594 862953 905102 948654 993430 1038977 1084857 1131263 1178785 1227426
$$ packed form
63154F05217k5484k3579k1569j9433j7205j5247j3759j2306j0363q192o594n799
63142D25687n131m011k717j948j955k474l160l753m106m315m622m956m806l928
63128C73805k817k154j936j576p16M04J257J427R25L98O72J690K286J640N79O56
63112C76540K041L303L371K710K212J860J185M03K75J048K196L051L226K638J659
63097D07718J087J352J847J590N69k00o8L90K69l90p57l85L08P90J093J538K112
63080D18863K547K933L656M716N499N678N841O739Q120R028R220R521J0599J2132
63066E15092J3599J5160J7115J9017K0186K0843K1897K3702K5785K7922L0589
63055G50907L4060L7627M0359M2149M3552M4776M5547M5880M6406M7522M8641
$$ plain form
63044 1227426 1276285 1324627 1373060 1423129 1475681 1530134 1585467 1641181 1696617 1749831 1798107
63033 1798107 1839545 1873308 1898260 1912351 1913908 1902856 1880200 1846873 1803774 1752516 1695382
63022 1695382 1634628 1572215 1509865 1448790 1389583 1332897 1280056 1232425 1190466 1154047 1123509
63011 1123509 1099676 1082862 1072568 1068216 1069447 1075608 1085679 1098953 1115175 1133864 1154228 1176114
62999 1176114 1200309 1227334 1256381 1285940 1315132 1343955 1372616 1401128 1429268 1456343 1481067
62988 1481067 1502138 1518925 1531279 1538762 1540360 1534909 1521590 1500194 1471204 1435633 1394538 1348797
62976 1348797 1299363 1247456 1194224 1140437 1086782 1034254 983998 936904 893560 854349 819237
62965 819237 787693 759067 732961 709012 686784 666253 648016 632359 618294 604235 589652
$$ packed form
63044A227426M8859M8342M8433N0069N2552N4453N5333N5714N5436N3214M8276
63033A798107M1438L3763K4952J4091J557j1052k2656l3327m3099n1258n7134
63022A695382o0754o2413o2350o1075n9207n6686n2841m7631m1959l6419l0538
63011A123509k3833j6814j0294m352J231O161J0071J3274J6222J8689K0364K1886
62999A176114K4195K7025K9047K9559K9192K8823K8661K8512K8140K7075K4724
62988A481067K1071J6787J2354P483J598n451j3319k1396k8990l5571m1095m5741
62976A348797m9434n1907n3232n3787n3655n2528n0256m7094m3344l9211l5112
62965H19237l1544k8626k6106k3949k2228k0531j8237j5657j4065j4059j4583
$$ plain form
62954 589652 575413 562384 550315 538409 526452 514887 504092 494027 484530 475569 467150 459229
62942 459229 451817 445045 438996 433513 428388 423762 420142 417789 416282 415071 414294 414471 415318 415554 414219
62927 414219 411573 408229 404095 398898 393202 387873 382763 376966 370378 364021 358676 354166 350262 347311
62913 347311 345396 343725 341592 339371 337808 336794 335577 333880 332078 330509 329289 328682 328895 329479 329645
62898 329645 329361 329570 331019 333243 335054 335852 336214 337248 339424 342030 343784 344031 343226 342237 341515 341182
62882 341182 341508 342707 344349 345598 346165 346587 347376 348293 348690 348271 347272 346107 345117 344479 344169 344102 344369 345133
62864 345133 346171 346864 346890 346687 346896 347531 348117 348517 349171 350460 352215 354007 355587 356839 357553 357603 357289
62847 357289 357223 357814 358920 360035 360735 360995 361169 361615 362332 363027 363550 364097 364863 365711 366441 367272 368679 370667
$$ packed form
62954E89652j4239j3029j2069j1906j1957j1565j0795j0065r497q961q419p921
62942D59229p412o772o049n483n125m626l620k353j507j211p77J77Q47K36j335
62927D14219k646l344m134n197n696n329n110n797o588o357n345m510l904k951
62913C47311j915j671k133k221j563j014j217j697j802j569j220o07K13N84J66
62898C29645k84K09J449K224J811P98L62J034K176K606J754K47q05r89p22l33
62882C41182L26J199J642J249N67M22P89R17L97m19r99j165r90o38l10o7K67P64
62864C45133J038O93K6k03K09O35N86M00O54J289J755J792J580J252P14N0l14
62847C57289o6N91J106J115P00K60J74M46P17O95N23N47P66Q48P30Q31J407J988
$$ plain form
62829 370667 372540 373595 373892 374106 374752 375805 377066 378669 381004 384184 387708 390791 393053 394768 396441
62814 396441 398337 400555 403304 406783 410892 415449 420684 427074 434590 442557 450487 458694 467774 477792
62800 477792 488261 498717 509012 519375 530509 543421 558772 576603 596974 620474 647636
62789 647636 678234 711829 748834 790313 836818 888160 944314 1005655 1072018 1142263 1215198
62778 1215198 1290329 1367162 1444201 1519082 1589427 1653163 1708345 1753229 1786529 1807421 1815418
62767 1815418 1810415 1792692 1762796 1721717 1671217 1613564 1550728 1484126 1415201 1345644 1276778
62756 1276778 1209225 1143538 1080650 1021341 965785 914073 866572 823197 782937 744900 709433
62745 709433 677436 648937 623276 600380 580723 564017 548955 534542 520877 508454 497500
$$ packed form
62829C70667J873J055K97K14O46J053J261J603K335L180L524L083K262J715J673
62814C96441J896K218K749L479M109M557N235O390P516P967P930Q207R080J0018
62800D77792J0469J0456J0295J0363J1134J2912J5351J7831K0371K3500K7162
62789F47636L0598L3595L7005M1479M6505N1342N6154O1341O6363P0245P2935
62778A215198P5131P6833P7039P4881P0345O3736N5182M4884L3300K0892P997
62767A815418n003j7723k9896m1079n0500n7653o2836o6602o8925o9557o8866
62756A276778o7553o5687o2888n9309n5556n1712m7501m3375m0260l8037l5467
62745G09433l1997k8499k5661k2896j9657j6706j5062j4413j3665j2423j0954
$$ plain form
62734 497500 488214 480827 475060 470232 466254 463730 462678 461971 460756 459720 460150 462232 465185 468730 473413
62719 473413 479504 486489 493976 502448 512730 525094 539293 555234 573312 594044 617613 643787
62707 643787 672335 703514 738120 777009 820633 869029 921947 978713 1038039 1098376 1158695
62696 1158695 1218839 1278965 1338521 1395665 1447683 1492070 1527285 1552585 1567382 1571066 1563404 1544753
62684 1544753 1515762 1477245 1430513 1377527 1320343 1260542 1199384 1138198 1078213 1020176 964565
62673 964565 912093 863490 818729 777015 737786 701391 668464 638867 611625 585876 561621
62662 561621 539451 519766 502413 487054 473655 462398 453044 444654 436197 427427 418965 411521 405205
62649 405205 399648 394581 390167 386844 384815 383576 381999 379309 376142 374255 374770 376885 378751 379479 379738
$$ packed form
62734D97500r286p387n767m828l978k524j052p07j215j036M30K082K953L545M683
62719D73413O091O985P487Q472J0282J2364J4199J5941J8078K0732K3569K6174
62707F43787K8548L1179L4606L8889M3624M8396N2918N6766N9326O0337O0319
62696A158695O0144O0126N9556N7144N2018M4387L5215K5300J4797L684p662j8651
62684A544753k8991l8517m6732n2986n7184n9801o1158o1186n9985n8037n5611
62673I64565n2472m8603m4761m1714l9229l6395l2927k9597k7242k5749k4255
62662E61621k2170j9685j7353j5359j3399j1257r354q390q457q770q462p444o316
62649D05205n557n067m414l323k029j239j577k690l167j887N15K115J866P28K59
$$ plain form
62634 379738 380346 380986 380751 379494 377989 376924 376370 376208 376519 377283 378172 379020 380197 382186 384942 387965
62618 387965 390840 393475 395944 398514 401802 406513 412886 420533 428807 437154 445204 452961 461088 470738
62604 470738 482873 497785 515351 535539 558458 584019 611834 641580 673345 707403 743533
62593 743533 780626 817142 851913 884313 913608 938568 957986 971325 978481 979142 972880 959900
62581 959900 941251 918138 891323 861289 828690 794532 760088 726604 694749 664378 635209
62570 635209 607709 582793 560568 540018 520254 501506 484437 469040 454853 441942 430925
62559 430925 422060 414900 408867 403628 398868 394201 389545 385230 381558 378463 375740 373390 371635 370714
62545 370714 370702 371346 372129 372697 373240 374207 375691 377363 379000 380703 382467 383931 384876 385822 387829 391702
$$ packed form
62634C79738O08O40k35j257j505j065n54j62L11P64Q89Q48J177J989K756L023
62618C87965K875K635K469K570L288M711O373P647Q274Q347Q050P757Q127R650
62604D70738J2135J4912J7566K0188K2919K5561K7815K9746L1765L4058L6130
62593G43533L7093L6516L4771L2400K9295K4960J9418J3339P156O61o262j2980
62581I59900j8649k3113k6815l0034l2599l4158l4444l3484l1855l0371k9169
62570F35209k7500k4916k2225k0550j9764j8748j7069j5397j4187j2911j1017
62559D30925q865p160o033n239m760m667m656m315l672l095k723k350j755r21
62545C70714j2O44P83N68N43R67J484J672J637J703J764J464R45R46K007L873
$$ plain form
62529 391702 397489 404715 412937 422085 432431 444384 458410 475012 494492 516623 540713 566205
62517 566205 593136 621850 652486 684969 719237 754970 790987 825430 856753 884357 908110
62506 908110 927544 941774 950026 952046 948087 938743 924785 907000 886081 862727 837833 812594
62494 812594 788333 766128 746564 729885 716335 706151 699260 695409 694774 697999 705208 715371 727241
62481 727241 740660 756236 773794 791947 809282 825174 839212 850662 859014 864328 866401 864116
62469 864116 856382 843369 826140 805315 780941 753529 724391 694748 665060 635445 606278 578203
62457 578203 551843 527650 505788 486138 468628 453454 440595 429307 418676 408650 400019 393264
62445 393264 387948 383376 379352 376047 373602 372095 371526 371579 371743 371821 371898 371684 370491 368104 365133 362143
$$ packed form
62529C91702N787P226Q222R148J0346J1953J4026J6602J9480K2131K4090K5492
62517E66205K6931K8714L0636L2483L4268L5733L6017L4443L1323K7604K3753
62506I08110J9434J4230Q252K020l959r344j3958j7785k0919k3354k4894k5239
62494H12594k4261k2205j9564j6679j3550j0184o891l851o35L225P209J0163J1870
62481G27241J3419J5576J7558J8153J7335J5892J4038J1450Q352N314K073k285
62469H64116p734j3013j7229k0825k4374k7412k9138k9643k9688k9615k9167k8075
62457E78203k6360k4193k1862j9650j7510j5174j2859j1288j0631j0026q631o755
62445C93264n316m572m024l305k445j507n69N3J64P8P7k14j193k387k971k990
$$ plain form
62429 362143 359066 355930 353425 351967 350728 348588 345775 343556 342346 341188 339263 336936 334846 332790
62415 332790 330210 327238 324546 322429 320673 319195 318217 317780 317506 316978 316045 314675 312851 310799 309175
62400 309175 308687 309494 311049 312658 314120 315664 317372 318951 320280 321823 324154 327229 330531 333842 337345
62385 337345 340950 344129 346732 349528 353475 358669 364428 370257 376408 383560 392158 402002 412319 422355
62371 422355 432153 442657 454884 469114 485043 502500 521724 543136 567199 594422 625110 659076
62359 659076 695892 735551 778614 825545 875879 928040 979837 1029233 1074765 1115270 1149385
62348 1149385 1175726 1193787 1204310 1208361 1206139 1197050 1180823 1158142 1130222 1098164 1062791 1024737
62336 1024737 984525 942831 900758 859668 820664 784378 751166 721150 694029 669200 646254
$$ packed form
62429C62143l077l136k505j458j239k140k813k219j210j158j925k327k090k056
62415C32790k580k972k692k117j756j478r78m37k74n28r33j370j824k052j624
62400C09175m88Q07J555J609J462J544J708J579J329J543K331L075L302L311L503
62385C37345L605L179K603K796L947N194N759N829O151P152Q598R844J0317J0036
62371D22355R798J0504J2227J4230J5929J7457J9224K1412K4063K7223L0688L3966
62359F59076L6816L9659M3063M6931N0334N2161N1797M9396M5532M0505L4115
62348A149385K6341J8061J0523M051k222r089j6227k2681k7920l2058l5373l8054
62336A024737m0212m1694m2073m1090l9004l6286l3212l0016k7121k4829k2946
$$ plain form
62325 646254 625165 605969 588469 572288 556919 541729 526248 510647 495672 481943 469485
62314 469485 458014 447382 437567 428436 419722 411200 402900 395271 388991 384331 380787 377672 375013 373317
62300 373317 372398 371080 368457 365034 362213 360907 360997 361863 363043 364459 366274 368509 370714 372280 373220
62285 373220 374323 376294 379048 382197 385917 390852 397200 404216 410712 415951 420213 424537 429737 435642
62271 435642 441665 448106 456223 466724 478945 492222 507462 526382 549447 575612 604122 635668
62259 635668 671470 711977 756866 805695 857951 912658 968260 1022815 1074238 1120656 1160712
62248 1160712 1193371 1217556 1232469 1238368 1236489 1227841 1212412 1189819 1160388 1125241 1085597 1042387
62236 1042387 996461 948819 900596 852960 806968 763417 722863 685754 652283 622120 594612
$$ packed form
62325F46254k1089j9196j7500j6181j5369j5190j5481j5601j4975j3729j2458
62314D69485j1471j0632r815r131q714q522q300p629o280m660l544l115k659j696
62300C73317r19j318k623l423k821j306R0Q66J180J416J815K235K205J566R40
62285C73220J103J971K754L149L720M935O348P016O496N239M262M324N200N905
62271D35642O023O441Q117J0501J2221J3277J5240J8920K3065K6165K8510L1546
62259F35668L5802M0507M4889M8829N2256N4707N5602N4555N1423M6418M0056
62248A160712L2659K4185J4913N899j879q648j5429k2593k9431l5147l9644m3210
62236A042387m5926m7642m8223m7636m5992m3551m0554l7109l3471l0163k7508
$$ plain form
62225 594612 569490 547132 527925 511591 497348 484502 472618 461410 450865 441314 432950 425304
62213 425304 417628 409848 402723 396922 392346 388587 385664 383819 382793 381882 380864 380404 381201 383073 385330
62198 385330 387883 391492 396830 403799 412009 421531 432824 446141 461305 477924 495496 513452 531499
62185 531499 549894 569085 588987 608766 627359 644044 658670 671583 683246 693733 702701 710136
62173 710136 716937 724412 733319 743834 756326 771580 790129 811947 836931 865106 895930 927741
62161 927741 958400 986386 1010995 1031635 1047394 1057396 1061406 1059957 1053939 1044017 1030353 1012705
62149 1012705 990746 964360 933977 900793 866425 832047 797996 764452 732247 702539 675823
62138 675823 651781 630147 611269 595645 583266 573511 565500 558602 552906 549107 547570 547621 548227 549202
$$ packed form
62225E94612k5122k2358j9207j6334j4243j2846j1884j1208j0545r551q364p646
62213D25304p676p780p125n801m576l759k923j845j026r11j018m60P97J872K257
62198C85330K553L609N338O969Q210R522J1293J3317J5164J6619J7572J7956J8047
62185E31499J8395J9191J9902J9779J8593J6685J4626J2913J1663J0487Q968P435
62173G10136O801P475Q907J0515J2492J5254J8549K1818K4984K8175L0824L1811
62161I27741L0659K7986K4609K0640J5759J0002M010j449o018r922j3664j7648
62149A012705k1959k6386l0383l3184l4368l4378l4051l3544l2205k9708k6716
62138F75823k4042k1634j8878j5624j2379r755q011o898n696l799j537N1O06R75
$$ plain form
62124 549202 551104 554077 557640 561691 566751 572838 578890 583837 587565 590348 592048 592528 592255 591763 590955
62109 590955 589578 587922 586289 584187 580918 576726 572600 569114 566284 564450 564401 566483 570335 575643 582464
62094 582464 590614 599384 608222 617232 626682 636416 646114 655916 666440 678179 691035 704505 718365
62081 718365 733056 749219 766852 785356 804501 824834 846775 869887 893547 917856 943080
62070 943080 968555 992991 1015815 1037477 1058534 1079268 1100145 1121759 1143955 1165657 1185741
62059 1185741 1203551 1218466 1229695 1236852 1240178 1239927 1236030 1228525 1217698 1203544 1185665 1164018
62047 1164018 1139171 1111493 1080720 1046804 1010737 974036 937736 902236 867720 834262 801824
62036 801824 770617 741308 714599 690762 669758 651420 635314 620863 607924 596893 587915 580342
$$ packed form
62124E49202J902K973L563M051N060O087O052M947L728K783J700M80k73m92q08
62109E90955j377j656j633k102l269m192m126l486k830j834m9K082L852N308O821
62094E82464Q150Q770Q838R010R450R734R698R802J0524J1739J2856J3470J3860
62081G18365J4691J6163J7633J8504J9145K0333K1941K3112K3660K4309K5224
62070I43080K5475K4436K2824K1662K1057K0734K0877K1614K2196K1702K0084
62059A185741J7810J4915J1229P157L326k51l897p505j0827j4154j7879k1647
62047A164018k4847k7678l0773l3916l6067l6701l6300l5500l4516l3458l2438
62036H01824l1207k9309k6709k3837k1004j8338j6106j4451j2939j1031q978p573
$$ plain form
62024 580342 573257 566159 558839 551060 542731 534015 524869 514951 504367 494060 484882 476708 469026 462035
62010 462035 456514 452874 450960 450625 451864 454536 458462 463693 470168 477293 484297 490819 496658 501283
61996 501283 504201 505578 505806 504663 501659 497034 491575 485445 478086 469361 459948 450388 440517 430235
61982 430235 420158 411061 403150 396209 390022 384336 378872 373673 369095 365235 361804 358691 356110 353952
61968 353952 351663 349141 347165 346360 346198 345687 344801 344522 345541 347416 349124 350227 351498 354429 359883
61953 359883 367147 374667 381845 389616 399001 409825 421451 434174 449017 466392 485841 507016
61941 507016 530074 554997 581256 608375 636251 664675 693105 721128 748659 775356 800359
61930 800359 822957 843164 861211 876772 889111 897795 902844 904296 902081 896384 887807 877128 865136
$$ packed form
62024E80342p085p098p320p779q329q716r146r918j0584j0307r178q174p682o991
62010D62035n521l640j914l35J239K672L926N231O475P125P004O522N839M625
61996E01283K918J377K28j143l004m625n459o130p359q725r413r560r871j0282
61982D30235j0077r097p911o941o187n686n464n199m578l860l431l113k581k158
61968C53952k289k522j976q05j62n11q86k79J019J875J708J103J271K931N454
61953C59883P264P520P178P771R385J0824J1626J2723J4843J7375J9449K1175
61941E07016K3058K4923K6259K7119K7876K8424K8430K8023K7531K6697K5003
61930H00359K2598K0207J8047J5561J2339Q684N049J452k215n697q577j0679j1992
$$ plain form
61917 865136 852760 841091 831088 823323 818197 816418 819107 827209 840587 857780 876890 896802
61905 896802 917450 938849 960099 979450 995058 1005482 1009757 1007662 1000116 988851 975237 959378
61893 959378 940564 918600 894444 869587 845130 821590 799289 778507 759259 741289 724415
61882 724415 708623 693661 678821 663422 647463 631592 616496 602537 589849 578429 568050
61871 568050 558417 549634 542315 537005 533616 531609 530709 531237 533741 538426 545035 553258 563238 575690
61857 575690 591460 610964 634106 660737 690974 724917 762165 801908 843509 886710 931129
61846 931129 975765 1019286 1060718 1099411 1134168 1162833 1183295 1194977 1199012 1196861 1189142 1176064
61834 1176064 1158700 1139378 1120870 1105451 1094522 1088577 1087311 1090160 1097009 1108213 1123669 1142050
$$ packed form
61917H65136j2376j1669j0003p765n126j779K689Q102J3378J7193J9110J9912
61905H96802K0648K1399K1250J9351J5608J0424M275k095p546j1265j3614j5859
61893I59378j8814k1964k4156k4857k4457k3540k2301k0782j9248j7970j6874
61882G24415j5792j4962j4840j5399j5959j5871j5096j3959j2688j1420j0379
61871E68050r633q783p319n310l389k007r00N28K504M685O609Q223R980J2452
61857E75690J5770J9504K3142K6631L0237L3943L7248L9743M1601M3201M4419
61846I31129M4636M3521M1432L8693L4757K8665K0462J1682M035k151p719j3078
61834A176064j7364j9322j8508j5419j0929n945j266K849O849J1204J5456J8381
$$ plain form
61822 1142050 1161096 1178534 1192508 1201429 1203936 1199271 1187491 1169146 1144728 1114499 1078861 1038846
61810 1038846 996125 952487 909318 867596 828122 791444 757572 726113 696786 669641 644798
61799 644798 622328 602471 585518 571202 558539 546613 535308 524949 515565 506963 499294 492981
61787 492981 488033 483876 479850 475536 470643 465089 459307 454051 449747 446307 443594 441582 439895 437711
61773 437711 434545 430865 427581 425091 423124 421446 420347 420328 421379 422688 423231 422792 422252 422610 423844 425077
61757 425077 425772 426293 427236 428735 430627 432781 434928 436586 437512 437926 437947 437148 435085 431996 428601 425391
61741 425391 422461 419862 417705 416043 414930 414418 414275 413983 413368 412965 413315 414185 414972 415685 416919 418931
61725 418931 421348 423787 426301 429083 432156 435417 438666 441628 444332 447404 451487 456317 460770 463918
$$ packed form
61822A142050J9046J7438J3974Q921K507m665j1780j8345k4418l0229l5638m0015
61810A038846m2721m3638m3169m1722l9474l6678l3872l1459k9327k7145k4843
61799F44798k2470j9857j6953j4316j2663j1926j1305j0359r384q602p669o313
61787D92981m948m157m026m314m893n554n782n256m304l440k713k012j687k184
61773D37711l166l680l284k490j967j678j099j9J051J309N43m39n40L58J234J233
61757D25077O95N21R43J499J892K154K147J658R26M14K1p99k063l089l395l210
61741D25391k930k599k157j662j113n12j43k92o15m03L50Q70P87P13J234K012
61725D18931K417K439K514K782L073L261L249K962K704L072M083M830M453L148
$$ plain form
61711 463918 465647 466267 465928 464477 461539 456769 450453 443744 437733 432341 426746 420920 415869 412143 408961
61696 408961 405333 401370 397802 394698 391445 387826 384447 382061 380854 380359 379779 378458 376338 373941 371799
61681 371799 370075 368859 368472 369097 370306 371340 371849 372114 372605 373480 374482 375224 375663 376327 377817 380029
61665 380029 382143 383499 384176 384621 385102 385703 386462 387177 387426 387105 386645 386472 386561 386792 387313 388213 389254 390330
61647 390330 391822 394083 396972 400330 404461 409505 414686 418895 421808 423821 425082 425305 424376 422413 419273
61632 419273 414679 408918 402813 396971 391532 386544 381970 377455 372857 369008 367123 367325 368532 369952
61618 369952 371851 374518 377356 379554 381047 382153 382715 382194 380355 377418 373777 369847 365808 361202 355235
61603 355235 347898 340375 333850 328312 323067 317973 313451 309474 305387 300791 295978 291294 286626 281822
$$ packed form
61711D63918J729O20l39j451k938m770o316o709o011n392n595n826n051l726l182
61696D08961l628l963l568l104l253l619l379k386j207m95n80j321k120k397k142
61681C71799j724j216l87O25J209J034N09K65M91Q75J002P42M39O64J490K212
61665C80029K114J356O77M45M81O01P59P15K49l21m60j73Q9K31N21R00J041J076
61647C90330J492K261K889L358M131N044N181M209K913K013J261K23r29j963l140
61632D19273m594n761o105n842n439m988m574m515m598l849j885K02J207J420
61618C69952J899K667K838K198J493J106N62n21j839k937l641l930m039m606n967
61603C55235p337p523o525n538n245n094m522l977m087m596m813m684m668m804
$$ plain form
61589 281822 277306 273882 271961 271079 270181 268404 265720 262851 260537 258916 257567 255886 253384 249924 245989
61574 245989 242514 240122 238565 237128 235448 233732 232282 231176 230413 230074 230196 230619 230978 230831 229890 228301
61558 228301 226674 225678 225569 226154 227152 228485 230238 232377 234468 235751 235683 234509 233152 232468 232718 233695
61542 233695 235125 236833 238805 241231 244250 247561 250576 253037 255141 256921 258002 258324 258644 259738 261337
61527 261337 262423 262438 261631 260289 258308 255696 252956 250579 248454 246086 243289 240421 238013 236311 235204
61512 235204 234487 234067 233807 233339 232390 231334 231005 231636 232378 232258 231360 230546 230247 230130 229816 229287 228524 227457
61494 227457 226467 226286 227021 227777 227709 227094 226952 227844 229465 231239 232891 234426 235821 236822 236996 236171 234881
61477 234881 234070 234163 234671 234907 234785 234629 234563 234540 234740 235372 236150 236461 236104 235415 234661 233879 233411 233995 235932
$$ packed form
61589B81822m516l424j921q82q98j777k684k869k314j621j349j681k502l460l935
61574B45989l475k392j557j437j680j716j450j106p63l39J22M23L59j47r41j589
61558B28301j627r96j09N85R98J333J753K139K091J283o8j174j357o84K50R77
61542B33695J430J708J972K426L019L311L015K461K104J780J081L22L20J094J599
61527B61337J086J5q07j342j981k612k740k377k125k368k797k868k408j702j107
61512B35204p17m20k60m68r49j056l29O31P42j20q98q14k99j17l14n29p63j067
61494B27457r90j81P35P56o8o15j42Q92J621J774J652J535J395J001J74q25j290
61477B34881q11R3N08K36j22j56o6k3K00O32P78L11l57o89p54p82m68N84J937
$$ plain form
61458 235932 238490 240536 241548 241720 241383 240776 240201 239902 239781 239589 239449 239792 240739 241895 242898 243894 245330
61441 245330 247557 250751 254808 259117 262809 265723 268920 273705 280170 287079 293130 297900 301566 304283
61427 304283 306138 307323 308048 308485 309036 310313 312565 315297 317787 319815 321643 323521 325525 327687 329831
61412 329831 331396 331921 331645 331156 330401 328613 325440 321631 318256 315542 312882 309779 306377 303168 300575
61397 300575 298793 297710 296877 295763 294136 292129 290037 288203 286952 286322 285879 285134 284260 284016 284856 286399
61381 286399 288020 289609 291405 293391 295344 297325 299463 301232 301664 300662 299526 299598 300737 301719 302005
61366 302005 302374 303787 306245 309007 311441 313367 315003 316958 319994 324395 329705 335310 341077 347183
61352 347183 353622 360351 367726 376244 385774 395399 404172 411829 418766 425559 432508 439396 445600 450664
$$ packed form
61458B35932K558K046J012J72l37o07n75k99j21j92j40L43R47J156J003R96J436
61441B45330K227L194M057M309L692K914L197M785O465O909O051M770L666K717
61427C04283J855J185P25M37N51J277K252K732K490K028J828J878K004K162K144
61412C29831J565N25k76m89p55j788l173l809l375k714k660l103l402l209k593
61397C00575j782j083q33j114j627k007k092j834j251o30m43p45q74k44Q40J543
61381B86399J621J589J796J986J953J981K138J769M32j002j136P2J139R82K86
61366C02005L69J413K458K762K434J926J636J955L036M401N310N605N767O106
61352C47183O439O729P375Q518R530R625Q773P657O937O793O949O888O204N064
$$ plain form
61338 450664 454813 458757 462974 467352 471425 474693 476690 477084 475879 473370 469844 465497 460655 455800
61324 455800 451256 447016 442914 438783 434474 430059 426182 423820 423344 423920 424132 423185 421388 419622 418647
61309 418647 418890 420585 423793 428242 433331 438459 443417 448313 453062 457105 459865 461317 461829 461474 459847
61294 459847 456682 452370 447767 443661 440521 438406 436905 435362 433416 431282 429444 428231 427801 428285 429689
61279 429689 431806 434344 437090 439850 442477 445090 448034 451451 455140 459026 463406 468394 473370 477508
61265 477508 480711 483675 487144 491583 497484 505352 515106 525891 536745 547227 557270 566736 575337
61252 575337 582796 588882 593521 597011 599891 602298 603604 602888 599736 594456 587698 580088 572091 563998
61238 563998 555990 548272 541002 534045 527006 519740 512616 506098 500246 494977 490546 487330 485215 483679
$$ packed form
61338D50664M149L944M217M378M073L268J997L94j205k509l526m347m842m855
61324D55800m544m240m102m131m309m415l877k362m76N76K12r47j797j766r75
61309D18647K43J695L208M449N089N128M958M896M749M043K760J452N12l55j627
61294D59847l165m312m603m106l140k115j501j543j946k134j838j213m30M84J404
61279D29689K117K538K746K760K627K613K944L417L689L886M380M988M976M138
61265D77508L203K964L469M439N901P868R754J0785J0854J0482J0043R466Q601
61252E75337P459O086M639L490K880K407J306p16l152n280o758p610p997q093
61238E63998q008p718p270o957p039p266p124o518n852n269m431l216k115j536
$$ plain form
61224 483679 482511 481870 481480 480409 478112 475330 473396 472795 472897 473040 473320 474220 475916 478175 480649 482991
61208 482991 484891 486274 487388 488555 489952 491771 494423 498330 503562 509903 517306 526126 536902 549952
61194 549952 565096 581567 598179 613803 627857 640414 651846 662385 671963 680364 687534 693758
61182 693758 699481 704903 709800 713857 717067 719639 721531 722323 721632 719517 716332 712265 707193 700989 693853
61167 693853 686168 678022 669018 658706 647195 635149 623168 611357 599584 587875 576334 564899
61155 564899 553579 542954 534066 527683 523757 521591 520252 518844 516744 513805 510184 505799 500131 492692
61141 492692 483616 473691 463921 455074 447436 440790 434796 429554 425674 423696 423567 424862 427312 430840
61127 430840 435266 440390 446388 453777 462812 473217 484676 497379 511810 528112 545953 565010
$$ packed form
61224D83679j168o41l90j071k297k782j934o01J02J43K80R00J696K259K474K342
61208D82991J900J383J114J167J397J819K652L907N232O341P403Q820J0776J3050
61194E49952J5144J6471J6612J5624J4054J2557J1432J0539R578Q401P170O224
61182F93758N723N422M897M057L210K572J892P92o91k115l185m067n072o204p136
61167F93853p685q146r004j0312j1511j2046j1981j1811j1773j1709j1541j1435
61155E64899j1320j0625q888o383l926k166j339j408k100k939l621m385n668p439
61141D92692r076r925r770q847p638o646n994n242l880j978j29J295K450L528
61127D30840M426N124N998P389R035J0405J1459J2703J4431J6302J7841J9057
$$ plain form
61115 565010 585298 606876 629421 652274 674811 696575 717160 736284 754034 770793 786765
61104 786765 801712 815231 826990 836452 842698 845022 843653 839469 832913 823646 811424 796863 780976
61091 780976 764164 746072 726402 705585 684526 663811 643287 622460 601320 580513 560581
61080 560581 541279 522168 503827 487756 474735 463762 453121 442181 431621 422202 413959 406585
61068 406585 399914 393876 388456 383913 380648 378653 377397 376462 375957 376102 376719 377486 378504 380295 383244
61053 383244 387238 391828 396625 401649 407417 414576 423280 433031 443308 454195 466168 479378 493468
61040 493468 508087 523214 538816 554422 569358 583389 597012 611058 626050 641852 657847
61029 657847 673498 688845 704488 721058 738749 757474 777502 799902 826437 859252 900696
$$ packed form
61115E65010K0288K1578K2545K2853K2537K1764K0585J9124J7750J6759J5972
61104G86765J4947J3519J1759R462O246K324j369m184o556r267j2222j4561j5887
61091G80976j6812j8092j9670k0817k1059k0715k0524k0827k1140k0807j9932
61080E60581j9302j9111j8341j6071j3021j0973j0641j0940j0560r419q243p374
61068D06585o671o038n420m543l265j995j256r35n05J45O17P67J018J791K949
61053C83244L994M590M797N024N768P159Q704R751J0277J0887J1973J3210J4090
61040D93468J4619J5127J5602J5606J4936J4031J3623J4046J4992J5802J5995
61029F57847J5651J5347J5643J6570J7691J8725K0028K2400K6535L2815M1444
$$ plain form
61018 900696 953203 1018948 1099583 1196569 1312006 1448712 1608282 1787510 1975658 2155399
61008 2155399 2307829 2418911 2483827 2507794 2504173 2490770 2484436 2494878 2520522 2549019 2562116
60997 2562116 2542126 2477523 2366419 2216924 2043814 1862941 1686684 1522587 1374369 1243264
60987 1243264 1128921 1030225 945930 874638 814401 762825 717824 678303 644037 614833 589763
60976 589763 567262 546117 526303 508593 493361 480078 468019 457006 447225 438729 431432 425283
60964 425283 420005 414881 409225 403015 396867 391548 387719 385727 385210 385167 384947 384946 385860 387575 389454 391521
60948 391521 394473 398496 402856 406876 410578 414129 417337 420095 422657 425003 426465 426535 425632 424546 423470
60933 423470 422078 420282 418321 416265 413968 411439 408818 406116 403360 400941 399359 398688 398626 398991 399739
$$ packed form
61018I00696N2507O5745Q0635R6986J15437J36706J59570J79228J88148J79741
61008B155399J52430J11082O4916K3967l621j3403o334J0442K5644K8497J3097
60997B562116j9990o4603j11104j49495j73110j80873j76257j64097j48218j31105
60987A243264j14343r8696q4295p1292o0237n1576m5001l9521l4266k9204k5070
60976E89763k2501k1145j9814j7710j5232j3283j2059j1013r781q496p297o149
60964D25283n278n124n656o210o148n319l829j992n17m3k20jR14J715J879K067
60948C91521K952M023M360M020L702L551L208K758K562K346J462P0r03j086j076
60933D23470j392j796j961k056k297k529k621k702k756k419j582o71o2L65P48
$$ plain form
60918 399739 400542 400817 400260 399044 397484 395815 394308 393155 392169 390959 389526 388375 387891 387985 388493 389525
60902 389525 391090 392685 393730 394294 394983 396050 397029 397486 397895 399339 402248 405734 408449 409914 410614 410921
60886 410921 410538 409365 408329 408649 410390 412461 414129 415892 418580 422194 426196 430585 436029 443032 451488
60871 451488 461086 471630 482727 493620 503729 513203 522651 532450 542557 552908 563666 575027
60859 575027 587084 599960 613802 628498 643636 658962 674719 691317 708817 727077 746280
60848 746280 766860 788789 811376 833948 856368 878564 899873 919303 936274 950649 962141
60837 962141 970246 974817 976111 974003 967666 956539 941331 923570 904216 883142 859872 834370
60825 834370 807072 778657 750055 722317 696153 671727 649024 628090 608715 590314 572579
$$ packed form
60918C99739Q03K75n57j216j560j669j507j153r86j210j433j151m84R4N08J032
60902C89525J565J595J045N64O89J067R79M57M09J444K909L486K715J465P00L07
60886D10921l83j173j036L20J741K071J668J763K688L614M002M389N444P003Q456
60871D51488R598J0544J1097J0893J0109R474R448R799J0107J0351J0758J1361
60859E75027J2057J2876J3842J4696J5138J5326J5757J6598J7500J8260J9203
60848G46280K0580K1929K2587K2572K2420K2196K1309J9430J6971J4375J1492
60837I62141Q105M571J294k108o337j1127j5208j7761j9354k1074k3270k5502
60825H34370k7298k8415k8602k7738k6164k4426k2703k0934j9375j8401j7735
$$ plain form
60814 572579 555978 541096 527680 514974 502904 492188 483120 475006 467254 460361 455208 451765 449156
60801 449156 446738 444414 442070 439443 436713 434588 433544 433398 433742 434373 435138 435811 436314 436650 436427 434992
60785 434992 432377 429662 427879 426835 425511 423403 420972 418853 417098 415225 412684 409237 405211 401386
60771 401386 398327 395748 392783 388882 384232 379283 374210 368998 363794 358944 354680 350917 347329 343653
60757 343653 339904 336294 332951 329896 327377 326013 326349 328253 330914 333451 335437 336966 338379 339937
60743 339937 341607 343149 344432 345526 346374 346596 345872 344358 342445 340235 337659 335120 333553 333576 334831
60728 334831 336420 337883 339522 341748 344282 346146 346449 345089 342613 339485 335775 331574 327329 323491
60714 323491 319997 316399 312374 307917 303225 298733 295074 292517 290490 288038 284844 281459 278489 275950
$$ packed form
60814E72579j6601j4882j3416j2706j2070j0716r068q114p752o893n153l443k609
60801D49156k418k324k344k627k730k125j044j46L44O31P65O73N03L36k23j435
60785D34992k615k715j783j044j324k108k431k119j755j873k541l447m026l825
60771D01386l059k579k965l901m650m949n073n212n204m850m264l763l588l676
60757C43653l749l610l343l055k519j364L36J904K661K537J986J529J413J558
60743C39937J670J542J283J094Q48K22p24j514j913k210k576k539j567K3J255
60728C34831J589J463J639K226K534J864L03j360k476l128l710m201m245l838
60714C23491l494l598m025m457m692m492l659k557k027k452l194l385k970k539
$$ plain form
60700 275950 273512 271058 268810 267126 266263 266135 266275 266241 266050 265921 265702 265028 264072 263646 264336 265980 268137
60683 268137 270556 272938 274730 275627 275993 276423 277213 278597 281033 284638 288568 291569 293127 293642 293655 293468
60667 293468 293508 294322 295971 297893 299674 301705 304775 309130 314121 318739 322499 325889 329872 334831 340156
60652 340156 345099 349718 354538 359446 363599 366537 368707 370632 372132 372803 372680 371797 369457 364766 357996
60637 357996 350782 344666 339775 335078 329646 323454 317259 312002 308262 305958 304480 303122 301458 299412
60623 299412 297131 294848 292718 290736 288916 287547 287030 287324 287762 287671 287093 286661 286772 287176 287423 287451 287541 287861
60605 287861 288273 288523 288425 287900 287002 285980 285229 285109 285758 286991 288314 289178 289421 289409 289605 290075 290592 291145
60587 291145 291982 293077 293982 294427 294779 295608 296963 298495 300155 302368 305464 309301 313608 318433 324088
$$ packed form
60700B75950k438k454k248j684q63j28J40l4j91j29k19o74r56m26O90J644K157
60683B68137K419K382J792Q97L66M30P90J384K436L605L930L001J558N15J3j87
60667B93468M0Q14J649J922J781K031L070M355M991M618L760L390L983M959N325
60652C40156M943M619M820M908M153K938K170J925J500O71j23q83k340m691o770
60637C57996p214o116m891m697n432o192o195n257l740k304j478j358j664k046
60623B99412k281k283k130j982j820j369n17K94M38r1n78m32J11M04K47K8R0L20
60605B87861M12K50r8n25q98j022p51j20O49J233J323Q64K43j2J96M70N17N53
60587B91145Q37J095R05M45L52Q29J355J532J660K213L096L837M307M825N655
$$ plain form
60572 324088 330798 338535 346990 355534 363374 369964 375226 379256 381980 383227 382956 381206 377990 373539
60558 373539 368639 364368 361470 360169 360465 362227 364969 368065 371487 375991 382242 390031 398639 407668
60544 407668 416945 425838 433342 438946 442869 445235 445660 444021 441150 438127 435142 431590 427235 422681
60530 422681 418690 415546 413236 411743 410894 410313 409883 409964 410770 411755 412060 411539 410929 410942 411624 412765 414509
60513 414509 417188 420720 424710 429270 435341 443973 455460 469532 486225 506085 529344 555286 582766
60500 582766 611136 640268 669749 698446 724830 747261 763829 772513 772121 763019 746561 723898
60488 723898 695792 663610 629872 597254 567097 539226 513190 489305 468289 450172 434059
60477 434059 419117 405501 393979 384742 376943 369599 362649 356785 352390 348977 345714 342163 338385
$$ packed form
60572C24088O710P737Q455Q544P840O590N262M030K724J247k71j750l216m451
60558C73539m900m271k898j301K96J762K742L096L422M504O251P789Q608R029
60544D07668R277Q893P504N604L923K366M25j639k871l023k985l552m355m554
60530D22681l991l144k310j493q49n81m30Q1Q06R85L05n21o10J3O82J141J744
60513D14509K679L532L990M560O071Q632J1487J4072J6693J9860K3259K5942K7480
60500E82766K8370K9132K9481K8697K6384K2431J6568Q684l92r102j6458k2663
60488G23898k8106l2182l3738l2618l0157k7871k6036k3885k1016j8117j6113
60477D34059j4942j3616j1522r237p799p344o950n864m395l413l263l551l778
$$ plain form
60464 338385 334637 331181 328115 325097 321487 317138 312885 309752 307733 305891 303734 301829 300795 300292
60450 300292 299585 298647 298015 297832 297771 297820 298342 299275 300030 300395 300779 301277 301243 300268 298936 297983 297270 296296 295265
60431 295265 294792 294853 294914 294899 295101 295193 294381 292771 291571 291486 291775 291505 291009 291245 292193 292799 292402 291483 290892 290913
60411 290913 291272 291665 292027 292441 292963 293528 294038 294560 295324 296453 297787 299105 300405 301860 303591 305509
60395 305509 307320 308737 309902 311451 313808 316419 318197 318858 319317 320521 322386 324231 325752 327072 328251
60380 328251 329345 330657 332321 333838 334644 335062 336092 338282 341250 344248 346697 348301 349309 350678 353316
60365 353316 356940 360200 362150 363152 364207 365943 368460 371621 375128 378706 382586 387425 393387 399575
60351 399575 404757 408450 410989 412727 413562 413166 411359 408298 404472 400424 396325 391958 387244 382617 378734
$$ packed form
60464C38385l748l456l066l018l610m349m253l133k019j842k157j905j034n03
60450C00292p07r38o32j83o1M9N22R33P55L65L84M98l4r75j332r53p13r74j031
60431B95265m73O1O1j5K02R2q12j610j200q5K89k70m96K36R48O06l97r19n91K1
60411B90913L59L93L62M14N22N65N10N22P64J129J334J318J300J455J731J918
60395C05509J811J417J165J549K357K611J778O61M59J204J865J845J521J320J179
60380C28251J094J312J664J517Q06M18J030K190K968K998K449J604J008J369K638
60365C53316L624L260J950J002J055J736K517L161L507L578L880M839N962O188
60351C99575N182L693K539J738Q35l96j807l061l826m048m099m367m714m627l883
$$ plain form
60336 378734 375962 374273 373395 372876 372237 371317 370311 369316 368085 366434 364635 363074 361784 360637 359803 359590
60320 359590 359965 360707 361930 363992 366824 369846 372717 375819 379815 385146 392168 401459 413478 427916
60306 427916 443633 459244 473662 486172 496233 503285 506648 505604 499781 489612 476382 461768
60294 461768 447294 434088 422853 413744 406300 399767 393721 388302 383801 380186 377213 374812 373066
60281 373066 371874 370917 369981 369017 367865 366292 364422 362733 361371 359786 357459 354728 352416 350760 349234
60266 349234 347476 345852 344877 344467 344160 343794 343573 343507 343221 342450 341474 340799 340494 340041 338986 337648 336974 337580
60248 337580 339038 340298 340802 340921 341230 341682 341797 341458 341107 341156 341620 342424 343621 345053 346191 346754 347241
60231 347241 348382 350193 352061 353708 355435 357297 358750 359494 360142 361525 363644 365928 368190 370729 373569
$$ packed form
60336C78734k772j689q78n19o39r20j006r95j231j651j799j561j290j147q34k13
60320C59590L75P42J223K062K832L022K871L102L996N331P022R291J2019J4438
60306D27916J5717J5611J4418J2510J0061P052L363j044n823j0169j3230j4614
60294D61768j4474j3206j1235r109p444o533o046n419m501l615k973k401j746
60281C73066j192r57r36r64j152j573j870j689j362j585k327k731k312j656j526
60266C49234j758j624r75m10l07l66k21o6k86p71r76o75l05m53j055j338o74O06
60248C37580J458J260N04J19L09M52J15l39l51M9M64Q04J197J432J138N63M87
60231C47241J141J811J868J647J727J862J453P44O48J383K119K284K262K539K840
$$ plain form
60216 373569 376322 378889 381725 385210 389226 393574 398304 403320 408063 411939 414887 417220 419174 420898
60202 420898 422745 425196 428447 432221 435964 439186 441796 444192 446840 449676 452133 453858 455042 455880
60188 455880 456049 455137 453326 451287 449473 447853 446198 444265 441799 438735 435473 432617 430412 428689 427274
60173 427274 426126 425031 423603 421774 420037 418935 418485 418293 418141 418182 418549 418929 418774 417956 417097 417062 418131
60156 418131 419848 421642 423323 424859 426118 427168 428574 430889 433899 436839 439342 441775 444532 447509
60142 447509 450561 454079 458665 464319 470318 475939 481014 485705 489958 493406 495786 497239 498097 498495 498321
60127 498321 497513 496230 494706 493067 491338 489483 487462 485443 483943 483414 483636 483865 483775 483829 484447 485255 485618
60110 485618 485489 485104 484173 482185 479458 477058 475515 474381 473234 472268 471460 470011 467418 464597 463107
$$ packed form
60216C73569K753K567K836L485M016M348M730N016M743L876K948K333J954J724
60202D20898J847K451L251L774L743L222K610K396K648K836K457J725J184Q38
60188D55880J69r12j811k039j814j620j655j933k466l064l262k856k205j723j415
60173D27274j148j095j428j829j737j102m50j92j52M1L67L80j55q18q59l5J069
60156D18131J717J794J681J536J259J050J406K315L010K940K503K433K757K977
60142D47509L052L518M586N654N999N621N075M691M253L448K380J453Q58L98j74
60127D98321q08j283j524j639j729j855k021k019j500n29K22K29r0N4O18Q08L63
60110D85618j29l85r31j988k727k400j543j134j147r66q08j449k593k821j490
$$ plain form
60095 463107 463429 464720 466109 467498 469051 470620 472015 473350 474830 476469 478210 480060 481922 483590
60081 483590 485089 486741 488671 490482 491681 492270 492624 492899 492815 491944 489959 486696 482255 477073 471605 465928
60065 465928 459960 454053 448954 444921 441225 436917 431943 427140 423232 420197 417550 414805 411649 408154
60051 408154 405030 403234 403051 403895 405210 407114 409716 412326 414093 415309 417259 420661 424870 428838 432209
60036 432209 435054 437092 437877 437669 437452 437869 438399 437794 435245 431074 426314 421710 417183 412236 406699 400913
60020 400913 395274 389909 384850 380236 376151 372427 368801 365228 361924 359183 357218 356065 355532 355295 355070
60005 355070 354578 353442 351396 348740 346339 344960 344701 345142 345872 346717 347665 348803 350236 351903 353599 355292
59989 355292 357296 359921 363038 366136 368724 370581 371747 372464 373012 373472 373773 374030 374570 375402 375934 375597
$$ packed form
60095D63107L22J291J389J389J553J569J395J335J480J639J741J850J862J668
60081D83590J499J652J930J811J199N89L54K75q4q71j985l263m441n182n468n677
60065D65928n968n907n099m033l696m308m974m803l908l035k647k745l156l495
60051D08154l124j796j83Q44J315J904K602K610J767J216J950L402M209L968L371
60036D32209K845K038P85k08k17M17N30o05k549m171m760m604m527m947n537n786
60020D00913n639n365n059m614m085l724l626l573l304k741j965j153n33k37k25
60005C55070m92j136k046k656k401j379k59M41P30Q45R48J138J433J667J696J693
59989C55292K004K625L117L098K588J857J166P17N48M60L01K57N40Q32N32l37
$$ plain form
59973 375597 374665 374075 374411 375346 376081 376104 375451 374458 373448 372611 372138 372310 373253 374522 375317 375365 375337 376043 377426
59954 377426 378765 379675 380409 381253 382189 383227 384472 385663 386124 385543 384391 383272 382172 380798 379369 378531
59938 378531 378466 378562 378116 377097 376042 375372 374971 374382 373298 371833 370371 369237 368536 368235 368308 368720 369354 370029
59920 370029 370622 371234 372186 373735 375710 377612 379229 381009 383594 387137 391373 396241 401951 408365 414735
59905 414735 420285 424708 427921 429705 429998 429340 428590 428256 428273 428293 427895 426753 425000 423472 423159 424302 426275
59888 426275 428391 430556 433019 435796 438650 441553 444903 449132 454168 459323 463803 467280 469920 471915
59874 471915 473178 473592 473289 472465 471032 468692 465293 460926 455763 450108 444535 439672 435737 432484 429605
59859 429605 426948 424362 421682 419003 416714 415115 414156 413656 413489 413412 413002 412056 410920 410167 410017 410207 410356
$$ packed form
59973C75597r32n90L36R35P35K3o53r93j010q37m73J72R43J269P95M8k8P06J383
59954C77426J339R10P34Q44R36J038J245J191M61n81j152j119j100j374j429q38
59938C78531o5R6m46j019j055o70m01n89j084j465j462j134p01l01P3M12O34O75
59920C70029N93O12R52J549J975J902J617J780K585L543M236M868N710O414O370
59905D14735N550M423L213J784K93o58p50l34J7K0l98j142j753j528l13J143J973
59888D26275K116K165K463K777K854K903L350M229N036N155M480L477K640J995
59874D71915J263M14l03q24j433k340l399m367n163n655n573m863l935l253k879
59859D29605k657k586k680k679k289j599r59n00j67p7m10r46j136p53j50J90J49
$$ plain form
59842 410356 410253 409869 409240 408336 407046 405431 403992 403405 403848 404879 406166 407999 410731 413985 416915 419094
59826 419094 420709 421892 422391 421995 420854 419182 416934 413975 410358 406414 402740 400054 398695 398163 397533
59811 397533 396480 395579 395462 396016 396641 396974 397082 397159 397298 397384 397053 396005 394518 393285 392500 391502 389725 387658
59793 387658 386295 385843 385505 384515 382887 381171 379908 379372 379432 379585 379388 378852 378175 377264 375979 374715 374135
59776 374135 374282 374530 374559 374787 375600 376691 377501 377877 377962 377858 377787 378282 379751 382021 384544 386810 388358 388808
59758 388808 388370 388027 388764 390738 393491 396640 399939 402966 405354 407208 408851 410359 411855 413986 417337
59743 417337 421433 425115 428030 430946 434404 437811 440363 442151 443703 444974 445544 445599 445888 446692 447476 447748
59727 447748 447744 448003 448578 449050 449091 448717 448026 447018 445837 444943 444728 444971 445004 444642 444645 445884 448125 450134 451076
$$ packed form
59842D10356j03l84o29r04j290j615j439n87M43J031J287J833K732L254K930K179
59826D19094J615J183M99l96j141j672k248k959l617l944l674k686j359n32o30
59811C97533j053r01j17N54O25L33J08P7J39Q6l31j048j487j233p85r98j777k067
59793C87658j363m52l38r90j628j716j263n36O0J53j97n36o77r11j285j264n80
59776C74135J47K48K9K28Q13J091Q10L76Q5j04p1M95J469K270K523K266J548M50
59758C88808m38l43P37J974K753L149L299L027K388J854J643J508J496K131L351
59743D17337M096L682K915K916L458L407K552J788J552J271N70N5K89Q04P84K72
59727D47748mK59N75M72M1l74o91j008j181q94k15K43L3l62LJ239K241K009R42
$$ plain form
59708 451076 451334 451742 452452 452991 453202 453591 454757 456812 459313 461483 462601 462611 462424 463303 465790 469379 473183
59691 473183 476521 478890 479923 479797 479370 479477 480180 480965 481466 481597 481116 479612 477018 473752 470209 466472
59675 466472 462752 459697 457776 456490 454662 451566 447472 443055 438687 434555 431067 428599 426897 425182
59661 425182 423070 421090 419990 419726 419588 419296 419546 421176 424121 427617 431242 435186 439390 443001 445144
59646 445144 445970 446407 446921 447009 446021 444022 441546 438789 435492 431631 427890 425283 424364 424832 425822 426473 426343
59629 426343 425415 423922 422184 420549 419218 418034 416474 414047 410797 407373 404460 402096 399645 396591
59615 396591 393221 390324 388273 386754 385478 384699 384732 385350 386142 387224 389012 391359 393579 395402 397261
59600 397261 399373 401159 401954 401834 401257 400319 398970 397699 397306 397950 398926 399420 399122 398074 396403 394384
$$ packed form
59708D51076K58M08P10N39K11L89J166K055K501K170J118J0j87Q79K487L589L804
59691D73183L338K369J033j26m27J07P03P85N01J31m81j504k594l266l543l737
59675D66472l720l055j921j286j828l096m094m417m368m132l488k468j702j715
59661D25182k112j980j100k64j38k92K50J630K945L496L625L944M204L611K143
59646D45144Q26M37N14Q8r88j999k476k757l297l861l741k607r19M68R90O51j30
59629D26343r28j493j738j635j331j184j560k427l250l424k913k364k451l054
59615C96591l370k897k051j519j276p79L3O18P92J082J788K347K220J823J859
59600C97261K112J786P95j20n77r38j349j271l93O44R76M94k98j048j671k019
$$ plain form
59584 394384 392448 390831 389334 387555 385295 382740 380355 378570 377461 376731 376022 375078 373573 371204 368269
59569 368269 365802 364574 364099 363156 361304 359364 358377 358668 360077 362491 365702 369122 372121 374543 376663
59554 376663 378802 381180 383950 387066 390274 393438 396805 400776 405607 411520 418916 428135 439118 451584
59540 451584 465538 481220 498315 515293 529706 539249 542738 540461 533949 525469 517326 511056 507022
59527 507022 504828 504155 504974 506975 509288 511179 512678 514061 515030 514980 513904 512276 510006 506302 500822
59512 500822 494237 487262 479772 471421 462634 454301 446792 439938 433766 428569 424213 420020 415534 411033
59498 411033 407134 404199 402244 401183 400956 401477 402559 403905 405268 406631 408071 409440 410488 411440 413031
59483 413031 415643 418720 421485 424015 427116 431335 436671 443082 450555 458438 465369 470253 473040 474361
$$ packed form
59584C94384j936j617j497j779k260k555k385j785j109p30p09r44j505k369k935
59569C68269k467j228m75r43j852j940r87K91J409K414L211L420K999K422K120
59554C76663K139K378K770L116L208L164L367L971M831N913P396R219J0983J2466
59540D51584J3954J5682J7095J6978J4413R543L489k277o512q480q143o270m034
59527E07022k194o73Q19K001K313J891J499J383R69n0j076j628k270l704n480
59512E00822o585o975p490q351q787q333p509o854o172n197m356m193m486m501
59498D11033l899k935j955j061k27N21J082J346J363J363J440J369J048R52J591
59483D13031K612L077K765K530L101M219N336O411P473P883O931M884K787J321
$$ plain form
59469 474361 474791 474785 474928 475741 477241 478952 480414 481613 483034 485429 489394 495009 501931 509825 518501 527542
59453 527542 536162 543794 550758 558013 566170 574905 583290 590423 595530 597773 596367 591123 582758 572500
59439 572500 561485 550632 540856 532846 526416 520427 513861 506904 500644 495758 491873 488399 485592 484468
59425 484468 485759 489217 494059 500002 507761 518402 532140 547869 564139 580662 598671 619626
59413 619626 643550 668464 691133 708178 716978 716423 707535 693295 677343 662348 649569 639848
59401 639848 634471 634434 638753 643990 645769 640878 628313 609153 585894 561432 537966 516616 497974
59388 497974 482519 470167 459930 450723 442416 435590 430479 426766 424278 423070 422717 422342 421613 421083
59374 421083 421255 421971 423095 425005 427757 430421 432071 433126 434874 437847 441502 445405 449864 455190 461139
$$ packed form
59469D74361M30oJ43Q13J500J711J462J199J421K395L965N615O922P894Q676R041
59453E27542Q620P632O964P255Q157Q735Q385P133N107K243j406n244q365j0258
59439E72500j1015j0853r776q010o430n989o566o957o260m886l885l474k807j124
59425D84468J291L458M842N943P759J0641J3738J5729J6270J6523J8009K0955
59413F19626K3924K4914K2669J7045Q800n55q888j4240j5952j4995j2779r721
59401F39848n377l7M319N237J779m891j2565j9160k3259k4462k3466k1350j8642
59388D97974j5455j2352j0237r207q307o826n111l713k488j208l53l75p29n30
59374D21083J72P16J124J910K752K664J650J055J748K973L655L903M459N326N949
$$ plain form
59359 461139 467408 474123 481469 489329 497712 507115 518006 530169 543047 556560 571120 586817 602995
59346 602995 618735 633540 647472 660786 673546 685429 695780 703841 709026 711100 710277 707180 702479
59333 702479 696369 688427 678203 665959 652734 639629 627129 615052 603043 591056 579439 568647
59321 568647 558929 550287 542631 535803 529468 523221 516929 510775 504809 498677 492056 485216 478908 473765
59307 473765 470055 467861 467052 467108 467383 467633 467941 468043 467291 465546 463650 462618 462629 463149 463776 464557 465689
59290 465689 467330 469556 472082 474204 475456 476263 477495 479483 481942 484746 488152 492220 496651 501388
59276 501388 506798 513066 519899 527117 534988 543555 552140 560006 567191 574112 580556 585627 588663 589792
59262 589792 589513 588058 585256 580893 575186 568859 562606 556423 549750 542379 534908 528079 522045 516617
$$ packed form
59359D61139O269O715P346P860Q383R403J0891J2163J2878J3513J4560J5697J6178
59346F02995J5740J4805J3932J3314J2760J1883J0351Q061N185K074q23l097m701
59333G02479o110p942j0224j2244j3225j3105j2500j2077j2009j1987j1617j0792
59321E68647r718q642p656o828o335o247o292o154n966o132o621o840o308n143
59307D73765l710k194q09N6K75K50L08J02p52j745j896j032J1N20O27P81J132
59290D65689J641K226K526K122J252Q07J232J988K459K804L406M068M431M737
59276E01388N410O268O833P218P871Q567Q585P866P185O921O444N071L036J129
59262E89792k79j455k802m363n707o327o253o183o673p371p471o829o034n428
$$ plain form
59248 516617 511829 507801 504314 501099 498491 497252 497711 499435 501829 504722 508325 512779 517802 522720
59234 522720 526982 530698 534286 537365 538549 536894 533161 528927 524661 519517 512951 505544 498000 490260
59220 490260 482207 474607 468605 464474 461394 458359 454991 451589 448745 446826 445608 444527 443421 442786
59206 442786 443108 444163 445293 446239 447306 448700 450014 450466 449551 447466 445065 443412 443198 444425 446665
59191 446665 449569 453043 456933 460780 464200 467485 471450 476382 481358 485050 487151 488591 490329 492523
59177 492523 495055 498215 502307 506981 511578 515893 520169 524602 529445 535315 542641 550826 558600 565264
59163 565264 571039 576227 580723 584394 587236 588883 588560 585825 580973 574636 567488 560371 553990 548128
59149 548128 541830 534767 527926 522532 518739 515754 512752 509190 504712 499410 494017 489354 485658 482725
$$ packed form
59248E16617m788m028l487l215k608j239M59J724K394K893L603M454N023M918
59234E22720M262L716L588L079J184j655l733m234m266n144o566p407p544p740
59220D90260q053p600o002m131l080l035l368l402k844j919j218j081j106o35
59206D42786L22J055J130R46J067J394J314M52r15k085k401j653k14J227K240
59191D46665K904L474L890L847L420L285L965M932M976L692K101J440J738K194
59177D92523K532L160M092M674M597M315M276M433M843N870P326Q185P774O664
59163E65264N775N188M496L671K842J647l23k735m852o337p148p117o381n862
59149E48128o298p063o841n394l793k985l002l562m478n302n393m663l696k933
$$ plain form
59135 482725 480427 478710 477326 476016 474875 474171 473907 473871 474024 474627 476019 478380 481531 484965 488314 491846
59119 491846 496131 501175 506403 511660 517598 524735 532689 540791 548965 557449 566103 574665 583388 592740
59105 592740 602551 612017 620570 628343 635810 643238 650390 656480 660637 662704 663430 663564 663056 661449 658731
59090 658731 655414 652066 649232 647417 646603 645895 644174 640970 636351 630311 622795 614149 604984 595722 586643
59075 586643 578154 570472 563271 556142 549151 542444 535637 528299 520799 513907 507725 501810 496255 491778
59061 491778 488623 486163 483790 481550 479697 478232 477084 476202 475243 473689 471439 468872 466218 463378 460456
59046 460456 457966 456342 455683 455954 456949 458061 458742 459284 460470 462350 464173 465697 467725 470838 474400
59031 474400 477477 480214 483580 488068 493308 498859 504839 511797 520265 530367 541655 553392 565082
$$ packed form
59135D82725k298j717j384j310j141p04k64l6J53O03J392K361L151L434L349L532
59119D91846M285N044N228N257N938P137P954Q102Q174Q484Q654Q562Q723R352
59105E92740R811R466Q553P773P467P428P152O090M157K067P26J34n08j607k718
59090F58731l317l348k834j815q14p08j721l204m619o040p516q646r165r262r079
59075E86643q489p682p201p129o991o707o807p338p500o892o182n915n555m477
59061D91778l155k460k373k240j853j465j148q82r59j554k250k567k654k840k922
59046D60456k490j624o59K71R95J112O81N42J186J880J823J524K028L113L562
59031D74400L077K737L366M488N240N551N980O958Q468J0102J1288J1737J1690
$$ plain form
59018 565082 576621 587912 598706 608834 618111 625825 630864 632773 632348 630866 629009 626855 624536
59005 624536 622402 620737 619758 619836 621346 624303 628352 633063 638053 642935 647420 651532 655576 659782 663840
58990 663840 666733 667277 665099 660922 655654 649433 641980 633659 625460 617948 610939 604328 598483 593555
58976 593555 589161 585262 582717 582375 583982 586543 589454 592773 596657 601129 606300 612293 618908 625627
58962 625627 632017 638010 643913 650154 656741 662814 667040 668665 667905 665249 660821 654655 647100 638581
58948 638581 629301 619542 609849 600526 591303 581959 572977 565104 558465 552512 546689 540772 534809 529091
58934 529091 524010 519596 515434 511295 507547 504583 502158 499766 497352 495164 493148 491049 488986 487407
58920 487407 486531 486197 486159 486130 485749 484995 484529 485128 486821 489025 491443 494345 497974 502212 506965 512531 519454
$$ packed form
59018E65082J1539J1291J0794J0128R277P714N039J909m25j482j857k154k319
59005F24536k134j665r79P8J510K957M049M711M990M882M485M112M044M206M058
58990F63840K893N44k178m177n268o221p453q321q199p512p009o611n845m928
58976E93555m394l899k545l42J607K561K911L319L884M472N171N993O615O719
58962F25627O390N993N903O241O587O073M226J625p60k656m428o166p555q519
58948F38581r280r759r693r323r223r344q982p873o639n953n823n917n963n718
58934E29091n081m414m162m139l748k964k425k392k414k188k016k099k063j579
58920D87407q76l34l8k9l81p54m66N99J693K204K418K902L629M238M753N566O923
$$ plain form
58903 519454 528138 538505 549763 560653 570287 578749 586664 594336 601664 608778 616338 625207 636074
58890 636074 649245 664499 681217 698946 717654 737163 756612 774868 791262 805478 817005
58879 817005 825355 830726 833810 834876 833478 829014 821086 809406 794060 776094 757313 739249 722514
58866 722514 707147 693090 680246 668504 657922 648642 640543 633238 626358 619545 612252 604063 595258
58853 595258 586670 578875 571834 565263 558952 552727 546600 540986 536322 532346 528248 523653 519012 514875
58839 514875 511158 507276 502651 497008 490555 484005 478074 472921 468409 464735 462197 460311 457999 454903
58825 454903 451843 449666 448297 447370 447133 448030 449818 451744 453393 454849 456240 457664 459428 461838 464721
58810 464721 467467 469544 470788 471373 471769 472569 474002 475689 477112 478180 479165 480245 481367 482331 482766 482228
$$ packed form
58903E19454Q684J0367J1258J0890R634Q462P915P672P328P114P560Q869J0867
58890F36074J3171J5254J6718J7729J8708J9509J9449J8256J6394J4216J1527
58879H17005Q350N371L084J066j398m464p928j1680j5346j7966j8781j8064j6735
58866G22514j5367j4057j2844j1742j0582r280q099p305o880o813p293q189q805
58853E95258q588p795p041o571o311o225o127n614m664l976m098m595m641m137
58839E14875l717l882m625n643o453o550n931n153m512l674k538j886k312l096
58825D54903l060k177j369r27k37Q97J788J926J649J456J391J424J764K410K883
58810D64721K746K077J244N85L96Q00J433J687J423J068R85J080J122R64M35n38
$$ plain form
58794 482228 480669 478617 476608 474651 472630 471021 470678 471935 474325 477233 480386 483710 487063 490378
58780 490378 493864 497920 502822 508410 513951 518484 521558 523551 525075 526249 526801 526634 525738 523708 520036
58765 520036 515067 510042 505826 502026 497791 493143 489074 486476 485450 485547 486198 486882 487306 487599 488133 489049
58749 489049 490201 491508 493067 494864 496691 498515 500564 502856 504969 506571 507960 509799 512579 516598
58735 516598 522155 529179 536857 544226 551175 558377 566141 573867 580819 586929 592490 597432 601268 603604
58721 603604 604487 604430 604281 604851 606460 608998 612432 616908 622300 628151 634271 640877 647788 653990 658519
58706 658519 661430 663351 664375 663963 661698 657532 651363 642973 632436 620181 606661 592332 577815
58693 577815 563627 549766 536080 522978 511362 501777 494017 487518 481784 476451 471391 466753 462644
$$ packed form
58794D82228j559k052k009j957k021j609l43J257K390K908L153L324L353L315
58780D90378L486M056M902N588N541M533L074J993J524J174N52j67q96k030l672
58765E20036m969n025m216l800m235m648m069k598j026R7O51O84M24K93N34R16
58749D89049J152J307J559J797J827J824K049K292K113J602J389J839K780M019
58735E16598N557P024P678P369O949P202P764P726O952O110N561M942L836K336
58721F03604Q83n7j49N70J609K538L434M476N392N851O120O606O911O202M529
58706F58519K911J921J024m12k265m166o169q390j0537j2255j3520j4329j4517
58693E77815j4188j3861j3686j3102j1616r585p760o499n734n333n060m638m109
$$ plain form
58680 462644 458820 455003 451312 448036 445256 443141 442274 442957 444462 445787 447159 449956 455078 462166 470467
58665 470467 479589 489176 498711 508058 517458 526576 534222 539454 542380 543467 542771 540338 536795 532892
58651 532892 528917 525029 521679 519082 516727 514024 511090 508325 505581 502399 498874 495680 493375 492155
58637 492155 492008 492641 493493 494355 495764 498220 501207 503610 504962 505689 506249 506735 507338 508509 510417 512726
58621 512726 515113 517647 520520 523799 527644 532453 538530 545689 553278 560475 566630 571507 575265 578116
58607 578116 580098 581264 581796 581609 580059 576624 571888 567349 564055 561732 559439 556766 554073 551768 549768
58592 549768 547789 545920 544635 544260 544650 545566 547179 549947 554067 559386 565833 573488 582085 590846 599107
58577 599107 606861 614397 621672 628388 634474 640172 645743 651347 657171 663453 670514 678902 689253 701754
$$ packed form
58680D62644l824l817l691l276k780k115q67O83J505J325J372K797N122P088Q301
58665D70467R122R587R535R347R400R118P646N232K926J087o96k433l543l903
58651E32892l975l888l350k597k355k703k934k765k744l182l525l194k305j220
58637D92155j47O33Q52Q62J409K456K987K403J352P27N60M86O03J171J908K309
58621E12726K387K534K873L279L845M809O077P159P589P197O155M877L758K851
58607E78116J982J166N32j87j550l435m736m539l294k323k293k673k693k305k000
58592E49768j979j869j285l75L90R16J613K768M120N319O447P655Q597Q761Q261
58577E99107P754P536P275O716O086N698N571N604N824O282P061Q388J0351J2501
$$ plain form
58563 701754 715945 731343 748082 766514 786297 806198 824833 841408 855845 868445 879347
58552 879347 888168 894355 898048 900222 901607 901752 899667 895178 889084 882061 874026 864625 853705 841139
58538 841139 826749 810746 793867 776736 759481 742350 726351 712725 701869 693229 686243 680873
58526 680873 677075 674255 671772 669815 669273 670703 673736 677565 681637 685658 689348 692594 695616 698576
58512 698576 701169 703009 704233 705182 705598 704771 702627 700014 697667 695395 692611 689173 685330 681228 676955
58497 676955 672773 668918 665347 662054 659354 657465 655976 654242 652227 650591 649938 650322 651538 653584 656683
58482 656683 660997 666460 672939 680515 689468 699811 710956 722064 732595 742176 750142 755802 759162
58469 759162 760730 760481 757656 751992 744573 737089 730672 725762 722536 720941 720670 721540 723651 726907 730892
$$ packed form
58563G01754J4191J5398J6739J8432J9783J9901J8635J6575J4437J2600J0902
58552H79347Q821O187L693K174J385J45k085m489o094p023q035r401j0920j2566
58538H41139j4390j6003j6879j7131j7255j7131j5999j3626j0856q640o986n370
58526F80873l798k820k483j957n42J430L033L829M072M021L690L246L022K960
58512F98576K593J840J224R49M16q27k144k613k347k272k784l438l843m102m273
58497F76955m182l855l571l293k700j889j489j734k015j636o53L84J216K046L099
58482F56683M314N463O479P576Q953J0343J1145J1108J0531R581P966N660L360
58469G59162J568k49k825n664p419p484o417m910l226j595k71Q70K111L256L985
$$ plain form
58454 730892 735541 741314 748197 755102 760859 765221 768251 769354 767918 764551 760637 756746 752362 747192
58440 747192 741895 737418 734290 732640 732272 732603 733175 734299 736662 740214 744074 747672 751500 756545 763448
58425 763448 772338 782995 794898 807338 819696 831496 842291 851751 859745 866043 870108 871572 870807
58412 870807 868601 865379 861145 856037 850379 844252 837539 830479 823760 817951 813194 809471 806853 805450
58398 805450 805330 806449 808510 811077 814039 817679 821990 826323 830070 833317 836311 838696 839886 839911 839258
58383 839258 838124 836513 834823 833643 833088 833007 833707 835804 839411 844037 849185 854499 859611 864530 869978
58368 869978 876595 883973 891240 898456 906505 915743 925640 935857 946696 958197 969603 980015 989105
58355 989105 996985 1003899 1010176 1016052 1021517 1026668 1031966 1037673 1043372 1048752 1054477 1061408 1069253 1077020
$$ packed form
58454G30892M649N773O883O905N757M362L030J103j436l367l914l891m384n170
58440G47192n297m477l128j650l68L31N72J124K363L552L860L598L828N045O903
58425G63448Q890J0657J1903J2440J2358J1800J0795R460P994O298M065J464p65
58412H70807k206l222m234n108n658o127o713p060o719n809m757l723k618j403
58398H05450j20J119K061K567K962L640M311M333L747L247K994K385J190K5o53
58383H39258j134j611j690j180n55q1P00K097L607M626N148N314N112M919N448
58368H69978O617P378P267P216Q049R238R897J0217J0839J1501J1406J0412R090
58355I89105P880O914O277N876N465N151N298N707N699N380N725O931P845P767
$$ plain form
58341 1077020 1084650 1093153 1103192 1114607 1127365 1141785 1157584 1173747 1189701 1205798 1222370 1239043
58329 1239043 1255105 1269768 1282076 1291522 1298877 1305555 1312083 1318067 1323522 1328989 1334330 1338809 1342730
58316 1342730 1347714 1354862 1363768 1373780 1385045 1397775 1411604 1426327 1442298 1459531 1477350 1495439
58304 1495439 1514205 1533604 1552744 1571332 1590385 1610624 1631170 1650769 1669506 1688368 1707722
58293 1707722 1727117 1746174 1764932 1783739 1803299 1824372 1847035 1870715 1895178 1920786 1947577
58282 1947577 1975004 2003006 2032394 2063641 2096142 2129200 2162940 2197715 2233384 2269686 2306673
58271 2306673 2344445 2383202 2423835 2467573 2514791 2564992 2618029 2674198 2733031 2793423 2855287
58260 2855287 2919749 2987272 3057058 3128640 3202440 3278184 3354497 3430963 3508974 3589685 3672744
$$ packed form
58341A077020P630Q503J0039J1415J2758J4420J5799J6163J5954J6097J6572J6673
58329A239043J6062J4663J2308R446P355O678O528N984N455N467N341M479L921
58316A342730M984P148Q906J0012J1265J2730J3829J4723J5971J7233J7819J8089
58304A495439J8766J9399J9140J8588J9053K0239K0546J9599J8737J8862J9354
58293A707722J9395J9057J8758J8807J9560K1073K2663K3680K4463K5608K6791
58282A947577K7427K8002K9388L1247L2501L3058L3740L4775L5669L6302L6987
58271B306673L7772L8757M0633M3738M7218N0201N3037N6169N8833O0392O1864
58260B855287O4462O7523O9786P1582P3800P5744P6313P6466P8011Q0711Q3059
$$ plain form
58249 3672744 3758048 3847063 3941172 4040148 4143530 4252210 4367398 4489311 4618050 4754540
58239 4754540 4899565 5053090 5215593 5388612 5572932 5767771 5972999 6190706 6423357
58230 6423357 6671848 6936617 7219178 7521391 7844722 8191379 8564523 8966278 9397338
58221 9397338 9859746 10358189 10897629 11482063 12116891 12810002 13569115 14400982 15315299
58212 15315299 16326924 17452676 18709253 20116691 21700924 23490947 25517877 27821192
58204 27821192 30453845 33478190 36959368 40966124 45578555 50900061 57076725 64320709
58196 64320709 72921973 83239315 95675900 110639518 128485967 149473573 173760938
58189 173760938 201390466 232110468 264989058 298045959 328272568 352204549 366827628
$$ packed form
58249C672744Q5304Q9015R4109R8976J03382J08680J15188J21913J28739J36490
58239D754540J45025J53525J62503J73019J84320J94839K05228K17707K32651
58230F423357K48491K64769K82561L02213L23331L46657L73144M01755M31060
58221I397338M62408M98443N39440N84434O34828O93111P59113Q31867R14317
58212A5315299J011625J125752J256577J407438J584233J790023K026930K303315
58204B7821192K632653L024345L481178M006756M612431N321506O176664P243984
58196F4320709Q601264J0317342J2436585J4963618J7846449K0987606K4287365
58189A73760938K7629528L0720002L2878590L3056901L0226609K3931981J4623079
$$ plain form
58182 366827628 370395858 362839800 345665043 321427899 293012037 262998323 233337340
58175 233337340 205323282 179712788 156854161 136798604 119406850 104439509 91614183
58168 91614183 80639461 71241553 63180026 56247476 50264655 45081306 40575853 36647442
58160 36647442 33208719 30186476 27522548 25168059 23078236 21214523 19547333 18052587
58152 18052587 16707647 15492837 14393473 13396812 12489205 11658821 10898610 10203522 9566782
58143 9566782 8981398 8443074 7948670 7493485 7072699 6683950 6325863 5995421 5689120
58134 5689120 5405393 5143475 4901012 4675081 4464529 4269073 4086975 3915826 3754914
58125 3754914 3604731 3464625 3332767 3208037 3090274 2979089 2873908 2774749 2681596 2593474
$$ packed form
58182C66827628L568230p556058j7174757k4237144k8415862l0013714k9660983
58175B33337340k8014058k5610494k2858627k0055557j7391754j4967341j2825326
58168I1614183j0974722r397908q061527o932550n982821n183349m505453l928411
58160C6647442l438723l022243k663928k354489k089823j863713j667190j494746
58152A8052587j344940j214810j099364r96661r07607q30384p60211o95088o36740
58143I566782n85384n38324m94404m55185m20786l88749l58087l30442l06301
58134E689120k83727k61918k42463k25931k10552j95456j82098j71149j60912
58125C754914j50183j40106j31858j24730j17763j11185j05181r9159r3153q8122
$$ plain form
58115 2593474 2509416 2429766 2355176 2284797 2216834 2150489 2086196 2024379 1965171 1908909 1855674
58104 1855674 1804566 1754496 1705472 1658187 1612650 1568184 1524505 1481956 1440904 1401597 1364339
58093 1364339 1329077 1295082 1261664 1229031 1198082 1169699 1144463 1122368 1102390 1083001 1063557
58082 1063557 1044566 1026342 1008273 989802 971066 952013 931928 910581 888900 867798 847300
58071 847300 827460 808988 792106 775949 760135 745790 733827 723254 712518 701607 691459
58060 691459 682124 673019 664326 656582 649323 641593 633396 625273 616858 607342 597120 587480 578779 570293
58046 570293 561822 554015 547023 540220 533402 527011 520945 514331 506844 499225 492208 485897 480364 475791
58032 475791 471586 466373 459421 451446 443609 436351 429493 422798 416011 408908 401671 394795 388402 382116
$$ packed form
58115B593474q4058p9650p4590p0379o7963o6345o4293o1817n9208n6262n3235
58104A855674n1108n0070m9024m7285m5537m4466m3679m2549m1052l9307l7258
58093A364339l5262l3995l3418l2633l0949k8383k5236k2095j9978j9389j9444
58082A063557j8991j8224j8069j8471j8736j9053k0085k1347k1681k1102k0498
58071H47300j9840j8472j6882j6157j5814j4345j1963j0573j0736j0911j0148
58060F91459r335r105q693p744p259p730q197q123q415r516j0222r640q701q486
58046E70293q471p807o992o803o818o391o066o614p487p619p017o311n533m573
58032D75791m205n213o952p975p837p258o858o695o787p103p237o876o393o286
$$ plain form
58018 382116 375791 369875 364763 360252 355866 351372 346771 342141 337690 333757 330673 328663 327728 327382 326758
58003 326758 325397 323737 322502 321967 322223 323642 326286 329222 331434 333294 336097 340020 343586 345483 346069
57988 346069 346598 347608 348611 348880 348066 346369 344431 342824 341421 339527 336724 333249 329449 325378 321115
57973 321115 317026 313330 309722 305784 301549 297443 293838 290945 288968 288132 288472 289654 290993 291861 292287
57958 292287 293030 294758 297195 299361 300542 300694 300006 298543 296479 294325 292719 292131 292822 294910 298425
57943 298425 303343 309481 316341 323342 330425 338124 346795 356123 365815 376267 387804 399443 409271
57930 409271 416164 420500 423095 424114 423261 420436 415755 409275 401067 391413 380810 369938 359529 349915
57916 349915 340679 331202 321618 312846 305578 299654 294584 290195 286509 283358 280524 278040 276152 275054
$$ packed form
58018C82116o325n916n112m511m386m494m601m630m451l933l084k010r35l46o24
58003C26758j361j660j235n35K56J419K644K936K212J860K803L923L566J897N86
57988C46069N29J010J003K69q14j697j938j607j403j894k803l475l800m071m263
57973C21115m089l696l608l938m235m106l605k893j977q36L40J182J339Q68M26
57958B92287P43J728K437K166J181J52o88j463k064k154j606n88O91K088L515
57943B98425M918O138O860P001P083P699Q671R328R692J0452J1537J1639R828
57930D09271O893M336K595J019q53k825m681o480q208r654j0603j0872j0409r614
57916C49915r236r477r584q772p268n924n070m389l686l151k834k484j888j098
$$ plain form
57902 275054 274749 275005 275363 275328 274618 273221 271401 269869 269627 271125 273621 275885 277542 279282 281796 285046
57886 285046 288589 291957 294538 295766 295810 295585 295679 295643 294688 292705 290176 287404 284303 280755 276772 272385
57870 272385 267735 263215 259190 255609 252093 248418 244751 241488 239018 237585 237181 237519 238271 239360 240949
57855 240949 243060 245275 246976 248056 249224 251272 253978 256114 256658 255599 253338 249895 245265 240125
57841 240125 235344 230963 226354 221372 216661 212797 209883 208052 207586 208256 209317 210517 212439 215411 218739
57826 218739 221566 223946 226394 228753 230253 230578 230279 230094 230319 230868 231544 232102 232209 231480 229672 227005
57810 227005 224214 221986 220248 218381 216165 214100 212628 211523 210333 209001 207658 206174 204353 202334
57796 202334 200368 198389 196159 193682 191194 188947 187264 186538 186798 187493 188069 188615 189687 191740 194961
$$ packed form
57902B75054l05K56L58l5p10j397j820j532k42J498K496K264J657J740K514L250
57886B85046L543L368K581J228M4k25R4l6r55j983k529k772l101l548l983m387
57870B72385m650m520m025l581l516l675l667l263k470j433m04L38P52J089J589
57855B40949K111K215J701J080J168K048K706K136N44j059k261l443m630n140
57841B40125m781m381m609m982m711l864k914j831m66O70J061J200J922K972L328
57826B18739K827K380K448K359J500L25k99j85K25N49O76N58J07p29j808k667
57810B27005k791k228j738j867k216k065j472j105j190j332j343j484j821k019
57796B02334j966j979k230k477k488k247j683p26K60O95N76N46J072K053L221
$$ plain form
57781 194961 199314 204336 209263 213839 218716 224523 230773 236323 240698 244271 247223 249051 249278 248030
57767 248030 245730 242728 239444 236392 233717 231009 227789 223951 219649 215098 210645 206684 203273 200114
57753 200114 197074 194426 192343 190459 188271 185788 183476 181621 180024 178293 176229 173883 171378 168753
57739 168753 165929 162860 159741 156964 154838 153347 152217 151127 149862 148371 146729 144994 143101 140975
57725 140975 138749 136779 135385 134685 134652 135148 135797 136021 135431 134208 132944 132098 131729 131780 132407 133793 135667
57708 135667 137318 138222 138495 138518 138316 137663 136750 136339 137092 139018 141669 144580 147272 149145 149742 149048 147317
57691 147317 144773 141717 138687 136168 134222 132677 131562 131007 130839 130786 131104 132556 135613 140078 145689
57676 145689 152785 162118 174297 189690 208703 231830 259420 291475 327460 365936 404311 439007
$$ packed form
57781A94961M353N022M927M576M877N807O250N550M375L573K952J828K27j248
57767B48030k300l002l284l052k675k708l220l838m302m551m453l961l411l159
57753B00114l040k648k083j884k188k483k312j855j597j731k064k346k505k625
57739A68753k824l069l119k777k126j491j130j090j265j491j642j735j893k126
57725A40975k226j970j394p00l3M96O49K24n90j223j264q46l69N1O27J386J874
57708A35667J651R04K73K3k02o53r13m11P53J926K651K911K692J873N97o94j731
57691A47317k544l056l030k519j946j545j115n55j68n3L18J452L057M465N611
57676A45689P096R333J2179J5393J9013K3127K7590L2055L5985L8476L8375L4696
$$ plain form
57664 439007 466001 481543 483139 470588 446331 414514 379407 344276 311124 280851 253566 229134
57652 229134 207694 189585 174773 162640 152502 144081 137234 131488 126299 121673 118034 115350 112862
57639 112862 109962 106961 104575 102915 101448 99825 98195 96736 95374 94109 93102 92281 91325 90304 89840
57624 89840 90206 90675 90302 89128 88018 87474 87181 86705 86028 85212 84088 82613 81184 80290 80025 80123 80247 79994
57606 79994 78930 77002 74883 73551 73458 74249 75338 76543 78050 79897 81643 82647 82642 82005 81389 81113 80925
57589 80925 80368 79234 77633 75798 74007 72687 72341 73154 74667 76070 76929 77538 78406 79465 79998 79363
57573 79363 77603 75306 73114 71476 70621 70477 70639 70583 69942 68584 66616 64458 62699 61720 61526 62038 63236
57556 63236 64820 66075 66529 66551 66879 67711 68726 69805 71078 72282 72820 72682 72609 73011 73316 72882 72071 71814
$$ packed form
57664D39007K6994J5542J596j2551k4257l1817l5107l5131l3152l0273k7285k4432
57652B29134k1440j8109j4812j2133j0138q421o847n746n189m626l639k684k488
57639A12862k900l001k386j660j467j623j630j459j362j265j007q21r56j021m64
57624H9840L66M69l73j174j110n44k93m76o77q16j124j475j429q94k65R8J24k53
57606G9994j064j928k119j332r3P91J089J205J507J847J746J004no37o16k76j88
57589H0925n57j134j601j835j791j320l46Q13J513J403Q59O09Q68J059N33o35
57573G9363j760k297k192j638q55j44J62n6o41j358j968k158j759r79j94N12J198
57556F3236J584J255M54K2L28Q32J015J079J273J204N38j38p3M02L05m34q11k57
$$ plain form
57538 71814 72431 73421 74166 74271 73468 71846 70150 69224 69093 69061 68687 68183 67841 67630 67513 67548 67516 66957 65890
57519 65890 64996 64814 65232 66087 67611 69754 71611 72286 72022 71715 71549 70964 69929 69277 69565 70404 71233 72008
57501 72008 72707 72884 72383 71948 72401 73542 74499 74856 74723 73990 72438 70548 69345 69215 69538 69740 70004 70624
57483 70624 71272 71422 71129 70915 71107 71622 72125 72129 71235 69643 68156 67354 67018 66660 66246 65963 65564 64543 62827
57464 62827 60815 58857 57171 56140 56069 56669 57304 57815 58600 59837 61160 62211 62946 63224 62668 61290 59762
57447 59762 58687 58001 57465 57328 57918 58887 59521 59744 60229 61385 62712 63426 63417 63249 63328 63372 62794 61480 60011
57428 60011 59045 58611 58172 57335 56281 55522 55458 56238 57694 59226 59975 59456 57981 56379 55380 55280 55876 56535
57410 56535 56625 56188 56009 56695 57916 58844 59085 58741 57826 56312 54726 53952 54176 54588 54469 54043 53829 53661
$$ packed form
57538G1814O17R90P45J05q03j622j696r26j31l2l74n04l42k11j17L5l2n59j067
57519F5890q94j82M18Q55J524K143J857O75k64l07j66n85j035o52K88Q39Q29P75
57501G2008O99J77n01m35M53J141R57L57j33p33j552j890j203j30L23K02K64O20
57483G0624O48J50k93k14J92N15N03Mq94j592j487q02l36l58m14k83l99j021j716
57464F2827k012j958j686j031p1O00O35N11P85J237J323J051P35K78n56j378j528
57447E9762j075o86n36j37N90R69O34K23M85J156J327P14rj68P9M4n78j314j469
57428F0011r66m34m39q37j054p59o4P80J456J532P49n19j475j602r99j00N96O59
57410E6535R0m37j79O86J221R28K41l44r15j514j586p74K24M12j19m26k14j68
$$ plain form
57392 53661 52998 51996 51559 52306 53989 56066 58368 60996 63915 67000 70252 73627 76682 78642 78890
57377 78890 77390 74781 72150 70492 70025 69982 69301 67655 65705 64314 63670 63283 62647 61663 60499 59371
57361 59371 58571 58486 59293 60629 61760 62211 62179 62241 62677 63185 63266 62858 62473 62652 63335 63913 63925 63591 63485 63809
57341 63809 64200 64329 64379 64778 65598 66484 67134 67568 67883 68018 67930 67804 67859 67972 67738 66904 65607 64192 62886
57322 62886 61717 60653 59819 59589 60326 61884 63441 64053 63432 62083 60738 59885 59778 60503 61829 63244
57306 63244 64356 65194 65931 66576 67131 67785 68579 69016 68462 66993 65462 64670 64760 65517 66794 68326 69476
57289 69476 69677 69143 68758 69171 70246 71469 72582 73639 74656 75579 76544 77832 79406 80733 81311 81303 81404
57272 81404 82118 83400 85023 86950 89191 91489 93448 94857 95716 96070 96066 96099 96557 97336 97873 97739 97028 96119
$$ packed form
57392E3661o63j002m37P47J683K077K302K628K919L085L252L375L055J960K48
57377G8890j500k609k631j658m67m3o81j646j950j391o44l87o36r84j164j128
57361E9371q00q5Q07J336J131M51l2O2M36N08Q1m08l85J79O83N78J2l34j06L24
57341F3809L91J29N0L99Q20Q86O50M34L15J35q8j26N5J13k34q34j297j415j306
57322F2886j169j064q34k30P37J558J557O12o21j349j345q53j07P25J326J415
57306F3244J112Q38P37O45N55O54P94M37n54j469j531p92R0P57J277J532J150
57289F9476K01n34l85M13J075J223J113J057J017R23R65J288J574J327N78qJ01
57272H1404P14J282J623J927K241K298J959J409Q59L54mL3M58P79N37j34p11r09
$$ plain form
57254 96119 95346 95064 95717 97422 99519 100896 101025 100535 100588 101739 103541 105206 106356 107024 107224 106918 106368
57237 106368 106099 106386 107080 108092 109656 111821 114050 115831 117501 119884 123142 126573 129616 132496 135638
57222 135638 138983 142298 145744 149628 153721 157288 159762 161158 161914 162657 163996 166152 168708 171049 173151
57207 173151 175706 179405 184269 189829 195778 202230 209434 217382 225802 234466 243507 253422 264702 277308
57193 277308 290412 302811 313836 323951 334294 345593 357780 370698 384712 400166 416593
57182 416593 433098 449522 466596 484872 504128 524032 544732 566355 588451 610493 632557
57171 632557 654998 677750 700500 723393 746999 771675 797417 824181 851888 880185 908784
57160 908784 938012 968490 1000238 1032544 1064726 1096550 1127897 1158629 1188935 1219264 1249679
$$ packed form
57254I6119p73k82O53J705K097J377J29m90N3J151J802J665J150O68K00l06n50
57237A06368k69K87O94J012J564K165K229J781J670K383L258L431L043K880L142
57222A35638L345L315L446L884M093L567K474J396P56P43J339K156K556K341K102
57207A73151K555L699M864N560N949O452P204P948Q420Q664R041R915J1280J2606
57193B77308J3104J2399J1025J0115J0343J1299J2187J2918J4014J5454J6427
57182D16593J6505J6424J7074J8276J9256J9904K0700K1623K2096K2042K2064
57171F32557K2441K2752K2750K2893K3606K4676K5742K6764K7707K8297K8599
57160I08784K9228L0478L1748L2306L2182L1824L1347L0732L0306L0329L0415
$$ plain form
57149 1249679 1279757 1309333 1338883 1368861 1399140 1429515 1460379 1492418 1525796 1560017 1594474
57138 1594474 1628823 1662871 1696460 1729521 1762137 1794527 1826923 1859362 1891649 1923733 1956072
57127 1956072 1989285 2023488 2058343 2093798 2130323 2168371 2208170 2250243 2295455 2344123 2395682
57116 2395682 2449839 2507727 2571329 2642066 2720534 2807353 2903517 3009934 3127245 3256279 3398519
57105 3398519 3556520 3734706 3939933 4180807 4466352 4805818 5209846 5691394 6265441
57096 6265441 6948116 7755808 8703822 9804321 11064241 12483763 14055361 15763496 17585044
57087 17585044 19490047 21442546 23401703 25322206 27151897 28828300 30282127 31453411
57079 31453411 32311528 32860101 33118792 33097443 32786244 32168435 31240375 30021678 28552624
$$ packed form
57149A249679L0078K9576K9550K9978L0279L0375L0864L2039L3378L4221L4457
57138A594474L4349L4048L3589L3061L2616L2390L2396L2439L2287L2084L2339
57127A956072L3213L4203L4855L5455L6525L8048L9799M2073M5212M8668N1559
57116B395682N4157N7888O3602P0737P8468Q6819R6164J06417J17311J29034J42240
57105C398519J58001J78186K05227K40874K85545L39466M04028M81548N74047
57096F265441O82675Q07692R48014J100499J259920J419522J571598J708135J821548
57087A7585044J905003J952499J959157J920503J829691J676403J453827J171284
57079C1453411Q58117N48573K58691k1349l11199o17809r28060j218697j469054
$$ plain form
57070 28552624 26886857 25085201 23210356 21321351 19468983 17693510 16024252 14480226
57062 14480226 13071511 11801021 10666147 9660065 8773085 7993942 7310720 6711456 6184812
57053 6184812 5720633 5309904 4944306 4616220 4319409 4049441 3803074 3577159 3368255
57044 3368255 3173191 2989656 2816081 2651180 2493907 2343834 2201244 2066620 1940125
57035 1940125 1821654 1711201 1608842 1514325 1426965 1346138 1271778 1204156 1143201 1088125 1037754
57024 1037754 991112 947693 907359 870125 836040 805139 777392 752635 730429 709946 690122
57013 690122 670226 650392 631487 614251 598631 584026 570026 556637 543891 531678 520091
57002 520091 509606 500584 492725 485363 478287 471977 466931 463049 459861 457299 455953 456467 458705 461760
$$ packed form
57070B8552624j665767j801656j874845j889005j852368j775473j669258j544026
57062A4480226j408715j270490j134874j006082q86980p79143o83222n99264n26644
57053F184812m64179m10729l65598l28086k96811k69968k46367k25915k08904
57044C368255j95064j83535j73575j64901j57273j50073j42590j34624j26495
57035A940125j18471j10453j02359r4517q7360q0827p4360o7622o0955n5076n0371
57024A037754m6642m3419m0334l7234l4085l0901k7747k4757k2206k0483j9824
57013F90122j9896j9834j8905j7236j5620j4605j4000j3389j2746j2213j1587
57002E20091j0485r022p859p362p076o310n046l882l188k562j346N14K238L055
$$ plain form
56988 461760 464892 468372 473118 479557 487055 494532 501272 506823 510443 511116 508203 501854 492801 481956
56974 481956 470215 458318 446742 435750 425527 416215 407962 401129 396328 394005 394052 396128 400204
56961 400204 406472 414804 424781 436204 448969 462166 473807 481797 485022 483375 477258 467423 454929
56948 454929 440751 425539 410050 395494 382976 372715 364204 357058 351466 348058 347717 351270 358766
56935 358766 369145 381274 395319 412431 432715 453937 472539 485692 492263 492330 486342 474813
56923 474813 458550 439003 418147 397660 378177 359537 341765 325381 310729 297548 285543
56912 285543 274931 266008 258470 251731 245724 240847 237101 233798 230368 227089 224763 223828 224072 225106
56898 225106 226862 229507 232986 236923 241077 245834 252006 260100 269967 281229 293827 307947 323523
$$ packed form
56988D61760L132L480M746O439P498P477O740N551L620O73k913o349r053j0845
56974D81956j1741j1897j1576j0992j0223r312q253o833m801k323M7K076M076
56961D00204O268Q332R977J1423J2765J3197J1641P990L225j647o117r835j2494
56948D54929j4178j5212j5489j4556j2518j0261q511p146n592l408l41L553P496
56935C58766J0379J2129J4045J7112K0284K1222J8602J3153O571O7n988j1529
56923D74813j6263j9547k0856k0487j9483j8640j7772j6384j4652j3181j2005
56912B85543j0612q923p538o739o007m877l746l303l430l279k326r35K44J034
56898B25106J756K645L479L937M154M757O172Q094R867J1262J2598J4120J5576
$$ plain form
56885 323523 340021 356545 371847 384327 392422 395371 393603 388362 380942 372256 362920 353604 345243
56872 345243 338857 335144 334314 336428 341846 351231 365056 383277 405601 431975 462670 497756 536417
56859 536417 576613 615203 648480 673014 686606 688839 680885 664805 642954 617731 591356 565619
56847 565619 541941 521780 506701 497789 495198 498628 508213 524646 548581 580315 620025 667868
56835 667868 723587 786026 852688 919152 978933 1024815 1051267 1056036 1039978 1006186 959376 905077
56823 905077 848214 792208 739404 691797 650833 616997 590346 571383 560797 558532 563796 576121
56811 576121 595846 623487 658993 701504 748974 797567 841820 876002 895626 898283 883995 855211
56799 855211 815978 770428 721805 672741 625841 583473 546990 516377 490773 469429 452416
$$ packed form
56885C23523J6498J6524J5302J2480Q095K949j768n241p420q686r336r316q361
56872C45243o386l713q30K114N418R385J3825J8221K2324K6374L0695L5086L8661
56859E36417M0196L8590L3277K4534J3592K233p954j6080k1851k5223k6375k5737
56847E65619k3678k0161j5079q912k591L430R585J6433K3935L1734L9710M7843
56835F67868N5719O2439O6662O6464N9781M5882K6452M769j6058l3792m6810n4299
56823I05077n6863n6006n2804m7607m0964l3836k6651j8963j0586k265N264J2325
56811E76121J9725K7641L5506M2511M7470M8593M4253L4182J9624K657j4288k8784
56799H55211l9233m5550m8623m9064m6900m2368l6483l0613k5604k1344j7013
$$ plain form
56788 452416 440465 434068 432884 436311 444467 458022 476947 499734 523882 546577 564815 575670
56776 575670 577189 569037 552145 528104 499106 467786 436337 405801 376574 349350 325079 304148
56764 304148 286208 270757 257391 245526 234462 224005 214633 206787 200255 194437 188952 183756 178877
56751 178877 174336 170332 167203 165039 163318 161122 157926 154290 151516 150392 150360 150148 149147 147920 147310
56736 147310 147407 147536 147095 146163 145339 145157 145638 146317 146613 146237 145351 144431 143999 144393 145669 147616 149838 151883
56718 151883 153431 154417 154924 154924 154278 153096 151896 151148 150816 150636 150735 151539 153051 154682 155895 156627 156937 156723
56700 156723 156063 155411 155117 155069 155176 155863 157632 160307 163136 165435 166813 167047 166214 164813 163294 161554
56684 161554 159317 156765 154310 151959 149548 147547 146867 147728 149298 150665 151655 152482 153133 153443 153405 153078
$$ packed form
56788D52416j1951o397j184L427Q156J3555J8925K2787K4148K2695J8238J0855
56776E75670J519q152j6892k4041k8998l1320l1449l0536k9227k7224k4271k0931
56764C04148j7940j5451j3366j1865j1064j0457r372p846o532n818n485n196m879
56751A78877m541m004l129k164j721k196l196l636k774j124l2k12j001j227o10
56736A47310R7J29m41r32q24j82M81O79K96l76q86r20m32L94J276J947K222K045
56718A51883J548R86N07%o46j182j200p48l32j80R9Q04J512J631J213P32L10k14
56700A56723o60o52k94m8J07O87J769K675K829K299J378K34q33j401j519j740
56684A61554k237k552k455k351k411k001o80Q61J570J367R90Q27O51L10l8l27
$$ plain form
56668 153078 152465 151728 151291 151527 152566 154429 157029 159905 162409 164369 166220 168300 170406 172304 174179
56653 174179 176237 178271 180007 181509 182826 183610 183648 183502 184025 185348 186891 188226 189374 190319 190888 191248
56637 191248 191860 192678 192951 192248 191271 191105 191899 192793 193081 192934 192838 192774 192321 191310 189968 188462 186720 184810
56619 184810 183141 182019 181181 180077 178464 176494 174408 172514 171352 171349 172166 172836 172700 171945 171100 170478 170293
56602 170293 170782 171749 172334 171844 170648 169755 169534 169368 168614 167396 166257 165390 164528 163449 162285 161348 160774
56585 160774 160429 160160 160104 160656 162071 164145 166306 167970 168892 169350 170013 171334 172998 174205 174616 174756 175385
56568 175385 176817 179084 182267 186231 190333 194004 197502 201565 206435 211722 217153 222779 228307 232851
56554 232851 235642 236662 236346 235037 232987 230519 227902 225295 222962 221244 220093 218992 217661 216482
$$ packed form
56668A53078o13p37m37K36J039J863K600K876K504J960J851K080K106J898J875
56653A74179K058K034J736J502J317P84L8j46N23J323J543J335J148R45N69L60
56637A91248O12Q18K73p03r77j66P94Q94K88j47r6o4m53j011j342j506j742j910
56619A84810j669j122q38j104j613j970k086j894j162lQ17O70j36p55q45o22j85
56602A70293M89R67N85m90j196q93k21j66p54j218j139q67q62j079j164r37n74
56585A60774l45k69n6N52J415K074K161J664R22M58O63J321J664J207M11J40O29
56568A75385J432K267L183L964M102L671L498M063M870N287N431N626N528M544
56554B32851K791J020l16j309k050k468k617k607k333j718j151j101j331j179
$$ plain form
56540 216482 215841 215349 214268 212602 211227 210848 211261 211795 212111 212292 212389 212232 211703 210959 210275 209743 209228 208576
56522 208576 207806 207051 206408 205932 205727 205882 206214 206192 205276 203441 201323 199812 199391 199828 200464 200794 200779 200688 200777
56503 200777 201081 201333 201051 199934 198309 196967 196369 196218 196074 196108 196790 197946 198743 198739 198395 198308 198428 198444 198513
56484 198513 199000 199676 199808 199141 198327 198218 199094 200703 202650 204470 205634 205916 205706 205592 205696 205688 205464 205371
56466 205371 205639 205922 205769 205355 205382 206250 207656 209044 210167 211121 212100 213237 214464 215405 215595 215008 214156
56449 214156 213508 212988 212290 211472 210988 211213 212158 213500 214661 215105 214854 214577 214785 215131 214986 214567 214824 216054
56431 216054 217293 217509 216952 216845 217957 219892 221695 222751 223125 223346 223942 224940 225745 225677 224672 223384 222575
56414 222575 222504 222909 223418 223829 224077 224123 224040 224129 224737 225841 227007 227869 228502 229113 229579 229614 229334 229266 229736 230589
$$ packed form
56540B16482o41m92j081j666j375l79M13N34L16J81R7j57n29p44o84n32n15o52
56522B08576p70p55o43m76k05J55L32k2r16j835k118j511m21M37O36L30j5r1Q9
56503B00777L04K52k82j117j625j342n98j51j44L4O82J156P97ml44q7J20J6O9
56484A98513M87O76J32o67q14j09Q76J609J947J820J164K82k10j14J04qk24r3
56466B05371K68K83j53m14K7Q68J406J388J123R54R79J137J227R41J90n87q52
56449B14156o48n20o98q18m84K25R45J342J161M44k51k77K08L46j45m19K57J230
56431B16054J239K16n57j07J112J935J803J056L74K21N96R98Q05o8j005j288q09
56414B22575p1M05N09M11K48M6q3Q9O08J104J166Q62O33O11M66L5k80o8M70Q53
$$ plain form
56394 230589 231594 232758 234017 234944 235096 234624 234283 234784 236215 238037 239607 240695 241480 242092 242434 242637
56378 242637 243340 244980 246909 247865 247436 246559 246328 246884 247804 248967 250478 252084 253404 254575 256025 257654
56362 257654 258802 259190 259358 259927 260836 261635 262287 263299 265000 266946 268189 268202 267451 266931 267150 267759 268264
56345 268264 268745 269603 270812 271868 272510 273075 274022 275327 276571 277452 278053 278703 279695 281145 282993 285104
56329 285104 287390 289869 292664 295908 299520 303027 305718 307150 307505 307390 307293 307272 307102 306612 305893 305243 304936
56312 304936 305014 305322 305748 306379 307375 308718 310106 311115 311555 311775 312498 314168 316532 318992 321295 323599
56296 323599 325938 328028 329674 331018 332180 332994 333377 333736 334703 336540 339023 341778 344526 347068 349331
56281 349331 351500 354015 357303 361409 365773 369509 372202 374468 377486 381851 387143 392654 398220 404145
$$ packed form
56394B30589J005J164J259R27J52m72l41N01J431J822J570J088P85O12L42K03
56378B42637P03J640J929R56m29q77k31N56R20J163J511J606J320J171J450J629
56362B57654J148L88J68N69R09P99O52J012J701J946J243J3p51n20K19O09N05
56345B68264M81Q58J209J056O42N65R47J305J244Q81O01O50R92J450J848K111
56329B85104K286K479K795L244L612L507K691J432L55j15r7k1j70m90p19o50l07
56312C04936P8L08M26O31R96J343J388J009M40K20P23J670K364K460K303K304
56296C23599K339K090J646J344J162Q14L83L59R67J837K483K755K748K542K263
56281C49331K169K515L288M106M364L736K693K266L018M365N292N511N566N925
$$ plain form
56267 404145 410614 417484 424550 431806 439541 448241 458183 469035 480076 490953 502055 514130 527844
56254 527844 543731 562087 582731 605252 629759 657021 687583 721153 757080 795026 834808
56243 834808 876005 918131 960775 1003123 1043773 1081530 1116001 1146864 1172939 1192756 1205801
56232 1205801 1212515 1213225 1207898 1196890 1181159 1161536 1138377 1112084 1083385 1052969 1021339 989182
56220 989182 957408 926591 896751 867902 840394 814527 790122 766728 744056 722138 701270
56209 701270 681909 664470 649143 635919 624604 614622 605090 595482 586115 577680 570473 564422 559550
56196 559550 555888 553066 550582 548358 546540 544938 543290 541953 541572 542039 542527 542616 542666 542888 542929 542788 543400
56179 543400 545646 549191 552877 556023 558853 561829 565036 568272 571434 574717 578486 582984 588192 593983
$$ packed form
56267D04145O469O870P066P256P735Q700R942J0852J1041J0877J1102J2075J3714
56254E27844J5887J8356K0644K2521K4507K7262L0562L3570L5927L7946L9782
56243H34808M1197M2126M2644M2348M0650L7757L4471L0863K6075J9817J3045
56232A205801O714P10n327j1008j5731j9623k3159k6293k8699l0416l1630l2157
56220I89182l1774l0817k9840k8849k7508k5867k4405k3394k2672k1918k0868
56209G01270j9361j7439j5327j3224j1315r982r532r608r367q435p207o051m872
56196E59550l662k822k484k224j818j602j648j337l81M67M88Q9N0K22M1j41O12
56179E43400K246L545L686L146K830K976L207L236L162L283L769M498N208N791
$$ plain form
56165 593983 600261 606875 613653 620773 628802 638000 647844 657771 668100 679666 692680 706687 721678
56152 721678 738516 758090 780619 806018 834532 866889 904308 948448 1000898 1062538 1133608
56141 1133608 1214119 1303468 1399608 1499198 1598701 1694991 1785191 1867005 1939624 2003783 2060794
56130 2060794 2111965 2158690 2201854 2240590 2272320 2294525 2306170 2307496 2299417 2283547 2261868 2235459
56118 2235459 2203677 2164731 2116633 2057674 1987061 1905977 1817728 1726442 1635801 1548813 1467836
56107 1467836 1394275 1328786 1272039 1224678 1186333 1155498 1130748 1111371 1096544 1084929 1075683
56096 1075683 1069035 1065181 1063309 1062397 1062243 1063036 1064549 1066494 1069134 1072772 1077116 1081789 1086954 1092780 1098847
56081 1098847 1104801 1111122 1118523 1126988 1136015 1145455 1155486 1166172 1177555 1189738 1202420 1214920
$$ packed form
56165E93983O278O614O778P120Q029R198R844R927J0329J1566J3014J4007J4991
56152G21678J6838J9574K2529K5399K8514L2357L7419M4140N2450O1640P1070
56141A133608Q0511Q9349R6140R9590R9503R6290R0200Q1814P2619O4159N7011
56130B060794N1171M6725M3164L8736L1730K2205J1645J326q079j5870k1679k6409
56118B235459l1782l8946m8098n8959p0613q1084q8249r1286r0641q6988q0977
56107A467836p3561o5489n6747m7361l8345l0835k4750j9377j4827j1615r246
56096A075683o648l854j872r12j54P93J513J945K640L638M344M673N165N826O067
56081A098847N954O321P401Q465R027R440J0031J0686J1383J2183J2682J2500
$$ plain form
56069 1214920 1227232 1240410 1255286 1271410 1287877 1304577 1321912 1339924 1358503 1377854 1397996
56058 1397996 1418327 1438498 1459043 1480304 1501352 1521063 1539835 1559194 1579970 1601756 1623837
56047 1623837 1645798 1667471 1689229 1712141 1737067 1763746 1791325 1819475 1848378 1878132 1908855
56036 1908855 1940924 1974330 2008255 2042031 2076139 2111650 2149233 2189309 2232315 2277861 2324348
56025 2324348 2370566 2417181 2465714 2516686 2569847 2625558 2684583 2746877 2811762 2879052 2949011
56014 2949011 3021605 3096898 3175797 3259254 3346982 3438018 3532279 3630617 3733694 3841755 3955147
56003 3955147 4074199 4198961 4329850 4467900 4613632 4766418 4925945 5093421 5270367
55994 5270367 5457236 5654403 5863465 6086196 6323121 6574530 6842013 7127671 7432858
$$ packed form
56069A214920J2312J3178J4876J6124J6467J6700J7335J8012J8579J9351K0142
56058A397996K0331K0171K0545K1261K1048J9711J8772J9359K0776K1786K2081
56047A623837K1961K1673K1758K2912K4926K6679K7579K8150K8903K9754L0723
56036A908855L2069L3406L3925L3776L4108L5511L7583M0076M3006M5546M6487
56025B324348M6218M6615M8533N0972N3161N5711N9025O2294O4885O7290O9959
56014B949011P2594P5293P8899Q3457Q7728R1036R4261R8338J03077J08061J13392
56003C955147J19052J24762J30889J38050J45732J52786J59527J67476J76946
55994E270367J86869J97167K09062K22731K36925K51409K67483K85658L05187
$$ plain form
55985 7432858 7759119 8109263 8486084 8891263 9327068 9797755 10307605 10859282 11456190
55976 11456190 12104893 12813083 13587070 14433986 15364956 16393462 17532498 18796719 20206377
55967 20206377 21786706 23565926 25578200 27868333 30492032 33515918 37023918 41125292
55959 41125292 45957168 51687517 58526486 66738497 76642694 88601373 102996346 120185141
55951 120185141 140450458 163981018 190865524 220972847 253615549 287132812 318755289
55944 318755289 345025588 362672185 369523701 365057299 350410438 327926348 300455194
55937 300455194 270693022 240779417 212197544 185856536 162216455 141403354 123319790
55930 123319790 107743678 94395899 82979912 73211131 64837692 57644268 51445306
$$ packed form
55985G432858L26261L50144L76821M05179M35805M70687N09850N51677N96908
55976A1456190O48703P08190P73987Q46916R30970J028506J139036J264221J409658
55967B0206377J580329J779220K012274K290133K623699L023886L508000M101374
55959D1125292M831876N730349O838969Q212011R904197J1958679J4394973J7188795
55951A20185141K0265317K3530560K6884506L0107323L2642702L3517263L1622477
55944C18755289K6270299J7646597O851516m466402j4646861k2484090k7471154
55937C00455194k9762172k9913605k8581873k6341008k3640081k0813101j8083564
55930A23319790j5576112j3347779j1415987r768781q373439p193424o198962
$$ plain form
55923 51445306 46082274 41424951 37367398 33820010 30706467 27964579 25543516 23398645
55915 23398645 21490685 19787742 18263838 16895225 15660437 14542837 13529888 12609947
55907 12609947 11771730 11006049 10305541 9662992 9071782 8527319 8026132 7564069 7136867
55898 7136867 6741587 6375887 6036783 5721721 5429781 5160117 4910244 4677500 4460996
55889 4460996 4260348 4073646 3898618 3734755 3582259 3439803 3305387 3178653 3060211
55880 3060211 2949361 2844483 2745235 2652261 2564957 2481362 2400178 2321330 2244772 2170300 2098345
55869 2098345 2029574 1963936 1901233 1842123 1787184 1735572 1686048 1638742 1594338 1552033 1510070
55858 1510070 1467923 1426322 1385452 1344886 1305125 1267466 1232254 1198808 1167080 1137763 1110608
$$ packed form
55923E1445306n363032m657323m057553l547388l113543k741888k421063k144871
55915B3398645j907960j702943j523904j368613j234788j117600j012949r19941
55907A2609947q38217p65681p00508o42549n91210n44463n01187m62063m27202
55898G136867l95280l65700l39104l15062k91940k69664k49873k32744k16504
55889D460996k00648j86702j75028j63863j52496j42456j34416j26734j18442
55880C060211j10850j04878r9248r2974q7304q3595q1184p8848p6558p4472p1955
55869B098345o8771o5638o2703n9110n4939n1612m9524m7306m4404m2305m1963
55858A510070m2147m1601m0870m0566l9761l7659l5212l3446l1728k9317k7155
$$ plain form
55847 1110608 1084131 1057355 1030569 1004209 978219 952813 928653 905897 884010 862780 842678
55836 842678 824030 806644 790315 774979 760426 746589 733972 722967 712993 703164 693481 684326
55824 684326 675154 664923 653685 642513 631844 621057 609671 597814 585490 572588 559755 548096
55812 548096 537835 528292 519305 511516 505107 499447 494367 490642 488688 487744 486884 486073 485803 486376 487977
55797 487977 490742 494336 497963 501093 503688 505636 506692 507180 508020 509627 511224 511462 509277 504092 495828
55782 495828 484971 472295 458538 444813 433069 425224 421660 421264 423060 426971 432649 438286 441138
55769 441138 439069 431561 419746 405678 391173 377088 363737 351620 341261 332620 325349 319465
55757 319465 315133 311928 309086 306434 304344 302808 301285 299450 297287 294507 290749 286462 282715 279932
$$ packed form
55847A110608k6477k6776k6786k6360k5990k5406k4160k2756k1887k1230k0102
55836H42678j8648j7386j6329j5336j4553j3837j2617j1005r974r829r683r155
55824F84326r172j0231j1238j1172j0669j0787j1386j1857j2324j2902j2833j1659
55812E48096j0261r543q987p789o409n660n080l725j954r44q60q11k70N73J601
55797D87977K765L594L627L130K595J948J056M88Q40J607J597K38k185n185q264
55782D95828j0857j2676j3757j3725j1744p845l564l96J796L911N678N637K852
55769D41138k069p508j1815j4068j4505j4085j3351j2117j0359q641p271n884
55757C19465m332l205k842k652k090j536j523j835k163k780l758m287l747k783
$$ plain form
55743 279932 277572 275187 272981 271098 269101 266469 262949 258282 252343 245797 239886 235273 231641 228582
55729 228582 226095 223968 221547 218589 215657 213240 211058 208705 206431 204760 203691 202800 201903 201404 202098
55714 202098 204706 209204 214504 219105 222097 223290 222661 220405 217443 215025 213560 212326 210389 207348
55700 207348 203275 198687 194527 191364 188465 184480 179188 173742 169083 165052 161325 158209 155998 154358
55686 154358 152899 151718 150953 150491 150496 151486 153389 155265 156526 157722 159502 161468 162790 163448 164089 164963
55670 164963 165677 165790 165158 163910 162505 161530 161099 160690 159880 158889 158149 157760 157730 158281 159473 160855 161877
55653 161877 162387 162543 162595 162952 163984 165460 166666 167356 168119 169471 171074 172137 172066 170458 167087 162414
55637 162414 157585 153417 149691 145742 141330 136633 131944 127721 124449 122091 120149 118504 117539 117149 116490
$$ packed form
55743B79932k360k385k206j883j997k632l520m667n939o546n911m613l632l059
55729B28582k487k127k421k958k932k417k182k353k274j671j069q91q97m99O94
55714B02098K608M498N300M601K992J193o29k256k962k418j465j234j937l041
55700B07348m073m588m160l163k899l985n292n446m659m031l727l116k211j640
55686A54358j459j181p65m62NR90J903J876J261J196J780J966J322O58O41Q74
55670A64963P14J13o32j248j405r75m31m09q10r91p40l89l0N51J192J382J022
55653A61877N10J56N2L57J032J476J206O90P63J352J603J063p1j608l371m673
55637A62414m829m168l726l949m412m697m689m223l272k358j942j645r65l90o59
$$ plain form
55622 116490 115245 114344 114723 116027 117215 117807 117791 116933 115153 113137 111650 110451 108676 106118 103415 101138
55606 101138 99335 97791 96188 94230 92095 90466 89631 88976 87926 86902 86680 87246 88022 88806 89656 90229
55590 90229 90203 90103 90755 92072 93245 94056 95066 96552 98139 99591 101143 102956 104977 107529 111283 116430
55574 116430 122408 128548 134395 139376 142892 144934 146020 146350 145604 143735 141288 138631 135435 131317 126499
55559 126499 121460 116318 110986 105749 101241 97834 95231 92748 89978 87212 85087 83801 82863 81679
55545 81679 80148 78507 76978 75801 75250 75235 75237 75066 75343 76703 78801 80644 81692 82118 82254 82371 82782
55528 82782 83507 83973 83636 82757 82001 81486 80863 80083 79353 78513 77258 75879 74966 74473 73897 73279 73103 73175 72610
55509 72610 71168 69664 68782 68312 67873 67572 67546 67593 67606 67685 67522 66496 64777 63553 63634 64503 65190 65368 65067
$$ packed form
55622A16490j245r01L79J304J188N92j6q58j780k016j487j199j775k558k703k277
55606A01138j803j544j603j958k135j629q35o55j050j024k22N66P76P84Q50N73
55590I0229k6j00O52J317J173Q11J010J486J587J452J552J813K021K552L754N147
55574A16430N978O140N847M981L516K042J086L30p46j869k447k657l196m118m818
55559A26499n039n142n332n237m508l407k603k483k770k766k125j286r38j184
55545H1679j531j641j529j177n51j5Kj71K77J360K098J843J048M26J36J17M11
55528H2782P25M66l37q79p56n15o23p80p30q40j255j379r13m93n76o18j76P2n65
55509G2610j442j504q82m70m39l01k6M7J3P9j63j026j719j224Q1Q69O87J78l01
$$ plain form
55490 65067 64147 62768 61752 61693 62217 62771 63537 64707 65451 64756 63038 61846 61930 62511 62575 62037 61389 60936
55472 60936 60754 60921 61351 61755 61971 62131 62309 62298 62003 61773 62044 62699 63098 62820 62192 61912 62163 62390 62053
55453 62053 61372 61020 61175 61338 61120 60774 60782 61242 61895 62460 62698 62466 61980 61762 62035 62384 62290 61754 61128 60549
55433 60549 59893 59138 58427 57941 57989 59021 61089 63434 65008 65450 65221 64872 64628 64728 65612 67454 69722
55416 69722 71484 72142 71773 70904 70107 69737 69857 70290 70743 70931 70669 69929 68808 67483 66203 65192 64436
55399 64436 63656 62696 61841 61467 61430 61233 60818 60663 60892 60882 60238 59622 59992 61269 62495 63205 63855 64746 65289
55380 65289 64774 63381 61941 60979 60401 59975 59636 59309 58756 57753 56304 54700 53465 53157 54026 55753 57611
55363 57611 58914 59436 59477 59552 59816 59746 58657 56679 54965 54599 55407 56274 56572 56784 57612 58981 60244 60978
$$ packed form
55490F5067r20j379j016n9N24N54P66J170P44o95j718j192Q4N81O4n38o48m53
55472F0936j82J67M30M04K16J60J78j1k95k30K71O55L99k78o28k80K51K27l37
55453F2053o81l52J55J63k18l46QM60O53N65K38k32m86k18K73L49r4n36o26n79
55433F0549o56p55p11m86M8J032K068K345J574M42k29l49k44J00Q84J842K268
55416F9722J762O58l69q69p97l70J20M33M53J88k62p40j121j325j280j011p56
55399F4436p80r60q55l74l7j97m15j55K29j0o44o16L70J277J226P10O50Q91N43
55380F5289n15j393j440r62n78m26l39l27n53j003j449j604j235l08Q69J727J858
55363E7611J303N22M1P5K64p0j089j978j714l66Q08Q67K98K12Q28J369J263P34
$$ plain form
55345 60978 61157 60825 60140 59624 59799 60502 61019 61009 60877 61098 61631 62237 62918 63658 64047 63650 62604 61483 60704
55326 60704 60357 60472 61036 61796 62424 62839 63113 63165 62928 62751 63170 64237 65472 66517 67407 68074 68085 67195 65837
55307 65837 64762 64428 64914 66109 67591 68604 68681 68285 68389 69266 70035 69626 68011 66184 65068 64729 64697
55290 64697 64704 64869 65328 66047 66935 67850 68438 68314 67545 66631 65869 65070 64200 63855 64637 66261 67817 68801 69378
55271 69378 69662 69391 68436 67189 66199 65755 65972 66867 68126 69163 69651 69807 69933 69986 69819 69529 69324 69233 69232
55252 69232 69425 69800 70009 69690 68932 68164 67689 67558 67783 68314 68825 68849 68305 67699 67616 68018 68227 67664 66529
55233 66529 65575 65245 65264 65173 64930 64669 64153 63034 61672 61099 61889 63414 64510 64695 64462 64614 65532 66989
55215 66989 68415 69325 69633 69600 69548 69715 70224 70887 71101 70353 68920 67707 67292 67473 67888 68580 69647 70746
$$ packed form
55345F0978J79l32o85n16J75P03N17j0j32K21N33O06O81P40L89l97j046j121p79
55326F0704l47J15N64P60O28M15K74N2k37j77M19J067J235J045Q90O67J1q90j358
55307F5837j075l34M86J195J482J013P7l96J04Q77P69m09j615j827j116l39l2
55290F4697PJ65M59P19Q88R15N88j24p69r14p62p99q70l45P82J624J556R84N77
55271F9378K84k71r55j247r90m44K17Q95J259J037M88J56J26N3j67k90k05r1j
55252F9232J93L75K09l19p58p68m75j31K25N31N11K4n44o06q3M02K09n63j135
55233F6529r54l30J9r1k43k61n16j119j362n73P90J525J096J85k33J52R18J457
55215F6989J426R10L08l3n2J67N09O63K14p48j433j213m15J81M15O92J067J099
$$ plain form
55197 70746 71411 71624 71699 71723 71502 70924 70061 69046 68176 68046 69169 71359 73757 75454 75994 75357 73796 71774
55179 71774 69860 68562 68173 68623 69422 69942 69961 69823 69917 70168 70246 70101 70029 70271 70807 71523 72368 73407 74779
55160 74779 76552 78435 79781 80058 79279 77891 76356 74977 73904 73128 72560 72275 72475 73087 73665 73944 74180
55143 74180 74598 74806 74256 73137 72271 72157 72619 73368 74330 75287 75773 75652 75397 75439 75563 75310 74735 74304 74163
55124 74163 73971 73508 73044 72853 72641 71852 70526 69536 69773 71190 72831 73758 73799 73403 73025 72788 72637 72668 73231
55105 73231 74618 76553 78131 78566 78050 77560 77744 78303 78673 78865 79269 79879 80269 80255 80168 80366 80806 81136 81014
55086 81014 80320 79329 78651 78692 79078 78940 77827 76158 74663 73721 73355 73533 74167 74965 75567 75777 75557 74938
55068 74938 74171 73802 74266 75380 76489 77153 77490 77814 78194 78518 78755 78874 78675 78015 77229 76954 77395 78003
$$ packed form
55197G0746O65K13P5K4k21n78q63j015q70j30J123K190K398J697N40o37j561k022
55179G1774j914j298l89M50P99N20J9j38R4K51P8j45p2K42N36P16Q45J039J372
55160G4779J773J883J346K77p79j388j535j379j073p76n68k85K00O12N78K79K36
55143G4180M18K08n50j119q66j14M62P49R62R57M86j21k55M2J24k53n75m31j41
55124G4163j92m63m64j91k12p89j326r90K37J417J641R27M1l96l78k37j51L1N63
55105G3231J387J935J578M35n16m90J84N59L70J92M04O10L90j4q7J98M40L30j22
55086H1014o94r91o78M1L86j38j113j669j495r42l66J78O34P98O02K10k20o19
55068G4938p67l69M64J114J109O64L37L24L80L24K37J19j99o60p86k75M41O08
$$ plain form
55050 78003 78080 77547 76899 76553 76513 76615 76802 77114 77603 78280 79040 79636 79869 79767 79424 78793 77846 76875 76336 76398
55030 76398 76907 77751 78887 79992 80466 79964 78679 77035 75345 73882 72953 72738 73251 74478 76231 77850
55014 77850 78560 78281 77677 77203 76657 75886 75367 75567 76175 76565 76743 77220 78127 79068 79804 80635 82062 84320
54996 84320 87108 89483 90289 89191 87143 85457 84592 84270 84421 85231 86388 87116 87122 86867 86732 86596 86397 86449
54978 86449 86828 87081 86997 87134 88031 89284 90046 90207 90449 91188 92055 92543 92662 92749 93022 93538 94302 95084 95331
54959 95331 94706 93745 93555 94664 96388 97589 97796 97284 96320 94944 93491 92656 92714 93191 93658 94377 95604
54942 95604 96706 96689 95470 93943 92779 91819 90761 89799 89276 89164 89177 89074 88688 88001 87485 87998 90010 93095
54924 93095 96420 99518 102395 105184 108036 111192 114775 118526 122018 125101 127888 130306 131908 132298 131635
$$ packed form
55050G8003P7n33o48l46m0J02J87L12M89O77P60N96K33j02l43o31r47r71n39O2
55030G6398N09Q44J136J105M74n02j285j644j690j463r29k15N13J227J753J619
55014G7850P10k79o04m74n46p71n19K00O08L90J78M77R07R41P36Q31J427K258
54996H4320K788K375Q06j098k048j686q65l22J51Q10J157P28Ok55j35j36j99N2
54978H6449L79K53q4J37Q97J253P62J61K42P39Q67M88J19Q7K73N16P64P82K47
54959I5331o25r61j90J109J724J201K07n12r64j376j453q35N8M77M67P19J227
54942I5604J102j7j219j527j164r60j058r62n23j12J3j03l86o87n16N13K012L085
54924I3095L325L098K877K789K852L156L583L751L492L083K787K418J602L90o63
$$ plain form
54909 131635 130559 129593 128655 127285 125293 123051 121021 119172 117154 114963 113116 112041 111495 110799 109536
54894 109536 107897 106399 105463 105216 105529 106011 106020 104974 102992 101089 100387 100945 101711 101786 101508 102011 103969 107053
54876 107053 110458 113606 116401 119104 122011 125110 128152 131101 134167 137156 139179 139464 138220 136175
54862 136175 133542 130068 125982 122101 118848 115836 112688 109702 107399 105797 104463 102960 101014 98579
54848 98579 95993 93848 92469 91714 91389 91555 92247 93192 93974 94285 93896 92708 91064 89721 89269 89657 90381
54831 90381 90946 91072 90766 90329 90073 89964 89754 89479 89446 89675 89814 89724 89718 90030 90482 90958 91749 93096 94723 96165
54811 96165 97279 98158 98831 99381 100003 100619 100744 100069 98953 98001 97473 97402 97863 98634 98979 98425 97576 97484 98285
54792 98285 99081 99177 98813 98513 98331 98056 97738 97601 97681 97893 98348 99295 100751 102381 103802 104896 105818 106807
$$ packed form
54909A31635j076r66r38j370j992k242k030j849k018k191j847j075n46o96j263
54894A09536j639j498r36k47L13M82Rj046j982j903p02N58P66P5k78N03J958L084
54876A07053L405L148K795K703K907L099L042K949L066K989K023K85j244k045
54862A36175k633l474m086l881l253l012l148k986k303j602j334j503j946k435
54848I8579k586k145j379p55l25J66O92R45P82L11l89j188j644j343m52L88P24
54831I0381N65J26l06m37k56j09k10k75l3K29J39r0oL12M52M76P91J347J627J442
54811I6165J114Q79O73N50O22O16J25o75j116r52n28p1M61P71L45n54q49r2Q01
54792I8285P96R6l64l00j82k75l18j37Q0K12M55R47J456J630J421J094R22R89
$$ plain form
54774 106807 108066 109754 111898 114231 116244 117577 118383 119239 120758 123329 126955 131102 134888 137822 140279
54759 140279 142857 145377 147064 147617 147395 146393 143871 139464 134079 129084 125040 121778 119248 117515 116216
54744 116216 114809 113344 112315 111751 111140 110344 109876 110024 110279 110024 109342 108707 108220 107661 107165 107303 108318
54727 108318 109682 110688 111327 112259 113955 116206 118641 121355 124677 128470 132115 135147 137457 138880 139143
54712 139143 138357 137013 135213 132402 128304 123679 119699 116889 115099 114118 113729 113425 112689 111513 110173
54697 110173 108703 107057 105575 104625 103958 103094 102273 102225 102961 103580 103509 103164 103028 102831 102195 101526 101548 102267 103019
54678 103019 103351 103264 102725 101606 100194 99205 99004 99168 99080 98740 98705 99289 100131 100552 100241 99499 98881 98614 98348
54659 98348 97525 96063 94682 94381 95511 97491 99513 101290 102923 104264 104895 104738 104224 103680 102976 102075
$$ packed form
54774A06807J259J688K144K333K013J333Q06Q56J519K571L626M147L786K934K457
54759A40279K578K520J687N53k22j002k522m407n385m995m044l262k530j733j299
54744A16216j407j465j029n64o11p96m68J48K55k55o82o35m87n59m96J38J015
54727A08318J364J006O39R32J696K251K435K714L322L793L645L032K310J423K63
54712A39143p86j344j800k811m098m625l980k810j790r81l89l04p36j176j340
54697A10173j470j646j482r50o67q64q21m8P36O19p1l45j36j97o36o69K2P19P52
54678A03019L32q7n39j119j412r89k01J64q8l40l5N84Q42M21l11p42o18k67k66
54659I8348q23j462j381l01J130J980K022J777J633J341O31j57n14n44p04r01
$$ plain form
54643 102075 101519 101955 103306 104755 105470 105147 104071 103019 102892 103979 105568 106635 106858 106649 106269 105504
54627 105504 104334 103389 103362 104132 104778 104470 103199 101702 100759 100549 100624 100524 100254 100139 100364 100880 101615 102453
54609 102453 103047 103062 102715 102769 103732 105241 106461 106964 106985 106859 106552 105933 105315 105323 106114 107044 107355 107048 106734 106734
54589 106734 106770 106569 106309 106256 106367 106516 106770 107136 107338 107162 106810 106601 106631 106957 107767 108965 109949 110293 110335 110559
54569 110559 110681 110099 109047 108527 108978 109728 109938 109513 108850 108276 108051 108444 109441 110670 111880 113195 114675
54552 114675 115972 116688 116852 116801 116801 116956 117260 117568 117725 117918 118573 119725 120814 121468 122171 123672 125825 127585
54534 127585 128296 128569 129510 131323 133076 133895 133906 133700 133207 131767 129277 126633 124698 123334 121903 120322
54518 120322 119097 118565 118654 119217 119975 120271 119562 118224 117267 117137 117350 117416 117472 117769 118138 118372 118706 119388 120115
$$ packed form
54643A02075n56M36J351J449P15l23j076j052j27J087J589J067K23k09l80p65
54627A05504j170r45k7P70O46l08j271j497r43k10P5j00k70j15K25N16P35Q38
54609A02453N94J5l47N4R63J509J220N03K1j26l07o19o18QP91R30L11l07l14%
54589A06734L6k01k60n3J11J49K54L66K02j76l52k09L0L26Q10J198R84L44M2K24
54569A10559J22n82j052n20M51P50K10m25o63n74k25L93R97J229J210J315J480
54552A14675J297P16J64n1%J55L04L08J57J93O55J152J089O54P03J501K153J760
54534A27585P11K73R41J813J753Q19J1k06m93j440k490k644j935j364j431j581
54518A20322j225n32Q9N63P58K96p09j338r57j30K13O6N6K97L69K34L34O82P27
$$ plain form
54499 120115 120350 120073 119833 120090 120778 121487 121908 122039 122014 121785 121191 120482 120493 121860 124185 126422 128066 129411
54481 129411 130647 131416 131563 131687 132478 133892 135413 136827 138207 139421 140129 140227 139970 139690 139667 140161 141257
54464 141257 142660 143859 144509 144559 144123 143411 142747 142487 142841 143728 144748 145409 145549 145458 145369 144926 143530 141222
54446 141222 138875 137377 136925 137132 137488 137607 137387 137092 137064 137264 137364 137247 137063 136855 136637 136801 137789 139197
54428 139197 139915 139464 138571 137985 137382 136047 134149 132648 132162 132552 133474 134725 136050 137100 137670 137800 137685
54411 137685 137622 137868 138338 138666 138706 138681 138704 138578 138350 138610 139793 141509 142994 143925 144413 144500 144157 143563 142919
54392 142919 142196 141419 140914 140858 140861 140470 139822 139316 138977 138644 138477 138709 139170 139656 140457 141777 142918 142948 142083
54373 142083 141527 141831 142302 142167 141538 140931 140570 140598 141368 143004 145047 146822 147924 148180 147594 146564 145728
$$ packed form
54499A20115K35k77k40K57O88P09M21J31k5k29n94p09J1J367K325K237J644J345
54481A29411J236P69J47J24P91J414J521J414J380J214P08R8k57k80k3M94J096
54464A41257J403J199O50N0m36p12o64k60L54Q87J020O61J40r1q9m43j396k308
54446A41222k347j498m52K07L56J19k20k95k8K00J00j17j84k08k18J64R88J408
54428A39197P18m51q93n86o03j335j898j501m86L90R22J251J325J050N70J30j15
54411A37685o3K46M70L28M0k5K3j26k28K60J183J716J485R31M88Q7l43n94o44
54392A42919p23p77n05n6Ll91o48n06l39l33j67K32M61M86Q01J320J141L0q65
54373A42083n56L04M71j35o29o07l61K8P70J636K043J775J102K56n86j030q36
$$ plain form
54356 145728 145321 144990 144430 143825 143438 143184 142820 142228 141308 140040 138858 138490 139024 139610 139506 139094 139305 140336
54338 140336 141517 142353 143038 143857 144561 144647 143980 142913 141934 141323 141087 141039 140898 140396 139339 137692 135697 133892
54320 133892 132872 132875 133541 134200 134520 134732 135102 135341 134926 134017 133559 134232 135680 137079 138108 138923 139501 139589
54302 139589 139253 138927 138909 139171 139560 139792 139361 138057 136533 135777 135938 136224 136065 135652 135189 134348 132952 131600
54284 131600 130991 130998 130930 130453 129740 128969 128228 127750 127745 128023 128222 128390 128910 129856 130844 131578 132176 132861 133622 134308
54264 134308 134792 134931 134595 133895 133202 132817 132759 132944 133421 134268 135378 136490 137350 137750 137528 136749 135858 135420
54246 135420 135605 136006 136008 135267 133821 131967 130234 129316 129677 131085 132736 133938 134599 134986 135227 135165 134583 133427
54228 133427 131930 130600 129875 129600 129033 127662 125887 124586 124074 123835 123309 122586 122118 122032 122050 122061 122469 123758
$$ packed form
54356A45728m07l31n60o05l87k54l64n92r20j268j182l68N34N86j04m12K11J031
54338A40336J181Q36O85Q19P04Q6o67j067r79o11k36m8j41n02j057j647j995j805
54320A33892j020LO66O59L20K12L70K39m15r09m58O73J448J399J029Q15N78Q8
54302A39589l36l26j8K62L89K32m31j304j524p56J61K86j59m13m63q41j396j352
54284A31600o09Po8m77p13p71p41m78nK78J99J68N20R46R88P34N98O85P61O86
54264A34308M84J39l36p00o93l85n8J85M77Q47J110J112Q60M00k22p79q91m38
54246A35420J85M01Kp41j446j854j733r18L61J408J651J202O61L87K41o2n82j156
54228A33427j497j330p25k75n67j371j775j301n12k39n26p23m68q6J8J1M08J289
$$ plain form
54210 123758 125833 128024 129814 131271 132538 133266 133062 132354 132092 132422 132394 131340 129867 128960 128670 128476 128379
54193 128379 128653 128779 127766 125670 123789 123018 122861 122469 121841 121448 121279 120971 120540 120407 120823 121645 122448 122642
54175 122642 121848 120549 119991 120931 122694 123929 124084 123702 123441 123398 123330 123007 122229 120934 119496 118664 118975 120272
54157 120272 121828 122869 123026 122472 121733 121278 121275 121653 122245 122822 123179 123312 123422 123683 124181 125077 126537 128346
54139 128346 129872 130691 131021 131302 131564 131562 131329 131168 131109 130765 129864 128686 127835 127705 128227 128994 129545 129580 129017
54120 129017 127946 126676 125776 125821 126890 128421 129722 130546 131077 131469 131626 131434 131020 130715 130786 131225 131783 132246
54102 132246 132602 132869 132855 132336 131477 130852 130915 131602 132450 133010 133132 133114 133546 134710 136084 136746 136363 135545 135134
54083 135134 135464 136333 137242 137574 137023 136063 135543 135579 135383 134519 133686 133731 134418 134883 134927 135046 135433 135803 136152 136883
$$ packed form
54210A23758K075K191J790J457J267P28k04p08k62L30k8j054j473r07k90j94r7
54193A28379K74J26j013k096j881p71j57l92o28l93j69l08m31j33M16Q22Q03J94
54175A22642p94j299n58R40J763J235J55l82k61m3o8l23p78j295j438q32L11J297
54157A20272J556J041J57n54p39m55lL78N92N77L57J33J10K61M98Q96J460J809
54139A28346J526Q19L30K81K62kk33j61n9l44r01j178q51j30N22P67N51L5n63
54120A29017j071j270r00M5J069J531J301Q24N31L92J57j92m14l05P1M39N58M63
54102A32246L56K67j4n19q59o25O3O87Q48N60J22j8M32J164J374O62l83q18m11
54083A35134L30Q69R09L32n51r60n20L6j96q64q33M5O87M65M4J19L87L70L49P31
$$ plain form
54063 136883 138053 139169 139877 140301 140584 140714 140923 141668 142978 144417 145899 147944 150764 153736 156289 158885
54047 158885 162548 167751 174291 181962 190669 199890 208594 215817 221050 224069 224805 223497 220668 216835
54033 216835 212380 207727 203315 199276 195335 191194 186908 182797 179131 175999 173349 170975 168573 166027
54019 166027 163649 161986 161277 161112 160734 159629 157805 155589 153303 151239 149764 149191 149390 149622 148961 147069
54003 147069 144563 142584 141891 142327 143129 143665 143844 143941 144169 144458 144596 144536 144544 144951 145684 146165 145891 145021 144121
53984 144121 143386 142473 141187 139971 139433 139703 140542 141826 143464 144985 145748 145720 145615 146025 146621 146549 145514
53967 145514 144221 143700 144313 145499 146405 146678 146668 146974 147961 149576 151461 153140 154299 154981 155411 155628 155436
53950 155436 154820 154111 153631 153422 153593 154604 156756 159517 161899 163593 165317 167902 171394 175341 179593
$$ packed form
54063A36883J170J116P08M24K83J30K09P45J310J439J482K045K820K972K553K596
54047A58885L663N203O540P671Q707R221Q704P223N233L019P36j308k829l833
54033B16835m455m653m412m039l941m141m286m111l666l132k650k374k402k546
54019A66027k378j663p09j65l78j105j824k216k286k064j475n73J99K32o61j892
54003A47069k506j979o93M36Q02N36J79R7K28K89J38o0QM07P33M81k74q70r00
53984A44121p35r13j286j216n38K70Q39J284J638J521P63k8j05M10N96p2j035
53967A45514j293n21O13J186R06K73j0L06R87J615J885J679J159O82M30K17j92
53950A55436o16p09m80k09J71J011K152K761K382J694J724K585L492L947M252
$$ plain form
53935 179593 184421 189933 195792 201577 207138 212426 217252 221459 225304 229316 233617 237590 240463 242116
53921 242116 242995 243265 242421 239928 235987 231444 227069 223099 219385 215773 212388 209572 207450 205594 203425
53906 203425 200973 198855 197378 196151 194918 194226 194772 196526 199154 202889 208085 214126 219837 225090 230969
53891 230969 237862 244186 247604 247010 242883 236381 228729 221050 213892 206958 199818 192774 186569 181470
53877 181470 177111 173107 169306 165589 162017 159132 157543 157136 157189 157207 157178 156990 156265 154935 153403 151958
53861 151958 150592 149642 149903 151612 153814 155323 155928 156128 156051 155400 154318 153573 153723 154615 155785 156892 157688
53844 157688 158050 158202 158487 158743 158350 157110 155679 154851 154815 155346 156248 157207 157617 157185 156498 156435 157117 157929 158509
53825 158509 159121 159946 160640 160868 160809 160738 160397 159240 157302 155509 155043 156388 158976 161712 163893 165617 167264
$$ packed form
53935A79593M828N512N859N785N561N288M826M207L845M012M301L973K873J653
53921B42116Q79K70q44k493l941m543m375l970l714l612l385k816k122j856k169
53906B03425k452k118j477j227j233o92N46J754K628L735N196O041N711N253N879
53891B30969O893O324L418n94m127o502p652p679p158o934p140p044o205n099
53877A81470m359m004l801l717l572k885j589m07N3J8k9j88p25j330j532j445
53861A51958j366r50K61J709K202J509O05K00p7o51j082p45J50Q92J170J107P96
53844A57688L62J52K85K56l93j240j431q28l6N31R02R59M10m32o87o3O82Q12N80
53825A58509O12Q25O94K28n9p1l41j157j938j793m66J345K588K736K181J724J647
$$ plain form
53808 167264 168818 169971 170740 171508 172396 173058 173292 173480 174083 174993 175722 176091 176414 177078 178230 179837 181808
53791 181808 183966 186057 187819 189075 189819 190234 190485 190504 190161 189592 189106 188688 187952 186720 185311 184085 183059
53774 183059 182163 181508 181105 180676 180095 179650 179459 179016 177873 176464 175583 175215 174583 173378 172219 171778 172014
53757 172014 172506 173000 173343 173285 172676 171606 170219 168673 167359 166713 166642 166575 166325 166470 167522 169176 170822
53740 170822 172414 174221 175929 176755 176580 176423 177404 179553 181934 183797 185212 186592 187927 188853 189358 190083
53724 190083 191708 194200 196863 199006 200355 200993 201312 202052 203938 206945 210093 212263 213225 213749 214765
53709 214765 216542 218655 220614 222376 224208 226180 228040 229698 231596 234297 237845 241777 245655 249266
53695 249266 252392 254808 256590 258135 259766 261547 263442 265353 266995 268129 268929 269648 269900 268879 266507
$$ packed form
53808A67264J554J153P69P68Q88O62K34J88O03R10P29L69L23O64J152J607J971
53791A81808K158K091J762J256P44M15K51J9l43n69m86m18p36j232j409j226j026
53774A83059q96o55m03m29n81m45j91m43j143j409q81l68o32j205j159m41K36
53757A72014M92M94L43n8o09j070j387j546j314o46p1o7k50J45J052J654J646
53740A70822J592J807J708Q26j75j57R81K149K381J863J415J380J335R26N05P25
53724A90083J625K492K663K143J349O38L19P40J886L007L148K170R62N24J016
53709B14765J777K113J959J762J832J972J860J658J898K701L548L932L878L611
53695B49266L126K416J782J545J631J781J895J911J642J134Q00P19K52j021k372
$$ plain form
53680 266507 263784 261642 259982 258332 256924 256407 256758 257253 257429 257456 257521 257450 257123 256727 256362 255777 254752 253423
53662 253423 252029 250655 249448 248751 248705 248890 248716 248030 247110 246176 245244 244405 243891 243766 243861 244121 244730 245737
53644 245737 246749 247295 247332 247166 247003 246932 247270 248465 250545 252971 255198 257102 258777 260312 261999 264264
53628 264264 266975 269198 270237 270692 271904 274440 277753 281222 284755 288261 291351 293960 296675 299977
53614 299977 303635 307243 310914 314930 319094 323022 326876 331196 336079 340957 345129 348171 349977 350892
53600 350892 351795 353561 356219 358881 360525 360832 360399 360385 361772 364569 367785 370429 372484 374675 377426
53585 377426 380358 382696 383760 383147 380874 377360 372984 367715 361561 355227 349792 345645 342244 338989
53571 338989 335879 333172 330884 328913 327251 325868 324692 323888 323806 324446 325413 326584 328301 330493 332136
$$ packed form
53680B66507k723k142j660j650j408n17L51M95J76K7O5p1l27l96l65n85j025j329
53662B53423j394j374j207o97m6J85j74o86r20r34r32q39n14j25R5K60O09J007
53644B45737J012N46L7j66j63p1L38J195K080K426K227J904J675J535J687K265
53628B64264K711K223J039M55J212K536L313L469L533L506L090K609K715L302
53614B99977L658L608L671M016M164L928L854M320M883M878M172L042J806R15
53600C50892R03J766K658K662J644L07m33j4J387K797L216K644K055K191K751
53585C77426K932K338J064o13k273l514m376n269o154o334n435m147l401l255
53571C38989l110k707k288j971j662j383j176q04q2O40R67J171J717K192J643
$$ plain form
53556 332136 332270 331298 330630 331093 332312 333640 334995 336565 338241 339838 341578 343950 347169 351068 355474
53541 355474 360396 365845 371693 377813 384189 390837 397767 405119 413202 422162 431679 441241 450814 460960
53527 460960 472092 483907 495904 508306 521975 537231 553228 568806 583745 598895 615271
53516 615271 633385 653342 675086 698354 722697 747740 773316 799200 824925 850057 874615
53505 874615 898997 923482 947937 972034 995579 1018556 1041001 1062991 1084656 1105966 1126556
53494 1126556 1146046 1164692 1183423 1202954 1222946 1242364 1260570 1277717 1294120 1309821 1325046
53483 1325046 1340574 1357073 1374163 1390613 1405467 1418665 1430567 1441269 1450476 1457674 1462272 1463835
53471 1463835 1462396 1458369 1452067 1443482 1432614 1419741 1405255 1389550 1373238 1357128 1341601 1326145
$$ packed form
53556C32136J34r72o68M63J219J328J355J570J676J597J740K372L219L899M406
53541C55474M922N449N848O120O376O648O930P352Q083Q960R517R562R573J0146
53527D60960J1132J1815J1997J2402J3669J5256J5997J5578J4939J5150J6376
53516F15271J8114J9957K1744K3268K4343K5043K5576K5884K5725K5132K4558
53505H74615K4382K4485K4455K4097K3545K2977K2445K1990K1665K1310K0590
53494A126556J9490J8646J8731J9531J9992J9418J8206J7147J6403J5701J5225
53483A325046J5528J6499J7090J6450J4854J3198J1902J0702R207P198M598J563
53471A463835j439m027o302q585j0868j2873j4486j5705j6312j6110j5527j5456
$$ plain form
53459 1326145 1309788 1291854 1272125 1250678 1228019 1205104 1182621 1160269 1137266 1113623 1090378
53448 1090378 1068452 1047839 1028132 1009352 991902 976086 962092 950158 940357 932339 925590 919870
53436 919870 915226 911795 909771 909301 910146 911767 914060 917697 923376 930966 939875 949984 961683 975111
53422 975111 989998 1006238 1024005 1043210 1063423 1084560 1107121 1131511 1157551 1184949 1213838
53411 1213838 1244441 1276491 1309427 1343049 1377691 1413924 1452358 1493583 1537921 1585144 1634691
53400 1634691 1686182 1739522 1794479 1850407 1906607 1962901 2019663 2077180 2135122 2192776 2249743
53389 2249743 2306037 2361384 2414752 2465001 2511939 2556426 2599415 2641030 2680439 2716345 2747764
53378 2747764 2774716 2798176 2818985 2836809 2850440 2858992 2862261 2859918 2850976 2834374 2809678 2777007
$$ packed form
53459A326145j6357j7934j9729k1447k2659k2915k2483k2352k3003k3643k3245
53448A090378k1926k0613j9707j8780j7450j5816j3994j1934r801q018o749n720
53436I19870m644l431k024m70Q45J621K293L637N679P590Q909J0109J1699J3428
53422I75111J4887J6240J7767J9205K0213K1137K2561K4390K6040K7398K8889
53411A213838L0603L2050L2936L3622L4642L6233L8434M1225M4338M7223M9547
53400A634691N1491N3340N4957N5928N6200N6294N6762N7517N7942N7654N6967
53389B249743N6294N5347N3368N0249M6938M4487M2989M1615L9409L5906L1419
53378B747764K6952K3460K0809J7824J3631Q552L269k343q942j6602k4696l2671
$$ plain form
53366 2777007 2736783 2689986 2638315 2583610 2527073 2469201 2410248 2350586 2290811 2231692 2173872
53355 2173872 2117533 2062539 2008886 1956657 1905551 1854992 1804853 1755504 1707024 1659052 1611766
53344 1611766 1566218 1523056 1481611 1441101 1402254 1366683 1334822 1305572 1278054 1252771 1230673
53333 1230673 1211850 1195585 1181070 1167567 1154296 1140769 1127200 1114205 1102161 1090992 1080455
53322 1080455 1070450 1061126 1052806 1045751 1039893 1034888 1030467 1026756 1024283 1023708 1025386 1029022 1033804 1039039
53308 1039039 1044646 1051044 1058786 1068451 1080493 1094807 1110619 1127215 1144671 1163540 1184006 1205863
53296 1205863 1229195 1254467 1281839 1310828 1340691 1370629 1399563 1426442 1451178 1474816 1498299
53285 1498299 1521385 1543138 1563085 1581304 1597577 1611131 1621326 1628093 1631552 1631594 1628213 1621924 1613439
$$ packed form
53366B777007m0224m6797n1671n4705n6537n7872n8953n9662n9775n9119n7820
53355B173872n6339n4994n3653n2229n1106n0559n0139m9349m8480m7972m7286
53344A611766m5548m3162m1445m0510l8847l5571l1861k9250k7518k5283k2098
53333A230673j8823j6265j4515j3503j3271j3527j3569j2995j2044j1169j0537
53322A080455j0005r324q320p055n858n005m421l711k473n75J678L636M782N235
53308A039039N607O398P742R665J2042J4314J5812J6596J7456J8869K0466K1857
53296A205863K3332K5272K7372K8989K9863K9938K8934K6879K4736K3638K3483
53285A498299K3086K1753J9947J8219J6273J3554J0195O767L459M2l381o289q485
$$ plain form
53272 1613439 1602961 1590086 1574450 1556139 1535423 1512443 1487398 1460767 1432966 1403938 1373511
53261 1373511 1342110 1310579 1279250 1247665 1215428 1182913 1150851 1119677 1089599 1060886 1033626
53250 1033626 1007421 981694 956058 930089 903187 875225 847098 820068 794760 771202 749473
53239 749473 729559 710815 692452 674630 658302 643920 630941 618757 607366 596924 587364 578752
53227 578752 571329 564709 557621 548999 538954 528257 517250 505776 493858 481856 470044 458481
53215 458481 447291 436718 426852 417536 408568 399918 391782 384446 377976 372023 366045 359702 352881 345522
53201 345522 337799 330403 324155 319203 314987 311019 307211 303383 299149 294581 290412 287141 284375 281510
53187 281510 278650 276300 274484 272707 270634 268337 265963 263629 261596 260156 259308 258766 258201 257310 255854
$$ packed form
53272A613439j0478j2875j5636j8311k0716k2980k5045k6631k7801k9028l0427
53261A373511l1401l1531l1329l1585l2237l2515l2062l1174l0078k8713k7260
53250A033626k6205k5727k5636k5969k6902k7962k8127k7030k5308k3558k1729
53239G49473j9914j8744j8363j7822j6328j4382j2979j2184j1391j0442r560q612
53227E78752p423o620p088q622j0045j0697j1007j1474j1918j2002j1812j1563
53215D58481j1190j0573r866r316q968q650q136p336o470n953n978o343o821p359
53201C45522p723p396o248m952m216l968l808l828m234m568m169l271k766k865
53187B81510k860k350j816j777k073k297k374k334k033j440q48n42n65q91j456
$$ plain form
53172 255854 253927 252025 250573 249486 248442 247380 246390 245274 243617 241343 238887 236805 235368 234537 234114
53157 234114 233853 233495 232743 231350 229430 227626 226566 226047 225161 223390 221275 219722 219010 218722 218373 217797
53141 217797 217197 217113 218076 219962 221939 223293 223996 224216 223798 222728 221685 221422 221786 222002 221816 221756 222300 223343
53123 223343 224538 225694 226815 228153 230100 232548 234435 234582 233054 231145 229903 229194 228415 227509 226811
53108 226811 226268 225296 223400 220738 218120 216457 216042 216305 216408 216080 215654 215408 215234 215035 215032 215485 216310 217161
53090 217161 217701 217713 217055 215713 213925 212240 211384 211763 212988 214160 214898 215767 217332 219125 220130 220080 219589
53073 219589 219089 218408 217543 217010 217069 217175 216673 215578 214310 213076 211946 211157 210887 210980 211266 211837 212585 212872
53055 212872 212245 211305 211150 211955 212658 212199 210647 208953 207969 207855 208113 207949 206845 205033 203349 202486 202434
$$ packed form
53172B55854j927j902j452j087j044j062r90j116j657k274k456k082j437q31m23
53157B34114k61l58p52j393j920j804j060n19q86j771k115j553p12k88l49n76
53141B17797o00q4R63J886J977J354P03K20m18j070j043k63L64K16j86o0N44J043
53123B23343J195J156J121J338J947K448J887J47j528j909j242p09p79r06o98
53108B26811n43r72j896k662k618j663m15K63J03l28m26k46j74j99lM53Q25Q51
53090B17161N40J2o58j342j788j685q56L79J225J172P38Q69J565J793J005n0m91
53073B19589n00o81q65n33N9J06n02j095j268j234j130p89k70R3K86N71P48K87
53055B12872o27r40j55Q05P03m59j552j694r84j14K58j64j104j812j684q63n2
$$ plain form
53038 202434 202688 202763 202464 201844 201105 200511 200176 199969 199691 199343 199163 199385 199991 200707 201194 201342 201374 201626 202128
53019 202128 202491 202329 201793 201521 201982 202953 203749 203865 203259 202134 200733 199399 198588 198574 199156 199811 200139 200120
53001 200120 200035 200174 200561 200887 200779 200217 199609 199464 200028 201283 203001 204678 205677 205788 205572 205793 206516 207117
52983 207117 207251 207440 208424 210186 211934 212977 213295 213299 213372 213847 215096 217259 219886 222203 223878 225331 227133
52966 227133 229259 231199 232624 233566 233959 233421 231754 229447 227411 226183 225419 224171 221684 218171 214784
52951 214784 212689 212094 212337 212807 213382 213950 214066 213426 212349 211363 210566 209697 208658 207570 206498 205508 204850
52934 204850 204660 204603 204203 203452 202718 202169 201753 201665 202205 203065 203373 202754 201894 201683 202114 202419 202087 201344 200706
52915 200706 200417 200396 200422 200317 200047 199781 199815 200341 201234 202094 202552 202588 202470 202351 202023 201159 199733 198104 196754
$$ packed form
53038B02434K54P5k99o20p39n94l35k07k78l48j80K22O06P16M87J48L2K52N02
53019B02128L63j62n36k72M61R71P96J16o06j125j401j334q11j4N82O55L28j9
53001B00120q5J39L87L26j08n62o08j45N64J255J718J677R99J11k16K21P23O01
52983B07117J34J89R84J762J748J043L18MP3M75J249K163K627K317J675J453J802
52966B27133K126J940J425R42L93n38j667k307k036j228p64j248k487l513l387
52951B14784k095n95K43M70N75N68J16o40j077r86p97q69j039j088j072r90o58
52934B04850j90n7m00p51p34n49m16q8N40Q60L08o19q60k11M31L05l32p43o38
52915B00706k89k1K6j05k70k66L4N26Q93Q60M58L6j18j19l28q64j426j629j350
$$ plain form
52896 196754 196018 195947 196334 196980 197963 199405 200839 201225 200024 198089 196973 197397 198796 200374 202007 203886
52880 203886 205749 206957 207218 206903 206674 206943 207662 208439 208796 208476 207652 206912 206905 207781 208965 209732 210128 211011
52862 211011 212916 215122 216268 215760 214236 212666 211387 210112 208493 206522 204560 203073 202212 201638 200890
52847 200890 199890 198888 197976 196925 195471 193523 191132 188547 186292 184862 184239 183930 183494 182854 182137 181539
52831 181539 181353 181800 182740 183766 184577 185074 185087 184446 183361 182516 182615 183916 186135 188551 190383 191384 192108
52814 192108 193255 194814 196187 197153 198276 200212 202921 205631 207376 207536 206166 203902 201402 198911 196444
52799 196444 194113 191966 189846 187844 186557 186370 186735 186839 186734 187005 187531 187513 186690 185555 184321 182689
52783 182689 180897 179918 180226 181263 182451 183759 184867 184964 184090 183583 184296 185306 185358 184677 184241 184045 183455
$$ packed form
52896A96754p36p1L87O46R83J442J434L86j201j935j116M24J399J578J633J879
52880B03886J863J208K61l15k29K69P19P77L57l20q24p40pQ76J184P67L96Q83
52862B11011J905K206J146n08j524j570j279j275j619j971j962j487q61n74p48
52847B00890j000j002r12j051j454j948k391k585k255j430o23l09m36o40p17n98
52831A81539j86M47R40J026Q11M97J3o41j085q45R9J301K219K416J832J001P24
52814A92108J147J559J373R66J123J936K709K710J745J60j370k264k500k491k467
52799A96444k331k147k120k002j287j87L65J04j05K71N26j8q23j135j234j632
52783A82689j792r79L08J037J188J308J108R7q74n07P13J010N2o81m36j96n90
$$ plain form
52766 183455 182697 182564 182901 182815 182284 182163 182493 182188 180855 179695 180008 181648 183558 185125 186375 187366 188047
52749 188047 188488 188824 189116 189474 190098 191071 192316 193796 195444 196974 198218 199584 201612 203978 205568 205845
52733 205845 205588 205935 207111 208458 209379 209794 209879 209756 209417 208775 207791 206591 205336 204025 202622 201341 200476
52716 200476 199968 199461 198837 198308 197893 197225 196049 194601 193261 192186 191440 191192 191503 192098 192595 192824 192810 192697
52698 192697 192831 193617 195025 196393 196957 196541 195666 195130 195563 197066 199061 200654 201379 201508 201525 201488 201151 200508
52680 200508 199857 199301 198519 197243 195841 195178 195792 197352 199037 200401 201655 203144 204837 206423 207615
52665 207615 208148 207788 206725 205788 205879 207189 209176 211197 212812 213705 213785 213407 213080 212865 212442 211784 211350 211497
52647 211497 212038 212539 212802 212882 212895 212918 212931 212823 212636 212720 213352 214332 215299 216310 217578 218696 218830 217895 216915
$$ packed form
52766A83455p58j33L37q6n31j21L30l05j333j160L13J640J910J567J250R91O81
52749A88047M41L36K92L58O24R73J245J480J648J530J244J366K028K366J590K77
52733B05845k57L47J176J347R21M15Q5j23l39o42r84j200j255j311j403j281q65
52716B00476n08n07o24n29m15o68j176j448j340j075p46k48L11N95M97K29j4j13
52698A92697J34P86J408J368N64m16q75n36M33J503J995J593P25J29J7l7l37o43
52680B00508o51n56p82j276j402o63O14J560J685J364J254J489J693J586J192
52665B07615N33l60j063r37R1J310J987K021J615Q93Q0l78l27k15m23o58m34J47
52647B11497N41N01K63Q0J3K3J3j08j87Q4O32R80R67J011J268J118J34r35r80
$$ plain form
52628 216915 216858 217626 218489 219062 219416 219649 219858 220250 220817 221127 220824 220081 219173 217952 216293 214840 214605 215760
52610 215760 217351 218327 218480 218267 218162 218388 218974 219758 220425 220707 220501 219846 218911 218049 217631 217686 217873 217901 217885
52591 217885 218148 218813 219736 220814 222164 223837 225497 226541 226602 225830 224667 223495 222616 222363 222884 223835 224556
52574 224556 224686 224501 224552 225133 226102 227091 227749 227867 227384 226352 224954 223604 222773 222524 222370 221857 221180 220877
52556 220877 221044 221278 221376 221502 221534 220912 219577 218573 219070 220948 222885 223784 223655 223073 222318 221323 220160 219209
52538 219209 218839 219091 219713 220448 221190 221844 222137 221800 220968 220235 220040 220102 219692 218549 217306 216813 217079 217181
52520 217181 216403 215231 214836 215616 216712 217196 217257 217837 219456 221885 224673 227351 229310 230230 230702 231723
52504 231723 233440 235020 235862 236148 235992 234920 232785 230431 228721 227438 225875 224101 222827 222269 221949
$$ packed form
52628B16915n7P68Q63N73L54K33K09L92N67L10l03p43r08j221j659j453k35J155
52610B15760J591R76J53k13j05K26N86P84O67K82k06o55r35q62m18N5J87K8j6
52591B17885K63O65R23J078J350J673J660J044O1p72j163j172q79k53N21R51P21
52574B24556J30j85N1N81R69R89O58J18m83j032j398j350q31k49j54n13o77l03
52556B20877J67K34R8J26L2o22j335j004M97J878J937Q99j29n82p55r95j163r51
52538B19209l70K52O22P35P42O54K93l37q32p33j95O2m10j143j243m93K66J02
52520B17181p78j172l95P80J096M84O1N80J619K429K788K678J959R20M72J021
52504B31723J717J580Q42K86j56j072k135k354j710j283j563j774j274n58l20
$$ plain form
52489 221949 221542 221223 221195 221492 222220 223443 224881 226164 227293 228355 229064 229221 229349 229997 230547 229771 227730
52472 227730 226109 226239 227661 229140 230230 231186 232114 233092 234694 237467 241069 244599 247642 250289 252323
52457 252323 253185 252814 251837 250692 249055 246454 243124 239997 237974 237252 237214 237009 236390 235869 235833 235817 235118 233963
52439 233963 233384 233803 234359 233940 232394 230382 228486 226946 225993 225922 226765 228207 229831 231306 232464 233418
52423 233418 234535 236085 237993 240066 242359 245117 248525 252722 257918 264243 271564 279631 288229 296892
52409 296892 304648 310401 313452 313494 310403 304579 297320 290160 283734 277823 272481 268415 266012 264659 263497
52394 263497 262358 261540 261073 260704 260288 259710 258749 257490 256584 256575 257227 258017 259023 260712 263060 265620 268354
52377 268354 271644 275418 279036 282253 285621 289624 293998 298264 302380 306450 310225 313394 316098 318703
$$ packed form
52489B21949m07l19k8K97P28J223J438J283J129J062P09J57J28O48N50p76k041
52472B27730j621J30J422J479J090R56R28R78J602K773L602L530L043K647K034
52457B52323Q62l71r77j145j637k601l330l127k023p22l8k05o19n21l6j6o99j155
52439B33963n79M19N56m19j546k012j896j540r53p1Q43J442J624J475J158R54
52423B33418J117J550J908K073K293K758L408M197N196O325P321Q067Q598Q663
52409B96892P756N753L051M2l091n824p259p160o426n911n342m066k403j353j162
52394B63497j139q18m67l69m16n78r61j259r06rO52P90J006J689K348K560K734
52377B68354L290L774L618L217L368M003M374M266M116M070L775L169K704K605
$$ plain form
52363 318703 321257 323562 325557 327296 328735 329959 331485 333888 337102 340453 343480 346473 350119 354788
52349 354788 360267 366121 372191 378714 385961 393961 402702 412462 423586 435981 449176 462982 477661
52336 477661 493344 509695 526464 543953 562491 581700 600723 619043 636669 653671 670079
52325 670079 686235 702723 719710 736652 752796 767631 780620 790936 798048 802506 805629 808117
52313 808117 809413 808766 806641 804377 802434 799725 795082 788844 782417 776696 771639 767134 763313 759936
52299 759936 756360 752549 749460 747997 748064 749005 750480 752527 755239 758857 763720 769705 776135 782782 790512
52284 790512 800320 812067 824817 838060 851823 865805 879280 891913 903925 915349 925756 934857
52272 934857 942728 949214 953649 955480 954827 952271 948451 943942 939099 933801 927673 920671 913159 905384
$$ packed form
52363C18703K554K305J995J739J439J224J526K403L214L351L027K993L646M669
52349C54788N479N854O070O523P247Q000Q741R760J1124J2395J3195J3806J4679
52336D77661J5683J6351J6769J7489J8538J9209J9023J8320J7626J7002J6408
52325F70079J6156J6488J6987J6942J6144J4835J2989J0316P112M458L123K488
52313H08117J296o47k125k264j943k709m643o238o427n721n057m505l821l377
52299G59936l576l811l089j463O7R41J475K047K712L618M863N985O430O647P730
52284G90512R808J1747J2750J3243J3763J3982J3475J2633J2012J1424J0407R101
52272I34857P871O486M435J831o53k556l820m509m843n298o128p002p512p775
$$ plain form
52258 905384 897328 889133 881184 873605 866088 858438 850894 843680 836697 829843 823277 817072 811022 805054
52244 805054 799462 794402 789561 784726 780368 777171 775170 773797 772692 772061 772285 773438 775193 777004 778492
52229 778492 779848 781702 784418 787749 791375 795466 800284 805534 810637 815546 820712 826260 831779 837048
52215 837048 842423 848195 854007 859277 863906 868213 872369 876270 879854 883240 886610 890175 894083 898043
52201 898043 901174 902731 903063 903398 904526 906072 907288 908145 909168 910481 911606 912190 912426 912582 912513 911877
52185 911877 910519 908420 905521 901913 898068 894563 891510 888390 884509 879715 874743 870782 868482 867404
52171 867404 866718 866360 867049 869068 871576 873484 874614 875585 876941 878902 881651 885258 889380 893589 897913
52156 897913 902575 907333 911749 916027 920837 926190 931316 936016 941375 948484 957031 965883 974698 984084
$$ packed form
52258I05384q056q195p949p579p517p650p544p214o983o854o566o205o050n968
52244H05054n592n060m841m835m358l197k001j373j105o31K24J153J755J811J488
52229G78492J356J854K716L331L626M091M818N250N103M909N166N548N519N269
52215H37048N375N772N812N270M629M307M156L901L584L386L370L565L908L960
52201H98043L131J557L32L35J128J546J216Q57J023J313J125N84K36J56o9o36
52185I11877j358k099k899l608l845l505l053l120l881m794m972l961k300j078
52171H67404o86l58O89K019K508J908J130R71J356J961K749L607M122M209M324
52156H97913M662M758M416M278M810N353N126M700N359P109Q547Q852Q815R386
$$ plain form
52142 984084 994235 1004349 1013759 1023049 1033470 1045440 1058087 1070256 1081633 1092808 1104549 1117248
52130 1117248 1130876 1145196 1159970 1175177 1191095 1207897 1225062 1241405 1255905 1268434 1279524
52119 1279524 1289602 1298636 1306304 1312171 1315813 1317103 1316354 1313874 1309490 1302866 1294249 1284492 1274298 1263849
52105 1263849 1253284 1243115 1233920 1225923 1219074 1213316 1208581 1204811 1202151 1200931 1201276 1202929 1205617 1209343
52091 1209343 1214150 1219772 1225754 1231761 1237643 1243413 1249411 1256329 1264806 1275013 1286733 1299766 1314064
52078 1314064 1329491 1345458 1360746 1373905 1384203 1392295 1399593 1406744 1412978 1417070 1418584 1417899 1415326
52065 1415326 1410683 1403671 1394301 1382912 1370000 1356061 1341394 1326006 1309686 1292206 1273513 1253966
52053 1253966 1234348 1215332 1196776 1177882 1158219 1138339 1119160 1101066 1083891 1067487 1051862
$$ packed form
52142I84084J0151J0114R410R290J0421J1970J2647J2169J1377J1175J1741J2699
52130A117248J3628J4320J4774J5207J5918J6802J7165J6343J4500J2529J1090
52119A279524J0078R034P668N867L642J290p49k480m384o624q617r757j0194j0449
52105A263849j0565j0169r195p997o849n758m735l770k660j220L45J653K688L726
52091A209343M807N622N982O007N882N770N998O918Q477J0207J1720J3033J4298
52078A314064J5427J5967J5288J3159J0298Q092P298P151O234M092J514o85k573
52065A415326m643p012r370j1389j2912j3939j4667j5388j6320j7480j8693j9547
52053A253966j9618j9016j8556j8894j9663j9880j9179j8094j7175j6404j5625
$$ plain form
52042 1051862 1036974 1022941 1010410 1000291 992979 988059 984797 982677 981418 980747 980325 979832 979114 978224
52028 978224 977197 975699 973079 968926 963415 956919 949580 941497 933011 924344 915143 904920 893889 882810
52014 882810 871947 860727 848639 836003 823488 811185 798528 784991 770652 756196 742562
52003 742562 730410 719619 709359 698879 688241 678137 669080 660937 653261 645804 638577 631496 624242
51990 624242 616628 609055 602351 597014 592676 588453 583708 578316 572316 565631 558146 549796 540535 530474
51976 530474 520180 510552 502172 494994 488842 483950 480647 478699 477402 476396 476016 476746 478646 481507
51962 481507 485214 489624 494255 498455 501841 504316 505683 505538 503601 499965 495011 489360 483915 479555
51948 479555 476571 474596 473346 473189 474800 478421 483727 490209 497418 505011 512941 521452 530488 539134
$$ packed form
52042A051862j4888j4033j2531j0119p312m920l262k120j259o71m22m93p18q90
52028I78224j027j498k620m153n511o496p339q083q486q667r201j0223j1031j1079
52014H82810j0863j1220j2088j2636j2515j2303j2657j3537j4339j4456j3634
52003G42562j2152j0791j0260j0480j0638j0104r057q143p676p457p227p081p254
51990F24242p614p573o704n337m338m223m745n392o000o685p485q350r261j0061
51976E30474j0294r628q380p178o152m892l303j948j297j006l80P30J900K861
51962D81507L707M410M631M200L386K475J367j45j937l636m954n651n445m360
51948D79555k984j975j250j57J611L621N306O482P209P593P930Q511R036Q646
$$ plain form
51934 539134 546115 550874 553690 554700 553330 549034 542165 533726 524436 514440 503835 493061 482640
$$ packed form
51934E39134O981M759K816J010j370m296o869q439r290r996j0605j0774j0421
$$ [...]
##END NTUPLES=NMR SPECTRUM
##END=
