##TITLE=AC1583_13IEXT2754_8214317_CFdQjpgJHK
##JCAMPDX= 6.0         $$ Bruker NMR JCAMP-DX V2.0
##DATA TYPE= NMR SPECTRUM
##DATA CLASS= NTUPLES
##ORIGIN= BRUKER
##OWNER= Administrator
$$ 1.72 TOPSPIN		Version 2.1
$$ 2013-10-11 18:00:37.415 -0700  Administrator@X
$$ Compression mode = diff/dup
##.OBSERVE FREQUENCY= 400.02188249412
##.OBSERVE NUCLEUS= ^1H
##.ACQUISITION MODE= SIMULTANEOUS (DQD)
##.ACQUISITION SCHEME= undefined
##.AVERAGES= 8
##.DIGITISER RES= 22
##SPECTROMETER/DATA SYSTEM= spect
##.PULSE SEQUENCE= zg30
##.SOLVENT NAME= COFFEE_meoh
##.SHIFT REFERENCE= INTERNAL, COFFEE_meoh, 1, 14.98509
##AUDIT TRAIL= $$ (NUMBER, WHEN, WHO, WHERE, PROCESS, VERSION, WHAT)
$$ ##TITLE= Audit trail, TOPSPIN		Version 2.1
$$ ##JCAMPDX= 5.01
$$ ##ORIGIN= Bruker BioSpin GmbH
$$ ##OWNER= Administrator
$$ $$ E:\/data/COFFEE/nmr/AC1583_13IEXT2754_8214317_CFdQjpgJHK/20/pdata/1/auditp.txt
$$ ##AUDIT TRAIL=  $$ (NUMBER, WHEN, WHO, WHERE, PROCESS, VERSION, WHAT)
(   1,<2013-10-11 18:00:30.728 -0700>,<Administrator>,<X>,<go>,<TOPSPIN 2.1>,
      <created by zg
	started at 2013-10-11 17:59:24.431 -0700,
	POWCHK enabled, PULCHK disabled,
       configuration hash MD5:
       C8 4E 4E 5D D3 5C D8 9E 9F 52 82 E0 59 8A DE 15
       data hash MD5: 64K
       5B B1 0E 2E 73 E7 01 1B 1E 9A 5D F4 8E 1A AA 43>)
(   2,<2013-10-11 18:00:33.712 -0700>,<Administrator>,<X>,<proc1d>,<TOPSPIN 2.1>,
      <Start of raw data processing
       efp LB = 0 FT_mod = 6 PKNL = 1 PHC0 = 0 PHC1 = 0 SI = 32K 
       data hash MD5: 32K
       98 2E 69 64 91 61 91 55 AE 66 10 25 24 35 8D 4C>)
(   3,<2013-10-11 18:00:34.056 -0700>,<Administrator>,<X>,<proc1d>,<TOPSPIN 2.1>,
      <pk PHC0 = 96.65222 PHC1 = 0 
       data hash MD5: 32K
       1A B5 9F 5E 54 EA E4 3C 9D 54 ED 52 66 E3 B4 3A>)
(   4,<2013-10-11 18:00:34.150 -0700>,<Administrator>,<X>,<proc1d>,<TOPSPIN 2.1>,
      <abs ABSG = 1 
       data hash MD5: 32K
       21 FE 37 CF ED BB F2 59 20 03 2E 90 8E CD A0 E0>)
(   5,<2013-10-11 18:00:34.243 -0700>,<Administrator>,<X>,<proc1d>,<TOPSPIN 2.1>,
      <abs ABSG = 2 
       data hash MD5: 32K
       F9 6D 04 3B 8D D3 FE EC 63 64 16 26 A0 15 99 4E>)
(   6,<2013-10-11 18:00:34.306 -0700>,<Administrator>,<X>,<proc1d>,<TOPSPIN 2.1>,
      <abs ABSG = 3 
       data hash MD5: 32K
       58 09 60 D6 C4 DD 04 47 62 8F 4A 8D 16 E1 BF 10>)
(   7,<2013-10-11 18:00:34.353 -0700>,<Administrator>,<X>,<proc1d>,<TOPSPIN 2.1>,
      <abs ABSG = 4 
       data hash MD5: 32K
       E6 43 0D 50 AA 41 81 53 65 E0 07 E3 FB 7D 6A A2>)
(   8,<2013-10-11 18:00:34.400 -0700>,<Administrator>,<X>,<proc1d>,<TOPSPIN 2.1>,
      <abs ABSG = 5 
       data hash MD5: 32K
       96 B6 ED 8F E8 1E D4 57 55 0E D0 9E BD D4 50 01>)
$$ ##END=
$$ 
$$ $$ hash MD5
$$ $$ 3F 33 B5 AB 5E 83 A3 B3 A2 B7 12 9F 16 01 36 4C
##$RELAX= 
##$RELAX= 
##$RELAX= 
##$RELAX= 
##$RELAX= 
##$RELAX= 
##$RELAX= 
$$ Bruker specific parameters
$$ --------------------------
##$DU= <E:\>
##$EXPNO= 20
##$NAME= <AC1583_13IEXT2754_8214317_CFdQjpgJHK>
$$ [...]
##$TP= (0..7)
150 150 150 150 150 150 150 150
##$TP07= 0
##$TPNAME0= <>
##$TPNAME1= <>
##$TPNAME2= <>
##$TPNAME3= <>
##$TPNAME4= <>
##$TPNAME5= <>
##$TPNAME6= <>
##$TPNAME7= <>
##$TPOAL= (0..7)
0.5 0.5 0.5 0.5 0.5 0.5 0.5 0.5
##$TPOFFS= (0..7)
0 0 0 0 0 0 0 0
##$TUNHIN= 0
##$TUNHOUT= 0
##$TUNXOUT= 0
##$USERA1= <user>
##$USERA2= <user>
##$USERA3= <user>
##$USERA4= <user>
##$USERA5= <user>
##$V9= 5
##$VALIST= <valist>
##$VCLIST= <CCCCCCCCCCCCCCC>
##$VD= 0
##$VDLIST= <DDDDDDDDDDDDDDD>
##$VPLIST= <PPPPPPPPPPPPPPP>
##$VTLIST= <TTTTTTTTTTTTTTT>
##$WBST= 1024
##$WBSW= 4
##$XGAIN= (0..3)
0 0 0 0
##$XL= 0
##$YL= 0
##$YMAX_a= 652405
##$YMIN_a= -554830
##$ZGOPTNS= <>
##$ZL1= 120
##$ZL2= 120
##$ZL3= 120
##$ZL4= 120
##$ABSF1= 14.98509
##$ABSF2= -5.573092
##$ABSG= 5
##$ABSL= 3
##$ALPHA= 0
##$AQORDER= 0
##$ASSFAC= 0
##$ASSFACI= 0
##$ASSFACX= 0
##$ASSWID= 0
##$AUNMP= <proc_prof1d_extract_pilot.lims>
##$AXLEFT= 0
##$AXNAME= <>
##$AXNUC= <1H>
##$AXRIGHT= 0
##$AXTYPE= 0
##$AXUNIT= <>
##$AZFE= 0.1
##$AZFW= 0.1
##$BCFW= 0
##$BC_mod= 0
##$BYTORDP= 0
##$COROFFS= 0
##$CY= 15
##$DATMOD= 1
##$DC= 0
##$DFILT= <>
##$DTYPP= 0
##$F1P= 0
##$F2P= 0
##$FCOR= 0.5
##$FTSIZE= 32768
##$FT_mod= 6
##$GAMMA= 0
##$GB= 0
##$INTBC= 1
##$INTSCL= 1
##$ISEN= 128
##$LB= 0
##$LEV0= 0
##$LPBIN= 0
##$MAXI= 10000
##$MC2= 0
##$MEAN= 0
##$ME_mod= 0
##$MI= 0
##$NCOEF= 0
##$NC_proc= -8
##$NLEV= 6
##$NOISF1= 0
##$NOISF2= 0
##$NSP= 0
##$NTH_PI= 0
##$NZP= 0
##$OFFSET= 14.98509
##$PC= 1
##$PHC0= 96.65222
##$PHC1= 0
##$PH_mod= 1
##$PKNL= yes
##$PPARMOD= 0
##$PPDIAG= 0
##$PPIPTYP= 0
##$PPMPNUM= 2147483647
##$PPRESOL= 1
##$PSCAL= 4
##$PSIGN= 0
##$PYNMP= <proc.py>
##$REVERSE= no
##$SF= 400.02
##$SI= 32768
##$SIGF1= 0
##$SIGF2= 0
##$SINO= 400
##$SIOLD= 32768
##$SPECTYP= <>
##$SREGLST= <1H.CDCl3>
##$SSB= 0
##$STSI= 32768
##$STSR= 0
##$SW_p= 8223.68421052631
##$SYMM= 0
##$S_DEV= 0
##$TDeff= 65536
##$TDoff= 0
##$TI= <>
##$TILT= no
##$TM1= 0
##$TM2= 0
##$TOPLEV= 0
##$USERP1= <user>
##$USERP2= <user>
##$USERP3= <user>
##$USERP4= <user>
##$USERP5= <user>
##$WDW= 1
##$XDIM= 32768
##$YMAX_p= 451789512
##$YMIN_p= -776543
##$CURPLOT= <Network HP LaserJet P1505>
##$CURPRIN= <$Network HP LaserJet P1505>
##$DFORMAT= <normdp>
##$LAYOUT= <+/1D_H.xwp>
##$LFORMAT= <normlp>
##$PFORMAT= <normpl>
##$SURQMSG= 1
$$ End of Bruker specific parameters
$$ ---------------------------------
##NTUPLES= NMR SPECTRUM
##VAR_NAME=  FREQUENCY,     SPECTRUM/REAL,   SPECTRUM/IMAG
##SYMBOL=    X,             R,               I
##VAR_TYPE=  INDEPENDENT,   DEPENDENT,       DEPENDENT
##VAR_FORM=  AFFN,          ASDF,            ASDF
##VAR_DIM=   32768,         32768,           32768
##UNITS=     HZ,            ARBITRARY UNITS, ARBITRARY UNITS
##FACTOR=    0.250966925370066, 1,           1
##FIRST=     8223.43324360094, -93143,       5961
##LAST=      0,             -24246,          94133
##MIN=       0,             -776543,         0
##MAX=       8223.43324360094, 451789512,    0
$$ Real data points
##PAGE= N=1
##DATA TABLE= (X++(R..R)), XYDATA
$$ [...]
$$ plain form
19542 -139943 -189063 -173412 189266 -57806 -194860 -223215 -187519 22624 -196785 164566 -105926
19530 48430 -184111 96525 -28503 -153047 -60433 -239214 14371 -75496 -9258 -91868 -406563
19519 -406563 -10587 75950 28580 -190611 -8346 -22564 18745 -91314 -131190 -110992 -77535
19508 -77535 -161307 110266 -41793 -75780 -27397 94959 -196384 -166458 21919 230930 3053
19496 -138374 51766 184690 -261083 -152693 103087 -88181 -104412 64239 -116101 32613
19485 195823 137551 10674 -310237 -36683 267746 -41936 -134251 2854 -4396 14616 187640
19474 187640 -91982 14834 -468914 -67411 -304973 -91203 -42704 47116 60134 79434 46503
19463 46503 -26143 -25693 -311288 -153837 38570 133090 -159154 13775 84575 -114166 19854
$$ packed form
19542a39943m9120J5651A89266e7806j37054k8355L5696B2624a96785A64566a05926
19530D8430a84111I6525b8503j24544f0433j78781A4371g5496i258q2610l14695
19519d06563a0587G5950B8580a90611h346j4218A8745i1314l9876K0198L3457
19508g7535q3772A10266d1793l3987b7397I4959a96384K9926B1919K09011C053
19496a38374E1766J32924b61083J08390A03087h8181j6231F4239a16101C2613
19485A95823n8272A0674c10237c6683B67746d1936r2315B854d396A4616J73024
19474A87640i1982A4834d68914f7411k37562i1203d2704D7116J3018J9300l2931
19463D6503b6143M50k85595a53837C8570R4520a59154A3775P0800a14166A9854
$$ plain form
19451 -240071 -153375 -52403 38498 26888 -482546 -11917 -218884 -123052 -81599 340644 168436
19439 -55969 -114427 172515 -279596 -6858 -187478 -168546 -24719 40462 -130592 49785 -173058
19427 -52198 -47555 -122730 -90417 -249957 300943 -112871 -46252 -206410 -38316 330025 -349499
19415 -48472 454666 -177236 -220496 -234875 167152 157155 -74913 -145857 -91189 -77353 -180539
19404 -180539 188588 155001 135388 -45148 -14861 90351 -344947 -184646 -223789 101138 -163851
19392 -155060 -44484 -152372 -275631 -130587 -96316 116726 -26678 -342782 33963 187217
19382 187217 257839 144196 -116993 23791 -100147 -276044 204822 -320988 -114549 49690
19371 8936 -166455 -131097 210755 -56069 13508 -421813 201028 -249060 124803 292439
$$ packed form
19451b40071Q6696e2403C8498j1610d82546a1917k06967R5832M1453C40644A68436
19439e5969n8458A72515b79596f858j80620J8932b4719D0462a30592D9785a73058
19427e2198M643p5175L2313j59540C00943a12871d6252j60158c8316C30025c49499
19415d8472D54666a77236m3260j4379A67152r997g4913p0944N4668J3836j03186
19404a80539A88588l3587j9613d5148a4861I0351c44947J60301l9143A01138a63851
19392a55060d4484j07888j23259a30587L4271A16726b6678l16104C3963J53254
19382A87217P0622j13643a16993B3791a00147j75897B04822c20988a14549D9690
19371H936a66455L5358B10755e6069A3508d21813B01028b49060A24803J67636
$$ plain form
19361 292439 -148692 -92277 -7924 3788 166159 -96793 183160 -170753 -103381 -73417 -193091
19350 -193091 -30388 -47439 286666 -84557 -189675 -86719 33740 -30273 290895 -116410 123826
19338 217082 -93701 -46361 -317305 -108272 -314958 -228995 -72095 -240417 -162636 -110128 10638
19326 -240703 -18454 -39353 -201538 -137804 -59054 93511 103630 -83439 -105005 -81619 22039
19314 -16514 -91162 -68031 356075 212699 43666 28490 -30304 -46172 61717 -197136 -278865
19303 -278865 -312988 15748 82215 -72343 -321654 -323089 62947 -36788 -180619 105728 321640
19292 321640 -25814 -64116 -91710 46650 54125 -188700 208650 10622 -142435 -158698 -66311
19280 -14980 11398 -221411 -76 -68331 -8353 -272239 -154772 102364 -76798 -164877 25436 177343
$$ packed form
19361B92439a48692N6415g924C788J62371i6793A83160a70753O7372K9964j19674
19350a93091c0388j7051B86666h4557j05118h6719C3740c0273B90895a16410A23826
19338B17082i3701d6361k70944a08272k06686Q5963g2095j68322P7781N2508A0638
19326b40703a8454k0899j62185O3734e9054I3511J0119h3439k1566K3386B2039
19314a6514p4648K3131C56075j43376D3666j5176c0304j5868F1717a97136q1729
19303b78865l4123A5748O6467g2343k49311j435F2947c6788j43831A05728K15912
19292C21640b5814l8302k7594D6650P475a88700B08650A0622a42435j6263f6311
19280a4980A1398b21411g6o8255h353k63886J17467A02364g6798q8079B5436J51907
$$ plain form
19268 177343 118038 32220 125408 -114365 197354 131185 -319741 137157 -49111 -127620 -30775
19256 -398196 -159477 -257470 -17798 91404 144730 -33607 190949 -130794 -59237 -32476 238518
19244 -64466 22505 -289624 -52717 -175423 -267191 -10826 -60067 109837 214605 -237416 -143448
19233 -143448 -181951 68737 -194952 126012 -469009 141252 -254213 192909 87241 -7255
19222 48358 159553 -99462 -64188 -135170 42754 -272776 -157636 75712 -155683 -282125 -334569
19211 -334569 -346946 72734 -375858 -38271 -106170 -50334 382488 -412347 83489 -21657 -279821
19200 -279821 -59 351671 104390 114319 12218 -238584 -7484 136504 -46744 -82285 199205
19188 -27379 -506013 -207123 -87830 42753 -124949 107407 -198152 -242069 -8985 -262807 -17229
$$ packed form
19268A77343n9305C2220R3188a14365A97354o6169c19741A37157d9111p8509c0775
19256c98196a59477r7993a7798I1404N3326c3607A90949a30794e9237K6761B38518
19244f4466B2505b89624e2717j22706r1768a0826m9241A09837J04768b37416R3968
19233a43448l8503F8737a94952A26012d69009A41252b54213A92909H7241g255
19222D8358J11195i9462L5274p0982D2754b72776J15140G5712a55683j26442n2444
19211c34569j2377G2734c75858c8271o7899e0334C82488d12347H3489b1657k58164
19200b79821e9C51671A04390R929A2218b38584g484A36504d6744l5541A99205
19188b7379m78634b07123h7830D2753a24949A07407a98152m3917h985k53822a7229
$$ plain form
19176 -34823 22047 -131794 18350 -137863 -105984 190489 -307636 -64926 -108279 150591 -273651
19164 117318 203888 -48924 -147461 -232121 -216387 -52077 30000 156078 -137822 -209211 74296
19152 -165711 -40163 9239 61712 -392762 -88230 86386 -170383 -105210 150213 -142833 30342
19140 -214193 -143443 -42455 253103 -123986 -204680 -38546 -415552 -112117 -50202 -54167 -66846
19129 -66846 275801 296898 201298 266824 -25843 154166 -32165 232475 -397611 -119755 62419
19117 174216 -23568 37564 148864 -2281 -14077 -183604 -166774 220716 -38414 112485 -57365
19105 -75251 178084 -428172 37384 -261680 -127294 -293353 51097 -103482 -86355 -349368
19095 -349368 -139536 127996 -50643 -95940 -6688 -231179 -483263 105857 -289494 164048
$$ packed form
19176c4823B2047a31794A8350a37863L1879A90489c07636f4926m3353A50591b73651
19164A17318Q6570d8924r8537q4660J5734e2077C0000J26078a37822p1389G4296
19152a65711d0163I239N2473c92762h8230H6386a70383O5173A50213a42833C0342
19140b14193P0750d2455B53103a23986q0694c8546l77006a12117e0202l965j2679
19129f6846B75801K1097r5600O5526b5843A54166c2165B32475c97611a19755F2419
19117A74216b3568C7564J11300b281j1796j69527J6830B20716c8414A12485e7365
19105g5251A78084d28172C7384b61680a27294j66059E1097a03482J7127k63013
19095c49368a39536A27996e0643m5297f688k24491k52084A05857b89494A64048
$$ plain form
19084 -274274 419665 -86465 45268 299698 -79812 -229902 -26898 23046 284136 73315 -49876
19072 -48692 258104 124107 270036 -208103 -44340 -346256 -267878 -101755 290442 -220602
19061 -176416 -291625 114512 -1114 179819 -24778 37499 -172747 193056 -174682 -143178
19051 -143178 -63176 154630 -63826 -71064 -317478 139926 -34258 -51537 -153589 -21213 -231664
19040 -231664 8468 -58646 122499 -35275 -44083 -93272 -182190 67689 -252469 -15692 -310998
19029 -310998 256083 -25785 47020 114223 -66970 34943 6945 142366 464681 -22276 215882
19017 12073 358092 -109971 113267 7906 170490 213623 -30196 -184859 86466 -180965 300071
19005 276580 -257139 166183 -161248 -45776 121389 203357 230315 40008 -17971 -76679 -59291
$$ packed form
19084b74274D19665h6465D5268K54430g9812j50090b6898B3046K61090G3315d9876
19072d8692B58104A24107J45929b08103d4340l01916P8378a01755B90442b20602
19061a76416j15209A14512a114A79819b4778C7499a72747A93056a74682L1504
19051a43178f3176A54630f3826p238k46414A39926c4258j7279j02052b1213k10451
19040b31664H468e8646A22499c5275q808m9189q8918F7689b52469a5692k95306
19029c10998B56083b5785D7020O7203f6970C4943F945J35421L22315b2276B15882
19017A2073L46019a09971A13267G906J62584M3133c0196j54663H6466a80965C00071
19005B76580b57139A66183a61248d5776A21389Q1968K6958D0008a7971n8708J7388
$$ plain form
18994 -59291 -113175 323124 -130254 -304775 -227098 -75527 119741 263809 -98824 -3050 78366
18982 288985 -409487 -90421 -131966 -143012 183895 -191748 -155277 -95745 -248225 -268181 -24787
18970 380639 -391132 131961 2488 228036 -295875 -8004 -313460 -547479 -107750 19200
18959 172679 365671 38360 34564 -140797 201620 20219 -253250 -53880 101590 20654 79
18947 -200518 -241920 -89550 -60179 -271700 115197 -128839 -50036 173853 -281718 221 -285704
18935 -145700 -55309 -26502 -93124 -106009 47959 54411 -169055 99374 55511 -67022 -35494
18924 -35494 -114499 -223802 212758 351865 45532 80866 -199657 -372180 -132800 16296
18913 -219563 -176429 126270 86899 -90864 -92153 113378 -117214 -35415 1529 -17012 128948
$$ packed form
18994e9291n3884C23124a30254j74521P7677g5527A19741J44068i8824c050G8366
18982B88985d09487i0421m1545j1046A83895a91748L6471N9532j52480j9956b4787
18970C80639c91132A31961B488K25548b95875h004l05456k34019a07750A9200
18959A72679J92992C8360l796a40797B01620B0219b53250e3880A01590B0654G9
18947b00518m1402h9550K9371k11521A15197a28839e0036A73853b81718B21b85704
18935a45700e5309b6502o6622j2885D7959O452a69055I9374m3863f7022L1528
18924c5494p9005j09303B12758J39107D5532L5334a99657j72523a32800A6296
18913b19563M3134A26270l9371i0864j289A13378a17214c5415A529a7012A28948
$$ plain form
18901 -43047 -36874 5992 108420 -86198 131155 -84970 -227704 -200576 -12305 -170462 125941
18889 53366 221106 51992 -100281 17578 130419 45969 -5817 -232009 -273153 12299 114175
18878 114175 -212161 84412 -50867 -278542 272149 45822 -193630 -153569 -219417 312451
18867 64850 71010 -339542 113326 261924 9891 -174930 83294 -335386 -303211 -207963 15270
18855 46567 -70661 -182862 240610 124979 -145569 -300035 342873 100863 104626 -139796
18844 -117973 -520 -384412 7562 -141599 -33901 3697 84877 -96333 4324 -15433 -61297 -112414
18832 -112414 12327 -337303 359484 130786 -28780 -112810 5647 -195014 36182 -57193 -172603
18821 -172603 -187814 -161160 -78984 314280 -66405 -32005 -148603 36287 132264 153597 112003
$$ packed form
18901d3047O173E992J02428h6198A31155h4970j42734K7128a2305j58157A25941
18889E3366J67740E1992a00281A7578J12841D5969e817k26192m1144A2299J01876
18878A14175b12161H4412e0867k27675B72149D5822a93630M0061o5848C12451
18867F4850O160c39542A13326J48598I891a74930H3294c35386L2175R5248A5270
18855D6567g0661j12201B40610j15631a45569j54466C42873A00863L763a39796
18844a17973e20l83892G562a41599c3901C697Q1180i6333D324a5433m5864n1117
18832a12414A2327c37303C59484A30786b8780q4030E647a95014C6182e7193j15410
18821a72603j5211K6654g8984C14280f6405c2005j16598C6287R5977K1333m1594
$$ plain form
18810 112003 -19510 563632 -61252 167572 99446 28609 30211 -42056 -184433 -107419 20275
18798 -255906 -10492 -267216 -112888 -95675 -100206 -91986 78545 -8811 -27074 -263291 24133
18786 -224708 -22939 95029 201183 -106616 -242308 -158193 5963 -260330 -232244 -257606 59518
18774 -110009 71593 -157446 227711 -314943 -183124 74823 -321779 -97330 58905 -371710
18763 -13316 16292 -11119 81494 -323440 -274125 -180036 -232254 54028 4663 -185219 -109381
18752 -109381 -65089 87850 -162263 -181100 -363516 6282 157813 333890 154612 130584 -178637
18740 -21745 6617 -20432 1398 -157753 -243188 -57004 175557 -196912 -272987 -68081 -191075
18729 -191075 14173 -165672 -301589 -193020 -74082 62136 225753 189948 -123214 228294
$$ packed form
18810A12003a9510E63632f1252A67572o8126B8609J602d2056j42377P7014B0275
18798b55906a0492k56724a12888J7213m531Q220G8545h811j8263k36217B4133
18786b24708b2939I5029J06154a06616j35692Q4115E963b60330K8086k5362E9518
18774a10009G1593a57446B27711c14943J31819G4823c21779i7330E8905c71710
18763a3316A6292a1119H1494c23440M9315R4089n2218E4028D663a85219P5838
18752a09381M4292H7850a62263j8837j82416F282J51531J76077A54612k4028a78637
18740b1745F617b0432A398a57753q5435e7004A75557a96912p6075f8081j22994
18729a91075A4173a65672j35917J08569g4082F2136J63617l5805a23214B28294
$$ plain form
18718 -185318 127773 -238056 153710 36450 426041 3408 -70816 -166804 -82737 -310373 329754
18706 -213830 581 -449980 -80837 -85660 103172 -344907 20278 -111500 -80378 -123874 -48473
18694 -176697 40932 34874 -322613 -204244 -2922 265124 -123105 284183 -12279 -123927 -93044
18683 -93044 -117263 4425 -190603 -150189 139983 67147 -283855 -206117 339003 -200221 -53852
18671 129323 56443 -28485 -32717 -79071 38953 -89991 -169996 -22493 -393526 219593 135330
18660 135330 -152346 -131434 1525 -73363 114731 -201072 -161075 48808 129637 107318 -294592
18648 -84085 -270089 -9157 10720 -231754 -80865 -208813 -73083 225043 201878 93220 -305256
18636 -135388 187624 87682 418551 -349535 -252072 73936 123315 -440122 76886 -210808
$$ packed form
18718a85318A27773b38056A53710C6450L89591C408g0816r5988h2737k27636C29754
18706b13830E81d49980h0837m823A03172c44907B0278a11500L1122m3496d8473
18694a76697D0932o058c22613J18369b922B65124a23105B84183a2279j11648L0883
18683i3044k4219D425a90603M0414A39983F7147b83855P7738C39003b00221e3852
18671A29323E6443b8485m232m6354C8953h9991q0005b2493l71033B19593q4263
18660A35330a52346K0912A525g3363A14731b01072L9997D8808Q0829k2319b94592
18648h4085j86004i157A0720b31754h0865j27948g3083B25043k3165I3220c05256
18636a35388A87624H7682L30869c49535R7463G3936M9379d40122G6886b10808
$$ plain form
18625 -34448 -175103 30450 -1488 240598 54779 72016 62099 12230 255627 -239463 -129462
18614 -129462 -26568 -198392 -302306 -214470 123835 -8958 -76539 -3376 321193 -54795 55752
18602 -151341 -98362 26869 -253735 63682 11632 -284641 -233507 -112011 -13059 247855 -43217
18590 -261634 -85409 224888 71565 -21326 -51072 -22227 94343 -7183 -97118 -89936 -77782 155243
18577 188948 82982 -96759 181872 -344983 -229178 -167286 139380 -273583 -319188 33534
18566 -215394 -2482 67982 -152724 -387964 39152 -216635 16531 247819 -445576 -139317
18555 -174418 -120429 -172902 96262 64023 -347288 215042 171495 -229414 -30151 -39220 -86800
18544 -86800 16953 -110769 247918 88849 -159980 98487 -12932 -42482 136448 -226088 -19662
$$ packed form
18625c4448j40655C0450a488B40598E4779J7237r917A2230K43397b39463J10001
18614a29462b6568j71824j03914Q7836A23835h958o7581c376C21193e4795E5752
18602a51341N2979B6869b53735F3682A1632b84641N1134a12011a3059B47855d3217
18590b61634h5409B24888G1565b1326k9746b2227I4343g183q9935P182J2154A55243
18577A88948H2982i6759A81872c44983J15805O1892A39380b73583m5605C3534
18566b15394b482F7982a52724k35240C9152b16635A6531K31288d45576a39317
18555a74418N3989n2473I6262l2239c47288B15042m3547b29414c0151r069m7580
18544h6800A6953a10769B47918H8849a59980I8487a2932k9550A36448b26088a9662
$$ plain form
18532 30402 88656 -5103 -200319 -30640 -93976 -299957 41506 83436 -148328 257168 -60008
18520 -46771 13102 -129262 243195 -81867 -78527 204574 -401344 -193075 -219941 -19781 -52347
18509 -52347 16560 95409 301979 -127834 133106 -48576 -64553 185446 177154 231592 -183411
18497 -185472 -229247 -11725 -294016 184632 31146 -218984 -259688 -140778 -121510 197049
18486 -38445 -28496 31232 -66576 41700 -16816 -46828 -106484 -172207 167949 118681 -191655
18474 -138481 -80020 -26129 32748 -153331 138684 162616 -16941 130861 3143 156259 -392926
18462 49651 163835 -399700 -256786 -127453 191112 269094 142392 -59380 129445 78146
18452 78146 -224376 -8163 205196 191112 -255743 270498 38050 -11765 25904 -121454 -8600
$$ packed form
18532C0402N8254e103j95216c0640o3336k05981D1506M1930a48328B57168f0008
18520d6771A3102a29262B43195h1867L340B04574d01344a93075k6866a9781l2566
18509e2347A6560P8849K06570a27834A33106d8576j5977A85446q292N4438a83411
18497a85472m3775a1725k82291A84632C1146b18984m0704J18910J9268A97049
18486c8445R949C1232f6576D1700a6816l0012n9656o5723A67949m9268a91655
18474a38481N8461b6129C2748a53331A38684K3932a6941A30861C143J53116c92926
18462D9651J14184c99700J42914a27453A91112P7982j26702e9380A29445n1299
18452G8146b24376h163B05196j4084b55743B70498C8050a1765B5904a21454h600
$$ plain form
18440 -251794 -120212 -196491 77222 -221995 -60251 -150784 251678 -173575 -333511 29717
18429 188366 -128485 -145292 -155449 97586 -72456 74162 102555 -113748 -182080 -198799 167946
18417 -291010 63773 -538200 85059 115727 74099 -277247 110731 63622 289282 42603 -306774
18405 -43378 205771 118104 -128560 -159387 124256 -7812 -94124 -36383 3556 -439576 177428
18393 76176 106273 -323807 324814 106585 67305 35449 236485 -141690 150017 60560
18382 -226008 -325550 363984 -231613 82383 147959 -268256 180406 189383 -140900 84380 47880
18371 47880 -87671 -170752 91061 -282534 324409 -151141 45708 124414 -41634 -109980 20137
18359 -176720 -448630 -60322 -47575 -317241 352550 -106004 -2277 -188562 276314 -83067
$$ packed form
18440b51794a20212p6279G7222b21995f0251r0533B51678a73575j59936B9717
18429A88366a28485j6807j0157I7586g2456G4162K8393a13748o8332j6719A67946
18417b91010F3773e38200H5059L0668m1628b77247A10731m7109K25660D2603c06774
18405d3378B05771q7667a28560l0827A24256g812q6312c6383C556d39576A77428
18393G6176L0097c23807C24814A06585l9280l1856K01036a41690A50017F0560
18382b26008r9542C63984b31613H2383O5576b68256A80406Q977a40900H4380l6500
18371D7880h7671q3081I1061b82534C24409a51141D5708P8706d1634o8346B0137
18359a76720k71910f0322J2747k69666C52550a06004b277j86285B76314h3067
$$ plain form
18348 -198501 53871 155695 -125347 -6921 -79189 59451 -303060 -386748 -138179 -118894 113522
18336 -381995 73176 -205900 112279 -135185 -208518 47847 -48486 -68860 204991 -177954
18325 281415 -138328 -15892 195592 -63059 19467 282967 110229 -32992 -95942 -358818
18315 -358818 -235737 168185 -329385 -63244 -34175 -3487 2378 267223 -145094 -66682 -46128
18304 -46128 -198299 -137730 84594 36846 -184733 -63102 -20185 -4146 -130928 127697 79776
18293 79776 -299651 16419 -349401 60643 255998 -125295 23553 -694 12495 -149343 77443
18281 -54498 -254821 -5342 84872 -67077 -231712 -249580 95351 -105925 165351 226217 -404729
18269 -6196 114960 -54168 -251513 -106210 50252 -180833 230958 -131507 -93153 -352832
$$ packed form
18348a98501E3871J01824a25347f921p2268E9451c03060q3688a38179J9285A13522
18336c81995G3176b05900A12279a35185p3333D7847d8486k0374B04991a77954
18325B81415a38328a5892A95592f3059A9467K63500A10229c2992o2950k62876
18315c58818J23081A68185c29385f3244K9069c487B378K64845a45094f6682K0554
18304d6128j52171O0569H4594C6846a84733f3102b0185d146j26782A27697m7921
18293G9776b99651A6419c49401F0643J95355a25295B3553f94A2495a49343G7443
18281e4498k00323e342H4872f7077j64635j7868I5351a05925A65351O0866d04729
18269f196A14960e4168j97345a06210E0252a80833B30958a31507L8354k59679
$$ plain form
18259 -352832 236544 -15934 -21911 129554 -156781 25495 -281858 38357 -247157 57833 -21089
18247 173740 -318469 -210903 -367854 299646 -152764 -55713 -87792 190428 12996 40147
18237 40147 -63240 -163576 305869 182212 -35438 -245190 68268 -5544 65922 1307 -217288
18225 150127 145524 -72379 -234347 -65479 -127094 133472 -55684 82394 -202034 286389 -103817
18213 -180361 -346066 -196943 91091 220139 -47263 126603 -138930 -150802 403245 -295030
18202 -213197 39948 -106495 -274023 3457 -130622 -279910 9373 13512 -141278 -196980 -91451
18190 -267577 -24549 152150 -110556 183601 -104603 112323 -145119 -134819 1539 -362190
18179 35057 277000 10527 161970 -370028 6392 -134922 -310125 -115779 -241179 -73446
$$ packed form
18259c52832B36544a5934n977A29554a56781B5495b81858C8357b47157E7833b1089
18247A73740c18469J07566j56951B99646a52764e5713l2079A90428A2996K7151
18237D0147f3240j00336C05869j23657c5438k09752F8268e544F5922A307b17288
18225A50127m603g2379j61968f5479o1615A33472e5684H2394b02034B86389a03817
18213a80361j65705J49123I1091J29048d7263A26603a38930j1872D03245b95030
18202b13197C9948a06495j67528C457a30622j49288I373M139a41278n5702i1451
18190b67577b4549A52150a10556A83601a04603A12323a45119J0300A539c62190
18179C5057K41943A0527J51443c70028F392a34922j75203a15779j25400g3446
$$ plain form
18168 -317725 198576 123923 102058 13412 10975 -45525 206924 -31452 37011 58346 132445
18157 132445 78581 -44698 -47597 -5691 -125100 -177599 -429234 -196441 -279349 123490 22592
18145 -160135 -220930 274567 -48130 -180745 9493 -421871 33012 -149995 564937 -343100
18134 328745 259392 -305547 -74640 -55368 9389 -85693 201807 30329 224196 -93849 -90740
18123 -90740 -256473 -58405 -16510 -37668 50061 -153384 90060 267523 -85816 3736 -165845
18111 -146580 175955 -224168 -390465 -36333 -197840 61262 -12503 -218374 204369 42293
18100 89616 -303212 184104 -77521 183490 -61905 89327 102095 -61983 -393143 -315807 -4692
18088 -267768 145885 -259497 -62965 -94154 -187726 -96874 -171085 -181749 130710 210940 40788
$$ packed form
18168c17725A98576p4653k1865A3412k437d5525B06924c1452C7011K1335P4099
18157A32445n3864d4698k899e691j19409n2499k51635a96441q2908A23490B2592
18145a60135o0795B74567d8130j32615I493d21871C3012a49995E64937c43100
18134C28745o9353c05547g4640J9272I389h5693B01807C0329J93867i3849L109
18123i0740j65733e8405a6510k1158E0061a53384I0060J77463h5816C736a65845
18111a46580A75955b24168j66297c6333j61507F1262a2503k05871B04369D2293
18100H9616c03212A84104g7521A83490f1905H9327J2768f1983l31160P7336d692
18088b67768A45885b59497f2965l1189r3572R0852p4211j0664A30710Q0230D0788
$$ plain form
18076 56065 4331 -46461 -130366 1567 29733 60881 -227421 353451 -170026 -350587 278929
18064 8839 71103 203218 -57694 -212698 -201161 111145 -255462 -174959 11504 63521 78489
18053 78489 -169797 49583 28423 51832 -119095 93233 -237337 -132501 -33507 103782 -423095
18041 -88300 -214588 1018 136482 -157479 -242223 118395 -202632 -56911 -303456 -374253 41969
18029 -106553 -97782 -174481 -102093 -114768 6033 -341752 -8582 24733 54955 128831 136189 -35825
18016 102106 -37736 -34047 81447 92022 76071 150553 -167012 -95588 -7536 -148632 -149050 28770
18003 54775 -181501 -3885 -60301 -392644 -61650 101924 60713 -31673 -114483 231641 280110
17992 280110 67911 39038 76396 96173 -131890 144582 -344913 122702 -11534 -18628 -499043
$$ packed form
18076E6065D331d6461q3905A567K8166L1148b27421C53451a70026j80561B78929
18064H839O2264J32115e7694j55004J1537A11145b55462Q0503A1504N2017J4968
18053G8489a69797D9583k1160K3409a19095I3233b37337J04836c3507A03782d23095
18041h8300j26288A018J35464a57479q4744A18395b02632e6911k46545p0797D1969
18029a06553Q771p6699P2388j2675F033c41752h582B4733L0222P3876P358c5825
18016A02106c7736L689H1447J0575j5951P4482a67012P1424g536j41096m18B8770
18003E4775a81501c885n6416l32343f1650A01924m1211c1673q2810B31641M8469
17992B80110F7911k8873L7358J9777a31890A44582c44913A22702a1534p094m80415
$$ plain form
17981 -499043 67442 425983 26489 7256 -57141 -64567 169207 -86143 -136288 -67157 -148718
17970 -148718 -68668 -117516 -153462 51824 -105104 -118663 125671 86020 61986 -101258 -258650
17959 -258650 91329 -124173 52731 -221623 -53109 -83366 -92181 -85454 -79396 167249 54015
17947 -230934 -53641 315377 -137394 -48307 -171563 143167 177047 -110411 114597 73940
17937 73940 -52947 -91793 249676 175310 -296206 -186633 221466 -6498 -97566 267484 -86167
17925 -95375 -38965 -265658 187390 87766 105087 -43790 226408 -77294 -55293 -215325 -73067
17913 147060 78984 157547 -400758 -255368 -40188 -4324 168397 -217514 -212535 -51255 -97399
17902 -97399 -265139 3233 47043 27305 -19428 -23977 140598 -389239 102332 -239935 -507990
$$ packed form
17981d99043F7442L58541B6489G256e7141p426A69207h6143n0145f7157q1561
17970a48718f8668m8848l5946E1824a05104j3559A25671l9651k4034a01258j57392
17959b58650I1329a24173E2731b21623e3109l0257q815O727O058A67249E4015
17947b30934e3641C15377a37394d8307j23256A43167L3880a10411A14597m0657
17937G3940e2947l8846B49676p4366b96206J09573B21466f498r1068B67484h6167
17925i5375c8965k26693A87390H7766J7321d3790B26408g7294K2001j60032g3067
17913A47060o8076P8563d00758J45390d0188d324A68397b17514M979e1255m6144
17902i7399j67740C233M3810j9738a9428m549A40598c89239A02332b39935k68055
$$ plain form
17891 -507990 -7090 -67851 -149663 -369998 87679 -263971 -1452 105942 29764 149051 -299280
17879 -197431 57219 14865 78509 -3347 54395 45450 -114150 -75285 337153 329035 175766
17868 175766 130894 84676 109999 300175 219879 111635 -45935 -45346 117855 -6512 -10116 128650
17855 306075 -71101 -116740 -243956 -209468 42227 -115574 65681 -78180 -263058 -335531 -164843
17843 37343 204169 -137948 246679 244592 -268546 -193415 153310 12338 84225 32498 -30399
17831 119130 -205431 -71793 -258280 39726 -204889 -2944 -170598 -257918 -102639 21279 -283615
17819 73921 262589 -276245 73090 -268187 -192051 -36435 12304 -76778 -177036 87182 95619
17808 95619 87624 245509 -271606 154752 -170197 223755 146371 188102 106703 230383 -302608
$$ packed form
17891e07990g090o0761q1812k20335H7679b63971a452A05942B9764J19287b99280
17879a97431E7219A4865O3644c347E4395q945a14150L8865C37153q118j53269
17868A75766m4872m6218K5323J90176q0296j08244d5935N89A17855f512l604A28650
17855C06075g1101m5639j27216L4488D2227a15574F5681g8180j84878p2473a64843
17843C7343J66826a37948B46679k087b68546P5131A53310A2338P1887C2498c0399
17831A19130b05431g1793j86487C9726b04889b944j67654q7320a02639B1279b83615
17819G3921J88668b76245G3090b68187P6136c6435A2304g6778j00258H7182Q437
17808I5619p995J57885b71606A54752a70197B23755p7384M1731q1399J23680c02608
$$ plain form
17796 839 152613 13732 13987 -25418 14338 -131865 403565 -148473 14952 225309 266835
17785 266835 -78426 44292 123744 -323284 112245 -114071 -117723 135590 301869 -426428
17774 51748 56981 200264 -210947 259335 -181299 15135 173170 33581 258231 44344 -87561
17762 -367808 130704 -345743 335545 -28084 -193408 31651 70153 -99907 -77324 33613 17623
17751 17623 353838 194196 282293 69032 225688 184161 114862 -59398 34227 138035 19174
17739 68613 -151153 268832 454122 8709 -31780 33044 12874 -196297 -31224 -108736 -49262
17727 -26518 -34640 127947 -175340 136840 476815 262676 210608 -3916 -64005 -133012 -260733
17716 -260733 -163385 -10962 19796 232248 219075 -416654 -148892 204539 198788 261824 44887
$$ packed form
17796H39J51774A3732K55b5418A4338a31865D03565a48473A4952K10357M1526
17785B66835g8426D4292P9452c23284A12245a14071l652A35590J66279d26428
17774E1748N233J43283b10947B59335a81299A5135J58035C3581K24650D4344h7561
17762c67808A30704c45743C35545b8084j65324C1651L8502i9907K2583C3613j5990
17751A7623L36215j59642Q8097F9032J56656m1527o9299e9398C4227J03808A9174
17739F8613a51153B68832J85290H709c1780C3044A2874a96297c1224p7512d9262
17727b6518q122A27947a75340A36840L39975k14139n2068c916o0089o9007j27721
17716b60733R7348a0962A9796K12452j3173d16654a48892B04539n751O3036D4887
$$ plain form
17704 -247550 114847 -83964 106576 -200463 37565 -3314 65943 98429 9612 -164713 -63244
17692 69889 23836 -40436 74381 77153 -95880 169857 -197942 240905 66016 401579 380482
17681 380482 -27582 169561 80063 15159 -94531 313962 13313 -230430 243780 -98630 4096
17669 172337 106434 98069 164282 -146419 -111802 -45791 -340569 102153 -64114 -9029 188580
17657 334103 -165610 41425 -43771 149443 287281 51085 63694 -106365 -168876 20462 199597
17646 199597 7189 164591 -240904 -177331 -27932 -240549 51176 -268938 -103007 -85431 33067
17634 43040 -330850 38646 -68800 -12234 277763 -153416 -1392 19679 106305 5303 282105
17623 282105 64215 -130324 94105 -18161 296253 29479 42826 276553 -208993 -58241 300040
$$ packed form
17704b47550A14847h3964A06576b00463C7565c314F5943L2486I612a64713f3244
17692F9889B3836d0436G4381K772i5880A69857a97942B40905F6016L35563k1097
17681C80482b7582A69561H0063A5159i4531C13962A3313b30430B43780i8630D096
17669A72337o5903q365O6213a46419L4617d5791k94778A02153f4114i029A88580
17657C34103a65610D1425d3771A49443J37838E1085J2609a06365o2511B0462J79135
17646A99597G189J57402b40904O3573b7932k12617E1176b68938a03007J7576C3067
17634D3040c30850C8646f8800a2234B77763a53416a392A9679Q6626E303K76802
17623B82105F4215a30324I4105a8161B96253B9479J3347K33727b08993e8241C00040
$$ plain form
17611 -45851 -61693 -96100 978 172551 -32398 -72184 371110 25717 -105865 -397023 -263925
17600 -263925 -112537 553646 -101890 206486 30062 174629 169979 -57663 107300 -205774
17589 81612 -19395 -175557 42222 65521 180457 -19970 -239918 -41522 106266 -256577 -148983
17578 -148983 211589 -99740 -226593 374409 50823 -48696 -192460 39325 85921 168341 -12656
17566 -338105 144955 -210574 -17834 110075 73980 -119540 60748 123475 -9219 345711 -281737
17554 71302 -168821 -295983 128043 172139 -77080 -17026 -29385 102807 162902 277442 226909
17543 226909 25548 158758 111908 -130208 228806 33977 127827 42464 159853 239501 334447
17532 334447 132889 121494 47954 -17629 95270 6895 -222990 61638 327338 354582 -39265
$$ packed form
17611d5851j5842l4407I78J71573c2398l9786C71110B5717a05865k91158J33098
17600b63925a12537E53646a01890B06486C0062J44567m650e7663A07300b05774
17589H1612a9395j56162D2222K3299J14936a9970k19948d1522A06266b56577J07594
17578a48983B11589i9740j26853C74409E0823d8696j43764C9325M6596Q2420a2656
17566c38105A44955b10574a7834A10075l6095a19540F0748O2727i219C45711b81737
17554G1302a68821j27162A28043M4096g7080a7026j2359A02807O0095J14540n0533
17543B26909B5548J33210m6850a30208B28806C3977R3850D2464J17389P9648R4946
17532C34447A32889j1395D7954a7629I5270F895b22990F1638K65700K7244c9265
$$ plain form
17520 -4448 -3329 39987 358267 118679 425977 44328 -87081 204172 7235 -153370 275705
17508 59839 100189 8705 -70774 99237 167925 -29430 320006 153586 502099 -61567 31986
17496 33313 163205 202975 289483 347697 58488 40836 -146122 114982 -133557 -112061 60319
17484 387774 215524 97178 18984 196879 62475 308523 182165 -74491 115887 99093
17474 99093 429362 120248 237147 222655 38381 381098 301531 -47993 321058 157117
17463 203344 -73441 538633 332823 297723 133539 -20635 -10739 259387 260851 488052 -1187
17451 171074 231523 513646 -35877 153409 87689 387513 520159 -3 132078 27431 163272
17440 163272 227580 427470 -96088 666194 444491 390178 163780 -16530 490992 188536
$$ packed form
17520d448J119C9987L18280A18679L07298D4328h7081B04172G235a53370B75705
17508E9839M0350H705g0774I9237O8688b9430C20006A53586L48513f1567C1986
17496C3313J29892L9770Q6508N8214E8488j7652a46122A14982a33557K1496F0319
17484C87774j72250I7178A8984J77895F2475K46048j26358g4491A15887j6794
17474I9093L30269A20248J16899j4492C8381L42717p9567d7993C21058A57117
17463B03344g3441E38633k05810l5100A33539b0635R896B59387J464K27201a187
17451A71074O0449K82123c5877A53409o5720K99824J32646cA32078B7431J35841
17440A63272O4308J99890i6088F66194k21703n4313A63780a6530D90992A88536
$$ plain form
17429 199571 171041 107225 699706 354805 267460 164691 435661 164719 518573 362992
17419 362992 270226 149139 106107 483511 75239 282610 96579 166426 5724 195196 266557
17408 266557 -105557 -78019 96080 356651 -37911 -97542 206733 306358 80263 15158 -220625
17396 231584 397277 48904 118124 49464 -190048 319058 47471 469865 398711 296418
17386 296418 205381 128322 313983 48327 25417 37601 -27877 -7796 85405 94364 392736
17375 392736 150093 1256 413970 113399 -45742 -180060 168619 18495 -112731 -134503
17365 -134503 258982 62851 235468 68010 -244566 162344 558078 70447 96190 147903
17355 147903 78161 103024 19741 -255108 90855 -82529 160654 58641 134583 190325 128103
$$ packed form
17429A99571k8530o3816N92481l44901q7345j02769K70970A64719L53854j55581
17419C62992r2766j21087m3032L77404G5239K07371I6579O9847E724J89472P1361
17408B66557a05557K7538I6080K60571c7911n9631B06733R9625H0263A5158b20625
17396B31584J65693D8904O9220D9464a90048C19058D7471M22394p1154j02293
17386B96418r1037p7059J85661D8327k2910J2184b7877g796H5405Q959K98372
17375C92736A50093A256M12714A13399d5742j34318A68619A8495a12731k1772
17365a34503B58982F2851J72617F8010b44566A62344L95734G0447K5743N1713
17355A47903o9742K4863A9741b55108I0855h2529A60654E8641P5942N5742o2222
$$ plain form
17344 128103 237514 -131685 180980 247459 235444 39529 -176269 190950 -325688 -80806
17333 271289 423438 229973 35693 -200729 -13678 315598 117974 -126093 125794 120688
17323 120688 56043 107015 -101962 64940 -65659 377597 108408 251596 176192 241801 288724
17312 288724 -133828 528658 211679 -79235 239016 -13508 -69340 124811 -52144 247330
17301 128925 -5805 -117182 156080 -1238 -67360 283561 239041 123067 -17975 138243 161445
17290 161445 201607 -63100 192163 154333 150548 294333 146580 36789 -388191 -1493 264851
17278 422101 404471 126048 -101104 3409 478519 -40357 90196 -13290 -211806 -20017 650854
17266 546377 201808 537052 47988 207974 82009 337312 193512 377154 81689 112219
$$ packed form
17344A28103J09411a31685A80980O6479j2015C9529a76269A90950c25688h0806
17333B71289J52149j93465C5693b00729a3678C15598A17974a26093A25794n106
17323A20688E6043N0972a01962F4940f5659C77597A08408J43188p5404O5609M6923
17312B88724a33828E28658B11679g9235B39016a3508n5832A24811e2144B47330
17301A28925e805j11377A56080a238o6122B83561m4520j15974a7975A38243K3202
17290A61445M0162f3100A92163l7830l785J43785A46580C6789c88191a493B64851
17278D22101j7630A26048a01104C409M75110d0357I0196a3290j98516b0017F50854
17266E46377B01808L35244D7988J59986H2009K55303j43800J83642H1689L0530
$$ plain form
17256 112219 202054 204773 223178 103890 297415 219445 337865 -39269 438667 275751 424782
17245 424782 440873 286798 496486 507433 14046 -44479 -60970 -157027 357781 204266 308157
17234 308157 105479 288819 277441 128430 218483 259316 523903 242836 211279 223043
17224 223043 272466 33167 48155 190907 184855 191908 392164 325785 364492 346079 332723
17213 332723 196161 200122 -4080 93524 332383 471512 274739 130398 398406 -262985
17202 197880 234177 164640 407106 334121 195186 282205 140959 -11349 377637 148492
17191 218297 393946 258613 179761 229470 289519 347319 220526 146005 275125 195817 141756
17180 141756 198452 186051 139191 195659 -135575 506189 41844 299247 903240 -223842
$$ packed form
17256A12219Q9835K719J8405A03890J93525p7970J18420c9269D38667j62916J49031
17245D24782J6091j54075K09688J0947A4046d4479j6491r6057C57781j53515J03891
17234C08157A05479J83340j1378A28430R0053M0833K64587B42836l1557J1764
17224B23043M9423C3167J4988J42752o052P053K00256o6379L8707j8413j3356
17213C32723j36562L961d080I3524K38859J39129j96773A30398K68008b62985
17202A97880L6297o9537K42466p2985j38935Q7019A40959a1349C77637A48492
17191B18297J75649j35333p8852M9709O0049N7800j26793p4521J29120p9308n4061
17180A41756N6696j2401m6860N6468a35575E06189D1844K57403O03993b23842
$$ plain form
17169 297110 7195 -158134 90030 231056 442801 279117 205918 248257 419155 310809
17159 310809 333239 356427 359914 361286 281448 239372 153817 674010 213638 138491 485621
17148 485621 -101416 284037 223012 236950 358981 142626 376034 460481 137379 382005
17138 382005 342980 268569 144575 267266 294993 289140 174540 269133 104997 423120 484094
17127 484094 250833 419955 114290 48173 395128 72436 185324 -16749 900427 152025
17116 328502 176649 517860 458055 267224 422149 519707 386333 193579 435184 65382
17105 145487 423396 -124657 311985 387403 477176 158206 589561 356112 553275 521404
17095 521404 547028 685465 285384 377501 224212 238268 634142 360078 682525 304162
$$ packed form
17169B97110G195a58134I0030J41026K11745j63684p3199M2339J70898j08346
17159C10809K2430K3188L487J372p9838m2076q5555N20193B13638p5147L47130
17148D85621a01416B84037o1025J3938J22031A42626K33408Q4447A37379K44626
17138C82005l9025p4411j23994J22691K7727n853j14600R4593A04997L18123O0974
17127D84094k33261J69122A14290D8173L46955G2436J12888a6749I00427A52025
17116C28502j51853L41211n9805j90831J54925R7558j33374j92754K41605F5382
17105A45487K77909a24657C11985P5418Q9773A58206M31355k33449J97163l1871
17095E21404K5624J38437B85384R2117j53289J4056L95874k74064L22447C04162
$$ plain form
17084 840272 200282 695841 334288 442465 468556 220233 380226 209191 594613 411002
17074 411002 488171 619456 56524 889744 486978 502623 410291 580673 548447 427285
17064 427285 450822 569393 323523 652382 602392 481510 911644 592734 738099 293263
17053 497599 736438 398825 763445 629057 504133 393270 118343 594624 519794 717313
17043 717313 768249 612533 575731 435466 892857 718724 653766 517638 614047 722298
17033 722298 656838 803019 558699 588238 574859 912769 858288 596042 665115 529079
17023 529079 837264 584814 684616 847762 874176 554032 551171 1014471 461256 673761
17013 673761 530677 599602 554888 843800 532617 712655 640059 834724 648801 684235
$$ packed form
17084H40272B00282M95559C34288J08177K6091B20233J59993j71035L85422j83611
17074D11002P7169J31285E6524Q33220m02766J5645r2332J70382l2226j21162
17064D27285K3537J18571k45870L28859m9990j20882M30134l18910J45365B93263
17053D97599K38839l37613L64620j34388j24924j10863A18343M76281p4830J97519
17043G17313N0936j55716l6802j40265M57391j74133o4958j36128R6409J08251
17033G22298o5460J46181k44320K9539j3379L37910n4481k62246O9073j36036
17023E29079L08185k52450R9802J63146K6414l20144k861M63300D61256K12505
17013F73761j43084O8925m4714K88912l11183J80038p2596J94665j85923L5434
$$ plain form
17003 684235 791613 742722 829903 1003342 588680 984643 983775 593888 871264 939759 501376
16992 501376 554862 706442 1150360 938559 998101 1011285 767067 1011982 966597 765425
16982 765425 721663 804745 980508 765826 1297310 1013047 716798 634299 1059172 1135783
16972 1135783 864641 840876 1082248 896134 1305681 1042603 1019567 824759 793189 907331
16962 907331 966602 1096768 1037108 988933 1200807 1313606 1361069 1266316 946853 1065539
16952 1065539 1116206 924894 1100653 1324620 1225926 1147096 1218658 1157657 1308987 1165509
16942 1165509 1225352 1008138 1160173 972245 1358650 1453898 1193228 1179528 1389011 1535190
16932 1535190 1637097 1321378 1492353 870472 1349205 1279731 1321654 1625725 1270593 1292444
$$ packed form
17003F84235J07378m8891Q7181J73439m14662L95963q68l89887K77376O8495m38383
16992E01376N3486J51580M43918k11801N9542J3184k44218K44915m5385k01172
16982G65425m3762Q3082J75763k14682N31484k84263k96249q2499M24873P6611
16972A135783k71142k3765K41372j86114M09547k63078k3036j94808l1570J14142
16962I07331N9271J30166n9660m8175K11874J12799M7463r4753l19463J18686
16952A065539N0667j91312J75759K23967r8694p8830P1562o1001J51330j43478
16942A165509N9843k17214J52035j87928L86405R5248k60670j3700K09483J46179
16932A535190J01907l15719J70975o21881M78733o9474M1923L04071l55132K1851
$$ plain form
16922 1292444 1730256 1594417 1621937 1162998 1712626 1806002 1365758 1563558 1735805 1697656
16912 1697656 1734279 1275423 1704154 1810017 1928411 1465624 1836511 1933461 1746699 2139380
16902 2139380 2001421 1786041 1773858 1668991 1808716 1753612 1932672 2131575 1844633 2105866
16892 2105866 2062659 2323433 2021951 2479157 2336576 2454801 2165161 2294824 1973981 2114030
16882 2114030 2366412 2147108 2520471 2306579 2588397 2330071 2335371 2497051 2280911 2497338
16872 2497338 2860398 2907115 2114372 2666917 3167059 2640844 2989473 2590406 2725729 2666668
16862 2666668 2787616 3129215 3236108 3322669 3261858 3474097 3418959 3424983 3307372 3239216
16852 3239216 3222053 3352201 3473293 3780615 4061243 3964263 3853212 3754998 4014052 4075319
$$ packed form
16922A292444M37812j35839K7520m58939N49628R3376m40244J97800J72247l8149
16912A697656L6623m58856M28731J05863J18394m62787L70887R6950j86762L92681
16902B139380j37959k15380j2183j04867J39725n5104J79060J98903k86942K61233
16892B105866m3207K60774l01482M57206j42581J18225k89640J29663l20843J40049
16882B114030K52382k19304L73363k13892K81818k58326N300J61680k16140K16427
16872B497338L63060M6717p92743N52545N00142n26215L48629l99067J35323n9061
16862B666668J20948L41599J06893Q6561o0811K12239n5138O024j17611o8156
16852C239216j7163J30148J21092L07322K80628r6980j11051r8214K59054O1267
$$ plain form
16842 4075319 4258376 3919151 4185277 4345684 4118805 4235020 4146746 4102052 4718503 4585051
16832 4585051 4665603 4570705 4719505 5152596 5199702 5279235 5196401 5603188 5643785 5491470
16822 5491470 5733682 5718715 5807688 6007516 6170300 6173352 6499292 6295724 6621453 6848393
16812 6848393 7114166 6964798 6944005 7251235 7438171 7821978 7973754 8360210 7954362 8195574
16802 8195574 8599969 8737864 8627870 9325275 9337869 9457260 9612190 9995044 10180295 10886540
16792 10886540 10989125 10977780 11532580 11997688 11701953 12390343 12558381 12797754 13527390
16783 13527390 13657451 14382200 14568095 15151199 15587282 16076990 16467793 17172080 17682949
16774 17682949 17953015 18961607 19384285 20336806 20942802 21535377 22486977 23314601 24207954
$$ packed form
16842D075319J83057l39225K66126J60407k26879J16215q8274m4694O16451j33452
16832D585051Q0552r4898J48800M33091M7106P9533q2834M06787M0597j52315
16822E491470K42212j4967Q8973J99828J62784L052L25940k03568L25729K26940
16812F848393K65773j49368k0793L07230J86936L83807J51776L86456m05848K41212
16802H195574M04395J37895j09994O97405J2594J19391J54930L82854J85251P06245
16792A0886540J02585j1345N54800M65108k95735O88390J68038K39373P29636
16783A3527390J30061P24749J85895N83104M36083M89708L90803P04287N10869
16774A7682949K70066J008592M22678R52521O05996N92575R51600Q27624Q93353
$$ plain form
16765 24207954 24863817 25944440 27071779 28020700 29218378 30272810 31430687 33032503
16757 33032503 34501348 35756867 37070686 39264098 40870645 42842119 44942115 46969306
16749 46969306 48915117 51669032 54373330 56958670 59735360 62892603 66205960 69723392
16741 69723392 73533427 77523408 81789281 85815008 90563321 95669240 100998222 106423289
16733 106423289 112125088 117809810 123857939 129590712 135914388 142001302 148336271 153777351
16725 153777351 158966914 163688809 168100571 171885720 174755103 176455485 177204835 177652211
16717 177652211 176675857 174897079 172129833 168417219 164529715 159670535 154667938 148830729
16709 148830729 142869217 136676370 130481741 124108324 118178250 112092922 106287195 100741316
$$ packed form
16765B4207954O55863J080623J127339R48921J197678J054432J157877J601816
16757C3032503J468845J255519J313819K193412J606547J971474K099996K027191
16749D6969306J945811K753915K704298K585340K776690L157243L313357L517432
16741F9723392L810035L989981M265873M025727M748313N105919N328982N425067
16733A06423289N701799N684722O048129N732773O323676O086914O334969N441080
16725A53777351N189563M721895M411762L785149K869383J700382P49350M47376
16717A77652211r76354j778778k767246l712614l887504m859180n002597n837209
16709A48830729n961512o192847o194629o373417n930074o085328n805727n545879
$$ plain form
16701 100741316 95553018 90313656 85278403 80878518 76854650 72834524 68629605 65151949
16693 65151949 61914767 58656079 55891565 53187774 50390116 48002277 45567605 43667578
16685 43667578 41355744 39629158 37733922 36221001 34885166 33387026 31885397 30395609
16677 30395609 28998368 28089680 27161181 26213604 24786401 24137778 23295740 22343680 21477366
16668 21477366 20680694 20186940 19426657 18914363 18065691 17530937 17043662 16509184 15799405
16659 15799405 15279292 15321902 14467461 14127583 13710928 13283826 12779895 12303468 12441234
16650 12441234 11993811 11423304 11149925 10622911 10763309 10364905 9927565 10244985 9416033
16641 9416033 9512477 8815796 8967831 8657506 8304162 8205709 7838717 7996573 7251924 7367338
$$ packed form
16701A00741316n188298n239362n035253m399885m023868m020126m204919l477656
16693F5151949l237182l258688k764514k703791k797658k387839k434672j900027
16685D3667578k311834j726586j895236j512921j335835j498140j501629j489788
16677C0395609j397241r08688r28499r47577j427203o48623q42038r52060q66314
16668B1477366p96672m93754p60283n12294q48672n34754m87275n34478p09779
16659A5799405n20113M2610q54441l39878m16655m27102n03931m76427J37766
16650A2441234m47423n70507k73379n27014J40398l98404m37340L17420q28952
16641I416033R6444o96681J52035l10325l53344r8453l66992J57856p44649J15414
$$ plain form
16631 7367338 7022942 7083605 6832766 6654579 6453148 6812298 6289830 6256198 6351990 5778122
16621 5778122 5867931 6069729 5690337 5511362 5434362 5206120 5321998 5039866 5098263 4834521
16611 4834521 4715997 5130247 4616778 4385909 4438830 4530836 4407095 4184789 4133108 4165384
16601 4165384 4282078 3820827 3912415 3888934 3815212 3772617 3705976 3334877 3676026 3602424
16591 3602424 3341273 3379160 3301160 3559782 3165826 3277412 2993916 2859157 3290993 2972041
16581 2972041 2790123 2793854 2709034 2662711 2817161 2764537 2585460 2413837 2467322 2474728 2408878
16570 2408878 2373620 2738390 2391733 2320985 2621111 2333532 2242664 1947101 2001054 2324215
16560 2324215 2130730 2103240 2290381 1917756 2148899 1803590 2240150 2040451 2012937 1850914
$$ packed form
16631G367338l44396O0663k50839j78187k01431L59150n22468l3632R5792n73868
16621E778122Q9809K01798l79392j78975p7000k28242J15878k82132N8397k63742
16611D834521j18524M14250n13469k30869N2921R2006j23741k22306n1681L2276
16601D165384J16694m61251R1588k3481p3722m2595o6641l71099L41149p3602
16591C602424k61151L7887p8000K58622l93956J11586k83496j34759M31836l18952
16581B972041j81918L731q4820m6323J54450n2624j79077j71623N3485P406o5850
16570B408878l5258L64770l46657p0748L00126k87579r0868k95563N3953L23161
16560B324215j93485k7490J87141l72625K31143l45309M36560j99699k7514j62023
$$ plain form
16550 1850914 1910115 1705379 1770331 1857822 1921616 2062395 1986715 1676114 1824878 1516530
16540 1516530 1864926 1556198 1768414 1454213 1667039 1516252 1481248 1369870 1505057 1508410
16530 1508410 1509559 1617052 1451031 1244622 1452574 1441704 1174052 937146 1203460 1320801
16520 1320801 1335358 1247794 1726584 1367450 1335286 1375899 1389165 1107626 1278095 1349499
16510 1349499 1282054 1092150 1060080 1334127 987617 1045905 1232209 1367365 1379722 1225207
16500 1225207 762296 1371192 1183857 1308818 934185 1277959 1219692 998740 1137800 1018336
16490 1018336 971095 1314421 1170581 742331 1262239 1261609 1053973 996761 756615 1011722
16480 1011722 980273 493648 736166 1017257 669518 932115 942380 1100281 938766 877311
$$ packed form
16550A850914N9201k04736O4952Q7491O3794J40779p5680l10601J48764l08348
16540A516530L48396l08728K12216l14201K12826j50787l5004j11378J35187L353
16530A508410J149J07493j66021k06409K07952j0870k67652k36906K66314J17341
16520A320801J4557q7564M78790l59134l2164M0613J3266k81539J70469P1404
16510A349499o7445j89904l2070K74047l46510N8288J86304J35156J2357j54515
16500A225207m62911O08896j87335J24961l74633L43774n8267k20952J39060j19464
16490A018336m7241L43326j43840m28250N19908o30k07636n7212k40146K55107
16480A011722l1449m86625K42518K81091l47739K62597J0265J57901j61515o1455
$$ plain form
16470 877311 678465 900195 802453 991980 823832 1031536 749781 912452 743524 787428
16460 787428 687340 775996 1035572 408112 1014120 677273 592175 670431 763376 807518
16450 807518 874898 575797 492112 722736 514332 1117900 657738 884131 556730 561833
16440 561833 1101416 878300 892143 823729 752204 708945 658017 767184 830541 554843 892486
16429 892486 411834 773531 607453 479822 680869 734827 526227 868750 119686 718070
16419 718070 591167 608766 172385 510953 1067885 547611 596381 696214 677437 350929
16409 350929 499653 779040 506285 481310 777964 704508 551499 537509 310514 93825
16398 691853 478372 463251 177517 503594 658879 194229 437523 232026 522072 354404
$$ packed form
16470H77311j98846K21730r7742J89527j68148K07704k81755J62671j68928M3904
16460G87428j00088Q8656K59576D08112O06008l36847q5098P8256R2945M4142
16450H07518O7380k99101q3685K30624k08404O03568m60162K26393l27401N103
16440E61833N39583k23116J3843o8414p1525m3259n0928J09167O3357k75698L37643
16429H92486D11834L61697j66078j27631K01047N3958k08600L42523A19686N98384
16419G18070j26903J7599A72385L38568N56932n20274M8770R9833j8777l26508
16409C50929J48724K79387k72755k4975K96654p3456j53009j3990k26995I3825
16398F91853k13481j5121A77517L26077J55285A94229K43294k05497K90046j67668
$$ plain form
16388 354404 455427 348127 528997 714491 428946 248794 559131 408157 374810 726481
16378 726481 460652 640276 497718 434616 -80298 852807 396144 494933 566673 666962
16368 666962 181412 311648 636784 60843 175814 639355 218121 388428 483510 482251
16358 482251 378896 255380 362405 564451 -83906 371787 183622 10977 559679 407203
16348 407203 322246 327123 269892 298085 183117 300041 483021 330519 460404 449270 223957
16336 139101 129801 646021 683917 277285 341446 564086 378285 324408 477911 596729
16326 596729 361656 -222398 -12329 187031 506230 296734 246376 -137257 171244 350474
16316 350474 271841 45828 159950 759402 186854 251282 315388 72364 234189 204920 148603
$$ packed form
16388C54404J01023j07300J80870J85494k85545j80152L10337j50974l3347L51671
16378G26481k65829J79624j42558o3102h0298H52807C96144R8789P1740J00289
16368F66962A81412J30236L25136F0843J14971M63541B18121J70307R5082j259
16358D82251j03355j23516J07025K02046h3906C71787A83622A0977N48702j52476
16348D07203q4957M877n7231K8193j14968J16924J82980j52502J29885j1134B23957
16336A39101r300N16220L7896B77285O4161K22640j85801n3877J53503J18818
16326E96729k35073b22398a2329A87031L19199k09496n0358a37257A71244J79230
16316C50474p8633D5828J14122N99452A86854O4428O4106G2364J61825k9269n6317
$$ plain form
16305 148603 181635 253154 439093 272739 324198 412417 466717 424593 93034 286947 174572
16294 174572 -113013 299625 374134 408801 331822 74641 250080 -69252 257169 204174 207920
16283 207920 202887 263546 339121 205039 216914 365112 343786 78747 112420 258691 380895
16272 380895 279343 -1575 119733 414854 153883 30249 280479 350588 170995 318094
16262 318094 294957 -68855 287546 151988 -67548 179358 -73554 112793 20439 422498
16252 422498 22300 160966 338591 43035 523 -64336 330373 103442 124950 202511 117871
16241 117871 -24877 20465 239134 166335 -149844 262998 175067 226515 -115276 12721 -182775
16229 -58349 70767 246062 261051 214899 491308 471384 -132841 117222 -62280 3329 46232
$$ packed form
16305A48603L3032P1519J85939j66354N1459Q8219N4300m2124I3034J93913j12375
16294A74572a13013B99625P4509L4667p6979G4641J75439f9252B57169n2995L746
16283B07920n033O0659P5575j34082J1875J48198k1326G8747L3673J46271J22204
16272C80895j01552a575A19733K95121A53883C0249K50230P0109A70995J47099
16262C18094k3137f8855B87546j35558f7548A79358g3554A12793B0439M02059
16252D22498B2300J38666J77625D3035E23f4336C30373A03442K1508P7561q4640
16241A17871b4877B0465K18669p2799a49844B62998q7931N1448a15276A2721a82775
16229e8349G0767J75295J4989m6152K76409j9924a32841A17222f2280C329M2903
$$ plain form
16218 46232 440876 143995 184104 183817 -150251 230780 -68517 527620 114132 165944 263701
16207 263701 39606 -58775 44560 -39865 366570 -6197 -78144 436375 193874 198502 534882
16196 534882 64429 235629 19038 -104471 -53615 123062 50485 286246 8751 164105 131873
16185 131873 148280 216608 -10967 -21182 117471 82214 112229 148757 238337 216427 380759
16174 380759 78604 381797 207323 83478 299268 -114811 89116 197156 -91043 131890
16163 -136067 -143403 169415 -33941 87553 122331 137879 -9055 286732 -308989 -30905 160590
16151 -13851 -46835 240400 32237 385298 89648 125635 -139425 -172254 185568 23734 212597
16140 212597 413279 -135859 -16795 297069 153047 99279 -202832 -87670 36761 109705
$$ packed form
16218D6232L94644A43995M0109k87a50251B30780f8517E27620A14132N1812R7757
16207B63701C9606e8775D4560c9865C66570f197p1947D36375A93874M628L36380
16196E34882F4429J71200A9038a04471N0856A23062E0485K35761H751J55354l2232
16185A31873J6407O8328a0967j0215A17471l5257L0015L6528Q9580k1910J64332
16174C80759G8604L03193j74474H3478K15790a14811H9116J08040i1043A31890
16163a36067p336A69415c3941H7553L4778J5548i055B86732c08989c0905A60590
16151a3851l2984B40400C2237L53061H9648L5987a39425l2829A85568B3734J88863
16140B12597K00682a35859a6795B97069j44022n3768b02832h7670C6761P2944
$$ plain form
16130 109705 88874 78630 -38414 325137 -66372 -279736 264340 88800 308767 163161
16120 163161 -84321 -65995 288463 -234148 136526 -161517 48141 88085 228208 39074
16109 -28522 422422 43406 -294584 -154016 283573 52250 149136 401813 320252 367482 50464
16097 170726 50065 149700 464631 -51076 5215 -144013 -142579 261006 130191 108328 -58040
16085 -224317 -301 -134462 -9856 -18741 -130961 -313921 -31542 84862 163505 -25051 -119809 -175682
16073 -175682 -145544 -22403 -138150 -27394 -10752 -157834 51426 -53844 235098 118430 -5772
16061 262996 89588 359873 333411 150524 -47080 100902 38814 111748 -54465 -35962 -144470
16050 -144470 274832 109939 -306065 49610 73047 259130 -217941 98541 -82944 -103586
$$ packed form
16130A09705k0831j0244c8414C25137f6372k13364B64340H8800K19967j45606
16120A63161h4321J8326B88463b34148A36526a61517D8141L9944J40123C9074
16109b8522D22422D3406b94584J40568B83573E2250R6886K52677q1561M7230E0464
16097A70726E0065R9635L14931e1076E215a44013J434B61006A30191k1863e8040
16085b24317c01j34161i856q885j12220j82960c1542H4862P8643b5051r4758n5873
16073a75682L0138b2403j15747b7394a0752j47082E1426e3844B35098j16668e772
16061B62996H9588K70285k6462A50524d7080A00902C8814P2934e4465J8503j08508
16050a44470B74832A09939c06065D9610K3437J86083b17941I8541h2944k0642
$$ plain form
16040 -103586 113264 -22921 197293 175902 52036 82200 108995 117989 86068 -177737 58409
16028 -173003 -36210 197322 -191074 227040 -175834 -45304 527522 -120830 -331346 -312199
16018 -312199 -368067 129590 92318 10016 187802 -227782 151925 94766 -19019 83416 -260904
16006 -157397 167623 187770 -83240 -253749 126023 53949 -351810 170846 -335511 -36443
15995 17627 -112408 107007 29282 272773 -53208 187488 30849 66210 259609 144947
15985 144947 -98332 -110911 72924 112734 9872 92696 234533 -7449 -294121 -27926 160008
15973 -50757 -285276 36599 -204161 159683 112252 -245403 209237 -72434 -112774 98371 -48348
15961 90593 -1375 -14155 298685 125895 25698 91244 96005 -262788 -161188 5034 219008
$$ packed form
16040a03586A13264b2921A97293k1391E2036L0164K6795Q994l1921a77737E8409
16028a73003c6210A97322a91074B27040a75834d5304E27522a20830k10516J9147
16018c12199n5868A29590l7272A0016J77786b27782A51925n7159a9019H3416b60904
16006a57397A67623K0147h3240j70509A26023E3949c51810A70846c35511c6443
15995A7627a12408A07007B9282K43491e3208A87488C0849L5361J93399j14662
15985A44947i8332j2579G2924L9810I872Q2824J41837g449k86672b7926A60008
15973e0757k34519C6599b04161A59683m7431b45403B09237g2434m0340I8371d8348
15961I0593a375j2780B98685A25895B5698O5546M761b62788J01600E034K13974
$$ plain form
15950 219008 -189732 106489 71797 -30613 -2972 -175065 -81384 218948 -114046 40801 149458
15939 149458 -125772 -49217 -107205 -307231 -50603 134455 -121337 190953 208083 -66046
15928 68588 66548 50222 146274 129152 164695 -101935 95793 -55759 135900 -163361 15792
15916 -207657 -317955 190733 167517 17473 209964 -172169 -133011 60092 -298013 61554
15905 208510 -92170 127005 186081 70289 55938 -264580 227330 -143175 -71044 67654 171810
15894 171810 -330703 -94997 -23416 256610 -161049 -373279 52184 -39441 -112894 -196050 -20104
15882 -20175 -78770 248692 183231 145731 -4591 -178146 -112494 14365 -18944 -367189 -117385
15870 122264 -204264 -253109 -124749 -112696 -54834 328222 -335874 -129390 -191429 -119871
$$ packed form
15950B19008a89732A06489l4692c0613b972j72093h1384B18948a14046D0801J08657
15939A49458a25772d9217n7988k00026e0603A34455a21337A90953J7130f6046
15928F8588k040j6326R6052j7122L5543a01935I5793e5759A35900a63361A5792
15916b07657j10298A90733k3216A7473J92491a72169L9158F0092b98013F1554
15905B08510i2170A27005N9076G0289j4351b64580B27330a43175g1044F7654J04156
15894A71810c30703i4997b3416B56610a61049k12230E2184c9441p3453q3156b0104
15882b0175n8595B48692o5461l7500d591j73555O5652A4365a8944l48245a17385
15870A22264b04264m8845a24749J2053e4834C28222c35874a29390o2039P1558
$$ plain form
15860 -119871 -33021 -208537 425414 58343 -244771 -286639 6151 239498 97196 -62594 -142828
15849 -142828 340082 -123018 185355 -258924 -33676 -71967 -114437 -21311 -60995 146060
15838 39239 -389915 -164243 109955 34642 70455 331962 51075 -99698 -120725 -342973 9032
15826 -161230 -41086 -32047 -218803 7162 -550403 158494 5805 -74911 -250378 -12732 128011
15814 -153907 -182928 -103030 -144668 -178518 11138 114560 -235326 217392 -7654 118055 -125430
15802 45868 -84573 -170901 30451 221796 -3952 -148668 -156900 -2195 -242270 39945 63180 167188
15790 167188 -306478 -272294 -24160 -35055 -28467 -117514 -49951 -261264 -213908 139434 -236250
15778 10582 -3433 87062 -186741 -150471 -4226 77158 341012 -39796 234454 -115718 20149
$$ packed form
15860a19871c3021j75516D25414E8343b44771m1868F151K33347I7196f2594q0234
15849a42828C40082a23018A85355b58924c3676l8291m2470b1311l9684A46060
15838C9239c89915a64243A09955C4642L5813K61507E1075i9698k1027k22248I032
15826a61230d1086R039j86756G162e50403A58494E805g4911j75467a2732A28011
15814a53907k9021P9898m1638l3850A1138J03422b35326B17392g654A18055a25430
15802D5868h4573q6328C0451J91345c952j44716q232b195k40075C9945K3235J04008
15790A67188c06478L4184b4160j0895O588q9047d9951k11313M7356A39434b36250
15778A0582c433H7062a86741L6270d226G7158K63854c9796B34454a15718B0149
$$ plain form
15766 101819 -52285 170405 -109366 -78812 62451 -73933 -133401 197432 -166515 108737
15755 363465 209632 -162136 -19439 157221 -211687 -169826 154596 85516 -143599 302984
15744 -172985 -46419 44609 54872 -37740 107542 -7267 -48297 -23683 71839 -84885 -155677
15733 -155677 -171283 77532 245301 -413047 -117199 220326 -54525 -224841 -239307 115103
15722 -248860 -364663 -164381 40610 -232918 -31349 156416 -426785 -68694 -64906 -84416 166855
15710 -10902 122808 32247 26185 -74660 -136879 357974 89977 73696 158252 -329647 -156583
15698 -136958 29905 -317692 -187860 272558 22026 74594 -138770 194244 120235 42952
15687 126173 397782 -220394 -134902 -196968 -323753 206053 -13602 -90855 198915 33490
$$ packed form
15766A01819e2285A70405a09366L0554F2451g3933n9468A97432a66515A08737
15755C63465j53833a62136a9439A57221b11687M1861A54596o9080a43599C02984
15744a72985d6419D4609J0263c7740A07542g267m1030b3683G1839h4885p0792
15733a55677j5606G7532J67769d13047a17199B20326e4525j70316j4466A15103
15722b48860j15803a64381D0610b32918c1349A56416d26785f8694L788j9510A66855
15710a0902A22808C2247o062g4660o2219C57974H9977j6281Q4556c29647a56583
15698a36958B9905c17692J29832B72558B2026N2568a38770A94244p4009D2952
15687A26173K71609b20394Q5492o2066j26785B06053a3602p7253A98915C3490
$$ plain form
15676 36840 5256 -102248 136190 -247849 68410 -106999 191729 -149093 -69564 46742 -69834
15664 272225 -231902 26514 -161123 95460 -1214 200287 -490257 -127395 21226 256642
15654 256642 249819 95744 -117518 187343 -117642 -35209 38297 340797 211180 -117302
15643 -58823 65857 137941 229965 -290824 317393 -117460 64884 -30126 43892 268388 225006
15632 225006 200936 -24462 221884 65076 2371 -237636 14746 150646 -35448 -282331 290160
15620 53031 160558 23006 -95805 -254143 335032 -92329 -46438 62354 164731 -40401 -92451
15609 -92451 -16581 118315 -8550 -197939 -232119 126417 -305586 -429399 -94390 60241 -101907
15597 -109119 -176865 43927 -262834 92593 -415275 -47281 -106952 209372 -288216 66480 3255
$$ packed form
15676C6840E256a02248A36190b47849F8410a06999A91729a49093f9564D6742f9834
15664B72225b31902B6514a61123I5460a214B00287d90257a27395B1226K35416
15654B56642o823I5744a17518A87343a17642c5209C8297L02500j29617a17302
15643e8823F5857P2084R2024b90824C17393a17460F4884c0126D3892K24496m3382
15632B25006k4070b4462B21884F5076B371b37636A4746J35900c5448k46883B90160
15620E3031J07527B3006i5805j58338C35032i2329M5891F2354J02377d0401n2050
15609i2451a6581A18315h550j89389l4180A26417c05586j23813i4390F0241a01907
15597a09119o7746D3927b62834I2593d15275d7281n9671B09372b88216F6480C255
$$ plain form
15585 317792 -321367 257616 -264870 -47832 -49693 -130162 162259 110283 315255 -253128
15574 -284140 190231 -93370 -345731 -166227 337826 -138162 -78887 -125402 -202711 361778
15563 -164417 -219989 20318 341533 -102994 92594 129292 -187019 170064 512488 -198185
15552 155190 -120238 13299 -41137 -114516 -112459 -26804 -54702 17913 -162064 -78441 -129020
15541 -129020 127618 -220926 116413 149731 159703 6553 -244822 255802 134976 21259 62086
15530 62086 -254092 -171760 -234057 -141583 43209 -114762 -343779 -255875 -174153 -27045 25555
15518 -107252 48208 -167962 35917 117412 -231007 -370055 -138263 -67567 257021 -204116
15507 26485 48750 -91806 -52614 -409164 157799 270592 19629 213139 7772 -83739 111580
$$ packed form
15585C17792c21367B57616b64870d7832j861q0469A62259n1976K04972b53128
15574b84140A90231i3370k52361a66227C37826a38162N9275m6515p7309C61778
15563a64417n5572B0318L21215a02994I2594L6698a87019A70064L42424a98185
15552A55190a20238A3299d1137p3379K057b6804k7898A7913a62064g8441n0579
15541a29020A27618b20926A16413L3318R972F553b44822B55802j20826B1259M0827
15530F2086b54092Q2332o2297R2474D3209a14762k29017Q7904Q1722b7045B5555
15518a07252D8208a67962C5917Q1495b31007j39048a38263f7567B57021b04116
15507B6485K2265i1806L9192l56550A57799J12793A9629J93510G772h3739A11580
$$ plain form
15495 -42511 3100 -80701 -110623 -309646 -26888 205264 171739 80478 48748 126196 230525
15484 230525 124714 118468 119947 47575 129396 85823 54820 44213 32317 89383 226022
15473 226022 -72592 171204 -178468 -273818 -33079 71613 93891 378664 354338 220607 -279508
15461 46440 61527 -146993 -140471 -1257 133624 -326617 -165193 240153 -177440 68358 -49433
15449 -146399 342740 -21118 42707 132754 -10722 -144412 -88765 -60480 -60386 184904 54453
15437 -96417 -16157 23068 83270 41482 31020 -43455 205098 -33820 163511 1478 -112543
15425 -147786 -108412 176332 -169459 129369 -166401 34144 65237 442002 34945 -145313
15414 255 -105599 81689 -124643 -119624 -42551 412293 193258 -165101 252904 -206597 112091
$$ packed form
15495d2511C100h0701k9922j99023b6888B05264l3525H0478l1730P7448J04329
15484B30525j05811o246J479D7575Q1821m3573l1003j0607j1896N7066J36639
15473B26022g2592A71204a78468r5350c3079G1613K2278K84773k4326j33731b79508
15461D6440J5087a46993O522a257A33624c26617J61424B40153a77440F8358d9433
15449a46399C42740b1118D2707R0047a0722j33690N5647K8285R4A84904E4453
15437i6417a6157B3068O0202D1482j0462d3455B05098c3820A63511A478a12543
15425a47786L9374A76332a69459A29369a66401C4144L1093L76765C4945a45313
15414B55a05599H1689a24643N019d2551D12293A93258a65101B52904b06597A12091
$$ plain form
15402 -331458 86312 -74011 62358 574368 69363 -31445 39246 101421 -12586 122355 -262382
15390 -4995 13844 -230250 160855 -40558 -32685 193361 26586 37078 11599 45178 -345983
15378 -155595 -264187 133178 66479 -264569 -184151 -112417 -113834 370056 397803 29876 -152436
15366 64141 -49294 -216309 -150115 -44659 -25155 -167014 32226 -309700 165655 415491 -100533
15354 172750 -157827 -217728 136113 -335864 119527 -77737 50305 155615 381552 -95267
15343 -175990 278215 110882 91782 -25326 22634 -163205 -89854 -75758 227745 46978 68443
15332 68443 155041 97727 303266 -92746 216177 -173094 -48824 4111 205987 82694 19176
15320 -132688 355649 61278 189545 -138784 -281029 183031 285462 -29425 -166976 -323591
$$ packed form
15402c31458H6312g4011F2358N12010F9363c1445C9246O2175a2586A22355b62382
15390d995A3844b30250A60855d0558P873A93361B6586J0492A1599L3579c45983
15378a55595j08592A33178F6479b64569Q0418P1734j417C70056K7747B9876a52436
15366F4141d9294j67015O6194d4659J9504j41859C2226c09700A65655K49836a00533
15354A72750a57827n9901A36113c35864A19527g7737E0305J05310K25937i5267
15343a75990B78215A10882j9100b5326B2634a63205P3351J4096B27745D6978K1465
15332F8443Q6598n7314K05539i2746B16177a73094d8824D111K01876H2694A9176
15320a32688C55649F1278J28267a38784j42245A83031J02431b9425j37551j56615
$$ plain form
15310 -323591 89316 319540 -34892 -91124 436021 -18283 -30125 221585 -198831 -115597 -241625
15299 -241625 -143779 159332 -187378 128734 227050 -247030 55835 134080 84888 -101281
15288 -162302 -41010 -257687 29840 94846 88642 -24448 218774 387702 -77310 -141543 112081
15276 -76970 -148368 86789 37246 -45756 -366368 327771 398778 226698 142037 -5113 -42540
15265 -42540 271579 353795 -172749 179558 351502 32842 -223831 134376 162758 6943 134856
15254 134856 -437571 345249 356168 395385 224303 202106 221018 112752 -112925 257106
15243 320186 234101 -191712 281754 268759 94907 -208684 288245 308870 79413 285811
15233 285811 181646 -223005 8259 188678 -1112 -49775 118594 219091 -209004 191235
$$ packed form
15310c23591H9316K30224c4892n6232D36021a8283j1842B21585a98831Q3234j26028
15299b41625R7846A59332a87378A28734R8316b47030E5835P8245m9192a01281
15288a62302d1010k16677B9840O5006o204b4448B18774J68928g7310o4233A12081
15276g6970p1398H6789C7246d5756l20612C27771P1007j72080q4661e113l7427
15265d2540B71579Q2216a72749A79558J71944C2842b23831A34376K8382F943J27913
15254A34856d37571C45249J0919L9217j71082k2197J8912j08266a12925B57106
15243C20186q6085a91712B81754j2995I4907b08684B88245K0625G9413K06398
15233B85811j04165b23005H259J80419a112m8663A18594J00497b09004A91235
$$ plain form
15222 -161001 -101603 201040 218842 -100380 -151037 -309132 105188 -276650 166461 145283
15212 145283 -168099 -68782 97977 -8128 17521 126118 428986 170313 -287618 213589
15201 -249184 -113991 -177587 380781 502827 205274 35593 88217 -171791 117366 49837
15190 269587 46234 157509 99852 -42835 21182 518808 150035 -235669 154010 244424
15180 244424 -44193 -125354 110376 68480 -2074 40246 322885 -73319 -66950 -377651 269230
15168 223394 -36755 64500 -15762 -126400 -36253 -94291 110992 109440 311751 186529 323879
15157 323879 345378 -1764 -34742 28670 420697 227670 -62583 133776 -27858 235359 405300
15146 405300 108391 73240 -137947 -44816 -160406 276702 506249 134397 -238034 201527
$$ packed form
15222a61001N9398B01040J7802a00380n0657j58095A05188b76650A66461k1178
15212A45283a68099f8782I7977h128A7521J08597L02868A70313b87618B13589
15201b49184a13991o3596C80781J22046B05274C5593N2624a71791A17366D9837
15190B69587D6234J11275n7657d2835B1182M97626A50035b35669A54010R0414
15180B44424d4193q1161A10376m1896b074D0246K82639g3319O369l10701B69230
15168B23394c6755F4500a5762j10638c6253n8038A10992j552K02311j25222J37350
15157C23879K1499a764l2978B8670L92027j93027f2583A33776b7858B35359J69941
15146D05300A08391l5151a37947d4816j15590B76702K29547A34397b38034B01527
$$ plain form
15135 -83158 344930 106399 238336 394334 273398 253424 335856 -48135 325679 141638
15124 202322 245749 238726 296998 -36579 329718 409956 178273 -131575 -112821 143809 303170
15113 303170 120164 192665 87965 113013 19660 199885 172699 115880 127554 152298 -56020
15101 27508 -194401 -81000 316336 -199891 321501 6181 96894 257111 300160 -104733 184822
15089 -59598 -155065 64016 -18946 -278423 -61094 196260 256525 -1935 20471 175040 -19202
15077 -6409 89147 75507 147990 421230 164776 96231 87209 154762 194251 106071 294254
15066 294254 76955 37128 -12668 389912 301993 7250 88396 149503 197505 186425 110514
15055 110514 -29044 171029 330261 19070 243653 252327 87110 137753 154009 -3950 392723
$$ packed form
15135h3158C44930A06399J31937J55998j20936j9974Q2432d8135C25679A41638
15124B02322M3427p023N8272c6579C29718Q0238A78273a31575J8754A43809J59361
15113C03170A20164P2501H7965K5048A9660J80225k7186n6819J1674K4744e6020
15101B7508a94401h1000C16336a99891C21501F181R0713J60217M3049a04733A84822
15089e9598r5467F4016a8946k59477f1094A96260O0265a935B0471J54569a9202
15077f409H9147j3640P2483K73240A64776o8545r022O7553L9489q8180J88183
15066B94254G6955C7128a2668C89912q7919G250Q1146O1107M8002j1080p5911
15055A10514b9044A71029J59232A9070K24583Q674H7110N0643J6256c950C92723
$$ plain form
15043 318905 -80132 334773 -58202 194329 -269131 146767 -243085 544259 330025 13361
15032 371027 527285 124369 39712 131916 140653 127709 286975 252446 141424 377545 12531
15020 319047 522268 250174 34480 27740 117293 399436 -49589 6896 413607 303524 358750
15009 358750 -2542 406368 238269 225666 395453 -72185 398437 312628 362577 304292 562046
14998 562046 238005 182320 177574 -53472 136962 281661 258264 -77656 144334 -157142 231320
14986 -55414 77273 261299 288542 402928 409856 480435 227531 171253 372925 254159 306499
14975 306499 333149 388446 394926 322246 303449 80382 97208 400800 368781 401403 272723
14964 272723 125699 267781 285956 362487 273982 167522 -48668 170242 150191 -79914 299623
$$ packed form
15043C18905h0132C34773e8202A94329b69131A46767b43085E44259k14234A3361
15032C71027J56258A24369C9712R2204Q737j2944J59266l4529j11022K36121A2531
15020C19047K03221B50174C4480o740Q9553K82143d9589F896M06711j10083N5226
15009C58750b542D06368j68099j2603J69787g2185C98437q5809M9949n8285K57754
14998E62046B38005n5685m746e3472A36962J44699k3397g7656A44334a57142B31320
14986e5414G7273J84026K7243J14386O928P0579B27531n6278K01672j18766N2340
14975C06499K6650N5297O480p2680j8797H0382J6826L03592l2019L2622j28680
14964B72723A25699J42082J8175P6531q8505j06460d8668A70242k0051g9914B99623
$$ plain form
14952 523226 298182 365632 218224 399738 -88946 113391 334841 147564 365370 286062
14942 286062 724691 264727 178524 196774 390441 223270 200770 179467 265890 -50727 307635
14930 238263 89120 484265 255543 265027 269408 320689 335788 134379 478445 345688 390580
14919 390580 327888 603384 468667 176387 211441 439771 332663 278959 352267 304476
14909 304476 292176 463737 -115433 124392 437152 408555 527523 236977 466949 485872
14899 485872 332166 208369 359507 516870 299747 253142 390441 279194 620670 17503
14888 248562 248925 339765 265824 296343 653957 458717 478611 267022 520009 597230 -77843
14876 257999 473232 274439 376646 348803 333967 401607 558097 442562 124351 323997
$$ packed form
14952E23226k25044O7450j47408J81514h8946A13391K21450A47564K17806p9308
14942B86062M38629B64727q6203J8250J93667j67171k2500k1303Q6423e0727C07635
14930B38263H9120L95145k28722R484M381N1281J5099A34379L44066j32757M4892
14919C90580o2692K75496j34717A76387L5054K28330j07108n3704P3308m7791
14909C04476j2300J71561a15433A24392L12760k8597J18968B36977K29972J8923
14899D85872j53706j23797J51138J57363k17123m6605J37299j11247L41476A7503
14888B48562L63R0840p3941L0519L57614j95240J9894k11589K52987P7221g7843
14876B57999K15233j98793J02207k7843j4836O7640J56490j15535A24351J99646
$$ plain form
14866 323997 408663 233605 341827 317436 358500 619901 414153 636587 246640 363726
14856 363726 329768 465795 524608 565842 542386 391343 476348 225508 91958 78615 103722
14845 103722 452202 440141 466892 338171 408848 366751 459135 -61140 653953 352322 487827
14834 487827 405126 511823 602783 360995 71466 38283 659061 648550 590969 496744 1038983
14823 1038983 662301 590413 511565 432069 231829 697756 736031 667400 705069 753014 726050
14812 726050 508051 473139 578805 347482 596756 515049 560480 630918 655304 762199
14802 762199 768199 530104 577044 864714 612051 419196 468381 373464 525830 484786 461901
14791 461901 522601 713121 303111 177024 526422 549773 432283 483896 573521 558715
$$ packed form
14866C23997Q4666j75058J08222k4391M1064K61401k05748K22434B46640J17086
14856C63726l3958J36027N8813M1234k3456j51043Q5005B25508I1958j3343K5107
14845A03722L48480j2061K6751j28721P0677m2097R2384f1140F53953l01631J35505
14834D87827q2701J06697R0960k41788G1466l3183O20778j0511n7581r4225N42239
14823A038983l76682p1888p8848p9496k00240M65927L8275o8631L7669M7945k6964
14812G26050k17999l4912J05666k31323K49274q1707M5431P0438K4386J06895
14802G62199O000k38095M6940K87670k52663j92855M9185r4917J52366m1044k2885
14791D61901O0700J90520C03111j26087L49398K3351j17490N1613Q9625j4806
$$ plain form
14781 558715 559309 565653 546146 544052 702107 568686 986942 384219 707846 606519 580746
14770 580746 572733 597555 742378 588066 405670 846277 933456 835288 687219 638926 532452
14759 532452 660184 558460 454764 847728 565026 622662 464697 809137 778505 569487
14749 569487 652799 731174 980590 682712 884674 744353 968844 547834 686608 620300
14739 620300 743598 916605 1000174 364767 647815 608130 588347 798814 619881 831840
14729 831840 641125 812177 779858 1052299 1013977 733260 652191 427646 671074 718195
14719 718195 622265 901542 667357 851187 801504 848596 860172 852499 862672 659695 960486
14708 960486 522939 891098 952089 681205 761412 916457 1041251 746734 881195 1318398
$$ packed form
14781E58715N94O344j9507k094J58055j33421M18256C84219L23627j01327k5773
14770E80746q013K4822J44823j54312j82396M40607Q7179r8168j48069m8293j06474
14759E32452J27732j01724j03696L92964k82702N7636j57965L44440l0632k09018
14749E69487Q3312P8375K49416k97878K01962j40321K24491m21010J38774o6308
14739F20300J23298J73007Q3569C64767K83048l9685j9783K10467j78933K11959
14729H31840j90715J71052l2319K72441l8322k80717q1069k24545K43428M7121
14719G18195r5930K79277k34185J83830m9683M7092J1576p673J0173k02977L00791
14708I60486m37547L68159O0991k70884Q0207J55045J24794k94517J34461M37203
$$ plain form
14698 1318398 1084908 919666 807514 917890 852328 1033291 979343 959544 619759 1037135
14688 1037135 1330528 1354328 855473 944420 1261655 1064361 873731 1129329 1031289 954580
14678 954580 1353465 579099 1284436 1217843 1235456 1033472 1301462 984771 1057754 1135010
14668 1135010 869971 1095226 1080911 1201992 1221950 1190199 1159793 994937 1117756 1006225
14658 1006225 1190986 1401931 1009672 1273470 979950 1049644 1123093 1295530 1380095 1164699
14648 1164699 1135112 1276862 1422625 1318650 1217583 888872 1259738 1199195 1126022 1083252
14638 1083252 1475479 1412832 1382640 1285215 1559033 1266516 1154302 1110441 1416096 1262658
14628 1262658 1269890 1427464 1079287 1353309 1336003 1468336 1452064 1290161 1195754 1512579
$$ packed form
14698A318398k33490j65242j12152J10376o5562J80963n3948j9799l39785M17376
14688A037135K93393K3800m98855Q8947L17235j97294j90630K55598r8040p6709
14678I54580L98885E79099P05337o6593J7613k01984K67990l16691P2983P7256
14668A135010k65039K25255j4315J21081J9958l1751l0406j64856J22819j11531
14658A006225J84761K10945l92259K63798k93520O9694P3449J72437Q4565k15396
14648A164699k9587J41750J45763j03975j01067l28711L70866o0543p3173m2770
14638A083252L92227o2647l0192r7425K73818k92517j12214m3861L05655j53438
14628A262658P232J57574l48177K74022j7306J32333j6272j61903r4407L16825
$$ plain form
14618 1512579 1348950 1570105 1709275 1652398 1908947 1962954 1508344 1634968 1533065 1495681
14608 1495681 1480933 1586237 1703663 1954917 1795180 1932330 1285858 1700468 1581793 1527950
14598 1527950 1894569 1688282 1647230 1957237 1714006 1499031 2151502 1901268 1760801 1898708
14588 1898708 1830079 2006162 1841696 1944636 1774775 2090889 1880872 2037400 1977175 2260179
14578 2260179 2095535 1923746 2118320 1939152 2067862 2190461 2070409 2065746 2259498 2639454
14568 2639454 2338066 2419556 2719264 2456810 2286227 2626732 2139117 2951325 2955428 2733763
14558 2733763 3114761 3200401 3210461 3173260 3658002 3998676 4274110 4902553 6515855 8875989
14548 8875989 13890392 23014698 32718272 34910282 23056680 11192240 5440920 3580060
$$ packed form
14618A512579j63629K21155J39170n6877K56549N4007m54610J26624j01903l7384
14608A495681j4748J05304J17426K51254j59737J37150o46472M14610j18675n3843
14598A527950L66619k06287m1052L10007k43231k14975O52471k50234j40467J37907
14588A898708o8629J76083j64466J02940j69861L16114k10017J56528o0225K83004
14578B260179j64644j71789J94574j79168J28710J22599j20052m663J93752L79956
14568B639454l01388Q1490K99708k62454j70583L40505m87615Q12208M103k21665
14558B733763L80998Q5640J0060l7201M84742L40674K75434O28443J613302K360134
14548H875989N014403R124306R703574K192010j1853602A1192240E440920j860860
$$ plain form
14540 3580060 2623091 2220952 1880373 2082950 2300565 1966641 1972701 2010044 2259050 2103144
14530 2103144 2122325 2039414 2335906 2530362 2607305 2343439 2818731 2296113 2418049 2305779
14520 2305779 2533499 2845472 2256656 2643388 2890646 2751107 2660680 2445163 2825955 2486032
14510 2486032 3010595 3081947 2847456 2967780 2972558 2724566 3094965 3059391 3394508 3308824
14500 3308824 2980028 3161287 3571168 3192953 3422662 3160917 3247373 3625271 3237312 3528652
14490 3528652 3649837 3640005 3675165 3533828 3485003 3939996 3790317 4006226 4089588 3935641
14480 3935641 3723962 4035801 4024231 3941863 4060144 4104833 4335481 4178735 4451462 4484732
14470 4484732 4724368 4648265 4661109 4551129 4596255 4911372 4753142 4597876 4918262 4831045
$$ packed form
14540C580060r56969m02139l40579K02577K17615l33924O060L7343K49006j55906
14530B103144J9181q2911K96492J94456P6943k63866M75292n22618J21936j12270
14520B305779K27720L11973n88816L86732K47258j39539r0427k15517L80792l39923
14510B486032N24563P1352k34491J20324M778k47992L70399l5574L35117q5684
14500C308824l28796J81259M09881l78215K29709k61745Q6456L77898l87959K91340
14490C528652J21185r832L5160j41337m8825M54993j49679K15909Q3362j53947
14480C935641k11679L11839j1570q2368J18281M4689K30648j56746K72727L3270
14470D484732K39636p6103J2844j09980M5126L15117j58230j55266L20386q7217
$$ plain form
14460 4831045 4906869 5217271 5076082 5043269 5227829 5400621 5236823 5259856 5290858 5351246
14450 5351246 5620832 5594073 5849585 5801141 5728924 5891870 6115957 5783373 6195608 6246625
14440 6246625 6512874 6490401 6419305 6387293 6877244 6738141 7119997 7043383 7110646 6996237
14430 6996237 6975298 7560679 7263125 7359194 7735892 7882450 7813477 7802190 8301787 7988718
14420 7988718 8338701 8182076 8494871 8594220 8773979 8832782 8933759 9231094 9262442 9518163
14410 9518163 9261164 9594127 9798111 9471236 9881681 10140650 10381791 10485923 10831598
14401 10831598 10764072 10876590 10690533 11156499 11443343 11590111 11831061 12135237 12222572 12779349
14391 12779349 12292634 12505301 12985212 13116476 13650121 13501349 13600095 14408434 14747554
$$ packed form
14460D831045P5824L10402j41189l2813J84560J72792j63798K3033L1002O0388
14450E351246K69586k6759K55512m8444p2217J62946K24087l32584M12235N1017
14440F246625K66249k2473p1096l2012M89951j39103L81856p6614O7263j14409
14430F996237k0939N85381k97554R6069L76698J46558o8973j1287M99597l13069
14420G988718L49983j56625L12795R9349J79759N8803J00977K97335L1348K55721
14410I518163k56999L32963K03984l26875M10445K58969K41141J04132L45675
14401A0831598o7526J12518j86057M65966K86844J46768K40950L04176Q7335N56777
14391A2779349m86715K12667M79911J31264N33645j48772R8746Q08339L39120
$$ plain form
14382 14747554 14396402 14648640 15508957 15504541 15563557 15928259 16454451 16629022 16946905 17101497
14372 17101497 17586711 18028946 17979113 18484829 19054981 19652486 19835689 20268855 20889736
14363 20889736 21071996 21578740 22069820 22299157 23026855 23618928 24208352 24744950 24939319
14354 24939319 25753865 26050816 26832542 27412678 27973943 28726502 29561878 30184037 31027909
14345 31027909 31978788 32542979 33254159 34488919 35072124 36205296 36954557 38006258 39300656
14336 39300656 40524910 41698933 42771387 44173789 45470391 46479927 48351078 49755724
14328 49755724 51430287 52796963 55051671 56517768 58689973 60394776 62669773 64656954
14320 64656954 67105452 69463717 72018174 74854858 77691375 80244551 83448239 86804326
$$ packed form
14382A4747554l51152K52238Q60317m416N9016L64702N26192J74571L17883J54592
14372A7101497M85214M42235m9833N05716N70152N97505J83203M33166O20881
14363B0889736J82260N06744M91080K29337P27698N92073N89424N36598J94369
14354B4939319Q14546K96951P81726N80136N61265P52559Q35376O22159Q43872
14345C1027909R50879N64191P11180J234760N83205J133172P49261J051701J294398
14336C9300656J224254J174023J072454J402402J296602J009536J871151J404646
14328D9755724J674563J366676K254708J466097K172205J704803K274997J987181
14320F4656954K448498K358265K554457K836684K836517K553176L203688L356087
$$ plain form
14312 86804326 90078179 94076063 97763167 101528094 106058165 110489074 114992949 120099600
14304 120099600 125254197 130958950 137171400 143341049 150123704 157268673 164747880 172386438
14296 172386438 181099313 189729430 199163661 209097098 219532965 230466771 241923429
14289 241923429 253669526 266518915 279455377 292701196 306494645 320598418 335016246
14282 335016246 349683309 364228791 378789941 392861738 406482731 418837595 430378032
14275 430378032 440241734 448173083 451789512 451470779 449225640 447540076 448719504 447310824
14267 447310824 445537241 441561386 434534437 424665518 413505040 401104688 387742778
14260 387742778 373970266 359430011 344604565 329311119 314342269 299543017 285397450
$$ packed form
14312H6804326L273853L997884L687104L764927M530071M430909M503875N106651
14304A20099600N154597N704753O212450O169649O782655P144969P479207P638558
14296A72386438Q712875Q630117R434231R933437J0435867J0933806J1456658
14289B41923429J1746097J2849389J2936462J3245819J3793449J4103773J4417828
14282C35016246J4667063J4545482J4561150J4071797J3620993J2354864J1540437
14275D30378032R863702P931349L616429l18733k245139j685564J179428j408680
14267D47310824j773583l975855p026949r868919j1160478j2400352j3361910
14260C87742778j3772512j4540255j4825446j5293446j4968850j4799252j4145567
$$ plain form
14253 285397450 271626201 258450577 246017793 233942916 222407898 211667240 201063252
14246 201063252 191462221 182284879 173966667 165755448 158053699 150702562 143797246 137860347
14238 137860347 131464409 126139268 120577937 115496347 110401013 105865426 101643082 97707586
14230 97707586 93877758 90208726 86614869 83430969 80194790 77584251 74476575 71875737
14222 71875737 69640563 66587294 64401020 62682507 60634077 58556138 56528620 54859408
14214 54859408 53217453 51946869 50084881 48662065 46720444 45658464 44596527 43733319
14206 43733319 42526811 41013653 39747811 38751966 37630649 36998370 36534754 35101661
14198 35101661 33919021 33081324 32160955 31328597 30781198 29933674 29358751 28148006 27460098
$$ packed form
14253B85397450j3771249j3175624j2432784j2074877j1535018j0740658j0603988
14246B01063252r601031r177342q318212q211219p701749p351137o905316n936899
14238A37860347o395938n325141n561331n081590n095334m535587m222344l935496
14230I7707586l829828l669032l593857l183900l236179k610539l107676k600838
14222G1875737k235174l053269k186274j718513k048430k077939k027518j669212
14214E4859408j641955j270584j861988j422816j941621j061980j061937q63208
14206D3733319j206508j513158j265842r95845j121317o32279m63616j433093
14198C5101661j182640q37697r20369q32358n47399q47524n74923j210745o87908
$$ plain form
14189 27460098 27170340 26592665 25790900 25268383 24717535 24302606 23671476 23364318 22710886
14180 22710886 22034407 21486222 21172605 20766264 20010643 19996073 19446530 18895526 18358354
14171 18358354 18318398 17759722 17511936 17144475 16885410 16348418 16682994 16021668 15602242
14162 15602242 15330862 15258445 14956927 14654328 14377339 14547540 13670947 13819830 13261557
14153 13261557 12988650 12972414 12938540 12340530 11927350 12193228 11602427 11962179 11387252 11264781
14143 11264781 11113702 11390240 10875560 10915255 10491763 10386163 10191633 10103160 10071445 9609508
14133 9609508 9858982 9406089 9294024 8928172 9353825 8821776 8643692 8946578 8671594
14124 8671594 8516614 8195691 8448658 8089321 8004580 7863086 7746399 7561549 7742899 7713799
$$ packed form
14189B7460098k89758n77675q01765n22517n50848m14929o31130l07158o53432
14180B2710886o76479n48185l13617m06341p55621j4570n49543n51004n37172
14171A8358354l9956n58676k47786l67461k59065n36992L34576o61326m19426
14162A5602242k71380p2417l01518l02599k76989J70201q76593J48883n58273
14153A3261557k72907j6236l3874n98010m13180K65878n90801L59752n74927j22471
14143A1264781j51079K76538n14680L9695m23492j05600j94530q8473l1715m61937
14133I609508K49474m52893j12065l65852M25653n32049j78084L02886k74984
14124H671594j54980l20923K52967l59337q4741j41494j16687j84850J81350k9100
$$ plain form
14114 7713799 7328034 7062315 7311302 7112873 6853864 6847426 6787856 6609084 6925494 6600601
14104 6600601 6301501 6469080 6549315 6328060 6287089 6244881 5987256 5983748 5913029 5635446
14094 5635446 5645136 5648525 5726125 5715504 5658396 5483653 5314530 5382636 5175203 5100225 5311177
14083 5311177 5164561 5155450 4926347 4783145 5037251 4845009 5083407 4978535 4843172 4684042
14073 4684042 4846099 4752306 4735272 4408191 4534207 4152634 4498903 4412602 4263291 3950144
14063 3950144 4228033 4088272 3943207 4150668 4077930 4354393 4291837 3961237 4112704 4024643
14053 4024643 3873101 3937436 3781056 3502996 3724228 3814507 3469086 2989154 3534136 3427932
14043 3427932 3605200 3370595 3293002 3295842 3123007 3166768 3329458 3202398 3015199 3035198
$$ packed form
14114G713799l85765k65719K48987j98429k59009o438n9570j78772L16410l24893
14104F600601k99100J67579Q0235k21255m0971m2208k57625l508p0719k77583
14094E635446R690L389P7600j0621n7108j74743j69123O8106k07433p4978K10952
14083E311177j46616r111k29103j43202K54106j92242K38398j04872j35363j59130
14073D684042J62057r3793j7034l27081J26016l81573L46269q6301j49311l13147
14063C950144K77889j39761j45065K07461p2738K76463o2556l30600J51467q8061
14053D024643j51542O4335j56380k78060K21232R0279l45421m79932N44982j06204
14043C427932J77268k34605p7593K840j72835M3761J62690j27060j87199J9999
$$ plain form
14033 3035198 2936383 3232186 3068563 3104765 3076867 3015620 3204927 3044123 2681645 2766404
14023 2766404 2902481 3010954 2879978 2679048 3073959 2943707 2891744 2789028 2734219 2610211
14013 2610211 2842993 2358602 2601801 2351208 2429197 2441713 2444787 2353917 2344992 1920030 2353338
14002 2353338 2602691 2156197 2233980 2295264 2240444 2295320 2043983 2008285 2387754 2116384
13992 2116384 2231330 2730155 3010630 5039275 8521220 17215657 28099474 36457205
13984 36457205 27762499 16665460 9918076 6697401 5438716 4638808 3853959 3507493
13976 3507493 3477263 3220575 2844340 3223753 2915968 2502608 2669998 2585476 2499150 2570579
13966 2570579 2118930 2208377 2109950 2344362 2171514 2314366 2073158 2252246 2050252 2135645
$$ packed form
14033C035198r8815K95803j63623L6202k7898o1247J89307j60804l62478Q4759
14023B766404J36077J08473j30976k00930L94911j30252n1963j02716n4809j24008
14013B610211K32782m84391K43199k50593P7989J2516L074r0870q925m24962M33308
14002B353338K49353m46494P7783O1284n4820N4876k51337l5698L79469k71370
13992B116384J14946M98825K80475K028645L481945Q694437J0883817Q357731
13984C6457205q694706j1097039o747384l220675j258685p99908p84849l46466
13976C507493l0230k56688l76235L79413l07785m13360J67390q4522q6326P1429
13966B570579m51649Q9447r8427K34412j72848J42852k41208J79088k01994Q5393
$$ plain form
13956 2135645 1897523 2177632 2360497 2022185 1966224 1953056 1947045 1669016 1985554 2206931
13946 2206931 2051783 2079231 1866053 1776586 1876971 1932627 1779965 1898736 1896745 1462900
13936 1462900 1903586 1791169 1657836 1712927 1901770 1634985 1777107 1778911 1358722 1728120
13926 1728120 1546694 1738868 1566031 1971645 1686999 1461549 1766326 1723220 1796833 1699776
13916 1699776 1589752 1730377 1384137 1448651 1483302 1799505 1664551 1872251 1629760 1112916
13906 1112916 1008509 1327253 1440925 1364805 1626332 1264647 1571709 1247762 1510358 1649124
13896 1649124 1535486 1365506 1185556 1187721 1440574 1326183 1455353 1154062 1300481 1190532
13886 1190532 1330609 1178086 1199951 1512389 1044110 1056954 1327245 1239192 1368991 1284029
$$ packed form
13956B135645k38122K80109J82865l38312n5961j3168o011k78029L16538K21377
13946B206931j55148K7448k13178q9467J00385N5656j52662J18771j991m33845
13936A462900M40686j12417j33333N5091J88843k66785J42122J804m20189L69398
13926A728120j81426J92174j72837M05614k84646k25450L04777m3106P3613r7057
13916A699776j10024J40625l46240O4514L4651L16203j34954K07700k42491n16844
13906A112916j04407L18744J13672p6120K61527l61685L07062l23947K62596J38766
13896A649124j13638j69980j79950K165K52853j14391J29170l01291J46419j09949
13886A190532J40077j52523K1865L12438m68279J2844K70291q8053J29799q4962
$$ plain form
13876 1284029 1519293 1040577 1343189 893543 983240 1257386 1133760 1377426 1002508 1276382
13866 1276382 1019504 1238400 776923 1109409 922149 1328714 1325613 873954 1108168 1158968
13856 1158968 963084 1211623 1116368 949874 919507 1134649 830211 895232 1051445 1119165
13846 1119165 762229 1201575 1295011 984899 887254 1090065 1120718 983385 886741 969562
13836 969562 900375 836092 1165400 940406 901946 579066 1043447 939858 1240917 855620
13826 855620 951578 1201209 938147 916051 1068034 813962 923567 656689 816082 1245513
13816 1245513 719484 1079186 945957 890594 581167 641700 796798 914942 906897 857203
13806 857203 747692 665103 710409 783867 970302 874502 763610 991310 651695 884464
$$ packed form
13876A284029K35264m78716L02612m49646Q9697K74146j23626K43666l74918K73874
13866A276382k56878K18896m61477L32486j87260M06565l101m51659K34214N0800
13856A158968j95884K48539r5255j66494l0367K15142l04438O5021J56213O7720
13846A119165l56936M39346R3436l10112r7645K02811L0653j37333r6644Q2821
13836I69562o9187o4283L29308k24994l8460l22880M64381j03589L01059l85297
13826H55620R5958K49631k63062k2096J51983k54072J09605k66878J59393M29431
13816A245513n26029L59702j33229n5363l09427O0533J55098J18144q045m9694
13806H57203j09511q2589M5306P3458J86435r5800j10892K27700l39615K32769
$$ plain form
13796 884464 657392 655686 796700 693234 711638 649928 676635 634710 878335 574747 429608
13785 429608 887244 479625 746885 854834 435120 671000 724875 599945 671078 628318
13775 628318 777469 462808 1042075 792533 697783 766518 1064673 581034 575155 571052 642453
13764 642453 906226 516166 793653 649030 935450 302992 618778 866590 793644 569798
13754 569798 642376 396202 328091 531714 773040 731810 479057 620847 819592 796816
13744 796816 839663 654413 880511 775100 261841 944922 628585 703015 603730 811351
13734 811351 822001 705997 655305 250339 715244 796497 506959 470091 666189 879159
13724 879159 547839 562413 781544 548140 432078 660254 353791 608423 790436 479489
$$ packed form
13796H84464k27072j706J41014j03466J8404o1710K6707m1925K43625l03588j45139
13785D29608M57636m07619K67260J07949m19714K35880N3875j24930P1133m2760
13775F28318J49151l14661N79267k49542r4750O8735K98155m83639n879m103P1401
13764F42453K63773l90060K77487j44623K86420C02992L15786K47812p2946k23846
13754E69798P2578k46174o8111K03623K41326m1230k52753J41790J98745k2776
13744G96816M2847j85250K26098j05411B61841O83081l16337P4430r9285K07621
13734H11351J0650j16004n0692B50339M64905Q1253k89538l6868J96098K12970
13724H79159l31320J4574K19131k33404j16062K28176l06463K54632J82013l10947
$$ plain form
13714 479489 841986 658297 573642 328168 503575 726094 512230 389515 694634 496174
13704 496174 567649 542716 444676 785199 578633 599577 595695 542024 878340 636203 550627
13693 550627 751607 475593 495087 634719 457037 617192 479351 299021 400979 334891
13683 334891 349398 597127 442718 292243 341114 638811 527583 678506 649696 547875
13673 547875 570401 421585 382022 598201 448108 549703 708367 494327 329681 460061
13663 460061 481464 717532 459148 203069 301659 587108 378550 503964 583859 449337
13653 449337 743866 298373 274437 443844 387873 330561 556288 252401 294373 835392
13643 835392 450691 553280 386241 490119 452232 522130 532359 262173 363075 287887
$$ packed form
13714D79489L62497j83689q4655k45474J75407K22519k13864j22715L05119j98460
13704D96174P1475k4933r8040L40523k06566K0944l882n3671L36316k42137q5576
13693E50627K00980k76014J9494J39632j77682J60155j37841j80330J01958o6088
13683C34891J4507K47729j54409j50475M8871K97697j11228J50923k8810j01821
13673E47875K2526j48816l9563K16179j50093J01595J58664k14040j64646J30380
13663D60061K1403K36068k58384B03069R8590K85449k08558J25414P9895j34522
13653D49337K94529B98373k3936J69407n5971n7312K25727B52401M1972N41019
13643H35392l84701J02589j67039J03878l7887O9898J0229B62173J00902p5188
$$ plain form
13633 287887 204684 348091 387415 381198 413537 276428 374345 277528 106418 218512 445420
13622 445420 614587 512700 183169 367452 458923 333920 412699 347442 548339 415588
13612 415588 509921 310770 556816 240911 260824 471153 137458 343569 233443 495504
13602 495504 428079 617856 607810 481071 268179 301904 499713 371129 243584 404110
13592 404110 359511 268019 275160 240069 575593 535323 353715 469899 306796 298479 399713
13581 399713 290643 496974 477303 366311 241661 428605 46142 320452 454095 441844
13571 441844 352746 554413 409815 263782 608645 288691 -112433 197582 429506 470347
13561 470347 75858 468221 379386 398964 127254 -121287 259259 191678 269875 321055 179538
$$ packed form
13633B87887q3203J43407L9324o217L2339j37109R7917r6817A06418J12094K26908
13622D45420J69167j01887A83169J84283R1471j25003P8779o5257K00897j32751
13612D15588R4333j99151K46046B40911J9913K10329A37458K06111j10126K62061
13602D95504o7425J89777j0046j26739k12892L3725J97809j28584j27545J60526
13592D04110m4599r1492P141l5091L35524m0270j81608J16184j63103q317J01234
13581C99713j09070K06331j9671j10992j24650J86944D6142K74310J33643j2251
13571D41844q9098K01667j44598j46033L44863B88691a12433A97582K31924M0841
13561D70347G5858L92363q8835J9578A27254a21287B59259o7581P8197N1180j41517
$$ plain form
13550 179538 138953 366702 411939 342500 327003 604779 112766 220835 251970 482400
13540 482400 380153 -60510 526754 167855 344154 177032 130063 468582 304280 215500
13530 215500 191104 290173 372230 261528 837338 362736 -103249 222843 186397 196954
13520 196954 344058 396461 209069 223349 -270786 535587 -60348 282835 307873 263376
13510 263376 152263 332137 311934 92701 497390 291443 294707 255006 341766 202942 232201
13499 232201 402535 199853 48828 157222 299610 330309 48294 451636 144624 156299
13489 156299 236346 575361 35436 194882 79764 153105 -2555 376512 2055 316699 341299
13478 341299 266169 361972 395263 223943 281611 148529 61095 306965 684762 344185
$$ packed form
13550A79538m0585K27749M5237o9439j5497K77776A12766J08069L1135K30430
13540D82400j02247f0510E26754A67855J76299j67122m6969L38519j64302q8780
13530B15500k4396R9069Q2057j10702N75810C62736a03249B22843l6446J0557
13520A96954J47104N2403j87392J4280b70786E35587f0348B82835K5038m4497
13510B63376j11113J79874k0203I2701M04689k05947L264l9701Q6760j38824K9259
13499B32201J70334A99853D8828J08394J42388L0699D8294M03342A44624J1675
13489A56299Q0047L39015C5436J59446G9764P3341b555C76512B055L14644K4600
13478C41299p5130R5803L3291j71320N7668j33082F1095K45870L77797l40577
$$ plain form
13468 344185 248664 23010 274949 238266 37080 215616 523581 -107787 313312 230660
13458 230660 47302 67703 185106 406809 13269 57833 89798 -33188 6861 -90532 259851
13446 49049 426898 103302 -33057 374018 229955 335811 118338 261833 461916 37956
13435 160568 154398 166225 229173 434808 151862 184233 65822 364019 131376 264704 260128
13424 260128 383517 343107 -56691 8566 32549 562248 389221 127578 434101 189966
13413 208349 151774 501041 90182 460149 103088 319818 244778 219472 245785 253900 89517
13401 527358 234755 362769 283431 456653 -87074 184388 -120050 420044 39383 242839
13391 242839 353070 160817 427317 256759 582938 545218 180020 352327 61226 325686
$$ packed form
13468C44185r5521B3010K51939l6683C7080J78536L07965a07787C13312q2652
13458B30660D7302K0401J17403K21703A3269M4564L1965c3188F861i0532B59851
13446D9049L77849A03302c3057C74018j44063J05856A18338J43495K00083C7956
13435A60568o170J1827O2948K05635A51862L2371F5822K98197A31376J33328m576
13424B60128J23389m0410e6691H566K3983N29699j73027A27578L06523A89966
13413B08349n6575L49267I0182L69967A03088K16730p5040k5306K6313Q115H9517
13401E27358B34755J28014p9338J73222h7074A84388a20050D20044C9383K03456
13391B42839J10231A60817K66500j70558L26179l7720A80020J72307F1226K64460
$$ plain form
13381 325686 -21984 262613 160049 158841 102067 410239 179589 285879 398162 10065
13370 495349 173125 404695 230182 92229 348984 256938 277280 408930 521804 -59924
13359 143842 32419 336255 442378 462172 429328 482026 341055 362274 181649 122581 105422
13348 105422 397876 616542 -8866 299614 457270 181501 341364 533954 420472 -107184
13337 195040 109323 104626 287227 414573 -76778 133404 253235 229782 333109 275045 -14816
13325 231645 -39942 51534 402834 31344 529831 300183 -23924 -61088 142091 445246
13315 445246 536785 44561 -48325 216780 415046 80093 251931 260945 110037 211098 275535
13304 275535 208392 255729 51235 348447 -17593 -112342 275731 212727 174240 -106669 155017
$$ packed form
13381C25686b1984B62613j02564j208n6774L08172A79589J06290J12283A0065
13370D95349A73125K31570j74513I2229K56755r2046K0342J31650J12874e9924
13359A43842C2419L03836J06123J9794l2844N2698j40971K1219j80625n9068j7159
13348A05422K92454K18666h866B99614J57656A81501J59863J92590j13482a07184
13337A95040q5717m697J82601J27346g6778A33404J19831k3453J03327n8064a4816
13325B31645c9942E1534L51300C1344M98487k29648b3924l7164A42091L03155
13315D45246R1539D4561d8325B16780J98266H0093J71838R014A10037J01061O4437
13304B75535o7143M7337E1235K97212a7593r4749B75731o3004l8487a06669A55017
$$ plain form
13292 237878 297440 2226 192742 280920 -59556 544127 300229 -206794 -48476 -33793 -73746
13281 -73746 109258 32220 -29884 77446 -5056 57021 -9183 136520 -147656 60173 -173010
13269 319188 -21137 64391 -226558 -29720 46048 165012 -534 532728 305982 213638 17152
13257 95011 147991 163646 84529 170307 28978 395805 -48154 144272 -46299 392938 258994
13246 258994 -103983 618198 204963 -111307 350233 453101 36878 177071 -121663 52891
13235 63355 128168 144410 46384 -202185 -193215 93913 5823 -267290 259755 113760 244433
13224 244433 95999 26946 121712 120565 76397 35419 195600 141194 -193511 -177527 50887
13212 -85257 28393 242516 103089 151478 109934 202179 22511 5628 -12103 145480 311687
$$ packed form
13292B37878N9562B226J90516Q8178e9556E44127k43898b06794d8476J4683l9953
13281g3746A09258C2220b9884G7446e056E7021i183A36520a47656F0173a73010
13269C19188b1137F4391b26558b9720D6048J18964e34E32728k26746r2344A7152
13257I5011N2980J5655p9117Q5778B8978L66827d8154A44272d6299C92938j33944
13246B58994a03983F18198B04963a11307C50233J02868C6878J40193a21663E2891
13235F3355O4813J6242D6384b02185Q970I3913E823b67290B59755A13760J30673
13224B44433I5999B6946R4766j147m4168C5419J60181n4406a93511J5984E0887
13212h5257B8393K14123A03089M8389m1544R2245B2511E628a2103A45480J66207
$$ plain form
13201 311687 167424 -97819 93311 353417 95495 -44997 94787 107066 -13778 -200521 -81958
13189 -130360 220604 -94402 105881 333219 -50047 133608 180885 -253917 42583 49782 184297
13178 184297 -54256 131408 68907 225856 276025 182443 -9269 86938 63245 220625 348689
13167 348689 155069 -139523 173045 -45610 256113 46717 329233 217920 85908 289246
13157 289246 109840 164793 244720 73397 91247 77487 114008 349467 -90884 130857 250908
13146 250908 47421 207219 -2972 1276 140482 35888 138731 177170 122697 -188811 21467
13134 -410289 90854 46645 317239 240744 -306818 96183 8716 41253 -46394 187740 105468
13123 105468 25358 61758 198598 281905 328762 163772 327350 -108270 -78271 -149720 106949
$$ packed form
13201C11687j44263i7819I3311K60106I5495d4997I4787J2279a3778j86743h1958
13189a30360B20604i4402A05881K27338e0047A33608M7277b53917D2583P199J34515
13178A84297e4256A31408o2501J56949N0169r3582i269H6938k3693J57380J28064
13167C48689A55069a39523A73045d5610B56113D6717K82516j11313H5908K03338
13157B89246A09840N4953P9927G3397J7850j3760L6521K35459i0884A30857J20051
13146B50908D7421J59798b972A276J39206C5888J02843L8439n4473a88811B1467
13134d10289I0854m4209K70594p6495c06818I6183H716L2537d6394A87740q2272
13123A05468B5358L6400J36840Q3307M6857A63772J63578a08270K9999p1449A06949
$$ plain form
13111 276748 375240 191090 421452 -45727 -85061 450939 -109134 -124793 -141063 -294284
13101 -294284 -184410 311548 -165855 79440 195710 73260 95066 93561 134090 162128 78326
13089 -76397 381103 607462 77073 33916 175813 117708 39559 241155 174727 210000 207165
13078 207165 62689 -84110 -117361 -205328 128613 -25923 -58564 -166692 -70743 54222 -2612
13066 115302 237020 222673 149199 341932 3648 17243 1379 201669 -195812 481797 -212355
13054 -2326 48649 249404 225098 219706 8786 80413 246278 13289 415948 -223790 444836
13042 71343 -7743 -62158 7366 94124 161891 3112 -232279 150071 438348 -22857 119791
13030 164896 147824 229441 82937 222688 47194 170182 419953 194210 157955 192466 160488
$$ packed form
13111B76748R8492j84150K30362d5727l9334D50939a09134j5659j6270j53221
13101b94284J09874C11548a65855G9440J16270G3260K1806j505M0529K8038G8326
13089g6397C81103K26359G7073C3916J41897n8105C9559K01596o6428L5273k835
13078B07165F2689h4110l3251q7967A28613b5923l2641j08128g0743E4222b612
13066A15302J21718j4347p3474J92733C648J3595A379K00290a95812D81797b12355
13054b326D8649K00755k4306n392H786P1627J65865A3289M02659b23790D44836
13042G1343g743n4415G366Q6758O7767C112b32279A50071K88277b2857A19791
13030A64896j7072Q1617H2937J39751D7194J22988K49771A94210l6255L4511l1978
$$ plain form
13019 160488 279035 181255 133670 -38007 197068 -107132 74318 81272 82612 42392 -46369
13007 58209 -140742 167293 86163 180233 -145419 181156 120139 -3791 -223690 8080 343916
12996 343916 -66863 142104 82068 -66144 -110210 -213871 242748 74228 1994 266370 167890
12985 167890 108407 156493 -260353 -166160 -105160 137146 168791 433847 95220 17044 109209
12974 109209 -60454 -53738 -212624 -242306 -96163 200157 -31779 -88077 -13269 14245 -73911
12962 18560 -252890 -109672 2937 94477 79493 123083 239464 170772 90142 -157204 -310805
12951 -310805 -245345 -111411 -38570 51405 -1400 39814 6961 -269755 26706 135950 233840
12940 233840 -143905 158242 -93156 -99592 -132929 119259 -256554 50475 -79177 -127553 135263
$$ packed form
13019A60488J18547r7780m7585c8007A97068a07132G4318O954J340m0220d6369
13007E8209a40742A67293q1130R4070a45419A81156o1017c791k19899H080L35836
12996C43916f6863A42104o0036f6144m4066j03661B42748G4228A994K64376r8480
12985A67890n9483M8086b60353R4193O1000A37146L1645K65056I5220A7044R2165
12974A09209f0454O716j58886k9682i6163B00157c1779n6298a3269A4245g3911
12962A8560b52890a09672B937R1540j4984M3590J16381o8692q0630a57204j53601
12951c10805O5460a11411c8570E1405a400C9814F961b69755B6706J09244R7890
12940B33840a43905A58242i3156o436l3337A19259b56554E0475g9177m8376A35263
$$ plain form
12928 -36678 26152 -22358 158584 -94300 336618 -98374 -100316 95637 40275 -83466 221690
12916 135232 135259 233841 9673 141656 132230 -13891 -81826 121862 199537 226122 -164447 -12343
12903 297346 14645 54601 -200935 -35442 292951 -45286 44585 74363 302054 191485 277809
12892 277809 224296 118410 252618 173730 168572 9174 -209188 115149 -99403 -32440 167488
12880 -87447 -78255 -25820 88114 -76831 314295 -232356 2376 89517 -253779 -66100 187871
12868 281672 143015 390881 46139 -74723 -76144 -155610 -154197 -89024 -236180 49656 79356
12857 79356 -81635 -73483 58804 -52363 87866 -3961 -26271 364512 -83879 -235294 119036
12845 -68851 -261258 118343 236859 -105662 135890 50942 49382 -11212 66277 492989 -33993
$$ packed form
12928c6678B6152b2358A58584i4300C36618i8374j942I5637D0275h3466B21690
12916A35232K7R8582I673J31983r426a3891o7935A21862P7675K6585a64447a2343
12903B97346A4645L9956b00935c5442B92951d5286D4585K9778K27691j10569Q6324
12892B77809n3513j05886J34208p8888n158I174b09188A15149i9403c2440A67488
12880h7447R192b5820H8114g6831C14295b32356B376Q7141b53779f6100A87871
12868B81672j38657K47866D6139g4723j421p9466J413O5173j47156D9656K9700
12857G9356h1635Q152E8804e2363H7866c961k2310C64512h3879j51415A19036
12845f8851j92407A18343J18516a05662A35890E0942j560a1212F6277M26712c3993
$$ plain form
12833 -315737 82356 109421 -259654 283453 -59269 -83087 -1549 215208 -348801 -363634 -12990
12821 101507 320241 -141806 86328 91260 -221502 -133269 -10463 132398 25887 -242694 -72985
12809 -334814 -18906 -148027 -512868 77518 201987 311307 248129 124106 133380 -107802
12798 31331 -36252 68616 168787 255867 6597 120987 62422 -201151 83347 -142315 -35576
12786 -178921 89642 -35819 261897 -120622 344791 -155443 -65737 185816 -83467 -37246
12775 140238 147434 -7049 59134 -80515 319601 364447 328211 342779 155539 324625 225522
12764 225522 -75493 -215870 -43251 74496 -27971 52474 -57263 -109793 76392 66000 121799
12753 121799 -118023 -23652 114803 -219931 38500 -286649 4934 85907 -125770 -206613 -7802
$$ packed form
12833c15737H2356K7065b59654B83453e9269k3818a549B15208c48801j4833a2990
12821A01507K18734a41806H6328M932b21502Q8233a0463A32398B5887b42694g2985
12809c34814a8906j29121l64841G7518J24469J09320o3178j24023R274a07802
12798C1331c6252F8616J00171Q7080F597J14390n8565b01151H3347a42315c5576
12786a78921H9642c5819B61897a20622C44791a55443f5737A85816h3467c7246
12775A40238P196g049E9134h0515C19601M4846l6236J4568A55539J69086r9103
12764B25522g5493j40377d3251G4496b7971E2474e7263n2530G6392j0392N5799
12753A21799a18023b3652A14803b19931C8500b86649D934Q0973a25770q0843g802
$$ plain form
12741 13568 201522 -148694 -209380 25052 345 -323491 203937 165083 115123 19005 295111
12730 295111 11241 16771 400823 73378 -388904 -117844 -23110 345940 -118762 108137
12719 70996 -13946 97614 -77564 111938 156521 267863 166 224495 68885 217303 481233
12708 481233 392110 23760 119389 -142848 75759 15834 304616 347164 -7470 239986 302184
12697 302184 226779 161594 231332 196690 183082 -156322 -92684 321627 -133160 20516 -162904
12685 39009 -233993 142284 203066 199142 475429 -129270 -121162 -132548 291959 -47547 -95278
12674 -95278 -29542 -123353 -79659 -282729 69783 189438 7645 428487 216952 4694 141094
12663 141094 51065 415597 -126695 123687 272800 181930 340017 62798 234358 2383
$$ packed form
12741A3568J87954a48694o0686B5052C45c23491B03937l8854m9960A9005K76106
12730B95111A1241N530L84052G3378c88904a17844b3110C45940a18762A08137
12719G0996a3946I7614g7564A11938M4583J11342A66K24329F8885J48418K63930
12708D81233q9123B3760R5629a42848G5759A5834K88782M2548g470B39986O2198
12697C02184p5405o5185O9738l4642j3608a56322O3638C21627a33160B0516a62904
12685C9009b33993A42284O0782l924K76287a29270Q108j1386B91959d7547m7731
12674i5278b9542r3811M3694k03070F9783J19655G645M20842k11535D694J36400
12663A41094E1065L64532a26695A23687J49113r0870J58087F2798J71560B383
$$ plain form
12652 296396 248253 -22877 142175 -76880 345958 16901 267798 141553 -98416 -251309
12642 -251309 86131 -162262 258459 -48379 72752 297012 246094 -79588 192037 241987 204376
12631 204376 16007 5897 403946 -13522 372340 236533 80473 65041 237537 46510 209902
12620 209902 -141611 21463 111978 60923 109829 113056 34947 -41400 318788 -9513 519000
12608 -41431 94215 160400 -120657 -186074 25300 -37341 62614 -63982 300567 120278 -260123
12596 79407 255426 225649 81754 123455 -171887 190808 81684 -72517 -201135 170450 -100216
12584 -275804 -224670 -107349 173772 200206 -89173 10687 -9371 31962 -37749 124091 249495
12573 249495 -302421 11349 91171 -99781 -330700 303386 -219381 231838 -95769 71330
$$ packed form
12652B96396m8143b2877A42175g6880C45958A6901K50897j26245i8416j52893
12642b51309H6131a62262B58459d8379G2752K24260n0918g9588A92037M9950l7611
12631B04376A6007E897L98049a3522C72340j35807H0473j5432J72496D6510J63392
12620B09902a41611B1463R0515n1055M8906L227C4947d1400C18788i513E19000
12608d1431I4215O6185a20657o5417B5300c7341F2614f3982C00567A20278b60123
12596G9407J76019k9777H1754M1701a71887A90808H1684g2517j28618A70450a00216
12584b75804N1134a07349A73772K6434h9173A0687i371C1962c7749A24091J25404
12573B49495c02421A1349P9822i9781k30919C03386b19381B31838i5769G1330
$$ plain form
12562 115119 -8962 189081 364497 -8212 -202294 26520 -124240 -123713 -1249 103648 287723
12551 287723 170775 4093 -100521 -229152 66428 436048 19721 14295 32197 -43639 158120
12539 -76443 -113489 -183776 -52297 -53016 -38568 -166441 36960 89207 -161991 67659 -223405
12527 93310 256796 176240 116181 567189 288721 -20109 318462 68271 314789 395075 -110905
12515 3936 90299 -139437 -8556 63059 204077 -8634 205384 -216680 242216 -146058 -37632
12503 249825 -46781 49225 49170 111155 -37983 32399 120254 403532 -20682 220446 -55417 113168
12490 40098 83382 17649 -103967 14645 -76415 -189836 -313050 245612 -131224 -215249 -263538
12479 -263538 -56390 135117 106691 44783 -101880 14708 -307084 -21454 23702 -17553 103640
$$ packed form
12562A15119h962A89081J75416h212j94082B6520a24240N27a249A03648J84075
12551B87723j16948D093a00521j28631F6428L69620A9721n426J7902d3639A58120
12539g6443l7046p0287e2297p19J4448j27873C6960N2247a61991F7659b23405
12527I3310J63486q0556o0059M51008k78468b0109C18462F8271K46518Q0286a10905
12515C936Q6363a39437h556F3059J41018h634B05384b16680B42216a46058c7632
12503B49825d6781D9225n5O1985c7983C2399Q7855K83278b0682B20446e5417A13168
12490D0098M3284A7649a03967A4645g6415j13421j23214B45612a31224q4025m8289
12479b63538e6390A35117k8426D4783a01880A4708c07084b1454B3702a7553A03640
$$ plain form
12467 -260956 214121 45879 -352739 33699 168512 123379 96050 -175794 -155258 113765
12456 196332 -121397 180656 136136 21119 400363 321895 169792 -18764 -35817 -85033 347515
12444 -59652 -128770 112319 -42157 -246172 -14167 -51299 52950 -76363 123679 -50132 220172
12432 283050 -26144 45392 61919 -183437 27774 -57454 151427 -89780 4509 214181 -63281
12420 90222 -378 117621 -68983 158296 -52592 -124470 -30085 48295 -370374 65029 128438
12409 128438 536137 69928 -142719 153559 537877 663051 59635 222813 82978 61693
12399 61693 -122664 179054 224783 42821 -164008 63592 -125069 252392 360552 275024
12389 275024 -184436 352513 200326 -270175 -152809 -405093 137085 -37390 -132010 124286
$$ packed form
12467b60956B14121D5879c52739C3699J34813m5133k7329a75794K0536A13765
12456A96332a21397A80656m4520B1119L79244p8468j52103a8764j7053m9216C47515
12444e9652o9118A12319d2157k04015a4167l7132E2950g6363A23679e0132B20172
12432B83050b6144D5392J6527a83437B7774e7454A51427h9780D509K09672f3281
12420I0222c78A17621f8983A58296e2592p1878c0085D8295c70374F5029O3409
12409A28438M07699F9928a42719A53559L84318J25174E9635J63178H2978k1285
12399F1693a22664A79054M5729D2821a64008F3592a25069B52392J08160q5528
12389B75024a84436C52513j52187b70175J17366k52284A37085c7390r4620A24286
$$ plain form
12378 62237 81474 -301949 -1864 -97328 -47691 -179120 -169260 -302909 -103732 87493 -181666
12366 22522 111074 91642 95707 85129 291304 -64806 -302968 -17455 -167620 -58599 -33018
12355 -33018 -42547 -371504 57513 -130226 -295933 -218244 -198546 -129960 15048 182289 11773
12343 -297974 -58876 -96704 248070 -176340 -203364 -156634 -313046 -102355 -214669 -63359
12332 138664 -73419 -25211 144515 84281 193930 -210450 -88147 -368773 -141403 140336
12321 1534 -70577 65553 -94465 251435 -130439 154643 106021 -142557 63477 163007 -28276
12309 57440 80839 246917 -202104 -108539 133854 -353761 266722 -220598 126152 111474
12299 111474 -47219 141953 -10312 -21255 -12350 -10017 -180802 20899 330988 -227886 240108
$$ packed form
12378F2237J9237c01949a864r5464d7691j31429R860j33649a03732H7493a81666
12366B2522Q8552j9432M065j0578K06175f4806k38162a7455j50165e8599K5581
12355c3018r529l28957E7513a30226j65707P7689J9698O8586A5048J67241A1773
12343b97974e8876l7828B48070a76340k7024M6730j56412a02355j12314f3359
12332A38664g3419b5211A44515o0234J09649b10450h8147k80626a41403A40336
12321A534g0577F5553i4465B51435a30439A54643m8622a42557F3477R9530b8276
12309E7440K3399J66078b02104R3565A33854c53761B66722b20598A26152j4678
12299A11474d7219A41953a0312j0943Q905K333j70785B0899L10089b27886B40108
$$ plain form
12287 -362 -16 157889 71740 -197069 -95869 68480 -150281 121173 112568 52756 508327 -68428
12274 40419 195680 256417 89095 149089 366215 248335 72746 251588 -47980 92402 -35530
12262 19232 -108672 115985 -127652 -123622 63187 292207 68145 302638 -48121 -223307 10243
12250 -71689 145236 42524 5590 184861 397554 204915 -34603 414372 74317 142231 -136916
12238 60930 183579 -36075 -61418 226803 -180648 479687 405746 186612 127676 -85279 101931
12226 106364 241151 -142998 133541 236298 20647 171912 220836 586950 -223946 -66183
12215 146597 165059 16857 56488 384292 44519 -20949 177456 212277 307443 169428 306821
12204 306821 251551 93484 137426 243026 121759 70903 313509 208101 24410 401438
$$ packed form
12287c62a6A57889G1740a97069i5869F8480a50281A21173q605E2756M55571f8428
12274D0419J55261O0737H9095N9994K17126j17880G2746J78842d7980I2402c5530
12262A9232a08672A15985a27652M030F3187K29020F8145K34493d8121j75186A0243
12250g1689A45236D2524E590J79271K12693j92639c4603D14372G4317O7914a36916
12238F0930J22649c6075k5343B26803a80648D79687p3941A86612n8936h5279A01931
12226A06364J34787a42998A33541J02757B0647J51265M8924L66114b23946f6183
12215A46597J8462A6857L9631L27804D4519b0949A77456L4821R5166j38015J37393
12204C06821n5270I3484M3942J05600j21267n0856K42606j05408B4410L77028
$$ plain form
12194 401438 431120 480814 43450 116987 315991 139689 -185760 44853 170672 94822 177276
12183 177276 315405 178230 235019 -17794 -28005 -15511 -38475 197434 133605 220910 -109214
12171 291464 136022 175595 73415 -112296 170180 180886 109188 -140101 229795 -124317
12160 108912 -112059 -121460 92751 -5483 -346808 339970 152808 -11984 -14138 -77026 -138666
12149 -138666 124970 -229960 198144 -357519 151149 -128662 -22638 291258 147445 -144743
12138 140084 28051 -199134 33285 -75096 166494 -223004 -56250 65300 -55959 -20519 105871
12126 -263282 -110026 79604 115615 -81528 -302204 -125967 210184 -73488 -153328 -23779 109196
12114 -326143 -98755 -53069 23250 181685 125236 294848 238651 -90689 13591 23493 -71123
$$ packed form
12194D01438K9682M9694D3450P3537J99004A39689a85760D4853J25819p5850Q2454
12183A77276J38129j37175N6789a7794j0211J2494k2964A97434o3829Q7305a09214
12171B91464A36022L9573G3415a12296A70180J0706p1698a40101B29795a24317
12160A08912a12059r401I2751e483l41325C39970A52808a1984k154o2888o1640
12149a38666A24970b29960A98144c57519A51149a28662b2638B91258j43813a44743
12138A40084B8051a99134C3285g5096A66494b23004e6250F5300e5959b0519A05871
12126b63282a10026G9604L6011h1528k20676a25967B10184g3488p9840b3779A09196
12114c26143i8755M5686B3250J58435n6449J69612n6197i0689A3591R902g1123
$$ plain form
12102 95022 -134650 -280455 -228531 -158999 -308018 -17738 -200232 -21834 11153 134814 187001
12091 187001 46852 -160034 14786 277976 120855 63727 31316 -35857 -105093 -48164 -3940
12079 -44883 -171520 -79004 516615 -267505 -42808 -109842 -109849 204723 80770 195260 528559
12068 528559 1068599 1286119 667357 441167 -56912 123764 170002 317624 -59961 -1288
12057 315466 107523 56926 -61271 242310 222448 -34790 -89070 -6237 -81685 -63681 209124
12045 -239404 -190463 219927 -297969 14394 -262730 66879 -72163 56511 218299 114927
12035 114927 -36882 50447 -196599 69753 74203 -19647 -109010 186564 -51237 -383111 160542
12023 51280 256765 158552 -98385 79300 13986 -304516 138968 31147 -28050 270838 -83706
$$ packed form
12102I5022a34650j45805N1924O9532j49019a7738j82494b1834A1153J23661N2187
12091A87001D6852a60034A4786K63190A20855n7128C1316c5857o9236d8164c940
12079d4883j26637g9004E16615b67505d2808o7034pB04723H0770J14490L33299
12068E28559N40040K17520o18762k26190e6912A23764M6238J47622e9961a288
12057C15466A07523n0597f1271B42310j9862c4790n4280f237p5448J8004B09124
12045b39404M8941B19927b97969A4394b62730F6879g2163E6511J61788j03372
12035A14927c6882E0447a96599F9753M450a9647q9363A86564e1237l31874A60542
12023E1280K05485r8213i8385G9300A3986c04516A38968C1147b8050B70838h3706
$$ plain form
12011 143838 78434 -172263 80585 -45185 140200 -135408 -109540 -57345 -28435 -83695 119587
11999 -93290 -188697 -359183 40010 -65751 -261092 -108182 305554 -115260 275900 -16569
11988 146516 -204768 391566 -48013 -377539 -200759 -157699 66156 -112209 -206134 121922
11977 -101288 128256 -190675 145250 18871 10012 222727 311056 -63666 -302745 -38961 -148100
11966 -148100 -311688 61036 -45666 -90435 16637 -308325 134780 -14756 198248 53821 -176726
11954 -20151 -187428 -198642 -19711 99348 -126170 161179 -173594 -67711 39643 65216 24884
11942 63739 -118896 -68331 -35123 -64246 -65955 1860 184138 -219631 -12174 20234 115547
11931 115547 432344 -334925 -62023 74066 -53422 24077 171352 -122556 -8314 -15299 352210
$$ packed form
12011A43838o5404a72263H0585d5185A40200a35408K5868N2195b8435n5260A19587
11999i3290r5407j70486D0010f5751j95341a08182C05554a15260B75900a6569
11988A46516b04768C91566d8013l29526J76780M3060F6156a12209r3925A21922
11977a01288A28256a90675A45250A8871q859K12715Q8329f3666k39079c8961j09139
11966a48100j63588F1036d5666m4769A6637c08325A34780a4756A98248E3821a76726
11954b0151j67277j1214a9711I9348a26170A61179a73594f7711C9643K5573B4884
11942F3739a18896N0565L3208k9123j709A860J82278b19631a2174B0234R5313
11931A15547L16797c34925f2023G4066e3422B4077J47275a22556h314o985C52210
$$ plain form
11919 -309630 283582 210907 7537 -64710 -229741 271058 73808 -112844 -36676 39176 232941
11908 232941 -58712 204430 -83925 -152288 307018 163438 95598 -30116 -105327 -5286 200302
11896 -96110 54335 147767 153427 99477 178483 72745 151627 46417 -290931 -7624 134242 -73417
11883 256802 84139 123849 93928 56780 -264618 131874 -13092 -147873 -215268 -33691 -117878
11872 -117878 -332321 -7929 215398 368713 -235152 125961 -152157 76162 2798 329552
11862 329552 -362613 185674 -196368 -234738 -93687 180676 -125566 -171836 223194 60401
11851 195553 177993 57514 245814 11581 149617 -84264 22200 -117989 210366 254840 82292
11839 -137653 -22948 13297 15847 -31602 -137784 -230979 -106784 -42773 -290618 80242 30028
$$ packed form
11919c09630B83582p2675G537f4710j65031B71058G3808a12844c6676C9176J93765
11908B32941e8712B04430h3925o8363C07018j43580o7840c0116p5211e286B00302
11896i6110E4335R3432N660n3950P9006G2745P8882D6417b90931g624A34242g3417
11883B56802H4139L9710k9921l7148b64618A31874a3092j34781o7395c3691q4187
11872a17878k14443g929B15398J53315b35152A25961a52157G6162B798L26754
11862C29552c62613A85674a96368l8370i3687A80676a25566m6270B23194F0401
11851A95553j7560E7514J88300A1581J38036h4264B2200a17989B10366M4474H2292
11839a37653b2948A3297K550c1602j06182r3195a06784d2773k47845H0242C0028
$$ plain form
11827 -28264 79848 -177814 100235 -68815 -334190 -235546 -39962 -200116 -155137 312922 220431
11816 220431 -143497 -275310 -175769 156675 -85781 365410 1106 95066 -202034 -216667 12037
11804 163150 28813 113667 -17789 -61918 -131156 -81238 14799 -137097 28743 -148921 -51940
11792 -305957 40914 -269078 95524 103618 -1476 263681 -186983 -61517 230701 -90121 120109
11780 98240 -171795 -99855 -264596 -147217 -310330 -392820 -9243 112908 -278260 -324742 44087
11768 92396 11966 -47060 95344 -294584 -119055 -52914 -49351 431764 65163 -62620 -186965
11757 -186965 267301 -128200 -191152 22970 -275462 34966 -33440 42061 188166 86521 302424
11746 302424 -60406 -107838 212423 103065 91601 53235 464428 26742 67975 -292047 -73033
$$ packed form
11827b8264G9848a77814A00235f8815k65375R8644c9962j60154M4979C12922r2491
11816B20431a43497j31813R9541A56675h5781C65410A106R3960b02034j4633A2037
11804A63150B8813Q4854a7789m4129o9238M9918A4799a37097B8743a48921e1940
11792c05957D0914b69078I5524Q094a476B63681a86983f1517B30701i0121A20109
11780I8240a71795P1940j64741J17379j63113q2490i243A12908b78260m6482D4087
11768I2396A1966d7060I5344b94584a19055e2914L563D31764F5163f2620j24345
11757a86965B67301a28200o2952B2970b75462C4966c3440D2061J46105H6521K15903
11746C02424f0406m7432B12423A03065j1464l8366M11193B6742M1233b92047g3033
$$ plain form
11734 -32452 -28944 -179221 -36911 41891 13882 -156546 -81083 285266 4279 -108523 203845
11722 148355 -245500 -170089 34874 61539 -232981 168140 -50937 404322 -87769 26739 -118353
11710 164007 252135 -85772 -64674 -69817 86179 -10143 2852 115195 25098 -149595 29574
11698 92798 45247 187450 182836 28045 410789 186820 61449 30912 -86733 75175 161376
11687 161376 52740 78989 -189117 81620 273039 39112 -20505 -145350 -4312 268843 131274
11675 -88133 284200 124882 151218 -91868 339014 189484 109933 -114098 -201397 -24075 208790
11663 -35584 -64265 -1321 70985 -218902 -11759 -143632 -246546 -70878 184173 335500 119772
11651 -297627 -73324 -54172 -73076 213425 103739 367939 -181062 -181097 -227583 -149103 86149
$$ packed form
11734c2452L508j50277c6911D1891A3882a56546P5463B85266D279a08523B03845
11722A48355b45500P5411C4874K6665b32981A68140e0937D04322h7769B6739a18353
11710A64007Q8128h5772K1098n143H6179a0143B852J12343B5098a49595B9574
11698I2798D5247J42203m614B8045L82744A86820F1449l0537h6733G5175Q6201
11687A61376E2740K6249a89117H1620J91419C9112b0505j24845d312B68843A31274
11675h8133B84200A24882K6336i1868C39014j49530p9551a14098q7299b4075B08790
11663c5584k8681a321G0985b18902a1759j31873j02914g0878A84173J51327A19772
11651b97627g3324J9152j8904B13425A03739K64200a81062l5m6486P8480H6149
$$ plain form
11639 -282700 144568 67237 23713 -51146 -199359 363936 -282633 295998 141043 -8294
11628 -144654 343489 -156484 -97039 144322 84970 234696 -244674 -239102 59844 155932 13832
11616 -220802 131129 -27771 -177181 38890 -131575 -59094 -81274 342128 -40783 -274982
11606 -274982 -212621 189913 -93803 194138 265418 151575 -52411 169213 322279 100340
11595 -43907 319353 3236 34800 -10030 197418 -94329 -121469 144755 350160 -57115 80924
11583 25833 77521 195159 -215213 207606 284117 -20293 -206852 233334 -218004 246718
11572 105320 -85895 221686 48396 68384 -43872 -76032 330413 -149991 -482632 -140514
11561 70626 36197 200857 -356959 84799 24210 -216787 -66628 -66234 161629 -151531 -191992
$$ packed form
11639b82700A44568F7237B3713e1146j48213C63936b82633B95998A41043h294
11628a44654C43489a56484N9445A44322n9352J49726b44674N572E9844R6088A3832
11616b20802A31129b7771j49410C8890a31575e9094k2180C42128d0783k34199
11606b74982O2361A89913i3803A94138P1280j13843e2411A69213J53066A00340
11595d3907C19353C236L1564a0030A97418i4329k7140A44755K05405e7115H0924
11583B5833N1688J17638b15213B07606P6511b0293j86559B33334b18004B46718
11572A05320h5895B21686D8396J9988d3872l2160C30413a49991l32641a40514
11561G0626l4429J64660c56959H4799B4210b16787f6628L94A61629a51531m0461
$$ plain form
11550 -191992 -65617 173764 -132379 -140403 27512 201812 71821 -34511 177822 157024 -222873
11538 185872 73570 -66924 434606 203460 177589 70209 38608 190034 146531 307870 290369
11527 290369 477633 -79464 660774 -114674 208705 30076 168258 327110 32463 111668
11517 111668 -124687 -205067 425584 123156 335021 223576 14322 150394 205697 -146253
11506 182345 74575 -60890 -103988 524802 30455 345760 346047 237031 567818 -122611 86605
11494 321420 174316 145703 201483 97249 80710 70226 345389 375362 90926 66344 139132
11483 139132 217746 -165124 139935 -43355 64342 -33939 103185 100507 133995 -52195 219735
11471 257801 -162057 193606 358782 137931 -84981 196900 86170 -58118 66858 182250
$$ packed form
11550a91992f5617A73764a32379q024B7512J74300G1821c4511A77822k0798b22873
11538A85872G3570f6924D34606B03460k5871G0209l1601J51426m3503J61339j7501
11527B90369J87264g9464F60774a14674B08705C0076J38182J58852C2463P9205
11517A11668a24687q0380D25584A23156K11865j11445A4322J36072N5303a46253
11506A82345G4575f0890m3098E24802C0455L15305K87j09016L30787a22611H6605
11494C21420j47104k8613N5780I7249j6539j0484K75163K9973I0926k4582P2788
11483A39132P8614a65124A39935d3355F4342c3939A03185k678L3488e2195B19735
11471B57801a62057A93606J65176A37931h4981A96900H6170e8118F6858J15392
$$ plain form
11461 182250 74287 89631 -214219 115629 113720 357305 -51325 -257243 -17577 -28235 256829
11449 138225 -186264 -163710 186204 25231 506043 437102 7585 -77668 -144948 82121 70053
11438 70053 232463 -258811 -2395 131497 146104 -26012 229330 227695 122077 -246937 60172
11426 15329 -340169 -224010 -146494 -122996 -58604 310693 45993 152721 67560 10703 152649
11415 152649 293802 62045 -52507 398133 -47045 108139 144256 4471 -201411 182509 -348087
11403 247610 24460 159247 -55811 -234179 41771 168719 436940 52077 62790 53038 -50644
11391 -155476 187262 -35031 -405184 -179746 -260241 -174846 -43159 -270810 87862 158674 159026
11380 159026 -79864 -220790 127697 36743 237108 53193 68865 -271218 -52870 -231195
$$ packed form
11461A82250G4287J5344b14219A15629j909K43585e1325k05918a7577j0658B56829
11449A38225a86264K2554A86204B5231M80812o8941G585g7668o7280H2121j2068
11438G0053J62410b58811b395A31497J4607b6012B29330j635j05618b46937F0172
11426A5329c40169J16159P7516K3498e8604C10693D5993J06728F7560A0703J41946
11415A52649J41153F2045e2507C98133d7045A08139L6117D471b01411A82509c48087
11403B47610B4460J34787e5811j78368D1771J26948K68221E2077J0713r752e0644
11391a55476A87262c5031l70153a79746q0495Q5395d3159k27651H7862P0812L52
11380A59026g9864j40926A27697C6743K00365E3193J5672b71218e2870j78325
$$ plain form
11370 -231195 -479380 245323 -101788 -355757 31570 -50912 87045 -213408 228911 138824
11360 138824 304688 -215686 -44559 489 154313 -73028 144263 -198977 140301 143113 125927
11349 125927 -8600 -400526 -181842 112257 235235 20460 142768 6780 -5470 131143 -97471
11337 191172 -9398 -19289 -146288 241837 134573 87950 -105937 -83517 -183898 -99159 161072
11325 123199 -79615 3048 98751 -156788 -219110 -130806 -37105 -266420 186617 118125 241967
11314 241967 75645 225807 228625 2516 -239202 -410140 35738 -114961 -229489 -267600 -499772
11303 -499772 -200365 -144404 152007 -94 -173549 -26431 -26899 -26371 2114 58001 3015 83406 -106592
11289 -34785 109556 -48591 146029 256420 81247 56227 -16072 -136348 -21764 -95000 -296073
$$ packed form
11370b31195k48185B45323a01788k53969C1570e0912H7045b13408B28911r0087
11360A38824J65864b15686d4559D89J53824g3028A44263a98977A40301K812j7186
11349A25927h600l91926a81842A12257J22978B0460J22308F780e470A31143i7471
11337A91172i398r891j26999B41837j07264m6623a05937K2420j00381Q4739A61072
11325A23199g9615C048R5703a56788o2322Q8304c7105k29315A86617o8492J23842
11314B41967G5645J50162K818B516b39202j70938C5738a14961j14528l8111k32172
11303d99772b00365N5961A52007i4j73455b6431m68N28B114N5887C015Q0391a06592
11289c4785A09556d8591A46029J10391H1247k5020a6072j20276b1764p3236k01073
$$ plain form
11278 -296073 99268 -104406 206821 -248212 101562 -191444 -12230 123634 -160603 94112
11267 -134660 -131236 116856 -28028 -63965 -72563 -275568 -236628 48209 -118964 58598 -36117
11255 39942 22538 243600 122803 -115932 -241038 27668 -53560 -199445 -65293 -153415 29096
11243 194740 -182641 144848 -115500 232152 -455487 -192678 -3235 76181 -67651 -99909
11233 -99909 14618 -233385 193036 33701 -106335 55407 62638 -29525 -198263 -243301 -83804
11221 17558 -200388 -241667 53800 -109382 -414456 -188317 -53936 -15116 -388344 -472793 349412
11209 -226294 8158 -12770 -87997 47980 -27779 -69731 -83287 24900 -316350 50617 172519
11198 172519 282396 -17918 -96657 118965 -53015 -213522 -143979 54389 -252022 -44996 149922
$$ packed form
11278b96073I9268a04406B06821b48212A01562a91444a2230A23634a60603I4112
11267a34660L424A16856b8028l5937q598k03005L8940D8209a18964E8598c6117
11255C9942j7404K21062j20797a15932j25106B7668e3560j45885f5293q8122B9096
11243A94740a82641A44848a15500B32152d55487a92678c235G6181f7651l2258
11233i9909A4618b33385A93036C3701a06335E5407P231b9525j68738m5038h3804
11221A7558b00388m1279E3800a09382l05074a88317e3936a5116l73228q4449C49412
11209b26294H158a2770p5227D7980b7779m1952j3556B4900c16350E0617J21902
11198A72519J09877a7918p8739A18965e3015j60507O9543E4389b52022d4996A49922
$$ plain form
11186 -94744 -267696 23250 441004 144212 -140961 293496 -405362 -110144 -227272 -186527
11176 -186527 -98961 -292736 169478 248995 -309107 -279653 -52462 -105537 -318103 -183971
11166 -183971 -219849 -11828 -243435 137129 -44699 252971 -59912 -7065 -444786 -220849 232075
11154 -12497 -42124 124894 292048 214498 -27449 115434 40007 153003 190770 151236 159560
11143 159560 313749 206391 50238 37858 -41974 148860 51863 291272 95944 4892 -52312
11131 -65721 385769 -125265 -170951 -40640 -25677 13678 -93687 -106671 165617 -175644 1250
11119 -121412 234486 204345 8287 -1380 30724 189711 -6729 180982 255038 198423 -19631
11107 501155 76330 66850 338113 291893 47245 -67465 540517 198907 28186 86123 131544
$$ packed form
11186i4744j72952B3250M17754A44212a40961B93496d05362a10144j17128M0745
11176a86527Q7566j93775A69478P9517c09107K9454e2462n3075k12566J34132
11166a83971l5878a1828k31607A37129d4699B52971e9912g065m37721b20849B32075
11154a2497k9627A24894J67154p7550b7449A15434D0007J12996L7767l9534Q324
11143A59560J54189j07358E0238j2380d1974A48860E1863K39409I5944D892e2312
11131f5721C85769a25265m5686d0640J4963A3678i3687j2984A65617a75644A250
11119a21412B34486l0141H287a380C0724J58987f729A80982P4056n6615a9631
11107E01155G6330r480K71263m6220D7245f7465E40517A98907B8186N7937M5421
$$ plain form
11096 131544 216748 -21864 384496 25040 -49032 68493 22366 431697 32689 338936 322418
11085 322418 80870 116982 -37637 475526 152336 52321 372218 576732 198857 408858
11075 408858 351168 271887 94074 696114 318232 564928 46440 121914 589386 341282
11065 341282 337379 265525 203008 454886 513412 619933 404215 511935 397261 724549
11055 724549 791815 580370 160306 557808 718766 647088 907384 825991 474524 865119
11045 865119 971876 1157986 461879 681439 605034 652340 852357 952908 752694 630158
11035 630158 452071 896146 574828 856114 642787 499465 483202 876351 625081 558415
11025 558415 665612 142933 416197 955230 699972 494622 689192 515926 484256 628282
$$ packed form
11096A31544Q5204b1864C84496B5040d9032F8493B2366M09331C2689L06247j6518
11085C22418H0870L6112c7637D75526A52336E2321L19897K04514A98857K10001
11075D08858n7690p9281I4074O02040C18232K46696D6440P5474M67472k48104
11065C41282l903p1854o2517K51878N8526J06521k15718J07720j14674L27288
11055G24549O7266k11445A60306L97502J60958p1678K60296q1393l51467L90595
11045H65119J06757J86110D61879K19560p6405M7306K00017J00551k00214j22536
11035F30158j78087M44075l21318K81286k13327j43322j6263L93149k51270o6666
11025E58415J07197A42933K73264N39033k55258k05350J94570j73266l1670J44026
$$ plain form
11015 628282 645255 782745 766644 676091 867516 660967 373245 522013 594923 286565
11004 694206 314568 482227 436549 546366 470513 640643 547859 474121 577154 584462 326862
10993 326862 745540 724805 787151 602276 446299 1311789 1160328 1028238 1152515 1231360
10983 1231360 1120539 1111301 1071263 1469566 1510418 1697738 1637093 1873265 1961744 2431997
10973 2431997 2849303 3416025 2736952 2822319 2694232 2332260 1938417 1732779 1715030 1299487
10963 1299487 1542127 1576612 1693324 1481427 1481004 1438751 1598541 1211347 722544 1063099
10953 1063099 1024430 556440 969664 390902 922943 260788 378121 359189 478456 180154
10942 137049 469184 174794 -69410 176038 78088 68424 -277272 -50416 297932 -65548 187164
$$ packed form
11015F28282J6973J37490j6101r0553J91425k06549k87722J48768P2910B86565
11004F94206C14568J67659m5678J09817p5853J70130r2784p3738J03033P308k57600
10993C26862M18678k0735O2346j84875j55977Q65490j51461j32090J24277P8845
10983A231360j10821r238m0038L98303M0852J87320o0645K36172Q8479M70253
10973B431997M17306N66722o79073Q5367j28087l61972l93843k05638j7749m15543
10963A299487K42640L4485J16712k11897m23m2253J59790l87194m88803L40555
10953A063099l8669m67990M13224C90902N32041B60788J17333j8932J19267A80154
10942A37049L32135A74794f9410A76038G8088r664b77272e0416B97932f5548A87164
$$ plain form
10930 -26927 97493 255436 316092 -116517 -126457 127716 -144284 -39565 -88206 50635 -245807
10918 229361 -119993 -146724 72567 -276295 -55143 105557 9030 -67879 62864 -208540 181571
10906 11475 -77358 163035 257761 48838 -25923 290500 -129307 -8678 220185 -53623 19893
10894 364920 -297257 175937 -90301 373864 -67429 50946 7192 33584 -153283 109600 -343899
10882 -146863 59834 40313 -23695 -13293 142382 -149700 227107 -33321 38845 137452 -5550
10870 -20902 139808 198883 -10968 99652 -120771 -4478 -168747 -61142 -150375 27544 -132002
10858 -147052 -191720 -162043 37696 -438008 331375 -76529 166744 -58975 -114217 -189111 2164
10846 -27346 -43968 -120482 118930 -376947 20633 80233 -247077 -19719 -208944 47466 109083
$$ packed form
10930b6927I7493J57943O0656a16517r940A27716a44284c9565m8641E0635b45807
10918B29361a19993k6731G2567b76295e5143A05557I030f7879F2864b08540A81571
10906A1475g7358A63035R4726D8838b5923B90500a29307h678B20185e3623A9893
10894C64920b97257A75937i0301C73864f7429E0946G192K6392a53283A09600c43899
10882a46863E9834j9521b3695J0402A42382a49700B27107c3321C8845R8607e550
10870b0902A39808N9075a0968I9652a20771d478j64269f1142q9233B7544a32002
10858a47052m4668K9677C7696d38008C31375g6529A66744e8975n5242p4894B164
10846b7346j6622p6514A18930c76947B0633N9600b47077a9719j89225D7466O1617
$$ plain form
10835 109083 -112094 -245586 -176334 -60745 -346348 29891 -29973 260458 150259 21952
10824 -84328 -131849 165407 -174480 155100 -259356 -16151 92223 -156409 -22569 -204351
10814 -204351 -65640 142452 232661 -241670 -15258 -376926 102617 -86042 -64862 85818 -223666
10802 -423531 -135480 -173325 -66886 -83239 -307957 -84831 -336170 -102324 40346 -510006
10791 249341 57264 -25904 31894 -102245 -10153 50139 -8726 -254637 190541 282516 258059
10780 258059 6751 121207 157702 405531 39713 -22475 -202883 -113710 102259 25958 250560
10769 250560 49835 -154061 17412 104717 309456 11887 -337533 -235488 -204283 -233228 -29820
10757 -42315 31664 -384650 -154460 -157537 -232999 -457243 -140782 69416 113620 101174 -164260
$$ packed form
10835A09083a12094j33492O9252f0745k85603B9891b9973B60458j10199B1952
10824h4328m7521A65407a74480A55100b59356a6151I2223a56409b2569j81782
10814b04351f5640A42452R0209b41670a5258l61668A02617h6042K1180H5818b23666
10802d23531a35480l7845f6886j6353k24718h4831k51339a02324D0346e10006
10791B49341E7264b5904C1894a02245a0153E0139h726k45911A90541R1975k4457
10780B58059F751J14456L6495K47829C9713b2475j80408Q9173A02259B5958K24602
10769B50560D9835a54061A7412Q7305K04739A1887c37533J02045L1205k8945b9820
10757d2315C1664c84650a54460l077p5462k24244a40782F9416M4204j2446a64260
$$ plain form
10745 222430 180421 -220765 -156431 -95082 119807 -317820 -41469 -375115 -195763 -220187
10735 -220187 -314914 -35415 -311667 -320157 -233592 154829 -27566 -251036 228720 -527664 65301
10723 -39740 275543 223524 68704 -127359 62058 -133970 -406939 111513 38796 346752
10713 346752 156571 -26897 148943 234924 26124 152096 -51495 -9360 -4769 151648 331764
10702 331764 -240470 -122372 78087 -307559 -208493 226121 90488 -145863 -148276 135261
10691 -125258 -154884 -14090 -197764 -30474 -16524 196184 -353920 -216341 226227 -214567
10680 -144492 389028 -334742 53115 -9759 -107568 -22798 -218304 -44523 -234325 -105977 -174705
10669 -174705 156876 -202736 -318466 -252832 -95508 71846 141089 237167 32705 -166040 9205
$$ packed form
10745B22430m2009b20765O4334O1349A19807c17820d1469l33646J79352k4424
10735b20187r4727c5415k76252q490Q6565A54829b7566k23470B28720e27664F5301
10723c9740B75543n2019F8704a27359F2058a33970k72969A11513C8796L07956
10713C46752A56571b6897A48943Q5981B6124J25972e1495i360M591A51648J80116
10702C31764b40470J18098G8087c07559R9066B26121I0488a45863k413A35261
10691a25258k9626a4090j83674c0474J3950A96184c53920J37579B26227b14567
10680a44492C89028c34742E3115i759r7809b2798j95506d4523j89802a05977o8728
10669a74705A56876b02736j15730O5634i5508G1846O9243R6078C2705a66040I205
$$ plain form
10657 -387586 -29925 101453 7041 276355 139259 166803 -110834 209082 -27062 -152540
10647 -152540 63857 -3458 -122851 160349 236981 -15886 359201 -115959 101020 -76986 -49900
10636 -49900 -93225 -204541 -72554 94869 -43023 -228379 -25375 54 -278023 300030 54635
10624 -359062 115453 -32503 180465 -162109 -98892 -39914 -8627 -41182 -100891 -45985 186166
10612 -153226 -235209 -188640 -198036 -266844 -42789 -122156 70274 205199 -34875 -41540 -79487 -141619
10600 -141619 151411 34303 -328091 -53721 -153579 -105270 -92591 -84400 -187469 420717 275200
10589 275200 7415 -167946 -321292 -149486 85767 -375985 79434 48106 97776 182402 -165321
10577 8992 -33262 -280278 -54985 31572 -3600 -339519 51326 -96924 291396 -220354 187798
$$ packed form
10657c87586b9925A01453G041K69314j37096K7544a10834B09082b7062j25478
10647a52540F3857c458j19393A60349P6632a5886C59201a15959A01020g6986K7086
10636d9900m3325j11316g2554I4869d3023j85356b5375E4b78023C00030E4635
10624c59062A15453c2503A80465a62109O3217c9914h627l2555n9709d5985A86166
10612a53226q1983M6569r396o8808d2789p9367G0274J34925c4875o665l7947o2132
10600a41619A51411C4303c28091e3721r9858M8309J2679Q191j03069D20717j45517
10589B75200G415a67946j53346a49486H5767c75985G9434l1328M9670Q4626a65321
10577H992c3262k47016e4985C1572c600l35919E1326i6924B91396b20354A87798
$$ plain form
10565 -386510 62082 231615 -190438 7586 -224994 -312814 33527 279314 -262645 -46053 -58891
10554 -58891 38519 143423 159146 -122953 486651 -15124 -63617 -154728 51359 116675 223949
10543 223949 84863 -142794 -104699 -106599 -196181 340945 85645 246226 50890 -149943 -2228
10531 110156 14996 -63317 -126643 36308 -154222 -12963 251079 3229 -59351 -375808 -275436
10520 -275436 -163556 68297 -41799 122329 172187 284110 93352 -9654 -231034 -160392 98465
10508 -170327 155333 199750 -64214 37448 76440 -177026 169956 -103020 -192426 43854 212018
10497 212018 222430 7151 58340 169108 -35406 -181165 -20985 49183 -276645 -186300 185712
10485 -4998 54414 199619 324449 569531 400364 509054 -46947 266690 11348 58806 -6454
$$ packed form
10565c86510F2082J69533a90438G586b24994q7820C3527K45787b62645d6053j2838
10554e8891C8519J04904J5723a22953D86651a5124m8493r1111E1359O5316J07274
10543B23949H4863a42794L8095j900q9582C40945H5645J60581E0890a49943b228
10531A10156A4996f3317o3326C6308a54222a2963B51079C229e9351l16457J00372
10520b75436J11880F8297d1799A22329M9858J11923I3352i654k21380P0642I8465
10508a70327A55333M4417f4214C7448L8992a77026A69956a03020q9406D3854J68164
10497B12018J0412G151N1189J10768c5406j45759b0985D9183b76645R0345A85712
10485d998E4414J45205J24830K45082j69167J08690d6947B66690A1348M7458f454
$$ plain form
10473 -227316 285859 166295 113639 102841 -364069 81414 116531 -65434 -108868 27209 -205961
10461 -74113 -129733 -112377 -150274 -121927 133351 -149878 -28992 -124172 -96222 59104 149706
10450 149706 -48164 -166491 121703 -57124 16280 -48345 -389948 -71204 146146 -91620 -232348
10439 -232348 -219318 198200 36715 154339 -305256 89706 103331 164512 255271 237359 -329081
10427 115919 -337230 212026 237095 -375967 47049 30453 -14912 7657 97809 -11398 76845
10415 82011 -276704 98471 17224 91515 71332 177116 164517 -288267 -133494 -16228 307697
10403 371805 -3425 116841 55135 161676 48025 107441 -66250 161665 -136734 -209618 -48163
10391 -192079 103099 439925 209061 91990 305978 399774 34874 -200229 1653 -235301
$$ packed form
10473b27316B85859j19564n2656j0798c64069H1414L5117f5434m3434B7209b05961
10461g4113n5620J7356l7897K8347A33351a49878b8992r5180K7950E9104R0602
10450A49706d8164j18327A21703e7124A6280d8345l41603g1204A46146i1620j40728
10439b32348J3030A98200C6715J17624c05256H9706J3625O1181R0759j7912c29081
10427A15919c37230B12026K5069c75967D7049j6596a4912G657R0152a1398G6845
10415H2011b76704I8471A7224P4291k0183J05784j2599b88267a33494a6228C07697
10403C71805c425A16841E5135J06541D8025N9416f6250A61665a36734p2884d8163
10391a92079A03099L36826B09061I1990K13988R3796C4874b00229A653b35301
$$ plain form
10380 77031 445534 325330 131674 36775 -112373 395120 233456 234679 28427 389269
10370 389269 442667 325672 369000 455620 571773 408002 549269 214948 112712 423150
10360 423150 195216 -8497 -18769 154019 193517 256089 24525 181637 494497 213561 734865
10349 734865 499443 494822 133605 -90593 168778 324801 159628 302680 309778 576452
10339 576452 -192183 -83575 3352 317316 131198 -154544 307516 50878 142699 -192608
10328 105343 244487 216149 236549 93580 89730 308774 481523 148750 163248 10537 73390
10317 73390 203626 111482 177252 201933 -12989 -37733 -147696 251745 -34155 -203809 -135834
10306 -135834 -55690 187121 -80074 259836 -38960 188877 -150770 131739 -116992 123159
$$ packed form
10380G7031L68503j20204A31674C6775a12373C95120j61664J223B8427L60842
10370C89269N3398j16995M3328Q6620J16153j63771J41267B14948j02236L10438
10360D23150A95216h497j0272A54019L9498O2572B4525J57112L12860B13561N21304
10349G34865k35422m621A33605i0593A68778J56023A59628J43052P098K66674
10339E76452a92183h3575C352L13964A31198a54544C07516E0878R1821a92608
10328A05343J39144k8338K0400I3580l850K19044J72749A48750J4498A0537O2853
10317G3390J30236r2144O5770K4681a2989k4744j09963B51745c4155j69654O7975
10306a35834e5690A87121h0074B59836c8960A88877a50770A31739a16992A23159
$$ plain form
10295 -109295 -190736 252054 128182 -54149 -324220 162022 -86804 42294 32684 -89687 -102577
10284 -102577 31934 -23174 -458205 -96790 -183980 29813 -332736 -143818 124986 299954
10274 299954 -34942 199298 14124 121118 143196 93265 215666 168172 71025 -44375 -50988
10263 -50988 68254 332214 35592 137709 332952 55217 -26655 195182 86407 -168654 -227415
10252 -227415 -139771 -199683 14239 73583 266994 284831 -71040 84857 -142301 -91135 39944
10240 87757 46024 -203843 122283 131474 -288739 -176092 60505 -152969 -44205 -66773 -101218
10229 -101218 -191233 -162739 -32759 113371 -29604 -28302 162414 -288657 1057 -29689 30529
10217 -311993 239454 -117669 150725 -245296 -125370 -88950 -340401 239207 -273708 -37083
$$ packed form
10295a09295q1441B52054j23872e4149k70071A62022h6804D2294r610h9687j2890
10284a02577C1934b3174m35031i6790q7190B9813c32736a43818A24986J74968
10274B99954c4942A99298A4124J06994K2078m9931J22401m7494G1025d4375o613
10263e0988F8254K63960C5592J02117J95243E5217b6655A95182H6407a68654n8761
10252b27415Q7644n9912A4239N9344J93411J7837g1040H4857a42301N1166C9944
10240H7757m1733b03843A22283R191b88739J12647F0505a52969d4205k2568l4445
10229a01218r0015K8494c2759A13371b9604J302A62414b88657A057b9689C0529
10217c11993B39454a17669A50725b45296J19926L6420k51451B39207b73708c7083
$$ plain form
10206 -244113 -85621 -408751 -118336 -94682 -183929 -308495 -159122 -202557 -282323 -183867 -38301
10194 -159799 66532 -88969 143048 129005 -136105 -75876 129157 -35556 -87380 -40721 -204767
10183 -204767 -61939 37941 -89431 -573 -422699 185405 51542 -75141 114650 76222 -19132
10171 44756 -92296 -270309 -3760 -100025 -10078 226405 329601 8090 -379924 -14954 61073
10159 283976 1546 37628 91537 -144913 -442550 -28506 -184652 -357356 -77007 -31789 -181460
10148 -181460 112815 106095 -193705 -332351 2672 223233 -44467 -7268 -383924 -123879 -83888
10137 -83888 -145444 -103955 -220683 -98115 28803 94052 142192 -96561 256923 -364560 -277612
10126 -277612 -399821 27842 -55213 8702 201441 -31398 93926 247574 -47257 -396913 -132651
$$ packed form
10206b44113h5621l23130a18336K3654q9247j24566J49373m3435p9766R8456c8301
10194a59799F6532h8969A43048j4043a36105O0229A29157c5556n1824d0721j64046
10183b04767f1939C7941h9431e73m22126A85405E1542g5141A14650l8428a9132
10171D4756i2296j78013c760r6265a0078B26405J03196H090c79924a4954F1073
10159B83976A546L6082N3909a44913k97637b8506j56146j72704g7007c1789j49671
10148a81460A12815o720a93705j38646B672K20561d4467g268l76656a23879L9991
10137h3888o1556M1489j16728i8115B8803O5249M8140i6561B56923c64560Q6948
10126b77612j22209B7842e5213H702J92739c1398I3926J53648d7257l49656a32651
$$ plain form
10114 -24976 -98996 -228932 -17590 -25893 -201467 -57372 -169997 -135740 -271351 -154757 -170804
10103 -170804 -448614 -254732 -48187 17077 6123 -30909 -151858 -232031 -162008 -212690 -198981
10092 -198981 -305818 -223371 -50507 227736 154745 4362 8726 -415784 -11417 92790 -16445
10080 210152 -185337 -216607 -469919 -262768 -19348 -149642 198522 -75845 -77754 -228528
10070 -228528 1735 83262 -316458 136560 -214396 -286033 16400 271971 -292330 162826
10059 -156907 38817 -201402 -288823 -47275 -204934 189800 291081 196424 120399 273077
10049 273077 175303 -266100 -331102 -55168 -49725 185650 -349976 53407 152072 -196734 72864
10037 -33969 188981 -89763 31628 -133961 126968 -20356 166711 -18332 116909 -241969
$$ packed form
10114b4976p4020j29936a7590q303j75574e7372j12625L4257j35611J16594j6047
10103a70804k77810J93882d8187A7077F123c0909j20949q0173P0023n0682J3709
10092a98981j06837Q2447e0507B27736p2991D362M364d15784a1417I2790a6445
10080B10152a85337l1270k53312K07151a9348j30294A98522g5845j909j50774
10070b28528A735Q1527c16458A36560b14396p1637A6400K55571b92330A62826
10059a56907C8817b01402q7421d7275j57659A89800J01281r4657p6025J52678
10049B73077r7774b66100o5002e5168N443A85650c49976E3407R8665a96734G2864
10037c3969A88981h9763C1628a33961A26968b0356A66711a8332A16909b41969
$$ plain form
10026 -203162 -487907 -228952 152547 146449 154874 237651 114829 -135835 -158073 -8584 -72344
10015 -72344 -76381 -93097 -224324 -220610 -424020 -225430 99937 -159960 156359 -147000 71823
10003 -55515 -202413 154897 -272355 -211011 -282257 -126053 164188 22442 -181992 601 -348572
9991 378334 -154364 -151022 -310565 -144222 -180449 -26537 -81181 -277488 8726 -271937 -218386
9980 -218386 -217541 -88383 -10804 92486 14181 -386877 -62559 -56149 -19679 -232466 201345 -168364
9967 -220089 288777 3781 44639 -163687 -67439 124351 -282774 72266 -275758 -77313 195605
9955 23889 -204986 -163187 -50601 -330729 -110488 101432 2269 -32141 -129923 114771 232253
9944 232253 176562 -317523 -160396 -72249 -73502 28393 218808 -134010 191617 -79911 34129
$$ packed form
10026b03162k84745b28952A52547o098Q425Q2777A14829a35835k2238h584o3760
10015g2344m037j6716j31227L714k03410J98590I9937a59960A56359a47000G1823
10003e5515j46898A54897b72355O1344p1246a26053A64188B2442a81992F01c48572
9991C78334a54364L342j59543a44222l6227b6537n4644j96307H726b71937N3551
9980b18386Q45h8383a0804I2486A4181c86877f2559O410a9679k12787B01345a68364
9967b20089B88777C781M0858a63687f7439A24351b82774G2266b75758g7313A95605
9955B3889b04986M1799e0601k80128a10488A01432B269c2141r7782A14771J17482
9944B32253n5691c17523J57127g2249j253B8393J90415a34010A91617g9911C4129
$$ plain form
9932 24283 -313424 -23073 -300062 -416 -72 -166225 13875 133924 -41919 -452564 -180780 -111086
9920 -111086 -255467 52744 -361829 -107554 -97354 -82597 -93615 -29953 7566 9888 108751
9909 108751 336951 -111900 42195 -225558 -235342 -211815 -336773 -111362 -269649 -133416
9898 23343 87319 -33466 -130729 -100335 203820 -202968 -54032 -283473 67544 -235690 15392
9886 178345 -40615 -6645 -375771 107802 -154928 -16313 -238106 -88780 -150299 324910 -331852
9874 -84902 22157 149945 247457 -115668 190108 -213029 27444 -82745 -192799 72035 -259835
9862 176113 153354 -9221 -204586 -276629 -246478 -77835 244026 85627 -289265 117348 -29473
9850 -41737 -44901 -37473 -278530 -297298 -71117 162132 -221656 64507 -62727 -152257 -379155
$$ packed form
9932B4283c13424b3073k76989d16g2j66153A3875J20049d1919m10645a80780O9694
9920a11086j44381E2744c61829a07554J0200J4757j1018b9953G566K322R8863
9909A08751K28200a11900D2195b25558r784K3527j24958a11362j58287a33416
9898B3343O3976c3466r7263L0394B03820b02968e4032k29441F7544b35690A5392
9886A78345d0615f645l69126A07802a54928a6313k21793h8780o1519C24910c31852
9874h4902B2157J27788R7512a15668A90108b13029B7444h2745j10054G2035b59835
9862A76113k2759i221j95365p2043L0151g7835B44026H5627b89265A17348b9473
9850d1737l164P428k41057j8768g1117A62132b21656F4507f2727q9530k26898
$$ plain form
9839 -379155 -412358 -114793 -171175 -342634 76018 2556 -221721 -219391 -134960 176921 -253219
9827 41249 215884 446759 -213907 1639 -399202 210296 -324194 101598 18327 -132429
9816 -84605 35578 73177 83681 94831 126940 -141291 77014 63854 -158503 -44243 123781
9804 -25171 -45723 -204354 -164245 -117555 10702 449823 -100505 16485 234259 -40718 75844
9792 -107618 -73132 5788 -46253 42730 -353353 -280513 -327456 215210 136926 -455970 -157848
9780 -33087 18875 63637 -55839 40446 -327248 16936 24327 191386 3685 -3640 22301 -388757
9767 -271594 -133338 -7300 -46427 -243525 -38311 -277455 -273079 128746 188504 -27560 -216309
9756 -216309 -87418 194063 -361117 105085 165918 -215644 116397 -408797 102000 -196055
$$ packed form
9839c79155l3203a14793n6382j71459G6018B556b21721K330Q4431A76921b53219
9827D1249J74635K30875b13907A639c99202B10296c24194A01598A8327a32429
9816h4605C5578L7599J0504J1150L2109a41291G7014j3160a58503d4243A23781
9804b5171k0552j58631M0109M6690A0702M39121a00505A6485K17774d0718G5844
9792a07618L4486E788d6253D2730c53353P2840m6943B15210p8284d55970a57848
9780c3087A8875M4762e5839D0446c27248A6936P391J67059C685c640B2301c88757
9767b71594a33338g300l9127j97098c8311k39144M376A28746N9758b7560j88749
9756b16309h7418A94063c61117A05085O0833b15644A16397d08797A02000a96055
$$ plain form
9745 270937 -128127 209080 -96845 166217 119936 -52855 163993 -186365 -17551 32313 -165639
9733 -200530 -60850 44769 63201 -129228 124736 -336904 -177790 -61888 289049 104093
9722 -92814 5810 -38526 -109418 -232382 195863 -157501 -132735 -132532 -218412 -37214 -125706 -345283
9710 -345283 -17283 242860 60425 -237693 -119365 -210265 -232268 -90453 -107119 125625 -33734
9698 -246866 -201374 -123476 44785 -140967 11984 -349035 -358982 138505 97380 -209567 30762
9686 -56340 76491 66291 221471 -306387 -45577 -206647 275998 -236782 -362037 -245840
9676 -245840 234455 113770 -136894 127354 -141442 -325166 -258926 -119674 -136039 -149246
9666 -149246 -73771 -759 -109951 -254806 -35702 291210 133950 -215003 -43687 -84424 -20998
$$ packed form
9745B70937a28127B09080i6845A66217m6281e2855A63993a86365a7551C2313a65639
9733b00530f0850D4769J8432a29228A24736c36904J59114f1888B89049A04093
9722i2814E810c8526p0892j22964A95863a57501K4766K03q5880c7214q8492k19577
9710c45283a7283B42860F0425b37693J18328r0900k2003i0453j6666A25625c3734
9698b46866M5492P7898D4785a40967A1984c49035r947A38505m1125b09567C0762
9686e6340G6491j0200J55180c06387d5577j61070B75998b36782j25255J16197
9676b45840B34455A13770a36894A27354a41442j83724O6240a19674j6365j3207
9666a49246g3771g59j09192j44855c5702B91210A33950b15003d3687m0737b0998
$$ plain form
9654 -240452 -14536 156013 -286881 -383924 116312 -288861 100954 -70825 -6216 -101925 -122651
9643 -122651 461403 108058 219796 187763 26933 9285 -238193 -138693 210511 -354297 -339776
9632 -339776 203909 -257781 152922 42487 64596 8740 -15763 -10965 24203 -6269 164589
9620 172329 -313589 68214 -243107 -315047 -406766 -53749 -186813 -273695 150265 -417172 20131
9608 60128 -126106 -231355 -6239 -221971 -33257 24043 -212951 -152936 -61568 36902 -50201
9596 -153612 -12369 -243068 -41355 -230322 -214592 146546 82320 -7033 -393030 -164021 -335299
9585 -335299 -342730 -173260 8057 -50272 256783 -169957 6649 -219749 -211699 -108513 -59033
9574 -59033 -79835 -120663 186137 261172 -255869 -87931 -379147 9187 26049 -60043 -416987
$$ packed form
9654b40452a4536A56013b86881r7043A16312b88861A00954g0825f216r5709k0726
9643a22651D61403A08058J11738l2033B6933I285b38193R9500B10511c54297J4521
9632c39776B03909b57781A52922D2487K2109H740a5763M798B4203f269A64589
9620A72329c13589F8214b43107p1940r1719e3749j33064q6882A50265d17172B0131
9608F0128a26106j05249f239k15732c3257B4043b12951O0015f1568C6902e0201
9596a53612a2369k30699d1355j88967J5730A46546o4226g033l85997a64021j71278
9585c35299p431J69470H057e0272B56783a69957F649b19749Q050J03186M9480
9574e9033k0802m0828A86137P5035b55869h7931k91216I187J6862f0043l56944
$$ plain form
9563 -416987 -172238 -146940 -203593 -81464 -57029 130023 -143196 -27808 283579 67617 -236320
9551 -133460 510473 -135975 -26347 -161382 -129167 52441 -455507 -100721 -241235 32051
9540 135390 -225987 -25027 -104869 128961 -53157 179935 61199 -30253 84253 -51506 8797
9528 -77340 -385712 147360 -138320 159917 -48454 -65925 -204259 208165 28035 210835
9518 210835 -38568 -182840 -115981 147536 213408 -100928 -180999 -99683 61255 -32291 -122699
9507 -122699 -239128 -399728 19721 -89107 -1095 191881 -4402 -30437 143379 208485 119822
9496 119822 -75150 96534 -231187 -113789 -26477 83089 -41515 47542 -71389 -150225 275136
9484 -344878 100283 151832 -99363 -22575 -163907 -96833 49811 -139678 -157958 -169041 -366950
$$ packed form
9563d16987a72238K5298n6653h1464K4435A30023a43196b7808B83579F7617b36320
9551a33460E10473a35975b6347j35035L2215E2441d55507a00721j40514C2051
9540A35390b25987b5027p9842A28961e3157A79935F1199c0253H4253e1506H797
9528g7340l08372A47360a38320A59917d8454j7471j38334B08165B8035J82800
9518B10835c8568j44272O6859A47536O5872a00928q0071Q1316F1255c2291r0408
9507a22699j16429j60600A9721h9107a095A91881d402k6035A43379O5106q8663
9496A19822g5150I6534b31187a13789b6477H3089d1515D7542g1389p8836B75136
9484c44878A00283N1549i9363b2575j41332O7074D9811a39678j8280j1083j97909
$$ plain form
9473 -366950 -187084 29910 -125543 -124224 -180982 -67172 149745 -222620 101542 -410284 -111218
9461 -92263 -10200 -262622 -369408 -206162 7684 -320349 50997 -50702 -116330 48767 -125417
9449 -165975 90580 -29343 -185013 -120192 278 106060 -44610 -272847 -67797 -197032 -87925
9437 -86387 143885 -241206 -27264 111735 -8033 -96387 8830 -173934 -126815 282406 210842
9426 210842 94866 -20738 51900 88607 -32631 -273457 253031 101253 -196040 -111280 92714
9414 -253905 17193 -50416 -116557 -107537 125118 43046 -229039 -96978 -117164 -111829 26792 -122680
9401 -51048 98076 -188327 -167974 -88055 183096 -269498 229520 -252470 336067 348159 -214259
9389 -285202 -81669 280279 -17231 -52316 -2903 22533 -129394 -140054 -289678 -58324 -72097
$$ packed form
9473c66950J79866B9910a25543J319n6758f7172A49745b22620A01542d10284a11218
9461i2263a0200k52422j06786J63246G684c20349E0997e0702o5628D8767a25417
9449a65975I0580b9343j55670O4821B78J05782d4610k28237f7797j29235h7925
9437h6387A43885b41206b7264A11735h033q8354H830a73934M7119B82406p1564
9426B10842I4866b0738E1900L6707c2631k40826B53031A01253a96040Q4760I2714
9414b53905A7193e0416o6141R020A25118D3046b29039i6978k0186N335B6792a22680
9401e1048I8076a88327K0353P9919A83096b69498B29520b52470C36067J2092b14259
9389b85202h1669B80279a7231l5085b903B2533a29394j0660j49624e8324j3773
$$ plain form
9378 -72097 -100451 86936 -234920 35777 -167974 114643 -122953 -318841 -21506 -246138 -165858
9367 -165858 -62606 70359 -144738 -165827 51345 152383 -74372 -252691 -177127 81020 -263700
9355 -30889 -3370 -267083 56996 97949 -396137 160192 -79478 17766 -80511 19500 129747
9344 129747 -104177 -235090 -377312 178680 -81344 -58355 -492025 53791 -124996 78998
9333 99480 -22882 215096 -190734 -76455 -191567 -92260 -209209 51957 -248948 160250 -76966
9321 -153445 -52010 -229945 -34469 173161 -390290 52160 109514 -196493 -251867 -82246 -168531
9310 -168531 -317090 291786 101673 -35727 -94854 20177 38 -244394 -283512 -51442 -205938
9299 -205938 -96674 -85957 287661 85505 -187108 -104 -368602 -15702 -147324 83088 -97608
$$ packed form
9378g2097k8354H6936b34920C5777a67974A14643a22953j95888b1506k24632Q0280
9367a65858f2606G0359a44738k1089E1345J01038g4372j78319P5564H1020b63700
9355c0889c370k63713E6996M0953c96137A60192g9478A7766h0511A9500J10247
9344A29747a04177j30913j42222A78680h1344K2989m33670E3791a24996G8998
9333I9480b2882B15096a90734g6455j15112i2260j16949E1957b48948A60250g6966
9321a53445e2010j77935c4469A73161c90290E2160N7354a96493n5374h2246q6285
9310a68531j48559B91786A01673c5727n9127B0177C8b44394l9118e1442j54496
9299b05938i6674J0717B87661H5505a87108a04l68498a5702j31622H3088i7608
$$ plain form
9287 -200405 -215364 63929 -150880 -14989 -139495 -254373 86204 70234 186526 242346 311952
9276 311952 -21126 -83297 -407720 116015 -56538 -70930 38719 10778 -82881 314482 182447
9265 182447 57175 127252 148512 -174026 -2568 143664 -307228 -43038 -142783 302966 113672
9253 -100418 -94023 100516 35242 -177030 -287013 -68873 -330523 -205329 1454 255005 147430
9242 147430 -368022 -147775 88605 97183 87042 39658 -145603 -248957 -337960 60293 154256
9231 154256 -84012 59400 70441 47957 -231065 -91266 -28375 -50927 -75285 152814 -5797
9219 -146745 -35816 229343 26167 -302081 228429 -37979 -10279 424903 -263893 -28633 -17009
9208 -17009 -200153 192822 31336 -301432 -21781 -198780 53342 218602 218581 -174269 -149069
$$ packed form
9287b00405j4959F3929a50880a4989j24506j14878H6204j5970J16292N5820O9606
9276C11952b1126o2171l24423A16015e6538j4392C8719A0778h2881C14482j32035
9265A82447E7175P0077K1260a74026b568A43664c07228d3038r9745C02966A13672
9253a00418O395A00516C5242a77030j09983f8873k61650J25194A454K53551j07575
9242A47430c68022a47775H8605Q578j0141C9658a45603j03354q9003F0293R3963
9231A54256h4012E9400J1041k2484b31065i1266b8375k2552k4358A52814e797
9219a46745c5816B29343B6167c02081B28429c7979a0279D24903b63893b8633J1624
9208a7009j83144A92822C1336c01432b1781j76999E3342J65260k1a74269K5200
$$ plain form
9197 -149069 72022 -481998 -354336 3316 -3819 28099 -78401 173046 203291 63016 -189702
9185 9789 -18799 60978 -86016 -7297 -343491 -225012 109843 32708 -150996 -92742 -39565
9173 -239096 -100795 19056 70549 -113060 -71242 -263506 38011 -36916 -22276 148629 25885
9161 -282084 12473 -403823 143600 -257329 34949 -145493 3464 111425 71682 -222366 -72231
9149 80051 -58096 -42521 -136746 242130 -35303 -53880 -177920 42606 7053 129709 -280481
9137 2270 -254841 -73964 322383 43775 -330833 -153006 -88681 -296719 -228600 -313114 214331
9125 -115073 -145065 187696 -66558 -165072 44666 -113263 -25327 -190646 239988 128648 44062
9113 -335296 -55856 -219975 -147859 -129996 -164166 18276 189995 -52426 302835 54942 85427
$$ packed form
9197a49069G2022d81998J27662C316c819B8099g8401A73046L0245F3016a89702
9185I789a8799F0978h6016g297l36194J18479A09843C2708a50996N8254c9565
9173b39096a00795A9056N1493a13060M1818j92264C8011c6916J4640A48629B5885
9161b82084A2473d03823A43600b57329C4949a45493C464J07961l9743b22366g2231
9149H0051e8096J5575r4225B42130c5303j8577j24040D2606G053J22656b80481
9137B270b54841g3964C22383D3775c30833a53006O4325k08038O8119q4514B14331
9125a15073k9992A87696f6558r8514D4666a13263b5327j65319B39988j11340D4062
9113c35296e5856j64119P2116J7863l4170A8276J71719e2426C02835E4942L0485
$$ plain form
9102 85427 -141962 -288081 -30714 275608 12202 -62055 -50244 215232 324668 15335 88312
9091 88312 -102922 -26766 22758 -274702 -257263 -256282 -25476 -94368 25234 -300827 -135368
9079 -15686 -154208 107014 -35167 142888 -139342 -108829 -200537 76632 48524 -205148 -107143
9068 -107143 253887 -266164 -249287 7994 -128207 -413097 -175938 194948 198576 -39660 -70694
9057 -70694 -180424 -166753 116170 -365682 -3406 -122275 170036 -50300 237152 -91242 -87260
9046 -87260 -264336 256414 219928 -69212 16421 -292798 274430 -83462 -243460 -13011 -121265
9035 -121265 -429097 -74524 -84013 6343 59728 -306164 -54987 1722 -172138 -52568 -99895 -258871
9023 -258871 164286 -304737 346371 174395 10717 225494 -273164 34912 -25174 -148572
$$ packed form
9102H5427a41962j46119c0714B75608A2202f2055J1811B15232J09436A5335P2977
9091H8312a02922b6766B2758b74702J7439R81b5476o8892B5234c00827a35368
9079a5686j38522A07014c5167A42888a39342L0513r1708G6632k8108b05148R8005
9068a07143B53887b66164J6877G994a28207k84890a75938A94948L628c9660l1034
9057g0694j09730J3671A16170c65682c406j18869A70036e0300B37152i1242L982
9046h7260j77076B56414l6486f9212A6421b92798B74430h3462j59998a3011j08254
9035a21265l07832g4524r489F343N3385c06164e4987A722a72138e2568m7327j58976
9023b58871A64286c04737C46371j71976A0717K14777b73164C4912b5174j23398
$$ plain form
9013 -148572 136978 -106943 63214 -59531 -446563 303742 -40836 85659 -81733 -91013 -317159
9002 -317159 12423 -142622 -190658 -353765 -135279 147441 -75379 -79662 -184711 -207432 -261481
8991 -261481 124193 -13465 80316 -38517 272863 -80281 -176179 -51975 -113137 -92504 111084
8979 345683 67793 -272760 7637 163122 -169515 -18563 85811 -137597 51053 -193180 206171
8967 274379 108469 16997 -30147 109340 -15844 111790 -394573 50366 -208602 -183244 41975
8955 -163634 8408 -312203 -386048 -48143 -123181 -41121 -268999 60635 -94366 19728 144992
8944 144992 291695 118088 -166715 3588 -68131 121313 -156463 249688 214883 399948
8934 399948 -4711 49597 -82052 200712 42441 90082 56731 523439 634070 1128438 2553703
$$ packed form
9013a48572A36978a06943F3214e9531l87032C03742d0836H5659h1733r280k26146
9002c17159A2423a42622m8036j63107a35279A47441g5379m283j05049k2721n4049
8991b61481A24193a3465H0316c8517B72863h0281r5898e1975o1162K0633A11084
8979C45683F7793b72760G637J55485a69515a8563H5811a37597E1053a93180B06171
8967B74379A08469A6997c0147A09340a5844A11790c94573E0366b08602K5358D1975
8955a63634H408c12203p3845d8143p5038d1121k27878F0635i4366A9728J25264
8944A44992J46703A18088a66715C588f8131A21313a56463B49688l4805J85065
8934C99948d711D9597h2052B00712D2441M7641l3351M66708J10631M94368J425265
$$ plain form
8923 2553703 6929120 11468173 9677197 5016023 2030023 626042 467833 253923 247309
8914 247309 352486 38403 -178352 101599 11182 241050 390079 208951 -321765 -98288
8903 88041 -49837 54436 -38615 -145306 -13230 -10834 35291 -283171 -457358 -86256 115074
8891 -234371 -261701 -267136 -295587 -19367 37399 -355015 -239875 -86430 -30067 -174170 423133
8879 83197 -185511 -135875 13646 -413349 -234240 89591 160998 -246429 7989 -106390 -97633
$$ packed form
8923B553703M375417M539053j790976m661174B030023F26042j58209k13910o614
8914B47309J05177C8403a78352A01599A1182K29868J49029j81128c21765i8288
8903H8041d9837E4436c8615j06691a3230K396C5291b83171j74187h6256A15074
8891b34371k7330n435k8451a9367C7399c55015J15140h6430c0067j44103D23133
8879H3197a85511M9636A3646d13349J79109H9591P1407b46429G989a06390Q757
$$ [...]
##END NTUPLES=NMR SPECTRUM
##END=
