##TITLE=AC1583_13IEXT2754_8214317_CFdQjpgJHK
##JCAMPDX= 6.0         $$ Bruker NMR JCAMP-DX V2.0
##DATA TYPE= NMR SPECTRUM
##DATA CLASS= NTUPLES
##ORIGIN= BRUKER
##OWNER= Administrator
$$ 1.72 TOPSPIN		Version 2.1
$$ 2013-10-11 18:13:37.589 -0700  Administrator@X
$$ Compression mode = diff/dup
##.OBSERVE FREQUENCY= 400.02188249412
##.OBSERVE NUCLEUS= ^1H
##.ACQUISITION MODE= SIMULTANEOUS (DQD)
##.ACQUISITION SCHEME= undefined
##.AVERAGES= 64
##.DIGITISER RES= 22
##SPECTROMETER/DATA SYSTEM= spect
##.PULSE SEQUENCE= noesygpps1d.comp
##.SOLVENT NAME= COFFEE_meoh
##.SHIFT REFERENCE= INTERNAL, COFFEE_meoh, 1, 14.96074
##AUDIT TRAIL= $$ (NUMBER, WHEN, WHO, WHERE, PROCESS, VERSION, WHAT)
$$ ##TITLE= Audit trail, TOPSPIN		Version 2.1
$$ ##JCAMPDX= 5.01
$$ ##ORIGIN= Bruker BioSpin GmbH
$$ ##OWNER= Administrator
$$ $$ E:\/data/COFFEE/nmr/AC1583_13IEXT2754_8214317_CFdQjpgJHK/22/pdata/1/auditp.txt
$$ ##AUDIT TRAIL=  $$ (NUMBER, WHEN, WHO, WHERE, PROCESS, VERSION, WHAT)
(   1,<2013-10-11 18:13:32.839 -0700>,<Administrator>,<X>,<go>,<TOPSPIN 2.1>,
      <created by zg
	started at 2013-10-11 18:02:02.525 -0700,
	POWCHK enabled, PULCHK disabled,
       configuration hash MD5:
       C8 4E 4E 5D D3 5C D8 9E 9F 52 82 E0 59 8A DE 15
       data hash MD5: 64K
       B0 67 23 62 27 C0 79 58 F9 F2 13 C0 94 F5 E9 69>)
(   2,<2013-10-11 18:13:35.745 -0700>,<Administrator>,<X>,<proc1d>,<TOPSPIN 2.1>,
      <Start of raw data processing
       efp LB = 0.3 FT_mod = 6 PKNL = 1 PHC0 = 0 PHC1 = 0 SI = 128K 
       data hash MD5: 128K
       54 83 91 55 E4 12 84 E2 F2 9C 15 A1 C2 AE B7 98>)
(   3,<2013-10-11 18:13:36.683 -0700>,<Administrator>,<X>,<proc1d>,<TOPSPIN 2.1>,
      <pk PHC0 = -81.41418 PHC1 = 0 
       data hash MD5: 128K
       1D 99 31 53 38 21 FA 9E 26 41 6D 36 1D 7D 5D 30>)
(   4,<2013-10-11 18:13:37.073 -0700>,<Administrator>,<X>,<proc1d>,<TOPSPIN 2.1>,
      <abs ABSG = 1 
       data hash MD5: 128K
       A6 A5 62 6E 19 19 C6 74 51 B0 0B BF 31 BF 27 00>)
(   5,<2013-10-11 18:13:37.183 -0700>,<Administrator>,<X>,<proc1d>,<TOPSPIN 2.1>,
      <abs ABSG = 2 
       data hash MD5: 128K
       F4 0C 22 31 4C 85 1C 10 D4 A7 C8 67 0F 03 5B 93>)
(   6,<2013-10-11 18:13:37.245 -0700>,<Administrator>,<X>,<proc1d>,<TOPSPIN 2.1>,
      <abs ABSG = 3 
       data hash MD5: 128K
       21 3D E8 E7 97 DA 76 DC C6 51 EF 10 A4 46 CD 2F>)
(   7,<2013-10-11 18:13:37.339 -0700>,<Administrator>,<X>,<proc1d>,<TOPSPIN 2.1>,
      <abs ABSG = 4 
       data hash MD5: 128K
       25 DA CC 4A 93 22 DD 3D CF 4A 3E AF 41 A5 A1 21>)
(   8,<2013-10-11 18:13:37.417 -0700>,<Administrator>,<X>,<proc1d>,<TOPSPIN 2.1>,
      <abs ABSG = 5 
       data hash MD5: 128K
       F5 B4 10 B7 97 6B 11 9B D1 8C 25 F2 56 7B 5F 4E>)
$$ ##END=
$$ 
$$ $$ hash MD5
$$ $$ 59 03 76 8C 11 5A 9B 26 3E 26 20 46 D8 AF E8 DF
##$RELAX= 
##$RELAX= 
##$RELAX= 
##$RELAX= 
##$RELAX= 
##$RELAX= 
##$RELAX= 
##$RELAX= 
$$ Bruker specific parameters
$$ --------------------------
##$DU= <E:\>
##$EXPNO= 22
$$ [...]
150 150 150 150 150 150 150 150
##$TP07= 0
##$TPNAME0= <>
##$TPNAME1= <>
##$TPNAME2= <>
##$TPNAME3= <>
##$TPNAME4= <>
##$TPNAME5= <>
##$TPNAME6= <>
##$TPNAME7= <>
##$TPOAL= (0..7)
0.5 0.5 0.5 0.5 0.5 0.5 0.5 0.5
##$TPOFFS= (0..7)
0 0 0 0 0 0 0 0
##$TUNHIN= 0
##$TUNHOUT= 0
##$TUNXOUT= 0
##$USERA1= <user>
##$USERA2= <user>
##$USERA3= <user>
##$USERA4= <user>
##$USERA5= <user>
##$V9= 5
##$VALIST= <valist>
##$VCLIST= <CCCCCCCCCCCCCCC>
##$VD= 0
##$VDLIST= <DDDDDDDDDDDDDDD>
##$VPLIST= <PPPPPPPPPPPPPPP>
##$VTLIST= <TTTTTTTTTTTTTTT>
##$WBST= 1024
##$WBSW= 4
##$XGAIN= (0..3)
0 0 0 0
##$XL= 0
##$YL= 0
##$YMAX_a= 6077970
##$YMIN_a= -12068372
##$ZGOPTNS= <>
##$ZL1= 120
##$ZL2= 120
##$ZL3= 120
##$ZL4= 120
##$ABSF1= 14.96074
##$ABSF2= -5.597442
##$ABSG= 5
##$ABSL= 3
##$ALPHA= 0
##$AQORDER= 0
##$ASSFAC= 0
##$ASSFACI= 0
##$ASSFACX= 0
##$ASSWID= 0
##$AUNMP= <proc_prof1d_extract.lims>
##$AXLEFT= 0
##$AXNAME= <>
##$AXNUC= <1H>
##$AXRIGHT= 0
##$AXTYPE= 0
##$AXUNIT= <>
##$AZFE= 0.1
##$AZFW= 0.1
##$BCFW= 0
##$BC_mod= 0
##$BYTORDP= 0
##$COROFFS= 0
##$CY= 15
##$DATMOD= 1
##$DC= 0
##$DFILT= <>
##$DTYPP= 0
##$F1P= 0
##$F2P= 0
##$FCOR= 0.5
##$FTSIZE= 131072
##$FT_mod= 6
##$GAMMA= 0
##$GB= 0
##$INTBC= 1
##$INTSCL= 1
##$ISEN= 128
##$LB= 0.3
##$LEV0= 0
##$LPBIN= 0
##$MAXI= 10000
##$MC2= 0
##$MEAN= 0
##$ME_mod= 0
##$MI= 0
##$NCOEF= 0
##$NC_proc= -2
##$NLEV= 6
##$NOISF1= 0
##$NOISF2= 0
##$NSP= 0
##$NTH_PI= 0
##$NZP= 0
##$OFFSET= 14.96074
##$PC= 1
##$PHC0= -81.41418
##$PHC1= 0
##$PH_mod= 1
##$PKNL= yes
##$PPARMOD= 0
##$PPDIAG= 0
##$PPIPTYP= 0
##$PPMPNUM= 2147483647
##$PPRESOL= 1
##$PSCAL= 4
##$PSIGN= 0
##$PYNMP= <proc.py>
##$REVERSE= no
##$SF= 400.02000974065
##$SI= 131072
##$SIGF1= 0
##$SIGF2= 0
##$SINO= 400
##$SIOLD= 131072
##$SPECTYP= <>
##$SREGLST= <1H.CDCl3>
##$SSB= 0
##$STSI= 131072
##$STSR= 0
##$SW_p= 8223.68421052631
##$SYMM= 0
##$S_DEV= 0
##$TDeff= 65536
##$TDoff= 0
##$TI= <>
##$TILT= no
##$TM1= 0
##$TM2= 0
##$TOPLEV= 0
##$USERP1= <user>
##$USERP2= <user>
##$USERP3= <user>
##$USERP4= <user>
##$USERP5= <user>
##$WDW= 1
##$XDIM= 131072
##$YMAX_p= 376655963
##$YMIN_p= -15254
##$CURPLOT= <Network HP LaserJet P1505>
##$CURPRIN= <$Network HP LaserJet P1505>
##$DFORMAT= <normdp>
##$LAYOUT= <+/1D_H.xwp>
##$LFORMAT= <normlp>
##$PFORMAT= <normpl>
##$SURQMSG= 1
$$ End of Bruker specific parameters
$$ ---------------------------------
##NTUPLES= NMR SPECTRUM
##VAR_NAME=  FREQUENCY,     SPECTRUM/REAL,   SPECTRUM/IMAG
##SYMBOL=    X,             R,               I
##VAR_TYPE=  INDEPENDENT,   DEPENDENT,       DEPENDENT
##VAR_FORM=  AFFN,          ASDF,            ASDF
##VAR_DIM=   131072,        131072,          131072
##UNITS=     HZ,            ARBITRARY UNITS, ARBITRARY UNITS
##FACTOR=    0.0627417313425164, 1,          1
##FIRST=     8223.62146879497, 2710,         -63449
##LAST=      0,             4787,            -63160
##MIN=       0,             -15254,          0
##MAX=       8223.62146879497, 376655963,    0
$$ Real data points
##PAGE= N=1
##DATA TABLE= (X++(R..R)), XYDATA
$$ [...]
61736D55975r22r87j055r77p48n29l40O5Q49J770K381K547K554K727L128L567
61720D70005L778L677L495L621M146M659M681M138L254K077M93j332k873l759
61706E00060m107m301m650n252n938o299o092n626n418n400m892l662k473k137
61692D33813k359k208j502j028j274j606j193k13L73N8p88j611k192k300j519
61677D14451Q4J512J704Q25P5J93O90P76M69L15M82O56O39M85J61k97m21K88J432
61658D24519J906J262L66K59Q23J124P59L27N30J325K141K599K793K948L044K913
61642D49638K618K396K192J534J82j293k108k251k395k800l066l027l245m087
61628D34288m968n049m359l591l055k473j629p24j8M50Q17J348K267L352L829
$$ y = [455975, 455053, 454066, 453011, 452034, 451286, 450757, 450417, 450482, 451331, 453101, 455482, 458029, 460583, 463310, 466438, 470005, 473783, 477460, 480955, 484576, 488722, 493381, 498062, 502200, 505454, 507531, 508024, 506692, 503819, 500060, 495953, 491652, 487002, 481750, 475812, 469513, 463421, 457795, 452377, 446977, 442085, 438423, 435950, 433813, 431454, 429246, 427744, 426716, 425442, 423836, 422643, 422430, 422803, 422861, 422073, 420462, 418270, 415970, 414451, 414535, 416047, 417751, 418576, 418651, 418844, 419534, 420310, 420779, 421094, 421576, 422232, 422871, 423356, 423517, 423220, 422799, 423087, 424519, 426425, 427687, 428053, 428312, 429135, 430259, 431018, 431345, 431875, 433200, 435341, 437940, 440733, 443681, 446725, 449638, 452256, 454652, 456844, 458378, 458560, 457267, 455159, 452908, 450513, 447713, 444647, 441620, 438375, 434288, 429320, 424271, 419912, 416321, 413266, 410793, 409164, 408440, 408422, 408872, 409689, 411037, 413304, 416656, 420485]
61613D20485L072J272q82k886m424n090m852m599n417p256q877r215q266o688
61599C56377n222m519m792n337n104l988k964k744l024l383m027n063n724n237
61585B95249l985l033k731k565k199j878j844j979k151k320k261j717q66k02R6
61570B65614K18J12n22j537k206k094j659j590j950k227k021j383o40j58n8n4
61554B47845K43P68J056R48Q86J193J503J284O76L59P11J526K346K766K510J728
61538B68348J149J429K332K984K961K664K491K232J615R07N23L07k17j033j592
61523B87100j598j430j630k304l092l556l421k693j666p90l59l76o60j017j288
61508B61220j397j348j123o10K15R77J057J89j136k069k164j702j204p97k26N79
$$ y = [420485, 423557, 424829, 423947, 421061, 416637, 411547, 406695, 402096, 396679, 389423, 380546, 371331, 363065, 356377, 351155, 346636, 341844, 336507, 331403, 327415, 324451, 321707, 318683, 315300, 311273, 306210, 300486, 295249, 291264, 288231, 285500, 282935, 280736, 278858, 277014, 275035, 272884, 270564, 268303, 266586, 265720, 265518, 265614, 265832, 265944, 265422, 263885, 261679, 259585, 257926, 256336, 254386, 252159, 250138, 248755, 248115, 247957, 247899, 247845, 248088, 248856, 249912, 250860, 251746, 252939, 254442, 255726, 256402, 256761, 257472, 258998, 261344, 264110, 266620, 268348, 269497, 270926, 273258, 276242, 279203, 281867, 284358, 286590, 288205, 289112, 289635, 289942, 289725, 288692, 287100, 285502, 284072, 282442, 280138, 277046, 273490, 270069, 267376, 265710, 264920, 264561, 264185, 263525, 262508, 261220, 259823, 258475, 257352, 256742, 256957, 257934, 258991, 259180, 258044, 255975, 253811, 252109, 250905, 250108, 249882, 250461]
61492B50461J167J034L38j59K4N87R08P57L20j87n57m50K92J176J426R37M70O54
61474B59198J191J263N89k76o30l00K91O68P35P33P40N06j15p24q07m38j67j64
61456B62293L4P39J515J687J119K98j80J1P59J530J801J632J557J811K123K357
61440B81086K816L592M183M232M113M243M336L985L576L757M315M410L780K908
61426C35332K102J295P39R91J969K857L155L120K988K598K052J908K250K286J463
61411C67105K69n95j288k382l832m984n342m791l466j951j206j655k604l046k790
61396C27442k274j754j340j421k172k815k294p34N89P87K60j03N1N06Q87Q97N16
61379C17028J32Q6K51M36R74K149L244L136J994J313J853K584K261J187N54P60
$$ y = [250461, 251628, 252662, 253000, 252841, 252865, 253452, 254360, 255117, 255437, 255250, 254693, 254243, 254535, 255711, 257137, 258074, 258544, 259198, 260389, 261652, 262241, 261965, 261335, 261035, 261326, 261994, 262729, 263462, 264202, 264708, 264593, 263869, 263062, 262624, 262457, 262293, 262327, 263066, 264581, 266268, 267387, 267685, 267505, 267516, 268275, 269805, 271606, 273238, 274795, 276606, 278729, 281086, 283902, 287494, 291677, 295909, 300022, 304265, 308601, 312586, 316162, 319919, 324234, 328644, 332424, 335332, 337434, 338729, 339468, 340459, 342428, 345285, 348440, 351560, 354548, 357146, 359198, 361106, 363356, 365642, 367105, 367374, 366779, 365491, 363109, 359277, 354293, 348951, 344160, 340694, 338743, 337537, 335882, 333278, 330232, 327442, 325168, 323414, 322074, 320653, 318481, 315666, 313372, 312638, 313227, 314014, 314274, 314171, 314222, 314728, 315615, 316512, 317028, 317160, 317246, 317497, 317933, 318907, 321056, 324300, 327436, 329430, 330743, 332596, 335180, 337441, 338628, 339182, 339942]
61363C39942J332J982K759L374L363K932K853L447M375N382O536P641Q180Q076
61349D02174P957Q379R226J0085J0646J0583R640Q169P075O797O781O330N527
61336E09369M783L969K650R89l31j127k000l447n164o415o813o468n744m981m344
61321D74926l706k923k239k199k942l789l815k802j446n55k07K73J451L057M244
61306D57328M566M498M818N667O481O686O102M797L013J291J96l86j168k463l576
61291D97850l624k708j864j923k791l738m061l514k427j443r01n02J96J126J889
61276D71565K471L268M392N424O042O423O727O589N577L981K784K750L800N280
61262E37073O612P682Q707R839J0919J1617J1791J1550J0955R849Q190O375M960
$$ y = [339942, 341274, 343256, 346015, 349389, 352752, 355684, 358537, 361984, 366359, 371741, 378277, 385918, 394098, 402174, 410131, 418510, 427736, 437821, 448467, 459050, 468690, 476859, 483934, 490731, 497512, 503842, 509369, 514152, 518121, 520771, 521760, 521429, 520302, 518302, 514855, 509691, 503276, 496463, 489995, 484251, 479270, 474926, 471220, 468297, 466058, 463859, 460917, 457128, 453313, 450511, 449065, 448510, 448303, 448576, 450027, 453084, 457328, 461894, 466392, 471210, 476877, 483358, 490044, 496146, 500943, 503956, 505247, 505443, 505057, 503889, 501426, 497850, 494226, 491518, 489654, 487731, 484940, 481202, 477141, 473627, 471200, 469757, 468856, 468354, 468550, 469676, 471565, 474036, 477304, 481696, 487120, 493162, 499585, 506312, 512901, 518478, 522459, 525243, 527993, 531793, 537073, 543685, 551367, 560074, 569913, 580832, 592449, 604240, 615790, 626745, 636594, 644784, 651159, 656119]
61249F56119L972K750O11k317n049o613o961o964p503q626r677j0037r608q738
61235E81359p913p496p480p446o993o184n358m517l337j876p98n77q22p26l1Q60
61219E20665J489J686J417Q43M46P02J471K118K289K225K209K151J990K033K517
61204E46251L098L254L047L042L548M454N806P977J0933J3806J5680J6608J7414
61191F54918J8446J9046J8384J6517J4385J2870J2036J1238R812P698N478L858
61179H04686L059K680K144J166k19j877l712n578p254q578r564j0313j0883j1290
61165G44467j1694j2426j3656j5040j5876j5834j5281j4748j4236j3385j2186
61154E90105j1004r890q407o349m199k564j525r14q58j559k760l989n162o507
$$ y = [656119, 660091, 662841, 663452, 661135, 656086, 649473, 642512, 635548, 628045, 619419, 609742, 599705, 590097, 581359, 573446, 565950, 558470, 551024, 544031, 537847, 532489, 527972, 524635, 522759, 521961, 521384, 520562, 519836, 519805, 520665, 522154, 523840, 525257, 526100, 526546, 527248, 528719, 530837, 533126, 535351, 537560, 539711, 541701, 543734, 546251, 549349, 552603, 555650, 558692, 562240, 566694, 572500, 580477, 591410, 605216, 620896, 637504, 654918, 673364, 692410, 710794, 727311, 741696, 754566, 766602, 777840, 787652, 795350, 800828, 804686, 807745, 810425, 812569, 813735, 813516, 811639, 807927, 802349, 795095, 786517, 776953, 766640, 755757, 744467, 732773, 720347, 706691, 691651, 675775, 659941, 644660, 629912, 615676, 602291, 590105, 579101, 569211, 560804, 554455, 550256, 547692, 546167, 545253, 544395, 542836, 540076, 536087, 530925, 524418]
61140E24418p856q568q261p203n905m620l407k318j284q2J413K992M270N061N653
61125D94303O740Q917J1999J5016J7098J8218J8863J9327J9777K0628K2125K3593
61113F96604K3956K3102K2061K1602K1413K0915K0139J9282J8039J6061J3625
61102I16799J1167Q490N090J092k792o162r232j2266j5248j8106k0785k3026k4500
61089H10521k5205k5469k5437k4948k3925k2630k1405k0435j9800j9487j9241
61078E62539j8624j7385j5707j4035j2748j1979j1536j0978r855q081o079m513
61066D21019l804l757l691l029j848o84J15O64J133J457J614J955K928M538O282
61051D24892P579Q232Q541R039R975J1122J2151J3099J4146J5102J5589J5716
$$ y = [524418, 516562, 507994, 499733, 492530, 486625, 482005, 478598, 476280, 474996, 474914, 476327, 479319, 483589, 488650, 494303, 501043, 509960, 521959, 536975, 554073, 572291, 591154, 610481, 630258, 650886, 673011, 696604, 720560, 743662, 765723, 787325, 808738, 829653, 849792, 869074, 887113, 903174, 916799, 927966, 936456, 941546, 942638, 939846, 933684, 924452, 912186, 896938, 878832, 858047, 835021, 810521, 785316, 759847, 734410, 709462, 685537, 662907, 641502, 621067, 601267, 581780, 562539, 543915, 526530, 510823, 496788, 484040, 472061, 460525, 449547, 439692, 431611, 425532, 421019, 417215, 413458, 409767, 406738, 404890, 404206, 404321, 404985, 406118, 407575, 409189, 411144, 414072, 418610, 424892, 432471, 440703, 449244, 458283, 468258, 479380, 491531, 504630, 518776, 533878, 549467, 565183]
61039E65183J5942J6251J6132J5611J5429J5789J5728J4531J3072J2808J3805
61028G30281J4781J4906J4580J4443J4614J5210J6813J9949K4555L0221L6626
61017I46979M3692N1827O2184P6079R3841J14597J37139J59822J78691J86671
61007B051522J76907J48638J09610P1562M2620K4128J4174J1912J6318K1681J7923
60996B706995j967l5478p2968j06036j32223j52400j66429j72695j70469j61118
60986A535212j47164j31030j14482r8571q3876p0918o0146n1512m4470l8534l3575
60975F60934k9468k5935k2845k0256j7998j5725j3506j1804j0634r324p516n812
60963D70111m928m660m297l708l360l376l197k369j169k29K52O08J174J863K438
$$ y = [565183, 581125, 597376, 613508, 629119, 644548, 660337, 676065, 690596, 703668, 716476, 730281, 745062, 759968, 774548, 788991, 803605, 818815, 835628, 855577, 880132, 910353, 946979, 990671, 1042498, 1104682, 1180761, 1274602, 1389199, 1526338, 1686160, 1864851, 2051522, 2228429, 2377067, 2486677, 2558239, 2600859, 2624987, 2639161, 2651073, 2667391, 2689072, 2706995, 2705028, 2669550, 2596582, 2490546, 2358323, 2205923, 2039494, 1866799, 1696330, 1535212, 1388048, 1257018, 1142536, 1043965, 960089, 889171, 829025, 777513, 733043, 694509, 660934, 631466, 605531, 582686, 562430, 544432, 528707, 515201, 503397, 492763, 483439, 475923, 470111, 465183, 460523, 456226, 452518, 449158, 445782, 442585, 440216, 439047, 438818, 439070, 439678, 440852, 442715, 445153]
60948D45153K946L550L995L781L072K814L469M135L615K001M61l58q22j377k044
60933D74391k812l643l986l266k030j588k245k891k702k171j932j650q78j55k60
60918D42182r71j391j099l05N76R58L29q72j339o29J5n13j386j114P7O14M7m43
60900D34736l5P07J118J459K097K621K505J927J419J115Q03L91j0k07m4L90O86
60883D51678O20O11J221K322L373M327N604P110Q114Q290Q214Q564R414J0441
60869E29903J1285J1543J1097J0611J1013J2290J3408J3714J3754J4291J5242
60858F68151J6075J6674J7228J7731J8176J8874K0017K1193K1850K2088K2467
60847H80524K3214K4037K4527K4369K3314K1399J9078J6668J3816R926N113J98
$$ y = [445153, 448099, 451649, 455644, 459425, 462497, 465311, 468780, 472915, 476530, 478531, 478992, 478634, 477812, 476435, 474391, 471579, 467936, 463950, 460684, 458654, 457066, 454821, 451930, 449228, 447057, 445125, 443475, 442597, 442442, 442182, 441211, 439820, 438721, 438416, 438992, 439950, 440279, 439407, 438068, 437439, 437454, 436941, 435555, 434441, 434518, 435132, 435179, 434736, 434701, 435408, 436526, 437985, 440082, 442703, 445208, 447135, 448554, 449669, 450472, 450863, 450853, 450646, 450602, 450992, 451678, 452298, 452909, 454130, 456452, 459825, 464152, 469756, 476866, 484980, 493270, 501484, 510048, 519462, 529903, 541188, 552731, 563828, 574439, 585452, 597742, 611150, 624864, 638618, 652909, 668151, 684226, 700900, 718128, 735859, 754035, 772909, 792926, 814119, 835969, 858057, 880524, 903738, 927775, 952302, 976671, 999985, 1021384, 1040462, 1057130, 1070946, 1080872, 1085985, 1086183]
60835A086183m327q784j3484j7899k1129k3035k4394k5833k7132k7841k8169k8664
60823H35492k9135k8674k6956k4875k3409k2395k1083j9481j8284j7592j6647
60812E86961j4998j3164j1793j0719r400p823o469n592m985m351l550k536j363
60799D90218l78r3o88j613j906j108R9M65m61j823k457k155j595j398j708k433
60783D70966l329l876l673k926k173j669j420j616k354l118l301l164l461m087
60769D30799m067l144k391k774l884m710m980n121n319n368n130m707m300m154
60755C70750m367m526l988k726j440n93O5P59J186J182J184J509J813J827J926
60740C64561K279K157J004l71p28j56J59k88p90o55KP84J447J716J383P48L13
$$ y = [1086183, 1081856, 1073072, 1059588, 1041689, 1020560, 997525, 973131, 947298, 920166, 892325, 864156, 835492, 806357, 777683, 750727, 725852, 702443, 680048, 658965, 639484, 621200, 603608, 586961, 571963, 558799, 547006, 536287, 526887, 519064, 512595, 507003, 502018, 497667, 494117, 491581, 490218, 489840, 489747, 489059, 487446, 485540, 484432, 484531, 484996, 484535, 482712, 480255, 478100, 476505, 475107, 473399, 470966, 467637, 463761, 460088, 457162, 454989, 453320, 451900, 450284, 447930, 444812, 441511, 438347, 434886, 430799, 426732, 423588, 421197, 418423, 414539, 409829, 404849, 399728, 394409, 389041, 383911, 379204, 374904, 370750, 366383, 361857, 357869, 355143, 353703, 353110, 353175, 353934, 355120, 356302, 357486, 358995, 360808, 362635, 364561, 366840, 368997, 370001, 369630, 368902, 368746, 368905, 368617, 367827, 367172, 367174, 367958, 369405, 371121, 372504, 373252, 373565]
60723C73565k3p28j655k036j731j594k289l438m314m769n088n321n318n064m602
60708C25595l863k872j990j692k143l017l613l257j960o58l73j091j796j679r10
60693B94681j65J86K25K29M38Q25J048Q25M10K81M63N55M02K65K97M13P21J460
60675C03559K377K817K661K486K568K440J888J557J959K461K187J394J149J794
60661C33297K623L048L268L674M221M674M995N224N350N445N660N901N774N037
60647C98191L899K746J761Q99L5j004k353l879n141n755n772n586n537n687n901
60632C60916n958n569m576l298k507k680l259l154k122j214j370j998j705k47
60618C21259J084J185M46r0j48j66l84o63r99j456j685j178l8R68J314J192J025
$$ y = [373565, 373542, 372814, 371159, 369123, 367392, 365798, 363509, 360071, 355757, 350988, 345900, 340579, 335261, 330197, 325595, 321732, 318860, 316870, 315178, 313035, 310018, 306405, 303148, 301188, 300530, 300157, 299066, 297270, 295591, 294681, 294516, 294702, 294927, 295156, 295594, 296419, 297467, 298292, 298702, 298983, 299446, 300001, 300403, 300668, 300965, 301378, 302099, 303559, 305936, 308753, 311414, 313900, 316468, 318908, 320796, 322353, 324312, 326773, 328960, 330354, 331503, 333297, 335920, 338968, 342236, 345910, 350131, 354805, 359800, 365024, 370374, 375819, 381479, 387380, 393154, 398191, 402090, 404836, 406597, 407496, 407531, 406527, 404174, 400295, 395154, 389399, 383627, 378041, 372504, 366817, 360916, 354958, 349389, 344813, 341515, 339008, 336328, 333069, 329915, 327793, 326579, 325209, 323211, 321506, 321259, 322343, 323528, 323974, 323884, 323736, 323570, 323186, 322523, 321524, 320068, 318383, 317205, 317167, 318135, 319449, 320641, 321666]
60601C21666Q39L96l18r39r91l51M92Q10M18n5N0N71P93M22o7o4N40J312J632
60582C27156J191M03K06J085K515L711M674N781O679O537N535N078O013P427P800
60567C91791O827N427M387L698K966J863K95j378k419k489k133k093k304k095
60553D02343j198L1J299K682M199N595O661P370P672P590P515P814Q131P616O033
60538D81353M087K451J010n91k200l422m222m765m887m262l004j718r34p06p45
60523D57445p31n42k89j10R9N61J187J557J588J835K855M472O000P049P794Q600
60507D99370R785J1598J4115J7069K0072K2969K5769K8339L0382L1631L1786L0392
60495G73277K7128K2141J5822Q428K70p871j5098k1174k6485l1053l4169l5240
$$ y = [321666, 322505, 322901, 322583, 321644, 320653, 320302, 320794, 321604, 322022, 321967, 322017, 322588, 323381, 323803, 323736, 323672, 324212, 325524, 327156, 328347, 328750, 328956, 330041, 332556, 336267, 340941, 346722, 353401, 359938, 365473, 370551, 376564, 383991, 391791, 398618, 404045, 408432, 412130, 415096, 416959, 417254, 415876, 413457, 410968, 408835, 406742, 404438, 402343, 401145, 401176, 402475, 405157, 409356, 414951, 421612, 428982, 436654, 444244, 451759, 459573, 467704, 475320, 481353, 485440, 487891, 488901, 488310, 486110, 482688, 478466, 473701, 468814, 464552, 461548, 459830, 458896, 458190, 457445, 456714, 456172, 455883, 455773, 455872, 456433, 457620, 459177, 460765, 462600, 465455, 469927, 475927, 482976, 490770, 499370, 509155, 520753, 534868, 551937, 572009, 594978, 620747, 649086, 679468, 711099, 742885, 773277, 800405, 822546, 838368, 846796, 847066, 839195, 824097, 802923, 776438, 745385, 711216, 675976]
60483F75976l4593l3030l0931k8174k4794k1271j8152j5721j4010j2882j1978
60472D30440j0787r048p093n627n032m978m876m594m421m355l909k988k409k967
60458C57356m134m440l220j390l18m70j381k348k781k295j088J9L06j09o36j028
60442C32043j447j848j847j324p10m96o98r80j093r89o59j09M87P80N29q0n03
60425C21056l25L38R61J146R41O69O10Q33J213J529J632J540J318R52M61N0j02
60408C34822j28l01n72o15l89k46l63m71l55k41l10k12M53J383J872J819J892
60391C38038K521L224L215K485J823J850K286K410K020J675J925K578K978K815
60377C71843K384K091K049K198K457K643K507K029J483J117R75J080J477J995
$$ y = [675976, 641383, 608353, 577422, 549248, 524454, 503183, 485031, 469310, 455300, 442418, 430440, 419653, 410605, 403512, 397885, 392853, 387875, 382999, 378405, 373984, 369629, 365720, 362732, 360323, 357356, 353222, 348782, 345562, 344172, 343854, 343384, 342003, 339655, 336874, 334579, 333491, 333510, 333816, 333707, 333071, 332043, 330596, 328748, 326901, 325577, 324867, 324371, 323673, 322693, 321600, 320611, 319952, 319843, 320330, 321110, 321639, 321559, 321056, 320731, 321069, 322030, 323176, 324117, 324786, 325396, 326229, 327442, 328971, 330603, 332143, 333461, 334413, 334874, 334924, 334822, 334694, 334393, 333821, 333206, 332817, 332571, 332208, 331737, 331382, 331141, 330831, 330619, 331072, 332455, 334327, 336146, 338038, 340559, 343783, 346998, 349483, 351306, 353156, 355442, 357852, 359872, 361547, 363472, 366050, 369028, 371843, 374227, 376318, 378367, 380565, 383022, 385665, 388172, 390201, 391684, 392801, 393776, 394856, 396333, 398328]
60363C98328K220J939J359Q26N75Q58J871L361M628N268N518N648N424M557L337
60348D45717K266J327J06j412k681l209k985k413k014k119k515k574k007j237
60334D24250q56r20j165j566k150k607k644k525k691k975k801k072j268p09l55
60319C96946j72r4L97J841L835N244N576N509N862O740P967R629J1607J3097J3265
60304D87249J2170J0594R109P572N413K211j796n649q383r899j0825j1496j1580
60291D74690j0842r651q416p059n499m160l437l040k467j847j695j959k005j559
60277D11054j123j245j801k251k353k339k465k628k535k204k006k109k090j515
60263C82390p47o02j156j491r40o6J06n04r69n55M74J261J170K26r79j721j683
$$ y = [398328, 400548, 402487, 403846, 404672, 405247, 406105, 407976, 411337, 415965, 421233, 426751, 432399, 437823, 442380, 445717, 447983, 449310, 449416, 448004, 445323, 442114, 439129, 436716, 434702, 432583, 430068, 427494, 425487, 424250, 423394, 422474, 421309, 419743, 417593, 414986, 412342, 409817, 407126, 404151, 401350, 399278, 398010, 397301, 396946, 396774, 396680, 397077, 398918, 402753, 407997, 413573, 419082, 424944, 431684, 439651, 449280, 460887, 473984, 487249, 499419, 510013, 519122, 526694, 532107, 534318, 532522, 526873, 518490, 508591, 497766, 486270, 474690, 463848, 454197, 445781, 438722, 433223, 429063, 425626, 422586, 420119, 418272, 416577, 414618, 412613, 411054, 409931, 408686, 406885, 404634, 402281, 399942, 397477, 394849, 392314, 390110, 388104, 385995, 383905, 382390, 381643, 381041, 379885, 378394, 377454, 377388, 377494, 376990, 376021, 375466, 375940, 377201, 378371, 378597, 377618, 375897, 374214]
60246C74214j036j27P59J326J327R09N29L51J15j94q4O32J280J192P76R52J751
60229C84672K282K045J564J543K096K992L995M629M257K867J431R68J468K177
60215D18986K702L285M081M692M661M081L496L292L390L536L667L921M331M667
60201D72788M610M037L144K284J757J619J682J717J643J515J307R07K77m91j345
60186D97451k237k899k957k476k153k596l461l676k680j149k93n30j153j372j264
60171D66555j444j961k045j183Q3Q47R80R73Q99L45n68r07j47J024J608J539J416
60154D68014J439J306R85Q64J108J475J846K429L267L995M292M267M260M447M805
60139E08799N274N778O192O348O007N002L524K111J136M45j87n48l25J42R9n61
$$ y = [374214, 373178, 373051, 373810, 375136, 376463, 377372, 377901, 378252, 378367, 378173, 378089, 378721, 380001, 381193, 381969, 382921, 384672, 386954, 388999, 390563, 392106, 394202, 397194, 401189, 405818, 410075, 412942, 414373, 415341, 416809, 418986, 421688, 424973, 429054, 433746, 438407, 442488, 445984, 449276, 452666, 456202, 459869, 463790, 468121, 472788, 477398, 481435, 484579, 486863, 488620, 490239, 491921, 493638, 495281, 496796, 498103, 499010, 499287, 498796, 497451, 495214, 492315, 489358, 486882, 484729, 482133, 478672, 474996, 472316, 471167, 470874, 470344, 469191, 467819, 466555, 465111, 463150, 461105, 459922, 460005, 460852, 461832, 462805, 463704, 464049, 463481, 462574, 462427, 463451, 465059, 466598, 468014, 469453, 470759, 471744, 472608, 473716, 475191, 477037, 479466, 482733, 486728, 491020, 495287, 499547, 503994, 508799, 514073, 519851, 526043, 532391, 538398, 543400, 546924, 549035, 550171, 550616, 550429, 549881, 549556, 549698, 549797, 549236]
60123E49236j104j016p31r08j380j385o40K69N74M6r77j903k197j709q99n33r38
60106E33805j664k086k137k255k628k921k776k260j627r34j57N50J018J325J577
60091E16830J630J458J519K225L157L429K918K407K410K521K207J603J066N89
60077E45969J21m2J91K15n97k021l324m164m645m820m790m964n569o135o165n958
60061D93302o079o286n898n028m464m353l981l058k178j763j455r58n96n64l80
60046D46261K90R86J257J538K460L767M616M742M555M291L783L035K388J941J278
60031D87188K0j621l034l833m173m486n047n783o481p005p193o841o064n430n314
60016D14903n254m542l357k634k650k583j821r94j066j892k347j757n74L03M24
$$ y = [549236, 548132, 547116, 546385, 545477, 544097, 542712, 542072, 542341, 542915, 542961, 541984, 540081, 537884, 536175, 535276, 534743, 533805, 532141, 530055, 527918, 525663, 523035, 520114, 517338, 515078, 513451, 512517, 512360, 512910, 513928, 515253, 516830, 518460, 519918, 521437, 523662, 526819, 530248, 533166, 535573, 537983, 540504, 542711, 544314, 545380, 545969, 546090, 546048, 546239, 546454, 545857, 543836, 540512, 536348, 531703, 526883, 522093, 517129, 511560, 505425, 499260, 493302, 487223, 480937, 475039, 470011, 465547, 461194, 457213, 454155, 451977, 450214, 448759, 447801, 447205, 446641, 446261, 446551, 447537, 448794, 450332, 452792, 456559, 461175, 465917, 470472, 474763, 478546, 481581, 483969, 485910, 487188, 487208, 485587, 482553, 478720, 474547, 470061, 465014, 459231, 452750, 445745, 438552, 431711, 425647, 420217, 414903, 409649, 405107, 401750, 399116, 396466, 393883, 392062, 391068, 390002, 388110, 385763, 384006, 383432, 383735, 384159]
60001C84159pm44m61o2M23P77J024J141J014P85Q97J539K429L235L856M108L724
59984D08137K897K282K068J625O23j96p1M93L64n72j345j367j065r46q78n26L9
59967D11562M21K36o36j713j972q59Q13J587J094L75M21J082J635J736J452R90
59951D18224P44J111J807J905J008j16n41l61k93m98o08o54j114j962k435k082
59935D14135j432j267j593j786j531j109q36n84q3N56Q85O86K74J62N50J175J670
59918D09872J879J944K146K659L381M003M349M580M926N313N382M934M138L377
59904D62883K945K850K771K240J121j88j185j778k085j933j081J06Q05Q20R22
59889D69213J741K815L304L211L225L612L918L878L827M058M342M365M141L707
$$ y = [384159, 384152, 383708, 383247, 383185, 383608, 384385, 385409, 386550, 387564, 388349, 389246, 390785, 393214, 396449, 400305, 404413, 408137, 411034, 413316, 415384, 417009, 417632, 417436, 417365, 417858, 418222, 417650, 416305, 414938, 413873, 412927, 412049, 411523, 411562, 411983, 412219, 411583, 409870, 407898, 407039, 407852, 409439, 410533, 410908, 411329, 412411, 414046, 415782, 417234, 418224, 418968, 420079, 421886, 423791, 424799, 424683, 424142, 423781, 423488, 422990, 422382, 421728, 420614, 418652, 416217, 414135, 412703, 411436, 409843, 408057, 406526, 405417, 404581, 403997, 403914, 404470, 405355, 406041, 406315, 406477, 407027, 408202, 409872, 411751, 413695, 415841, 418500, 421881, 425884, 430233, 434813, 439739, 445052, 450434, 455368, 459506, 462883, 465828, 468678, 471449, 473689, 474810, 474622, 473437, 471659, 469574, 467641, 466560, 466666, 467471, 468291, 469213, 470954, 473769, 477073, 480284, 483509, 487121, 491039, 494917, 498744, 502802, 507144, 511509, 515650, 519357]
59875E19357K847J530K24p33j738l341n233o456o583o116n580m850l763k845k772
59860D73948l349l574k853j711j100j265j560j281m53L48P58R15R23M16r12k460
59844D56790l038k249j039n17o01m69J08N86P01Q10J070J115R16J180K287L364
59828D61014L228J959Q20O00P60L48q22k136k948l069k765k490k496k524k118
59813D47361j367j033j678k795l227k392q60L35O64L31j39k88P4O79Q29rj498
59796D34987k654k898k586k344k216j878j360r72p22m02j87n27j260j564j049
59781D12368l78l73r46j387j264o56J79Q90J033N72R1R3L64M66N57J084J872K276
59763D16841K121J809J555J249J080J464K134K210J498J044J775L193M010L754
$$ y = [519357, 522204, 523734, 523958, 523225, 521487, 518146, 512913, 506457, 499874, 493758, 488178, 483328, 479565, 476720, 473948, 470599, 467025, 464172, 462461, 461361, 460096, 458536, 457255, 456802, 457150, 457908, 458823, 459746, 460162, 459250, 456790, 453752, 451503, 450464, 449947, 449346, 448877, 448985, 449571, 450272, 451082, 452152, 453267, 454183, 455363, 457650, 461014, 464242, 466201, 467021, 467621, 468381, 468729, 467907, 465771, 462823, 459754, 456989, 454499, 452003, 449479, 447361, 445994, 444961, 443283, 440488, 437261, 434869, 434009, 434344, 435008, 435339, 435200, 434912, 434986, 435665, 436494, 436485, 434987, 432333, 429435, 426849, 424505, 422289, 420411, 419051, 418079, 417357, 416955, 416768, 416241, 414981, 413417, 412368, 411990, 411617, 410671, 409284, 408020, 407364, 407543, 408433, 409466, 410038, 410129, 410222, 410586, 411052, 411609, 412693, 414565, 416841, 418962, 420771, 422326, 423575, 424655, 426119, 428253, 430463, 431961, 433005, 434780, 437973, 441983, 445737]
59749D45737L104K826K957L045K835K539K568K981L302L133K767K753K901K425
59735D85873J245L86N64J094Q74o6q58j163j318j250m20R43J589Q00n40j022m65
59718D86266J30O5l00l13J09O22J033J392J660J695J607J750K165K328J848J235
59702E03292J444K561L438L026J655N96N83J250J794J723J015P6m39k41J31j00
59686E21804q53j208o30L51Q92P95L35l57j285k267l096l864m655n158m983m330
59670D91491l852l873m067l972l477k758k034j532j404j567j706j486p51L88J523
59655D60923K176K296K344K669K920K519J572Q18O05M93j4p49j250j397j373j280
59639D73272j187j311j776k318k578k567k496k271j573m87L35L40l42j075j358
$$ y = [445737, 448841, 451667, 454624, 457669, 460504, 463043, 465611, 468592, 471894, 475027, 477794, 480547, 483448, 485873, 487118, 487504, 488068, 489162, 490036, 489970, 489112, 487949, 486631, 485381, 484961, 485904, 487493, 488293, 487753, 486731, 486266, 486396, 486461, 486161, 485848, 485957, 486579, 487612, 489004, 490664, 492359, 493966, 495716, 497881, 500209, 502057, 503292, 504736, 507297, 510735, 513761, 515416, 516012, 516595, 517845, 519639, 521362, 522377, 522453, 522014, 521773, 521904, 521804, 520951, 519743, 519113, 519464, 520356, 521151, 521486, 521129, 519844, 517577, 514481, 510617, 505962, 500804, 495821, 491491, 487639, 483766, 479699, 475727, 472250, 469492, 467458, 465926, 464522, 462955, 461249, 459763, 459012, 459400, 460923, 463099, 465395, 467739, 470408, 473328, 475847, 477419, 478237, 478842, 479335, 479321, 478572, 477322, 475925, 474552, 473272, 472085, 470774, 468998, 466680, 464102, 461535, 459039, 456768, 455195, 454708, 455043, 455383, 455041, 453966, 452608]
59624D52608j213j127j628k759l884m212l586k667k201k190j984j134l6N34L89
59609D24910K48Q41J943K590K301J628J356J498J439Q69J20l67n60p20j054j485
59593D35557j687j321m37L97N39j23j128j904k143j873j409j131j130j126r89
59578D20092j082j735k570k897k693k626l027l425l276k630j818r46p0N19O38
59563C92454N49N83O28L59j84n20k41O35J718K516K807K894L284M050M787N235
59547D21554N640O210O761P177P836R069J0598J2009J3404J4902J5710J4573J1356
59534E56799P438M256J939k56k545m198m450l424j957o62N53J887K914K855J685
59519E62834L32n02j198k495m316n991p291q524r744j0577j0853j0632r700p817
$$ y = [452608, 451395, 450268, 448640, 445881, 441997, 437785, 434199, 431532, 429331, 427141, 425157, 424023, 423987, 424521, 424910, 425158, 425999, 427942, 430532, 432833, 434461, 435817, 437315, 438754, 439623, 439743, 439376, 438816, 438096, 437042, 435557, 433870, 432549, 432112, 432509, 433048, 432925, 431797, 429893, 427750, 425877, 424468, 423337, 422207, 421081, 420092, 419010, 417275, 414705, 411808, 409115, 406489, 403462, 400037, 396761, 394131, 392313, 391367, 391297, 391816, 392454, 393003, 393586, 394214, 394573, 394389, 393869, 393628, 394263, 395981, 398497, 401304, 404198, 407482, 411532, 416319, 421554, 427194, 433404, 440165, 447342, 455178, 464247, 474845, 486854, 500258, 515160, 530870, 545443, 556799, 564237, 568493, 570432, 570176, 567631, 563433, 558983, 555559, 553602, 552940, 553493, 555380, 558294, 561149, 562834, 563166, 562664, 561466, 558971, 554655, 548664, 541373, 532849, 523105, 512528, 501675, 491043, 481343, 473526]
59505D73526n626m372m451m894m732m084l459k803k016j633k047k411j476N43
59491D30065J966J671L50n79n23J73J027J742K040J869J688K045K904L668L927
59476D54033L797L584L385L213L162L229L112K534J731J350J765K704L570L999
59462D95168M001L802L799M428N759P263Q282Q680Q794Q770Q415P737P145O820
59448E88863O254M874K882R72p57k957n905q694j0027r678q774q538q961q907
59434E30647p443m915k627j589j682j956j549j82J948M394O564Q011Q813R553
59420E47987J0753J2451J4401J6384J8119J9171J9402J9194J8667J6836J2417
59409G25782N708j119o135r397j1996j3939j4020j1598p573l546p83p7j672m861
$$ y = [473526, 467900, 463528, 459077, 454183, 449451, 445367, 441908, 439105, 437089, 435456, 433409, 430998, 429522, 430065, 432031, 433702, 434052, 433473, 432950, 433123, 434150, 435892, 437932, 439801, 441489, 443534, 446438, 450106, 454033, 457830, 461414, 464799, 468012, 471174, 474403, 477515, 480049, 481780, 483130, 484895, 487599, 491169, 495168, 499169, 502971, 506770, 511198, 516957, 524220, 532502, 541182, 549976, 558746, 567161, 574898, 582043, 588863, 595117, 599991, 602873, 603845, 603088, 600131, 594226, 585532, 575505, 565827, 557053, 548515, 539554, 530647, 523204, 518289, 515662, 514073, 512391, 510435, 508886, 508704, 510652, 515046, 521610, 529621, 538434, 547987, 558740, 571191, 585592, 601976, 620095, 639266, 658668, 677862, 696529, 713365, 725782, 731490, 730371, 724236, 714839, 702843, 688904, 674884, 663286, 655713, 652167, 651384, 651307, 649635, 644774]
59395F44774q339j1386j4256j7125j9278j9834j8748j6631j4087j1679r996r056
59383D74359q041o260m126k562j800j413j152r60m28Q49K374L096K770K229K220
59368D61155K675L263L877M313M201L683L599M598O385Q155R375R944J0031J0112
59354E45366J0765J2107J3652J4885J5721J6273J6604J6829J7094J7218J6800
59343G13314J5762J4377J2623J0136P026M098J827k59k718n250p239q814j0649
59330G44234j2858j4724j5509j5162j4283j3603j3404j3217j2391j1041j0042
59319E98000r764r410q100o114m496l817l959m710n727o260n757m739m201m206
59305E16740l886k912j954j504j160n37pJ03L22J203K193K223J298N78Q69J694
$$ y = [644774, 636435, 625049, 610793, 593668, 574390, 554556, 535808, 519177, 505090, 493411, 483415, 474359, 466318, 460058, 455932, 453370, 451570, 450157, 449005, 448045, 447617, 448466, 450840, 453936, 456706, 458935, 461155, 463830, 467093, 470970, 475283, 479484, 483167, 486766, 491364, 497749, 505904, 515279, 525223, 535254, 545366, 556131, 568238, 581890, 596775, 612496, 628769, 645373, 662202, 679296, 696514, 713314, 729076, 743453, 756076, 766212, 773238, 777336, 779163, 778904, 776186, 770936, 763697, 754883, 744234, 731376, 716652, 701143, 685981, 671698, 658095, 644691, 631474, 619083, 608042, 598000, 588236, 578826, 570726, 564612, 560116, 556299, 552340, 547630, 541903, 535643, 529886, 525147, 520946, 516740, 512854, 509942, 507988, 506484, 505324, 504787, 504780, 504883, 505205, 506408, 508601, 510824, 512122, 512700, 513569, 515263]
59289E15263K097J723R01J48l7O23J788K612K761K973M104N740O605O375O311
59274E59987P613R769J1161J0966R788Q613P830P220O269M467J882n46j921k611
59260F40487l763n511o610o307n670o205p863r340r875r675q838p083m764l054
59246E45929k591k596j908l74J255K437L213L773M191M626N231N761N621M513
59232E79081K826J204j84j630l286m829n859o401o771p138p459p770q129q245
59218E15410p568o093m718m376m824m789l486j639o02o73q17j32R57J413J076
59203D79139O57M22j42j079j384m15Q89J171N94M69J261K229K928L745M637M681
59187D99802L556K404K392L253M042M553N071N388N124M590M380M408M229M019
$$ y = [515263, 517360, 519083, 519984, 520132, 520095, 520718, 522506, 525118, 527879, 530852, 534956, 540696, 547301, 553676, 559987, 567600, 577369, 588530, 599496, 609284, 617897, 625727, 632947, 639216, 643683, 645565, 645019, 643098, 640487, 636724, 631213, 624603, 618296, 612626, 606421, 598558, 589218, 579343, 569668, 560830, 553747, 548983, 545929, 543338, 540742, 538834, 538460, 539715, 542152, 545365, 549138, 553329, 557955, 563186, 568947, 574568, 579081, 581907, 583111, 582927, 581297, 578011, 573182, 567323, 560922, 554151, 547013, 539554, 531784, 523655, 515410, 507842, 501749, 497031, 492655, 487831, 483042, 479556, 477917, 477315, 476642, 475825, 475693, 476650, 478063, 479139, 479796, 480218, 480076, 478997, 477613, 477198, 478087, 479258, 479852, 480321, 481582, 483811, 486739, 490484, 495121, 499802, 503358, 505762, 508154, 511407, 515449, 520002, 525073, 530461, 535585, 540175, 544555, 548963, 553192, 557211]
59173E57211M321N010N413N404N494N893O278O482O649O639O090N140M380L902
59159F34306L114J629l18k409m534o305p155p203p367q054q465p777o491n874
59145E67097o220o503n831m653m114m572n192n048m118l001j991j011k41j09m58
59130E14035m63K35R83J176J200J633K163K182K041K618L821M664M819N080N998
59115E52185P063P640P891Q308Q946R637J0349J0912J0882J0138R272Q913Q989
59102F71125Q919Q305P127N607M136L067K347J555M84o36j602k516l369l752l320
59087F97477k337j474j248j767k790l909m909o016p541r272j0563j1056j0996
59074F23599j0755j0432r922r059p701o112n139n394o199o183n022l910l881m437
$$ y = [557211, 561532, 566542, 571955, 577359, 582853, 588746, 595024, 601506, 608155, 614794, 620884, 626024, 630404, 634306, 637420, 639049, 638731, 636322, 631788, 625483, 618328, 611125, 603758, 595704, 587239, 579462, 572971, 567097, 560877, 554374, 548543, 543890, 539776, 535204, 530012, 524964, 520846, 517845, 515854, 514843, 514602, 514493, 514035, 513572, 513807, 514790, 515966, 517166, 518799, 520962, 523144, 525185, 527803, 531624, 536288, 541107, 546187, 552185, 559248, 566888, 574779, 583087, 592033, 601670, 612019, 622931, 633813, 643951, 653223, 662136, 671125, 680044, 688349, 695476, 701083, 705219, 708286, 710633, 712188, 712672, 712036, 710434, 707918, 704549, 700797, 697477, 695140, 693666, 692418, 690651, 687861, 683952, 679043, 673027, 665486, 656214, 645651, 634595, 623599, 612844, 602412, 592490, 583431, 575730, 569618, 564479, 559085, 552886, 546703, 541681, 537771, 533890, 529453]
59060E29453m390l547k770k725l184l552l546l293l028k843k658k396k063j576
59046D87882p31L53J081J055P02O60P89N58J85M46J310J845J730J777K539L436
59030E05617L949M616O020P532Q104P776P480P794Q751J0453J2802J4803J5151
59017F20848J3610J1132Q659O426M371K443N00j513l171l896l722l225k635j605
59003F48222O8J957L475M482N242N967O541O665O249N604N061M386L028J070n86
58988G07431j391j978l244n073o603p497q148q736q882q300p127n556l717k046
58974F29133j135r62p08L25J963L548M720N556O215O751P221P693Q125Q267P811
58959F94523O732N481M568L917K859R76j412l744n874p861r444j0301j0611j0860
$$ y = [529453, 525063, 521516, 518746, 516021, 512837, 509285, 505739, 502446, 499418, 496575, 493917, 491521, 489458, 487882, 487151, 487504, 488585, 489640, 490342, 491002, 491791, 492349, 492534, 492980, 494290, 496135, 497865, 499642, 502181, 505617, 509566, 514182, 520202, 527734, 535838, 543614, 551094, 558888, 567639, 578092, 590894, 605697, 620848, 634458, 645590, 654249, 660675, 665046, 667489, 667989, 666476, 663305, 659409, 655687, 652462, 649827, 648222, 648290, 650247, 653722, 658204, 663446, 669413, 675954, 682619, 688868, 694472, 699533, 703919, 706947, 708017, 707431, 706040, 704062, 700818, 695745, 689142, 681645, 673497, 664761, 655879, 647579, 640452, 634896, 631179, 629133, 627998, 627036, 626328, 626653, 628616, 632164, 636884, 642440, 648655, 655406, 662627, 670320, 678445, 686712, 694523, 701255, 706736, 711304, 715221, 718080, 719056, 717644, 713900, 708026, 700165, 690721, 680420, 669809, 658949]
58945F58949j1113j0983j0345r584r024q518p767o788n930n507n515n589n340
58932E56946m814m465m474m403l816k997k547k459k164j515j128j472k116k244
58918E16332j712j100q23n79J08J075J654J645J693K427L560M335M653N112O002
58903E44382O992P946R212J0706J1482J0914R769R398J0155J1261J2037J2574
58891F66828J3321J4578J6315J8161J9625K0698K1862K3129K3497K1991J8966
58880H78971J5593J2329Q663M314j69m158p587j0702j3645j6436j8899k0516k0857
58867H06901k0155j9049j7790j6253j4659j3544j2886j1955j0286q356o985o539
58855F48444o928p861q835r277r085q665q293p758o840n763m852m124l553l411
$$ y = [658949, 647836, 636853, 626508, 616924, 607900, 599382, 591615, 584827, 578897, 573390, 567875, 562286, 556946, 552132, 547667, 543193, 538790, 534974, 531977, 529430, 526971, 524807, 523292, 522164, 520692, 518576, 516332, 514620, 513520, 512697, 512118, 512226, 513301, 514955, 516600, 518293, 520720, 524280, 528615, 533268, 538380, 544382, 551374, 559320, 568532, 579238, 590720, 601634, 611403, 620801, 630956, 642217, 654254, 666828, 680149, 694727, 711042, 729203, 748828, 769526, 791388, 814517, 838014, 860005, 878971, 894564, 906893, 915556, 919870, 919701, 915543, 907956, 897254, 883609, 867173, 848274, 827758, 806901, 786746, 767697, 749907, 733654, 718995, 705451, 692565, 680610, 670324, 661968, 654983, 648444, 641516, 633655, 624820, 615543, 606458, 597793, 589500, 581742, 574902, 569139, 564287, 560163, 556610, 553199]
58841E53199l999n065n908o011n508m975m824m902m754m323m105m421m799m486
58827D85119l400k107j048k53K00J35j80j04N35J141J173Q88R06J421K158K803
58811D89387L170L151K822K429K029J391M84j90j51L29N00P8m49n11j31K14K27
58794E04779j6l40o61r41j107j133j028o04M63K117L676M467M602M715N017N147
58778E29153M962M814M860M657L858K768J751O46p15j897k485k941m000n360n838
58763E34233m903l400k518k554k898k892k449j974j781j535n33J243K739K983
58749E13761K354K042K400K590J997J250J398K500L501L465K592J972K427L729
58735E47978N027N870O467P034P381P369P276P444P859Q287Q401P648N669L210
$$ y = [553199, 549200, 544135, 538227, 532216, 526708, 521733, 516909, 512007, 507253, 502930, 498825, 494404, 489605, 485119, 481719, 479612, 478564, 478311, 478511, 478646, 478466, 478362, 478897, 480038, 481211, 482099, 483005, 484426, 486584, 489387, 492557, 495708, 498530, 500959, 502988, 504379, 504863, 504673, 504522, 504851, 505351, 505429, 504980, 504469, 504338, 504552, 504779, 504763, 504423, 503762, 502821, 501714, 500581, 499553, 498949, 499412, 501529, 505205, 509672, 514274, 518989, 524006, 529153, 534115, 538929, 543789, 548446, 552304, 555072, 556823, 557469, 556754, 554857, 552372, 549431, 545431, 540071, 534233, 529330, 525930, 523412, 520858, 517960, 515068, 512619, 510645, 508864, 507329, 506796, 508039, 510778, 513761, 516115, 518157, 520557, 523147, 525144, 526394, 527792, 530292, 533793, 537258, 539850, 541822, 544249, 547978, 553005, 558875, 565342, 572376, 579757, 587126, 594402, 601846, 609705, 617992, 626393, 634041, 639710, 642920]
58721F42920J777J895K368K007J305J512K785M314N734P120P986P618O396N469
58707G01206M989L888J619j022l183n005o941q903j0667j2352j3965j5051j5244
58694F19369j4772j4099j3418j2747j2082j1308j0260r033p895p007o472o489
58682D93787o918p076o496n626m975m090k294j18J186J459J740K619L654M495
58668D71347N414O513P595Q911J0817J2542J2667J1090R163P503N263K112o91
58655E70246k100k779l689m499m622m610n161n616m891l330k276k261k672k912
58641E18828k815k261j361p44p68q34k66N55Q48P98J166J823J820Q66k07n53j57
58624E16738N83J373K044K575L171L998M893N665O460P451Q380Q855Q844Q489
$$ y = [642920, 644697, 646592, 648960, 650967, 652272, 653784, 656569, 660883, 666617, 673737, 681723, 689341, 695737, 701206, 706195, 710083, 711702, 710680, 707497, 702492, 695551, 686648, 675981, 663629, 649664, 634613, 619369, 604597, 590498, 577080, 564333, 552251, 540943, 530683, 521650, 513755, 506748, 500276, 493787, 486869, 479793, 473297, 467671, 462696, 458606, 456312, 456194, 457380, 458839, 460579, 463198, 466852, 471347, 476761, 483274, 490869, 499780, 510597, 523139, 535806, 546896, 556059, 563562, 568825, 570937, 570246, 568146, 565367, 561678, 557179, 552557, 547947, 542786, 537170, 532279, 528949, 526673, 524412, 521740, 518828, 516013, 513752, 512391, 511647, 510879, 510045, 509779, 510334, 511182, 511980, 513146, 514969, 516789, 517655, 517448, 516895, 516738, 517321, 518694, 520738, 523313, 526484, 530482, 535375, 541040, 547500, 554951, 563331, 572186, 581030, 589519]
58610E89519P637O062L942J748j95j727k698l095l142l055l003l356m435n729
58596E78473o083n055l553k671k461k295j837j060J70J858L551M825N768O631
58582E76261P406Q106Q802R147Q562P422P094Q128R226Q971P773P102P352P727
58568F89079P860Q293R417J0926J2509J4253J6227J8190J9796K0724K0715J9810
58556H67799J8422J6804J4807J2383R837P277M434J486p25j947l200n331p639
58543I34407q966r581j0836j3147j5558j7160j7939j8190j7976j7351j6421j5121
58531G56161j3455j1834j0639r544p903n716l610j928m68R27K055K660K714K404
58517G01824K088K071K312K565K841L185L053J741k49j357j007n43j363l071m340
$$ y = [589519, 597156, 603218, 607160, 608908, 608713, 606986, 604288, 601193, 598051, 594996, 591993, 588637, 584202, 578473, 572390, 567335, 563782, 561111, 558650, 556355, 554518, 553458, 553628, 555486, 559037, 563862, 569630, 576261, 583667, 591773, 600575, 609722, 618284, 625706, 632800, 640928, 650154, 659125, 666898, 674000, 681352, 689079, 696939, 705232, 714649, 725575, 738084, 752337, 768564, 786754, 806550, 827274, 847989, 867799, 886221, 903025, 917832, 930215, 940052, 947329, 951763, 953249, 952524, 950577, 947377, 942046, 934407, 925441, 915860, 905024, 891877, 876319, 859159, 841220, 823030, 805054, 787703, 771282, 756161, 742706, 730872, 720233, 710689, 702786, 697070, 693460, 691532, 691064, 691991, 694046, 696706, 699420, 701824, 703912, 705983, 708295, 710860, 713701, 716886, 719939, 721680, 721431, 720074, 719067, 718524, 717161, 714090, 709750]
58502G09750m747m680m210l293k620k987m076m844m923m723m408l754k842k059
58488F55584j505r93l80O09K309M301N445N503N942Q040J0902J2554J2459J1639
58474G32409J0747R424P432N185L040J005q50k413l849n216o071o091n611m944
58460G34197l837k309j188q22j83J548L433M227M447N320O307N628L015J17j859
58445G58041l243m521n464n838n772n130l699k014j000p54o54m80k85M76K368
58430G22031M725O273O935P753R167J0639J1812J2718J2977J2117J0651R544Q709
58417H46051P251N017K698O56j186k557l376m541o699q668q850p780p414q080
58403H02522q193o976n347l963k396o74K73L29P25K176L886M859M981M483L509
$$ y = [709750, 705003, 700323, 696113, 692820, 690200, 687213, 683137, 678293, 673370, 668647, 664239, 660485, 657643, 655584, 654079, 653086, 652706, 653315, 655624, 659925, 665370, 670873, 676815, 684855, 695757, 708311, 720770, 732409, 743156, 752580, 760012, 765197, 768237, 769242, 768392, 765979, 762130, 756914, 750843, 744752, 739141, 734197, 730360, 728051, 726863, 726041, 725858, 727406, 730839, 735066, 739513, 744833, 751140, 756768, 759783, 759900, 758041, 754798, 750277, 744813, 738975, 733203, 728073, 724374, 722360, 721360, 720606, 719952, 719472, 719187, 719663, 722031, 726756, 733029, 739964, 747717, 756884, 767523, 779335, 792053, 805030, 817147, 827798, 837342, 846051, 853302, 858319, 861017, 861673, 860487, 857930, 854554, 850013, 843314, 834646, 825796, 818016, 810602, 802522, 794329, 787353, 782006, 778043, 775647, 774973, 775246, 775575, 776300, 778476, 782362, 787221, 792202, 796685, 800194]
58388H00194K459J647O48r29k410l006l274m001m374l253j643j491k369j975J01
58373G76324J874K457L236M980O483P007P540Q620R194Q790Q606R379J0156J0262
58359H74908J0454J1044J0914R572Q239P779P349O290N433N336N071M085L508
58346I69982M258N455N994O228O823P455P853Q734J0537J2480J3858J4993J6033
58333A090683J6320J5748J5252J5104J4299J2427J0491R081P451N344L877L619
58321A219696L513K711J882J760K026K560L976O140P853Q823J0177J2290J4031
58308A297438J4910J5869J7156J7615J6952J6508J6849J6836J6019J5564J5871
58297A477587J5731J4838J4645J5586J6127J5672J5689J6757J7371J7045J7589
$$ y = [800194, 802653, 804300, 804948, 804019, 801609, 798603, 795329, 791328, 786954, 783701, 782058, 780567, 778198, 776223, 776324, 778198, 780655, 783891, 788871, 795354, 802361, 809901, 818521, 827715, 836505, 845111, 854490, 864646, 874908, 885362, 896406, 907320, 916892, 925131, 932910, 940259, 946549, 951982, 957318, 962389, 966474, 969982, 974240, 979695, 985689, 991917, 998740, 1006195, 1014048, 1022782, 1033319, 1045799, 1059657, 1074650, 1090683, 1107003, 1122751, 1138003, 1153107, 1167406, 1179833, 1190324, 1199405, 1206856, 1212200, 1216077, 1219696, 1223209, 1225920, 1227802, 1229562, 1231588, 1234148, 1238124, 1244264, 1252117, 1260940, 1271117, 1283407, 1297438, 1312348, 1328217, 1345373, 1362988, 1379940, 1396448, 1413297, 1430133, 1446152, 1461716, 1477587, 1493318, 1508156, 1522801, 1538387, 1554514, 1570186, 1585875, 1602632, 1620003, 1637048, 1654637]
58286A654637J9761K1627K2027K2611K4606K6501K7072K7697K9533L1187L1517
58275A938776L1973L3902L6141L7495L8917M1107M2701M3037M3916M6435M8900
58264B383300N0096N1561N4396N7012N8462O0561O4137O6699O6678O6536O8577
58253C048015P1120P1973P2356P4016P5875P6938P9252Q4471R0669R5916J01656
58242C942257J09227J16683J22623J29468J39228J49711J58723J68082J79601
58233E215603J91262K01427K12638K26961K41919K55515K70703K90315L12271
58224G418614L34517L59606L89476M21086M52554M87981N30660N77653O27158
58215A1599305O84585P54665Q34402R21215J021155J141286J281342J441413J630499
$$ y = [1654637, 1674398, 1696025, 1718052, 1740663, 1765269, 1791770, 1818842, 1846539, 1876072, 1907259, 1938776, 1970749, 2004651, 2040792, 2078287, 2117204, 2158311, 2201012, 2244049, 2287965, 2334400, 2383300, 2433396, 2484957, 2539353, 2596365, 2654827, 2715388, 2779525, 2846224, 2912902, 2979438, 3048015, 3119135, 3191108, 3263464, 3337480, 3413355, 3490293, 3569545, 3654016, 3744685, 3840601, 3942257, 4051484, 4168167, 4290790, 4420258, 4559486, 4709197, 4867920, 5036002, 5215603, 5406865, 5608292, 5820930, 6047891, 6289810, 6545325, 6816028, 7106343, 7418614, 7753131, 8112737, 8502213, 8923299, 9375853, 9863834, 10394494, 10972147, 11599305, 12283890, 13038555, 13872957, 14794172, 15815327, 16956613, 18237955, 19679368, 21309867]
58206B1309867J858728K129377K448393K834051L307337L880122M559503N351589
58198D7678967O253603P261357Q400924R738574J1346088J3274112J5567043J8261046
58190A37781714K1323077K4594565K7774850L0350587L1470578L0053092K5351987
58183C28700450J7625570Q189471j329327r836333j6939249k2513545k6356843
58176B77540194k8294484k8432830k7170920k5002019k2358568j9577938j6897818
58169A09805617j4447776j2276260j0398189q809989p481016o366573n433838
58162D4591976m661478m022394l486113l034077k656635k338996k064213j825747
58154B0502323j623632j451528j299376j164958j051059r54140q66555p87023
$$ y = [21309867, 23168595, 25297972, 27746365, 30580416, 33887753, 37767875, 42327378, 47678967, 53932570, 61193927, 69594851, 79333425, 90679513, 103953625, 119520668, 137781714, 159104791, 183699356, 211474206, 241824793, 273295371, 303348463, 328700450, 346326020, 354515491, 353186164, 343349831, 326410582, 303897037, 277540194, 249245710, 220812880, 193641960, 168639941, 146281373, 126703435, 109805617, 95357841, 83081581, 72683392, 63873403, 56392387, 50025814, 44591976, 39930498, 35908104, 32421991, 29387914, 26731279, 24392283, 22328070, 20502323, 18878691, 17427163, 16127787, 14962829, 13911770, 12957630, 12091075, 11304052]
58146A1304052p18811o60012o05181n54215n10590m72785m35952m00272l69555
58137F576679l43145l16891k90764k68288k49579k31566k14024j99135j86259
58128D277028j73045j60518j51442j44815j37372j29259j22952j17923j11630
58119C028072j04574r9259r5219r0059q4287q0236p7203p2536o6686o2490o0158
58108B135365n7486n4399n2821n2546n1400m9171m7492m6363m4431m2113m0862
58097A596281l9980l7771l5066l4026l4087l2760k9836k7271k5472k3202k0702
58086A256108j9345j8662j7057j5089j4804j6130j7115j7402j8335j9951k0867
58075A061351k0919k1032k0911j9640j8069j7780j8163j7401j5710j4738j4366
$$ y = [11304052, 10585241, 9925229, 9320048, 8765833, 8255243, 7782458, 7346506, 6946234, 6576679, 6233534, 5916643, 5625879, 5357591, 5108012, 4876446, 4662422, 4463287, 4277028, 4103983, 3943465, 3792023, 3647208, 3509836, 3380577, 3257625, 3139702, 3028072, 2923498, 2824239, 2729020, 2638961, 2554674, 2474438, 2397235, 2324699, 2258013, 2195523, 2135365, 2077879, 2023480, 1970659, 1918113, 1866713, 1817542, 1770050, 1723687, 1679256, 1637143, 1596281, 1556301, 1518530, 1483464, 1449438, 1415351, 1382591, 1352755, 1325484, 1300012, 1276810, 1256108, 1236763, 1218101, 1201044, 1185955, 1171151, 1155021, 1137906, 1120504, 1102169, 1082218, 1061351, 1040432, 1019400, 998489, 978849, 960780, 943000, 924837, 907436, 891726, 876988, 862622]
58064H62622j3192j1587j1111j1378j0628r033q253q175p330o214o739q468q899
58051G41615p684p102p955q360p288o164o054o175o110o778q243q978q320p448
58037F38956p141o678n729n241n636o018n948o165o977p626p824q215q916r232
58023E41610r106r133r005p846o176n524n813n310l554k192k264k780k693k421
58009D67793k509k551k267k125k148j566l23M87L48R1L56O26M17J56K83M97L98
57992D57963r6j099k472l195k314n24M69K19k70m92j027k115l176m049n066n885
57976D26871n758n126n229o040o260n583n063m936m029j948jP96J002J312J400
57961C81408J039Q86J274J502J056M45J46r8m28m23l0K36L78J019K073K641K592
$$ y = [862622, 849430, 837843, 826732, 815354, 804726, 795693, 787440, 779265, 771935, 765721, 758982, 750514, 741615, 733931, 726829, 718874, 710514, 703226, 697062, 691008, 684833, 678723, 671945, 663702, 654724, 646404, 638956, 631815, 625137, 619408, 614167, 608531, 602513, 596565, 590400, 583423, 575797, 567973, 559758, 550842, 541610, 532504, 523371, 514366, 506520, 500344, 494820, 489007, 483697, 480143, 477951, 475687, 472907, 470214, 467793, 465284, 462733, 460466, 458341, 456193, 454627, 454304, 454791, 455139, 455230, 455586, 456212, 456629, 456785, 457068, 457565, 457963, 457867, 456768, 454296, 451101, 448787, 448263, 448732, 448951, 448681, 448189, 447162, 445047, 441871, 437822, 432756, 426871, 421113, 415987, 410758, 404718, 398458, 392875, 387812, 382876, 378847, 376899, 376898, 377694, 378696, 380008, 381408, 382447, 383333, 384607, 386109, 387165, 387610, 387756, 387658, 387230, 386807, 386777, 387013, 387391, 388410, 390483, 393124, 395716]
57944C95716K848L708M366M562N180O555P735Q172Q688R922J1108J1383J1054
57931D90997J0683R970Q406O153L557O65k154m184n490p011r005j0519j0961j1029
57917D70078j1396j1715j1570j1265j0873r708p614n665m663m019l029k208k292
57904C74061k793k729k125j738j789j853j690j388r58l16N27J572K761L714M052
57889C69308M075M353M703M438L670L266L366L105K080R11M4q62j961k893l744
57874C93859n126o785p484o806n795n204m557l592l193l873m662m510l693k882
57860C25697j982q78k02k04N2J229K428K484J696J080P45K23l96q19j331k100
57844C27722k412j746r81j336k652l843m478m725m397l267j971j336j053j67J356
$$ y = [395716, 398564, 402272, 406638, 411200, 416380, 422935, 430670, 438842, 447530, 457452, 468560, 479943, 490997, 501680, 511650, 520056, 526209, 529766, 530431, 528277, 524093, 518603, 511592, 502587, 492068, 481107, 470078, 458682, 446967, 435397, 424132, 413259, 403551, 395937, 390272, 385609, 381590, 378561, 376353, 374061, 371268, 368539, 366414, 364676, 362887, 361034, 359344, 357956, 356998, 356682, 357209, 358781, 361542, 365256, 369308, 373383, 377736, 382439, 386877, 390547, 393813, 397179, 400284, 402364, 403275, 403319, 402457, 400496, 397603, 393859, 388733, 381948, 374464, 367658, 361863, 356659, 352102, 348510, 345317, 341444, 336782, 332272, 328579, 325697, 323715, 322837, 322635, 322431, 322483, 323712, 326140, 328624, 330320, 331400, 332145, 332368, 331972, 331153, 329822, 327722, 325310, 323564, 322583, 321247, 318595, 314752, 310274, 305549, 301152, 297885, 295914, 294578, 293525, 293358, 294714]
57829B94714K572K937K781K540K385K430K589K394J672J064J185J589J398O12
57815C22862j8j85k43m83r15j671k780l734l895l302k607k251k171k090j770j170
57799B93577p36j056j980k565k292j733j578j666j564j389j372j217o50o2J28
57784B73845K89R65J954K752L466M490N581O051N618M537L232K330K531L735M703
57769C26079M262K523M51j209k113k172j972k527l891m723m154l273l635m921
57755B98725n460m643l455k788k558k466k516k565k321j925j771j761j547j404
57741B61545j984l092l695l280k484k166k472l017l391l283k592j626q87n84o40
57726B26352j049j794k478k515j825j042r52j789k934l333k461r35J51M72N01
$$ y = [294714, 297286, 300223, 303004, 305544, 307929, 310359, 312948, 315342, 317014, 318078, 319263, 320852, 322250, 322862, 322844, 322659, 322416, 321933, 321018, 319347, 316567, 312833, 308938, 305636, 303029, 300778, 298607, 296517, 294747, 293577, 292841, 291785, 289805, 287240, 284948, 283215, 281637, 279971, 278407, 277018, 275646, 274429, 273779, 273717, 273845, 274134, 275099, 277053, 279805, 283271, 287761, 293342, 299393, 305011, 309548, 312780, 315110, 317641, 321376, 326079, 330341, 332864, 333315, 332106, 329993, 327821, 325849, 323322, 319431, 314708, 310554, 307281, 303646, 298725, 293265, 288622, 285167, 282379, 279821, 277355, 274839, 272274, 269953, 268028, 266257, 264496, 262949, 261545, 259561, 256469, 252774, 249494, 247010, 244844, 242372, 239355, 235964, 232681, 230089, 228463, 227576, 226992, 226352, 225303, 223509, 221031, 218516, 216691, 215649, 214697, 212908, 209974, 206641, 204180, 203245, 203396, 203868, 204369]
57711B04369M85J49l64l56K19M09k17o75J0J248J718J124K90MN42J770K948K983
57693B16656J672J45n78p56r74r64l95Q6j39l51M30J684K115J742J800K859M474
57676B29506O496R236J2404J5218J7725K0836K4943K9543L4163L8360M0748L9221
57664E18399L2704K2040R159l873j5287k4133l0583l4957l6776l5586l2307k8605
57652C40195k5168k1738j8432j5700j3247j0479p915o573o057m943l160k143k304
57639B02336k222j041Q4m6q82j389j729k451l046k780k138k153k694k736k025
57624A75088j436j624k228k525k283j752j170m85L65J031R54K41r7O08J582J577
57608A67846O52l2k0jl22l98O6M28K86J78M65M83k83j110j008k32J73r8m51n39
$$ y = [204369, 204854, 205003, 204639, 204283, 204502, 204911, 204694, 204019, 204029, 205277, 206995, 208119, 208409, 208413, 208955, 210725, 213673, 216656, 218328, 218473, 217895, 217139, 216165, 215201, 214806, 214892, 214753, 214402, 214832, 216516, 218631, 220373, 222173, 225032, 229506, 236002, 245238, 257642, 272860, 290585, 311421, 336364, 365907, 400070, 438430, 479178, 518399, 551103, 573143, 582302, 578429, 563142, 539009, 508426, 473469, 436693, 401107, 368800, 340195, 315027, 293289, 274857, 259157, 245910, 235431, 227516, 220943, 214886, 209943, 206783, 204640, 202336, 200114, 199073, 199157, 199111, 198229, 196840, 195111, 192660, 189614, 186834, 184696, 182543, 179849, 177113, 175088, 173652, 172028, 169800, 167275, 164992, 163240, 162070, 161585, 161950, 162981, 163935, 164176, 164079, 164687, 166269, 167846, 168498, 168466, 168446, 168445, 168123, 167725, 167791, 168219, 168505, 168683, 169148, 169631, 169348, 168238, 167230, 166998, 167171, 167073, 166622, 166083]
57588A66083o63j042j301r67j59M34K91k81m58J9M14L7p34j095j066j222j480
57571A56810j228o10n26j155j548j042r1O39J064J174P32l4l50m2P2m79r52n11
57553A51923N07J216J421J537J722J813J849K034K311K321J742O50k72j91P34
57538A71317J042k82k118k484j343o23j292k048j577m32J62J10o3l42p21o09J70
57521A58867O61J72m73j62Q02J376J357J135O23k92q89n19J56J30l10k04K99L03
57503A63032k9L40J381J799R32m36j441k040k233j593j68J097J342O39m36j406
57487A60780j828j351j99Q69J387J517J483J244Q72P33R66J179Q78j2j123j871
57471A65524j855j332j037j201j116k33P39O62l41r99o66j8K16K36M97Q83J065
$$ y = [166083, 165420, 164378, 163077, 162110, 161951, 162385, 162676, 162395, 161937, 161956, 162370, 162407, 161673, 160578, 159512, 158290, 156810, 155582, 154972, 154446, 153291, 151743, 150701, 150610, 151249, 152313, 153487, 154219, 154185, 153835, 153793, 153865, 153386, 152434, 151923, 152430, 153646, 155067, 156604, 158326, 160139, 161988, 164022, 166333, 168654, 170396, 171046, 170774, 170583, 171317, 172359, 172077, 169959, 167475, 166132, 165509, 164217, 162169, 160592, 160160, 160322, 160432, 160369, 160027, 159306, 158697, 158867, 159528, 159700, 159227, 159065, 159867, 161243, 162600, 163735, 164358, 164066, 163177, 162658, 162814, 162944, 162634, 162430, 162729, 163032, 163003, 163343, 164724, 166523, 167455, 167019, 165578, 163538, 161305, 159712, 159544, 160641, 161983, 162622, 162186, 160780, 158952, 157601, 157402, 158271, 159658, 161175, 162658, 163902, 164774, 165507, 166473, 167652, 168530, 168518, 167395, 165524, 163669, 162337, 161300, 160099, 158983, 158750, 159489, 160151, 159810, 158811, 158145, 158127, 158343, 158579, 159076, 159959, 161024]
57454A61024J161J487J933K086J741J088M57J08J14L66P78J389K063K313J781
57439A79889Q30J93Q5Q6j36m34n63n13l40n0K26K31o9l77l92o9L72N55K03m67
57419A79260p44j73P86J159M52r77k302k696j712K44J931K276J353Q3q73j396
57403A76671j378o74M21J278J666J898K132K120J783J500J549J738J826J992K497
57388A97019L137L348K880K145J853K220K590K125R55J75M20Q71L55r90j871j613
57372B15619r12o67q60r62p68m06Q4O34R18O28o4o53q41p49o46n97l54M29J710
57353B11543K814K972K120J005L57K46L23M36P14J204J674J850J693J387J144
57338B31482J053J152J464J910K184J912J040j0o27m55L35J115J264P21K4l61
$$ y = [161024, 162185, 163672, 165605, 167691, 169432, 170520, 170977, 171085, 171199, 171565, 172343, 173732, 175795, 178108, 179889, 180719, 180912, 180997, 181083, 180947, 180513, 179950, 179437, 179097, 179047, 179273, 179504, 179435, 179058, 178666, 178597, 178969, 179524, 179727, 179260, 178516, 178343, 179129, 180288, 180740, 179763, 177461, 174765, 173053, 173297, 175228, 177504, 178857, 178940, 178067, 176671, 175293, 174619, 175040, 176318, 177984, 179882, 182014, 184134, 185917, 187417, 188966, 190704, 192530, 194522, 197019, 200156, 203504, 206384, 208529, 210382, 212602, 215192, 217317, 218272, 218447, 218867, 219738, 220093, 219103, 217232, 215619, 214707, 214040, 213180, 212218, 211450, 211044, 211128, 211762, 212680, 213308, 213244, 212591, 211750, 211001, 210355, 209758, 209404, 209833, 211543, 214357, 217329, 219449, 220454, 220811, 221057, 221380, 221816, 222530, 223734, 225408, 227258, 228951, 230338, 231482, 232535, 233687, 235151, 237061, 239245, 241157, 242197, 242187, 241560, 241105, 241440, 242555, 243819, 244540, 244564, 244203]
57322B44203m98n56k82N32J331J361Q84Q86J529J837J262N68N71R49R83P87Q76
57305B57223J152J233J308J729K188K170J945K174K763L029K866K821L163L622
57291B89386L974M164M035L719L987N253O595O756N956N475N571N311M596M771
57277C59549O559Q726R688R482R213R340R505R553R737J0116J0521J1000J1742
57264D84731J2654J3385J3692J3490J2854J2165J1934J2211J2396J1968J1113
57253F22593J0371J0038J0173J0852J2040J3408J4600J5507J6153J6569J6921
57242G69225J7476J8258J8974J9452J9859K0330K0713K0850K0858K0958K1288
57231I88241K1931K2802K3443K3327K2473K1436K0577J9775J8950J8318J7973
$$ y = [244203, 243705, 243149, 242867, 243399, 244730, 246091, 246975, 247861, 249390, 251227, 252489, 253057, 253628, 254577, 255560, 256347, 257223, 258375, 259608, 260916, 262645, 264833, 267003, 268948, 271122, 273885, 276914, 279780, 282601, 285764, 289386, 293360, 297524, 301559, 305278, 309265, 314518, 321113, 327869, 333825, 339300, 344871, 350182, 354778, 359549, 366108, 374834, 384522, 394004, 403217, 412557, 422062, 431615, 441352, 451468, 461989, 472989, 484731, 497385, 510770, 524462, 537952, 550806, 562971, 574905, 587116, 599512, 611480, 622593, 632964, 643002, 653175, 664027, 676067, 689475, 704075, 719582, 735735, 752304, 769225, 786701, 804959, 823933, 843385, 863244, 883574, 904287, 925137, 945995, 966953, 988241, 1010172, 1032974, 1056417, 1079744, 1102217, 1123653, 1144230, 1164005, 1182955, 1201273, 1219246]
57220A219246J7651J7201J6850J6806J6944J7102J7268J7340J7217J7302J8308
57209A409235K0223K2077K3137K3818K4951K6605K8216K9488L0543L1368L1814
57198A701475L2005L2332L2907L3396L3366L2620L1346L0142K9659K9947L0309
57187B049504L0165K9849L0251L1837L4321L7109L9651M1436M2209M2351M2735
57176B451418M3971M5826M7527M8568M9159M9890N0948N1852N1988N1290N0261
57165B992698M9419M8947M8706M8316M7309M5520M3347M1313L9483L7573L5579
57154C478210L3865L2668L1915L1461L1019K9951K7778K5026K2948K2207K2330
57143C789378K2630K3081K3966K5236K6674K8254K9867L1080L1626L1852L2275
$$ y = [1219246, 1236897, 1254098, 1270948, 1287754, 1304698, 1321800, 1339068, 1356408, 1373625, 1390927, 1409235, 1429458, 1451535, 1474672, 1498490, 1523441, 1550046, 1578262, 1607750, 1638293, 1669661, 1701475, 1733480, 1765812, 1798719, 1832115, 1865481, 1898101, 1929447, 1959589, 1989248, 2019195, 2049504, 2079669, 2109518, 2139769, 2171606, 2205927, 2243036, 2282687, 2324123, 2366332, 2408683, 2451418, 2495389, 2541215, 2588742, 2637310, 2686469, 2736359, 2787307, 2839159, 2891147, 2942437, 2992698, 3042117, 3091064, 3139770, 3188086, 3235395, 3280915, 3324262, 3365575, 3405058, 3442631, 3478210, 3512075, 3544743, 3576658, 3608119, 3639138, 3669089, 3696867, 3721893, 3744841, 3767048, 3789378, 3812008, 3835089, 3859055, 3884291, 3910965, 3939219, 3969086, 4000166, 4031792, 4063644, 4095919]
57132D095919L2855L3097L2772L2120L1466L0820K9870K8297K6200K4264K3296
57121D420976K3603K5192K8421L4014M2158N2089O2765P3570Q4205R4524J04933
57110E046450J16590J30678J47642J67397J90100K16408K47309K84168L28842
57101F875584L83321M49206N27774O20547P29424Q55934J000107J159875J331419
57092A3933191J510197J692057J874237K056116K238741K422179K601810K766873
57084C1095401K902943K996157L035554L012059K915038K729085K435793K024152
57076E3146182J504608R13175K97863l02128q65882j384176j849418k253355k589481
57067D6617388k852702l037344l138831l157854l101540k981132k810379k605268
$$ y = [4095919, 4128774, 4161871, 4194643, 4226763, 4258229, 4289049, 4318919, 4347216, 4373416, 4397680, 4420976, 4444579, 4469771, 4498192, 4532206, 4574364, 4626453, 4689218, 4762788, 4846993, 4941517, 5046450, 5163040, 5293718, 5441360, 5608757, 5798857, 6015265, 6262574, 6546742, 6875584, 7258905, 7708111, 8235885, 8856432, 9585856, 10441790, 11441897, 12601772, 13933191, 15443388, 17135445, 19009682, 21065798, 23304539, 25726718, 28328528, 31095401, 33998344, 36994501, 40030055, 43042114, 45957152, 48686237, 51122030, 53146182, 54650790, 55563965, 55861828, 55559700, 54693818, 53309642, 51460224, 49206869, 46617388, 43764686, 40727342, 37588511, 34430657, 31329117, 28347985, 25537606, 22932338]
57059B2932338k382035k153645j928556j712688j511111j327494j163387j018925
57051I734497q93575p85921o93651o14437n46466m88027m37357l93289l55504
57042D526270l23757k97217k74800k55568k38559k22534k06499j90349j74808
57033B342179j60640j47893j35903j24057j12509j01904r2494q3893p5851o8669
57023A238366o2601n7318n2377m7783m3646l9824l6342l3631l1796l0140k8102
57012G74806k6161k5067k4611k3967k2936k1865k0672j8909j6745j4985j3970
57001E44918j3292j2621j2121j1891j1633j1106j0327r262p835o243m768l224
56989D30595j174J331L747N806P730R652J1243J2003J1462R284N627J384k533
$$ y = [22932338, 20550303, 18396658, 16468102, 14755414, 13244303, 11916809, 10753422, 9734497, 8840922, 8055001, 7361350, 6746913, 6200447, 5712420, 5275063, 4881774, 4526270, 4202513, 3905296, 3630496, 3374928, 3136369, 2913835, 2707336, 2516987, 2342179, 2181539, 2033646, 1897743, 1773686, 1661177, 1559273, 1466779, 1382886, 1307035, 1238366, 1175765, 1118447, 1066070, 1018287, 974641, 934817, 898475, 864844, 833048, 802908, 774806, 748645, 723578, 698967, 675000, 652064, 630199, 609527, 590618, 573873, 558888, 544918, 531626, 519005, 506884, 494993, 483360, 472254, 461927, 452665, 444830, 438587, 433819, 430595, 429421, 430752, 434499, 440305, 448035, 457687, 468930, 480933, 492395, 501679, 507306, 508690, 506157]
56976E06157o034r470j2533j4316j4468j3613j2483j1252r813q122o116l773j320
56963C82844J018L492O513R901J2972J5411J7394J8668J8169J4933R159K166m473
56950E08167r809j3833j6956j9084j9569j8320j6398j4792j3052j0039n855j961
56938C48499P28K905N752R531J3670J7591K1025K3811K5602K5596K2685J6409
56926E33804P785j310r522j6423k1762k5185k6773k7113k6596k5229k3104k0586
56914C17986j7847j4897j2105j0075q855p879o790n764m891l944k870j996j506
56901B18567j180p45o8R45K195L332M337N862Q247J0582J1723J2092J3305J6024
56887C05218J9284K2009K3769K3890K1301J6055R898M450k69m870q997j1688j2618
$$ y = [506157, 500123, 490653, 478120, 463804, 449336, 435723, 423240, 411988, 402175, 394053, 387937, 384164, 382844, 383862, 387354, 393867, 403768, 416740, 432151, 449545, 468213, 486382, 501315, 510474, 512640, 508167, 498358, 484525, 467569, 448485, 428916, 410596, 394198, 379406, 366354, 356315, 350460, 348499, 349227, 352132, 357884, 367415, 381085, 398676, 419701, 443512, 469114, 494710, 517395, 533804, 541589, 540279, 530757, 514334, 492572, 467387, 440614, 413501, 386905, 361676, 338572, 317986, 300139, 285242, 273137, 263062, 254207, 246328, 239538, 233774, 228883, 224939, 222069, 220073, 218567, 217387, 216642, 216574, 217519, 219714, 223046, 227383, 233245, 241492, 252074, 263797, 275889, 289194, 305218, 324502, 346511, 370280, 394170, 415471, 431526, 441424, 445874, 445605, 440735, 431738, 420050, 407432]
56874D07432j2215j0913q936o425l268P32N178R137J2340J5685K0095K5505L1459
56861D85806L7800M3984M8303M8714M4340L5712K4108J1203j202j1939k0858k7992
56849G17979l2715l4204l2426k8174k2366j5734q758j501O277J4593K3193L2136
56837F18300M1807N2109O2262P1467P8791Q1928P7448O3597M2419J8290n252k6463
56825A176703m4201n7286o5184o8286o7322o3009n6220m7867l8572k8807j9193
56814F20756j0165j496P396J6821K6756L6967M6651N4157N7496N5063M5979L0616
56802I86997J1309q230k5126l8664m9113n6117n9115n8602n5707n0879m4099l6151
56790E16503k8515k1953j6110j0490m851J255Q270J5684K2114K6516K8558K7779
$$ y = [407432, 395217, 384304, 375368, 368943, 365675, 366407, 371585, 380722, 393062, 408747, 428842, 454347, 485806, 523606, 567590, 615893, 664607, 708947, 744659, 768767, 779970, 778768, 766829, 745971, 717979, 685264, 651060, 618634, 590460, 568094, 552360, 543602, 542101, 548378, 562971, 586164, 618300, 660107, 712216, 774478, 845945, 924736, 1006664, 1084112, 1147709, 1190128, 1208418, 1203166, 1176703, 1132502, 1075216, 1010032, 941746, 874424, 811415, 755195, 707328, 668756, 639949, 620756, 610591, 609095, 616491, 633312, 660068, 697035, 743686, 797843, 855339, 910402, 956381, 986997, 998306, 990076, 964950, 926286, 877173, 821056, 761941, 703339, 647632, 596753, 552654, 516503, 487988, 466035, 449925, 439435, 434584, 435839, 444109, 459793, 481907, 508423, 536981, 564760]
56778E64760K3431J5594N744m292j3523k1668k8509l3716l6968l7901l6346l2940
56766C63666k9101k5982k3549k0985j7877j4721j2340j0939r934q670p191o055
56754A76322n511n271n124n213n454n239m268l143k618k513k130j420j040j223
56740A26155j372r36j80K00j00p00r76o89k24q2k21k27j59n39j318j536o28N91
56722A17059R83O91P61J515K208K263J943J652J329Q32L75K69N35Q89R57N52n2
56705A34761k97MM38O08N84M65M7o08q86n38k99p93j375j098k91j9k72q2N97N59
56685A31505p64k286k724k077j148m32p4k08o75r11o44k82k28k82j60j4j3P5M26
56666A19084P08O36N92J117K030K640K686K504K369K168J797J421J189J035R64
$$ y = [564760, 588191, 603785, 609529, 605237, 591714, 570046, 541537, 507821, 470853, 432952, 396606, 363666, 334565, 308583, 285034, 264049, 246172, 231451, 219111, 208172, 198238, 189568, 182377, 176322, 170811, 165540, 160416, 155203, 149749, 144510, 140242, 137099, 134481, 131968, 129838, 128418, 127378, 126155, 124783, 123847, 123667, 123867, 123767, 123067, 122091, 121402, 121178, 121096, 120875, 120648, 120489, 119950, 118632, 117096, 116468, 117059, 118042, 118733, 119494, 121009, 123217, 125480, 127423, 129075, 130404, 131236, 131611, 131880, 132415, 133304, 134261, 134813, 134761, 134464, 134468, 134906, 135514, 136098, 136563, 136610, 136002, 135116, 134578, 134279, 133486, 132111, 131013, 130722, 130703, 130431, 130349, 130946, 131505, 130741, 128455, 125731, 123654, 122506, 122074, 122000, 121792, 121117, 120206, 119562, 119280, 119052, 118770, 118610, 118596, 118583, 118658, 119084, 119792, 120428, 121020, 122137, 124167, 126807, 129493, 131997, 134366, 136534, 138331, 139752, 140941, 141976, 142940]
56651A42940J258K021K732K655J830J207J495K208K328J700J129J086J108P01
56637A66398P4l41n00m18N2O19M40o86j671j525q12p33j281j460j053r04j440
56620A54759k096k423k665k953k901k385j955j994k178k115j895j695j392j006
56606A25106q48r56q49k76L26M39J14k91n77o47l86L1J25k57n72k69M13O61O4
56587A21351q53j133l45R38J749J729J276P63J24n30o56j15L27P8k66J28R04J111
56569A26580Q84J239K364L333L716M119M912N569N754N939O403O563N935M882
56555A88192L847K658J240J96j30m15j352k416k543j772j271j801k840l373l006
56540A75214k182j563j368j325j104p23l41j1J83m2o83j134r27n47q16j654k213
$$ y = [142940, 144198, 146219, 148951, 151606, 153436, 154643, 156138, 158346, 160674, 162374, 163503, 164589, 165697, 166398, 166472, 166131, 165631, 165213, 165265, 165884, 166324, 165638, 163967, 162442, 161630, 160897, 159616, 158156, 157103, 156199, 154759, 152663, 150240, 147575, 144622, 141721, 139336, 137381, 135387, 133209, 131094, 129199, 127504, 126112, 125106, 124258, 123302, 122453, 122177, 122503, 122942, 123056, 122765, 122188, 121541, 121155, 121186, 121311, 121054, 120482, 120213, 120626, 121287, 121351, 120498, 119365, 119020, 119958, 121707, 123436, 124712, 125475, 125599, 125069, 124413, 124298, 124625, 124703, 124437, 124565, 125469, 126580, 127464, 128703, 131067, 134400, 138116, 142235, 147147, 152716, 158470, 164409, 170812, 177375, 183310, 188192, 192039, 194697, 195937, 196133, 196003, 195588, 194236, 191820, 189277, 187505, 186234, 184433, 181593, 178220, 175214, 173032, 171469, 170101, 168776, 167672, 166949, 166608, 166597, 166780, 166738, 166055, 164921, 163994, 163447, 162631, 160977, 158764]
56523A58764k166j901j535o93N22J320J330J019P72L82k28o56p21p48q42o87l66
56506A53566l64m98R4J360J906R71k63k65P56J442J274Q69O79M99R7m46r84j345
56488A59348j283q28l70l1N51J435J899J369L38k98l78l46l82l10q7K03N95J002
56470A62427J056O94N16R74J637J783J375R26O96O18P07R69J153J054Q48P01M13
56453A78547j63o71p68o79p82r10o62j00L34M60M43M41M37K74k12q95j168o21
56435A73305J29J14m24j90J076J889J144j66m09M07J045J084J208J694J966J719
56419A85591J439J510J574J034j45j315j613p25O72J497J514J451J706J649P77
56404A96616k87o48m09k27j68J15N22P19R21J452J860J361J10q63r24l66K71O97
$$ y = [158764, 156598, 154697, 153162, 152469, 152991, 154311, 155641, 156660, 157432, 157814, 157586, 156930, 156209, 155461, 154619, 153932, 153566, 153202, 152704, 152798, 154158, 156064, 157035, 156772, 156507, 157263, 158705, 159979, 160848, 161527, 162026, 162123, 161677, 160693, 159348, 158065, 157237, 156867, 156836, 157387, 158822, 160721, 162090, 162428, 162130, 161752, 161406, 161024, 160714, 160627, 160830, 161425, 162427, 163483, 164177, 164693, 165667, 167304, 169087, 170462, 171388, 172084, 172702, 173409, 174378, 175531, 176585, 177433, 178134, 178547, 178384, 177713, 176945, 176266, 175484, 174574, 173912, 173812, 174146, 174606, 175049, 175490, 175927, 176201, 175989, 175094, 173926, 173305, 173434, 173548, 173124, 172934, 174010, 175899, 177043, 176877, 176468, 176875, 177920, 179004, 180212, 181906, 183872, 185591, 187030, 188540, 190114, 191148, 191003, 189688, 188075, 187350, 188022, 189519, 191033, 192484, 194190, 195839, 196616, 196329, 195681, 195272, 195045, 194877, 194992, 195514, 196233, 197154, 198606, 200466, 201827, 201937, 201074, 200150, 199784, 200055, 200752]
56386B00752P98O88Q07J364J821J474M46m23n52J5R14J664J745J073K54n8J27
56369B12909M16O73R34J056R43P94P28M99j1m39m75k54K5L24L22l74j176p41J056
56350B17209K470K153R92N21N82R3p21o27M37J213J140R99J463K270K991L467
56334B36652L415K695K048K442L644M437M373M182M290M103L181K086J606J790
56320B80944K123K113J450J50j223j943j828j318q98p67q59q29l03M07M06m51
56304B77174r61j00J470K371K447K534K775K461J480O57N61R17J334J729K099
56289B98948K503L172L934L947K832J580J359J878K046J795J944K574K983L089
56275C34584L498M182M435M180M103M420M727N019N688O526P017P460Q534R787
$$ y = [200752, 201550, 202238, 203045, 204409, 206230, 207704, 208150, 207727, 207175, 207190, 208104, 209768, 211513, 212586, 212840, 212782, 212909, 213325, 213998, 214932, 215988, 216931, 217725, 218453, 218952, 218941, 218502, 218027, 217773, 217798, 218122, 218444, 218070, 216894, 216153, 217209, 219679, 221832, 222824, 223345, 223927, 224020, 223299, 222672, 223109, 224322, 225462, 226461, 227924, 230194, 233185, 236652, 240067, 242762, 244810, 247252, 250896, 255333, 259706, 263888, 268178, 272281, 275462, 277548, 279154, 280944, 283067, 285180, 286630, 286780, 285557, 283614, 281786, 280468, 279570, 278803, 277944, 277115, 276812, 277219, 277625, 277174, 276213, 276113, 277583, 279954, 282401, 284935, 287710, 290171, 291651, 292308, 292869, 293786, 295120, 296849, 298948, 301451, 304623, 308557, 312504, 315336, 316916, 318275, 320153, 322199, 323994, 325938, 328512, 331495, 334584, 338082, 342264, 346699, 350879, 354982, 359402, 364129, 369148, 374836, 381362, 388379, 395839, 404373, 414160]
56261D14160J0164J0003J0862J3061J5059J5768J6020J7023J8738K0583K2597
56250E84038K5083K7934L0971L4200L7320L9682M1162M2334M3483M4229M4275
56239I94711M3704M2384L9942L6474L2353K7320K0874J3581O811Q93n182j1916
56227A241949j8296k3244k6922l0008l2540l4150l4800l4755l4297l3707l3082
56216I06148l2189l0972k9912k9268k8322k6381k4064k2443k1282j9526j7204
56205F24585j5324j4023j2512j0827r904r673q822o880m990m095l802l441k989
56192E17303k488j853j510j914k299j422L30J210P68L69P42R77O27P89K083L317
56176E17029L352K797K771L243L674M107M621M782M534M623N401O238O703P248
$$ y = [414160, 424324, 434327, 445189, 458250, 473309, 489077, 505097, 522120, 540858, 561441, 584038, 609121, 637055, 668026, 702226, 739546, 779228, 820390, 862724, 906207, 950436, 994711, 1038415, 1080799, 1120741, 1157215, 1189568, 1216888, 1237762, 1251343, 1258154, 1259047, 1253865, 1241949, 1223653, 1200409, 1173487, 1143479, 1110939, 1076789, 1041989, 1007234, 972937, 939230, 906148, 873959, 842987, 813075, 783807, 755485, 729104, 705040, 682597, 661315, 641789, 624585, 609261, 595238, 582726, 571899, 561995, 552322, 543500, 536620, 531630, 527535, 523733, 520292, 517303, 514815, 512962, 511452, 509538, 507239, 505817, 506147, 507357, 508125, 508494, 509236, 510213, 510840, 511629, 513712, 517029, 520381, 523178, 525949, 529192, 532866, 536973, 541594, 546376, 550910, 555533, 560934, 567172, 573875, 581123]
56162E81123Q086Q647Q716Q883R349R564R559J0279J1993J3891J5762J8495K2173
56149G36520K5407K7511K9844L3895L9472M5820N3191O2112P2148Q2297R1708
56138A299925R9369J04243J06274J06155J03688R7909Q9332Q0405P2930O6505
56128B226735O0164N3762M6945L8520K8086J6891O176l942j3213k0630k6156l1622
56116B381716l8866m8117n8784p0318q1490r0484r6465r9743j00132r6904r0702
56105A509711q3330p5256o5591n4983m5770l8578l1549k3984j7792j4007j0915
56094A047956p294m623m067m050k957j678j304p30J105K922L347L340M158N063
56080A041188N267N831P394Q291P375O504P660R774J1014J2021J4019J5811J5596
$$ y = [581123, 589209, 597856, 606572, 615455, 624804, 634368, 643927, 654206, 666199, 680090, 695852, 714347, 736520, 761927, 789438, 819282, 853177, 892649, 938469, 991660, 1053772, 1125920, 1208217, 1299925, 1399294, 1503537, 1609811, 1715966, 1819654, 1917563, 2006895, 2087300, 2160230, 2226735, 2286899, 2340661, 2387606, 2426126, 2454212, 2471103, 2477279, 2473337, 2460124, 2439494, 2413338, 2381716, 2342850, 2294733, 2235949, 2165631, 2084141, 1993657, 1897192, 1797449, 1697317, 1600413, 1509711, 1426381, 1351125, 1285534, 1230551, 1184781, 1146203, 1114654, 1090670, 1072878, 1058871, 1047956, 1040662, 1036039, 1031972, 1027922, 1024965, 1023287, 1021983, 1021253, 1022358, 1025280, 1028627, 1031967, 1036125, 1041188, 1046455, 1052286, 1059680, 1067971, 1075346, 1081850, 1089510, 1099284, 1110298, 1122319, 1136338, 1152149, 1167745]
56067A167745J4135J3350J3385J3644J4856J7417J9452J9291J8289J8530J9489
56056A349583J9583J9222J9540J9876J9269J8779J9581K0558K0354K0004K0802
56045A567151K1675K1381K1261K2861K4962K5919K6699K8580L0211L0209L0325
56034A851234L2535L5362L6611L7384L9649M2161M2790M2698M4212M6588M7973
56023B299197M9263N2027N4738N5378N5630N8142O1739O3810O5339O8967P4020
56012B958250P8010Q1094Q4680Q7795Q9305R1389R6214J01702J05266J08865J15372
56001C997942J23036J28990J35098J44491J55439J64712J73804J85518J97661
55992E406691K06998K16196K29728K46110K61500K77505K97647L19782L40382
$$ y = [1167745, 1181880, 1195230, 1208615, 1222259, 1237115, 1254532, 1273984, 1293275, 1311564, 1330094, 1349583, 1369166, 1388388, 1407928, 1427804, 1447073, 1465852, 1485433, 1505991, 1526345, 1546349, 1567151, 1588826, 1610207, 1631468, 1654329, 1679291, 1705210, 1731909, 1760489, 1790700, 1820909, 1851234, 1883769, 1919131, 1955742, 1993126, 2032775, 2074936, 2117726, 2160424, 2204636, 2251224, 2299197, 2348460, 2400487, 2455225, 2510603, 2566233, 2624375, 2686114, 2749924, 2815263, 2884230, 2958250, 3036260, 3117354, 3202034, 3289829, 3379134, 3470523, 3566737, 3668439, 3773705, 3882570, 3997942, 4120978, 4249968, 4385066, 4529557, 4684996, 4849708, 5023512, 5209030, 5406691, 5613689, 5829885, 6059613, 6305723, 6567223, 6844728, 7142375, 7462157, 7802539]
55983G802539L62700L91779M25001M57069M90698N32297N80601O30425O84321
55974A2357430P49316Q25184R07688J000455J111726J242682J391473J565194
55966B1151148J775032K024370K316384K669063L107597L647443M300681N090373
55958D6082091O037945P144752Q411002R868307J1571563J3569193J5905926J8631660
55950A37222439K1755984K5182069K8675173L1790438L3709265L3241988K9338997
55943C40916353K1901944J2100984J736682p783956j5874459k2387422k7124104
55936C03486022k9834127l0521122k9549329k7452088k4722368k1750454j8824512
55929A20832022j6117847j3702047j1598773r810371q312599p059303o010832
$$ y = [7802539, 8165239, 8557018, 8982019, 9439088, 9929786, 10462083, 11042684, 11673109, 12357430, 13106746, 13931930, 14839618, 15840073, 16951799, 18194481, 19585954, 21151148, 22926180, 24950550, 27266934, 29935997, 33043594, 36691037, 40991718, 46082091, 52120036, 59264788, 67675790, 77544097, 89115660, 102684853, 118590779, 137222439, 158978423, 184160492, 212835665, 244626103, 278335368, 311577356, 340916353, 362818297, 374919281, 376655963, 368872007, 352997548, 330610126, 303486022, 273651895, 243130773, 213581444, 186129356, 161406988, 139656534, 120832022, 104714175, 91012128, 79413355, 69602984, 61290385, 54231082, 48220250]
55922D8220250n142679m427053l828873l323818k901811k549849k248120j985011
55914B1813036j759954j568952j401336j252368j125252j018541r23939q38139
55906A1924555p64928p03803o47763n94143n47085n07407m69933m32703l99435
55897F857355l71033l43374l15329k90717k70523k50980k30927k13714k00296
55888D370462j87493j74441j63957j56209j47679j37631j29260j23308j16759
55879C033725j08925j02673r8487r3371q6858q2208q0325p8120p4224p0892o8967
55868B088675o6216o2014n8581n6417n3418m9583m7565m7471m6183m2970m0694
55857A517563m0250l8925l5773l3520l3364l2669k9978k7692k7621k7986k7048
$$ y = [48220250, 43077571, 38650518, 34821645, 31497827, 28596016, 26046167, 23798047, 21813036, 20053082, 18484130, 17082794, 15830426, 14705174, 13686633, 12762694, 11924555, 11159627, 10455824, 9808061, 9213918, 8666833, 8159426, 7689493, 7256790, 6857355, 6486322, 6142948, 5827619, 5536902, 5266379, 5015399, 4784472, 4570758, 4370462, 4182969, 4008528, 3844571, 3688362, 3540683, 3403052, 3273792, 3150484, 3033725, 2924800, 2822127, 2723640, 2630269, 2543411, 2461203, 2380878, 2302758, 2228534, 2157642, 2088675, 2022459, 1960445, 1901864, 1845447, 1792029, 1742446, 1694881, 1647410, 1601227, 1558257, 1517563, 1477313, 1438388, 1402615, 1369095, 1335731, 1303062, 1273084, 1245392, 1217771, 1189785, 1162737]
55846A162737k5894k5550k4944k3664k3296k4188k4218k2501k1000k0862k0450
55835I06170j8690j7044j6440j5490j3500j2133j2289j2330j1185j0247j0452
55824G56370j0431r454r255j0910j2553j2418j1685j2091j2931j2594j1270j0084
55812F20694r130q132p551p506o936n276l548k795k671k500k195j450K95K467
55798E63766L641L784M259N199N036L299J492L45j283l747n297m915m230n108
55784E66241p204r331j1397j3470j4568j3969j2445j1021r645p938n960l547n30
55771D45216J897J842n50k948m134n315p283q622q070o587n553m758l765l396
55757C87974m271n346n480n246n709o673p442q089q700q575p402o179n826n910
$$ y = [1162737, 1136843, 1111293, 1086349, 1062685, 1039389, 1015201, 990983, 968482, 947482, 926620, 906170, 887480, 870436, 853996, 838506, 825006, 812873, 800584, 788254, 777069, 766822, 756370, 745939, 736485, 727230, 716320, 703767, 691349, 679664, 667573, 654642, 642048, 630778, 620694, 611564, 603432, 595881, 588375, 581439, 576163, 572615, 569820, 567149, 564649, 562454, 561004, 561299, 563766, 567407, 571191, 575450, 580649, 585685, 588984, 590476, 590821, 589538, 585791, 580494, 575579, 571349, 566241, 559037, 549706, 538309, 524839, 510271, 496302, 483857, 472836, 463191, 455253, 449293, 445746, 445216, 447113, 448955, 448405, 445457, 441323, 436008, 428725, 420103, 412033, 405446, 399893, 395135, 391370, 387974, 383703, 378357, 372877, 367631, 361922, 355249, 347807, 339718, 331018, 322443, 315041, 308862, 303036, 297126]
55743B97126n663n156m662m064l583l818m451m338l545l473m382m648l505k413
55729B39425k547k891k310j615j927k646k742k629l025l309k667j677j190p86
55715B07464J14Q69Q40Q37J730K743K773K258K192K284J780J103J029J047J67
55700B29230j406k871m229n620o210n382m224m174m858m856l919k879k060j353
55686A75189j224j923k297j047J184K611K762K641K783K792K535K327K023J316
55672A91672P10Q85J313Q87l40j374j996k805l719l854k995j872r55j49L89L40
55656A76137J95Q08J960K510K190K016K654L492L671L115K112P54p85k050k798
55641A95981l262l688m064m378m702m915m789m400m069l913l714l259k554j847
$$ y = [297126, 291463, 286307, 281645, 277581, 273998, 270180, 265729, 261391, 257846, 254373, 249991, 245343, 241838, 239425, 236878, 233987, 231677, 230062, 228135, 225489, 222747, 220118, 217093, 213784, 211117, 209440, 208250, 207464, 207578, 208447, 209287, 210124, 211854, 214597, 217370, 219628, 221820, 224104, 225884, 226987, 228016, 229063, 229230, 227824, 224953, 220724, 215104, 208894, 203512, 199288, 195114, 190256, 185400, 181481, 178602, 176542, 175189, 173965, 172042, 169745, 168698, 169882, 172493, 175255, 177896, 180679, 183471, 186006, 188333, 190356, 191672, 192382, 193267, 194580, 195467, 195127, 193753, 191757, 188952, 185233, 181379, 178384, 176512, 175557, 175408, 175797, 176137, 176332, 177140, 179100, 181610, 183800, 185816, 188470, 191962, 195633, 198748, 200860, 201614, 200829, 198779, 195981, 192719, 189031, 184967, 180589, 175887, 170972, 166183, 161783, 157714, 153801, 150087, 146828, 144274, 142427]
55627A42427j593k075k828k931k124j182p96o74k79J76J13n22j407k434l429l784
55611A16658l121k011j301j056p98n16o43j184j562j332o53p1k6m21n67l2N27
55594A01891Q5j064j434n19L36o3j000j122m37J22L63P39J115R97O94J077K298
55577A04078L631M497M834M689M298M230M630M670L581J896P79L91m8r60k083
55562A43113l224m301m781m138k863k122k345k949l381l595l518k904j909j124
55548I9959q44q01o80m26r5K83O13P94P55L61l59q10l10Q04J327Q57L65O04R34
55529A03331N73l8j34k6m17j008j098q80r53j090q27p17j489k444k227r88j40
55512H9428j17K4O80R63K76q09j572j999k152j850j273r63r12n76j8Ko72j239
$$ y = [142427, 140834, 138759, 135931, 133000, 130876, 129694, 128898, 128224, 127945, 128121, 128234, 127712, 126305, 123871, 120442, 116658, 113537, 111526, 110225, 109169, 108371, 107855, 107212, 106028, 104466, 103134, 102481, 102410, 102384, 101963, 101396, 101364, 101891, 101976, 100912, 99478, 98959, 99295, 99232, 98232, 97110, 96673, 96795, 97158, 97897, 99012, 100009, 100703, 101780, 104078, 107709, 112206, 117040, 121729, 126027, 130257, 134887, 139557, 143138, 145034, 145813, 146204, 146156, 145196, 143113, 139889, 135588, 130807, 126669, 123806, 121684, 119339, 116390, 113009, 109414, 105896, 102992, 101083, 99959, 99115, 98314, 97634, 97208, 97113, 97396, 98009, 98803, 99558, 99919, 99560, 98750, 98440, 99244, 100571, 101428, 101793, 102397, 103331, 103904, 103866, 103732, 103706, 103289, 102281, 101183, 100303, 99350, 98260, 97433, 96716, 95227, 92783, 90556, 89568, 89428, 89311, 89335, 90015, 90978, 91254, 90445, 88873, 86874, 84722, 82872, 81599, 80636, 79724, 79148, 79130, 79132, 78460, 77221]
55494G7221j189r52r20p82k74K16K50j18o47j108j033p5J155J485O81j99k82J60
55476G3589M94O54Q14Q49O13K71k6l20m84k79N1j45r62j637j544r52m76l04k50
55457F9956j22K30Q38J358J297O60J6k04j21j09m07j023j612j564o16O11J270
55440G0458J273J099Q75M08n5N3O62J022P41J86k52n84p66n75r8J83M1k90n04
55421G3877m10J47R65J252M52q11j383j026m49m5L91Q31Q67N09J50k78j106j880
55403G2053j609l14Q14J022P79O27M01o8m36n49p52j041q35oP18Q24O63O48O57
55384G3596O13P36Q93O16P2L5N37O56J44p8M01O40Po28m01R6K4j55K49N57k35
55363G8375j476j638o37J36j7m50o45r13j367j446q98k08K58P58J458J947J853
$$ y = [77221, 76032, 75080, 74160, 73378, 73104, 73320, 73570, 73452, 72805, 71697, 70664, 70589, 71744, 73229, 73910, 73711, 73429, 73589, 74083, 74737, 75551, 76400, 77013, 77284, 77258, 76938, 76454, 76175, 76226, 76081, 75119, 73482, 71938, 70986, 70510, 70206, 69956, 69834, 70064, 70902, 72260, 73557, 74217, 74233, 74029, 73908, 73799, 73392, 72369, 70757, 69193, 68577, 69188, 70458, 71731, 72830, 73705, 74113, 74058, 74111, 74773, 75795, 76536, 76722, 76470, 75886, 75120, 74545, 74447, 74630, 74671, 74381, 73877, 73467, 73614, 74579, 75831, 76283, 75472, 74089, 73063, 72614, 72569, 72960, 73791, 74658, 75167, 75317, 75039, 73933, 72053, 70444, 70130, 70944, 71966, 72745, 73372, 73773, 73705, 73269, 72720, 71968, 70927, 70092, 70086, 70804, 71628, 72291, 72939, 73596, 74209, 74945, 75838, 76454, 76526, 76561, 77098, 77754, 77898, 77820, 78221, 78861, 78868, 78240, 77839, 77935, 77959, 77804, 78053, 78610, 78375, 76899, 75261, 74624, 74760, 74743, 74293, 73648, 72735, 71368, 69922, 69024, 68816, 69074, 69832, 71290, 73237, 75090]
55346G5090J352P99L32J9p8j62n53j157j509j458j343j347j225q17m17k94k00
55329F7032L06J192J888J855J150M13K41N19N19j82j101j368p49J78P47P91N63
55312G3994L80M21O23P19N41K39R0J13N2k12m60l92j2L57M32L16L53O14P28L46
55292G9242l20p25o35l29j49j76m10q43j293j371q39J42J159J811J860J331N19
55275G8974k67q74j138q58j68L27K69J63P06J683K156J730R20K86j43m54n67n85
55257H2160q21j238j391j125p38l35L32J124J335O42l32p62m69K53J002J208M21
55240H1266q92j471p54L40O78L07Lj5m6l0L44P92N66m86j589j946j491p21j38
55221G4717K7j11k17p8K20M63N54M44Q5l00k41L66R22Q01K42Q9O48J215R95J62
$$ y = [75090, 76442, 77241, 77573, 77592, 77514, 77352, 76799, 75642, 74133, 72675, 71332, 69985, 68760, 67943, 67526, 67232, 67032, 67338, 68530, 70418, 72273, 73423, 73836, 74077, 74596, 75115, 74933, 73832, 72464, 71715, 71893, 72640, 73431, 73994, 74374, 74795, 75418, 76137, 76678, 76917, 77007, 77120, 77172, 76960, 76500, 76108, 76096, 76453, 76885, 77201, 77554, 78168, 78896, 79242, 78922, 78197, 77562, 77233, 77084, 76908, 76498, 75655, 74362, 72991, 72152, 72294, 73453, 75264, 77124, 78455, 78974, 78707, 77833, 76695, 75837, 75669, 75996, 76265, 76428, 77134, 78817, 80973, 82703, 83623, 83909, 83766, 83312, 82745, 82160, 81339, 80101, 78710, 77585, 76847, 76512, 76844, 77968, 79303, 79945, 79613, 78851, 78382, 78635, 79637, 80845, 81266, 80374, 78903, 78149, 78489, 79167, 79474, 79477, 79462, 79416, 79386, 79730, 80522, 81088, 80602, 79013, 77067, 75576, 74855, 74717, 74744, 74633, 74416, 74338, 74558, 75021, 75575, 76019, 76104, 75804, 75563, 75929, 76851, 77652, 77894, 77983, 78631, 79846, 80841, 81003]
55201H1003l05J19Q10P99L5o64q36q69j051r54l51oo30j534j442l63M98N69M37
55182G5265M79K90j79k15L93O84q7j294j881j690j166m75L66J019J286J488J870
55165G6153K050J677J058O26L47J01J31M72N79J07n32r06j205j571j455m56Q20
55148G7996J500J559J520J532J443J264Q89rj235j854j454q64q96j098p59k73
55132G9261l48n89j63O39Q62N16L80M75J31n57o99j17M08M64M55O06O10L82J67
55113H2883j75r39j636j382l57K73P2j56J52N33N93P53J303J692J373O49J00j48
55095H5583j50J52N97P56O45P79J207J241N81r1j98j77o27j161r47j2P52P86L79
55076I0095Q8N1N2n6j25O2L71L34j53m34P8R01J005K49m67n47l56l51l31n7J41
$$ y = [81003, 80698, 80817, 81627, 82426, 82461, 81797, 80961, 80092, 79041, 78087, 77736, 77730, 77100, 75566, 74124, 73761, 74259, 74828, 75265, 75744, 76034, 75855, 75640, 76033, 76717, 76630, 75336, 73455, 71765, 70599, 70124, 70490, 71509, 72795, 74283, 76153, 78203, 79880, 80938, 81564, 81911, 82012, 82143, 82615, 83194, 83301, 82769, 81863, 80658, 79087, 77632, 77176, 77996, 79496, 81055, 82575, 84107, 85550, 86814, 87703, 87694, 86459, 84605, 83151, 82287, 81391, 80293, 79534, 79261, 78913, 78324, 78161, 78800, 79662, 80178, 80558, 81033, 81164, 80607, 79908, 79791, 80199, 80663, 81118, 81724, 82334, 82716, 82883, 82708, 81769, 80133, 78751, 78394, 78667, 78739, 78583, 78735, 79268, 79861, 80614, 81917, 83609, 84982, 85631, 85731, 85583, 85433, 85585, 86182, 86938, 87583, 88362, 89569, 90810, 91391, 91300, 91102, 90925, 90298, 89137, 88190, 88178, 88930, 89716, 90095, 90183, 90234, 90286, 90230, 90105, 90167, 90538, 90872, 90719, 90285, 90363, 91264, 92269, 92518, 92051, 91504, 91148, 90797, 90466, 90409, 90550]
55055I0550r6n35p77q55r16p67k81J87K90K74N43R17Q69M07O4J06J56k75j157
55036H8704j929j959j075K24J170J460J437J490J529J298R13P11O32J97p81j738
55020I2283j860j044r0J90j46m12k85j13k31m06l32j98l02m66l13j3r9n73p78
55001H4812k78N54J049R89O61M01K72J39j3M5M71R51R55N02K33M90Q30P67N31
54982I4361N63P40P44Q05J278J782J572O39k76p06p71n29J57J023J386R87K91
54965A04046j81l44l94n35q62j111p83M2M18k38j067q26L42J234J429J486J464
54948A04120P35m84r33j74O20M45j32j56K26M42O95J354J806J168j99r68n69K71
54930A08267P08P17P01Q19R51J049J223J596K077K436K707L277M280N063M821
$$ y = [90550, 90454, 89919, 89142, 88287, 87371, 86604, 86323, 86510, 86800, 87074, 87617, 88534, 89403, 89810, 89874, 89980, 90136, 89861, 88704, 86775, 84816, 83741, 83965, 85135, 86595, 88032, 89522, 91051, 92349, 93262, 93973, 94605, 94802, 94021, 92283, 90423, 89379, 89289, 89479, 89333, 88921, 88636, 88523, 88292, 87886, 87554, 87356, 87054, 86588, 86275, 86262, 86163, 85590, 84812, 84534, 85088, 86137, 87126, 87787, 88188, 88460, 88599, 88586, 88631, 89102, 90053, 91008, 91510, 91743, 92233, 93063, 93830, 94361, 94924, 95664, 96408, 97213, 98491, 100273, 101845, 102484, 102208, 101502, 100731, 100202, 100359, 101382, 102768, 103755, 104046, 103865, 103521, 103127, 102592, 101730, 100619, 99836, 99878, 100296, 100058, 98991, 98165, 98507, 99741, 101170, 102656, 104120, 104855, 104371, 103438, 103264, 103884, 104329, 104197, 104041, 104267, 104709, 105404, 106758, 108564, 109732, 109533, 108565, 107996, 108267, 108975, 109692, 110393, 111212, 112163, 113212, 114435, 116031, 118108, 120544, 123251, 126528, 130808, 135871, 140692]
54915A40692L724K683K031J164k57j637k329k492k629k893l262l775m167l887
54901A22966k951k219k232k409j952r80k03J05J60Q0j24k82l02l84n84n15Q1Q62
54883A09117J397J704J903J817J478J522K449L828M807N030M602L623K370J465
54869A47112J166Q54r7j326k085k463l125m032m378l832l055k747k793k597j909
54854A14693j084p05r38j315j301j067j237j778j848j105l92m43o61o7J000J280
54838A03032M76l47l59k1k20r87j497j042J71J146J034J61k64L08R63N54o95j578
54820A00835j533j087p98o31m28l01l28l73l54k64M8O16R69O02j83m75Q6R19J337
54801I8657J257R47O16M36N54Q45R86Q87P73P71P84P66Q00Q27O45K33j77m02l58
$$ y = [140692, 144416, 147099, 149130, 150294, 150037, 148400, 146071, 143579, 140950, 138057, 134795, 131020, 126853, 122966, 120015, 117796, 115564, 113155, 111203, 110223, 110020, 110125, 110285, 110365, 110241, 109959, 109657, 109273, 108689, 108174, 108255, 109117, 110514, 112218, 114121, 115938, 117416, 118938, 121387, 125215, 130022, 135052, 139654, 143277, 145647, 147112, 148278, 149132, 149035, 147709, 145624, 143161, 140036, 136004, 131626, 127794, 124739, 121992, 119199, 116602, 114693, 113609, 112904, 111966, 110651, 109350, 108283, 107046, 105268, 103420, 102315, 101923, 101480, 100819, 100752, 101752, 103032, 103508, 103161, 102802, 102781, 102561, 101574, 100077, 99035, 99206, 100352, 101386, 101547, 101283, 101591, 102554, 103108, 102413, 100835, 99302, 98215, 97417, 96786, 96358, 96057, 95729, 95356, 95002, 94738, 94786, 95402, 96371, 96973, 96790, 96315, 96401, 97320, 98657, 99914, 100861, 101477, 101913, 102467, 103312, 104298, 105185, 105958, 106729, 107513, 108279, 109079, 109906, 110551, 110784, 110607, 110205, 109847]
54782A09847P2R23J851K349K216J620P89ll36JO51J138J574K413L515M083L681
54765A36384K860K478K760L216L282K890K462K374K329J522l17k362l551l764
54751A52563l667l626l482l257l298l613l738l403k808k054r50L51J157J022L39
54736A21536k36n35p38q12n94j71K07N09Q81J309J620J788J979K317K738L125
54720A34923L450L701L779L536K933K084J095J4j008j701k060k562l541m456m344
54705A35843l159j942j432j182n95j25n94j681k135j488o69p28j581k324k323
54690A13885j655p77o6L84O67P93O88M51L06K04j72p13p40J7P91P65K03j29k54
54671A14648p04j224r06K51J022N68m86j030q10l13J22M77O95O55L93O4j72j08
$$ y = [109847, 109919, 110842, 112693, 115042, 117258, 118878, 119667, 119664, 119328, 119329, 119980, 121118, 122692, 125105, 128620, 132703, 136384, 139244, 141722, 144482, 147698, 150980, 153870, 156332, 158706, 161035, 162557, 162240, 159878, 156327, 152563, 148896, 145270, 141788, 138531, 135233, 131620, 127882, 124479, 121671, 119617, 118667, 119018, 120175, 121197, 121536, 121300, 120765, 120027, 119215, 118621, 118450, 118657, 119166, 120047, 121356, 122976, 124764, 126743, 129060, 131798, 134923, 138373, 142074, 145853, 149389, 152322, 154406, 155501, 155515, 154507, 152806, 150746, 148184, 144643, 140187, 135843, 132684, 130742, 129310, 128128, 127533, 127408, 126814, 125133, 122998, 121510, 120841, 120113, 118532, 116208, 113885, 112230, 111453, 111387, 111771, 112438, 113231, 113919, 114370, 114676, 114880, 114708, 113995, 113255, 113272, 114063, 114828, 115031, 114902, 114648, 113944, 112720, 111814, 112065, 113087, 113655, 113169, 112139, 111329, 111016, 111138, 111615, 112310, 112965, 113358, 113422, 113250, 113142]
54653A13142L43Q96J127R56N85j6r93j944k049j191l73n63j469j879j051O04K016
54636A08141K426J879J057N85N64P78J128J508J467N47r69k128k287j683r29l75
54620A11709n0J05K25L82M30J89j58j66K38O41P01N36M43N44P63Q76O24O3k97
54601A17798n4M20M10j53o15n17p4L64P65J158J368J215O88q4p80r58n85k90o03
54582A19473j120j122o92m56l38L49J525K156J687P60J00l11n90l85M11J165J307
54565A23919J044Q18O76N90O81O93K6j171j784j212l08j11l91l10K16P14J162
54548A25252J747K052J533O02K36O63J251J496J370Q55M2m33P0J160J699J185
54532A40780K19m36n99m68k76k56m24l81J70P44N36l76r52n04L97O61m1r57j147
$$ y = [113142, 113485, 114381, 115508, 116464, 117049, 117033, 116040, 114096, 112047, 110856, 110483, 109920, 108451, 106572, 105521, 106125, 108141, 110567, 112446, 113503, 114088, 114652, 115430, 116558, 118066, 119533, 120080, 119111, 116983, 114696, 113013, 112084, 111709, 111659, 111764, 111989, 112371, 112801, 112990, 112832, 112666, 112904, 113545, 114246, 114782, 115225, 115769, 116532, 117408, 118032, 118095, 117798, 117744, 118164, 118574, 118421, 117806, 117289, 117215, 117579, 118344, 119502, 120870, 122085, 122773, 122689, 121909, 120951, 120366, 120076, 119473, 118353, 117231, 116539, 116083, 115745, 116094, 117619, 119775, 121462, 122222, 122322, 122011, 121421, 121036, 121447, 122612, 123919, 124963, 125781, 126457, 127047, 127728, 128421, 128447, 127276, 125492, 124280, 123972, 123861, 123470, 123160, 123376, 124090, 125252, 126999, 129051, 130584, 131186, 131422, 132085, 133336, 134832, 136202, 137057, 137099, 136666, 136736, 137896, 139595, 140780, 140999, 140563, 139964, 139496, 139220, 138964, 138540, 138159, 138329, 139073, 139609, 139233, 138281, 137777, 138174, 138835, 138794, 137837, 136690]
54513A36690n13Q1j47q13p53L57J447J446O40m0m02q58j276j083l42K18K67J42
54495A35061L9k03m49k75K21M69M73Q68J679J971J209J66j06M35J102J486J575
54478A45721J399J174J406K187K738K302J205M15K64K30j15n35n95k29J96J66
54462A57929n12j287j159J25J485J630O18l83p12p72q95p00L3O31M29k10n29n73
54444A55148q95j309j038q2N19J29o57j010r25p49m29J01L29j61q19q10k75n7
54426A47010l48n30l10n8M5K74N68M57L1K9N80Q16L51Q4Q05J767J699O11l91p06
54406A52784o00l22J26L91J9o51p08Q9J004J431J515J519J339R43O56N83L07m48
54388A59977j247j482j180q49p15n01R6R34J521J422O33m29j263j572j226k71
$$ y = [136690, 136177, 136258, 136111, 135298, 134545, 134902, 136349, 137795, 138435, 138395, 137993, 137135, 135859, 134776, 134434, 134652, 134919, 135061, 135100, 134897, 134448, 134173, 134394, 134863, 135336, 136204, 137883, 139854, 141063, 141229, 141123, 141558, 142660, 144146, 145721, 147120, 148294, 149700, 151887, 154625, 156927, 158132, 158547, 158811, 159041, 158926, 158391, 157796, 157567, 157763, 157929, 157417, 156130, 154971, 155096, 156581, 158211, 158829, 158446, 157734, 156962, 156067, 155367, 155400, 156031, 156460, 156250, 155721, 155148, 154253, 152944, 151906, 151824, 152343, 152472, 151815, 150805, 149880, 149131, 148702, 148803, 149132, 148971, 148152, 147342, 147067, 147010, 146662, 146132, 145822, 145764, 145809, 146083, 146651, 147108, 147139, 147168, 147748, 148564, 148915, 148999, 149804, 151571, 153270, 153881, 153490, 152784, 152184, 151862, 151988, 152379, 152398, 151747, 151039, 151128, 152132, 153563, 155078, 156597, 157936, 158879, 159535, 160118, 160425, 159977, 158730, 157248, 156068, 155219, 154504, 154003, 154099, 155033, 156554, 157976, 158609, 158180, 156917, 155345, 154119, 153848]
54372A53848Q86J605J564J056M92p3n90o42J4P69P17j44r29j045p40m81m12n50
54354A55345q57r51m00N40J043Q31M76L81J62m73r47n85L31R77J090J013Q93N82
54336A59451J89K8N2o9l01l27k91p95j849k509k040j007o10j139j719j538p59
54319A44767m0L51N62O18L80m1l17l72m63o66o97m63l03m10l91R8O19M88n8qR57
54298A44611J910J900J181O56M84Rj039j954j944j182n81o51j009j062q05o56
54282A39868o75m47K06P81O84lo79r98j013p66k64K28L56K73M77R22R37L36n7
54263A40166M71J392J655J154O49M75K15k26j96O60J636J818J175L44k84o71p48
54246A49685n60n56j050j527j166o5Q17R66Q08P41N00j25o70o54l14j17m1N1j15
$$ y = [153848, 154734, 156339, 157903, 158959, 159451, 159378, 158788, 158146, 158160, 158929, 159646, 159502, 158573, 157528, 156788, 156307, 155895, 155345, 154488, 153537, 153137, 153677, 154720, 155551, 156027, 156408, 156570, 156097, 155150, 154565, 154896, 155873, 156963, 157976, 158869, 159451, 159640, 159668, 159720, 159651, 159350, 159023, 158732, 157937, 156088, 153579, 151539, 150532, 149922, 148783, 147064, 145526, 144767, 144727, 145078, 145640, 146258, 146638, 146597, 146280, 145908, 145445, 144779, 144082, 143619, 143316, 142906, 142515, 142613, 143232, 143720, 143662, 143654, 144611, 146521, 148421, 149602, 150258, 150742, 150751, 149712, 147758, 145814, 144632, 144051, 143400, 142391, 141329, 140524, 139868, 139193, 138746, 138952, 139733, 140417, 140414, 139735, 138737, 137724, 136958, 136694, 136922, 137278, 137551, 138028, 138950, 139887, 140223, 140166, 140637, 142029, 143684, 144838, 145487, 145962, 146177, 145951, 145755, 146415, 148051, 149869, 151044, 151388, 151104, 150433, 149685, 149125, 148569, 147519, 145992, 144826, 144761, 145578, 146544, 147352, 148093, 148593, 148468, 147798, 147144, 146830, 146713, 146672, 146723, 146608]
54227A46608o76j022o02M5K0m62l45N44J192R15J18o80j469k022j632k27J107
54210A41412J409R03K70l65q99o65O07J809J591J68j001j124p17m16k37r3j66
54193A42486m72p11p82r25j194j254q38j12N27P17L06l75n92l4O32N75n3l16J87
54174A37772R32J277J029K06j014j999k010j074KO71J050J220P57n82k175l009
54158A33053k624j442k84K82L45M17P17Q63N41J29J49L77K23j45Q6J066J901J801
54140A37455R95K34NL81J115J622J465R86R30J299J258M15n16o83j77K54Q9o49
54122A46478j494j739r71K59Q50L99m41r45j007p11J0Q69J210R24P32J064J339
54105A46826R46J87l03n18p66r97j094j257j468j145j25O04J11j018j401p69j02
$$ y = [146608, 145932, 144910, 144308, 144353, 144373, 143911, 143566, 144110, 145302, 146217, 146335, 145655, 144186, 142164, 140532, 140305, 141412, 142821, 143724, 143994, 143629, 142730, 142065, 142672, 144481, 146072, 146240, 145239, 144115, 143398, 142982, 142745, 142652, 142486, 142014, 141303, 140521, 139596, 138402, 137148, 136310, 136198, 136725, 137442, 137748, 137373, 136781, 136747, 137379, 137954, 137901, 137585, 137772, 138704, 139981, 141010, 141216, 140202, 138203, 136193, 135119, 135121, 135792, 136842, 138062, 138819, 138237, 136062, 133053, 130429, 128987, 128703, 128985, 129330, 129747, 130464, 131327, 131868, 131997, 132146, 132523, 132746, 132601, 132687, 133753, 135654, 137455, 138450, 138684, 138689, 139070, 140185, 141807, 143272, 144258, 145188, 146487, 147745, 148160, 147644, 146961, 146784, 147038, 147127, 146478, 144984, 143245, 142274, 142533, 143383, 143782, 143341, 142396, 141389, 140678, 140688, 141557, 142767, 143691, 144423, 145487, 146826, 147772, 147959, 147656, 147138, 146372, 145375, 144281, 143024, 141556, 140411, 140286, 140890, 141001, 139983, 138582, 137813, 137711]
54088A37711k4j02J66O11Q56Q95R13R86J137J286J177O87J41p1q6l21p13p54k64
54069A44231L45O16M74J88J05M11Q34Q48M40L17R79J965K533K671K813K873K520
54052A65163K089K367L514M955O298P561Q538Q830Q568Q235P655O075L476Q33
54038B44157j231l155n275o922p302o671n832n051m171l315k733k247j621j237
54024A87394j636k476k768k190j461j243j337j293j268j687k340k449j736r15
54010A62595q17j319j592j268q63q50r31n46K42R11J203J182P21k93j296j377
53994A55702n24J93P2k92l1O07O96Q2m61m38k03j51o2L70Q74R07M31j28m79o93
53974A56472q16o90k77J08J68M8J19L93N30M53O21J366K221K352J654R49R21J203
$$ y = [137711, 137687, 137585, 137751, 138362, 139218, 140113, 141026, 142012, 143149, 144435, 145612, 146299, 146440, 146369, 146283, 145962, 145249, 144495, 144231, 144576, 145192, 145666, 145854, 145959, 146370, 147204, 148052, 148492, 148809, 149788, 151753, 154286, 156957, 159770, 162643, 165163, 167252, 169619, 173133, 178088, 184386, 191947, 200485, 209315, 217883, 226118, 233773, 239848, 243324, 244157, 242926, 239771, 234496, 227574, 220272, 213601, 207769, 202718, 198547, 195232, 192499, 190252, 188631, 187394, 185758, 183282, 180514, 178324, 176863, 175620, 174283, 172990, 171722, 170035, 167695, 165246, 163510, 162595, 161778, 160459, 158867, 157599, 156736, 155886, 154955, 154409, 154651, 155562, 156765, 157947, 158668, 158375, 157079, 155702, 155178, 155371, 155443, 155151, 155120, 155727, 156423, 156505, 156044, 155606, 155403, 155252, 155190, 155560, 156434, 157341, 157772, 157644, 157165, 156472, 155656, 154966, 154689, 154797, 154965, 155013, 155132, 155525, 156055, 156508, 157129, 158495, 160716, 163068, 164722, 165671, 166592, 167795]
53956A67795R57J04n03k04O03J047R38R20J456K209K569K520K557K963L577M230
53940A93738M965N755O354O570O403N902N187M663M670M802M070K126j50j742
53926B53313k673l536m307m447l933l408l237l167k980k811k594j955r02m5K27
53911B13545K33L32L16j19p33j089j128r35k73R91K337L085L324L733M528N266
53895B33413N703O154O741O863N778L424L86k650n125o708p506p978q279p949
53881B22267o642m954l972l965m146l811l205k892k769k302j503r80r60r35n37
53866A78694k10m85r67p82M2L98m12j573j713o89K55Q7p94j239q05o5K85J85m1
53847A70171j96k34n1L72P21N49j18o88o60k19J4k24n08k96L27P22M78n7j89K69
$$ y = [167795, 168752, 168856, 168353, 168149, 168752, 169799, 170737, 171657, 173113, 175322, 177891, 180411, 182968, 185931, 189508, 193738, 198703, 204458, 210812, 217382, 223785, 229687, 234874, 239537, 244207, 249009, 253079, 255205, 255055, 253313, 250640, 247104, 242797, 238350, 234417, 231009, 227772, 224605, 221625, 218814, 216220, 214265, 213363, 213318, 213545, 213778, 214110, 214426, 214307, 213574, 212485, 211357, 210422, 210149, 211140, 213477, 216562, 219886, 223619, 228147, 233413, 239116, 245270, 252011, 258874, 264652, 268076, 268462, 265812, 260687, 253979, 246473, 238495, 230216, 222267, 215625, 210671, 206699, 202734, 198588, 194777, 191572, 188680, 185911, 183609, 182106, 181126, 180166, 179231, 178694, 178484, 177999, 177032, 176250, 176292, 176690, 176278, 174705, 172992, 172303, 172558, 172645, 171851, 170612, 169807, 169742, 170027, 170212, 170171, 169975, 169741, 169690, 170062, 170783, 171332, 171214, 170526, 169866, 169647, 169661, 169437, 168929, 168633, 168960, 169682, 170160, 170103, 169914, 170183]
53827A70183Q24R58O85L76K25J63J01M8j7j46l05l92l25j8O26J500K211K465K425
53808A81587K424K431K157J585J012N92K90L01R43J942K366J660M02l76l08J75
53792A99183O09R01J108J193J121R45P54N86L44j73j003j779k065j991k154k660
53776A94919k773j931p24k72q23j553j721j410j014n74J0N37O32K99k0j6M7l35
53758A83278j181j834j627o67K69N20O0o61j050o47N15J674J919J195M11L58R10
53741A83442J465J732J686J275O35L39P97J617J979J551O61j87o00k86O70J610
53725A98386J895J630J419J511J668J745J900K175K360K325K105J687J145R38
53711B22889J549K713L450L112K111J447J694K501K992K647J924J784K435K903
$$ y = [170183, 171007, 171965, 172650, 173026, 173251, 173414, 173515, 173563, 173546, 173400, 173095, 172703, 172378, 172360, 172986, 174486, 176697, 179162, 181587, 184011, 186442, 188599, 190184, 191196, 191788, 192078, 192379, 193322, 195264, 197630, 199290, 199692, 199316, 199008, 199183, 199792, 200693, 201801, 202994, 204115, 205060, 205814, 206400, 206744, 206571, 205568, 203789, 201724, 199733, 197579, 194919, 192146, 190215, 189491, 189219, 188396, 186843, 185122, 183712, 182698, 182124, 182134, 182671, 183303, 183602, 183582, 183566, 183613, 183278, 182097, 180263, 178636, 177969, 178238, 178758, 178818, 178157, 177107, 176460, 176975, 178649, 180568, 181763, 182174, 182532, 183442, 184907, 186639, 188325, 189600, 190235, 190574, 191371, 192988, 194967, 196518, 197179, 196992, 196392, 196106, 196776, 198386, 200281, 201911, 203330, 204841, 206509, 208254, 210154, 212329, 214689, 217014, 219119, 220806, 221951, 222889, 224438, 227151, 230601, 233713, 235824, 237271, 238965, 241466, 244458, 247105, 249029, 250813, 253248, 256151]
53697B56151K348J409J529L023M610M966M105K932K056J421P29j40j013j526j477
53682B81123j161j053j198j215r56p59r09j165j095o32j26M2j96n84q49j046j433
53665B66788j883j785q56K55O51K58k33l26r1K29M01J17o42j266j161o16l58l81
53647B59101o8N76P84L24r8rJ65P7J79Q22J411J241O22M55J029J879K482K559
53629B73531K047J322J138J806K711L050K809K528K504K713L197L896M351M156
53615C11759L585L245L279L401L542L881M340M578M521M422M387M210L752L144
53601C66046K606K283K197K130J699Q39Q3P1Q11J723K269K311K002J628J460J455
53585C91613J275P92L61K73J49o52k072l276l546k972k246k010k405l103l657
$$ y = [256151, 258499, 259908, 261437, 264460, 269070, 274036, 278141, 281073, 283129, 284550, 285279, 285139, 284126, 282600, 281123, 279962, 278909, 277711, 276496, 275540, 274781, 273872, 272707, 271612, 270980, 270854, 270896, 270700, 270116, 269267, 268221, 266788, 264905, 263120, 262264, 262519, 263170, 263428, 263195, 262869, 262778, 263007, 263408, 263525, 262883, 261617, 260456, 259840, 259482, 259101, 259033, 259609, 260393, 260717, 260619, 260610, 260775, 260852, 261031, 261853, 263264, 264505, 265127, 265582, 266611, 268490, 270972, 273531, 275578, 276900, 278038, 279844, 282555, 285605, 288414, 290942, 293446, 296159, 299356, 303252, 307603, 311759, 315344, 318589, 321868, 325269, 328811, 332692, 337032, 341610, 346131, 350553, 354940, 359150, 362902, 366046, 368652, 370935, 373132, 375262, 376961, 377800, 377883, 377954, 378765, 380488, 382757, 385068, 387070, 388698, 390158, 391613, 392888, 393680, 394041, 394314, 394463, 393811, 391739, 388463, 384917, 381945, 379699, 377689, 375284, 372181, 368524]
53570C68524l889l849l493k735j883j523j745j853j308m61QJ10L62Q50J145J089
53554C49349J036J229J441J427J263J109R92J039J495K302K955L074K948L145
53540C74804L690M015L852L817M717O381P718Q089Q091Q557R303R578R476R939
53526D72027J1323J2920J4104J5040J5865J6129J5746J5664J6665J8085J8718
53515F42286J8575J8779J9889K1369K2617K3604K4419K4992K5460K6048K6448
53504H94486K6010K4780K3665K3316K3396K3277K2902K2596K2459K2305K1915
53493A151107K1069J9676J8143J7298J7559J8364J8729J8302J7598J7308J7528
53482A352681J7744J7462J6785J6208J5811J5005J3343J1237R403P732N435K355
$$ y = [368524, 364635, 360786, 357293, 354558, 352675, 351152, 349407, 347554, 346246, 345785, 345793, 345903, 346265, 347115, 348260, 349349, 350385, 351614, 353055, 354482, 355745, 356854, 357846, 358885, 360380, 362682, 365637, 368711, 371659, 374804, 378494, 382509, 386361, 390178, 394895, 401276, 408994, 417083, 425174, 433731, 443034, 452612, 462088, 472027, 483350, 496270, 510374, 525414, 541279, 557408, 573154, 588818, 605483, 623568, 642286, 660861, 679640, 699529, 720898, 743515, 767119, 791538, 816530, 841990, 868038, 894486, 920496, 945276, 968941, 992257, 1015653, 1038930, 1061832, 1084428, 1106887, 1129192, 1151107, 1172176, 1191852, 1209995, 1227293, 1244852, 1263216, 1281945, 1300247, 1317845, 1335153, 1352681, 1370425, 1387887, 1404672, 1420880, 1436691, 1451696, 1465039, 1476276, 1485679, 1493411, 1498846, 1501201]
53470A501201o21k800m736p357j0440j2670j3289j3059j3303j4485j6072j7552
53458A374817j8936k0256k1146k1350k1268k1494k1966k2080k1621k0993k0546
53447A143161k0249k0156k0478k0829k0141j7925j5133j3067j1819j0487q640
53436I64237o750n231l830k151k44J484K619L037L206M087O257R103J1428J2773
53422A000025J3706J4807J6069J7385J8937K0770K2472K3672K4525K5470K6734
53411A224572K8310L0145L2071L3779L5135L6374L7870L9781M1981M4261M6480
53400A630759M8593N0539N2108N3091N3719N4711N6541N8711O0164O0358N9696
53389B238990N8845N7975N6759N4851N2264M9366M6545M3899M1311L8779L6297
$$ y = [1501201, 1500580, 1497780, 1493044, 1485687, 1475247, 1462577, 1449288, 1436229, 1422926, 1408441, 1392369, 1374817, 1355881, 1335625, 1314479, 1293129, 1271861, 1250367, 1228401, 1206321, 1184700, 1163707, 1143161, 1122912, 1102756, 1082278, 1061449, 1041308, 1023383, 1008250, 995183, 983364, 972877, 964237, 957487, 952256, 948426, 946275, 946031, 947515, 950134, 953171, 956377, 960464, 966721, 975824, 987252, 1000025, 1013731, 1028538, 1044607, 1061992, 1080929, 1101699, 1124171, 1147843, 1172368, 1197838, 1224572, 1252882, 1283027, 1315098, 1348877, 1384012, 1420386, 1458256, 1498037, 1540018, 1584279, 1630759, 1679352, 1729891, 1781999, 1835090, 1888809, 1943520, 2000061, 2058772, 2118936, 2179294, 2238990, 2297835, 2355810, 2412569, 2467420, 2519684, 2569050, 2615595, 2659494, 2700805, 2739584, 2775881]
53378B775881L3491K9901K5800K2086J8932J5203R876L439k914r005j5570k2809
53366B884311l0087l6952m3349m8782n2500n4761n6836n9252o1068o1376o0537
53355B318811n9264n7476n5002n2715n1780n2032n2133n1285n0054m9322m9076
53344A738672m8522m7013m4621m1967l9675l7924l6459l4858l2751k9938k6630
53333A318314k3512k1173j9467j7784j5978j4550j3828j3503j3130j2626j2014
53322A140749j1153j0062r120q595q283p785o858n350l198q11J083K203K988L844
53308A079652M614N167N965P448R300J0937J2474J4486J6942J9037K0260K1023
53296A227305K2027K3402K4796K6031K7237K8355K8855K8281K6941K5735K5101
$$ y = [2775881, 2809372, 2839273, 2865073, 2887159, 2906091, 2921294, 2931170, 2934609, 2931695, 2922690, 2907120, 2884311, 2854224, 2817272, 2773923, 2725141, 2672641, 2617880, 2561044, 2501792, 2440724, 2379348, 2318811, 2259547, 2202071, 2147069, 2094354, 2042574, 1990542, 1938409, 1887124, 1837070, 1787748, 1738672, 1690150, 1643137, 1598516, 1556549, 1516874, 1478950, 1442491, 1407633, 1374882, 1344944, 1318314, 1294802, 1273629, 1254162, 1236378, 1220400, 1205850, 1192022, 1178519, 1165389, 1152763, 1140749, 1129596, 1119534, 1110414, 1101819, 1093536, 1085751, 1078893, 1073543, 1070345, 1069534, 1070617, 1072820, 1075808, 1079652, 1084266, 1089433, 1095398, 1102846, 1112146, 1123083, 1135557, 1150043, 1166985, 1186022, 1206282, 1227305, 1249332, 1272734, 1297530, 1323561, 1350798, 1379153, 1408008, 1436289, 1463230, 1488965, 1514066]
53285A514066K4578K3551K2093K0596J8935J6611J3611J0488P613M860K089o97
53273A678394l605o660r442j1601j3679j6538j9967k2809k4616k6125k7823k9196
53261A466333k9916l0585l1574l2244l2222l2371l3320l4024l3112l1075k9570
53250A116320k9055k8570k7663k7011k7017k7144k6948k6614k6155k5182k3843
53239H21118k2979k2820k2432k0994j8883j6974j5457j3998j2521j1257j0308
53228F32495r627r184q834q352p898q096r309j1087j2508j2964j2486j1636j1153
53215D99361j1291j1484j1012j0007r285r137r010q541q142q076p799o850n796
53202C82931n516n963o421o591o626o355n484m504m463n492o404o124m960l950
$$ y = [1514066, 1538644, 1562195, 1584288, 1604884, 1623819, 1640430, 1654041, 1664529, 1672142, 1677002, 1679091, 1678394, 1674789, 1668129, 1658687, 1647086, 1633407, 1616869, 1596902, 1574093, 1549477, 1523352, 1495529, 1466333, 1436417, 1405832, 1374258, 1342014, 1309792, 1277421, 1244101, 1210077, 1176965, 1145890, 1116320, 1087265, 1058695, 1031032, 1004021, 977004, 949860, 922912, 896298, 870143, 844961, 821118, 798139, 775319, 752887, 731893, 713010, 696036, 680579, 666581, 654060, 642803, 632495, 622868, 613684, 604850, 596498, 588600, 580504, 571195, 560108, 547600, 534636, 522150, 510514, 499361, 488070, 476586, 465574, 455567, 446282, 437145, 428135, 419594, 411452, 403376, 395577, 388727, 382931, 377415, 371452, 365031, 358440, 351814, 345459, 339975, 335471, 331008, 325516, 319112, 312988, 308028, 304078]
53188C04078l559l466l288k928k371j687j160j008j077j091j099j245j336j094
53174B77669p94j020j698k045j682j219j300j599j338m62L32N41K36l75j133j687
53158B62426j671j283j142j418j604j324r54j055j603k092k149j819j374j081
53144B41857j015r99q51o55n63m04M7N05M36pLP44J371J052J42k90K38J305K216
53125B45132K478J936R53J97k1k7r2L9M86P22L83R5O13J463J406J75j205j844
53107B52889j872j768j657j559j617j718j492r90p90j088j296r51m92n77j071
53092B33951j242p75m0M92O88O33M70L48L29K80N8k69n25o49o61n11j72J71K23
53073B32799l0j77K51J193J935J696M84q05j310j075p91q34r67r03p41n93k99
$$ y = [304078, 300519, 297053, 293765, 290837, 288466, 286779, 285619, 284611, 283534, 282443, 281344, 280099, 278763, 277669, 276875, 275855, 274157, 272112, 270430, 269211, 267911, 266312, 264974, 264512, 264844, 265385, 265621, 265246, 264113, 262426, 260755, 259472, 258330, 256912, 255308, 253984, 253030, 251975, 250372, 248280, 246131, 244312, 242938, 241857, 240842, 239843, 238992, 238337, 237774, 237370, 237417, 237922, 238358, 238351, 238354, 239098, 240469, 241521, 241663, 241373, 241611, 242916, 245132, 247610, 249546, 250499, 250696, 250675, 250648, 250556, 250595, 251081, 251803, 252186, 252281, 252894, 254357, 255763, 255938, 254733, 252889, 251017, 249249, 247592, 246033, 244416, 242698, 241206, 240216, 239426, 238338, 237042, 236091, 235599, 235022, 233951, 232709, 231934, 231894, 232386, 233074, 233707, 234177, 234525, 234854, 235134, 235192, 234923, 234398, 233749, 233088, 232577, 232405, 232576, 232799, 232769, 232592, 232843, 234036, 235971, 237667, 238151, 237346, 236036, 234961, 234170, 233336, 232369, 231466, 230725, 230132, 229833]
53056B29833J99M98J76n24r50r52j096j743k356k082q97K98P18M19q6n04p38o21
53038B19592j44K38J22j75l3L89L06l89p19m2Q88R33J82k67J00O67O92K10k30
53019B22320k54J34O67R91Q74L93k32q06j082p30K08J089J213O10r9m42l76k4
53001B24454L90M83M3n08n16L0M87M84L82O24R93Q80J50n43l60P24J660J372R9
52982B31328o83l9J238J668R72K49L99J156J700J581R19K02O4Q20K039K868K850
52965B49331K155J115K4p24q36n99n70q26r88j032j386k081k461k087j356q85
52949B36794p32n86l29o9R1l6o32j452j799j349p00o80j298j735j360m24L03L81
52931B24388N2k10l28n48q51q50m57k09m56p04l79R2j70j095j618j191l90R2K65
$$ y = [229833, 230032, 230530, 230706, 230182, 229232, 228280, 227184, 225441, 223085, 221003, 220106, 220404, 221122, 221541, 221455, 220951, 220213, 219592, 219448, 219686, 219808, 219633, 219600, 219989, 220295, 219906, 219187, 219145, 220033, 220966, 221148, 220881, 220981, 221648, 222340, 222550, 222320, 222066, 222200, 222867, 223858, 224732, 225125, 224893, 224087, 223005, 222275, 222483, 223572, 224785, 225395, 225296, 224854, 224478, 224454, 224844, 225327, 225370, 224862, 224346, 224376, 224863, 225347, 225729, 226353, 227346, 228226, 228376, 227833, 227473, 228197, 229857, 231229, 231328, 230645, 230606, 231844, 233512, 234484, 234733, 235132, 236288, 237988, 239569, 240488, 240690, 240754, 241574, 243613, 246481, 249331, 251486, 252601, 252625, 251901, 251065, 250466, 249896, 249070, 248082, 247050, 245664, 243583, 241122, 239035, 237679, 236794, 236062, 235476, 235147, 235078, 235169, 235133, 234501, 233049, 231250, 229901, 229201, 228521, 227223, 225488, 224128, 223704, 224007, 224388, 224440, 224230, 223902, 223354, 222503, 221653, 221196, 220987, 220531, 219827, 219448, 219540, 219370, 218275, 216657, 215466, 215076, 215168, 215433]
52912B15433L60L29K22L47O03L31o18j298p99M46J227J110P75Q50J097Q88J50
52895B21453m65l40K98N30j13r73j111n94k34k18J23J029J694J403N64J9q0j14
52877B22871k16k91m12o19n64L7P87R90N93K28M25J117J932K581K919K840K227
52860B37445J115j08q18p96n58o96j050j090q46q49j216j636k118k829l199k430
52844B18321j107q62j934k468j186N98Q57k38q52k34N86O33P4n19q32o50K6O10
52826B10823M47l04r74j381j760j923j442n16K59Q97J868K940L215K455J437Q44
52810B16885N83M62N51P17N04j81q89j418k011k623k710k039j087l48J32L31L5
52793B06894n92r30p55n57o52o03lP46J003Q54Q65J134J129M96m41j041j030p35
$$ y = [215433, 215793, 216122, 216344, 216691, 217294, 217625, 217007, 215709, 214910, 215356, 216583, 217693, 218468, 219318, 220415, 221303, 221453, 220988, 220648, 220946, 221476, 221363, 220390, 219279, 218685, 218451, 218233, 218356, 219385, 221079, 222482, 223046, 223065, 222985, 222871, 222655, 222364, 221952, 221333, 220769, 220806, 221593, 222583, 223176, 223404, 223829, 224946, 226878, 229459, 232378, 235218, 237445, 238560, 238452, 237634, 236838, 236280, 235584, 234534, 233444, 232598, 231749, 230533, 228897, 226779, 223950, 220751, 218321, 217214, 216352, 214418, 211950, 210764, 211362, 212219, 211981, 211129, 210895, 211481, 212114, 212188, 211669, 210837, 210187, 210213, 210823, 211270, 210966, 209992, 208611, 206851, 204928, 203486, 202970, 203229, 204126, 205994, 208934, 212149, 214604, 216041, 216885, 217468, 217930, 218481, 219198, 219702, 219521, 218632, 217214, 215203, 212580, 209870, 207831, 206744, 206396, 206528, 206859, 206894, 206302, 205372, 204617, 204060, 203408, 202805, 202802, 203548, 204551, 205405, 206270, 207404, 208533, 209029, 208588, 207547, 206517, 205782]
52775B05782o27o92m88O9M37K59NJ71L50q8o90m32N55R82M29jM82R90M01q30j342
52754B05722q02n7K72L33K93K7l26k73L48J093J539J754J992K240K260J913J327
52737B19655Q46P21Q78J015R94R28Q72O96L94J80N1l27j123j931k272k169j947
52720B17461j738j520j341j131n93K71P93L83n45j057j028j244k072k666k042
52705B01931l87J151J760J530R20K07l61m29J13Q24J173J247J621K436K985K551
52689B19272J373M37L46P62R87P79M16J92J07Oj14r7Q9J07m47j391j821r91P56
52670B20768K195K428J634P24M55Q85J463J563J118O46N15M28m1o26o82k25Rl72
52652B32885r16j153j269j478j351l90R36J454O89n50j115p09J9L52J82j02j58
$$ y = [205782, 205155, 204463, 203975, 204044, 204481, 204740, 204745, 204916, 205266, 205178, 204488, 204056, 204611, 205593, 206022, 206021, 206503, 207493, 207894, 207064, 205722, 204920, 204863, 205135, 205468, 205761, 205788, 205462, 205189, 205537, 206630, 208169, 209923, 211915, 214155, 216415, 218328, 219655, 220501, 221222, 222100, 223115, 224109, 225037, 225909, 226605, 226999, 227179, 227230, 226903, 225780, 223849, 221577, 219408, 217461, 215723, 214203, 212862, 211731, 211138, 211409, 212202, 212585, 212040, 210983, 209955, 208711, 206639, 203973, 201931, 201544, 202695, 204455, 205985, 206905, 207112, 206751, 206322, 206435, 207259, 208432, 209679, 211300, 213736, 216721, 219272, 220645, 221082, 221428, 222190, 223177, 223956, 224372, 224564, 224671, 224677, 224563, 224466, 224555, 224662, 224215, 222824, 221003, 220012, 220768, 222963, 225391, 227025, 227749, 228204, 229089, 230552, 232115, 233233, 233879, 234394, 234822, 234781, 234155, 233473, 233248, 233257, 232885, 231969, 230816, 229547, 228069, 226718, 226328, 227264, 228718, 229407, 228857, 227742, 227033, 227052, 227404, 227586, 227484, 227326]
52635B27326QK26L77M01K89K39O26J539K445K659K057J150M00j43o00r80j229
52618B36790j266r99n17k47n11r99j071n82J9L95N84N97L56J71O22J661K451K462
52600B39916K169K160K144J440J26j006j441j314q98l00L08O60P12P43R88J354
52584B47761J515J210N14j46l48j33J02J46J50J91R6j72l49l90o87j395j969j859
52566B44237j385j330j838k218j863r25J8N64P26P69Q48Q12M40r7l18o6K80L93
52548B39047L71K88q6p51j159r37m84k57L0Q09J672J826J326Q79O05Op77q59q3
52529B41466M12k45j340j577q13k8J19q0j03P8J81K7k90m73j99N66J468K112K456
52510B43737K707K968L170L243L163K835K124R59n70k144l175l171k352j621j613
$$ y = [227326, 227334, 227560, 227937, 228338, 228627, 228866, 229492, 231031, 233476, 236135, 238192, 239342, 239742, 239599, 238999, 238019, 236790, 235524, 234525, 234008, 233761, 233250, 232251, 231180, 230598, 230617, 231012, 231596, 232193, 232549, 232720, 233342, 235003, 237454, 239916, 242085, 244245, 246389, 247829, 247955, 246949, 245508, 244194, 243296, 242996, 243304, 243964, 244676, 245419, 246407, 247761, 249276, 250486, 251000, 250854, 250506, 250373, 250475, 250621, 250771, 250962, 251058, 250886, 250537, 250147, 249460, 248065, 246096, 244237, 242852, 241522, 239684, 237466, 235603, 234678, 234696, 235260, 235986, 236755, 237603, 238415, 238855, 238758, 238440, 238374, 238654, 239047, 239418, 239706, 239620, 238869, 237710, 236773, 236289, 236032, 236062, 236871, 238543, 240369, 241695, 242574, 243179, 243185, 242408, 241549, 241466, 241878, 241633, 240293, 238716, 237903, 237875, 237994, 237914, 237811, 237889, 238070, 238097, 237807, 237334, 237135, 237701, 239169, 241281, 243737, 246444, 249412, 252582, 255825, 258988, 261823, 263947, 264906, 264336, 262192, 259017, 255846, 253494, 251873, 250260]
52495B50260j942j776j068n93p46r17m17M41P44K27m51o15k81K16P19J168J408
52478B46377J433J541J878K032J482L57o21r33p20m43l76l92l2J046K498L383
52462B58510L228K706K730L051K580J074m32j062j146j360j616j518j319j579
52448B63847k180k479k252j892j649j353r58p89j074j557j729j343o15j8J73K06
52432B44338M91R56J093P76N52P78J007P65M61Q35J787K478K487K199K080K249
52416B65332K827M031N753P439Q601R088Q870P947O453M505K009r54l622n074
52402C23205n295n216n530n932n707m651l251k227j978k200k097j278k86J77K51
52387B77985N85J136J187N48l5J08Q05J564K169K579K852L345M344N334N389M582
$$ y = [250260, 248318, 246542, 245474, 244881, 244135, 243218, 242801, 243242, 243986, 244213, 243762, 243147, 242866, 243082, 243801, 244969, 246377, 247810, 249351, 251229, 253261, 254743, 255100, 254479, 253546, 252826, 252383, 252007, 251615, 251583, 252629, 255127, 258510, 261738, 264444, 267174, 270225, 272805, 273879, 273447, 272385, 271239, 269879, 268263, 266745, 265426, 263847, 261667, 259188, 256936, 255044, 253395, 252042, 251084, 250295, 249221, 247664, 245935, 244592, 243977, 243959, 244132, 244338, 244829, 245785, 246878, 247654, 248206, 248984, 249991, 250756, 251217, 252052, 253839, 256317, 258804, 261003, 263083, 265332, 268159, 272190, 277943, 285382, 293983, 303071, 311941, 319888, 326341, 330846, 332855, 331901, 328279, 323205, 317910, 312694, 307164, 301232, 295525, 290874, 287623, 285396, 283418, 281218, 279121, 277843, 277557, 277734, 277985, 278570, 279706, 280893, 281441, 281406, 281514, 282319, 283883, 286052, 288631, 291483, 294828, 299172, 304506, 309895, 314477]
52371C14477M061M349M562L927L120L166L735L645K621J464O84P2m55n32k5O76
52355C49547J266J782K237K553K959L819M943N633N616N448N806O809Q199R695
52341D16312J0933J1571J1741J2078J2988J4197J5256J6174J7194J8209J8854
52330E75507J9050J9123J9324J9523J9535J9506J9732K0138K0158J9281J7583
52319G88460J5544J3387J0987Q453O406N302M764L996K713J263j13j583l212m559
52305H51808n147n039m729m544m388l988l232k357j846k013k553k768k367j869
52291H04968j856k003j308O78L286N635P609R526J1208J2117J2329J2578J3129
52278H87896J3326J2811J2389J2915J3726J3251J1125Q675P089O097M801L013
$$ y = [314477, 318538, 322887, 327449, 331376, 334496, 337662, 341397, 345042, 347663, 349127, 349811, 349883, 349428, 348896, 348871, 349547, 350813, 352595, 354832, 357385, 360344, 364163, 369106, 374739, 380355, 385803, 391609, 398418, 406617, 416312, 427245, 438816, 450557, 462635, 475623, 489820, 505076, 521250, 538444, 556653, 575507, 594557, 613680, 633004, 652527, 672062, 691568, 711300, 731438, 751596, 770877, 788460, 804004, 817391, 828378, 836831, 843237, 848539, 853303, 857299, 860012, 861275, 861162, 859579, 856367, 851808, 846661, 841622, 836893, 832349, 827961, 823973, 820741, 818384, 816538, 814525, 811972, 809204, 806837, 804968, 803112, 801109, 799801, 800479, 803765, 809400, 817009, 826535, 837743, 849860, 862189, 874767, 887896, 901222, 914033, 926422, 939337, 953063, 966314, 977439, 986114, 993203, 999300, 1004101, 1007114]
52266A007114J136n83k000k804k991l203l989n038n817o486p407q125p941p254
52252I44612p237q025q448p916p406p897q753q719p818p149p084o839n957n152
52238H40212n112n233m262j991L43J405J117N25N55J199J844K100K167K483L199
52223H40551M074M781N247N692O302O899P079O801O576O831P174O737N353L979
52209I24076L636M174M520M059L293L012L206L173K584J946J885K330K702K722
52195I67318K578K444K238K046K182K620K662J708P4j355k165k686l308m100n036
52180I67220o109p027p257o629n533m409l339k329j592j205q58k61M01Q03J008
52165I22884J361J958K576L064L449L764M057M461M959N132M548L464K745K953
$$ y = [1007114, 1008250, 1007667, 1005667, 1002863, 999872, 996669, 992680, 987642, 981825, 975339, 967932, 959807, 951866, 944612, 937375, 929350, 920902, 912986, 905580, 897683, 888930, 880211, 872393, 865244, 858160, 851321, 845364, 840212, 835100, 829867, 825605, 823614, 823957, 825362, 826479, 827004, 827559, 828758, 830602, 832702, 834869, 837352, 840551, 844625, 849406, 854653, 860345, 866647, 873546, 880625, 887426, 894002, 900833, 908007, 914744, 920097, 924076, 927712, 931886, 936406, 940465, 943758, 946770, 949976, 953149, 955733, 957679, 959564, 961894, 964596, 967318, 969896, 972340, 974578, 976624, 978806, 981426, 984088, 985796, 985870, 984515, 982350, 979664, 976356, 972256, 967220, 961111, 954084, 946827, 940198, 934665, 930256, 926917, 924588, 922996, 921791, 920933, 920672, 921073, 921876, 922884, 924245, 926203, 928779, 931843, 935292, 939056, 943113, 947574, 952533, 957665, 962213, 965677, 968422, 971375]
52151I71375L791M580N003N229N504N893O361O890P493Q208R052R887J0414J0467
52137A070147J0320J0591J1635J3115J4316J4916J5299J5973J6940J7780J8299
52126A229331J8658J8966J9026J8706J8117J7319J6124J4438J2570J0888R341
52115A403484P595N490L051L09k576n105o820p893q933j0244j1483j2104j1778
52102A342993j0490q562o629n195m153l110k105j567j466j170m20J63K2l55k3
52087A297933J139K454L643N257P683J0328J2180J2923J3082J3276J3652J4030
52075A407580J4232J4108J3500J2408J1137J0002Q882P297N053K539J61k209m832
52062A499858p431r412j0745j1983j3337j4376j4919j5561j6863j8481j9729k0542
$$ y = [971375, 975166, 979746, 984749, 989978, 995482, 1001375, 1007736, 1014626, 1022119, 1030327, 1039379, 1049266, 1059680, 1070147, 1080467, 1091058, 1102693, 1115808, 1130124, 1145040, 1160339, 1176312, 1193252, 1211032, 1229331, 1247989, 1266955, 1285981, 1304687, 1322804, 1340123, 1356247, 1370685, 1383255, 1394143, 1403484, 1411079, 1416569, 1419620, 1419929, 1417353, 1412248, 1405428, 1397535, 1388602, 1378358, 1366875, 1354771, 1342993, 1332503, 1323941, 1317312, 1312117, 1307964, 1304854, 1302749, 1301182, 1299716, 1298546, 1298126, 1298289, 1298311, 1297956, 1297933, 1299072, 1301526, 1305169, 1310426, 1318109, 1328437, 1340617, 1353540, 1366622, 1379898, 1393550, 1407580, 1421812, 1435920, 1449420, 1461828, 1472965, 1482967, 1491849, 1499146, 1504199, 1506738, 1506899, 1504690, 1499858, 1492427, 1483015, 1472270, 1460287, 1446950, 1432574, 1417655, 1402094, 1385231, 1366750, 1347021, 1326479]
52050A326479k1281k1826k1678k0804j9773j9017j8603j8618j9017j9019j7469
52039A109374j4156j0246p013m739l133k196k033k268k319k135k106k381k756
52026A051893l193l947n169o628p910q665q757q490q520r200j0052j0285r791
52013I51286r278r435j0310j1532j2672j3290j3058j2170j1396j1392j2082j2848
52001H11823j3199j3088j2732j2326j1935j1476j0825j0010r246q696q232p562
51989F82496o624n788n623o332p391p908p521o860o872p719q685r207r554j0200
51975E76212j0832j0554r025o918n072l579k022l18J107K003K705L684M874N715
51961E47980N755N009L749K155L50j391k706l448l841m222m673m932m689l851
$$ y = [1326479, 1305198, 1283372, 1261694, 1240890, 1221117, 1202100, 1183497, 1164879, 1145862, 1126843, 1109374, 1095218, 1084972, 1077959, 1073220, 1070087, 1067891, 1065858, 1063590, 1061271, 1059136, 1057030, 1054649, 1051893, 1048700, 1044753, 1039584, 1032956, 1025046, 1016381, 1007624, 999134, 990614, 981414, 971362, 961077, 951286, 942008, 932573, 922263, 910731, 898059, 884769, 871711, 859541, 848145, 836753, 824671, 811823, 798624, 785536, 772804, 760478, 748543, 737067, 726242, 716232, 706986, 698290, 690058, 682496, 675872, 670084, 664461, 658129, 650738, 642830, 635309, 628449, 621577, 613858, 605173, 595966, 586412, 576212, 565380, 554826, 545801, 538883, 533811, 530232, 528210, 527892, 528999, 531002, 533707, 537391, 542265, 547980, 553735, 558744, 562493, 564648, 564998, 563607, 560901, 557453, 553612, 549390, 544717, 539785, 535096, 531245]
51947E31245k546r52P26K239L484M676O117P707Q963R599R831R820R193P508M978
51932F12588K269l08k893n338p158q283r276j0393j1078j0872j0360j0453j1056
51919E17389j1199j0412r220q198p274o212n170m291l192j383R66L100M463N219
51905D64586N962P150Q757J0351J1502J2184J2666J3043J3054J2471J1460J0337
51893E93523R102P365M674Q71l663p938j0863j2126j2465j2661j2487j1102q448
51880E23782n565l342j507O57L044M848N691N949N835M945L047P59j126k652m428
51865E39937o479q050q668q794r020r101q257o348m239k857k220j654q03j03j31
51850D63213p68j304j317j106j161j562k153k940l860m429m166l349k767k619
$$ y = [531245, 528699, 527747, 528473, 530712, 534196, 538872, 544989, 552696, 561659, 571258, 581089, 590909, 600102, 607610, 612588, 614857, 614549, 611656, 606318, 599160, 590877, 581601, 571208, 560130, 549258, 538898, 528445, 517389, 506190, 495778, 486558, 478360, 471086, 464874, 459704, 455413, 452221, 450838, 451804, 454904, 459367, 464586, 470548, 477698, 486455, 496806, 508308, 520492, 533158, 546201, 559255, 571726, 583186, 593523, 602625, 609990, 614664, 615535, 611872, 603934, 593071, 580945, 568480, 555819, 543332, 532230, 523782, 518217, 514875, 513368, 514025, 517069, 521917, 527608, 533557, 539392, 544337, 547384, 548143, 547017, 544365, 539937, 533458, 525408, 516740, 507946, 498926, 489825, 481568, 475220, 470981, 468124, 465904, 464250, 463447, 463344, 463213, 462445, 461141, 459824, 458718, 457557, 455995, 453842, 450902, 447042, 442613, 438447, 435098, 432331, 429712]
51836D29712k247j205k8M21lp58j302j401j001l19P4k56j093j840k235k409k401
51819D11709k010j213l45K61O42J114J904K836L350K962J830O16k97j174k328
51804D19857l517m266m453m216l603k786k298k458k762k497j797j412j496j406
51790C80890p90j02K09L83Q34J448J770J543P49m39j508j800j226m67j35K8P00
51773C82087K005L360M203M578M931N515O096O287O105N996O066N612L864J059
51759D47764j699l648m931n957o819p439p705p323o124m678l882l754l296j935
51745C78574l27P66J707L274N326O966P756P950P703O887N686M722M410M578M708
51730D50686M265K992J257p0o04j061k363m302n751o072n668n131m598m067l719
$$ y = [429712, 427465, 426260, 426232, 426653, 426650, 425892, 424590, 423189, 422188, 421869, 421943, 421687, 420594, 418754, 416519, 414110, 411709, 409699, 408486, 408141, 408402, 409044, 410158, 412062, 414898, 418248, 421210, 423040, 423656, 423359, 422185, 419857, 416340, 412074, 407621, 403405, 399802, 397016, 394718, 392260, 389498, 387001, 385204, 383792, 382296, 380890, 380100, 379998, 380207, 380590, 381424, 382872, 384642, 386185, 386934, 386495, 384987, 383187, 381961, 381494, 381359, 381387, 382087, 384092, 387452, 391655, 396233, 401164, 406679, 412775, 419062, 425167, 431163, 437229, 442841, 446705, 447764, 446065, 442417, 437486, 431529, 424710, 417271, 409566, 402243, 396119, 391441, 387559, 383805, 380509, 378574, 378247, 379013, 380720, 383994, 389320, 396286, 404042, 411992, 419695, 426582, 432268, 436990, 441400, 445978, 450686, 454951, 457943, 459200, 459130, 458526, 457465, 455102, 450800, 445049, 438977, 433309, 428178, 423580, 419513, 415794]
51715D15794l564l300k762k168j716j216m20O49J856L091M064M360L946L332K909
51700D24855K442J577O19L39J011K033K662K744K525J988Q14r43k617l629m172
51685D32248m778n348n208m234l213k759k388j292M12J835K553K986L503L842
51671D18159L645L028K370J879J610J607J680J387N75j61P4J518L470M902N257
51656D51000M609L312J715J87q71j386j871k990m742o295o842o403n669n235n276
51641D13243n692o223o448o051n149m149l273k415j427l38P10J529J896J707J179
51626C79099P75P98J083J050J83j395k813l198k612j952j846k000j837j394j128
51611C62813j139j044n64K29J147K032K759L397M318N811P594Q926R162Q063N906
$$ y = [415794, 412230, 408930, 406168, 404000, 402284, 401068, 400648, 401297, 403153, 406244, 410308, 414668, 418614, 421946, 424855, 427297, 428874, 429493, 429832, 430843, 432876, 435538, 438282, 440807, 442795, 443609, 442666, 440049, 436420, 432248, 427470, 422122, 416914, 412680, 409467, 406708, 404320, 403028, 403440, 405275, 407828, 410814, 414317, 418159, 421804, 424832, 427202, 429081, 430691, 432298, 433978, 435365, 435940, 435779, 435853, 437371, 440841, 445743, 451000, 455609, 458921, 460636, 460823, 459952, 458566, 456695, 453705, 448963, 442668, 435826, 429423, 423754, 418519, 413243, 407551, 401328, 394880, 388829, 383680, 379531, 376258, 373843, 372416, 372078, 372788, 374317, 376213, 377920, 379099, 379874, 380672, 381755, 382805, 382988, 381593, 378780, 375582, 372970, 371018, 369172, 367172, 365335, 363941, 362813, 361674, 360630, 360066, 360295, 361442, 363474, 366233, 369630, 373948, 379759, 387353, 396279, 405441, 413504, 419410]
51596D19410L492J773J040O96Q3p70j527k204k863l045k251o85J069K899M938
51581D22055O769P837Q535R853J1838J3399J3936J4210J5100J6385J7317J7664
51569E74898J7554J6866J5572J4399J4475J6384J9864K4209K8717L2952L6761
51558H12651L9858M1338M0193L6494L1452K5925J9466J1339J885p694j6478k4070
51546A012359l0105l4302l6973l8748l9822l9933l9085l7708l6097l4137l1675
51535F13774k8812k5725k2535j9382j6438j3765j1389r505q309p649p054o244
51523D36967n339m605m079l621l167k861k908l271l650l728l442k882k118j340
51509C89956r49j182j611j500p20J04M10K92J53K41O49J348K042K411K694L411
$$ y = [419410, 422902, 424675, 425715, 426411, 426494, 425724, 424197, 421993, 419130, 416085, 413834, 413149, 414218, 417117, 422055, 428824, 436661, 445196, 455049, 466887, 480286, 494222, 508432, 523532, 539917, 557234, 574898, 592452, 609318, 624890, 639289, 653764, 670148, 690012, 714221, 742938, 775890, 812651, 852509, 893847, 934040, 970534, 1001986, 1027911, 1047377, 1058716, 1060601, 1052907, 1036429, 1012359, 982254, 947952, 910979, 872231, 832409, 792476, 753391, 715683, 679586, 645449, 613774, 584962, 559237, 536702, 517320, 500882, 487117, 475728, 466223, 457914, 450265, 443211, 436967, 431628, 427023, 422944, 419323, 416156, 413295, 410387, 407116, 403466, 399738, 396296, 393414, 391296, 389956, 389007, 387825, 386214, 384714, 383994, 384098, 384508, 384800, 384953, 385194, 385843, 387191, 389233, 391644, 394338, 397749]
51493C97749M347M464L285J717R12Q28O22n0r01j843l065m316n001n059n072n353
51477C83264n507n152m561m306m572m997n004m248k961j835j351j286j121p05
51463C35658k20K82Q11J119R87Q15J290K377L242L325K979K876L241L891M636
51448C67309N404O274P566R485J1478J2389J1589R672P752O336N201M065K945
51435D67465J924R23k47j739l543n319o518o856o710o833p592q517q663p535n627
51420C94613m013l272l024k566j800j151q04m90j09L2j97l87j92P9j09n65m78
51403C75567N45J920K782K998L230M090N491O863P809Q415Q995R790J0906J2372
51389D61773J4080J5834J7642J9864K2867K6529L0329L3978L7734M1943M6352
$$ y = [397749, 402096, 406560, 409845, 411562, 412474, 413302, 413924, 413874, 412973, 411130, 408065, 403749, 398748, 393689, 388617, 383264, 377757, 372605, 368044, 363738, 359166, 354169, 349165, 344917, 341956, 340121, 338770, 337484, 336363, 335658, 335438, 335720, 336531, 337650, 338637, 339452, 340742, 343119, 346361, 349686, 352665, 355541, 358782, 362673, 367309, 372713, 378987, 386553, 396038, 407516, 419905, 431494, 441166, 448918, 455254, 460455, 464520, 467465, 469389, 470312, 470065, 468326, 464783, 459464, 452946, 446090, 439380, 432547, 424955, 416438, 407775, 400240, 394613, 390600, 387328, 384304, 381738, 379938, 378787, 377983, 377493, 377384, 377416, 377219, 376832, 376640, 376719, 376610, 376045, 375567, 376112, 378032, 380814, 383812, 387042, 391132, 396623, 403486, 411295, 419710, 428705, 438495, 449401, 461773, 475853, 491687, 509329, 529193, 552060, 578589, 608918, 642896, 680630, 722573, 768925]
51378G68925N0071N2181N2376N0947M8250M4262L8644L1221K2238J2278K006p980
51366A165419j7387k6306l4814m2393m8065n1358n2811n3212n2658n0696m7275
51355F88444m2968l8335l3566k8803k4390k0614j7534j5083j3135j1395r670q189
51343D24762p261o574n401l748k646k903l993m711m581l993l272k376j505j188
51329C70610j505j837j774j745k282l015l088k380j672j465j346q34l22n36j321
51314C45488j691j178m92n47j252j766j633j143o35RR78K080K907L250L117K553
51298C50045J736J123J119J502J515P27k92n09M50J875K823L060K973K800K346
51283C73293J527P46M54N53N20N6o46j271j741k168k540k621k138j058K50J188
$$ y = [768925, 818996, 871177, 923553, 974500, 1022750, 1067012, 1105656, 1136877, 1159115, 1171393, 1173399, 1165419, 1148032, 1121726, 1086912, 1044519, 996454, 945096, 892285, 839073, 786415, 735719, 688444, 645476, 607141, 573575, 544772, 520382, 499768, 482234, 467151, 454016, 442621, 432951, 424762, 417501, 410927, 405526, 401778, 399132, 396229, 392236, 387525, 382944, 378951, 375679, 373303, 371798, 370610, 369105, 367268, 365494, 363749, 361467, 358452, 355364, 352984, 351312, 349847, 348501, 347667, 347345, 346809, 345488, 343797, 342619, 342127, 341580, 340328, 338562, 336929, 335786, 335151, 335160, 336138, 338218, 341125, 344375, 347492, 350045, 351781, 352904, 354023, 355525, 357040, 357767, 357475, 356966, 357416, 359291, 362114, 365174, 368147, 370947, 373293, 374820, 375566, 376020, 376573, 377093, 377149, 376503, 375232, 373491, 371323, 368783, 366162, 364024, 362966, 363216, 364404]
51267C64404J350Q82L70L21O82Q86M75l83j081j324j419j744k155k247j985j628
51251C55404j211n37K74P59P60O21N73L82j05n42n77l93l93o11q40r68q49k32
51233C51515P45J277P68k27n66P6R92J563J884K170K179J580M84o42j374j472
51217C60952r34j21L88K88k06o38p43o05m40l03l9L78N47J18l85J02J664K898
51199C62921K628J524J091J457J413N55M3P83K011K421J827R83L24k94r50j460
51183C77277j692j584j070k68M50Q89J182J317R25n6j036j436j403j283j009m70
51167C70733m0m5q3M09J164J469J298J246J424J316P54K13oj27k85k97k58o12
51149C78273j298j620j290r39j054j174p41j55j30m64l57K85P81Q09P99J067J388
$$ y = [364404, 365754, 366636, 367006, 367327, 368009, 368895, 369370, 368987, 367906, 366582, 365163, 363419, 361264, 359017, 357032, 355404, 354193, 353656, 353930, 354689, 355449, 356070, 356643, 357025, 356920, 356378, 355801, 355408, 355015, 354404, 353564, 352596, 351747, 351515, 352260, 353537, 354305, 354078, 353512, 353588, 354580, 356143, 358027, 360197, 362376, 363956, 364440, 363798, 362424, 360952, 360018, 359897, 360285, 360573, 360367, 359729, 358986, 358381, 357941, 357638, 357599, 357977, 358524, 358642, 358257, 358359, 360023, 362921, 365549, 367073, 368164, 369621, 371034, 371589, 371632, 372415, 374426, 376847, 378674, 379657, 379981, 379687, 378737, 377277, 375585, 374001, 372931, 372663, 373113, 374002, 375184, 376501, 377426, 377370, 376334, 374898, 373495, 372212, 371203, 370733, 370693, 370648, 370565, 370974, 372138, 373607, 374905, 376151, 377575, 378891, 379645, 379858, 379852, 379725, 379440, 379143, 378885, 378273, 376975, 375355, 374065, 373126, 372072, 370898, 370157, 370002, 369872, 369408, 369051, 369336, 370117, 370926, 371725, 372792, 374180]
51132C74180J609J969K406K278J258j2o79p51p77q31n10J36M56J41k95k42K41
51115C80577P63J280J938K457K300J509R12J140J780J880J248P77J308K503L228
51100D05600K902K096J680J853K173K274K158J967J796J631J294M98o87j649j873
51085D23713j595j409j361j052n36l96p57r35m18L39O26M04J43J20L91J061K011
51068D20349K736L024L520M912O834Q236Q673Q547Q243P781P372P456P996Q454
51054E14133Q685R267J0588J2181J3317J3831J3997J3836J3026J1218Q315M604
51042F46998Q20k131l808m529n054o061p844j0170j2434j4148j5301j6018j6091
51029E34229j5260j3767j2088j0190p714m870k457q56L04J322K019K424L071M192
$$ y = [374180, 375789, 377758, 380164, 382442, 383700, 383688, 383009, 382258, 381481, 380650, 380140, 380276, 380732, 380873, 380578, 380336, 380577, 381340, 382620, 384558, 387015, 389315, 390824, 391736, 392876, 394656, 396536, 397784, 398561, 399869, 402372, 405600, 408502, 410598, 412278, 414131, 416304, 418578, 420736, 422703, 424499, 426130, 427424, 427922, 427235, 425586, 423713, 422118, 420709, 419348, 418296, 417760, 417364, 416607, 415672, 415254, 415593, 416219, 416623, 416766, 416886, 417277, 418338, 420349, 423085, 426109, 429629, 434541, 441375, 449611, 458284, 466831, 475074, 482855, 490227, 497683, 505679, 514133, 522818, 532085, 542673, 554854, 568171, 582002, 595999, 609835, 622861, 634079, 642394, 646998, 647818, 645687, 641879, 637350, 632296, 626235, 618391, 608221, 595787, 581639, 566338, 550320, 534229, 518969, 505202, 493114, 482924, 475210, 470340, 467883, 467027, 467331, 468653, 470672, 473096, 476167, 480359]
51015D80359N248N772O085O670P383P891Q381R160R938J0289J0529J1401J3038
51002E92144J4819J6254J7364J8210J8609J8405J7717J6779J5713J4490J2971
50991G73475J1206R668Q844Q413P419N532L567K215R99p50k469l005k365j620
50977H21129r82P82M608R732J4639J8708K2374K6229L0546L5362M0316M4693M8013
50964A116149N0551N2885N5079N6708N7511N7612N7065N5679N3342N0231M6563
50953A709375M2326L7446L2092K6692K1732J7626J4593J2341R925O277J243m127
50941A927541q526j1585j3794j5498j6477j6708j6881j7737j9191k0677k2155
50930A748312k4242k7280l0807l4128l7064l9863m2497m4447m5260m5138m4760
$$ y = [480359, 485607, 491379, 497464, 504134, 511517, 519408, 527789, 536949, 546887, 557176, 567705, 579106, 592144, 606963, 623217, 640581, 658791, 677400, 695805, 713522, 730301, 746014, 760504, 773475, 784681, 794349, 803193, 811606, 819025, 824557, 828124, 830339, 831338, 830588, 828119, 825114, 822749, 821129, 820147, 820929, 825537, 835269, 849908, 868616, 890990, 917219, 947765, 983127, 1023443, 1068136, 1116149, 1166700, 1219585, 1274664, 1331372, 1388883, 1446495, 1503560, 1559239, 1612581, 1662812, 1709375, 1751701, 1789147, 1821239, 1847931, 1869663, 1887289, 1901882, 1914223, 1924148, 1930425, 1931668, 1927541, 1919015, 1907430, 1893636, 1878138, 1861661, 1844953, 1828072, 1810335, 1791144, 1770467, 1748312, 1724070, 1696790, 1665983, 1631855, 1594791, 1554928, 1512431, 1467984, 1422724, 1377586, 1332826]
50919A332826m4488m3926m2433l9971l7170l4573l2158k9657k7055k4446k1766
50908I55183j8978j6416j4580j3545j2860j2071j1156j0365r747q989p739o044
50896H12693m362l084k209j588j257j311j535j583j410j160p16J56J226J938K258
50881G98056K778L800M946N914O908P936Q365P891P361P942R738J1929J3920J5683
50867I13167J7179J8280J9322K1039K3814K7327L1020L4615L8233M2282M7165
50856A233443N2876N9052O5525P2517Q0049Q7710R5224J02630J09486J14791J18414
50845B191717J21787J26028J29969J31238J28922J23804J16342J06086R3189P8946
50835C348028O4285M9023L3204J7993M564o855j6250k3044k6881k8222k7495k4501
$$ y = [1332826, 1288338, 1244412, 1201979, 1162008, 1124838, 1090265, 1058107, 1028450, 1001395, 976949, 955183, 936205, 919789, 905209, 891664, 878804, 866733, 855577, 845212, 835465, 826476, 818737, 812693, 808331, 805247, 803038, 801450, 800193, 798882, 797347, 795764, 794354, 793194, 792478, 792634, 793860, 795798, 798056, 800834, 804634, 809580, 815494, 822402, 830338, 838703, 846594, 853955, 861897, 871635, 883564, 897484, 913167, 930346, 948626, 967948, 988987, 1012801, 1040128, 1071148, 1105763, 1143996, 1186278, 1233443, 1286319, 1345371, 1410896, 1483413, 1563462, 1651172, 1746396, 1849026, 1958512, 2073303, 2191717, 2313504, 2439532, 2569501, 2700739, 2829661, 2953465, 3069807, 3175893, 3269082, 3348028, 3412313, 3461336, 3494540, 3512533, 3517097, 3510242, 3493992, 3470948, 3444067, 3415845, 3388350, 3363849]
50823C363849j9593j4475j0700q091n924n075p561j3989k2830l2450m2617n3675
50811C126869o5228p6351q6420r5110j01944j06473j08719j08987j07286j03334
50801B167017r7141q9300q0605p1531o2191n2662m3203l4113k5568j7727j0815
50790A582161n000k49L468O010P321P754P631O654M332J070j844l679n122p295
50776A603212j0290j3336j5967j8400k0859k3244k5544k7957l0388l2267l3153
50765A351807l3252l3049l2701l2008l0852k9298k7326k4752k1515j7959j4638
50754A054457j1940r834p900n606k746L08K897M912P096J0179J3863J7195J9925
50741A092806K2864K6711L1225L5947M0994M6416N1416N5218N8359O2079O6431
$$ y = [3363849, 3344256, 3329781, 3319081, 3310990, 3305066, 3299991, 3292430, 3278441, 3255611, 3223161, 3180544, 3126869, 3061641, 2985290, 2898870, 2803760, 2701816, 2595343, 2486624, 2377637, 2270351, 2167017, 2069876, 1980576, 1899971, 1828440, 1766249, 1713587, 1670384, 1636271, 1610703, 1592976, 1582161, 1577161, 1576912, 1580380, 1586390, 1593711, 1601465, 1609096, 1615750, 1620082, 1621152, 1619308, 1615629, 1610507, 1603212, 1592922, 1579586, 1563619, 1545219, 1524360, 1501116, 1475572, 1447615, 1417227, 1384960, 1351807, 1318555, 1285506, 1252805, 1220797, 1189945, 1160647, 1133321, 1108569, 1087054, 1069095, 1054457, 1042517, 1032683, 1024783, 1019177, 1016431, 1016739, 1019636, 1024548, 1031644, 1041823, 1055686, 1072881, 1092806, 1115670, 1142381, 1173606, 1209553, 1250547, 1296963, 1348379, 1403597, 1461956, 1524035, 1590466]
50730A590466P0036P1908P2557P2946P3146P2499P0351O6236N9915N1752M2624
50719B314436L2980K2550J1323K43r612j7984k4968l0079l2548l2294k9932k6026
50707B178089k0967j5468j0433o256k764R5J844J802m87n131j1815j9835k8355
50694B060319l6600m3786m9199n2606n4285n4365n2549m8875m4179l9188l3548
50683A551139k6529j8415j0279k491N600J4317K2997L0997L8453M5481N1323N5106
50671A757699N7034N7966N7993N6171N1848M5706L9219L3464K8586K4219K0088
50660B229993J6281J3056J0357P609M155N5l802o491p920q663r082q896p652n325
50646B223675k304J033M565Q347J2497J7009K1625K5888K9429L2041L3584L4117
$$ y = [1590466, 1660502, 1732410, 1804967, 1877913, 1951059, 2023558, 2093909, 2160145, 2220060, 2271812, 2314436, 2347416, 2369966, 2381289, 2381532, 2371920, 2353936, 2328968, 2298889, 2266341, 2234047, 2204115, 2178089, 2157122, 2141654, 2131221, 2124965, 2122201, 2122296, 2124140, 2125942, 2125455, 2120324, 2108509, 2088674, 2060319, 2023719, 1979933, 1930734, 1878128, 1823843, 1769478, 1716929, 1668054, 1623875, 1584687, 1551139, 1524610, 1506195, 1495916, 1493425, 1499025, 1513342, 1536339, 1567336, 1605789, 1651270, 1702593, 1757699, 1814733, 1872699, 1930692, 1986863, 2038711, 2084417, 2123636, 2157100, 2185686, 2209905, 2229993, 2246274, 2259330, 2269687, 2277296, 2281451, 2281506, 2277704, 2271213, 2263293, 2254630, 2245548, 2236652, 2229000, 2223675, 2221371, 2222404, 2226969, 2235316, 2247813, 2264822, 2286447, 2312335, 2341764, 2373805, 2407389, 2441506]
50634B441506L4235L4762L5815L6444L5440L1958K4982J3180l467k2196l8933
50623B623726n1470o0312o6398o9339o8400o3906n6766m7537l6975k6738j8383
50612B057502j1926o417j618J851L690M064K711r32o543j2930j9578k7067l5507
50599A947300m3502m9490n3455n6360n8377n8699n7121n4711n2513n0221m6750
50588A366101m1880l6685l2300k8746k5229k1302j7315j3840j1109r058p583o527
50576A114527n643m697l603k399j246l52M03J681M041P043R563J1257J3156J6357
50562A160088K0649K4956K8863L2924L7609M2582M7128N0760N3232N4397N4258
50551A607446N2966N0636M7404M3792M0765L9111L8729L8730L8432L8189L9022
$$ y = [2441506, 2475741, 2510503, 2546318, 2582762, 2618202, 2650160, 2675142, 2688322, 2684855, 2662659, 2623726, 2572256, 2511944, 2445546, 2376207, 2307807, 2243901, 2187135, 2139598, 2102623, 2075885, 2057502, 2045576, 2039159, 2037541, 2039392, 2043082, 2047146, 2049857, 2048925, 2042382, 2029452, 2009874, 1982807, 1947300, 1903798, 1854308, 1800853, 1744493, 1686116, 1627417, 1570296, 1515585, 1463072, 1412851, 1366101, 1324221, 1287536, 1255236, 1226490, 1201261, 1179959, 1162644, 1148804, 1137695, 1128637, 1121054, 1114527, 1108884, 1104187, 1100584, 1098185, 1096939, 1096587, 1096990, 1098671, 1102712, 1109755, 1119318, 1130575, 1143731, 1160088, 1180737, 1205693, 1234556, 1267480, 1305089, 1347671, 1394799, 1445559, 1498791, 1553188, 1607446, 1660412, 1711048, 1758452, 1802244, 1843009, 1882120, 1920849, 1959579, 1998011, 2036200, 2075222]
50540B075222M1369M4554M7734N0943N4668N8754O2539O6021O9997P4853Q0099
50529B726753Q5303R0554R5556R9285J01255J02122J02233J00397R5233Q7052
50519C685743P7183O5937N2626L7256K0746L437j5130l4647n3390o9692q3064
50508C687005r3568j01088j05768j08146j08160j04688r6925q5690p2712n9014
50498B751246m4653k9650j4491J75J3656K5071L3445L8038L8434L4415K6032J3833
50486B885551j140j7655l4638n1352o7143q1018r1777r8919j03102j05276j05599
50475B127932j03735j00006r5402r0397q4662p8119p1558o5771o0702n5869n1058
50464A270653m6195m1022l5460k9993k5224k1282j7908j4925j2265r943q133p009
$$ y = [2075222, 2116591, 2161145, 2208879, 2259822, 2314490, 2373244, 2435783, 2501804, 2571801, 2646654, 2726753, 2812056, 2902610, 2998166, 3097451, 3198706, 3300828, 3403061, 3503458, 3598691, 3685743, 3762926, 3828863, 3881489, 3918745, 3939491, 3942928, 3927798, 3893151, 3839761, 3770069, 3687005, 3593437, 3492349, 3386581, 3278435, 3170275, 3065587, 2968662, 2882972, 2810260, 2751246, 2706593, 2676943, 2662452, 2662627, 2676283, 2701354, 2734799, 2772837, 2811271, 2845686, 2871718, 2885551, 2884411, 2866756, 2832118, 2780766, 2713623, 2632605, 2540828, 2441909, 2338807, 2233531, 2127932, 2024197, 1924191, 1828789, 1738392, 1653730, 1575611, 1504053, 1438282, 1377580, 1321711, 1270653, 1224458, 1183436, 1147976, 1117983, 1092759, 1071477, 1053569, 1038644, 1026379, 1016436, 1008303, 1001294]
50452A001294o220m969k939p54Q71K055L383M927O198O932P360P677P687P147
50438A040649O301N898O605Q337J0252J1614J2660J4223J6571J8954K0523K1353
50426A193940K2274K3971K6446K9185L1649L3733L5866L8560M1876M5497M9169
50415A572166N2778N6071N8760O0850O2454O3320O3017O1565N9277N6036N1401
50404B217695M5573L9508L3671K7370J9603J0144n05j1620k2421l2299m1224m9496
50392B235999n6871o2580o6347o8593o9284o7514o2843n6283m9200m1888l3971
50381A600625k5576j7232r101j243N767J1189J4867J6871J6842J4448J0138M652
50369A642247j909r677j8046k5921l2728l8370m2532m4997m6327m7271m7600m6643
$$ y = [1001294, 995074, 990105, 987166, 986412, 987283, 989338, 992721, 997648, 1003846, 1010778, 1018138, 1025815, 1033502, 1040649, 1046950, 1052848, 1059453, 1067790, 1078042, 1089656, 1102316, 1116539, 1133110, 1152064, 1172587, 1193940, 1216214, 1240185, 1266631, 1295816, 1327465, 1361198, 1397064, 1435624, 1477500, 1522997, 1572166, 1624944, 1681015, 1739775, 1800625, 1863079, 1926399, 1989416, 2050981, 2110258, 2166294, 2217695, 2263268, 2302776, 2336447, 2363817, 2383420, 2393564, 2393059, 2381439, 2359018, 2326719, 2285495, 2235999, 2179128, 2116548, 2050201, 1981608, 1912324, 1844810, 1781967, 1725684, 1676484, 1634596, 1600625, 1575049, 1557817, 1548716, 1547473, 1553240, 1564429, 1579296, 1596167, 1613009, 1627457, 1637595, 1642247, 1640338, 1630661, 1612615, 1586694, 1553966, 1515596, 1473064, 1428067, 1381740, 1334469, 1286869, 1240226]
50357A240226m4739m3038m1810m0121l7537l4900l2948l1125k8384k4595k0608
50346H60421j7303j4966j3200j1309r065p031n686m549k915j231o29j041r68N24
50332G71052K739M669O249P670Q539Q665Q828R819J1327J2607J3502J3874J2742
50319H92282R316M580N73j857l468m820n346m547l065j780n73J294L882O332P868
50304I00671Q493Q691Q780Q778Q662Q481Q232P811P295P041P226P420O969N826
50290A010376M585L611K677J576O03J77N39K016M834P958Q948O065M12n020q469
50275A040888j0646j2924j5301j6709j6500j4919j2548r918p473n346l279j028
50263I14297J208L054M401N447O341P137P837Q303Q298P812P237O910O703O327
$$ y = [1240226, 1195487, 1152449, 1110639, 1070518, 1032981, 998081, 965133, 934008, 905624, 881029, 860421, 843118, 828152, 814952, 803643, 794578, 787547, 781861, 777312, 774397, 773166, 772537, 771496, 770528, 771052, 773791, 778460, 784709, 792379, 800918, 809583, 818411, 828230, 839557, 852164, 865666, 879540, 892282, 901598, 906178, 906751, 904894, 901426, 896606, 891260, 886713, 883648, 881868, 881295, 882589, 886471, 892803, 900671, 909164, 917855, 926635, 935413, 944075, 952556, 960788, 968599, 975894, 982935, 990161, 997581, 1004550, 1010376, 1014961, 1018572, 1021249, 1022825, 1023428, 1023605, 1024144, 1026160, 1030994, 1038952, 1047900, 1053965, 1054377, 1049357, 1040888, 1030242, 1017318, 1002017, 985308, 968808, 953889, 941341, 931423, 923950, 918604, 915325, 914297, 915505, 918559, 922960, 928407, 934748, 941885, 949722, 958025, 966323, 974135, 981372, 988282, 994985, 1001312]
50249A001312N822N490N466N752O455P618Q915J0008J1144J2901J5352J8002K0660
50236A134897K3735K7428L1252L4726L7967M0934M2640M1979L9272L6120L3623
50225A524573L1455K8988K6532K4908K4124K3048K0265J4974P276j985j1756k1468
50213A690934l1140m0591m8806n4529n7367n7893n6690n3872m9582m4448l9143
50202A156873l3887k8828k4719k2659k3031k4930k6864k7937k8305k8593k8948
50191H58172k8818k7571k5203k2376j9794j7720j6004j4397j2786j1204r754q455
50179F44090p206n940m741l690k671j612q51q21j215r29P19K933M172L968L490
50164F29696M129N878P619Q581R043R566J0182J0589J0745J0816J0793J0618J0553
$$ y = [1001312, 1007134, 1012624, 1018090, 1023842, 1030297, 1037915, 1046830, 1056838, 1067982, 1080883, 1096235, 1114237, 1134897, 1158632, 1186060, 1217312, 1252038, 1290005, 1330939, 1373579, 1415558, 1454830, 1490950, 1524573, 1556028, 1585016, 1611548, 1636456, 1660580, 1683628, 1703893, 1718867, 1726143, 1724158, 1712402, 1690934, 1659794, 1619203, 1570397, 1515868, 1458501, 1400608, 1343918, 1290046, 1240464, 1196016, 1156873, 1122986, 1094158, 1069439, 1046780, 1023749, 998819, 971955, 944018, 915713, 887120, 858172, 829354, 801783, 776580, 754204, 734410, 716690, 700686, 686289, 673503, 662299, 652545, 644090, 636884, 630944, 626203, 622513, 619842, 618230, 617379, 616558, 615343, 614414, 615133, 618066, 622238, 626206, 629696, 633825, 639703, 647322, 655903, 664946, 674512, 684694, 695283, 706028, 716844, 727637, 738255, 748808]
50151G48808J0870J1154J0499Q678O625N267M348L021J375M95R35J983K860L922
50137H20840N955Q699J0999J2360J3565J5494J7947K0061K1459K2534K3858K5775
50125A019546K8504L2207L6883M2393M8587N5231O1987O8686P5536Q2553Q8909
50114A641022R3264R4918R4279R2195Q9263Q6024Q3141Q0932P9051P6992P4519
50103B585600P1010O4868N4476L9907K2935N218j2901l1622n0394o7840q2540
50092B598717r3548j00587j04259j05663j05387j03011r8100r1381q4382p8025
50082A634374p2119o6248o0513n5203n0317m5808m1950l9034l6810l4635l2110
50071A099627k9276k6198k2795j9285j6411j4737j3809j2520j0434q280o895o114
$$ y = [748808, 759678, 770832, 781331, 790009, 796634, 801901, 806249, 809270, 810645, 811140, 812075, 814058, 816918, 820840, 826795, 835494, 846493, 858853, 872418, 887912, 905859, 925920, 947379, 969913, 993771, 1019546, 1048050, 1080257, 1117140, 1159533, 1208120, 1263351, 1325338, 1394024, 1469560, 1552113, 1641022, 1734286, 1829204, 1923483, 2015678, 2104941, 2190965, 2274106, 2355038, 2434089, 2511081, 2585600, 2656610, 2721478, 2775954, 2815861, 2838796, 2844014, 2831113, 2799491, 2749097, 2681257, 2598717, 2505169, 2404582, 2300323, 2194660, 2089273, 1986262, 1888162, 1796781, 1712399, 1634374, 1562255, 1496007, 1435494, 1380291, 1329974, 1284166, 1242216, 1203182, 1166372, 1131737, 1099627, 1070351, 1044153, 1021358, 1002073, 985662, 970925, 957116, 944596, 934162, 925882, 918987, 912873]
50059I12873n209m075l261k916k443j411j58Q08J472J995K233K115K003K121J966
50044I08113J005k78q09m31j79q17j814k150j678j137j061j240j264j058p74m54
50028H93974p8J19k12j011j611j413n39L20O78N22o3j025j980k160j157N92K344
50011H87300L818N126O294P386Q860J1301J4741J8691K2836K7319L2294L7592
49999A083558M2965M8354N3706N8631O2383O4246O4026O2195N9328N5409M9992
49988A704793M3268L6479L0904K6692K3121J9549J5519J0181K511p719j9708l2394
49976A853196m5026n6834o6813p4130p8599q0557q0431p8378p4248o8030o0530
49965A089620n3187m6806m0826l4479k8203k2997j8770j4477r861n833k843j32
$$ y = [912873, 907664, 903589, 900328, 897412, 894969, 893558, 893400, 894208, 895680, 897675, 899908, 902023, 904026, 906147, 908113, 909118, 908840, 908031, 907600, 907421, 906604, 904790, 902640, 900962, 899825, 898764, 897524, 896260, 895202, 894428, 893974, 893896, 894015, 893803, 892792, 891181, 889768, 889229, 889549, 890227, 890749, 890686, 889661, 887681, 885521, 884364, 884956, 887300, 891118, 896244, 902538, 909924, 918784, 930085, 944826, 963517, 986353, 1013672, 1045966, 1083558, 1126523, 1174877, 1228583, 1287214, 1349597, 1413843, 1477869, 1540064, 1599392, 1654801, 1704793, 1748061, 1784540, 1815444, 1842136, 1865257, 1884806, 1900325, 1910506, 1913017, 1905298, 1885590, 1853196, 1808170, 1751336, 1684523, 1610393, 1531794, 1451237, 1370806, 1292428, 1218180, 1150150, 1089620, 1036433, 989627, 948801, 914322, 886119, 863122, 844352, 829875, 820014, 814181, 811338, 811206]
49953H11206K839N373O641O920O827O167M486K236L48j021k408m043n737p578
49939H32256r885j2581j5268j7740j9775k0747k0293j9170j8481j8037j6603j3923
49927F29753j1388j0229r835q635o065k942k56J682K934L473L365L053L102L628
49913F01640M163M299M338N000O437P963Q983R791J0988J2433J3366J3450J3030
49900G15881J2416J1548J0469R443Q335O494L614K80k694n122p310r449j1523
49887G42382j3494j5159j6078j6031j5438j4920j4605j4203j3593j2906j2105
49876E83850j0948r447p947o651n377l910k342q73N06J919L378M743N896O787
49862E59584P470Q184R288J0908J2648J3839J4171J3959J3712J3460J2720J1102
$$ y = [811206, 814045, 819418, 826059, 832979, 839806, 845973, 850459, 852695, 853043, 852022, 849614, 845571, 839834, 832256, 822371, 809790, 794522, 776782, 757007, 736260, 715967, 696797, 678316, 660279, 643676, 629753, 618365, 608136, 598301, 589666, 583601, 580659, 580403, 582085, 585019, 588492, 591857, 594910, 598012, 601640, 605803, 610102, 614440, 619440, 625877, 633840, 642823, 652614, 663602, 676035, 689401, 702851, 715881, 728297, 739845, 750314, 759757, 768092, 774586, 778200, 778480, 775786, 770664, 763354, 753905, 742382, 728888, 713729, 697651, 681620, 666182, 651262, 636657, 622454, 608861, 595955, 583850, 572902, 563455, 555508, 548857, 543480, 539570, 537228, 536355, 536861, 538780, 542158, 546901, 552797, 559584, 567054, 575238, 584526, 595434, 608082, 621921, 636092, 650051, 663763, 677223, 689943, 701045]
49850G01045Q845O605M768L109J197j022l156m851o162p383q646r802j0639j1094
49836F62814j1160j0752r775q305o531m585k536n70J002K046K842L814N123O613
49822F30040Q078R461J0792J2069J3187J3814J3476J2039J0164Q941Q811R006
49810G59878Q378O570M182J840m16k761n023o856q209r311j0242j0851j1104j1177
$$ y = [701045, 709890, 716495, 721263, 724372, 725569, 724547, 721391, 716540, 710378, 702995, 694349, 684547, 673908, 662814, 651654, 640902, 631127, 622822, 616291, 611706, 609170, 608600, 609602, 611648, 614490, 618304, 623427, 630040, 638118, 647579, 658371, 670440, 683627, 697441, 710917, 722956, 733120, 742061, 750872, 759878, 768256, 774826, 779008, 780848, 780432, 777671, 772648, 765792, 757583, 748272, 738030, 727179, 716075, 704898]
$$ [...]
##END NTUPLES=NMR SPECTRUM
##END=
