##TITLE=AC1583_13IEXT2754_8214317_CFdQjpgJHK
##JCAMPDX= 6.0         $$ Bruker NMR JCAMP-DX V2.0
##DATA TYPE= NMR SPECTRUM
##DATA CLASS= NTUPLES
##ORIGIN= BRUKER
##OWNER= Administrator
$$ 1.72 TOPSPIN		Version 2.1
$$ 2013-10-12 20:13:07.698 -0700  Administrator@X
$$ Compression mode = diff/dup
##.OBSERVE FREQUENCY= 400.02188249412
##.OBSERVE NUCLEUS= ^1H
##.ACQUISITION MODE= SIMULTANEOUS (DQD)
##.ACQUISITION SCHEME= undefined
##.AVERAGES= 8
##.DIGITISER RES= 22
##SPECTROMETER/DATA SYSTEM= spect
##.PULSE SEQUENCE= zg30
##.SOLVENT NAME= COFFEE_meoh
##.SHIFT REFERENCE= INTERNAL, COFFEE_meoh, 1, 14.98509
##AUDIT TRAIL= $$ (NUMBER, WHEN, WHO, WHERE, PROCESS, VERSION, WHAT)
$$ ##TITLE= Audit trail, TOPSPIN		Version 2.1
$$ ##JCAMPDX= 5.01
$$ ##ORIGIN= Bruker BioSpin GmbH
$$ ##OWNER= Administrator
$$ $$ E:\/data/COFFEE/nmr/AC1583_13IEXT2754_8214317_CFdQjpgJHK/30/pdata/1/auditp.txt
$$ ##AUDIT TRAIL=  $$ (NUMBER, WHEN, WHO, WHERE, PROCESS, VERSION, WHAT)
(   1,<2013-10-12 20:13:00.589 -0700>,<Administrator>,<X>,<go>,<TOPSPIN 2.1>,
      <created by zg
	started at 2013-10-12 20:11:54.995 -0700,
	POWCHK enabled, PULCHK disabled,
       configuration hash MD5:
       C8 4E 4E 5D D3 5C D8 9E 9F 52 82 E0 59 8A DE 15
       data hash MD5: 64K
       EF BF A2 0E 0E B8 EC 78 25 E7 0C 05 E9 B4 5F A4>)
(   2,<2013-10-12 20:13:04.167 -0700>,<Administrator>,<X>,<proc1d>,<TOPSPIN 2.1>,
      <Start of raw data processing
       efp LB = 0 FT_mod = 6 PKNL = 1 PHC0 = 0 PHC1 = 0 SI = 32K 
       data hash MD5: 32K
       E4 98 F5 0E 35 D4 63 98 CC B4 F6 90 D6 9B 0C AE>)
(   3,<2013-10-12 20:13:04.464 -0700>,<Administrator>,<X>,<proc1d>,<TOPSPIN 2.1>,
      <pk PHC0 = 97.62451 PHC1 = 0 
       data hash MD5: 32K
       76 8A 80 C1 BC F2 FE 9A 16 DC AC 58 60 F1 6E 9D>)
(   4,<2013-10-12 20:13:04.557 -0700>,<Administrator>,<X>,<proc1d>,<TOPSPIN 2.1>,
      <abs ABSG = 1 
       data hash MD5: 32K
       DF 43 08 1F EC A2 02 83 A0 79 AD 3C C7 7F 23 1F>)
(   5,<2013-10-12 20:13:04.635 -0700>,<Administrator>,<X>,<proc1d>,<TOPSPIN 2.1>,
      <abs ABSG = 2 
       data hash MD5: 32K
       4A 02 59 1B 61 3B FA 12 1D 3E 64 65 25 CE 26 7E>)
(   6,<2013-10-12 20:13:04.682 -0700>,<Administrator>,<X>,<proc1d>,<TOPSPIN 2.1>,
      <abs ABSG = 3 
       data hash MD5: 32K
       D0 30 B2 6E 58 52 73 C8 8A 1E 4D 46 13 C8 22 4A>)
(   7,<2013-10-12 20:13:04.745 -0700>,<Administrator>,<X>,<proc1d>,<TOPSPIN 2.1>,
      <abs ABSG = 4 
       data hash MD5: 32K
       28 94 7C 60 95 53 7D E4 9A D9 F5 02 18 7A 8E 29>)
(   8,<2013-10-12 20:13:04.807 -0700>,<Administrator>,<X>,<proc1d>,<TOPSPIN 2.1>,
      <abs ABSG = 5 
       data hash MD5: 32K
       BC A9 40 B4 99 AC 58 45 DE C8 1F EB 67 C2 71 B7>)
$$ ##END=
$$ 
$$ $$ hash MD5
$$ $$ C8 F4 1B 0B FA 09 2B 66 7C A4 2A AE E5 1F AE 72
##$RELAX= 
##$RELAX= 
##$RELAX= 
##$RELAX= 
##$RELAX= 
##$RELAX= 
##$RELAX= 
$$ Bruker specific parameters
$$ --------------------------
##$DU= <E:\>
##$EXPNO= 30
##$NAME= <AC1583_13IEXT2754_8214317_CFdQjpgJHK>
$$ [...]
150 150 150 150 150 150 150 150
##$TP07= 0
##$TPNAME0= <>
##$TPNAME1= <>
##$TPNAME2= <>
##$TPNAME3= <>
##$TPNAME4= <>
##$TPNAME5= <>
##$TPNAME6= <>
##$TPNAME7= <>
##$TPOAL= (0..7)
0.5 0.5 0.5 0.5 0.5 0.5 0.5 0.5
##$TPOFFS= (0..7)
0 0 0 0 0 0 0 0
##$TUNHIN= 0
##$TUNHOUT= 0
##$TUNXOUT= 0
##$USERA1= <user>
##$USERA2= <user>
##$USERA3= <user>
##$USERA4= <user>
##$USERA5= <user>
##$V9= 5
##$VALIST= <valist>
##$VCLIST= <CCCCCCCCCCCCCCC>
##$VD= 0
##$VDLIST= <DDDDDDDDDDDDDDD>
##$VPLIST= <PPPPPPPPPPPPPPP>
##$VTLIST= <TTTTTTTTTTTTTTT>
##$WBST= 1024
##$WBSW= 4
##$XGAIN= (0..3)
0 0 0 0
##$XL= 0
##$YL= 0
##$YMAX_a= 630376
##$YMIN_a= -537365
##$ZGOPTNS= <>
##$ZL1= 120
##$ZL2= 120
##$ZL3= 120
##$ZL4= 120
##$ABSF1= 14.98509
##$ABSF2= -5.573092
##$ABSG= 5
##$ABSL= 3
##$ALPHA= 0
##$AQORDER= 0
##$ASSFAC= 0
##$ASSFACI= 0
##$ASSFACX= 0
##$ASSWID= 0
##$AUNMP= <proc_prof1d_extract_pilot.lims>
##$AXLEFT= 0
##$AXNAME= <>
##$AXNUC= <1H>
##$AXRIGHT= 0
##$AXTYPE= 0
##$AXUNIT= <>
##$AZFE= 0.1
##$AZFW= 0.1
##$BCFW= 0
##$BC_mod= 0
##$BYTORDP= 0
##$COROFFS= 0
##$CY= 15
##$DATMOD= 1
##$DC= 0
##$DFILT= <>
##$DTYPP= 0
##$F1P= 0
##$F2P= 0
##$FCOR= 0.5
##$FTSIZE= 32768
##$FT_mod= 6
##$GAMMA= 0
##$GB= 0
##$INTBC= 1
##$INTSCL= 1
##$ISEN= 128
##$LB= 0
##$LEV0= 0
##$LPBIN= 0
##$MAXI= 10000
##$MC2= 0
##$MEAN= 0
##$ME_mod= 0
##$MI= 0
##$NCOEF= 0
##$NC_proc= -8
##$NLEV= 6
##$NOISF1= 0
##$NOISF2= 0
##$NSP= 0
##$NTH_PI= 0
##$NZP= 0
##$OFFSET= 14.98509
##$PC= 1
##$PHC0= 97.62451
##$PHC1= 0
##$PH_mod= 1
##$PKNL= yes
##$PPARMOD= 0
##$PPDIAG= 0
##$PPIPTYP= 0
##$PPMPNUM= 2147483647
##$PPRESOL= 1
##$PSCAL= 4
##$PSIGN= 0
##$PYNMP= <proc.py>
##$REVERSE= no
##$SF= 400.02
##$SI= 32768
##$SIGF1= 0
##$SIGF2= 0
##$SINO= 400
##$SIOLD= 32768
##$SPECTYP= <>
##$SREGLST= <1H.CDCl3>
##$SSB= 0
##$STSI= 32768
##$STSR= 0
##$SW_p= 8223.68421052631
##$SYMM= 0
##$S_DEV= 0
##$TDeff= 65536
##$TDoff= 0
##$TI= <>
##$TILT= no
##$TM1= 0
##$TM2= 0
##$TOPLEV= 0
##$USERP1= <user>
##$USERP2= <user>
##$USERP3= <user>
##$USERP4= <user>
##$USERP5= <user>
##$WDW= 1
##$XDIM= 32768
##$YMAX_p= 433884633
##$YMIN_p= -854264
##$CURPLOT= <Network HP LaserJet P1505>
##$CURPRIN= <$Network HP LaserJet P1505>
##$DFORMAT= <normdp>
##$LAYOUT= <+/1D_H.xwp>
##$LFORMAT= <normlp>
##$PFORMAT= <normpl>
##$SURQMSG= 1
$$ End of Bruker specific parameters
$$ ---------------------------------
##NTUPLES= NMR SPECTRUM
##VAR_NAME=  FREQUENCY,     SPECTRUM/REAL,   SPECTRUM/IMAG
##SYMBOL=    X,             R,               I
##VAR_TYPE=  INDEPENDENT,   DEPENDENT,       DEPENDENT
##VAR_FORM=  AFFN,          ASDF,            ASDF
##VAR_DIM=   32768,         32768,           32768
##UNITS=     HZ,            ARBITRARY UNITS, ARBITRARY UNITS
##FACTOR=    0.250966925370066, 1,           1
##FIRST=     8223.43324360094, -92317,       -114903
##LAST=      0,             -28342,          -79905
##MIN=       0,             -854264,         0
##MAX=       8223.43324360094, 433884633,    0
$$ Real data points
##PAGE= N=1
##DATA TABLE= (X++(R..R)), XYDATA
$$ [...]
$$ plain form
19555 -211547 -211310 7574 -147943 8627 -82788 -123318 -255214 133610 -228807 168544 170928
19544 170928 -86373 -3502 -279000 17657 -82849 -88872 -108690 29283 -129226 -173522 155678
19532 -125339 -446917 48271 -213133 -194027 -159398 159696 28243 -110040 123484 -48030
19521 -3431 84853 -178353 1051 -447422 240260 -159552 3793 160738 -121083 -114772 82882
19509 -107492 -43173 -162894 -5591 -184411 101473 124026 -295863 -42480 -224403 -124516 278495
19497 -203406 91182 58705 -59783 -179293 328713 385302 31594 -270128 -129461 31426 -328106
19485 -97628 79829 47976 -128675 -175636 350005 -212754 106340 -271362 273291 2643 -58161
19473 104470 1478 -16709 -115754 46277 -136349 -7398 -110829 93563 188187 45218 14248
$$ packed form
19555b11547K37G574a47943H627h2788m0530j31896A33610b28807A68544K384
19544A70928h6373c502k75498A7657h2849o023j9818B9283a29226m4296A55678
19532a25339l21578D8271b13133J9106L4629A59696B8243a10040A23484d8030
19521c431H4853a78353A051d47422B40260a59552C793J56945a21083O311H2882
19509a07492d3173j19721e591j78820A01473K2553b95863d2480j81923R9887B78495
19497b03406I1182l2477e9783j19510C28713N6589C1594b70128a29461C1426c28106
19485i7628G9829l1853a28675m6961C50005b12754A06340b71362B73291B643e8161
19473A04470A478a6709r9045D6277a36349g398j03431I3563R4624D5218A4248
$$ plain form
19461 -163508 -109530 259575 -263470 -74951 199009 -256651 -48807 210685 -174977 -39261
19450 -130363 -161655 -290018 -214392 -379438 -268341 51660 102251 -298400 81991 -74755 112959
19438 -302155 25986 21128 67733 198837 34588 185243 93712 265518 -207520 95067 -308382
19426 75371 -105488 -61570 -28156 -329814 -252256 -295482 -143885 -124449 -95263 126707 -222517
19414 -266527 23146 -61078 -102643 41777 -26543 -23501 -235670 -186463 12083 53858 300839
19403 300839 -204 -258441 219761 285368 505122 -528121 20665 48991 33167 -131456 -74440
19392 -74440 39146 17786 41713 -58773 90033 -253688 116957 98573 80427 24068 196894
19381 196894 -16911 234061 -3432 -69349 51472 31061 69399 180174 -89976 -3955 -375749
$$ packed form
19461a63508N3978B59575b63470g4951A99009b56651d8807B10685a74977c9261
19450a30363l1292j28363P5626j65046J11097E1660N0591b98400H1991g4755A12959
19438c02155B5986m858M6605J31104C4588J50655r1531J71806b07520I5067c08382
19426G5371a05488M3918b8156l01658P7558m3226a43885J9436K9186A26707b22517
19414b66527B3146f1078m1565D1777b6543L042k12169M9207A2083M1775K46981
19403C00839b04k58237B19761O5607K19754e28121B0665K8326j5824a31456N7016
19392g4440C9146A7786K3927e8773I0033b53688A16957j8384j8146B4068J72826
19381A96894a6911B34061c432o5917E1472k0411L8338J10775h9976c955l71794
$$ plain form
19370 -375749 -100434 -171415 -100511 380008 -110877 -85897 -34285 -60662 -237432 92885 79330
19359 79330 -43608 -64619 -250187 -52232 78922 194776 -195405 -245948 -206273 -61269 -104489
19348 -104489 56449 -417588 -104252 -60511 -87384 177772 -384775 -152279 24422 -70652
19337 -160909 42374 -23707 -5018 -196338 -266513 40315 -97133 189782 125150 -94214 -4183
19325 -35990 54578 -450577 -32390 -89789 63246 -249314 -417918 154684 -229703 -244164 18117
19313 -282863 -148725 95703 -242411 128150 144062 -17916 -386894 -162181 -25826 -192799
19303 -192799 -38564 115117 -109233 -327881 13986 -272254 -221932 -116538 -59152 -429344
19293 -429344 3960 -79105 -196290 170256 7763 138591 340236 8369 -114878 146325 212062
$$ packed form
19370c75749a00434p0981P0904C80008a10877K4980c4285k6377j76770I2885j3555
19359G9330d3608k1011j85568e2232G8922J15854a95405n0543L9675f1269m3220
19348a04489E6449d17588a04252M3741k6873A77772c84775a52279B4422g0652
19337a60909D2374b3707e018j91320p0175D0315i7133A89782o4632i4214d183
19325c5990E4578d50577c2390n7399F3246b49314j68604A54684b29703j4461A8117
19313b82863J34138I5703b42411A28150J5912a7916l68978a62181b5826j66973
19303a92799c8564A15117a09233k18648A3986b72254N0322J05394N7386l70192
19293d29344C960g9105j17185A70256G763J30828K01645H369a14878A46325O5737
$$ plain form
19282 212062 462503 -83478 -410045 -213827 -32408 -221195 -186206 25121 -55277 -216586
19272 -216586 -159755 137006 296193 -286487 139832 106777 -75743 -112006 -269278 -343565
19262 -343565 122141 -118592 116889 -2517 38009 35894 -442141 -209418 -439525 -151162
19251 95213 -104026 -121318 -19811 93215 -257153 -213003 9790 254460 12635 -338233 -185152
19240 -185152 230866 163350 -89884 359621 -185837 265635 -61423 177239 -42815 -126187
19230 -126187 124440 195825 -529049 -206156 -11422 43174 -211131 212265 45973 -333108
19219 78879 173556 -375708 142344 -158701 -48632 58458 -14740 57399 -131428 -238643 106856
19207 -128008 -130372 -336034 -13914 366416 -65397 -117980 196118 -175776 -89896 162996 177038
$$ packed form
19282B12062K50441h3478l26567J96218c2408j88787L4989B5121e5277j61309
19272b16586N6831A37006J59187b86487A39832l3055g5743l6263j57272p4287
19262c43565A22141a18592A16889b517C8009k115d42141b09418k30107a51162
19251I5213a04026j7292a9811I3215b57153M4150I790K44670A2635c38233J53081
19240a85152B30866o7516h9884C59621a85837B65635f1423A77239d2815q3372
19230a26187A24440P1385e29049b06156a1422D3174b11131B12265D5973c33108
19219G8879R4677c75708A42344a58701d8632E8458a4740E7399a31428j07215A06856
19207a28008k364k05662a3914C66416f5397n2583A96118a75776Q5880A62996J4042
$$ plain form
19196 177038 -254249 122820 -315628 253752 20081 135396 26582 -307555 -96113 -445883
19186 -445883 1392 87060 -171889 -139083 -255853 -28492 151296 -1597 194927 170052 -196616
19174 -34694 -145124 23715 82669 -244552 -19709 3093 81238 166688 -60409 68984 -224160
19162 -77039 124482 194747 160389 40337 -31200 -28609 -294364 28070 -10261 -239632 169394
19150 -225547 -24575 162322 -221110 -199113 -70452 175025 -157668 -44155 -240709 -81195
19139 -2850 76395 -40447 50259 -343761 -250201 -93075 -101415 -59199 -115419 -36808 -90638 -103660
19127 -103660 -56985 -36916 -235799 130381 33007 -125326 -28866 -416132 79353 -196072
19116 -105021 19136 33633 -80763 164706 -342577 74718 -425202 -61251 -64248 240148 -90671
$$ packed form
19196A77038b54249A22820c15628B53752B0081J15315B6582c07555i6113l49770
19186d45883A392Q5668a71889L2806j16770b8492A51296a597A94927k4875a96616
19174c4694j10430B3715N8954b44552a9709C093P8145Q5450f0409F8984b24160
19162g7039A24482P0265l4358D0337c1200K591k65755B8070a0261k29371A69394
19150b25547b4575A62322b21110K1997g0452A75025a57668d4155j96554h1195
19139b850G6395d0447E0259c43761R3560i3075q340M2216n6220c6808n3830j3022
19127a03660M6675K0069j98883A30381C3007a25326b8866l87266G9353a96072
19116a05021A9136J4497h0763A64706c42577G4718d25202f1251k997B40148i0671
$$ plain form
19104 -235348 -136748 160253 184019 -89960 230800 139770 -83869 -231053 229064 184618 -183947
19092 -123355 -49478 178800 -63083 -48506 -227571 25315 145707 -112613 -179465 79373 -277164
19080 84842 -54760 -31561 96587 -100095 845 -28071 -162361 31653 -89610 -155364 -253213 60889
19067 -85912 -93025 -133432 718946 -281791 -209360 300360 100833 -247883 -83358 156288 -268667
19055 -96517 178404 -331804 -212123 -176097 -11069 -46203 -98627 -148246 90714 -284453 188716
19043 81530 153945 -241229 -108321 286799 14461 -3607 56388 67027 -29408 119491 32609
19031 78598 -51437 44777 219103 7253 -257210 249401 26292 -359634 -94879 198647 -145687
19019 52173 -158983 160374 10167 -145709 9491 -88603 -253911 300841 176655 41558 -67404
$$ packed form
19104b35348R8600A60253K3766h9960B30800r1030h3869j47184B29064m4446a83947
19092a23355d9478A78800f3083J4577j79065B5315J20392a12613o6852G9373b77164
19080H4842e4760K3199I6587a00095H45b8071j34290C1653h9610o5754r7849F0889
19067h5912p113m0407G18946b81791P2431C00360A00833b47883h3358A56288b68667
19055i6517A78404c31804J19681L6026a1069l5134n2424m9619I0714b84453A88716
19043H1530P2415b41229a08321B86799A4461c607E6388J0639b9408A19491C2609
19031G8598e1437D4777J74326G253b57210B49401B6292c59634i4879A98647a45687
19019E2173a58983A60374A0167a45709I491h8603j65308C00841j24186D1558f7404
$$ plain form
19007 256103 -52270 28737 82127 -88194 -465838 -13594 88641 -55221 260510 -9738 -266261
18996 -266261 -274240 -215529 -103678 -283727 30192 49840 204036 106722 68305 -278965 -172997
18985 -172997 -68723 -58955 -224728 -103837 -245810 -231924 60232 -509504 -47407 -125575 -106095
18974 -106095 -274744 -278557 -18202 -203740 -235038 179643 -283975 139488 -80330 174701
18963 -23469 234285 -140926 -99517 -47727 -60253 22382 -101034 -54086 -20736 -421696 -42494
18951 -157259 106722 80258 2645 -155981 72291 31455 59501 -160774 -74750 -169884 -177983
18940 -177983 164404 217593 -280671 -307859 227617 148367 11227 16469 -68998 79770 57910
18929 57910 -84917 -215421 10386 -96159 25536 -85749 -115370 -53621 -268933 129663 -287937
$$ packed form
19007B56103e2270B8737N3390h8194l77644a3594H8641e5221B60510i738k56523
18996b66261p979N8711a03678j80049C0192J9648J54196r7314l8417b78965J05968
18985a72997f8723R768j65773a03837j41973J3886F0232e09504d7407p8168J9480
18974a06095j68649l813a8202j85538l1298A79643b83975A39488h0330A74701
18963b3469B34285a40926M1409d7727j2526B2382a01034M6948b0736m00960d2494
18951a57259A06722k6464B645a55981G2291C1455K8046a60774g4750r5134q099
18940a77983A64404N3189b80671k7188B27617p9250A1227N242f8998G9770k1860
18929E7910h4917j30504A0386i6159B5536h5749k9621e3621k15312A29663b87937
$$ plain form
18917 -160003 -43994 -78126 -106317 -140500 -139779 -102414 72712 38808 -230875 188748 -98848
18905 -109708 -154950 -193915 -109274 -148625 -197422 242853 149048 55929 -7520 296694 -47506
18893 -25043 -186885 -20419 -149558 -222830 -387304 226287 5629 -257513 -63095 -198905 8983
18881 -172 498792 414928 -94482 -25885 136631 65358 -146256 -141568 -66026 134833 78952
18870 78952 189797 53705 -4447 -53260 -238844 111675 -126392 77094 -9817 175845 -468489
18858 -36600 136278 -246766 -41349 179182 153644 149897 -62873 -128748 -31704 -22922 -90043
18847 -90043 -166213 425142 214350 -79715 112880 -177523 -18475 -258829 -145697 259825
18836 -177323 100374 -2728 -239346 -227405 33195 -12030 48989 -338929 304771 -108283 366556
$$ packed form
18917a60003d3994l4132k8191l4183P21L7365G2712l3904b30875A88748i8848
18905a09708m5242l8965Q4641l9351m8797B42853r3805E5929g520B96694d7506
18893b5043j61842b0419j29139p3272j64474B26287E629b57513f3095j35810H983
18881a72D98792q3864i4482b5885A36631F5358a46256M688f6026A34833n5881
18870G8952J10845E3705d447m8813j85584A11675a26392G7094i817A75845d68489
18858c6600A36278b46766d1349A79182k5538l747f2873o5875c1704Q782o7121
18847i0043p6170D25142k10792g9715A12880a77523a8475k40354J13132B59825
18836a77323A00374b728k36618J1941C3195a2030D8989c38929C04771a08283C66556
$$ plain form
18824 -75860 -278428 -154112 211983 174069 -26601 -446624 106280 -215427 -26239 81617
18813 205181 183729 29515 23678 88387 387397 -44568 -293033 64366 9074 271623 -44059
18801 155871 -38718 158997 60609 -45345 238245 32446 -279784 203869 -61273 -50860 163709
18789 -123017 -501626 -544475 233538 71488 -139783 -258328 -209945 287263 58376 -348266
18778 -140536 -59155 -53554 -15484 72252 -161898 -351057 -78347 10248 -164299 -170802 297415
18766 -119329 -268981 92243 287842 44419 -289440 170765 -81850 -122734 49624 277136
18756 277136 -165217 120815 261481 -130787 -28439 -11824 -63351 -20549 -223712 -146835
18746 -146835 159157 -487118 75612 -166209 -137310 -204636 -243394 -277919 15623 -254344 136831
$$ packed form
18824g5860k02568J24316B11983l7914b6601m20023A06280b15427b6239H1617
18813B05181k1452B9515n837O4709K99010d4568k48465F4366I074K62549d4059
18801A55871c8718A58997F0609d5345B38245C2446b79784B03869f1273J0413A63709
18789a23017l78609m2849B33538G1488a39783j18545M8383B87263E8376c48266
18778a40536e9155N601a5484G2252a61898j89159g8347A0248a64299o503B97415
18766a19329j49652I2243J95599D4419b89440A70765h1850m0884D9624K27512
18756B77136a65217A20815J40666a30787b8439a1824n1527b0549k03163P6877
18746a46835A59157d87118G5612a66209K8899o7326l8758l4525A5623b54344A36831
$$ plain form
18734 -143498 -211859 -5792 -134626 77413 49668 -151964 79254 84339 353658 -250087 212436
18722 161602 -304500 23436 111064 -34418 13102 64190 126084 176608 -34951 -263750 -192317
18711 -192317 15982 155210 263619 156616 382937 -170902 127504 142175 86508 12694
18700 127142 -92445 -23509 -512 430768 -441654 -92000 -313190 -154793 121403 134846 -166005
18688 -33289 -202123 204282 -53793 155847 212246 131392 156761 308352 47021 40862 257065
18677 257065 162312 204487 40247 -465705 -213990 -74453 -159591 -113562 -110708 -108074 168566
18665 -160601 87055 41401 -27563 -119084 356784 143064 212708 -139558 -9596 169966 84589
18653 -77903 24923 108523 -32236 -255307 -44223 195667 123727 -75935 6862 -121773 -146513
$$ packed form
18734a43498o8361e792j28834G7413k7745a51964G9254N085K69319b50087B12436
18722A61602c04500B3436Q7628c4418A3102N1088O1894N0524c4951k28799P1433
18711a92317A5982J39228J08409j07003K26321a70902A27504J4671n5667A2694
18700A27142i2445b3509e12D30768d41654i2000k21190a54793A21403J3443a66005
18688c3289j68834B04282e3793A55847N6399q0854K5369J51591D7021o159K16203
18677B57065r4753M2175D0247d65705b13990g4453q5138M6029K854K634A68566
18665a60601H7055D1401b7563r1521C56784A43064O9644a39558i596A69966H4589
18653g7903B4923Q3600c2236k23071d4223A95667p1940g5935F862a21773k4740
$$ plain form
18642 -146513 -194384 -42883 -159741 -498376 -210415 -250060 -111716 105848 107673 -108458
18631 214539 -298891 -265149 -25328 17539 -18984 -384774 -47207 15181 -373892 -351467 -137408
18619 -125216 1022 -202629 76096 -191901 225309 -264864 -206762 -77778 -63084 -247662 -298987
18608 -298987 -3419 -368872 260414 62264 19701 -128088 -227808 63879 -186406 -171695 -245457
18597 -245457 -361656 -141075 -70174 -55271 -8118 -190061 125031 -307196 -156704 -299177
18587 -299177 -131502 226422 294702 -91616 -152036 321477 -109870 -144300 -353939 -102056
18576 -334107 157024 -59217 -197536 -47891 54062 177268 -9796 -233773 58317 -215133 -150219
18565 -150219 249699 -71456 60541 89139 75904 66846 -254657 -91025 85861 -249983 -104456
$$ packed form
18642a46513m7871d2883j16858l38635b10415l9645a11716A05848J825a08458
18631B14539b98891L3742b5328A7539a8984l65790d7207A5181c73892K2425a37408
18619a25216A022b02629G6096a91901B25309b64864N8102g7778J4694j84578n1325
18608b98987c419l65453B60414F2264A9701a28088r9720F3879a86406J4711p3762
18597b45457j16199a41075g0174J4903h118j81943A25031c07196J50492j42473
18587b99177a31502B26422O8280i1616o0420C21477a09870l4430k09639a02056
18576c34107A57024e9217j38319d7891E4062J23206i796k23977E8317b15133O4914
18565a50219B49699g1456F0541K8598j3235r058b54657i1025H5861b49983a04456
$$ plain form
18553 -258563 121312 -147772 164941 162670 -44914 181776 126384 -145887 128930 -32166
18542 -506867 -21230 287537 111341 -75912 269724 -11167 -119487 -306494 -226506 -121076
18532 -121076 -151116 32743 -237149 246910 54456 -297247 -29583 -11324 116700 -227898
18521 -287479 -194353 -52246 -291100 -190443 95577 264728 -128994 180108 106978 -55796
18510 79405 -20397 -282667 -255093 -128447 85016 -58849 266930 103819 -164470 -256093 47004
18498 -76918 -83202 72009 133136 69955 116758 -230694 -75440 -10637 -196208 -396067 -246956
18487 -246956 162602 47689 -11088 -239823 161963 98569 -31074 -397782 -410351 38428 -229642
18475 52593 -301961 -359772 69793 83414 -120977 181554 -16020 139204 85605 204188 -85426
$$ packed form
18553b58563A21312a47772A64941k271d4914A81776n5392a45887A28930c2166
18542e06867b1230B87537A11341g5912B69724a1167j08320j87007P9988J05430
18532a21076l0040C2743b37149B46910E4456b97247b9583a1324A16700b27898
18521b87479R3126e2246k38854J00657I5577J69151a28994A80108p3130e5796
18510G9405b0397k62270K7574J26646H5016e8849B66930A03819a64470r1623D7004
18498g6918o284G2009O1127o3181M6803b30694g5440a0637j85571j99859J49111
18487b46956A62602D7689a1088k28735A61963o3394c1074l66708j2569C8428b29642
18475E2593c01961n7811F9793J3621a20977A81554a6020A39204n3599J18583h5426
$$ plain form
18463 159428 -185145 -123909 -85584 248903 -179815 -25864 42436 -29196 -64528 -90206 -312712
18452 -312712 -98752 14087 -283393 -58199 52946 -132210 -263839 15937 -32988 -68424 129374
18440 -177257 -270127 -160635 -58799 -33876 -44206 51217 -283492 -58921 25723 -150998 -199557
18429 -199557 17727 47437 -125977 -140901 -12020 -62527 -264070 44565 -294991 -428670 -81995
18417 -11796 75498 -40287 -162867 377973 74920 120232 182620 243502 181370 15903 83324
18406 83324 -13132 -48447 -314370 -101038 -218784 371294 165468 -109741 72633 -126526
18395 61727 23067 -332391 -81597 11326 -71495 -168879 -288762 66848 -16509 -129070 245885
18383 -100518 240447 188403 171530 45069 -171992 -141176 317811 -264114 8148 7694 -175571
$$ packed form
18463A59428a85145O1236L8325B48903a79815b5864D2436b9196l5332k5678k22506
18452c12712i8752A4087b83393e8199E2946a32210j31629A5937c2988l5436A29374
18440a77257r2870J09492e8799K4923j0330E1217b83492e8921B5723a50998m8559
18429a99557A7727K9710a25977j4924a2020n0507k01543D4565b94991j33679h1995
18417a1796G5498d0287j22580C77973G4920M5312O2388O0882o2132A5903O7421
18406H3324a3132l5315k65923a01038j17746C71294A65468a09741G2633a26526
18395F1727B3067c32391h1597A1326g1495r7384j19883F6848a6509j12561B45885
18383a00518B40447n2044j6873D5069a71992L0816C17811b64114H148m54a75571
$$ plain form
18371 -393692 2749 -254349 -271733 329871 -137400 -30432 15648 337646 -56087 -114082 -65114
18360 -65114 -406261 -24871 114050 105186 -100027 116549 -119603 51860 72312 -214788 161155
18348 98834 171493 -275236 -90128 24894 -121740 -160165 -83713 -131033 143456 -175264 -80368
18336 115361 91942 -91394 -71259 218667 -120809 134117 -164903 -187248 -111549 -129871 -60631
18324 -854264 -110802 -68972 2716 87333 130461 -171203 -176269 38968 -58043 -110719 -107487 487872
18311 -17821 -148206 -177637 151666 -192700 -280240 2606 214554 -397410 133517 155585 142701
18300 142701 32355 -26142 -38013 -26809 -144971 83186 13543 1003 53511 -31441 132305
18288 -163183 164440 249339 -225484 -110054 -26113 325992 35446 -57233 47203 22823 -14343
$$ packed form
18371c93692B749b54349j7384C29871a37400c0432A5648L21998e6087n7995M8968
18360f5114l41147b4871A14050q864a00027A16549a19603E1860K0452b14788A61155
18348I8834P2659b75236i0128B4894a21740l8425P6452m7320A43456a75264h0368
18336A15361k3419i1394K0135B18667a20809A34117a64903k2345P5699j8322f0631
18324h54264a10802M1830B716Q4617M3128a71203n066C8968e8043n2676L232D87872
18311a7821j30385k9431A51666a92700q7540B606K11948c97410A33517K2068j2884
18300A42701C2355b6142j1871J1204j18162H3186A3543A003N2508c1441A32305
18288a63183A64440Q4899b25484a10054b6113C25992C5446e7233D7203B2823a4343
$$ plain form
18276 -356817 -193756 54003 -4341 210501 -33853 -183485 301206 163543 390868 65015
18265 -11177 153465 51357 -112152 -35394 -417859 -80516 -65603 503205 101270 -104019
18254 -94882 3325 256901 68853 105370 782 -380903 107296 -167642 26421 -53754 4968 133540
18242 133540 -356978 53057 -45167 -98214 -8619 -391765 221059 275146 -387449 2858 -296321
18230 -30452 -208995 -115784 -319312 -172370 -10988 -212420 45416 19499 -280778 -272336 -185654
18219 -185654 -260609 -75472 -256751 191787 -350834 -14526 -166445 -71422 136026 61873
18208 88876 238757 73051 176621 106031 -231490 -89284 -36193 28961 45956 170874 -248291
18196 -166615 -287701 -53335 -98413 -158421 63517 -198434 64350 311944 -78152 -49471 -65111
$$ packed form
18276c56817J63061E4003d341B10501c3853j49632C01206j37663K27325F5015
18265a1177A53465E1357a12152c5394l82465h0516J4913E03205A01270a04019
18254i4882C325K53576F8853L6517G82c80903A07296a67642B6421e3754D968J28572
18242A33540c56978E3057d5167n3047h619l83146B21059N4087c87449B858b96321
18230c0452j78543R3211k03528J46942a0988k01432D5416A9499b80778Q442Q6682
18219a85654p4955g5472j81279A91787c50834a4526j51919g1422A36026F1873
18208H8876J49881G3051J03570p0590b31490h9284c6193B8961J6995J24918b48291
18196a66615j21086e3335m5078o0008F3517a98434F4350K47594g8152K8681j5640
$$ plain form
18185 -65111 129854 51753 125649 -69370 67343 -16010 -107695 218557 26964 -93974 134905
18173 -288108 -141555 -176053 -140209 6861 -216658 -27224 -166770 34959 143656 -156136 264144
18161 -360782 -208065 119921 10429 88528 307685 -73462 218565 -57841 -4222 -312292 -25602
18149 -134658 -100921 -4635 70607 -56295 146034 128053 -71673 44707 141140 -105567 103240
18137 296309 64906 -32383 -46510 -505841 -121263 -7971 65864 7207 -53987 -102947 -222597
18126 -222597 174524 -166924 126436 28254 263367 166346 -205544 -31365 -101648 11333
18115 -114058 830 -27107 3243 -81461 69393 224254 -76196 256071 90404 5964 163264 -289142
18102 -119439 308396 -74949 -204303 311953 154349 -127580 109020 -312590 -55565 65397
$$ packed form
18185f5111A29854E1753P3896f9370F7343a6010r1685B18557B6964i3974A34905
18173b88108a41555l4498L5844F861b16658b7224j39546C4959J08697a56136B64144
18161c60782J52717A19921A0429P8099K19157g3462B18565e7841d222l08070b5602
18149a34658L3737d635G0607e6295A46034j7981g1673D4707R6433a05567A03240
18137B96309F4906c2383j4127m59331a21263g971F5864G207e3987m8960j19650
18126b22597A74524a66924A26436B8254K35113r7021b05544c1365p0283A1333
18115a14058H30b7107C243h1461F9393J54861g6196B56071I0404E964J57300b89142
18102a19439C08396g4949j29354C11953A54349a27580A09020c12590e5565F5397
$$ plain form
18091 13582 -431663 -65631 -8836 -95261 59356 -358180 42847 242152 -219832 31076 -119690
18079 112293 -30988 262630 -63294 261665 -86935 37012 22726 -86349 24331 10050 -292300
18067 -24888 -81121 113105 -178030 -123891 -388834 4228 -75901 188767 -52666 -317510 334606
18055 23837 -159388 -250125 84294 447 90762 -53739 35787 3620 388295 -176686 -50628 -196024
18043 -196024 -272448 -222184 -264071 192642 113638 370148 15742 158874 -46449 96287 46852
18031 36140 -228449 -59978 38032 -220966 40296 -203232 -542815 -109551 -74599 -167114 148776
18019 225924 66283 63292 -145874 110869 -90542 58243 84647 208288 -3809 -98677 -50308
18008 -50308 -296752 -127986 27382 -114604 265051 20421 25199 -244383 260656 38769 -46069
$$ packed form
18091A3582d31663f5631h836q6425E9356c58180D2847J99305b19832C1076a19690
18079A12293c0988B62630f3294B61665h6935C7012j4286h6349B4331A0050b92300
18067b4888n6233A13105a78030N4139k64943D228g5901A88767e2666k64844C34606
18055B3837a59388r0737H4294D47R0315e3739C5787C620L84675a76686e0628j45396
18043a96024p6424N0264m1887A92642p9004K56510A5742J43132d6449I6287D6852
18031C6140b28449e9978C8032b20966D0296b03232l39583a09551L4952r2515A48776
18019B25924F6283k991a45874A10869i0542E8243K6404J23641c809r4868M8369
18008e0308k46444a27986B7382a14604B65051B0421M778b44383B60656C8769d6069
$$ plain form
17996 372702 -73906 212199 -115386 -202811 -73392 -82641 -125285 228845 11351 80637 -209721
17984 417043 -111926 218289 -37836 214944 -346524 -112069 192832 -2425 -82488 -224779
17974 -224779 65769 40307 -296110 22261 -143709 -328936 150812 -264104 -134756 -18928
17963 -126566 84312 -38133 -484232 -75485 -212681 -39952 154426 -121192 -85186 -43868 -5995
17951 -109764 203066 185536 -554231 85823 164434 48015 -71108 -59568 7494 -140108 -215057
17940 -215057 -81094 -181362 -70599 -93409 -262612 114038 336528 96497 -159993 130 -158305
17928 -336039 -314436 -16336 67736 105984 164262 271109 -124671 273802 -22615 116019 281056
17917 281056 -14118 -26539 8057 125812 260596 54371 -96740 228937 -238969 -197570 213079
$$ packed form
17996C72702g3906B12199a15386q7425g3392r249m2644B28845A1351O9286b09721
17984D17043a11926B18289c7836B14944c46524a12069A92832b425q0063j42291
17974b24779F5769k5462b96110B2261a43709j85227A50812b64104J29348a8928
17963a26566H4312c8133m46099g5485j37196c9952A54426a21192L6006M1318e995
17951a09764B03066j7530e54231H5823P8611D8015g1108J1540G494a40108p4949
17940b15057h1094j00268g0599k2810j69203A14038K22490I6497a59993A30a58305
17928c36039K1603a6336F7736L8248N8278J06847a24671B73802b2615A16019J65037
17917B81056a4118j2421H057J17755J34784E4371i6740B28937b38969M1399B13079
$$ plain form
17905 -269826 -185320 250593 -57101 171954 141240 252695 -16760 100029 171914 -189645
17894 -275333 -114312 67361 267692 -112981 -26202 87457 -97675 22412 -301735 234168
17883 -292426 -150834 -192917 164567 289229 225111 -75978 -17200 -113431 274158 11142 154551
17872 154551 1465 130799 204871 -194059 17796 -431274 122419 192976 -434017 4638 -69373
17860 110489 72709 -136582 28425 172998 13575 -83189 27876 -14501 150590 -1524 7043
17848 116401 -192998 -337019 195094 -139220 202507 46623 -231219 31548 125886 -215381
17837 -50744 320213 264169 -52914 -73838 48433 -71685 -146582 -52526 -49575 -58177 51052 37249
17825 37249 155330 73426 310232 13371 -75607 -86887 421808 -267450 24352 -53440 136425
$$ packed form
17905b69826Q4506B50593e7101A71954l0714J11455a6760A00029P1885a89645
17894b75333a14312F7361K00331a12981b6202H7457i7675B2412c01735B34168
17883b92426J41592m2083A64567J24662o4118g5978a7200r6231B74158A1142J43409
17872A54551A465J29334P4072a94059A7796d31274A22419P0557d34017D638f9373
17860A10489l7780a36582B8425J44573A3575h3189B7876a4501A50590a524G043
17848A16401a92998j44021A95094a39220B02507D6623b31219C1548R4338b15381
17837e0744C20213n6044e2914k0924D8433g1685p4897e2526K951q602E1052j3803
17825C7249J18081G3426K36806A3371g5607j1280D21808b67450B4352e3440A36425
$$ plain form
17813 -238792 -294260 -35343 -14543 160676 -97684 -6376 -60936 345311 240565 80573 -131618
17801 20957 -188193 268177 54656 -157323 101467 23631 -199382 -102228 483929 -34424
17790 -35891 -99865 -312407 -331656 -304366 28273 -285960 -26832 -240811 -5631 63726 460171
17779 460171 60654 1749 -10461 -134049 137180 -270198 -45689 75024 111401 -188793 36999
17767 61757 -552457 -51236 343316 267539 194646 -151979 160994 -43406 327938 216300
17757 216300 -35617 105788 -237496 -57251 -106516 113808 -3043 73554 253876 -78671 -17704
17745 -241308 -158462 52827 278159 -11848 -223629 268286 -104463 44613 -146853 73062
17734 167589 -61015 58910 236259 60170 198705 73944 -43816 174039 -37699 175361 -203195
$$ packed form
17813b38792n5468c5343a4543A60676i7684f376n4560C45311j04746H0573a31618
17801B0957a88193B68177E4656a57323A01467B3631a99382R7154D83929c4424
17790c5891o3974k12542j9249K7290B8273b85960b6832k13979e631F3726L96445
17779D60171F0654A749a0461j23588A37180b70198d5689G5024L6377a88793C6999
17767F1757e52457e1236C43316p5777p2893a51979A60994d3406C27938j11638
17757B16300c5617A05788b37496e7251m9265A13808c043G3554J80322g8671a7704
17745b41308Q2846E2827K25332a1848k11781B68286a04463D4613a46853G3062
17734A67589f1015E8910J77349F0170J38535G3944d3816A74039c7699A75361b03195
$$ plain form
17722 -43845 271951 -37078 -11655 76122 150553 -45184 -50558 179691 16198 -14012 -319745
17711 -319745 -19187 -261159 -117254 130333 -141350 1472 -20957 -323902 -268328 84766 -112984
17699 79962 109266 -77014 285374 76361 146544 6980 -32944 177880 46555 -53428 -141228
17688 -141228 -123661 111991 47236 71630 118666 90173 -100274 -172767 -266333 248735 69371
17676 17216 -186875 105225 9762 -56174 -105760 377195 31872 -119026 57510 -220339 273439
17664 -473348 -379261 50233 213200 -8970 114103 132206 -4256 342270 -215904 59478 -173499
17652 -30116 47407 60671 -79378 127900 -24577 -221848 -97343 299113 47915 -345111 -90319
17640 248362 11091 -170255 121572 120097 -135916 340397 -21845 -4988 39022 -91434 60396
$$ packed form
17722d3845B71951c7078a1655G6122P4431d5184n374A79691A6198a4012l05733
17711c19745a9187k41972a17254A30333a41350A472b0957l02945N5574H4766a12984
17699G9962K9304g7014B85374G6361P0183F980c2944A77880D6555e3428q7800
17688a41228J7567A11991D7236K4394M7036k8493a00274p2493r3566B48735F9371
17676A7216a86875A05225I762e6174m9586C77195C1872a19026E7510b20339B73439
17664d73348R4087E0233J62967h970A14103J8103d256C42270b15904E9478a73499
17652c0116D7407J3264g9378A27900b4577j97271i7343B99113D7915c45111i0319
17640B48362A1091a70255A21572j475a35916C40397b1845d988C9022i1434F0396
$$ plain form
17628 96945 19490 294087 96287 -104142 10555 -30661 -9563 207497 315683 -383837 -129650
17616 -315841 -12211 200943 -431964 187988 87704 70723 76146 -86026 221720 -138047 59781
17604 74098 -138988 -213110 63615 -226985 47134 34295 -518275 269852 5313 101614 -182296
17592 45067 -48969 178629 351114 -2151 -21663 125946 -43621 -191862 30627 297687 337438
17581 337438 149236 341237 205500 -83692 172013 141419 -75457 230348 99071 173387
17571 173387 76230 219231 125813 -126671 53138 311536 92577 101735 -14810 -116544 428221
17559 274427 -268604 104653 33090 218117 79056 202009 451234 -26261 121896 389305
17549 389305 338187 108799 486643 -181359 -101937 271711 345517 111559 125168 243447
$$ packed form
17628I6945A9490K74597I6287a04142A0555c0661i563B07497J08186c83837a29650
17616c15841a2211B00943d31964A87988H7704j6981N423h6026B21720a38047E9781
17604G4098a38988p4122F3615b26985D7134j2839e18275B69852E313R6301a82296
17592D5067d8969A78629J72485b151j9512A25946d3621j48241C0627K67060L9751
17581C37438A49236J92001j35737h3692A72013l0594g5457B30348I9071P4316
17571A73387G6230J43001r3418a26671E3138K58398I2577R158a4810j01734D28221
17559B74427b68604A04653C3090J85027G9056J22953K49225b6261A21896K67409
17549C89305n1118A08799L77844a81359P9422B71711P3806A11559J3609J18279
$$ plain form
17539 243447 146177 43489 -160521 233250 -66602 195599 -204107 13101 -50365 106504
17528 408402 144897 201989 39047 -7716 -8737 63879 42110 72618 -77489 -1298 85707 -60868
17515 41558 -77550 -38124 37566 -51434 237838 210942 157688 -181856 126645 -229301 187420
17503 263517 -128047 177783 57622 9814 504447 152230 82030 26268 -107392 172814
17492 -89227 13783 112815 -16883 -128231 55125 -51480 183715 -162650 30180 26619 -265488
17480 306434 49100 197718 395934 194418 217532 71963 346770 241994 311651 -40047
17469 -58075 -175655 -239701 190934 158907 -253142 15988 252051 -158756 -42336 20869 565421
17458 565421 -15067 215778 229714 359612 250427 296048 415123 302320 339328 423193
$$ packed form
17539B43447r7270D3489a60521B33250f6602A95599b04107A3101e0365A06504
17528D08402A44897N7092C9047g716j021F3879k1769L0508g7489a298H5707f0868
17515D1558g7550c8124C7566e1434B37838k6896n3254a81856A26645b29301A87420
17503B63517a28047A77783E7622I814M94633A52230p0200B6268a07392A72814
17492h9227A3783R9032a6883j11348E5125e1480A83715a62650C0180l561b65488
17480C06434D9100J48618J98216A94418K3114G1963K74807j04776O9657d0047
17469e8075j17580o4046A90934l2027b53142A5988K36063a58756d2336B0869N44552
17458E65421a5067B15778J3936J29898j09185M5621J19075j12803L7008Q3865
$$ plain form
17448 423193 356960 186799 142153 56256 227593 103492 215108 275118 17584 328182
17438 328182 -25797 308390 176367 195275 86199 209279 430365 223563 74427 183828
17428 183828 98608 -132398 120393 446486 84606 294519 -136928 175823 533106 328531
17418 328531 231285 617746 -52200 132543 221042 384755 255518 371676 -37372 142862
17407 57601 -66983 44183 192572 129678 -16904 -124023 94216 180234 -25899 18254 137296
17396 137296 322060 80844 290760 99090 243865 258287 -170042 -242238 395337 49313
17385 -177008 253936 123081 -57827 122084 57632 198240 103562 -379950 142328 131804
17375 131804 267541 413379 46151 -100122 342017 125419 66832 -87358 273638 107948
$$ packed form
17448D23193o6233j70161m4646E6256J71337A03492J11616O0010A7584L10598
17438C28182b5797C08390j32023J8908H6199J23080K21086k06802G4427J09401
17428A83828q5220a32398A20393L26093H4606K09913a36928A75823L57283k04575
17418C28531r7246L86461e2200A32543Q8499J63713j29237J16158c7372A42862
17407E7601f6983D4183J48389o2894a6904j07119I4216Q6018b5899A8254J19042
17396A37296J84764H0844K09916I9090J44775J4422a70042p2196C95337D9313
17385a77008B53936A23081e7827A22084E7632J40608r4678c79950A42328j0524
17375A31804J35737J45838D6151a00122C42017A25419n8587h7358B73638A07948
$$ plain form
17364 64582 6953 132112 -205450 35810 176040 386960 97210 161287 404715 30029 -276886
17352 111455 91008 162673 354111 -190436 148154 -88909 521423 -140958 -72613 44690
17341 179577 312766 105146 118987 426588 109362 148158 345546 -58197 177060 48768
17330 170661 270192 -29222 105696 -47279 80080 453428 2162 159081 292417 47162 78324
17319 78324 374066 263395 74294 345545 10115 109728 166645 120531 98686 143705 187803
17308 187803 348157 203532 82274 -170786 -97577 53893 161830 85241 296251 33686
17297 -37062 375 152455 239406 -22960 1696 293940 458970 65838 634671 -111402 288837
17285 -395045 407232 98027 344399 248592 320301 284061 315579 199037 20791 2055 116803
$$ packed form
17364F4582F953J25159b05450C5810J40230K10920I7210O4077K43428C0029b76886
17352A11455k0447P1665J91438a90436A48154h8909E21423a40958O8345D4690
17341A79577J33189A05146J3841L07601A09362L8796J97388e8197A77060D8768
17330A70661R9531b9222A05696d7279H0080L73348B162J56919J33336D7162L1162
17319G8324K95742j10671G4294K71251A0115R9613N6917m6114k1845M5019M4098
17308A87803J60354j44625H2274a70786P3209E3893J07937p6589K11010C3686
17297c7062C75J52080Q6951b2960A696K92244J65030F5838N68833a11402B88837
17285c95045D07232I8027K46372r5807P1709l6240L1518j16542B0791B055J14748
$$ plain form
17274 116803 416332 137146 145473 693 386234 232365 117102 73483 252887 173410 168848
17263 168848 387578 274633 8009 8605 680 33691 219762 178506 -7085 129324 141517 135181
17251 135181 21549 283939 312985 421251 26905 398230 462336 195390 179266 516188
17241 516188 131723 242755 -167831 383158 303203 323526 179763 128586 132020 391223
17231 391223 -192812 329739 200936 156805 325915 725488 367895 121602 -59131 545066
17220 427632 250144 396618 311735 258933 420593 254360 -95949 123163 291009 48673
17209 65861 444826 307949 132182 152885 15766 478015 31954 203740 210151 450835 338156
17198 338156 130796 226330 280848 24450 341819 332162 -186893 218240 130276 184979 390537
$$ packed form
17274A16803K99529A37146Q327F93L85541j53869j15263m3619J79404p9477m562
17263A68848K18730j12945H009N96F80L3011J86071m1256g085A29324J2193o336
17251A35181B1549K62390K9046J08266B6905L71325O4106A95390j6124L36922
17241E16188A31723J11032a67831C83158p9955K0323j43763n1177L434K59203
17231C91223a92812C29739j28803m4131J69110L99573l57593A21602e9131E45066
17220D27632j77488J46474q4883n2802J61660j66233i5949A23163J67846D8673
17209F5861L78965j36877A32182K0703A5766M62249C1954J71786O411K40684j12679
17198C38156A30796R5534N4518B4450L17369r657a86893B18240q7964N4703K05558
$$ plain form
17187 390537 -44403 2866 514688 286666 126782 479008 29211 192759 -123594 599126
17176 191451 463715 336199 204480 329917 -2373 -130018 229546 236842 313911 355878 349821
17165 349821 341888 492373 524881 100384 27876 316398 427442 283844 231910 360632
17155 360632 500056 533713 -51358 449402 339526 426703 476331 398201 271672 148537
17145 148537 -125241 387989 519733 349639 418328 -25314 666247 257582 384278 410800
17135 410800 287361 657254 396074 211294 413638 365362 128190 254638 253830 174849
17125 174849 394186 498337 614213 135835 604722 320268 615150 253230 806154 286257
17114 366110 527770 333154 141487 634623 153730 458351 503557 128962 344055 502435
$$ packed form
17187C90537d4403B866N11822k28022A26782L52226B9211J63548a23594E99126
17176A91451K72264j27516j31719J25437b373j27645B29546P296P7069M1967o057
17165C49821p933J50485L2508A00384B7876K88522J11044j43598n1934J28722
17155C60632J39424L3657e1358D49402j09876Q7177M9628p8130j26529j23135
17145A48537a25241C87989J31744j70094O8689b5314F66247B57582J26696K6522
17135D10800j23439L69893k61180j84780K02344m8276A28190J26448q08p8981
17125A74849K19337J04151J15876A35835M68887k84454K94882B53230N52924B86257
17114C66110J61660j94616A41487M93136A53730L04621M5206A28962K15093J58380
$$ plain form
17104 502435 544121 250320 12444 359838 72064 746958 591384 402620 141143 446031
17094 446031 238485 396385 315689 708097 416494 343397 325706 348001 599300 260886
17083 281085 550076 375691 470680 466463 346393 406805 424203 434180 485590 400137 429947
17072 429947 506879 413578 657879 603383 581706 365981 449340 505781 724333 783169 499435
17061 499435 303299 617926 365646 753845 370362 489460 429863 969473 312914 418209
17051 418209 607739 498865 329586 544669 457335 192753 564262 460270 403658 575918
17041 575918 498981 764241 418683 484919 512243 569533 880459 684972 713267 710417 269420
17029 597835 572869 411788 653704 678141 966973 491767 594297 468705 400821 620944
$$ packed form
17104E02435M1686B50320A2444L47394G2064O74894j55574j88764A41143L04888
17094D46031k07546J57900q0696L92408k91603p3097j7691K2295K51299B60886
17083B81085K68991j74385R4989m217j20070O0412J7398R977N1410q5453K9810
17072D29947P6932r3301K44301n4496k1677k15725Q3359N6441K18552N8836k83734
17061D99435j96136L14627k52280L88199C70362J19098n9597N39610C12914J05295
17051D18209J89530j08874j69279K15083q7334A92753L71509j03992n6612J72260
17041E75918p6937K65260l45558O6236K7324N7290L10926j95487K8295k850B69420
17029E97835k4966j61081K41916K4437K88832m75206J02530j25592o7884K20123
$$ plain form
17019 620944 1048132 652072 578563 645416 474793 633846 707445 601447 801634 795327
17009 795327 335195 805845 892800 1032668 642520 963329 740611 790121 673436 908573
16999 908573 955523 495413 648867 835128 510540 1064455 840462 875801 729975 585486
16989 585486 481312 955306 1014925 649544 1041128 584341 824186 958978 731782 1062648
16979 1062648 836546 728807 629088 1009397 863329 746287 687783 1074707 1048952 771621
16969 771621 665202 1036864 859673 873815 667030 694713 890687 954483 1020781 1106801
16959 1106801 920431 878801 1120426 1078263 1111230 990846 986660 1031512 1048965 1209285 1114362
16948 1114362 1339476 1116193 1143445 1155815 1511872 1116644 1089387 1045328 980868 937727
$$ packed form
17019F20944M27188l96060p3509O6853j70623J59053P3599j05998K00187o307
17009G95327C35195M70650Q6955J39868l90148L20809k22718M9510j16685K35137
16999I08573M6950m60110J53454J86261l24588N53915k23993L5339j45826j44489
16989E85486j04174M73994N9619l65381L91584m56787K39845J34792k27196L30866
16979A062648k26102j07739r9719L80309j46068j17042n8504L86924k5755k77331
16969G71621j06419L71662j77191J4142k06785K7683J95974O3796O6298Q6020
16959A106801j86370m1630K41625m2163L2967j20384m186M4852J7453J60320r4923
16948A114362K25114k23283K7252J2370L56057l95228k7257m4059o4460m3141
$$ plain form
16938 937727 1129949 1316360 1237800 1215260 1276468 1368025 1254497 1173206 1554469 1624723 1505862
16927 1505862 1196389 1246025 1388187 1363011 1542060 1023111 1589204 1588875 1352245 1432744
16917 1432744 1583751 1555222 1317971 1569671 1477612 1667711 1395402 1648154 1591080 1810115
16907 1810115 1679224 1633381 1429705 1464952 1844836 1997124 1623707 1566250 1973205 1618981
16897 1618981 1703718 1867632 1624313 2002530 1682454 1985246 2001117 1991978 1781803 2201776
16887 2201776 2322867 2159604 2193679 1959771 2319229 2560363 2011326 2024357 2012134 2349546
16877 2349546 2734089 2679505 2447841 2378074 2332433 2597495 2730497 2595910 2705096 2559342
16867 2559342 2723993 3050278 2469582 2433581 2948334 2644587 2767186 2857566 2772605 2939710
$$ packed form
16938I37727J92222J86411p8560k2540O1208R1557j13528q1291L81263P0254j18861
16927A505862l09473M9636J42162k5176J79049n18949N66093l29k36630Q0499
16917A432744J51007k8529k37251K51700r2059J90099k72309K52752n7074K19035
16907A810115j30891m5843k03676L5247L79884J52288l73417n7457M06955l54224
16897A618981Q4737J63914k43319L78217l20076L02792J5871r139k10175M19973
16887B201776J21091j63263L4075k33908L59458K41134n49037J3031j2223L37412
16877B349546L84543n4584k31664o9767m5641K65062J33002j34587J09186j45754
16867B559342J64651L26285n80696l6001N14753l03747J22599R0380q4961J67105
$$ plain form
16857 2939710 3225909 3043058 3153199 3248784 3124763 3264764 3198526 3538985 3279484 3301411
16847 3301411 3773867 3301904 3622003 3587493 3844925 3617958 3893939 3752121 3693405 3996799
16837 3996799 4065953 4225064 4063633 4386637 4787585 4577510 4524861 4833268 4742501 5079252
16827 5079252 4750566 4996410 5091906 5256139 5427816 5373796 5233792 5611006 5819133 5617579
16817 5617579 5809263 6092285 6067792 6116390 6405410 6792841 6552448 6986294 6661162 7335586
16807 7335586 7145389 7418133 7347825 7679313 7954181 8136009 8580745 8419767 8936432 8974310
16797 8974310 9172188 9297848 9252463 10049912 10504606 10833345 10695499 11122547 11164985 11583524
16787 11583524 12073735 12143961 12650711 12891786 13612119 13781094 14050295 14734844 15100378
$$ packed form
16857B939710K86199j82851J10141R5585j24021J40001o6238L40459k59501K1927
16847C301411M72456m71963L20099l4510K57432k26967K75981j41818n8716L03394
16837C996799O9154J59111j61431L23004M00948k10075n2649L08407r0767L36751
16827E079252l28686K45844R5496J64233J71677n4020j40004L77214K08127k01554
16817E617579J91684K83022k4493M8598K89020L87431k40393M33846l25132O74424
16807G335586j90197K72744p0308L31488K74868J81828M44736j60978N16665L7878
16797H974310J97878J25660m5385P97449M54694L28739j37846M27048M2438M18539
16787A1583524M90211P0226N06750K41075P20333J68975K69201O84549L65534
$$ plain form
16778 15100378 15372223 15899329 16639666 17364693 17308904 17990986 18406152 19513064 20158461
16769 20158461 20665260 21474198 22214395 23252207 23936973 24565875 25763318 26476270 27865741
16760 27865741 28719709 29777693 31367104 32750540 33922223 35614855 37242590 38543958
16752 38543958 40307455 42101321 44583809 46683828 48600972 50996342 53671604 56121875
16744 56121875 59599274 62429154 65774428 69228314 73358288 76857067 81279756 85822212
16736 85822212 90937140 96102665 101265447 106898650 112626485 118303367 125168359 131489984
16728 131489984 137968270 144631443 150535312 156381705 161393398 166336138 170401368 173884511
16720 173884511 175975876 177422869 178071129 177268928 175537329 172947789 169382517 165058484
$$ packed form
16778A5100378K71845N27106P40337P25027n5789O82082M15166J106912O45397
16769B0158461N06799Q08938P40197J037812O84766O28902J197443P12952J389471
16760B7865741Q53968J057984J589411J383436J171683J692632J627735J301368
16752C8543958J763497J793866K482488K100019J917144K395370K675262K450271
16744E6121875L477399K829880L345274L453886M129974L498779M422689M542456
16736H5822212N114928N165525N162782N633203N727835N676882O864992O321625
16728A31489984O478286O663173N903869N846393N011693M942740M065230L483143
16720A73884511K091365J446993O48260q02201j731599k589540l565272m324033
$$ plain form
16712 165058484 159881270 154222790 148272852 142214051 135822891 128959101 122615066 116253272
16704 116253272 109826956 103880200 97866494 92677723 87207920 82172562 77880330 73348816
16696 73348816 68974979 65331351 61754494 58385482 55274622 52411105 49745880 47018178
16688 47018178 44770050 42415086 40736220 38528606 36704337 34663172 33374623 32173801
16680 32173801 30426560 29044613 27898623 26734434 25350870 24715938 23672166 22418554
16672 22418554 21606407 21051882 20215114 19595026 18855448 18210537 17672303 16916944 16352381
16663 16352381 15813355 15228306 14929707 14163869 13877032 13750587 13083541 12857518 12336023
16654 12336023 11976208 11598349 11057050 10802473 10775745 10244678 9852127 9780776 9648174 8962444
$$ packed form
16712A65058484n177214n658480n949938o058801o391160o863790o344035o361794
16704A16253272o426316n946756o013706n188771n469803n035358m292232m531514
16696G3348816m373837l643628l576857l369012l110860k863517k665225k727702
16688D7018178k248128k354964j678866k207614j824269k041165j288549j200822
16680C2173801j747241j381947j145990j164189j383564o34932j043772j253612
16672B2418554q12147n54525q36768o20088p39578o44911n38234p55359n64563
16663A6352381n39026n85049k98599p65838k86837j26445o67046k26023n21495
16654A2336023l59815l77859n41299k54577k6728n31067l92551p1351j32602o85730
$$ plain form
16644 8962444 9464142 8813876 8780268 8007037 8158320 8055734 7666016 7651459 7244201 7135847
16634 7135847 7382897 6958725 6881455 6641622 6717982 6217110 6036688 6191416 6058656 5654090
16624 5654090 5946288 5501494 5339418 5458744 5287327 5070361 4826036 4884683 4730676 4949983
16614 4949983 4607040 4642912 4520869 4416295 4320826 4068915 3605713 4057161 4280979 3664978
16604 3664978 3847481 3766229 4105341 3338882 3781445 3603379 3704029 3246737 3081819 3543084
16594 3543084 2969880 3173049 3234354 3029234 2879575 3106438 2937318 2934327 3124634 3126533
16584 3126533 2810366 2805815 2688435 2826801 2662792 2397005 2104637 2544447 2451223 2461846
16574 2461846 2328254 2463068 2118079 2402096 2173702 2062427 2436204 2146915 2039999
$$ packed form
16644H962444N01698o50266l3608p73231J51283j02586l89718j4557m07258j08354
16634G135847K47050m24172p7270k39833P6360n00872j80422J54728j32760m04566
16624E654090K92198m44794j62076J19326j71417k16966k44325N8647j54007K19307
16614D949983l42943L5872j22043j04574r5469k51911m63202M51448K23818o16001
16604C664978J82503q1252L39112p66459M42563j78066J00650m57292j64918M61265
16594C543084n73204K03169O1305k05120j49659K26863j69120k991J90307J899
16584C126533l16167m551j17380J38366j64009k65787k92368M39810r3224J0623
16574B461846j33592J34814l44989K84017k28394j11275L73777k89289j06916
$$ plain form
16565 2039999 2034135 1845574 2226829 2024393 2206443 1772105 2158601 1785137 1957381 1936763
16555 1936763 2032278 1913799 1607712 1939395 1798167 1790182 1761631 1462415 1824499 1583927
16545 1583927 1716217 1576761 1588279 1649219 1207468 1662634 1346342 1537194 1561064 1598838
16535 1598838 1151668 1417873 1552942 1399148 1067442 1498740 1214444 1189323 1455328 1490956
16525 1490956 1060658 1098430 1373504 1248818 1006958 1112719 1068345 1357993 1173077 1310616
16515 1310616 848484 1462820 1306476 1215167 984306 1054780 1084240 1141133 1204558 819165
16505 819165 827047 859389 1382253 1175153 1324833 664769 1034146 1088148 938835 1258978
16495 1258978 1140936 806288 932665 633945 915458 766173 1089417 1087918 802976 604276
$$ packed form
16565B039999n864j88561L81255k02436J82050m34338L86496l73464J72244k0618
16555A936763R5515j18479l06087L31683j41228p985k8551k99216L62084k40572
16545A583927J32290j39456J1518O0940m41751M55166l16292J90852K3870L7774
16535A598838m47170K66205J35069j53794l31706M31298k84296k5121K66005L5628
16525A490956m30298L7772K75074j24686k41860J05761m4374K89648j84916J37539
16515A310616m62132O14336j56344r1309k30861P0474K9460N6893O3425l85393
16505H19165P882L2342N22864k07100J49680o60064L69377N4002j49313L20143
16495A258978j18042l34648J26377k98720K81513j49285L23244j499k84942j98700
$$ plain form
16485 604276 1344180 1315780 507218 647896 965610 850840 832353 653106 1016787 866703
16475 866703 931700 528968 653751 709598 642525 559342 620684 658076 680836 799824 869970
16464 869970 709110 826880 582524 723720 684740 774626 614038 914209 821119 786548
16454 786548 505353 985739 880483 522822 426743 507882 399290 747542 447813 484473
16444 484473 860792 666694 753037 718026 541952 674579 647237 959543 501179 898047
16434 898047 386784 465763 388793 426363 249073 415131 652404 810411 772873 850439
16424 850439 509819 643559 695340 716215 750406 501050 392314 530942 151251 513886
16414 513886 633803 446628 337941 512324 289444 577950 198674 669000 435526 463017
$$ packed form
16485F04276P39904k8400E07218J40678L17714j14770j8487j79247L63681j50084
16475H66703O4997m02732J24783N5847o7073q3183O1342L7392K2760J18988P0146
16464H69970j60860J17770k44356J41196l8980Q9886j60588L00171r3090l4571
16454G86548k81195M80386j05256l57661r6079Q1139j08592L48252k99729L6660
16444D84473L76319j94098Q6343l5011j76074J32627k7342L12306m58364L96868
16434H98047C86784P8979p6970L7570j77290J66058K37273J58007l7538P7566
16424H50439l40620J33740N1781K0875L4191k49356j08736J38628A51251L62635
16414E13886J19917j87175j08687J74383k22880K88506A98674M70326k33474K7491
$$ plain form
16404 463017 107924 636871 580649 825573 326701 675799 256392 309168 467812 313653
16394 313653 171677 450598 448914 551378 401381 619910 792928 271587 27888 239522
16384 239522 102374 410965 451326 350665 280312 432261 499937 193158 219202 335945
16374 335945 504694 324665 410280 351532 454481 377121 274543 85544 26826 378865
16364 378865 86729 323658 71872 -53732 469327 53584 59112 782815 453184 212324 283946
16353 283946 24725 158139 549957 90924 175637 468129 431280 126416 84059 407496
16343 407496 491131 93470 400783 243173 389490 324358 416470 431056 115710 418058
16333 418058 408501 302768 173618 87208 125287 14801 227495 281874 538029 120198 235927
$$ packed form
16404D63017A07924N28947n6222K44924C26701L49098B56392N2776J58644j54159
16394C13653j41976K78921j684J02464j49997K18529J73018B71587B7888K11634
16384B39522A02374L08591M0361j00661p0353J51949O7676A93158K6044J16743
16374C35945J68749j80029Q5615n8748J02949p7360j02578H5544B6826L52039
16364C78865H6729K36929G1872e3732D69327E3584N528P23703l29631B12324P1622
16353B83946B4725J33414L91818I0924Q4713K92492l6849A26416m2357L23437
16343D07496Q3635I3470L07313j57610J46317o5132R2112J4586A15710L02348
16333D18058r557j05733j29150q6410L8079A4801K12694N4379K56155A20198J15729
$$ plain form
16322 235927 114354 60804 313940 308101 254665 360378 126417 246006 502887 314225
16312 314225 -64014 233812 418517 334212 116749 225442 266010 365782 22427 77752 114031
16301 114031 214495 254251 214793 238063 448629 254748 311076 240208 401921 616028
16291 616028 355106 431380 192290 199779 362444 492282 275468 323983 60651 149835 280793
16280 280793 -141815 258827 -76072 258280 -105529 278336 225452 187259 362533 -21934
16269 53182 190470 252075 300187 528168 -185631 166812 141749 -237984 26981 196767
16259 196767 224714 197018 197803 70847 447298 306719 323982 483137 -34878 13932 417406
16248 417406 470585 102786 20222 75859 304601 193752 54362 68018 -21322 -37312 398568
$$ packed form
16322B35927A14354n3550K53136n839n3436J05713A26417J19589K56881j88662
16312C14225f4014B33812J84705q4305A16749J08693M0568R9772B2427N5325L6279
16301A14031J00464L9756l9458K3270K10566j93881N6328p0868J61713K14107
16291F16028k60922P6274A92290P489J62665J29838k16814M8515F0651Q9184J30958
16280B80793a41815B58827g6072B58280a05529B78336n2884l8193J75274b1934
16269E3182J37288O1605M8112K27981a85631A66812k5063b37984B6981J69786
16259A96767K7947k7696P85G0847L76451j40579J7263J59155c4878A3932M03474
16248D17406N3179A02786B0222N5637K28742j10849E4362J3656b1322j5990C98568
$$ plain form
16236 78662 147805 80512 34128 6882 393611 203945 -8972 -56524 11077 -29426 181580
16224 -95557 -94761 21710 203785 188132 190816 148603 93773 533496 60220 328236 104897
16212 -69726 -38019 38980 250961 295685 -112893 445484 -47347 69594 -124071 -46919 47831
16200 52644 222389 401238 14602 12617 55650 413319 -103319 238621 162496 285338 -105316
16188 3698 87766 131505 -226371 70221 212992 85072 175739 61006 187561 -170224 12698
16176 110898 308796 352517 376098 165707 -253365 164940 286035 174116 44987 277452
16166 277452 -113172 151556 210634 60429 -37407 -37237 -170654 -135079 149923 134701 -116675
16154 -65222 430055 96654 313371 235 229825 -140914 -15921 -208384 335334 436455 194782
$$ packed form
16236G8662O9143o7293C4128F882L86729j89666h972m7552A1077b9426A81580
16224i5557P96B1710J82075j5653K684m2213n4830M39723F0220K68016A04897
16212f9726L1707C8980K11981M4724a12893D45484d7347F9594a24071d6919D7831
16200E2644J69745J78849A4602j985M3033L57669a03319B38621p6125J22842a05316
16188C698Q4068M3739b26371G0221J42771H5072R0667F1006J26555a70224A2698
16176A10898J97898M3721K3581A65707b53365A64940J21095j11919D4987K32465
16166B77452a13172A51556N9078F0429c7407J70j33417L5575A49923j5222a16675
16154f5222D30055I6654K16717B35K29590a40914a5921j92463C35334J01121A94782
$$ plain form
16142 -125289 32746 96810 107193 459871 37515 125516 -40570 373628 147759 53775 -76640
16130 -11974 -177229 -86143 217341 -51098 -115898 242766 -284806 -129580 36110 187412
16120 187412 -36548 188543 45599 128748 -42420 276446 -93386 222328 92950 190276 -118762
16108 52670 96670 -313252 119019 27859 -111202 -170661 139676 144356 89635 -25074 330503
16096 203085 233192 225657 262363 -165747 98030 80022 47865 155535 -126208 174241 -34350
16084 98009 -325547 150883 -171069 -153571 184786 -157450 -14982 167357 -167243 -175254
16074 -175254 -190983 74797 1912 -549544 -311122 -23192 215675 89130 414063 -134341 -444690
16063 -444690 183232 -69744 340468 440690 381641 -91937 83631 301416 -8821 113226 -255410
$$ packed form
16142a25289C2746O4064J0383L52678C7515Q8001d0570C73628A47759E3775g6640
16130a1974j65255h6143B17341e1098o4800B42766b84806a29580C6110J51302
16120A87412c6548A88543D5599Q3149d2420B76446i3386B22328I2950R7326a18762
16108E2670M4000c13252A19019B7859a11202n9459A39676M680n4721b5074C30503
16096B03085L0107p535L6706a65747I8030j8008l2157J07670a26208A74241c4350
16084I8009c25547A50883a71069J7498A84786a57450a4982A67357a67243q011
16074a75254j5729G4797A912e49544K38422b3192B15675H9130L24933a34341l10349
16063d44690A83232f9744C40468J00222n9049i1937H3631K17785h821A13226b55410
$$ plain form
16051 -304016 192721 276087 143138 -31546 134215 -83850 283397 103452 1299 -28996 -245694
16040 -245694 124233 -99733 105550 156064 164265 97515 -144137 -75005 61263 -95512 28002
16028 -194240 116613 -19500 -55137 -10217 145420 70308 102665 70840 434559 -57213 83841
16016 -164061 257748 78347 -15064 83195 -31195 -133703 -47004 -34178 82043 -346405 -323686
16005 -323686 8300 -49185 133637 -83034 -117 -197023 296356 -148789 -139984 -464193 -51546
15993 -39638 -13643 63805 -159247 147591 108691 -128290 -7969 -274930 -83205 272454 -191534
15981 -151218 250780 118354 324297 -294396 -205483 171826 -236864 -30898 70652 -34120
15970 -311066 -171746 260842 209154 -141885 189022 195226 10011 19034 178254 25418 -117994
$$ packed form
16051c04016A92721Q3366j32949c1546A34215h3850B83397A03452A299b8996k16698
16040b45694A24233i9733A05550N0514Q201o6750a44137O9132F1263i5512B8002
16028a94240A16613a9500l5637a0217A45420G0308L2357l1825L63719e7213H3841
16016a64061B57748G8347a5064H3195c1195j02508d7004J2826H2043c46405K2719
16005c23686H300d9185A33637h3034a17j96906B96356a48789Q805l24209e1546
15993c9638a3643F3805a59247A47591l8900a28290g969k66961h3205B72454a91534
15981a51218B50780A18354K05943b94396Q8913A71826b36864c0898G0652c4120
15970c11066J39320B60842n1688a41885A89022O204A0011R023J59220B5418a17994
$$ plain form
15958 19701 -303572 -16413 76248 11769 -96732 161458 -188412 -170488 50967 -178521 338655
15946 -112124 -86708 145172 160505 146787 -88148 42441 -128908 -37768 -152948 -13395 -54653
15935 -54653 -116291 -10940 -246476 27236 -77660 -216417 178137 252623 312583 -114796 413483
15923 133902 45822 -83069 -20633 -13054 -43578 127983 -19042 -15757 20627 149602 -160920
15911 147480 52812 119512 63727 -61612 151199 7490 -136953 -69266 254540 217601 102627
15899 332003 -158306 -94395 -317422 -206348 -390703 355498 -66344 -59909 -89151 417636
15888 114104 -166234 134987 53553 -63112 152615 255895 -64998 99907 -149505 -64707
15877 -257754 -74171 -124302 79066 54202 -165831 -261410 -22614 174108 34354 -325613 71038
$$ packed form
15958A9701c03572a6413G6248A1769i6732A61458a88412J7924E0967a78521C38655
15946a12124K5416A45172J5333j3718h8148D2441a28908c7768j15180a3395m1258
15935e4653o1638a0940k35536B7236g7660j38757A78137P4486N9960a14796D13483
15923A33902D5822h3069b0633P579l0524A27983a9042L285B0627J28975a60920
15911A47480E2812O6700n5785f1612A51199G490a36953O7687B54540l6939A02627
15899C32003a58306O3911k23027J11074j84355C55498f6344O435k9242D17636
15888A14104a66234A34987E3553f3112A52615J03280f4998I9907a49505f4707
15877b57754g4171n0131G9066k4864a65831r5579b2614A74108C4354c25613G1038
$$ plain form
15865 104721 5884 -793 102262 197092 63766 39789 4496 224328 180772 69602 -284899 35601
15852 -166092 94832 411375 -241340 -93997 179305 -123567 -340136 -11177 -368575 -226432
15842 -226432 -339328 286658 -284071 -20807 -222150 -293026 -2994 112843 -227318 -131221
15832 -131221 -190258 -102453 -116100 -13406 -353098 -67329 -279451 -65635 -6280 3820 -203394
15820 -323404 -157011 -53981 -94402 182087 -411986 42535 76989 -69715 -430271 -52687 88537
15808 -355441 228395 104753 -505115 -150688 -172987 -241206 -41081 56732 94925 -65616 -24478
15796 -252807 92467 76901 -299882 -54301 -30246 -97553 147269 -213598 25100 -213402 169243
15784 -249255 -172659 -138799 -153878 -272889 98376 -37923 39576 -110212 -39095 -247689 -149399
$$ packed form
15865A04721E884g93A02262R4830F3766k3977D496K19832m3556F9602b84899C5601
15852a66092I4832L16543b41340i3997A79305a23567k16569a1177l57398J42143
15842b26432j12896B86658b84071b0807k01343p0876b994A12843b27318R6097
15832a31221n9037Q7805j3647a3406l39692f7329k12122f5635f280C820b03394
15820c23404a57011e3981m0421A82087d11986D2535L4454f9715l60556e2687H8537
15808c55441B28395A04753e05115a50688k2299o8219d1081E6732L8193f5616b4478
15796b52807I2467j5566b99882e4301K4055o7307A47269b13598B5100b13402A69243
15784b49255P6596L3860j5079j19011I8376c7923C9576a10212c9095k08594R8290
$$ plain form
15773 -149399 -130181 -206371 244300 -47337 -8111 68242 -62305 69170 -91764 48953 -156711
15761 -176703 61757 -97211 80188 105707 -96783 -82253 31634 -129430 56059 -430651 -104171
15749 -18224 69794 -87271 112628 -224944 66666 -55201 -11739 -82490 -16498 -119237 -249931
15738 -249931 -18963 -88808 92789 117171 17363 -310175 -99290 60366 66900 -23153 198968
15726 -54183 -66423 -49495 -270211 -210665 -166504 -6558 -71206 105666 139007 -239519 -2273
15714 -388037 -77958 227616 251229 43269 -58113 -17340 -137421 -93376 -113124 15826 322008
15703 322008 -206093 42001 145255 -94005 151807 211596 -26479 94985 -245812 -88193 30903
15691 -2972 11839 -132368 39867 -40792 418227 148316 -126079 86630 77704 -67106 218380
$$ packed form
15773a49399J9218p6190B44300d7337h111F8242f2305F9170i1764D8953a56711
15761a76703F1757i7211H0188K5519i6783J4530C1634a29430E6059d30651a04171
15749a8224F9794h7271A12628b24944F6666e5201a1739p0751a6498j02739j30694
15738b49931a8963o9845I2789K4382A7363c10175i9290F0366O534b3153A98968
15726e4183j2240J6928k20716N9546M4161f558o4648A05666L3341b39519b273
15714c88037g7958B27616K3613D3269e8113a7340j20081M4045j9748A5826L06182
15703C22008b06093D2001J03254i4005A51807N9789b6479I4985b45812h8193C0903
15691b972A1839a32368C9867d0792D18227A48316a26079H6630q926f7106B18380
$$ plain form
15679 -106003 -212009 121474 74291 99749 -35416 9648 237705 -90308 -103828 -70370 106871
15667 10116 158563 -336170 -122222 192601 138924 48746 -3632 -106342 -163634 111923 -30183
15655 180263 251584 -160254 -15693 50072 19410 -66148 -116701 -234266 198345 70837 -188839
15643 -17706 -206886 319733 130047 -53717 -587 -45384 -115286 -288100 -96299 -103650 178758
15631 -252506 35616 25061 -337285 -28503 104785 -2883 88833 -177527 31510 -40155 -205429
15620 -205429 -99765 -34459 -260458 114122 -399934 -235132 -152051 132690 -199462 143245
15609 35089 -339151 49843 123144 -134230 -45199 7224 -165491 -64506 -89862 19656 -71398
15597 78938 313064 5295 -112569 5619 -307717 30399 -71461 125826 -232937 81765 49583
$$ packed form
15679a06003j06006A21474m7183K5458c5416I648K28057i0308j3520L3458A06871
15667A0116J48447c36170a22222A92601n3677D8746c632j02710n7292A11923c0183
15655A80263P1321a60254a5693E0072A9410f6148n0553j17565A98345G0837a88839
15643a7706j89180C19733A30047e3717e87m4797o9902j72814i6299p351A78758
15631b52506C5616j0555c37285b8503A04785b883H8833a77527C1510d0155j65274
15620b05429i9765c4459k25999A14122c99934J64802Q3081A32690a99462A43245
15609C5089c39151D9843P3301a34230d5199G224a65491f4506k5356A9656g1398
15597G8938K34126E295a12569E619c07717C0399g1461A25826b32937H1765l2182
$$ plain form
15586 49583 268300 -259157 201960 223774 -84799 95089 73138 -173292 106691 9519 165283
15575 165283 -58671 69985 68659 155191 -30381 146801 -140729 279462 12968 -184308 -216816
15564 -216816 145208 95898 9775 -59991 114527 -128664 145864 73907 81239 -238497 77589
15552 -440715 -94907 -342257 -122983 564870 -205662 -66051 -43867 31426 -210466 -113859
15542 -113859 216532 -151086 -219258 97632 205872 15214 -162440 141492 -141098 205725
15531 29161 -48252 -329365 -128259 -33043 -93047 -332853 -347163 4480 -86420 201753 76214
15519 -212438 11036 25301 104299 62701 -285594 -22262 153542 266294 -441256 49524 229442
15508 229442 -116380 24215 167292 -49835 -320231 -373975 43522 422165 53039 -139391
$$ packed form
15586D9583K18717b59157B01960K1814h4799I5089k1951a73292A06691I519J55764
15575A65283e8671F9985j326Q6532c0381A46801a40729B79462A2968a84308l2508
15564b16816A45208m9310I775e9991A14527a28664A45864p1957P332b38497G7589
15552d40715i4907k47350a22983E64870b05662f6051K2184C1426b10466R6607
15542a13859B16532a51086o8172I7632J08240A5214a62440A41492a41098B05725
15531B9161d8252k81113a28259c3043o0004k39806j4310D480h6420B01753G6214
15519b12438A1036J4265P8998m1598b85594b2262A53542J12752d41256D9524J79918
15508B29442a16380B4215J43077d9835k70396n3744D3522L78643E3039a39391
$$ plain form
15497 12164 -72446 -332546 -73653 -215379 175641 4049 114093 140572 76771 439147 204123
15485 -129063 53063 147962 -8347 -49343 80377 152310 76169 210042 -297491 10540 332510
15474 332510 33403 -29778 1753 -114005 -97159 33357 -95413 -410359 -44758 -126307 174769
15462 -74750 62972 -216064 210767 287383 180918 -135488 12479 52406 168919 -26333 26778
15450 -90652 215478 -139457 -2360 20 -17793 42069 -105676 -196583 420550 185560 70297
15438 -207805 -71165 112915 536039 50004 162593 8050 177893 135236 -38331 84940 -37541
15426 -231162 -203832 -181549 49924 -200994 180121 -42417 -10709 228044 90381 30257 -100090
15414 131406 -240863 97613 268596 341016 -63307 163371 30944 352399 -299735 -128209
$$ packed form
15497A2164g2446k60100g3653j41726A75641D049J10044K6479o3801L62376B04123
15485a29063E3063R4899h347m0996H0377P1933p6141J33873b97491A0540L21970
15474C32510C3403b9778A753a14005J6846C3357i5413l14946d4758q1549A74769
15462g4750F2972b16064B10767P6616j06465a35488A2479L9927J16513b6333B6778
15450i0652B15478a39457b360B0a7793D2069a05676r0907D20550A85560G0297
15438b07805g1165A12915M23124E0004J12589H050J69843m2657c8331H4940c7541
15426b31162K7330K2283D9924b00994A80121d2417a0709B28044I0381C0257a00090
15414A31406b40863I7613J70983P2420f3307A63371C0944L21455b99735a28209
$$ plain form
15403 35932 -58207 73370 -29337 115407 -227739 -219541 11417 -70428 16226 32989 -106806
15391 134212 -184666 -57716 -216684 -8092 -377347 -260794 -110982 198915 -177628 282525
15380 -88558 -273861 -84311 188751 28657 5075 -45791 -352762 255133 103358 -219348 -64531
15368 47726 -44105 159892 50217 -88335 -289634 -75936 90971 112299 20583 -25047 -80928
15357 -80928 88409 1960 -103304 79217 33999 13045 98086 177152 -87925 -186264 -14985 206590
15344 53252 -293762 -160752 149714 -79087 121889 -63361 -10225 160837 -48039 -426667
15334 -426667 295100 -16197 9205 173129 180674 -4814 -102705 -103198 75594 -57570 271390 140078
15322 140078 -11799 189373 56444 -83357 -5019 -242364 200396 -130803 80211 25414 -74059
$$ packed form
15403C5932e8207G3370b9337A15407b27739Q198A1417g0428A6226J6763a06806
15391A34212a84666e7716j58968h092l69255J16553a10982A98915a77628B82525
15380h8558j85303h4311A88751B8657E075d5791l06971B55133A03358b19348f4531
15368D7726d4105A59892E0217h8335k01299g5936I0971K1328B0583b5047n5881
15357h0928H8409A960a03304G9217C3999A3045Q5041P9066h7925r8339a4985B06590
15344E3252b93762J33010A49714g9087A21889f3361a0225A60837d8039l78628
15334d26667B95100a6197I205J63924P545d814r7891m93G5594e7570B71390j31312
15322A40078a1799A89373E6444h3357e019k37345B00396a30803H0211B5414g4059
$$ plain form
15310 271 -38972 259406 84072 -67461 310652 52526 269206 -98143 263652 -79281 -32643
15298 209211 3251 -56597 181147 5260 210849 44754 199298 -337634 14641 -298956 10573
15286 127044 272679 240231 56404 68317 53384 133472 193393 52203 71476 62494 -213453
15274 64573 290038 78805 185431 -162101 144546 -149372 162507 -133636 210414 340515
15264 340515 -135996 -136328 -70347 -12263 14038 100888 192529 182613 -137441 45177 166166
15253 166166 36020 -89904 316175 321192 164146 126789 523543 -9835 13482 155205 461300
15242 461300 133199 -456 -217816 -87278 -88635 314325 30690 -87048 -171584 -104100 -66846
15231 -66846 -200637 21108 -270625 -219016 180680 30625 302816 56724 -346574 166836
$$ packed form
15310B71c8972B59406H4072f7461C10652E2526K16680i8143B63652g9281c2643
15298B09211C251e6597A81147E260K05589D4754J54544c37634A4641b98956A0573
15286A27044J45635l2448E6404J1913j4933Q0088N9921E2203J9273q982b13453
15274F4573K25465G8805J06626a62101A44546a49372A62507a33636B10414J30101
15264C40515a35996l32O5981a2263A4038Q6850R1641r916a37441D5177J20989
15253A66166C6020h9904C16175N017j57046l7357L96754i835A3482J41723L06095
15242D61300A33199d56k17360h7278j357C14325C0690h7048q4536O7484L7254
15231f6846j33791B1108b70625N1609A80680C0625K72191E6724c46574A66836
$$ plain form
15220 189167 -110336 10328 -53442 -38098 597541 340269 62154 71507 -127834 -92042 65495
15208 93854 359255 16581 76195 59481 74794 83991 -193967 45106 -110907 73519 185699
15197 185699 -92515 206848 71618 191030 -33767 84296 331332 237595 30773 -229758 -14792
15185 -95183 130747 11670 411384 -227857 -48299 175231 -93477 -134411 91008 121929 78610
15174 78610 193651 210653 308511 -80835 -282742 105259 88341 154641 253945 170020 162336
15163 162336 414514 292545 349291 101959 142700 275786 75680 -147785 162423 52440
15152 143363 314025 -179126 354818 30791 2610 -12243 -56371 145143 34762 -90576 422831
15140 293597 167583 69224 251801 89210 -31941 139216 555003 219786 25318 -141074
$$ packed form
15220A89167a10336A0328e3442J5344E97541k57272F2154R353a27834L5792F5495
15208I3854K65401A6581N9614j6714J5313R197a93967D5106a10907G3519J12180
15197A85699i2515B06848G1618J19412c3767H4296K47036r3737C0773b29758a4792
15185i5183A30747A1670L99714b27857d8299A75231i3477m0934I1008L0921m3319
15174G8610J15041J7002R7858h0835k01907A05259j6918O6300R9304q3925p684
15163A62336K52178j21969N6746A01959M0741J33086G5680a47785A62423E2440
15152A43363J70662a79126C54818C0791B610a2243m4128A45143C4762i0576D22831
15140B93597j26014F9224J82577H9210c1941A39216M15787B19786B5318a41074
$$ plain form
15129 225922 81042 -5793 341747 439157 407723 560728 86357 362750 -22910 -52998 146087
15117 -27761 336699 26680 -21965 93451 -285240 -156278 55866 -249904 175721 -17861 98060
15105 25634 56203 127291 34995 3800 -212081 45929 150253 172060 117992 282655 81089
15093 59397 365037 -7702 78763 123127 7099 187159 461578 109785 162103 81978 30698
15081 115143 -144694 59479 -126264 -125770 -181148 -180864 374265 123036 146093 406828 124923
15069 247243 148908 370898 375217 88056 63898 142696 202555 148484 18620 73063 245542
15058 245542 26092 -93323 228035 135210 30573 46067 18702 187189 203410 337916 330934
15047 330934 137693 104700 8878 213325 505846 220232 385032 124345 253895 420164
$$ packed form
15129B25922H1042e793C41747R7410l1434J53005H6357K76393b2910l0088A46087
15117b7761C36699B6680b1965I3451b85240J28962E5866b49904A75721a7861I8060
15105B5634L0569P1088C4995C800b12081D5929J04324K1807n4068J64663H1089
15093E9397L05640g702G8763M4364G099J80060K74419A09785N2318q0125C0698
15081A15143a44694E9479a26264M94n5378K84C74265A23036K3057K60735A24923
15069B47243r8335K21990M319H8056k4158P8798N9859n4071A8620N4443J72479
15058B45542B6092i3323B28035r2825C0573J5494A8702J68487J6221J34506o982
15047C30934A37693l2993H878K04447K92521B20232J64800A24345J29550J66269
$$ plain form
15037 420164 127423 198994 326538 152414 18968 139963 370555 136067 473073 149100
15026 164194 -130068 -86274 148826 337038 313555 629242 -63123 -107843 193338 290399
15016 290399 10138 144798 -271404 457368 -206071 376413 228271 237399 216351 -42534
15005 383538 195896 313301 -221067 235906 99182 166049 98273 347919 81851 353321
14995 353321 115416 411896 359152 -70932 71491 212890 -273510 149584 103997 283169
14985 283169 116563 66412 281967 254120 155767 99821 170712 34510 317997 -272779 602425
14973 369123 -207071 253858 419297 147220 643787 340565 -132749 181942 257418 513314
14963 513314 161405 30659 284006 442357 382724 218398 261399 -49663 44170 342216
$$ packed form
15037D20164A27423P1571J27544A52414A8968J20995K30592A36067L37006A49100
15026A64194a30068M3794A48826J88212k3483L15687f3123m4720A93338R7061
15016B90399A0138J34660b71404D57368b06071C76413j48142R128k1048d2534
15005C83538j87642J17405b21067B35906I9182O6867o7776K49646H1851K71470
14995C53321A15416K96480n2744g0932G1491J41399b73510A49584m5587J79172
14985B83169A16563n0151K15555k7847r8353n5946P0891C4510K83487b72779F02425
14973C69123b07071B53858J65439A47220M96567l03222a32749A81942P5476K55896
14963E13314A61405C0659K53347J58351n9633j64326M3001d9663D4170K98046
$$ plain form
14953 342216 212153 99279 312297 557260 542718 568859 303575 308486 312709 642736 423279
14942 423279 524827 303818 14312 393841 399820 297485 204461 554736 402279 326043
14932 326043 369840 135543 310489 32668 92510 577822 182476 162483 285614 379959
14922 379959 349938 495532 439557 545093 635680 524006 252289 127550 384342 264692
14912 264692 220483 248123 268359 494975 293571 65456 590635 212289 179578 357650
14902 357650 263094 457629 413280 197305 20098 512452 449906 -152382 424937 40087
14891 428297 185399 519937 417964 148789 383218 109547 134727 223814 153591 461948
14881 461948 374709 362972 379260 273084 452315 335070 377758 425203 308690 315854 430190
$$ packed form
14953C42216j30063I9279K13018K44963j4542K6141k65284M911M223L30027k19457
14942D23279J01548k21009A4312L79529N979j02335r3024L50275j52457p6236
14932C26043M3797A35543J74946C2668N9842M85312A82476j9993J23131R4345
14922C79959l0021J45594n5975J05536R0587j11674B52289j24739K56792j19650
14912B64692m4209K7640K0236K26616k01404F5456N25179B12289l2711J78072
14902C57650r4556J94535m4349A97305B0098M92354o2546a52382D24937D0087
14891D28297A85399L34538j01973A48789K34429A09547K5180Q9087p0223L08357
14881D61948q7239j1737J6288j06176J79231j17245M2688M7445j16513P164J14336
$$ plain form
14870 430190 518397 262767 342656 215311 136448 399716 353097 15245 296426 221793 534915
14859 534915 199641 157866 621058 148517 338885 273125 520384 477498 223165 300180
14849 300180 431523 811482 509893 544534 254244 753925 603002 357866 206180 739256
14839 739256 301567 350911 709106 537604 502061 530659 342331 98798 359996 537886
14829 537886 602342 474773 282741 578724 144568 591677 370572 246563 641437 352073
14819 352073 389827 380418 266786 401140 622555 337863 361929 251627 228925 570387
14809 570387 330827 625722 494643 562902 455354 446865 435716 522666 711480 493419
14799 493419 841565 538436 449257 536870 661189 538277 418910 880074 546465 315995
$$ packed form
14870D30190Q8207k55630P9889j27345p8863K63268m6619A5245K81181p4633L13122
14859E34915A99641m1775M63192A48517J90368o5760K47259m2886B23165P7015
14849C00180J31343L79959l01589L4641B54244M99681j50923k45136j51686N33076
14839G39256C01567M9344L58195j71502l5543K8598j88328I8798K61198J77890
14829E37886O4456j27569j92032K95983A44568M47109k21105j24009L94874k89364
14819C52073L7754r409j13632J34354K21415k84692K4066j10302k2702L41462
14809E70387k39560K94895j31079O8259j07548q489j1149Q6950J88814k18061
14799D93419L48146l03129q9179Q7613J24319j22912j19367M61164l33609k30470
$$ plain form
14789 315995 537218 480495 597604 599839 636652 691904 723944 604308 818387 597894 614680
14778 614680 979862 571343 394221 617112 630805 793196 828763 808351 628319 556442
14768 556442 838625 666565 431183 608472 492559 547647 326290 663718 614508 800342
14758 800342 654681 668062 638214 503803 686400 687642 541367 342698 917983 814850
14748 814850 626662 353275 737583 770633 786519 765765 932403 763114 618483 640977
14738 640977 652618 483724 692621 684919 664880 499510 793865 785739 754050 619241 1094704
14727 1094704 835958 854286 730639 787398 623145 1051853 523097 808272 540618 805613
14717 805613 834978 804847 956074 574133 935498 934290 589886 826246 898815 854771 799910
$$ packed form
14789C15995K21223n6723J17109K235L6813N5252L2040j19636K14079k20493J6786
14778F14680L65182m08519j77122K22891J3693J62391L5567k0412j80032p1877
14768E56442K82183j72060k35382J77289j15913N5088k21357L37428m9210J85834
14758H00342j45661J3381k9848j34411J82597J242j46275j98669N75285j03133
14748H14850j88188k73387L84308L3050J5886k0754J66638j69289j44631K2494
14738F40977J1641j68894K08897p702k0039j65370K94355q126l1689j34809M75463
14727A094704k58746J8328j23647N6759j64253M28708E23097K85175k67654K64995
14717H05613K9365l0131J51227l81941L61365j208l44404K36360P2569m4044n4861
$$ plain form
14706 799910 865251 1019589 815492 555239 1285386 772217 609916 644236 751413 785541
14696 785541 1049296 672007 1189868 960297 1026112 815432 1066797 1030210 904907 844831
14686 844831 588300 1094735 982172 1044082 952928 1049120 1159806 970178 858434 1018764
14676 1018764 872872 1013508 981202 1008441 1203418 875174 1078609 952645 891788 1134876
14666 1134876 906301 1132333 920605 983328 1272243 1234103 919657 1003132 1147811 1174757
14656 1174757 1204261 989422 1316525 1214646 1258437 1289037 1081878 1283218 878440 835707
14646 835707 954236 1249402 1548165 1513450 1330642 1255425 1640046 1233132 1289360 1252628
14636 1252628 1161928 1269010 1178612 1155699 1314972 1204203 1295782 1358383 1522344 1393097
$$ packed form
14706G99910O5341J54338k04097k60253P30147n13169j62301L4320J07177L4128
14696G85541K63755l77289N17861k29571O5815k10680K51365l6587j25303o0076
14686H44831k56531N06435j12563O1910r1154R6192J10686j89628j11744J60330
14676A018764j45892J40636l2306K7239J94977l28244K03435j25964o0857K43088
14666A134876k28575K26032k11728O2723K88915l8140l14446Q3475J44679K6946
14656A174757K9504k14839L27103j01879M3791L0600k07159K01340m04778m2733
14646H35707J18529K95166K98763l4715j82808p5217L84621m06914N6228l6732
14636A252628r0700J07082r0398k2913J59273j10769R1579O2601J63961j29247
$$ plain form
14626 1393097 1184396 1393805 1426433 1427842 1407990 1261745 1354520 1492197 1495092 1398638 1445761
14615 1445761 1630386 1356065 1914794 1441824 1524336 1394596 1512808 1508075 1747680 1564225
14605 1564225 1654830 1431241 1849401 1660033 1687382 1579559 1879419 1628965 1849271 1838334
14595 1838334 1601910 1898577 1927704 1513323 1948796 2097480 2071491 1928001 1750112 2045124
14585 2045124 1698029 1802814 1890614 1917734 2432285 2053381 1739837 2132310 2220386 2391576
14575 2391576 1991292 1950825 1946985 2291376 2222675 2149117 2743667 2750477 2257485 2618306 2396446
14564 2396446 2920480 2662386 2936881 2839286 2841580 2881303 3431790 2913727 3504302 3320522
14554 3320522 4120430 4012605 4610365 5401043 6673722 9976862 15247552 21187680 27982445
$$ packed form
14626A393097k08701K09409L2628J409j9852j46245R2775J37677K895r6454M7123
14615A445761J84625k74321N58729m72970Q2512j29740J18212m733K39605j83455
14605A564225R0605k23589M18160j89368K7349j07823K99860k50454K20306j0937
14595A838334k36424K96667K9127m14381M35473J48684k5989j43490j77889K95012
14585B045124l47095J04785Q7800K7120N14551l78904l13544L92473Q8076J71190
14575B391576m00284m0467l840L44391o8701p3558N94550O810m92992L60821k21860
14564B396446N24034k58094K74495r7595K294L9723N50487n18063N90575j83780
14554C320522P99908j07825N97760P90678J272679L303140N270690N940128O794765
$$ plain form
14545 27982445 29154159 20838793 11446083 6209561 4140477 3137943 3059425 2930422
14537 2930422 2215117 2443961 2161394 2121350 2301666 2310782 2045824 2386441 2430516 2129630
14527 2129630 1979390 2440299 2468355 2427703 2624878 2513177 2162735 2694278 2714482 2858922
14517 2858922 2478736 2527536 2455691 2684306 2722705 3083111 2960635 2870010 2915846 2896058
14507 2896058 3063274 3262567 3014341 3188538 3294552 3203093 3340764 3192105 3461071 3446052
14497 3446052 3262525 3194079 3558764 3505189 3218225 3358522 3448067 3880643 3960639 3941031
14487 3941031 3456820 3823804 3729480 3732880 3801303 4160818 4208894 3878541 4665522 4189961
14477 4189961 4488875 4242489 4395069 4314947 4295213 4095261 4317673 4696225 4687493 4474786
$$ packed form
14545B7982445J171714q315366r392710n236522k069084j002534p8518j29003
14537B930422p15305K28844k82567m0044J80316R116k64958L40617M4075l00886
14527B129630j50240M60909K8056m0652J97175j11701l50442N31543K0204J44440
14517B858922l80186M8800p1845K28615L8399L60406j22476r0625M5836j9788
14507B896058J67216J99293k48226J74197J06014r1459J37671j48659K68966j5019
14497C446052j83527o8446L64685n3575k86964J40297Q9545M32576P9996j9608
14487C941031m84211L66984r4324L400O8423L59515M8076l30353P86981m75561
14477D189961K98914k46386J52580q0122j9734j99952K22412L78552q732k12707
$$ plain form
14467 4474786 4479560 4820511 4811601 4624621 4790404 4879099 5239044 5189434 5138765 4837168 5067042
14456 5067042 5670151 5100536 5426992 5500301 5721255 5637993 5880188 5641594 5755378 5894561
14446 5894561 6086807 6174368 6302708 5912242 5847285 6330174 6094397 6683102 6496372 6756999
14436 6756999 6577474 6799607 6663746 6881582 6962485 6951199 6786158 7302261 7481438 7632712
14426 7632712 7809771 7260261 7710833 8131162 7996475 8229529 8094376 8001001 8817824 8765256
14416 8765256 8754214 9275195 9127377 9118766 8945822 9066654 9343436 9413815 9940682 9711232
14406 9711232 9937857 10243104 10249124 10400608 10345820 10704384 10861918 10932207 10950793 11666045
14396 11666045 11219266 11645517 11756074 11894911 11997241 12417825 12721923 13150950 13487862
$$ packed form
14467D474786M774L40951q910j86980J65783Q8695L59945m9610n0669l01597K29874
14456E067042O03109n69615L26456P3309K20954q3262K42195k38594J13784J39183
14446E894561J92246Q7561J28340l90466o4957M82889k35777N88705j86730K60627
14436F756999j79525K22133j35861K17836Q0903j1286j65041N16103J79177J51274
14426G632712J77059n49510M50572M20329j34687K33054j35153r3375Q16823n2568
14416H765256j1042N20981j47818q611j72944J20832K76782P0379N26867k29450
14406I711232K26625L05247O020J51484n4788L58564J57534P0289J8586P15252
14396A1666045m46779M26251J10557J38837J02330M20584L04098M29027L36912
$$ plain form
14387 13487862 13792068 13545820 14208119 14251344 14277799 14834460 14715278 15193455 15506685 15511950
14377 15511950 16099462 16247938 16446053 16637850 17293169 17902081 17937653 18234788 18343501
14368 18343501 18820665 19147057 19869426 20370839 20653160 20925153 21671308 22200964 22439958
14359 22439958 22959071 23182463 23664847 24450449 25101512 25790100 26397901 27066192 27829695
14350 27829695 28460012 28783855 29631566 30321431 31328921 32171893 32726428 33714570 34668951
14341 34668951 35455942 36528102 37109579 38502164 39369048 40477515 41853934 43115212
14333 43115212 44309241 45820973 47147240 48605173 50077949 51311528 53213074 54664090
14325 54664090 56275743 58116091 60246516 62294812 64425552 66474364 68461118 71173140
$$ packed form
14387A3487862L04206k46248O62299M3225K6455N56661j19182M78177L13230N265
14377A5511950N87512J48476J98115J91797O55319O08912L5572K97135J08713
14368A8343501M77164L26392P22369N01413K82321K71993P46155N29656K38994
14359B2439958N19113K23392M82384P85602O51063O88588O07801O68291P63503
14350B7829695O30317L23843Q47711O89865J007490Q42972N54535R88142R54381
14341C4668951P86991J072160N81477J392585Q66884J108467J376419J261278
14333D3115212J194029J511732J326267J457933J472776J233579J901546J451016
14325E4664090J611653J840348K130425K048296K130740K048812J986754K712022
$$ plain form
14317 71173140 74025146 76233576 78961346 82100462 85091964 88850279 92075555 95507820
14309 95507820 99160198 103430421 107295853 111848697 116879381 121649914 126692546 132247289
14301 132247289 138277812 144541122 150624132 157783893 165185599 172993532 181187231 189383433
14293 189383433 198637959 207980679 218150847 228716433 239637055 251397066 263259693
14286 263259693 276257124 289359080 302990751 317024740 331013166 345607939 360033865
14279 360033865 374678973 388961858 402073685 414374581 424970475 431070393 432764666
14272 432764666 431906727 431444368 433808527 433884633 433306939 432205099 428399121 420595682 410414185
14263 410414185 399793178 388058888 375708603 363029807 350344484 336492759 322414165
$$ packed form
14317G1173140K852006K208430K727770L139116K991502L758315L225276L432265
14309I5507820L652378M270223L865432M552844N030684M770533N042632N554743
14301A32247289O030523O263310O083010P159761P401706P807933Q193699Q196202
14293A89383433R254526R342720J0170168J0565586J0920622J1760011J1862627
14286B63259693J2997431J3101956J3631671J4033989J3988426J4594773J4425926
14279C60033865J4645108J4282885J3111827J2300896J0595894O099918J694273
14272D32764666q57939m62359K364159P6106n77694j101840l805978p803439j0181497
14263D10414185j0621007j1734290j2350285j2678796j2685323j3851725j4078594
$$ plain form
14256 322414165 308034067 293666596 279549832 265986879 253077431 240161210 228274889
14249 228274889 216522112 205563881 195414385 185342298 176426182 167682132 159732442
14242 159732442 152196882 144686803 138367405 132078255 126041652 120490103 115212489 110342248
14234 110342248 105235998 101039180 96832306 93208966 89611724 85969381 82407152 79323294
14226 79323294 76088073 73638264 70676110 68681512 65961780 63466816 61597111 59428703
14218 59428703 57277150 55389466 53683526 51857123 50156042 49073924 47410669 45981132
14210 45981132 44601838 43017598 42341990 41090977 40281046 39118809 37669549 36492923
14202 36492923 35651545 34867946 33870140 32992389 32225142 31364312 30603930 29451324 29034644
$$ packed form
14256C22414165j4380098j4367471j4116764j3562953j2909448j2916221j1886321
14249B28274889j1752777j0958231j0149496j0072087q916116q744050p949690
14242A59732442p535560p510079o319398o289150o036603n551549n277614m870241
14234A10342248n106250m196818m206874l623340l597242l642343l562229l083858
14226G9323294l235221k449809k962154j994598k719732k494964j869705k168408
14218E9428703k151553j887684j705940j826403j701081j082118j663255j429537
14210D5981132j379294j584240o75608j251013q09931j162237j449260j176626
14202C6492923q41378p83599r97806q77751p67247q60830p60382j152606m16680
$$ plain form
14193 29034644 28330949 27450083 26692166 26270755 25703067 25068004 24545908 24061377 23333717
14184 23333717 22647406 22403704 21926824 21554532 20972733 20821197 20114692 19793751 19381096
14175 19381096 18891771 18831894 18402341 17713228 17573631 17458879 17193688 16405484 16291492
14166 16291492 16073498 15968707 15320135 15555592 14717032 14527165 14442240 14102111 13616952
14157 13616952 13490750 13330376 13465353 12715533 12717383 12606650 12221224 11763839 11836096 11690793
14147 11690793 11615499 11426267 11193151 10828611 10659046 10386153 10327177 10101615 10142483 10336742
14137 10336742 9907586 9538758 9577134 9204823 9142837 8848129 8939671 8871438 8743969 8467483
14127 8467483 8590586 8485858 7985501 8082954 8184227 7674895 7681176 7767864 7883802 7202853
$$ packed form
14193B9034644p03695q80866p57917m21411n67688o35063n22096m84531p27660
14184B3333717o86311k43702m76880l72292n81799j51536p06505l20941m12655
14175A9381096m89325n9877m29553o89113j39597j14752k65191p88204j13992
14166A6291492k17994j04791o48572K35457q38560j89867q4925l40129m85159
14157A3616952j26202j60374J34977p49820J850j10733l85426m57385P2257j45303
14147A1690793p5294j89232k33116l64540j69565k72893n8976k25562M0868J94259
14137A0336742m29156l68828L8376l72311o1986k94708R1542o8233j27469k76486
14127H467483J23103j04728n00357R7453J01273n09332O281Q6688J15938o80949
$$ plain form
14117 7202853 7185163 7257986 7170472 7056083 7143590 6906433 6662894 6662678 6621734 6686132 6749261
14106 6749261 6413964 6183166 6574277 6190639 5972060 6033093 5809545 6017408 5833917 5433279
14096 5433279 5711796 5907302 5802090 5381490 5611814 5760771 5276986 5212880 5061440 5219560
14086 5219560 5041683 4945056 5164412 5059033 5089459 4618127 4438954 4645146 4636698 4922023
14076 4922023 4614898 4942162 4515563 4165287 4395369 4324718 4003554 4174687 3895884 3927533
14066 3927533 4263662 3787523 3840111 4098471 3933766 3783105 4161015 3736290 3686809 3888057
14056 3888057 3847323 3792998 3804459 3812896 3746735 3682972 3580498 3251823 3448149 3301649 3388916
14045 3388916 3086529 3316717 3231740 3055443 2853323 3261412 3134570 3212901 3104161 3030285
$$ packed form
14117G202853j7690P2823q7514j14389Q7507k37157k43539k16m0944O4398O3129
14106F749261l35297k30798L91111l83638k18579O1033k23548K07863j83491m00638
14096E433279K78517J95506j05212m20600K30324J48957m83785o4106j51440J58120
14086E219560j77877r6627K19356j05379L0426m71332j79173K06192q448K85325
14076D922023l07125L27264m26599l50276K30082p0651l21164J71133k78803L1649
14066C927533L36129m76139N2588K58360j64705j50661L77910m24725m9481K01248
14056C888057m0734n4325J1461Q437o6161o3763j02474l28675J96326j46500Q7267
14045C388916l02387K30188q4977j76297k02120M08089j26842P8331j08740p3876
$$ plain form
14035 3030285 2913130 2888444 2901524 3132795 2894311 2928582 2835964 2754752 3080475 2808520
14025 2808520 3071846 2805353 2731826 2929587 2787413 2574591 2756185 2588037 2564160 2645223
14015 2645223 2433272 2311304 2935528 2683374 2279504 2188641 2419545 2505728 2479039 2403362
14005 2403362 2453035 2261694 2288682 2243941 2286342 2325267 2200161 2277105 2011401 2285925
13995 2285925 2203187 2473440 2204167 2486518 2892055 3789384 6403297 10694098 17347949
13986 17347949 24905528 29917448 24464542 15328401 9348616 6514784 5342865 4032248
13978 4032248 4144117 3639751 3167826 2908531 2745458 2857792 2455223 3008466 2404923
13969 2404923 2338021 2393954 1876009 2108702 1857519 2427143 2092743 2201816 2302832 2043153
$$ packed form
14035C030285j17155k4686J3080K31271k38484L4271r2618q1212L25723k71955
14025B808520K63326k66493p3527J97761j42174k12822J81594j68148k3877Q1063
14015B645223k11951j21968O24224k52154m03870r0863K30904Q6183k6689p5677
14005B403362M9673j91341K6988m4741M2401L8925j25106P6944k65704K74524
13995B285925q2738K70253k69273K82351M05537Q97329K613913M290801O653851
13986A7347949P557579N011920n452906r136141n979785k833832j171919j310617
13978D032248J11869n04366m71925k59295j63073J12334m02569N53243o03543
13969B404923o6902N5933n17945K32693k51183N69624l34400J09073J01016k59679
$$ plain form
13959 2043153 2041339 1993821 2095148 1890783 1961597 2452899 2028937 1699791 1929074 1861650
13949 1861650 1967662 1908544 1790877 1634520 1717806 1875006 1742347 1861151 1814764 1565222
13939 1565222 1867159 1675854 1433430 1764534 1693153 1376699 1428199 1724994 1607329 1623295
13929 1623295 1803519 1739196 1218813 1425665 1657150 1657785 1455944 1415911 1897007 1451839
13919 1451839 1418711 1675390 1502975 1306078 1657700 1606174 1384194 1644911 1187965 1334563
13909 1334563 1267143 1395967 1307107 1604768 1031807 1384949 1682825 1337262 1211859 1777069
13899 1777069 1245956 1068267 1297465 1754564 1318495 1131320 1186470 1279752 1578821 1445139
13889 1445139 883875 1136550 1138363 1353048 1463682 1646766 906423 1261518 1209284 1471728
$$ packed form
13959B043153j814m7518J01327k04365P0814M91302m23962l29146K29283o7424
13949A861650J06012n9118j17667j56357Q3286J57200j32659J18804m6387k49542
13939A565222L01937j91305k42424L31104p1381l16454N1500K96795j17665J5966
13929A623295J80224o4323n20383K06852K31485O35k01841m0033M81096m45168
13919A451839l3128K56679j72415j96897L51622n1526k21980K60717m56946J46598
13909A334563o7420J28824q8860K97661n72961L53142K97876l45563j25403N65210
13899A777069n31113j77689K29198M57099m36069j87175N5150R3282K99069j33682
13889A445139n61264K52675J813K14685J10634J83084p40343L55095n2234K62444
$$ plain form
13879 1471728 1070948 1057406 1399295 1529752 1073372 1315125 1027680 999084 1089228 927147
13869 927147 1108152 1189338 1441220 892216 1178013 914519 1072276 1113313 1256076 1073394
13859 1073394 1200938 906877 1061654 1061854 1115310 1329138 1014710 1166564 890617 848816
13849 848816 1033470 1033941 1214750 1171067 1077276 888956 703717 805724 958297 834244
13839 834244 1081652 1212929 897464 847675 1080545 960563 956117 783849 978380 1043036
13829 1043036 902315 798983 868834 618171 891780 971758 836262 622957 392524 937281
13819 937281 866450 697446 1087510 437361 628672 831126 882652 877545 1135717 828503
13809 828503 771099 588996 851247 994302 1026277 859872 887048 792178 882132 784557 563104
$$ packed form
13879A471728m00780j3542L41889J30457m56380K41753k87445k8596R0144j62081
13869I27147J81005Q1186K51882n49004K85797k63494J57757M1037J42763j82682
13859A073394J27544k94061J54777K00N3456K13828l14428J51854k75947m1801
13849H48816J84654M71J80809m3683r3791j88320j85239J02007J52573j24053
13839H34244K47408J31277l15465m9789K32870j19982m446j72268J94531O4656
13829A043036j40721j03332O9851k50663K73609P9978j35496k13305k30433N44757
13819I37281p0831j69004L90064D37361J91311K02454N1526n107K58172l07214
13809H28503n7404j82103K62251J43055L1975j66405K7176r4870Q9954r7575k21453
$$ plain form
13798 563104 641504 597924 793620 866949 842535 966133 961798 537200 882869 574651 611902
13787 611902 740102 759520 686631 916921 584365 784250 708277 704972 383104 520107
13777 520107 638691 466008 504498 547533 836780 633889 845917 746916 658192 491863
13767 491863 579528 724303 712116 726923 725875 515198 400069 889369 867188 761738 709943
13756 709943 786112 495897 598091 1034301 664805 766830 547443 552502 301708 630642
13746 630642 650351 617284 631248 409530 415180 504147 599032 602820 608150 825649 689412
13735 689412 535694 603186 408463 784172 648451 610005 651601 493751 760758 1064015
13725 1064015 350311 708375 413042 515223 849651 512630 751317 477460 349806
$$ packed form
13798E63104P8400m3580J95696P3329k4414J23598m335m24598L45669l08218L7251
13787F11902J28200J9418p2889K30290l32556J99885p5973l305l21868J37003
13777E20107J18584j72683L8490M3035K89247k02891K12028r9001q8724j66329
13767D91863Q7665J44775j2187J4807j048k10677j15129M89300k2181j05450n1795
13756G09943P6169k90215J02194M36210l69496J02025k19387N059k50794L28934
13746F30642J9709l3067J3964k21718N650Q8967R4885L788N330K17499j36237
13735F89412j53718O7492j94723L75709j35721l8446M1596j57850K67007L03257
13725A064015C50311L58064k95333J02181L34428l37021K38687k73857j27654
$$ plain form
13716 349806 641517 653909 404403 354481 654743 587606 406362 581443 576109 360776
13706 360776 506121 562879 389778 548592 421365 555412 743708 564946 476965 386740
13696 386740 409767 425947 421868 549182 324750 558471 425748 529868 278260 536959
13686 536959 493302 324080 511264 445365 328242 389738 624762 655715 272986 873101
13676 873101 770137 229717 440979 305712 396150 449072 816632 386162 663806 442778
13666 442778 696242 533095 162296 533458 411020 232116 499319 484851 243991 355281
13656 355281 532115 446020 565963 189442 572552 800626 65644 400108 522171 358780
13646 358780 482833 185786 299003 470066 204196 461998 618423 380833 148571 121449
$$ packed form
13716C49806K91711J2392k49506m9922L00262o7137j81244J75081n334k15333
13706C60776J45345N6758j73101J58814j27227J34047J88296j78762q7981r0225
13696C86740K3027J6180m079J27314k24432K33721j32723J04120k51608K58699
13686E36959m3657j69222J87184o5899j17123O1496K35024L0953B72986O00115
13676H73101j02964B29717K11262j35267R0438N2922L67560C86162K77644k21028
13666D42778K53464j63147A62296L71162j22438j78904K67203j4468k40860J11290
13656C55281J76834q6095J19943A89442L83110K28074F5644L34464J22063j63391
13646C58780J24053A85786J13217J71063B04196K57802J56425k37590A48571k7122
$$ plain form
13636 121449 289279 352967 609990 98749 401976 414183 349204 843276 361123 302200
13626 302200 404807 593066 109991 396790 572625 389106 644029 275474 368189 466494
13616 466494 478958 524546 433085 404635 478861 233329 481935 334746 600847 297698
13605 268032 335166 635272 413629 224019 448788 473755 345509 505624 548747 311078
13595 311078 651565 570159 431642 510084 487694 421502 433792 499206 239792 298513 175050
13584 175050 273284 509640 318346 372612 484295 109971 208329 268227 249921 253922 200029
13573 200029 354968 310880 357577 458269 650452 367118 259056 87515 338383 321044
13563 321044 439853 257934 328334 490409 125592 157198 444467 258203 515933 109721
$$ packed form
13636A21449J67830O3688K57023I8749L03227J2207o4979M94072C61123n8923
13626C02200J02607J88259A09991K86799J75835j83519K54923B75474R2715R8305
13616D66494J2464M5588r1461k8450P4226B33329K48606j47189K66101B97698
13605B68032O7134L00106k21643j89610K24769K4967j28246J60115M3123k37669
13595C11078L40487q1406j38517P8442k2390o6192J2290O5414B39792N8721j23463
13584A75050R8234K36356j91294N4266J11683A09971R8358N9898j8306M001n3893
13573B00029J54939m4088M6697J00692J92183k83334j08062H7515K50868j7339
13563C21044J18809j81919P0400J62075A25592L1606K87269j86264K57730A09721
$$ plain form
13552 -66721 826107 235531 139192 413579 515323 479149 432357 112004 424290 320442
13542 320442 301047 -40218 148168 221697 287929 246694 92131 258511 -159351 376123 587564
13531 587564 131240 485056 279167 352705 78076 483149 102660 235978 379269 587258
13521 587258 554230 304214 541425 151295 78866 549845 100702 440142 499256 -115653
13510 114650 553654 -128 100912 190810 259838 254865 586998 39267 246521 160493 322663
13499 322663 376468 207055 72492 207580 243931 636614 369426 119076 301346 359791
13489 359791 101617 159415 17956 6971 -324245 430621 383494 -56397 254599 211896 346566
13478 346566 531397 345454 -157723 227347 96767 376484 375196 114929 256955 50554
$$ packed form
13552f6721H26107B35531r6339K74387J01744l6174m6792A12004L12286j03848
13542C20442j9395d0218A48168P3529O6232m1235I2131J66380a59351C76123K11441
13531E87564A31240L53816k05889P3538G8076M05073A02660J33318J43291K07989
13521E87258l3028k50016K37211A51295p2429M70979A00702L39440N9114a15653
13510A14650M39004a28A00912Q9898O9028m973L32133C9267K07254q6028J62170
13499C22663N3805j69413G2492J35088L6351L92683k67188A19076J82270N8445
13489C59791A01617N7798A7956F971c24245D30621m7127e6397B54599m2703J34670
13478C46566J84831j85943a57723B27347I6767K79717j288A14929J42026E0554
$$ plain form
13467 196946 443951 -527 309117 177909 285590 157363 71602 302868 16590 213856
13457 213856 151341 312308 305364 309322 268582 186768 283984 637566 310654 -72217 142258
13445 527918 195786 32534 304943 -82476 182722 -78034 258099 491310 -71665 235277
13434 253869 58703 288369 131080 85253 373573 328969 214013 186291 184822 360479 278405
13423 278405 310273 145213 80951 -96940 303293 410232 159773 587964 -84679 199777
13412 75193 350817 417542 179038 58310 124967 40186 214285 -30649 348754 536933 480725
13401 480725 378971 -14024 374882 96848 110325 414175 60658 145998 412599 269219
13391 269219 183240 256702 266333 481572 342919 455730 -146954 -8580 86845 141879 138205
$$ packed form
13467A96946K47005e27C09117j31208J07681j28227G1602K31266A6590J97266
13457B13856o2515J60967o944L958m0740q1814R7216L53582C10654g2217A42258
13445E27918A95786C2534K72409h2476A82722g8034B58099K33211g1665B35277
13434B53869E8703K29666A31080m5827K88320m4604j14956k7722j469J75657q2074
13423B78405L1868A45213o4262i6940C03293J06939A59773M28191h4679A99777
13412G5193K75624O6725A79038E8310O6657D0186J74099c0649C48754J88179n6208
13401D80725j01754a4024C74882I6848J3477L03850F0658Q5340K66601j43380
13391B69219q5979P3462R631K15239j38653J12811a46954h580H6845N5034l674
$$ plain form
13380 138205 91990 44946 308498 39365 415476 436581 191102 15897 351508 310552 306018
13369 306018 -246883 313921 371012 200105 247511 206847 196150 478322 44248 119969 179648
13358 179648 90034 462244 39556 308699 205647 313261 47048 526987 378430 103327
13347 313570 150594 240650 236350 411712 153966 627561 232411 236653 303521 112253 234115
13336 234115 -117431 240077 183733 170856 283421 164182 -5769 -16389 -36261 128653 70465
13325 70465 310317 487088 355170 56757 26642 82944 261427 143707 120529 444195
13315 444195 306014 293830 354850 147441 95327 107307 66236 243593 154102 -117308 225548
13303 169299 18459 -3742 131657 132875 389191 -83830 -46997 21085 35027 253840 -1964
$$ packed form
13380A38205m6215D4946K63552C9365L76111K1105A91102A5897L35611m0956m534
13369C06018b46883C13921N7091j70907M7406m0664j0697K82172D4248P5721N9679
13358A79648q9614L72210C9556K69143j03052J07614D7048M79939j48557A03327
13347C13570A50594R0056m300J75362A53966M73595B32411M242O6868A12253J21862
13336B34115a17431B40077n6344j2877J12565j19239e769j0620j9872A28653n8188
13325G0465K39852J76771j31918E6757B6642N6302J78483j17720k3178L23666
13315D44195j38181j2184O1020A47441n2114J1980m1071J77357q9491a17308B25548
13303A69299A8459c742A31657J218K56316h3830L6833B1085J3942K18813a964
$$ plain form
13291 -196439 228735 88470 169430 273439 191632 -105073 324851 734085 302050 34301
13280 104588 106972 261799 252994 84393 67400 224418 -52040 285602 57673 299269 151180
13269 151180 1164 245365 103910 270537 89541 63150 100788 224954 214009 50398 221729
13258 221729 -408639 343344 131677 195463 269753 -225519 388083 62242 -122924 -63190
13248 -63190 16585 361244 71821 161674 84789 -106810 379181 -113354 166248 477446
13238 477446 -69648 122428 163687 -137145 -213013 182061 314462 135449 -25316 -37462
13228 -37462 122785 162696 58545 145422 127515 34603 83443 -72603 -99864 360915 163949
13216 -197676 52022 -26274 277644 -48292 105939 124546 160482 418930 299337 209293 -6180
$$ packed form
13291a96439B28735H8470Q0960J04009q1807a05073C24851M09234C02050C4301
13280A04588K384J54827q805H4393j6993J57018e2040B85602E7673K41596j48089
13269A51180A164K44201A03910J66627H9541k6391L7638J24166j0945E0398J71331
13258B21729d08639C43344A31677O3786P4290b25519C88083F2242a22924N9734
13248f3190A6585L44659G1821Q9853p6885a06810C79181a13354A66248L11198
13238D77446f9648A22428M1259a37145p5868A82061J32401A35449b5316j2146
13228c7462A22785L9911E8545Q6877j7907C4603M8840g2603k7261C60915A63949
13216a97676E2022b6274B77644d8292A05939J8607L5936K58448j19593r0044f180
$$ plain form
13204 37857 -249604 224626 -126101 -163197 -127445 135714 451005 -3765 -149662 -100461 -182852
13193 -182852 236888 209914 104826 -39189 213960 157701 -107655 -44057 -93287 241944
13182 -166673 -25455 169697 370929 64700 -185484 44710 -220934 -83094 422630 318103
13172 318103 -50250 237788 -61143 -142381 38359 -3237 103293 382174 209503 370532 106835
13160 189974 -24811 82849 69126 74331 -82738 130361 373389 -19483 46681 13090 -174851
13148 -89206 62194 203719 430788 -90126 383457 21107 107162 -132330 213576 -96005 259579
13136 226715 -67936 -28657 17240 -53960 91540 160450 -123501 116096 -36933 -30594 -84673
13125 -84673 -120872 124877 269797 110824 36911 104780 -121149 156591 662659 194876
$$ packed form
13204C7857b49604B24626a26101l7096L5752A35714L15291c765j45897M9201q2391
13193a82852B36888k6974A04826c9189B13960n6259a07655d4057m9230B41944
13182a66673b5455A69697K01232F4700a85484D4710b20934h3094D22630j04527
13172C18103e0250B37788f1143q1238C8359c237A03293K78881j72671J61029A06835
13160A89974b4811H2849j3723N205h2738A30361K43028a9483D6681A3090a74851
13148h9206F2194J41525K27069i0126C83457B1107Q6055a32330B13576i6005B59579
13136B26715f7936b8657A7240e3960I1540O8910a23501A16096c6933O339n4079
13125h4673l6199A24877J44920A10824C6911O7869a21149A56591N06068A94876
$$ plain form
13114 65725 98409 60461 306163 88903 -209909 144515 230420 254078 258079 -107443 56974
13102 273102 55739 -7610 24150 46629 -172325 135525 -57991 -116316 185009 101262 274997
13091 274997 -109305 120027 108374 -52018 102942 197799 -258401 -173634 218532 -8497 -82952
13080 -82952 107633 251161 -96110 -166075 27486 294735 -88341 42062 106360 62517 202438
13069 202438 -68894 279902 84072 -138964 -18045 191581 198826 -16459 283511 306016 232607
13058 232607 -149809 23221 165481 173201 46354 252908 -258090 -100960 -83707 -296438
13048 -296438 97026 214758 -376182 24596 150412 -59821 -26694 -120542 202721 -162318
13037 144056 110864 238942 204174 -184020 115907 136792 33997 63607 43602 270033 61869
$$ packed form
13114F5725L2684l7948K45702H8903b09909A44515Q5905K3658M001a07443E6974
13102B73102E5739g610B4150K2479a72325A35525e7991n8325A85009q3747J73735
13091B74997a09305A20027j1653e2018A02942R4857b58401Q4767B18532h497p4455
13080h2952A07633J43528i6110o9965B7486K67249h8341D2062O4298m3843J39921
13069B02438f8894B79902H4072a38964a8045A91581P245a6459B83511K2505p3409
13058B32607a49809B3221J42260P720D6354K06554b58090a00960J7253k12731
13048b96438I7026J17732c76182B4596J25816e9821b6694r3848B02721a62318
13037A44056l3192J28078l4768a84020A15907K0885C3997K9610k0005K26431F1869
$$ plain form
13025 166255 306903 -107366 -99283 218083 190854 72387 76928 36973 411776 162507 -261231
13013 -21913 219569 220046 -15368 305179 -15930 235947 205686 -67549 -18972 -152302 192243
13001 402073 115039 209859 42814 -205783 -188319 97782 -103146 -25741 433875 -22994 51951
12989 -196894 286121 269279 404018 129101 -156420 -21811 59554 133194 225684 323334 -47813
12977 -36640 -354015 44870 -311736 88109 296203 -69285 120889 333547 73754 275746
12967 275746 175083 58941 -6545 12744 185656 131564 140670 341596 154743 33402 264568
12956 264568 5151 -300363 -184191 48065 -69644 139408 42015 80925 -358659 -44729 330282
12944 171527 400464 30420 66063 -18851 -123084 -362799 -332485 -44773 87084 208633 180508
$$ packed form
13025A66255J40648a07366Q083B18083k7229G2387M541C6973L74803A62507b61231
13013b1913B19569M77a5368C05179a5930B35947l0261f7549a8972j33330A92243
13001D02073A15039R4820D2814b05783J7464I7782a03146b5741D33875b2994E1951
12989a96894B86121j6842J34739A29101a56420b1811E9554P3640R2490R7650d7813
12977c6640l17375D4870c11736H8109K08094f9285A20889K12658G3754K01992
12967B75746j00663E8941f545A2744J72912n4092R106K00926A54743C3402K31166
12956B64568E151c00363J16172D8065f9644A39408D2015L8910c58659d4729C30282
12944A71527K28937C0420L5643a8851j04233k39715L0314d4773H7084J21549k8125
$$ plain form
12933 180508 -62853 -52870 -141764 -49844 -42075 58540 133578 -28679 -38064 185588 115687 262874
12921 262874 -3923 -31116 -33462 86286 -280932 -56076 -115956 -88503 61549 375069 160233
12909 -112734 -62240 219882 130550 -49430 -138421 -198121 -306969 -74489 -209162 -30170 -53728
12898 -53728 -22942 -58906 100184 -3152 -62986 18702 -174595 148919 395360 -148444 -82742
12887 -82742 -5229 7229 368175 408831 -14931 237371 -296483 128188 54509 226697 -42242
12875 102084 -71783 310130 -62108 171002 147336 72588 -79358 -29825 -330688 -38495 -121715
12864 -121715 148979 83651 -296575 8791 192802 131436 317328 276144 -159505 38757 256064
12853 256064 -124707 196084 103038 260747 225457 -157515 188053 118265 70570 -320511
$$ packed form
12933A80508f2853R983q8894d9844P769E8540P5038b8679r385A85588o9901J47187
12921B62874c923k7193k346H6286b80932e6076n9880K7453F1549L13520A60233
12909a12734N0494B19882q9332d9430q8991n9700j08848g4489j34673c0170k3558
12898e3728b2942l5964A00184c152n9834A8702a74595A48919K46441a48444O5702
12887h2742e229G229L60946M0656a4931B37371b96483A28188E4509J72188d2242
12875A02084g1783C10130f2108A71002k3666G2588g9358b9825l00863c8495q3220
12864a21715A48979o5328b96575H791J84011o1366J85892m1184a59505C8757K17307
12853B56064a24707A96084r3046J57709l5290a57515A88053o9788m7695c20511
$$ plain form
12842 -125195 183675 136971 453851 -218369 -172602 219439 -106327 -277286 170941 -146412
12831 -100559 75951 -35620 75523 -81574 36782 86924 90961 -191898 -43384 141159 -17188
12819 189004 -78111 -172348 2907 159413 190079 -177212 -266805 -40855 -41001 246039 550857
12808 550857 -137861 119060 -35575 185876 -176915 -197061 -187069 54499 96752 215277 -288604
12796 99808 -110357 158017 12154 16188 -839 -180810 21069 261564 -33355 188776 201734
12785 201734 -150639 13226 27395 14697 16813 -42558 -24311 182945 124890 -42336 64354
12773 132840 -43548 -85900 96545 -33507 -113255 -165427 -140362 28181 -6696 -213754 -268497
12762 -268497 48011 305293 -63708 -79670 7334 -173929 118741 170731 -237282 -87450 359491
$$ packed form
12842a25195A83675m6704L16880b18369M5767B19439a06327j70959A70941a46412
12831a00559G5951c5620G5523h1574C6782N0142M037a91898d3384A41159a7188
12819A89004g8111r4237B907J56506L0666a77212q9593d0855j46B46039L04818
12808E50857a37861A19060c5575A85876a76915k0146R992E4499M2253J18525b88604
12796I9808a10357A58017A2154M034h39j79971B1069K40495c3355A88776J2958
12785B01734a50639A3226J4169j2698K116d2558J8247A82945n8055d2336F4354
12773A32840d3548m2352I6545c3507p9748n2172K5065B8181f696k07058n4743
12762b68497D8011K57282f3708j5962G334a73929A18741N1990b37282h7450C59491
$$ plain form
12750 -65727 -211743 -113701 134329 -229827 -120857 -42881 -171211 -33510 -291535 -30350
12739 -34967 145429 -21285 -77464 -87652 129714 105659 114710 13781 258542 -74740 164074
12727 -51172 105316 -49161 171122 2986 277534 281279 139765 4154 24607 -56860 111124
12715 60426 174574 97134 71557 104874 313738 94079 49351 453565 -9836 36003 -54844
12703 163878 210305 134318 317748 87002 25833 -21591 -2270 -148302 -178686 447987 40013
12691 162563 207227 202493 106931 302783 232614 52306 226461 107506 358465 -14838 63854
12679 -149951 -120747 -20160 -6734 132476 126872 254356 88635 -137237 -160135 10104 -3386
12667 8288 18673 160574 18061 -191002 211181 -116736 396398 258869 -97214 112453
$$ packed form
12750f5727j46016R8042A34329b29827J08970d2881j28330c3510k58025c0350
12739c4967A45429b1285n6179j0188A29714k4055R051A3781K44761g4740A64074
12727e1172A05316d9161A71122B986K74548L745A39765D154K0453e6860A11124
12715F0426J14148p7440k5577L3317K08864I4079m4728M04214i836C6003e4844
12703A63878M6427p5987J83430H7002B5833b1591b270j46032l0384D47987D0013
12691A62563M4664m734r5562J95852p0169E2306J74155A07506K50959a4838F3854
12679a49951K9204b0160f734A32476n604J27484H8635a37237k2898A0104c386
12667H288J0385J41901A8061a91002B11181a16736C96398j37529i7214A12453
$$ plain form
12656 -111309 255187 -130497 90877 304162 -156273 -227759 2718 -158278 94398 -38358 323907
12644 136692 63628 107382 -209001 -35441 -246624 74239 -338857 59980 109806 182590 -24432
12632 174961 457614 -24903 48855 444346 -1910 102003 146315 -23232 -47663 154074 218274
12621 218274 389070 14886 -196301 -145104 4287 219165 105820 114618 -148195 234725 128562
12610 128562 29084 127636 -166310 42434 158730 2077 111232 -349550 7371 309561 -50715
12598 -69657 -68493 -167852 -83694 -190957 -28313 105759 -6268 331876 -520 3830 123044 79617
12586 79617 -56209 149188 97933 -216877 253260 248323 -184614 301253 32726 210032 -126752
12574 175154 190643 460584 -332510 -36572 -356443 -23938 1764 -160959 15119 229501 41084
$$ packed form
12656a11309B55187a30497I0877K13285a56273p1486B718a58278I4398c8358C23907
12644A36692F3628M3754b09001c5441k11183G4239c38857E9980M9826P2784b4432
12632A74961K82653b4903D8855L95491a910A02003M4312b3232k4431A54074O4200
12621B18274J70796A4886a96301N1197D287K14878A05820Q798a48195B34725j06163
12610A28562B9084R8552a66310D2434J16296B077J09155c49550G371L02190e0715
12598f9657J164r9359h3694j07263b8313A05759f268C31876e20C830J19214m3427
12586G9617e6209A49188n1255b16877B53260m937a84614C01253C2726J77306a26752
12574A75154J5489K69941c32510c6572l19871b3938A764a60959A5119K14382D1084
$$ plain form
12562 109392 47704 -259020 -194750 52086 88412 89135 77069 237519 101777 125982 278585
12551 278585 -305573 215145 52135 -33398 62498 169148 103665 118665 31713 -426452 -166016
12539 -18507 86595 -47809 137049 -89914 321147 -140716 65205 -316132 417340 108374
12528 546 256110 37966 584075 -150850 239696 -157637 391479 -68915 -3823 126313 51054
12516 113263 299679 73315 -277554 -58588 230242 -48203 -57071 -202564 85131 66159 -30075
12504 118224 -78608 50502 -48342 149846 369450 278569 172535 308148 -54396 387270
12493 51114 243887 89571 -296454 61452 -41289 -271056 261876 -128100 239250 68512
12482 3614 72340 -174765 62412 -104244 -68042 -53720 -315895 15203 -27032 8633 -108647
$$ packed form
12562A09392D7704b59020O4270E2086L6326P23j2066J60450A01777K4205J52603
12551B78585c05573B15145E2135c3398F2498J06650o5483J5000C1713d26452a66016
12539a8507H6595d7809A37049h9914C21147a40716F5205c16132D17340A08374
12528E46K55564C7966N46109a50850B39696a57637C91479f8915c823A26313E1054
12516A13263J86416G3315b77554e8588B30242d8203q868j45493H5131j8972c0075
12504A18224g8608E0502d8342A49846K19604r0881j06034J35613e4396C87270
12493E1114J92773H9571b96454F1452d1289k29767B61876a28100B39250F8512
12482C614O8726a74765F2412a04244L6202J4322k62175A5203b7032H633a08647
$$ plain form
12470 -497988 138821 31014 -150546 -133622 -178493 147600 -30286 42903 36412 -123729 246039
12458 246755 117167 247895 275486 106499 -169556 -311016 -56742 143657 66143 -123078
12447 39019 47279 -196631 76358 131907 339073 186197 -36332 -274010 208243 342073 -8362
12435 -102676 132577 25161 78702 326531 156224 35026 -23828 72998 33888 17852 205508
12424 205508 -130778 15466 -120177 110374 -18380 -456613 -39085 123195 -22285 96510
12413 29053 -15812 -232965 218416 -164641 213583 -80359 91926 -22077 -3566 -269052 65744
12401 55915 -3890 -607 -304105 -213644 -30731 -125017 -49535 320794 184016 -151407 -134362
12390 -134362 -67649 105668 38308 77479 100624 -108287 -164585 969 -85559 -300685 -92875
$$ packed form
12470d97988A38821C1014a50546J6924m4871A47600c0286D2903o491a23729B46039
12458B46755A17167J30728K7591A06499a69556j41460e6742A43657F6143a23078
12447C9019Q260a96631G6358N5549K07166j52876c6332k37678B08243J33830h362
12435a02676A32577B5161N3541K47829A56224C5026b3828G2998C3888j6036J87656
12424B05508a30778A5466a20177A10374a8380m38233c9085A23195b2285I6510
12413B9053a5812k17153B18416a64641B13583h0359I1926b2077c566k65486F5744
12401E5915c890f07l03498R0461c0731r4286d9535C20794j36778a51407J7045
12390a34362O6713A05668C8308L9171K3145a08287n6298I69h5559k15126i2875
$$ plain form
12378 92930 -234611 55323 -41797 121654 195150 420907 -267501 -20212 -48811 2566 134904
12367 134904 64084 91348 43115 -256124 45317 -8142 -52178 -70782 98335 241628 89640
12355 270681 111915 -86210 110058 100763 -25935 -204998 -210907 35765 145538 -166753 2103
12343 85245 -243676 -74141 -108193 175823 -95119 -84845 -45979 -138475 35410 113377 113150 -218342
12330 79003 -39309 98449 193741 -297080 -178131 -52761 291255 -11302 163746 -112043 -320500
12319 -320500 -176203 -40567 -226033 -62666 40427 341312 -198937 263572 -24215 146354
12308 326613 72779 132144 19955 -81301 -22874 107655 240552 -292928 -245723 -267421 -165450
12297 -165450 428059 252908 -237713 33543 50609 -8287 22065 21900 212583 -66544 -338935
$$ packed form
12378I2930b34611E5323d1797A21654P3496K25757b67501b0212k8599B566J32338
12367A34904F4084K7264D3115b56124D5317h142m4036j8604I8335J43293H9640
12355B70681A11915h6210A10058r295b5935j79063n909C5765J09773a66753B103
12343H5245b43676g4141l4052A75823i5119J0274L8866r2496C5410P7967k27b18342
12330G9003c9309I8449R5292b97080J18949e2761B91255a1302A63746a12043k08457
12319c20500J44297d0567j85466f2666D0427L00885a98937B63572b4215A46354
12308C26613G2779N9365A9955h1301b2874A07655J32897b92928M7205k1698J01971
12297a65450D28059j75151b37713C3543J7066h287B2065j65J90683f6544k72391
$$ plain form
12286 -338935 69196 -77330 62743 -111121 -23845 49266 205637 -102659 26339 12537 298398
12275 298398 99700 178436 -184145 240640 142674 187847 146940 183580 -196281 -46809 118901
12263 -266183 119337 -168610 268694 39582 74310 287580 -421271 -115594 2162 304138
12253 304138 -107216 -138344 22827 -135348 298074 210216 -43533 365143 4791 -265610 89222
12241 118489 -264907 -123518 223516 -18437 390277 -108479 -138922 145465 -24854 121171
12230 269800 19322 275625 49733 21262 231303 -64215 288278 24556 275943 156846
12220 156846 182053 158297 411455 581910 50731 368516 174276 245210 110176 79189
12210 79189 90798 459664 233102 -8639 89368 71630 220391 -167978 -22076 76177 295089
$$ packed form
12286c38935F9196g7330F2743a11121b3845D9266J56371a02659B6339A2537K85861
12275B98398I9700P8736a84145B40640r7966M5173m0907L6640a96281d6809A18901
12263b66183A19337a68610B68694C9582L4728K13270d21271a15594B162L01976
12253C04138a07216l1128B2827a35348B98074q7858d3533C65143D791b65610H9222
12241A18489b64907a23518B23516a8437C90277a08479l0443A45465b4854A21171
12230B69800A9322K56303D9733B1262K10041f4215B88278B4556K51387j19097
12220A56846K5207k3756K53158J70455E0731L17785A74276P0934A10176l0987
12210G9189J1609L68866k26562h639H9368j7738J48761a67978b2076G6177K18912
$$ plain form
12199 295089 353127 -19849 131177 -243732 367269 455047 319799 115900 32697 197238
12189 197238 -129674 433200 67312 230390 89762 162774 -203107 152208 -29517 -36002 205534
12177 -422119 -38688 162894 40073 219287 108801 24824 -60968 -7426 -68796 223848 97676
12165 14994 320128 176348 -52541 -43867 -404938 158208 116251 -401484 203757 101163
12154 -379205 39085 55049 333379 69192 -309678 -39669 326460 213232 -291590 -73185
12143 186354 -152665 -195869 178523 52257 -47408 -31954 -137467 62225 95126 111505 -125108
12131 36763 353591 -88174 -405428 -356138 257453 249686 157867 338718 -83832 132451 -62020
12119 191678 135523 -162472 351544 202793 -57870 -65842 101450 -192215 -99877 -15035 159352
$$ packed form
12199B95089N8038a9849A31177b43732C67269Q7778j35248A15900C2697J64541
12189A97238a29674D33200F7312J63078H9762P3012b03107A52208b9517o485B05534
12177d22119c8688A62894D0073J79214A08801B4824f0968g426o1370B23848I7676
12165A4994L05134j43780e2541Q674l61071A58208m1957d01484B03757A01163
12154c79205C9085J5964K78330F9192c09678c9669C26460j13228b91590g3185
12143A86354a52665m3204A78523E2257d7408J5454j05513F2225L2901J6379a25108
12131C6763L16828h8174l17254M9290B57453p767r1819J80851h3832A32451f2020
12119A91678n6155a62472C51544j48751e7870p972A01450a92215R2338a5035A59352
$$ plain form
12107 -70614 59606 -28059 -23316 -115804 56119 -146422 141486 239398 121012 -379832 -90674
12095 -130881 -28573 133418 197240 -19533 69527 269640 -5472 162362 171922 -254968 129899
12083 51358 -36128 -175936 196240 -107513 42126 198866 -247232 -114480 -144490 68121
12072 -60125 -123633 63546 234140 632710 673173 815308 1041104 185693 331874 256248
12062 256248 140752 192927 -55527 39536 -24723 -61137 117228 60136 -281880 32251 327437
12051 327437 -171092 106056 65375 85561 -26451 122386 -145509 -203704 -106029 115614
12040 -64487 -224894 -8900 -42639 82038 29184 -145454 255783 -62492 -73957 -83282 -114375
12029 -114375 -47575 -125874 -71125 81522 246549 -35140 -218920 -118529 39821 -193378 125671
$$ packed form
12107g0614E9606b8059M743r2488E6119a46422A41486R7912j18386c79832i0674
12095a30881b8573A33418O3822a9533F9527K00113e472A62362R560b54968A29899
12083E1358c6128j39808A96240a07513D2126J56740b47232a14480l0010F8121
12072f0125o3508F3546J70594L98570M0463J42135K25796A85693J46181p5626
12062B56248j15496N2175e5527C9536b4723l6414A17228n7092b81880C2251K95186
12051C27437a71092A06056m0681K0186b6451A22386a45509n8195R7675A15614
12040f4487j60407h900l3739H2038B9184a45454B55783f2492j1465r325l1093
12029a14375d7575p8299N4749H1522J65027c5140j83780J00391C9821a93378A25671
$$ plain form
12017 339457 55233 50961 161479 -35261 -101515 -67252 141069 -212906 226311 -21110 16002
12005 -214660 65661 32082 244358 -300772 57409 -359268 -76084 -161818 -4424 -11451 -36018
11994 -36018 60444 162832 217660 21538 -86161 -57851 -178134 29653 -184827 145360 -252498
11982 -90983 -162547 299430 -363090 -12534 88272 203083 251520 170590 176724 339295 131140
11970 -140336 73562 -395836 -87503 -22582 -179947 -154054 -130589 -215144 -116314 -122484 -81581
11959 -81581 191538 69511 10177 -192217 156693 16208 109529 -335183 -24249 184997 -141575
11947 -211888 -142738 61400 154634 23502 -469088 -92881 -87947 -244735 -69823 120023 4332
11935 -304303 76063 264574 -31016 191905 -654 -152214 98832 13703 -102331 86168 58119
$$ packed form
12017C39457E5233m272J10518c5261o6254L4263A41069b12906B26311b1110A6002
12005b14660F5661C2082K12276c00772E7409c59268g6084q5734d424p027k4567
11994c6018F0444J02388N4828B1538h6161K8310j20283B9653a84827A45360b52498
11982i0983p1564B99430c63090a2534H8272J14811M8437q0930O134J62571A31140
11970a40336G3562c95836h7503b2582j57365K5893K3465q4555R8830o170M0903
11959h1581A91538F9511A0177a92217A56693A6208R3321c35183b4249A84997a41575
11947b11888O9150F1400R3234B3502d69088i2881M934j56788f9823A20023D332
11935c04303G6063J88511c1016A91905f54j51560I8832A3703a02331H6168k8049
$$ plain form
11924 58119 4671 -46457 -302637 62266 93932 -166004 -141129 59454 161796 274737 -1498
11912 -58847 267231 16214 112731 12008 24804 -114736 100540 44569 -68832 -180195 71384
11900 -150917 193685 43334 483404 -11497 -3339 441009 -216831 -62534 66199 -155755 -193569
11889 -193569 44486 -383339 -192635 -61157 148341 -392877 -50553 59766 -34081 135125
11878 -149926 127577 -38921 -173356 -99320 103732 -191251 -5305 -169136 -37783 150674
11867 -385650 16050 -34582 161203 -183300 388434 -227403 11286 6434 32877 -4469 217445
11855 106573 -4038 257228 186791 -18825 52332 27715 -79853 -82244 173948 133433 -124699
11843 324420 3989 135966 97491 -167366 315698 -83967 66753 -45752 -45604 -12391 72070
$$ packed form
11924E8119D671d6457k56180F2266L1666a66004K4875E9454J02342J12941a498
11912e8847B67231A6214R6517A2008J2796a14736A00540D4569f8832j11363G1384
11900a50917A93685D3334M40070a1497c339D41009b16831f2534F6199a55755l7814
11889a93569D4486c83339J90704f1157A48341c92877e0553E9766c4081A35125
11878a49926A27577c8921j34435P4036A03732a91251e305j63831c7783A50674
11867c85650A6050c4582A61203a83300C88434b27403A1286m852K6443d469B17445
11855A06573d038B57228p0437a8825E2332k4617g9853k391A73948m0515a24699
11843C24420C989J31977l8475a67366C15698h3967F6753d5752J48a2391G2070
$$ plain form
11831 -82313 -231297 -31457 32454 -90606 -69639 -270207 -85130 -211540 -205926 231899 -53803
11819 -75647 14286 -126455 -233343 -95574 -169884 26588 205547 -204564 -60108 -105794 -116971
11808 -116971 -146298 33769 -162615 -282917 -40115 -105467 -32845 -63544 -270586 -240566 -6381
11796 -87249 -210902 196623 -45636 -32581 63351 224586 326073 -166973 206601 -189181
11785 245412 -46290 134339 -274505 123046 94994 -4176 -46642 301192 199154 -303334
11774 148795 -379909 46733 -93665 153682 328821 -16826 177788 -541638 -20485 -112521
11764 -112521 160913 -114382 -197282 -82862 -132559 -80637 237057 -52375 217041 -46123 -155784
11753 -155784 -8282 1977 -130595 68110 -75470 99144 44403 -31628 76328 -72052 -68099 144257
$$ packed form
11831h2313j48984c1457C2454i0606K0967k00568h5130j26410N614B31899e3803
11819g5647A4286a26455j06888i5574p4310B6588J78959b04564f0108m5686j1177
11808a16971k9327C3769a62615j20302d0115o5352c2845l0699k07042L0020f381
11796h7249j23653A96623d5636J3055F3351J61235J01487a66973B06601a89181
11785B45412d6290A34339b74505A23046k8052d176m2466C01192j02038c03334
11774A48795c79909D6733i3665A53682J75139a6826A77788e41638b0485r2036
11764a12521A60913a14382q2900h2862m9697N1922B37057e2375B17041d6123j09661
11753a55784h282A977a30595F8110g5470I9144D4403c1628G6328g2052L953A44257
$$ plain form
11740 -147390 -258621 -115773 -115833 -215367 -203917 111481 -87092 -128786 261609 -98062 314811
11728 119896 -93672 -20316 -22969 -76484 267664 -188696 172844 189249 321977 -24820 248777
11716 -143863 226999 156882 -87586 -113719 7391 -154047 -122018 -116998 93307 -14044 223568
11704 294152 144849 -218504 85315 -140661 168411 -89955 -142309 233930 -34487 -154332
11694 -154332 46011 -85233 -75837 204288 211052 -167922 33465 236735 -425 -124025 114537
11682 253439 205092 -94126 385053 -199194 204659 -95101 134803 4695 -359117 101663
11671 252695 488765 61550 -101862 -240535 -325382 2038 -40491 -100118 262731 138282 262326
11660 262326 -9880 -211265 -143569 222864 58158 152922 -65523 218297 -472718 45499 74214
$$ packed form
11740a47390j11231a15773o0r9534J1450A11481h7092m1694B61609i8062C14811
11728A19896i3672b0316k653n3515B67664a88696A72844J6405J32728b4820B48777
11716a43863B26999p0117h7586k6133G391a54047L2029N020I3307a4044B23568
11704B94152A44849b18504H5315a40661A68411h9955n2354B33930c4487j19845
11694a54332D6011h5233R396B04288O764a67922C3465K03270d25j23600A14537
11682B53439m8347i4126C85053a99194B04659i5101A34803D695c59117A01663
11671B52695K36070F1550a01862j38673q4847B038d0491n9627B62731j24449J24044
11660B62326i880k01385O7696B22864E8158R4764f5523B18297d72718D5499K8715
$$ plain form
11649 74214 167340 -61690 103972 220553 -231320 -151162 -17273 109545 -85795 -68507 166782
11637 5692 265247 -36515 -61487 -2116 254044 56933 25957 -268778 90501 -128650 43373
11625 122835 408071 -205495 105868 122070 12868 -183122 -48148 47766 -80076 7486 202185
11614 202185 -66681 200181 69316 -13453 -58713 -11348 402761 133292 -113424 301235
11603 393347 184006 93339 -197829 307044 28266 -52189 -86873 -175214 -49996 -186913 -142522
11592 -142522 169424 -250795 32586 -139361 98623 36689 210699 29125 -19287 23867 224554
11581 224554 140679 -26593 103740 124971 -215198 -23808 -46555 -332236 33176 259413 54539
11569 -77797 -16688 21763 206268 -60027 115227 22375 159708 -10028 253834 -1908 143431
$$ packed form
11649G4214R3126f1690A03972J16581b31320Q0158a7273A09545h5795J7288A66782
11637E692K59555c6515k4972b116B54044E6933B5957b68778I0501a28650D3373
11625A22835K85236b05495A05868J6202A2868a83122d8148D7766h0076G486J94699
11614B02185f6681B00181F9316a3453m5260a1348D02761A33292a13424C01235
11603C93347A84006r0667a97829C07044B8266e2189l4684q8341d9996j36917M4391
11592a42522A69424b50795C2586a39361I8623C6689J74010B9125a9287B3867K00687
11581B24554q3875b6593A03740K1231b15198b3808k2747k85681C3176K26237E4539
11569g7797a6688B1763J84505f0027A15227B2375J37333a0028B53834a908A43431
$$ plain form
11557 -172042 174538 -118624 -182760 -11753 -60608 44057 -27422 -20004 -23149 64324 23846
11545 -269626 183050 334155 -298105 -215641 -60403 10753 -150846 177676 102434 89609
11535 89609 65004 -31919 192215 -297362 16038 317509 -158417 -154416 -48972 4017 159759
11524 159759 36351 19479 117809 4908 -92902 -22179 107117 -29817 -230529 95023 110140
11513 110140 17993 154788 67811 226051 -21755 96527 -151022 187927 -50117 -26827 238868
11501 187951 62736 -98562 204914 5788 2174 52926 166045 68776 34779 -11259 -6493 121164
11488 -1556 162067 -14910 -273571 88608 117670 -70306 222531 310834 209046 256655 124369
11476 51051 304644 34257 108909 5497 -24429 159298 -38716 262445 228175 159025 -187339
$$ packed form
11557a72042A74538a18624o4136a1753m8855D4057b7422P418l145F4324B3846
11545b69626A83050J51105b98105Q2464f0403A0753a50846A77676p5242j2825
11535H9609k4605c1919A92215b97362A6038L01471a58417M001d8972D017J55742
11524A59759C6351j6872R8330D908i2902b2179A07117b9817k00712I5023J5117
11513A10140A7993J36795F7811J58240b1755I6527a51022A87927e0117K3290B38868
11501A87951F2736i8562B04914E788B174N0752J13119F8776l3997a1259M766A21164
11488a556A62067a4910k58661H8608K9062g0306B22531Q8303j01788M7609A24369
11476E1051K53593C4257P4652E497b4429A59298c8716B62445l4270o9150a87339
$$ plain form
11464 -100384 217347 355719 328925 86609 12762 -165436 49625 244977 -39671 213677
11453 -1746 152536 223313 578080 87048 -11063 261217 -133922 -30366 220328 -70229 -162010
11442 -162010 86000 87587 409530 23128 234794 -4326 85817 -47301 47039 393993 -17612
11430 23382 3506 73303 -401866 95891 -116502 -1179 -161050 -91789 57944 -215720 45190
11418 168 181120 26780 145934 298667 -200867 230008 14089 11254 28895 -208199 -40950
11406 132895 300400 356939 267256 88004 213714 370089 92731 330179 152853 -94626
11395 -6414 143369 -299933 27225 -275797 -51370 70745 -89560 -383768 -109131 -59465 52983
11383 -108889 -31979 105413 -83561 -211103 157597 -141830 63807 17377 109086 -192579
$$ packed form
11464a00384B17347J38372k6794H6609A2762a65436D9625J95352c9671B13677
11453a746A52536P0777L54767H7048a1063B61217a33922c0366B20328g0229r1781
11442a62010H6000J587L21943B3128K11666d326H5817d7301D7039L46954a7612
11430B3382C506O9797d01866I5891a16502a179j59871O9261E7944b15720D5190
11418A68J80952B6780J19154J52733b00867B30008A4089k835J7641b08199d0950
11406A32895J67505N6539q9683H8004J25710J56375I2731K37448A52853i4626
11395f414A43369b99933B7225b75797e1370G0745h9560k94208a09131M9666E2983
11383a08889c1979A05413h3561j27542A57597a41830F3807A7377R1709a92579
$$ plain form
11372 -23442 -19808 -376452 -171531 -53336 114866 186412 -172449 -289742 -41153 -56254 2083
11360 -105492 -162864 172333 36320 -3800 -40861 -59829 53415 -4791 -59415 70100 -89203 357383
11347 91282 -117476 -237618 -1918 155641 50387 148791 504070 -221938 128239 -137884
11336 -7016 107732 -147363 187754 110417 -310652 90176 228845 -49302 49645 -14701 -289406
11325 -289406 -190045 -148589 -86721 -163049 151199 -119730 87765 -163931 -151548 155339 -122528
11313 -144623 166895 152425 -266319 -216924 -123271 -145993 -163805 45037 -159587 49384 -71349
11301 -254624 -84122 -131488 -6281 -121057 107388 170248 28635 -229402 72019 218955 66641
11289 -413269 65542 -10408 -63226 285646 -120105 -63540 -194911 -11184 45228 -174376 52615
$$ packed form
11372b3442L634l56644a71531e3336A14866P1546a72449j17293d1153j5101B083
11360a05492n7372A72333C6320c800l7061j8968E3415d791n4624G0100h9203C57383
11347I1282a17476j20142a918A55641E0387R8404L55279b21938A28239a37884
11336g016A07732a47363A87754p7337c10652I0176J38669d9302D9645a4701k74705
11325b89406R9361M1456O1868p6328A51199a19730H7765a63931J2383A55339a22528
11313a44623A66895j4470b66319M9395R3653k2722j7812D5037a59587D9384g1349
11301b54624h4122m7366f281j14776A07388O2860B8635b29402G2019J46936F6641
11289d13269F5542a0408n2818B85646a20105N6565j31371a1184D5228a74376E2615
$$ plain form
11277 -147544 156021 -79703 -160662 130708 -33227 19781 316245 211570 -182253 8365 -199061
11265 -136414 145667 -119579 -304138 -186823 178282 -329243 -44924 -216666 399678 -230787
11254 183276 -143823 -1064 -109174 -120258 89292 -149861 -69449 43009 -44828 -205775 -62507
11242 226011 116451 -115622 219662 -202567 -143870 147852 -433744 -333900 68302 -19645
11231 174405 -122307 228766 46409 -116809 -32476 -2221 -199444 -189648 164514 154838 98964
11220 98964 303158 178945 -51391 -166979 -98372 -456428 -156452 -2261 -47009 64608 328008
11209 328008 55660 -309724 -62820 -53859 -305612 -19739 -125840 -34622 -399387 -136467 -405122
11198 -405122 -12879 -202449 -149552 -129358 -169026 -282008 -198594 -90798 194572 -19342 200541
$$ packed form
11277a47544A56021g9703q0959A30708c3227A9781K96464j04675a82253H365a99061
11265a36414A45667a19579j84559J17315A78282c29243d4924j71742C99678b30787
11254A83276a43823a064j08110j1084H9292a49861f9449D3009d4828j60947f2507
11242B26011j09560a15622B19662b02567N8697A47852d33744R9844F8302a9645
11231A74405a22307B28766D6409a16809c2476b221j97223R796A64514r676n5874
11220I8964K04194j24213e1391j15588O8607l58056a56452b261m4748F4608K63400
11209C28008E5660c09724f2820Q961k51753a9739j06101c4622l64765a36467k68655
11198d05122a2879j89570N2897K0194l9668j12982Q3414i0798A94572a9342B00541
$$ plain form
11186 -94462 63819 -274663 -22930 -189400 -48011 -78250 198575 172128 38750 240767 -83436
11174 93841 -46701 -89859 365949 -242706 50344 42704 -148102 257913 -31423 -361898 231868
11162 -197945 48897 111934 -69957 -81761 12881 -150266 -129604 56390 211005 -185880 -235937
11151 -235937 -172488 58062 256866 -48684 87300 232960 45293 293048 -127908 111412
11140 9078 -164157 -44186 20849 -14504 -259413 -5011 -71824 -219425 268114 212545 29804
11128 25446 -71279 69537 -331999 -134659 147709 435972 33270 29595 59494 87732 2848
11116 -200369 8009 159576 -154547 -78036 233240 261646 -24463 398081 186403 222704 177075
11105 177075 65931 4759 29072 140724 56591 -114467 331225 299915 252569 498911 88613
$$ packed form
11186i4462F3819b74663b2930j66470d8011l0239A98575k6447C8750K02017h3436
11174I3841d6701m3158C65949b42706E0344p640a48102B57913c1423l30475B31868
11162a97945D8897O3037f9957j1804A2881a50266K0662E6390J54615a85880n0057
11151b35937O3449E8062J98804d8684H7300J45660D5293K47755a27908A11412
11140I078a64157d4186B0849a4504k44909e011o6813j47601B68114n5569B9804
11128B5446g1279F9537c31999a34659A47709K88263C3270l675K9899K8238B848
11116b00369H009J51567a54547P6511B33240K8406b4463C98081A86403L6301m5629
11105A77075F5931D759K4313J11652E6591a14467C31225l1310m7346K46342H8613
$$ plain form
11093 -63253 211677 -110183 448909 245432 298603 102361 92980 18789 135309 331486
11083 331486 390292 146904 236911 446861 417184 218492 471513 453409 73276 378467
11073 378467 567422 251814 148731 127051 419619 618439 85847 345047 266966 253534
11063 253534 46453 553597 359835 513648 467498 434624 479414 190138 466708 515469
11053 515469 583409 384102 324842 847945 629451 802042 935160 639317 467937 497793
11043 497793 687930 841762 860790 707621 317062 616723 760600 903892 588483 856030
11033 856030 554620 613347 662203 628932 401793 644423 866237 609963 793648 794926
11023 794926 531825 513504 812032 623997 748366 559728 422281 559373 632822 595703
$$ packed form
11093f3253B11677a10183D48909k03477N3171A02361r381A8789J16520J96177
11083C31486N8806A46904R0007K09950k9677j98692K53021j8104G3276L05191
11073C78467J88955B51814j03083k1680K92568J98820H5847K59200p8081j3432
11063B53534D6453N07144j93762J53813m6150l2874M4790A90138K76570M8761
11053E15469O7940j99307n9260N23103k18494J72591J33118k95843j71380K9856
11043D97793J90137J53832J9028j53169C17062K99661J43877J43292l15409K67547
11033H56030l01410N8727M8856l3271k27139K42630K21814k56274J83685J278
11023G94926k63101j8321K98528j88035J24369j88638j37447J37092P3449l7119
$$ plain form
11013 595703 660149 772291 534993 308621 582635 564855 454212 786417 589358 591996
11003 591996 966101 510767 365397 906274 438130 470040 787159 799362 445023 539867
10993 539867 740155 909543 980075 650429 621958 682211 987715 1402534 800216 861115
10983 861115 860433 968191 989956 1390721 1311676 1285133 2078586 1924905 2080491 2808757 2471934
10972 2471934 2558179 2638309 2732813 2461772 1831520 1989224 1345598 1404301 1170394 1289302
10962 1289302 1099186 1288617 1275178 1124996 1410015 1254829 1174559 941756 815754 862272
10952 862272 846494 429749 522026 397651 272186 408409 444661 206619 516268 -95827
10941 292721 164055 203393 4907 38494 234016 -70466 -65172 -163690 158151 -53883 -35829
$$ packed form
11013E95703O4446J12142k37298k26372K74014j7780j10643L32205j97059K638
11003E91996L74105m55334j45370N40877D38130L1910L17119J2203l54339R4844
10993E39867K00288J69388P0532l29646k8471O0253L05504M14819o02318O0899
10983H61115o82J07758K1765M00765p9045k6543P93453j53681J55586P28266l36823
10972B471934Q6245Q0130R4504k71041o30252J57704o43626N8703k33907J18908
10962A289302j90116J89431j3439j50182K85019j55186q0270k32803j26002M6518
10952H62272j5778m16745R2277j24375j25465J36223L6252B06619L09649i5827
10941B92721j28666L9338D907L3587J95522g0466N294r8518A58151e3883J8054
$$ plain form
10930 -35829 -183997 61495 -5174 -12898 55362 65782 37488 -137008 -81110 192599 -131171
10918 -95536 -130768 166566 163033 -185783 187326 -193880 -261449 -42074 -108649 -798 432175
10906 -110022 67472 243184 355300 65658 319478 274532 93878 -148730 -76037 -344519
10896 -344519 -82020 -121249 -46790 30933 -152766 -15542 -49598 182946 -88650 -374685 143636
10884 -244201 -235745 -44525 -21549 295720 131202 156522 65664 94804 10736 -31526 319495
10872 -123692 -56306 243263 -313872 153301 -70323 -252526 45255 111238 -28607 240682
10861 -323962 -267071 85527 266386 210452 -36789 198988 -178033 -31821 -274866 109470
10850 153457 -206006 41884 37224 -336740 -78207 77106 163283 -6000 389088 -77594 -13266
$$ packed form
10930c5829j48168F1495e174p724E5362J0420k8294a37008N5898A92599a31171
10918i5536l5232A66566l533a85783A87326a93880o7569d2074o6575g98D32175
10906a10022F7472J75712J12116F5658K53820m4946I3878a48730P2693k68482
10896c44519h2020l9229d6790C0933a52766a5542l4056A82946h8650k86035A43636
10884b44201Q456d4525b1549B95720A31202K5320F5664K9140A0736c1526C19495
10872a23692e6306B43263c13872A53301g0323j82203D5255O5983b8607B40682
10861c23962N6891H5527J80859n5934c6789A98988a78033c1821k43045A09470
10850A53457b06006D1884m660c36740g8207G7106Q6177f000C89088g7594a3266
$$ plain form
10838 59069 23879 -208027 -74626 304816 -179643 -58292 40891 -175653 -68569 -117207 219366
10826 -347477 115388 -145314 -33062 -10394 39106 -372527 -87651 -143546 21701 -135718 -158643
10815 -158643 38382 32804 44914 53723 -362843 -178531 -14849 134619 -314072 282612 -23480
10803 146400 389202 255909 -36392 -280743 140604 94169 -169795 -57505 -249168 -91637
10792 -107505 -204322 -120497 39983 -141873 14589 1460 30764 -112757 -381213 88112 -69455
10780 -143406 -194321 -76867 -79310 19944 -266427 -116359 -297412 -80272 -201005 -275642 252117
10768 120752 134714 16085 26573 138911 -119621 82202 -100780 66384 -265093 -29053 -46034
10757 -46034 -108676 15244 -123005 -412 238282 46665 -47186 -81447 -198567 -175202 239076
$$ packed form
10838E9069B3879b08027g4626C04816a79643e8292D0891a75653f8569m8638B19366
10826c47477A15388a45314c3062a0394C9106c72527h7651n5895B1701a35718k2925
10815a58643C8382n578J2110Q809c62843a78531a4849A34619c14072B82612b3480
10803A46400K42802j33293c6392k44351A40604m6435a69795e7505j91663i1637
10792a07505r6817Q3825C9983a41873A4589A460K9304a12757k68456H8112f9455
10780a43406n0915g6867k443A9944b66427a16359j81053h0272j20733p4637B52117
10768A20752J3962A6085J0488J12338a19621H2202a00780F6384b65093b9053j6981
10757d6034o2642A5244a23005d12B38282D6665d7186l4261j17120K3365B39076
$$ plain form
10745 -55235 96859 14990 48573 -230404 -155747 25859 141717 -351833 -19325 -238432 -95873
10733 174156 208845 -163359 -63552 285494 -41359 156703 -93225 -44992 -344416 76047 69427
10722 69427 -504596 -28356 -7602 260343 -13137 100956 -98738 -118504 -54563 216082 -46366
10710 -95681 78428 -231747 -10984 -11744 -238505 14290 -244988 -141200 69757 -68437 -258926
10699 -258926 -51131 -50852 -189658 -97451 41954 40469 -126987 -321323 -63879 109107 271205
10688 271205 -122582 6933 122071 -225604 -145261 491295 -110492 7481 -4257 253999 224842
10677 224842 123302 25765 192185 96294 -71078 1545 18390 13377 -126264 99414 -82452
10665 -100170 -37431 121163 192634 -6546 -70081 -8305 -51868 -91869 -49310 54765 -262732
$$ packed form
10745e5235I6859A4990L3583b30404P4657B5859J15858c51833a9325k19107i5873
10733A74156L4689a63359f3552B85494d1359A56703i3225d4992k99424G6047o620
10722F9427e04596b8356g602B60343a3137A00956i8738j9766e4563B16082d6366
10710i5681G8428b31747a0984p60k26761A4290b44988J03788F9757f8437j90489
10699b58926e1131K79j38806R2207D1954j485a26987j94336f3879A09107J62098
10688B71205a22582F933J15138b25604Q0343D91295a10492G481d257B53999k9157
10677B24842j01540B5765J66420r5891g1078A545J6845n013a26264I9414h2452
10665a00170c7431A21163P1471f546o3535h305m3563m0001M2559E4765b62732
$$ plain form
10653 -357123 257224 -15127 -432851 -274888 -34799 69533 -290271 -100492 -43022 -36735 14001
10641 -283876 -111964 -84525 50813 64761 -323949 -19894 38021 83149 -278373 232779 -113959
10629 25446 -228864 -21014 -116591 237626 -291398 -373650 -28392 -49456 -127450 163845 -57325
10617 150250 -151121 198285 -131408 25378 96955 -38081 -180874 -389140 190182 -72410
10606 -507711 46453 71026 -162069 -157071 -109744 -78672 -14063 104287 -249723 -174704 158759
10594 -371787 -165241 280998 223921 -6077 -45396 160611 26927 137623 43997 174643 -61847
10582 -330091 104476 -352825 -73596 -233153 -148354 69958 27254 -163679 26389 -144144
10571 82856 -7770 -45376 183144 -342623 -371226 -34852 -125837 67974 -50779 2536 69684 41179
$$ packed form
10653c57123B57224a5127m17724J57963c4799F9533b90271a00492d3022O287A4001
10641b83876a11964K7439E0813J3948c23949a9894C8021M5128b78373B32779a13959
10629B5446b28864b1014r5577B37626b91398q2252b8392k1064p7994A63845e7325
10617A50250a51121A98285a31408B5378P1577c8081j42793k08266A90182g2410
10606e07711D6453K4573a62069M998M7327L1072a4063A04287b49723P5019A58759
10594c71787a65241B80998n7077f077l9319A60611B6927J10696D3997J30646f1847
10582c30091A04476c52825g3596j59557Q4799F9958B7254a63679B6389a44144
10571H2856g770l7606A83144c42623k8603c4852r0985F7974e0779B536O7148k8505
$$ plain form
10559 41179 -139428 -145308 -6704 130206 432652 441454 55897 352921 -118665 -40930 114605
10547 -117368 -109430 58415 -313077 -109598 74521 -44761 158306 43136 -167539 -331729 -222003
10536 -222003 -112493 387778 -42811 -217475 -75913 -231490 -7604 12588 -307800 -210147 -135074
10525 -135074 29262 14787 -206985 114864 157222 -305875 -117120 117720 -103558 147725
10514 374967 -98278 4364 -129062 -176079 -234185 -128823 -63041 110107 -4993 233072 -176481
10502 128788 33458 462212 -111923 -200189 301256 1762 141027 -377843 -11752 178668
10491 -41035 -162367 290116 -147808 292588 -62259 106040 162437 57010 401202 -119156
10480 353806 -151929 54996 -289304 -107972 -344659 -71182 3946 188090 128849 104142 274923
$$ packed form
10559D1179a39428n880f704A30206L02446Q802E5897K97024a18665d0930A14605
10547a17368P938E8415c13077a09598G4521d4761A58306D3136a67539j64190J09726
10536b22003J09510C87778d2811j74664g5913j55577g604A2588c07800R7653P5073
10525a35074B9262j4475b06985A14864M2358c05875a17120A17720a03558A47725
10514C74967i8278D364a29062m7017n8106J05362f3041A10107d993B33072a76481
10502A28788C3458M28754a11923q8266C01256A762J39265c77843a1752A78668
10491d1035j21332B90116a47808B92588f2259A06040N6397E7010L44192a19156
10480C53806a51929E4996b89304a07972k36687g1182C946J84144n9241k4707J70781
$$ plain form
10469 274923 -100150 -418295 -221471 28486 30535 -40536 43980 -386155 -84870 -41018 -129909
10458 -129909 -97376 -164237 -271269 124441 -134356 -101212 -69490 111007 -148762 172993
10447 -25836 -75889 -59983 39517 -26759 101745 15075 273003 94744 -216825 146432 196142
10436 196142 -238826 -86587 -69988 50811 -65028 -125052 1199 -277657 343582 -198301 -399398
10425 -399398 142792 62764 144583 -65851 -283747 -151805 30159 -75014 -84240 -24452 -143904
10414 -143904 32607 -249492 207579 97892 42323 -161543 -21030 -170032 181058 31590
10403 221431 -118844 -75056 56536 188580 129576 124763 -65259 -34492 -40597 -52806 276709
10391 128903 140592 127971 -3621 237284 120202 58583 -18915 185849 151298 457695 84429
$$ packed form
10469B74923a00150l18145J96824B8486K049d0536D3980c86155h4870d1018q8891
10458a29909L2533o6861j07032A24441a34356L3144L1722A11007a48762A72993
10447b5836n0053J5906C9517b6759A01745A5075K57928I4744b16825A46432M9710
10436A96142b38826h6587J6599E0811f5028o0024A199b77657C43582a98301k01097
10425c99398A42792F2764Q1819f5851k17896J31942C0159g5014r226b4452j19452
10414a43904C2607b49492B07579I7892D2323a61543b1030j49002A81058C1590
10403B21431a18844M3788E6536J32044n9004m813f5259L0767o105j2209B76709
10391A28903J1689j2621c621B37284j17082E8583a8915A85849l4551L06397H4429
$$ plain form
10379 205265 250376 254213 382210 277005 224140 253375 89434 462293 160777 429552 218623
10368 218623 292932 456734 269815 454594 286206 43785 519038 282937 233811 -54593
10357 189851 23863 267042 423456 317934 258832 250259 435083 398585 181835 -84048 312402
10345 160760 466454 259526 148839 -43296 388937 -58226 -37825 268604 9048 -318378
10334 173162 593612 -181118 222239 74986 190069 -56633 -62972 468610 418684 -10479 236619
10322 153757 246214 338826 81768 -223179 247855 246063 219658 254989 66837 168951 45621
10310 -106699 126700 -129194 -130762 241067 173556 -32064 -82310 -33696 194768 -95931 205513
10298 49203 70650 28102 -191401 183784 -447896 -212182 -185331 91172 35042 -450909 -375143
$$ packed form
10379B05265M5111L837J27997j05205n2865K9235H9434L72859A60777K68775k10929
10368B18623P4309J63802j86919J84779j68388D3785M75253k36101m9126e4593
10357A89851B3863K43179J56414j05522n9102q573J84824l6498A81835h4048C12402
10345A60760L05694k06928j10687d3296C88937e8226K0401B68604I048c18378
10334A73162M20450a81118B22239G4986J15083e6633o339D68610m9926a0479B36619
10322A53757R2457R2612H1768b23179B47855j792k6405L5331F6837J02114D5621
10310a06699A26700a29194j568B41067o7511c2064n0246c3696A94768i5931B05513
10298D9203K1447B8102a91401A83784d47896b12182K6851I1172C5042d50909P5766
$$ plain form
10287 -375143 -124200 14836 104844 -50514 36309 -361212 -68898 47288 67671 -184522 -138938
10276 -138938 109723 55214 83480 70433 -36357 149099 -22622 -75028 171949 91696 57034
10265 57034 -89609 75689 -32147 18083 67331 453308 29058 18004 198967 -178202 92880
10253 -37065 -55387 26606 209147 -49902 191158 -247536 -75830 54471 -183829 -166055 149005
10241 20137 304749 -78645 -240721 -29235 -239822 -5755 -65481 65765 89373 264894 -94667
10229 -66298 38584 -332558 107648 320899 163730 -118821 -336517 -15170 -110183 146005
10218 57013 4554 51778 -47569 -301851 -107258 -52803 -136791 47835 -120497 -328958 130571
10206 -190656 114957 114884 -36541 85046 80223 -125593 -32433 131871 159765 29345 -121068
$$ packed form
10287c75143a24200A4836R0008e0514C6309c61212f8898D7288K0383a84522M5584
10276a38938A09723n4509K8266j3047c6357A49099b2622n2406A71949q0253l4662
10265E7034h9609G5689c2147A8083M9248L85977B9058j1054J80963a78202I2880
10253c7065j8322B6606J82541d9902A91158b47536g5830E4471a83829J7774A49005
10241B0137K84612g8645j62076b9235k10587e755n9726F5765K3608J75521i4667
10229f6298C8584c32558A07648K13251j57169a18821k17696a5170r5013A46005
10218E7013D554M7224d7569k54282a07258e2803q3988D7835a20497k08461A30571
10206a90656A14957p3c6541H5046m823a25593c2433A31871K7894B9345a21068
$$ plain form
10194 -21072 205513 -126305 -82620 250854 265140 26736 -244920 56120 -95094 -117445 -21232
10182 -114812 125704 41621 -146619 -61395 -184652 153384 45577 147601 -9891 125832
10171 87418 12463 249461 56575 -343984 -19852 -23628 -26556 69756 210870 -384287 -330704
10160 -330704 -190560 -158088 -64282 -75619 -25821 -41856 -21025 -241766 227742 16576 -142295
10148 -94736 186974 -52240 -282716 -267394 292704 92751 42900 -101023 -44235 90631 -401133
10136 -400613 -131538 -57045 -118346 -59437 -632033 169555 86894 -136431 -48432 105052
10125 -22744 -14531 -258366 -114709 103269 -389669 32206 -214346 -25419 369760 -110389
10114 -219314 -312764 -26251 198976 -249294 91193 -39705 71402 42799 -245557 -230433 -89617
$$ packed form
10194b1072B05513a26305M3685B50854J4286B6736b44920E6120i5094k2351b1232
10182a14812A25704D1621a46619f1395j23257A53384D5577J02024i891A25832
10171H7418A2463K36998E6575c43984a9852l776k928F9756J41114c84287N3583
10160c30704J40144L2472f4282j1337b5821j6035K0831k20741B27742A6576a42295
10148i4736A86974e2240k30476J5322B92704I2751D2900a01023d4235I0631d01133
10136d00613a31538e7045o1301N8909n72596A69555q2661a36431d8432A05052
10125b2744Q213k43835a14709A03269c89669C2206b14346b5419C69760a10389
10114b19314r3450b6251A98976b49294I1193c9705G1402k8603b45557J5124h9617
$$ plain form
10102 36140 -34915 64346 -106966 57186 -297838 -60123 283036 -86890 -292428 -3603 -12750
10091 -12750 -63798 -248072 -188719 261012 -127263 -4081 15606 125883 -50475 -332237 -57621
10079 -345937 57966 -175908 106298 20733 -29954 -74101 13310 21422 -216637 -344137 63943
10067 103331 3292 212578 107985 61693 -156352 30630 -355987 -331636 328888 -216253
10056 -76176 -50508 -54361 9793 38877 199373 -19768 85545 31196 -181765 75950 21338 221058
10044 221058 -317636 -129015 -128681 31696 -151779 -121872 192559 -34721 -5452 -170021 -230251
10033 -230251 -22745 -234291 -41494 119671 17416 -37402 318660 -71671 -185236 8380 -99814
10021 62010 50851 -414066 50089 -115817 -63393 -165248 136754 -13552 -114781 -315219
$$ packed form
10102C6140c4915F4346a06966E7186b97838f0123B83036h6890k05538c603r147
10091a2750n1048j84274N9353B61012a27263d081A5606J10277e0475k81762e7621
10079c45937E7966a75908A06298B0733b9954m4147A3310Q112b16637j27500F3943
10067A03331C292K09286j04593m6292a56352C0630c55987K4351C28888b16253
10056g6176K5668l853I793K9084J60496a9768H5545C1196a81765G5950B1338J99720
10044B21058c17636a29015L34C1696a51779K9907A92559c4721e452j64569o0230
10033b30251b2745k11546d1494A19671A7416c7402C18660g1671j13565H380i9814
10021F2010j1159d14066E0089a15817N2424j01855A36754a3552j01229k00438
$$ plain form
10011 -315219 -130392 -263139 20361 -38778 -58193 -142230 -150163 -143772 -91350 -135408 -243249
10000 -243249 139371 -150681 -88984 -52087 80046 877 -497864 -96988 -568 66328 -117714
9988 -391722 138141 -208136 -238548 -123027 -2203 24645 251759 -159366 -2174 -247345 41119
9976 141862 -392202 139395 -73135 -107062 -269698 3947 157175 10472 -288139 -70338 -158182
9965 -158182 -168072 -6987 130266 358792 -149776 -333326 269899 -288043 -25451 -17264 -54008
9954 -54008 44354 -138012 59880 20224 185761 -293979 -38014 -35777 -27623 -71864 111515
9942 -156912 111546 12909 42926 -341197 -368503 -131261 -93296 173256 -121164 179825
9931 58318 -267375 125462 -94158 -5571 251461 -157299 -237290 190949 337567 -82107 -124271
$$ packed form
10011c15219a30392j32747B0361c8778j9415q4037p933O391N2422m4058j07841
10000b43249A39371a50681O1697L6897H0046H77d97864i6988e68F6328a17714
9988c91722A38141b08136l0412J15521b203B4645K27114a59366b174k45171D1119
9976A41862c92202A39395g3135l3927j62636C947J53228A0472b88139g0338q7844
9965a58182r890f987A30266K28526a49776j83550B69899b88043b5451Q187l6744
9954e4008D4354a38012E9880B0224J65537b93979c8014K237Q154m4241A11515
9942a56912A11546A2909L0017c41197k7306a31261L7965A73256a21164A79825
9931E8318b67375A25462i4158e571B51461a57299p9991A90949J46618h2107m2164
$$ plain form
9920 -124271 117072 281006 -95726 -253159 19248 -195016 -124943 71807 -338971 -78354 -226586
9909 -226586 -107028 -166874 -131949 -71401 194837 -104019 -235294 60771 -14650 -91132 -207628
9898 -207628 -48014 -335091 -57689 -79620 -321958 -122091 -262457 -319640 5329 171638 -187736
9886 -120090 256577 -96077 -203352 81305 -55656 -292301 -1781 -159393 -85496 -159350 163887
9874 -182409 -208584 -91180 148111 -34763 211135 -200085 -169000 234549 93693 273054 69865
9862 22680 67324 -230251 -46518 42779 -178241 -151042 -261231 -193366 -8903 -32862 184434
9850 -69520 34444 -194275 -412715 -75578 -126779 -198799 -272222 47177 -181488 -82722 102969
9838 -45997 -273506 -63251 201422 -6701 112931 -281996 19154 -123247 56037 87944 -530307
$$ packed form
9920a24271A17072J63934i5726j57433A9248a95016P0073G1807c38971g8354j48232
9909b26586a07028n9846L4925O0548A94837a04019j31275F0771a4650p6482j16496
9898b07628d8014k87077e7689k1931k42338a22091j40366n7183E329J66309a87736
9886a20090B56577i6077j07275H1305e5656k36645a781j57612P3897p3854A63887
9874a82409k6175i1180A48111c4763B11135b00085L1085B34549I3693J79361F9865
9862B2680M4644b30251d6518D2779a78241K7199j10189O7865h903k3959A84434
9850f9520C4444a94275k18440g5578n1201p2020p3423D7177a81488h2722A02969
9838d5997k27509f3251B01422f701A12931b81996A9154a23247E6037L1907e30307
$$ plain form
9826 231173 -364749 -197198 -69249 -60321 -252824 60198 23600 -55238 125999 6348 -60590
9814 -354775 -157637 -212681 -311773 -102635 148275 -1817 12511 210942 -299129 26024 -353531
9802 -29386 33385 -310547 -116670 87701 -91403 98498 142716 47163 -147912 184503 -105587
9790 -21164 42972 11318 43568 120315 -87539 98919 -160154 -181561 18201 -27419 -208733
9779 -208733 -76284 41853 -100914 -199459 -99933 -161171 -217296 -321873 -70608 356645 -13246
9767 -155083 11580 99572 -64675 85960 51743 58658 -490483 17538 11991 198353 -144411
9755 -243377 -414558 97317 -175478 -48914 96342 11015 -213557 -249537 -256957 -3300 241660
9743 -211034 88262 45844 -387654 2522 -242888 -195877 37706 165194 -52020 -155130 -32047
$$ packed form
9826B31173c64749J67551f9249Q928j92503F0198B3600e5238A25999F348f0590
9814c54775a57637n5044r9092a02635A48275a817A2511J98431b99129B6024c53531
9802b9386C3385c10547a16670H7701i1403I8498M4218D7163a47912A84503a05587
9790b1164D2972A1318L2250P6747h7539I8919a60154k1407A8201b7419j81314
9779b08733g6284D1853a00914r8545R9526o1238n6125j04577g0608C56645a3246
9767a55083A1580Q7992f4675H5960l4217O915d90483A7538n547J86362a44411
9755b43377j71181I7317a75478d8914I6342A1015b13557l5980p420c300B41660
9743b11034H8262m2418c87654B522b42888M7011C7706J27488e2020j03110c2047
$$ plain form
9731 375745 -109730 33890 246993 60205 43455 22756 -53984 -182211 35194 145620 -112560
9719 36344 -154476 -189357 -140226 -81257 212410 -56035 -235460 -44615 -1968 -90710 87398
9707 -102086 -288813 -59281 38656 52641 47380 82458 -8710 82941 -29999 -273322 -95759 125222
9694 -230734 -77991 -96776 5247 -268486 -393142 -155114 -63076 86619 36430 223022 -144127
9682 -252765 83331 -259818 -85654 -189441 -191113 -111873 -123770 271595 185242 -251665 157324
9670 -43118 3625 110839 -112814 -291227 -247962 -310025 184076 -72956 -15315 -329601 -102917
9658 -160016 -93456 180416 82040 52850 425301 -101828 -71633 333238 -25273 -36746 -45889
9647 -45889 -165741 280271 -170255 -252896 -79305 -52772 -3028 -103245 41270 57787 9083
$$ packed form
9731C75745a09730C3890K13103F0205j6750k0699e3984j28227C5194J10426a12560
9719C6344a54476l4881M9131N8969B12410e6035j79425d4615a968q8742H7398
9707a02086j86727e9281C8656J3985n261L5078h710H2941b9999k43323i5759A25222
9694b30734g7991j8785E247b68486j24656a55114f3076H6619C6430J86592a44127
9682b52765H3331b59818h5654j03787j672P9240j1897B71595q6353b51665A57324
9670d3118C625J07214a12814j78413M3265o2063A84076g2956a5315l14286a02917
9658a60016O6560A80416H2040k9190L72451a01828L0195C33238b5273j1473r143
9647d5889j19852B80271a70255q2641g9305K6533c028j00217D1270J6517I083
$$ plain form
9635 -122005 -127073 -2387 -100060 -33246 36731 -109424 -171838 -165228 -199761 -155840 164758 -15819
9622 -266642 96836 35494 -143249 -265262 374734 -110185 51738 -140392 278603 104779
9611 -236063 77526 -256441 -269439 -262690 -51559 -79794 -162525 -296098 128147 -47364 -228136
9600 -228136 -304629 55141 359173 -319945 -6965 18951 -170874 66859 25338 -141954 -104871
9589 -104871 132998 62168 -326860 54566 -5449 126166 -130956 214290 77095 -71562 92079
9577 -119849 -309147 -302130 -84491 41015 -49094 -94529 -40519 -100764 239877 -259162 -283958
9566 -283958 -372587 -161246 -494487 75155 65529 -161308 -34804 -288839 -159133 -208650 -54075
9554 -85945 84762 -54470 73169 -45732 19464 79987 -96541 -29433 -40688 -925 19370 -197570
$$ packed form
9635a22005n068b387r7673c3246C6731a09424o2414O610l4533M3921A64758a5819
9622b66642I6836C5494a43249j22013C74734a10185E1738a40392B78603A04779
9611b36063G7526b56441j2998O749e1559k8235q2731j33573A28147d7364j80772
9600b28136p6493E5141L04032c19945f965A8951a70874F6859B5338a41954L7083
9589a04871A32998F2168c26860E4566e449A26166a30956B14290G7095g1562I2079
9577a19849j89298P017h4491D1015d9094m5435d0519o0245B39877b59162k4796
9566b83958q8629a61246l33241G5155r626a61308c4804k54035J29706m9517e4075
9554h5945H4762e4470G3169d5732A9464O0523i6541b9433j1255i25A9370a97570
$$ plain form
9541 13974 -297356 -165857 11488 -108266 25283 -96390 406063 -85577 -271628 81130 -41132
9529 -296278 13353 95046 -400006 -54760 22048 -90015 -33454 -45729 -230828 228871 -12897
9517 128253 -172355 -129977 -89308 255144 -49168 -72535 -29003 76494 -81074 -164378 -71648
9505 9962 -16776 -114060 292527 -23757 -349265 -84436 -380364 125464 -23282 375741 -31904
9493 117303 161605 -25864 -156664 -149980 131165 54141 -25420 -129084 -25617 94415 43507
9481 -43887 -123018 -24612 -185204 -300266 -98806 140543 -197723 57132 31786 -287045 13279
9469 86291 -131303 -86073 82320 36689 73078 3355 61876 53096 -243783 120558 -148096
9457 9545 -148345 -41996 -235859 -12054 -256930 -130129 -188958 -125687 -264828 -249453 189918
$$ packed form
9541A3974b97356J31499A1488a08266B5283i6390D06063h5577j86051H1130d1132
9529b96278A3353Q1693d00006e4760B2048i0015c3454j2275j85099B28871a2897
9517A28253a72355M2378M0669B55144d9168k3367b9003G6494h1074q3304g1648
9505I962a6776r7284B92527b3757l25508h4436k95928A25464b3282C75741c1904
9493A17303M4302b5864j30800O684A31165E4141b5420j03664b5617I4415D3507
9481d3887p9131b4612j60592j15062i8806A40543a97723E7132k5346b87045A3279
9469H6291a31303M5230H2320C6689L6389C355N8521q780b43783A20558a48096
9457I545a48345d1996j93863a2054k44876J26801n8829O3271j39141J5375A89918
$$ plain form
9445 -248344 -78951 -214318 -285850 -33625 111201 46542 -250129 -134307 91554 -296256 19613
9433 -1682 232602 -171389 -177508 -413540 176255 118245 58277 259787 -298337 28271 -196343
9421 111292 294949 3882 -60553 -238907 159957 -299221 87607 -394097 112372 -190256
9410 -875 307142 87777 -8881 -267335 -28466 278680 -40778 -277802 -13192 90810 110855 -101666
9397 -209719 -26155 37508 -81305 99826 -6028 307352 -332653 -93947 -3953 -77647 34259 231084
9385 231084 -168425 -344839 -69296 143860 -132251 -19486 -975 -96183 -16290 -296446 117602
9373 120999 -63763 -189061 -371887 -271870 31852 -6636 11480 -298544 -294061 115182 -7420
9361 353 -90747 -164705 -13532 -21534 60595 -234758 61562 -121523 -211814 181256 39796 -52142
$$ packed form
9445b48344g8951j35367p1532c3625A11201D6542b50129J15822I1554b96256A9613
9433a682B32602a71389o119k36032A76255n8010E8277K01510b98337B8271a96343
9421A11292J83657C882f0553j78354A59957b99221H7607c94097A12372a90256
9410h75C07142H7777h881k58454b8466B78680d0778k37024a3192I0810K0045a01666
9397b09719b6155C7508h1305I9826f028C07352c32653i3947c953p3694C4259J96825
9385B31084a68425j76414f9296A43860a32251a9486i75r5208a6290k80156A17602
9373A20999f3763j25298j82826J00017C1852f636A1480b98544M483A15182g420
9361C53i0747p3958a3532q002F0595b34758F1562a21523r0291A81256C9796e2142
$$ plain form
9348 -66160 -188492 -20745 -141705 -258248 -69535 209938 -67056 -143612 38521 118185 379696
9337 379696 97709 -59602 -217036 36698 -232628 14685 -243507 93809 49384 -7919 134728
9325 28883 45848 -50702 -52857 71216 -113396 -328496 -79611 46450 88812 235667 160863
9314 160863 -54308 -287459 -138673 139462 -182777 99707 -197625 110870 305820 -46925
9303 -178504 -380248 186990 -3869 -361773 -121336 75326 -190291 -66177 -71256 -301068 38257
9291 197667 -18896 25781 -97493 282326 -251270 -19403 65796 16425 12066 48340 -238038
9279 57550 26564 -97660 -92672 -548290 -37574 -263715 -114357 -8480 -436745 -22212 -76443
9268 -76443 -210977 58495 -49345 -10875 33764 296773 -193311 -64696 -170041 -73618 -13112
$$ packed form
9348f6160j22332b0745j20960j16543f9535B09938f7056p6556C8521P9664K61511
9337C79696I7709e9602j57434C6698b32628A4685b43507I3809m4425g919A34728
9325B8883J6965e0702k155G1216a13396k15100g9611D6450M2362J46855p4804
9314A60863e4308k33151a38673A39462a82777I9707a97625A10870J94950d6925
9303a78504k01744A86990c869l57904a21336G5326a90291f6177n079k29812C8257
9291A97667a8896B5781i7493B82326b51270a9403F5796A6425m359L6274b38038
9279E7550B6564i7660M988m55618c7574k26141a14357h480m28265b2212n4231
9268g6443j34534E8495d9345a0875C3764K63009a93311f4696j05345g3618a3112
$$ plain form
9256 301794 -85008 -172607 89590 -57153 -48927 -240713 419303 46788 -250331 63246 -289620
9244 -56585 -146961 -184176 -168185 202995 -300342 -117591 -35148 -159628 18945 -194682 -122120
9233 -122120 19520 -326459 125509 -158425 30268 -94468 -142768 -61834 -151141 -53487 326145
9221 71868 -86695 386750 61116 -21822 -188773 109592 -142889 -147500 65413 -60379 -124901
9210 -124901 -152193 -328247 -51001 37074 -123006 85817 -158267 202527 -67219 -245033 -115082
9198 -140039 -28610 -77392 92475 13847 180911 68001 179608 397600 -182852 -83080 -124629
9187 -124629 97793 24821 41808 280445 -156671 -244896 -84175 -15194 48265 -258116 -121450
9175 140599 -60124 -261219 143163 -139216 -203910 -72056 -233563 -100292 -195890 -283615 -117770
$$ packed form
9256C01794h5008q7599H9590e7153Q226j91786D19303D6788b50331F3246b89620
9244e6585r0376l7215J5991B02995c00342a17591c5148j24480A8945a94682P2562
9233a22120A9520c26459A25509a58425C0268i4468m8300f1834q9307e3487C26145
9221G1868h6695C86750F1116b1822j66951A09592a42889m611F5413f0379o4522
9210a24901k7292j76054e1001C7074a23006H5817a58267B02527f7219j77814a15082
9198a40039b8610m8782I2475A3847J67064F8001J11607K17992a82852h3080m1549
9187a24629I7793B4821J6987K38637a56671q8225h4175a5194D8265b58116a21450
9175A40599f0124k01095A43163a39216o4694g2056j61507a00292r5598q7725a17770
$$ plain form
9163 -194159 -71795 169877 -2279 -359208 75759 -314577 171942 -57791 184349 -81516 -144746
9152 -144746 -10262 -76792 -111269 -14457 13310 -33704 271960 -376181 -38902 -27931 39812
9140 -29970 -8201 28441 -149061 60021 -6525 -153288 -218695 -243405 22540 -132071 -133058 73963
9127 76132 157523 -95912 131292 59880 64397 126920 -19539 -175416 83129 139913 -406921
9115 -574548 -21476 -168573 215385 -189506 -87222 -315011 -308250 38727 -83701 -369841 -9876
9103 -334797 115414 -81864 -165859 -90232 -180038 -136153 -56202 299680 35511 41294 -240426
9091 90359 -72501 -237137 16039 -208336 -14662 -384153 -48427 -108635 -17710 -343247 9497
9079 -216973 75292 -48379 171538 117254 -272505 254240 -50939 -10142 -134037 -209925 -33177
$$ packed form
9163a94159g1795A69877b279l56929G5759c14577A71942e7791A84349h1516o3230
9152a44746a0262o6530l4477a4457A3310c3704B71960c76181c8902J0971C9812
9140b9970h201B8441a49061F0021f525j46763o5407k4710B2540a32071r87G3963
9127G6132Q1391i5912A31292E9880M517O2523a9539j55877H3129N6784d06921
9115e74548b1476j47097B15385a89506h7222k27789O761C8727h3701k86140i876
9103c34797A15414h1864q3995P5627q9806M3885e6202B99680C5511N783b40426
9091I0359g2501j64636A6039b08336a4662l69491d8427o0208a7710l25537I497
9079b16973G5292d8379A71538n4284b72505B54240e0939a0142j23895p5888c3177
$$ plain form
9067 -39574 141878 16903 -241054 142469 35877 -152200 -286427 -217084 -4090 188280 21456
9055 -315547 -39870 54371 -23711 133165 55312 -168376 57925 -116586 -98966 -19020 -7528
9043 -83950 126617 56132 -185778 386498 52739 -319831 -59051 -199851 64511 -348073 -74793
9031 215706 -259036 4803 -168555 -102949 -15290 -244735 -92809 36984 -141075 -223733 163749
9019 -73038 -123949 -91757 150262 -1654 22136 -5595 7140 -205659 9802 -70455 60794 77414
9007 77414 13978 359601 220300 -129683 -162251 180537 -3163 278562 7199 128438 -198968
8995 71764 -204839 -76235 128694 -259047 -206397 -65722 -227393 393126 53640 97366 15954
8983 -124747 9896 -45474 232047 172937 -55843 21189 287025 -189141 -117523 114433 -91384
$$ packed form
9067c9574A41878A6903b41054A42469C5877a52200j34227O9343d090A88280B1456
9055c15547c9870E4371b3711A33165E5312a68376E7925a16586J7620a9020g528
9043h3950A26617E6132a85778C86498E2739c19831e9051j40800F4511c48073g4793
9031B15706b59036D803a68555O5606a5290k29445i2809C6984a41075q2658A63749
9019g3038n0911L2192A50262a654B2136e595G140b05659I802g0455F0794J6620
9007G7414A3978L45623j39301a29683l2568A80537c163B78562G199J21239a98968
8995G1764b04839g6235A28694b59047N2650f5722j61671C93126E3640M3726A5954
8983a24747I896d5474B32047n9110e5843B1189K65836a89141P1618A14433i1384
$$ plain form
8971 -69803 -22229 371932 -185089 62735 -64636 -102837 487 111406 12452 199672 -50198
8959 11008 147283 -209509 -155289 -67350 61397 20544 98632 -51683 38477 -323604 -138944
8947 -136260 175109 -55433 -357273 -112545 -17973 78953 206023 4980 -87904 136492 137620
8936 137620 80943 239050 232379 289352 39633 3811 218209 -156428 169469 543836 1256421
8925 1256421 2339275 4148969 6529090 9356843 7131776 3053318 1226950 669528
8917 669528 222488 464783 180650 279716 -1945 266490 -390791 253067 421216 402856
8907 402856 293465 -154257 -220686 46356 -233320 -266002 56292 -281321 -235940 358088 -31506
8895 5815 -338660 -15209 122849 -463588 -6651 89810 117216 -269113 -238846 -164377 281533
$$ packed form
8971f9803b2229C71932a85089F2735f4636l8201D87J10919A2452J87220e0198
8959A1008J36275b09509N4220f7350F1397B0544P8088e1683C8477c23604a38944
8947a36260A75109e5433l01840a12545a7973G8953J27070D980h7904A36492J128
8936A37620n6677J58107o671N6973C9633C811K14398a56428A69469L74367P12585
8925A256421J082854J809694K380121K827753k225067C053318A226950n57422
8917F69528B22488K42295A80650R9066a945B66490c90791B53067J68149j8360
8907D02856j09391a54257o6429D6356b33320l2682E6292b81321M5381C58088c1506
8895E815c38660a5209A22849d63588f651H9810K7406b69113L0267P4469B81533
$$ plain form
8883 -110701 86737 -247039 -79853 -184580 -154646 26763 26106 -255700 205024 -19527 -92855
8872 -92855 -420267 207675 -103486 -22047 -120236 -434307 -211448 -210813 -93484 -59079 -213694
8861 -213694 -344838 -1938 140750 85808 -36421 55282 -253384 -158907 -328509 196742 45439
8849 303966 -241357 -5498 54072 -95190 10961 -713 -89232 -162616 116253 -26779 -279794 35589
8836 -124985 -54685 -384710 93460 472163 176789 -299480 -92558 303923 186817 -197395
8825 -438378 195258 -92820 -83311 -1746 -284458 178528 -51675 211618 -123537 -16009 -219762
$$ packed form
8883a10701H6737b47039g9853j04727K9934B6763o57b55700B05024a9527p3328
8872i2855l27412B07675a03486b2047r8189l14071b11448O35i3484L4405j54615
8861b13694j31144a938A40750n4942c6421E5282b53384R4477j69602A96742D5439
8849C03966b41357e498E4072i5190A0961g13q8519p3384A16253b6779k53015C5589
8836a24985e4685l30025I3460L78703A76789b99480i2558C03923j17106a97395
8825d38378A95258i2820R509a746k82712A78528e1675B11618a23537a6009k03753
$$ [...]
##END NTUPLES=NMR SPECTRUM
##END=
