##TITLE=AC1583_13IEXT2754_8214317_CFdQjpgJHK
##JCAMPDX= 6.0         $$ Bruker NMR JCAMP-DX V2.0
##DATA TYPE= NMR SPECTRUM
##DATA CLASS= NTUPLES
##ORIGIN= BRUKER
##OWNER= Administrator
$$ 1.72 TOPSPIN		Version 2.1
$$ 2013-10-12 20:26:06.280 -0700  Administrator@X
$$ Compression mode = diff/dup
##.OBSERVE FREQUENCY= 400.02188249412
##.OBSERVE NUCLEUS= ^1H
##.ACQUISITION MODE= SIMULTANEOUS (DQD)
##.ACQUISITION SCHEME= undefined
##.AVERAGES= 64
##.DIGITISER RES= 22
##SPECTROMETER/DATA SYSTEM= spect
##.PULSE SEQUENCE= noesygpps1d.comp
##.SOLVENT NAME= COFFEE_meoh
##.SHIFT REFERENCE= INTERNAL, COFFEE_meoh, 1, 14.96046
##AUDIT TRAIL= $$ (NUMBER, WHEN, WHO, WHERE, PROCESS, VERSION, WHAT)
$$ ##TITLE= Audit trail, TOPSPIN		Version 2.1
$$ ##JCAMPDX= 5.01
$$ ##ORIGIN= Bruker BioSpin GmbH
$$ ##OWNER= Administrator
$$ $$ E:\/data/COFFEE/nmr/AC1583_13IEXT2754_8214317_CFdQjpgJHK/32/pdata/1/auditp.txt
$$ ##AUDIT TRAIL=  $$ (NUMBER, WHEN, WHO, WHERE, PROCESS, VERSION, WHAT)
(   1,<2013-10-12 20:26:01.405 -0700>,<Administrator>,<X>,<go>,<TOPSPIN 2.1>,
      <created by zg
	started at 2013-10-12 20:14:32.014 -0700,
	POWCHK enabled, PULCHK disabled,
       configuration hash MD5:
       C8 4E 4E 5D D3 5C D8 9E 9F 52 82 E0 59 8A DE 15
       data hash MD5: 64K
       B4 05 36 E5 D6 71 58 C3 39 B3 D0 CE 52 89 EE 0C>)
(   2,<2013-10-12 20:26:04.373 -0700>,<Administrator>,<X>,<proc1d>,<TOPSPIN 2.1>,
      <Start of raw data processing
       efp LB = 0.3 FT_mod = 6 PKNL = 1 PHC0 = 0 PHC1 = 0 SI = 128K 
       data hash MD5: 128K
       DA 3C 92 78 7C B2 44 39 A5 DE FF 57 11 2A D7 FB>)
(   3,<2013-10-12 20:26:05.311 -0700>,<Administrator>,<X>,<proc1d>,<TOPSPIN 2.1>,
      <pk PHC0 = -80.08484 PHC1 = 0 
       data hash MD5: 128K
       73 78 9F 2E FB D4 B9 72 83 0C A4 BB EC B1 E0 E5>)
(   4,<2013-10-12 20:26:05.717 -0700>,<Administrator>,<X>,<proc1d>,<TOPSPIN 2.1>,
      <abs ABSG = 1 
       data hash MD5: 128K
       6B 98 76 6A E8 E2 8B CA 02 27 09 CE 90 15 A8 B0>)
(   5,<2013-10-12 20:26:05.842 -0700>,<Administrator>,<X>,<proc1d>,<TOPSPIN 2.1>,
      <abs ABSG = 2 
       data hash MD5: 128K
       19 E8 80 59 01 7B AA 77 8A FC 57 A3 3B 37 15 32>)
(   6,<2013-10-12 20:26:05.920 -0700>,<Administrator>,<X>,<proc1d>,<TOPSPIN 2.1>,
      <abs ABSG = 3 
       data hash MD5: 128K
       25 4B 84 DE 1A FD 2B F7 E6 F0 D0 E0 1F 78 71 D5>)
(   7,<2013-10-12 20:26:06.014 -0700>,<Administrator>,<X>,<proc1d>,<TOPSPIN 2.1>,
      <abs ABSG = 4 
       data hash MD5: 128K
       73 DF 0C 24 76 66 FA 1A 93 92 7C 99 77 0D 9F DC>)
(   8,<2013-10-12 20:26:06.108 -0700>,<Administrator>,<X>,<proc1d>,<TOPSPIN 2.1>,
      <abs ABSG = 5 
       data hash MD5: 128K
       60 28 9B 1F 74 FD A3 26 A8 F4 92 18 4D EC 6A FA>)
$$ ##END=
$$ 
$$ $$ hash MD5
$$ $$ 6A 32 3F 3A B6 01 44 E4 59 73 DE F4 69 A4 0A 4C
##$RELAX= 
##$RELAX= 
##$RELAX= 
##$RELAX= 
##$RELAX= 
##$RELAX= 
##$RELAX= 
##$RELAX= 
$$ Bruker specific parameters
$$ --------------------------
##$DU= <E:\>
##$EXPNO= 32
$$ [...]
##$TP07= 0
##$TPNAME0= <>
##$TPNAME1= <>
##$TPNAME2= <>
##$TPNAME3= <>
##$TPNAME4= <>
##$TPNAME5= <>
##$TPNAME6= <>
##$TPNAME7= <>
##$TPOAL= (0..7)
0.5 0.5 0.5 0.5 0.5 0.5 0.5 0.5
##$TPOFFS= (0..7)
0 0 0 0 0 0 0 0
##$TUNHIN= 0
##$TUNHOUT= 0
##$TUNXOUT= 0
##$USERA1= <user>
##$USERA2= <user>
##$USERA3= <user>
##$USERA4= <user>
##$USERA5= <user>
##$V9= 5
##$VALIST= <valist>
##$VCLIST= <CCCCCCCCCCCCCCC>
##$VD= 0
##$VDLIST= <DDDDDDDDDDDDDDD>
##$VPLIST= <PPPPPPPPPPPPPPP>
##$VTLIST= <TTTTTTTTTTTTTTT>
##$WBST= 1024
##$WBSW= 4
##$XGAIN= (0..3)
0 0 0 0
##$XL= 0
##$YL= 0
##$YMAX_a= 6146999
##$YMIN_a= -12386751
##$ZGOPTNS= <>
##$ZL1= 120
##$ZL2= 120
##$ZL3= 120
##$ZL4= 120
##$ABSF1= 14.96046
##$ABSF2= -5.597722
##$ABSG= 5
##$ABSL= 3
##$ALPHA= 0
##$AQORDER= 0
##$ASSFAC= 0
##$ASSFACI= 0
##$ASSFACX= 0
##$ASSWID= 0
##$AUNMP= <proc_prof1d_extract.lims>
##$AXLEFT= 0
##$AXNAME= <>
##$AXNUC= <1H>
##$AXRIGHT= 0
##$AXTYPE= 0
##$AXUNIT= <>
##$AZFE= 0.1
##$AZFW= 0.1
##$BCFW= 0
##$BC_mod= 0
##$BYTORDP= 0
##$COROFFS= 0
##$CY= 15
##$DATMOD= 1
##$DC= 0
##$DFILT= <>
##$DTYPP= 0
##$F1P= 0
##$F2P= 0
##$FCOR= 0.5
##$FTSIZE= 131072
##$FT_mod= 6
##$GAMMA= 0
##$GB= 0
##$INTBC= 1
##$INTSCL= 1
##$ISEN= 128
##$LB= 0.3
##$LEV0= 0
##$LPBIN= 0
##$MAXI= 10000
##$MC2= 0
##$MEAN= 0
##$ME_mod= 0
##$MI= 0
##$NCOEF= 0
##$NC_proc= -2
##$NLEV= 6
##$NOISF1= 0
##$NOISF2= 0
##$NSP= 0
##$NTH_PI= 0
##$NZP= 0
##$OFFSET= 14.96046
##$PC= 1
##$PHC0= -80.08484
##$PHC1= 0
##$PH_mod= 1
##$PKNL= yes
##$PPARMOD= 0
##$PPDIAG= 0
##$PPIPTYP= 0
##$PPMPNUM= 2147483647
##$PPRESOL= 1
##$PSCAL= 4
##$PSIGN= 0
##$PYNMP= <proc.py>
##$REVERSE= no
##$SF= 400.020009854369
##$SI= 131072
##$SIGF1= 0
##$SIGF2= 0
##$SINO= 400
##$SIOLD= 131072
##$SPECTYP= <>
##$SREGLST= <1H.CDCl3>
##$SSB= 0
##$STSI= 131072
##$STSR= 0
##$SW_p= 8223.68421052631
##$SYMM= 0
##$S_DEV= 0
##$TDeff= 65536
##$TDoff= 0
##$TI= <>
##$TILT= no
##$TM1= 0
##$TM2= 0
##$TOPLEV= 0
##$USERP1= <user>
##$USERP2= <user>
##$USERP3= <user>
##$USERP4= <user>
##$USERP5= <user>
##$WDW= 1
##$XDIM= 131072
##$YMAX_p= 311482633
##$YMIN_p= -16035
##$CURPLOT= <Network HP LaserJet P1505>
##$CURPRIN= <$Network HP LaserJet P1505>
##$DFORMAT= <normdp>
##$LAYOUT= <+/1D_H.xwp>
##$LFORMAT= <normlp>
##$PFORMAT= <normpl>
##$SURQMSG= 1
$$ End of Bruker specific parameters
$$ ---------------------------------
##NTUPLES= NMR SPECTRUM
##VAR_NAME=  FREQUENCY,     SPECTRUM/REAL,   SPECTRUM/IMAG
##SYMBOL=    X,             R,               I
##VAR_TYPE=  INDEPENDENT,   DEPENDENT,       DEPENDENT
##VAR_FORM=  AFFN,          ASDF,            ASDF
##VAR_DIM=   131072,        131072,          131072
##UNITS=     HZ,            ARBITRARY UNITS, ARBITRARY UNITS
##FACTOR=    0.0627417313425164, 1,          1
##FIRST=     8223.62146879497, 2830,         -61843
##LAST=      0,             4613,            -61575
##MIN=       0,             -16035,          0
##MAX=       8223.62146879497, 311482633,    0
$$ Real data points
##PAGE= N=1
##DATA TABLE= (X++(R..R)), XYDATA
$$ [...]
61642D19496J982K134K149J907J459J008N60k93j746l230l975m085m285m703m667
61627D03711l898l081k842k873k566j960j474j095n02K47P31Q12P74Q11Q16O79
61611C88290M53J09o45k098m082n881o777o740o436o361o243n651m908m807n410
61596C22813n817n375m508m003l964l949l736l464l170k697k014j397j198j535
61582B75986k109k377k114j771j950k538k855k668k471k533k405j712q91n66o29
61567B46397n60k87j57k48l24l13l69m94m92l40k25k81m81p22p82m16L16J028
61549B41250J446J665J745J534J115R92J330J488Q69q2l67K91J286K004K258J983
61533B60807J253N86N91J135J412R74J98l80p44j189j774k286k531k509k326k056
$$ plain form
61642 419496 421478 423612 425761 427668 429127 430135 430695 430402 428656 425426 421451 417366 413081 408378 403711
61627 403711 399813 396732 393890 391017 388451 386491 385017 383922 383420 383667 384398 385210 385984 386795 387611 388290
61611 388290 388743 388852 388207 386109 382027 376146 369369 362629 356193 349832 343589 337938 333030 328223 322813
61596 322813 316996 311621 307113 303110 299146 295197 291461 287997 284827 282130 280116 278719 277521 275986
61582 275986 273877 271500 269386 267615 265665 263127 260272 257604 255133 252600 250195 248483 247592 247026 246397
61567 246397 245837 245550 245393 245145 244821 244508 244139 243645 243153 242813 242588 242307 241826 241104 240322 239906 240222 241250
61549 241250 242696 244361 246106 247640 248755 249747 251077 252565 253434 253352 252985 253276 254562 256566 258824 260807
61533 260807 262060 262646 263237 264372 265784 266758 266956 266576 265832 264643 262869 260583 258052 255543 253217 251161
61517B51161j624r50k46J8l40r59j416j683j850j760j338r65j013j211j050o41
61501B34133n24p45p79l92J5J15J27L20N36M25o6o27q32n19k9N0l08l08N97J776
61481B32965K149J706J393J574J547Q41P5k9K66K54q5j35L73J032J295J008M31
61464B46660k7k15n00j326k449k940k232q39K65P21R65J507K343K998K966K167
61448B50064J079L07L1P9L87J033J821K329K503K755L276L724L804L706L645L532
61432B84075L319L295L517L442K669J692J357J726K107K074J910J968K124K082
61418C17357J820J572J519J590J528J148N72R7j76l96n61m24l9l7q33j883k249
61401C20605j926j930k841l802l459j768k78l50j549k198j471k89P6l48o21m18
$$ plain form
61517 251161 249537 248587 248341 248359 248019 247060 245644 243961 242111 240351 239013 238048 237035 235824 234774 234133
61501 234133 233609 232864 232085 231693 231708 231823 231950 232270 232806 233231 233165 232538 231706 231187 231158 231208 230900 230592 231189 232965
61481 232965 235114 236820 238213 239787 241334 242175 242250 242221 242487 242741 242656 242521 242894 243926 245221 246229 246660
61464 246660 246633 246418 245918 244592 242143 239203 236971 236132 236397 237118 238083 239590 241933 244931 247897 250064
61448 250064 251143 251450 251481 251560 251947 252980 254801 257130 259633 262388 265664 269388 273192 276898 280543 284075
61432 284075 287394 290689 294206 297648 300317 302009 303366 305092 307199 309273 311183 313151 315275 317357
61418 317357 319177 320749 322268 323858 325386 326534 327106 327203 327027 326631 326070 325646 325607 325570 324737 322854 320605
61401 320605 318679 316749 313908 310106 306647 304879 304601 304251 302702 300504 299033 298744 298820 298472 297851 297433
61385B97433k69l80k30L46O51K23l52l49K1J95L37R54J812K217K167K255K536
61368C09567K422J834J424J427J218M56j10L31J438K245K472K681L267M051M769
61353C39492N463O152O590O561O287O291O859P711Q249Q152P674P297P189P123
61339D37090O879O449N917N349M823M344L667K495R69l13r26j082j322j885k581
61324D69873l135l520l914m363m516l904k650j611j454j797j747j179p76p50l98
61309D34159O76J741K005J826K053K677L022L070L429M022L856K473P36l47q55
61294D64543j463k237k696k673k515k518k686k981l312l331k666j465l38K95N97
61279D34554R80J580K140K341K230K326L046M042M412L865L221L395M208M724
$$ plain form
61385 297433 297164 296784 296554 296900 297551 297774 297422 297073 297094 297289 297626 298580 300392 302609 304776 307031 309567
61368 309567 311989 313823 315247 316674 317892 318348 318238 318569 320007 322252 324724 327405 330672 334723 339492
61353 339492 344955 351107 357697 364258 370545 376836 383695 391406 399655 407807 415481 422778 429967 437090
61339 437090 443969 450418 456335 461684 466507 470851 474518 477013 477982 477669 476743 475661 474339 472454 469873
61324 469873 466738 463218 459304 454941 450425 446521 443871 442260 440806 439009 437262 436083 435307 434557 434159
61309 434159 434835 436576 438581 440407 442460 445137 448159 451229 454658 458680 462536 465009 465745 465398 464543
61294 464543 463080 460843 458147 455474 452959 450441 447755 444774 441462 438131 435465 434000 433662 433957 434554
61279 434554 435534 437114 439254 441595 443825 446151 449197 453239 457651 461516 464737 468132 472340 477064
61265D77064M540M130M017M285M968O175P658Q796R328R581R710R260P942O377
61251E73831N499N452N455M715L075J026o94j639k109k857m161n504o380o954
61237E68755p534p840p464o716o344o464o466n928n110m435m004l670l178k272
61223D91330j138n21r17j667j648q34k65l31r6J153K549K781K002J642K423L465
61207D99928L541K578J602J476K058K561K626K815L823N437O721P355Q123R704
61193E60348J1565J2649J2847J2926J3152J2842J1541R915Q996Q863Q646P678
61181F91968O212M955M270L974L704L175K220Q61n72j680k468l362m549n577n970
61166F97161o037o555p697q832r453r804j0350j1088j1697j1948j1726j0977r953
$$ plain form
61265 477064 481604 485734 489751 494036 499004 505179 512837 521633 530961 540542 550252 559512 567454 573831
61251 573831 579330 584782 590237 594952 598027 599053 598359 596720 594611 591754 587593 582089 575709 568755
61237 568755 561221 553381 545917 539201 532857 526393 519927 513999 508889 504454 500450 496780 493602 491330
61223 491330 490192 489671 488754 487087 485439 484605 484340 484009 483913 485066 487615 490396 492398 494040 496463 499928
61207 499928 503469 506047 507649 509125 511183 513744 516370 519185 523008 528445 535166 542521 550644 560348
61193 560348 571913 584562 597409 610335 623487 636329 647870 657785 666781 675644 684290 691968
61181 691968 698180 703135 707405 711379 715083 718258 720478 721339 720767 719087 716619 713257 708708 703131 697161
61166 697161 691124 684569 676872 668040 658587 648783 638433 627345 615648 603700 591974 580997 571044
61153E71044r174q760q135o777n035l761l366l635m245m917n312n287n264n822
61139D91554o864p566p301o270n144m355l795l113k176j279p64l53P24K786N172
61124D51256P043Q325R405J0329J0954J1620J2922J4806J6589J7898J8932J9770
61112F09849K0182K0269K0523K0980K0939J9952J8463J7084J5743J4008J1805
61101H09797R355O785M214J887k24k587n407q143j0215j1872j3684j5484j6568
61088G47854j6929j7452j8700k0080k0571j9873j8557j7455j7095j7445j7856
61077E45841j7450j5948j4016j2546j1651j0692r268p817p004o811o583n933n193
61064D14929m847m829m646m010l043j937p43N08J722K762L411L430K986K888L862
$$ plain form
61153 571044 561870 553110 544975 538198 533163 529402 526036 522401 518156 513239 507927 502640 497376 491554
61139 491554 484690 477124 469823 463553 458409 454054 450259 447146 444970 443691 442927 442574 443298 446084 451256
61124 451256 458299 466624 476029 486358 497312 508932 521854 536660 553249 571147 590079 609849
61112 609849 630031 650300 670823 691803 712742 732694 751157 768241 783984 797992 809797
61101 809797 819152 825937 830151 832038 831814 829227 823820 815677 805462 793590 779906 764422 747854
61088 747854 730925 713473 694773 674693 654122 634249 615692 598237 581142 563697 545841
61077 545841 528391 512443 498427 485881 474230 463538 454270 446453 439449 432638 426055 420122 414929
61064 414929 410082 405253 400607 396597 393554 391617 390874 391382 393104 395866 399277 402707 405693 408581 412443
61049D12443N641P202P950Q202Q443Q774R312J0449J2197J3845J4760J5128J5348
61036E49694J5255J4654J4199J4729J5998J6929J7156J7342J7871J8280J8374
61025G30481J8980K0985K4221K7937L1943L6667M2475M9535N8062O8112P9300
61014A188698R1365J04621J18815J31217J36780J31366J15266R3526P2548N6152
61004B240354M4528L6279L0472K6024J9824P385j3380l9441o4691q4678r8771
60993B103905j08423j14840j18690j20639j20913j18775j13360j04932r4754q3968
60983A004611p3203o3094n4296m6889m0367l4498k9700k6352k4136k2348k0558
60972E69170j8736j6995j5517j4450j3598j2462j0881r353q401p824p039o009
$$ plain form
61049 412443 418084 425286 433236 441438 449881 458655 467967 478416 490613 504458 519218 534346 549694
61036 549694 564949 579603 593802 608531 624529 641458 658614 675956 693827 712107 730481
61025 730481 749461 770446 794667 822604 854547 891214 933689 983224 1041286 1109398 1188698
61014 1188698 1280063 1384684 1503499 1634716 1771496 1902862 2018128 2111654 2184202 2240354
61004 2240354 2284882 2321161 2351633 2377657 2397481 2404866 2391486 2352045 2287354 2202676 2103905
60993 2103905 1995482 1880642 1761952 1641313 1520400 1401625 1288265 1183333 1088579 1004611
60983 1004611 931408 868314 814018 767129 726762 692264 662564 636212 612076 589728 569170
60972 569170 550434 533439 517922 503472 489874 477412 466531 457178 448777 440953 433914 427905
60960D27905n237m857m334l337k346j988k099j890r29N03J893K901L300L032K449
60945D14966K133K271K473K372K092J905J736J408J069R74R92P31J18n89j323
60930D33328k198k953l011k319j605j413j363q98l19m00j128j596j266o48m40
60915D11771n51m49j13m1l69n89k93J58Jr48j966k130j233Q0J013J249R74M81
60897D07045m0l88l03L97J572K637K822J818K70o66m41L70Q38P32N79Q79J630
60880D19751K571L398L848L889L901M366N325O404P282P830P965P816P926Q680
60866E00952R542R606Q995Q897R909J1126J1466J1232J1567J2807J4181J4970
60854F35250J5187J5252J5537J6288J7457J8600J9325J9759K0193K0532K0531
$$ plain form
60960 427905 422668 417811 413477 410140 407794 405806 403707 401817 400888 401391 403284 406185 409485 412517 414966
60945 414966 417099 419370 421843 424215 426307 428212 429948 431356 432425 433399 434391 435122 435240 434651 433328
60930 433328 431130 428177 425166 422847 421242 419829 418466 417568 417249 416849 415721 414125 412859 412211 411771
60915 411771 411220 410771 410658 410617 410248 409659 409366 409524 409525 408577 406611 404481 403248 403328 404341 405590 406564 407045
60897 407045 407005 406617 406314 406711 408283 410920 413742 415560 415830 415164 414723 415093 415931 416663 417242 418121 419751
60880 419751 422322 425720 429568 433457 437358 441724 447049 453453 460735 468565 476530 484346 492272 500952
60866 500952 510494 520100 529095 537992 547901 559027 570493 581725 593292 606099 620280 635250
60854 635250 650437 665689 681226 697514 714971 733571 752896 772655 792848 813380 833911
60843H33911K0371K0315J9922J8303J5260J1599Q182N231K632L05k004m760q189
60830I41078j2016j5754j8934k1097k2106k2509k3057k3719k3759k2917k1897
60819G13313k1383k1224k0928k0421j9775j8761j7203j5370j3622j1945j0362
60808E22319r297q971q805q079o894n848n037m142l262k829k720k269j352o52
60794D52162n97p68p22p49j302k109k461k152j617j294j225j309j486j730k001
60779D30640k298k595k752k639k317k005j928k188k686l050k894k254j694j734
60765C97606k393l369m460n527o195o093n420m934n076n381m984l673k176j406
60751C36519j550j990k008j494q67m62p9O62J681K343K168J468J051J295J714
$$ plain form
60843 833911 854282 874597 894519 912822 928082 939681 947863 953094 955726 956031 954027 949267 941078
60830 941078 929062 913308 894374 873277 851171 828662 805605 781886 758127 735210 713313
60819 713313 691930 670706 649778 629357 609582 590821 573618 558248 544626 532681 522319
60808 522319 513022 504051 495246 487167 480273 474425 469388 465246 461984 459155 456435 454166 452814 452162
60794 452162 451565 450797 450075 449326 448024 445915 443454 441302 439685 438391 437166 435857 434371 432641 430640
60779 430640 428342 425747 422995 420356 418039 416034 414106 411918 409232 406182 403288 401034 399340 397606
60765 397606 395213 391844 387384 381857 375662 369569 364149 359215 354139 348758 343774 340101 337925 336519
60751 336519 334969 332979 330971 329477 328610 328148 328069 328731 330412 332755 334923 336391 337442 338737 340451
60736C40451J551O92j84l91J9L43O1n62p72j27J027J892J944J248K27p29j418
60719C45272j771j868j968k305k845l311l569l786m135m408m218l576k997k882
60705C01633l040l040k874k897l146l161k618j759r87l67J49K91j91r23j157p23
60689B75190k38j75k00K44J115J891K259K251J865J074K24o8M20J166J506J317
60673B89841R95Q53Q43Q48R80J414K021K375K238J828J488J294J237J579K585
60658C12419L916M775M838M592M576M695M593M255L828L229K447J916K017K368
60644C64464K228J453N09l99j502k780l776m290m615m904m893m456l930l577l245
60629C26287k878k805l109l224k768k272k455l033l030k119j001l73j71j2J26
$$ plain form
60736 340451 342002 342694 342510 342119 342138 342481 342542 341980 341208 341081 342108 344000 345944 347192 347419 346690 345272
60719 345272 343501 341633 339665 337360 334515 331204 327635 323849 319714 315306 311088 307512 304515 301633
60705 301633 298593 295553 292679 289782 286636 283475 280857 279098 278111 277744 277893 278184 277993 277070 275913 275190
60689 275190 274952 274777 274577 274821 275936 277827 280086 282337 284202 285276 285500 285432 285852 287018 288524 289841
60673 289841 290836 291689 292532 293380 294360 295774 297795 300170 302408 304236 305724 307018 308255 309834 312419
60658 312419 316335 321110 325948 330540 335116 339811 344404 348659 352487 355716 358163 360079 362096 364464
60644 364464 366692 368145 368654 368255 366753 363973 360197 355907 351292 346388 341495 337039 333109 329532 326287
60629 326287 323409 320604 317495 314271 311503 309231 306776 303743 300713 298594 297593 297220 297049 297037 297163
60614B97163M2k34m52m64l03l5L04O64R57J107J025O33N9l06j05N09Q98O33O7
60595C02162j08J74K81o2k27L72J228J310N10k63l69k9M89J373K622L624L963
60578C17050M018M214M295L946L646L999M619M599L996L838M562N257M828L280
60564C76147J506K50l41n42p73j281j856j973j389m06N43J345K126K948L726M352
60548C84382M776N101N566O197O595O323N537M801M243L327J705q1j162j353j236
60533D34721j353j684j940k003j923j714j372r89p12n65m04q8L83R33J489J932
60517D24711K060J814J561J860K863M158N349O593Q318J0583J2995J5227J7282
60504E15374J9240K0966K2224K2932K3189K3122K2674K1543J9286J5621J0608
$$ plain form
60614 297163 297205 296971 296519 296055 295752 295717 296021 296685 297642 298749 299774 300407 300466 300160 300055 300564 301462 302095 302162
60595 302162 302054 302228 302509 302447 302220 302592 303820 305130 305640 305377 305008 304979 305468 306841 309463 313087 317050
60578 317050 321068 325282 329577 333523 337169 341168 345787 350386 354382 358220 362782 368039 372867 376147
60564 376147 377653 377903 377562 377020 376247 374966 373110 371137 369748 369342 369885 371230 373356 376304 380030 384382
60548 384382 389158 394259 399825 406022 412617 418940 424477 429278 433521 436848 438553 438472 437310 435957 434721
60533 434721 433368 431684 429744 427741 425818 424104 422732 421743 421031 420466 420062 419974 420357 421290 422779 424711
60517 424711 426771 428585 430146 432006 434869 439027 444376 450969 459287 469870 482865 498092 515374
60504 515374 534614 555580 577804 600736 623925 647047 669721 691264 710550 726171 736779
60493G36779M660j626p634j2960j7510k1283k4111k5827k6597k6757k6287k4918
60481E25929k2814k0595j8521j6222j3674j1705j0885j0460r272p368n782m945
60469C73686m412m055m394n386n949n261l816k680k291k453k900l287l187k656
60455C20959k357k556k529j575k02M64J43n31j106j657k058j875j138n56o13r67
60439C01846j055p98m96l42l71n43o80n03k2L78L66N4k07k36r8N7J11O8J23M48
60419B98100Q99J138J064Q57O05K13j79j47M23J085J406J420J215M87q31j881
60403C05874j587m9J399J679J054M92N52J108J753K053J734J034O34R72J774K458
60387C22934K731K542J910J155R90J716K622K756K176J751J831J878J518J147
$$ plain form
60493 736779 741439 739813 732179 719219 701709 680426 656315 630488 603891 577134 550847 525929
60481 525929 503115 482520 463999 447777 434103 422398 411513 401053 391781 384413 378631 373686
60469 373686 369274 365219 360825 355439 349490 344229 340413 337733 335442 332989 330089 326802 323615 320959
60455 320959 318602 316046 313517 311942 311740 312204 312347 311816 310710 309053 306995 305120 303982 303426 302813 301846
60439 301846 300791 299993 299497 299155 298784 298241 297561 297058 297036 297414 297780 297834 297627 297391 297293 297350 297461 297529 297652 298100
60419 298100 298999 300137 301201 302058 302663 302876 302697 302550 302973 304058 305464 306884 308099 308586 307755 305874
60403 305874 304287 304238 305637 307316 308370 308862 309414 310522 312275 314328 316062 317096 317730 318702 320476 322934
60387 322934 325665 328207 330117 331272 332262 333978 336600 339356 341532 343283 345114 346992 348510 349657
60373C49657J166J267R44K46l97o72m04M51J507K043J872J691K174L064L704L989
60357C72302M183M233L934L546L511L736L820L783L792L363J826l86j929k223
60343D07491k068k276k585k466k157k137k222j931j404j191j338j403j302j464
60329C81547k072k620k479j601n67L4J68L16Q03J289J258Q97R89J810K807L592
60313C86171M616O246P834Q468Q301Q252Q571Q549P754O661N766M851L463J584
60299D77087o01l139n929q304r466r356q645p975p471o927o169n204m244l562
60285C90095l204k894k393j860j601j616j601j425j255j171j004p12o23r84j518
60270C66234j748j704j891k500l008k748j706m55M92J034J269J172O15l47j325
$$ plain form
60373 349657 350823 352090 353034 353280 352883 352211 351807 352258 353765 355808 357680 359371 361545 364609 368313 372302
60357 372302 376485 380718 384652 388198 391709 395445 399265 403048 406840 410203 412029 411643 409714 407491
60343 407491 405423 403147 400562 398096 395939 393802 391580 389649 388245 387054 385716 384313 383011 381547
60329 381547 379475 376855 374376 372775 372208 372242 372410 372726 373529 374818 376076 376973 377962 379772 382579 386171
60313 386171 390787 397033 404867 413335 421636 429888 438459 447008 454762 461423 467189 472040 475503 477087
60299 477087 476486 473347 467418 459114 449648 440292 431647 423672 416201 409274 403105 397901 393657 390095
60285 390095 386891 383997 381604 379744 378143 376527 374926 373501 372246 371075 370071 369359 368736 367752 366234
60270 366234 364486 362782 360891 358391 355383 352635 350929 350474 350966 352000 353269 354441 355056 354709 353384
60255C53384j744j279j84Q45J313J247R65O16J38m31q27p45j39O46J020O85Q0
60238C55590K8P75J627J783J262O51L17K43M15Q07J090R49O48P64J302J697J719
60221C71667J772K158K656L085L601M134M140L432K744K812L321L409K953K643
60207D14527K924L483L788L603K906J861R83Q95J618K441K717K559K506K738K877
60192D52426K561J966J580J612J753J557Q95r4j271k453l200l102k332j561j237
60177D49100j222j282j505j952k261k012j301o64m92p72j209j426j188o44j93
60162D30977K1K55O70J004J032R73J058J043N80p6k95J59R56J696K186K332K203
60145D46774K151K465K946L188L192L260L407L353L113L080L380L621L465L043
$$ plain form
60255 353384 351640 350361 350177 351022 352335 353582 354547 355163 355301 354870 354043 353298 353159 353805 354825 355510 355590
60238 355590 355618 356393 358020 359803 361065 361716 362033 362276 362691 363498 364588 365537 366185 366949 368251 369948 371667
60221 371667 373439 375597 378253 381338 384939 389073 393213 396645 399389 402201 405522 408931 411884 414527
60207 414527 417451 420934 424722 428325 431231 433092 434075 434970 436588 439029 441746 444305 446811 449549 452426
60192 452426 454987 456953 458533 460145 461898 463455 464350 464256 462985 460532 457332 454230 451898 450337 449100
60177 449100 447878 446596 445091 443139 440878 438866 437565 436901 436409 435637 434428 433002 431814 431170 430977
60162 430977 430998 431253 431923 432927 433959 434932 435990 437033 437613 437537 437242 437401 438357 440053 442239 444571 446774
60145 446774 448925 451390 454336 457524 460716 463976 467383 470736 473849 476929 480309 483930 487395 490438
60131D90438K614K153J545R45O40O47O50L62j31m55l82j82l17p72r98o85k55k86
60113D95531o90r35q47o92n61k03M09Q51P69L11j13k93l39n36j069j773k185k013
60095D85622j447q04j05O95J314J421J121P49L73J2J19J072K262K543J733R12
60079D97592Q96J162P80k16j006j130q87p77j109j956l144m211m738m739m582
60064D71935m600m865n245n520n538n284m799m069l180k442k098j966j681j215
60050D19433q23n63k99n4Q9L57J044J908K401K502K612K708K415K050K426L331
60034D41537L301J635l97j248j115j236j871k327k549l242m438n252n252n008
60020D12538m929m647l961l507l778m202l900k882j916j481j437j502j523j350
$$ plain form
60131 490438 493052 495205 496750 497695 498335 498982 499632 499994 499863 499408 499026 498844 498527 497755 496757 496072 495817 495531
60113 495531 494841 493906 493059 492367 491806 491603 492012 492863 493632 493943 493830 493537 493198 492662 491593 489820 487635 485622
60095 485622 484175 483371 483266 483961 485275 486696 487817 488566 488939 488951 489070 490142 492404 494947 496680 497592
60079 497592 498488 499650 500430 500214 499208 498078 497191 496414 495305 493349 490205 485994 481256 476517 471935
60064 471935 467335 462470 457225 451705 446167 440883 436084 432015 428835 426393 424295 422329 420648 419433
60050 419433 418610 418047 417748 417694 417783 418140 419184 421092 423493 425995 428607 431315 433730 435780 438206 441537
60034 441537 444838 446473 446076 444828 443713 442477 440606 438279 435730 432488 428050 422798 417546 412538
60020 412538 407609 402962 399001 395494 391716 387514 383614 380732 378816 377335 375898 374396 372873 371523
60006C71523r68o87q61j400j784j619j016l79n7m6k3L69J104J704J765J447J287
59989C70359J509J781J685J261Q61O11L67J58L11R08J448J464J208J202J268P01
59973C87102m81j288j060l35N5J35L34M65O3n47n17K54J009J355J580J668J004
59956C90796l99j329q12N21J264J032O10N44N28K06j39PO70J343J434P37l55j122
59938C95536j213r99j013j244j274j076j083j524k063k261j999j371o04j18k30
59923C77464n56k04J073K317K426J502O42O28J351K435L693M863N454N280M796
59908D13164M515M376M009L429L029K833K276R49o30j331o26P31J384P02o97j670
59892D36443j621p30M66J453J838J598J246J408K091K687K812K790L110L728M157
$$ plain form
60006 371523 370555 369868 369007 367607 365823 364204 363188 362809 362752 362706 362683 363052 364156 365860 367625 369072 370359
59989 370359 371868 373649 375334 376595 377456 378067 378434 378592 378903 379811 381259 382723 383931 385133 386401 387102
59973 387102 386621 385333 384273 383938 383993 384128 384462 384927 384990 384443 383926 384180 385189 386544 388124 389792 390796
59956 390796 390397 389068 388256 388777 390041 391073 391683 392227 392755 392961 392822 392829 393499 394842 396276 397013 396658 395536
59938 395536 394323 393324 392311 391067 389793 388717 387634 386110 384047 381786 379787 378416 377812 377694 377464
59923 377464 376908 376704 377777 380094 382520 384022 384664 385292 386643 389078 392771 397634 403088 408368 413164
59908 413164 417679 422055 426064 429493 432522 435355 437631 438580 437950 436619 435993 436724 438108 438810 438113 436443
59892 436443 434822 434092 434558 436011 437849 439447 440693 442101 444192 446879 449691 452481 455591 459319 463476
59877D63476M035L334K291J374R76Q06j0j766l388l578k539j809k293l257l515
59862D54137k942k322k198k394k507k285j765j292j311j782k053j617q22m54p31
59847D27662j173j358j382j483j579j392q35j62K56K57J05K45P92J370J584J554
59831D24461J674J976K053J609Q41J75j00J5K46J30o76j968l046l288k697j863
59815D19542j437j621k054k161j719j052n78l54j74k3r6l69m70j46L32L90k70
59798D07740j399k369k640k207j628j484j739j852j488q87m10j45r7m42j144j607
59782C86202j226k46M73N55M68O18O17n8j021j225k69J036J598J222O22M34N83
59765C90383O39N45P13J404K258K588K163J410Q64O24N83Q58J658K726L343L052
$$ plain form
59877 463476 467511 470845 473136 474510 475486 476292 476282 474516 471128 467550 465011 463202 460909 457652 454137
59862 454137 451195 448873 446675 444281 441774 439489 437724 436432 435121 433339 431286 429669 428847 428393 427662
59847 427662 426489 425131 423749 422266 420687 419295 418460 418298 418554 418811 418916 419161 419953 421323 422907 424461
59831 424461 426135 428111 430164 431773 432614 432789 432689 432704 432950 433080 432404 430436 427390 424102 421405 419542
59815 419542 418105 416484 414430 412269 410550 409498 408920 408566 408392 408369 408273 407904 407434 407288 407620 408010 407740
59798 407740 406341 403972 401332 399125 397497 396013 394274 392422 390934 390047 389637 389492 389395 388953 387809 386202
59782 386202 384976 384730 385203 385758 386226 386844 387461 387403 386382 385157 384888 385924 387522 388744 389366 389800 390383
59765 390383 391022 391567 392280 393684 395942 398530 400693 402103 402967 403591 404174 405032 406690 409416 412759 415811
59749D15811K174J500J536K187K957L394L375L032K505J864J314J210J653K248
59735D46760K582K718K831K595J571J62n99l24L01N65M84K44l15j089j351p43
59719D56392m5j42p52r75o98m89m39j18M48P97R67J396J913J845J260J008J350
59702D63718J574J301J080J276J427J268J349J930K232J621P54N54P66N24q7k33
59686D81054K59O70M61k38j114j907k257k040j704j746j937j774j430j559k252
59671D62486k972l386l569l420k761j975j774k189k520k429k281k268j941j013
59657D27988R3Q62J329J750K114K343K534K641K323J501O92M03M36K49k81p98
59641D46179j057j145j123q55l33Lm18j547k475k242r87R6Q6o81j292j494j711
$$ plain form
59749 415811 417985 419485 421021 423208 426165 429559 432934 435966 438471 440335 441649 442859 444512 446760
59735 446760 449342 452060 454891 457486 459057 459219 458620 458296 458597 459162 459646 459890 459575 458486 457135 456392
59719 456392 456347 456205 455453 454478 453780 453291 452852 452734 453182 453979 454946 456342 458255 460100 461360 462368 463718
59702 463718 465292 466593 467673 468949 470376 471644 472993 474923 477155 478776 479530 480084 480850 481374 481287 481054
59686 481054 481313 481983 482444 482206 481092 479185 476928 474888 473184 471438 469501 467727 466297 464738 462486
59671 462486 459514 456128 452559 449139 446378 444403 442629 440440 437920 435491 433210 430942 429001 427988
59657 427988 428081 428943 430272 432022 434136 436479 439013 441654 443977 445478 446170 446573 447009 447258 446977 446179
59641 446179 445122 443977 442854 441999 441666 441669 441251 439704 437229 434987 434000 434096 434182 433501 432209 430715 429004
59624D29004k125k387k243j969k025k658l718m534m214k609q86l96j046j468q19
59609C95907L49J167J588K052K638L045K952K185Q69l35o83l06j01m30n92k8O17
59592D10894L61o89j549j778j859k145k211j503k84M49j2j302k303k353j948j947
59576C89821k350k360j666q99o49p08o72o55q74j067r28p35q72j097r04l36J99
59559C73248O81J377K133K495K458K462K632K712K791L374M494N412N562N344
59545D17175N543O285P056P626Q459J0016J1830J2582J1300Q424N415L297J867
59532E16875M58r67j900k172k178k251k292k025j309r5J478K885L480L064J997
59517E15048O48q89k466l647m121m155m343m976n830o541o975p161o992o249n020
$$ plain form
59624 429004 426879 424492 422249 420280 418255 415597 411879 407345 403131 400522 399636 399240 398194 396726 395907
59609 395907 396256 397423 399011 401063 403701 406746 409698 411883 412752 412417 411734 411428 411327 410897 410305 410277 410894
59592 410894 411255 410566 409017 407239 405380 403235 401024 399521 399237 399686 399674 398372 396069 393716 391768 389821
59576 389821 387471 385111 383445 382546 381897 381189 380517 379862 378988 377921 376993 376258 375386 374289 373385 373049 373248
59559 373248 373929 375306 377439 379934 382392 384854 387486 390198 392989 396363 400857 406269 411831 417175
59545 417175 422718 429003 436059 443685 452144 462160 473990 486572 497872 506296 511711 515008 516875
59532 516875 517333 516366 514466 512294 510116 507865 505573 503548 502239 502144 503622 506507 509987 513051 515048
59517 515048 515696 514807 512341 508694 504573 500418 496075 491099 485269 478728 471753 464592 457600 451351 446331
59502D46331l944l699m200m594m195l163k082j244o32l16l65n60n80m91n33n30
59486D15203k2J015J977K432K562K647K569K149J748J971K832L571L494K794K344
59471D49286K716L550L964L496K478J631J484K155L281M070L858K935K445L110
59457D90459M400N358N882O533P363P796P657P484P505P112N785L946K381J178
59443E70839k22k086m090n763o861p344p328p106o915o670o101n197m287l708
59429D97161l414k940j810j7J963L778N636P827J0035J1609J2539J3502J4863
59416E70732J6230J7297J8278J8985J8185J4816R524M143j29l288n542o757p009
59403F65465o675n803m187k447k069l780o566q964j0741j2552j4414j5523j5477
$$ plain form
59502 446331 442387 438688 434488 429894 425699 422536 420454 419210 418578 418262 417897 417337 416757 416266 415733 415203
59486 415203 415181 416196 418173 420605 423167 425814 428383 430532 432280 434251 437083 440654 444148 446942 449286
59471 449286 452002 455552 459516 463012 465490 467121 468605 470760 474041 478111 481969 484904 487349 490459
59457 490459 494859 500217 506099 512632 519995 527791 535448 542932 550437 557549 563334 567280 569661 570839
59443 570839 570617 568531 564441 558678 551817 544473 537145 530039 523124 516454 510353 505156 500869 497161
59429 497161 493747 490807 488997 488980 490943 494721 500357 508184 518219 529828 542367 555869 570732
59416 570732 586962 604259 622537 641522 659707 674523 684047 688190 688061 684773 679231 672474 665465
59403 665465 658790 652987 648800 646353 644284 640504 633938 624974 614233 601681 587267 571744 556267
59390E56267j4851j4343j3971j3333j2244j0842r362q005o803n555m074k552j405
59377D38927p81m32q8K62N05N87M99L68N05J157K153L039L620M013M265M289M270
59360D67158M641N439O084O160O121O779Q287R966J1072J1463J1551J1828J2501
59347E79050J3380J4135J4550J4552J4028J2978J1747J0688R503P443M438J483
59335G07975n21j845l305m956o258p228q494j0062j0984j0682r923r891j0645
59322F13181j1120j0522r243q298q159q322p980p007o097n873o093o030n461m827
59308E08149m457m113l446k523j636j011q28j142j567j402m62N90J030R11P17
59293D88810O06M67M65Q51J353J369R13P20J230J942K218K227K621L442M025L998
$$ plain form
59390 556267 541416 527073 513102 499769 487525 476683 467321 459316 452513 446958 442884 440332 438927
59377 438927 438146 437714 437626 437888 438393 438980 439479 439847 440352 441509 443662 446701 450321 454334 458599 462888 467158
59360 467158 471799 477238 483322 489482 495603 502382 510669 520635 531707 543170 554721 566549 579050
59347 579050 592430 606565 621115 635667 649695 662673 674420 685108 694611 702054 706492 707975
59335 707975 707454 705609 702304 697348 691090 683862 675368 665306 654322 643640 633717 623826 613181
59322 613181 602061 591539 582296 573998 565839 557517 549537 542530 536433 530560 524467 518437 512976 508149
59308 508149 503692 499579 496133 493610 491974 490963 490135 488993 487426 486024 485562 486152 487182 488093 488810
59293 488810 489416 489883 490348 491199 492552 493921 494834 495554 496784 498726 500944 503171 505792 509234 513259 517257
59277E17257L851M216M924N326N342N680O762P928Q114P167O000N443N321M871
59263E98202L699K013J93j510k903l830m358m822n529o461p331p857p878p294
59249E44334o147m800l859l629l659l146j818k32R46J683K368L113L612L609L215
59234E35590K702K264J957J710J312N82m55j627k768l707m349m830n431o073o222
59219E10655n611m773m387m370m146l618l223l097k921k636k595k829k778k084
59205D61587j085k21M97J079J146M52n29j020p47n5N79Q91R14R91J460K208K784
59188D70931L011L178L468L674L645L568L645L861M254M881N379N177M419L954
59174E27045M118M237L814L416L673M216M444M703N613O619O489N150L963L889
$$ plain form
59277 517257 521108 525324 530248 535574 540916 546596 553358 561286 569400 576567 582567 588010 593331 598202
59263 598202 601901 603914 604107 602597 599694 595864 591506 586684 581155 574694 567363 559506 551628 544334
59249 544334 538187 533387 529528 525899 522240 519094 517276 517044 517990 519673 522041 525154 528766 532375 535590
59234 535590 538292 540556 542513 544223 545535 546117 545662 544035 541267 537560 533211 528381 522950 516877 510655
59219 510655 505044 500271 495884 491514 487368 483750 480527 477430 474509 471873 469278 466449 463671 461587
59205 461587 460502 460281 460778 461857 463003 463455 462926 461906 461159 461104 461683 462574 463488 464479 465939 468147 470931
59188 470931 473942 477120 480588 484262 487907 491475 495120 498981 503235 508116 513495 518672 523091 527045
59174 527045 531163 535400 539214 542630 546303 550519 554963 559666 565279 571898 578387 583537 587500 591389
59160E91389M286L911K416M63j172k266l075l855m497m751m841n417o572p418
59146E58601p121o003n058m693m566m391m128l660k962k536k810l349l375k981
59132E00968k840k846k091m39J009J422J292J476J997K412K771L408M244M894
59118E17677N284N602N908O174O566P237Q006Q524Q664Q529Q294Q205Q501R022
59104F22193R124Q299O854N626N122N057M791L981K803J608N50l20q08p34m47
59089F73699o54j456k038j817j453k039l536m809n187n097n145n441o070p363
59075F21594r168j0457j0356r191q019p370o923o266n498n022n020n209n105m534
59061E23456l802l185k526j630q54q22j563k411k818k770k411j794j155q70r39
$$ plain form
59160 591389 595675 599586 602002 602465 601293 599027 595952 592097 587600 582849 578008 572591 566019 558601
59146 558601 551480 545477 540419 535726 531160 526769 522641 518981 516019 513483 510673 507324 503949 500968
59132 500968 498128 495282 493191 492752 493761 495183 496475 497951 499948 502360 505131 508539 512783 517677
59118 517677 522961 528563 534471 540645 547211 554448 562454 570978 579642 588171 596465 604670 613171 622193
59104 622193 631317 639616 646470 652096 657218 662275 667066 671047 673850 675458 676008 675688 674880 674146 673699
59089 673699 673045 671589 669551 667734 666281 664242 660706 655897 650710 645613 640468 635027 628957 621594
59075 621594 612426 601969 591613 582422 574403 567033 560110 553844 548346 543324 538304 533095 527990 523456
59061 523456 519654 516469 513943 512313 511459 510637 509074 506663 503845 501075 498664 496870 495715 494845 493906
59046D93906r24n69j21J10O3k08n65n70J70J327K080K177K146K345K474K349K419
59029E08609L081M063M917N637O338O877P271P939R008R808R658Q819Q151Q012
59015F08188P994P562O616N535M833M544L914K244J09j027p02j23m11j064r26
59000F47286M3R76J563K221L030L493L367K975K629K357K161J951J301o8j676
58985F73609k728l083l291l745m496n630p057p930p168m795k139m75mj70l17J28
58969F20709J381K895L776L856L899M496N330N868O147O392O331N554M226K935
58955F83795J870P20p12k223l648n113o654p885q364q202q009q199q499q295p347
58940F03235o059n062m727m973n387n457m947m149l642l709m108m362m181l539
$$ plain form
59046 493906 492982 492413 492292 492402 492465 492257 491692 491122 491292 492619 494699 496876 499022 501367 503841 506190 508609
59029 508609 511690 515753 520670 526307 532645 539522 546793 554732 563740 573548 583206 592025 600176 608188
59015 608188 616182 623744 630360 635895 640728 645272 649186 651430 651539 650512 649810 649687 649276 648212 647286
59000 647286 647329 648305 649868 652089 655119 658612 661979 664954 667583 669940 672101 674052 675353 675285 673609
58985 673609 670881 667798 664507 660762 656266 650636 643579 635649 628481 623686 621547 621072 621068 620898 620581 620709
58969 620709 622090 624985 628761 632617 636516 641012 646342 652210 658357 664749 671080 676634 680860 683795
58955 683795 685665 686385 685673 683450 679802 674689 668035 660150 651786 643584 635575 627376 618877 610582 603235
58940 603235 597176 592114 587387 582414 577027 571570 566623 562474 558832 555123 551015 546653 542472 538933
58926E38933k609j695j005m71lJ13n29j690k453k209j293m19J47N31P66Q72J160
58909E28146J956L098M074M618M918N349O148P217Q027Q038P393O908P066P452
58895F10408P546P659Q505J0104J1757J2959J3754J4312J4724J5170J5778J6209
58883G58885J5932J4955J3841J2924J1891J0230P766M663J243k089m995p383r366
58870H28497j1060j2541j3823j4699j4843j4306j3633j3120j2338j0865r261q591
58858F79417r040r684r677r153q706q513q273p711o942o376o319o551o493n931
58844E70048n287m894m391l376k316k127k877l714m019l971l886l691l352l129
58830E19018l102k988k725k721l161l515l207k403j706j298q33k9J004J980K668
$$ plain form
58926 538933 536324 534629 533624 533153 533150 533263 532734 531044 528591 526382 525089 524670 524817 525348 526114 526986 528146
58909 528146 530102 533200 537274 541892 546810 552159 558307 565524 573551 581589 588982 595890 602956 610408
58895 610408 617954 625613 634118 644222 655979 668938 682692 697004 711728 726898 742676 758885
58883 758885 774817 789772 803613 816537 828428 838658 846424 851087 852330 850241 845246 837863 828497
58870 828497 817437 804896 791073 776374 761531 747225 733592 720472 708134 697269 688008 679417
58858 679417 670377 660693 651016 641863 633157 624644 616371 608660 601718 595342 589023 582472 575979 570048
58844 570048 564761 559867 555476 552100 549784 547657 544780 541066 537047 533076 529190 525499 522147 519018
58830 519018 515916 512928 510203 507482 504321 500806 497599 495196 493490 492192 491359 491330 492334 494314 496982
58815D96982K856K432J575Q07O90J362K304K735K381J734J408J364J044J80q65
58800E18989j536j580j092l61K68O15P60Q31P83N47K07j52n42p57l00R95K439
58783E20114L194L248L215L357L436L459L738M162M163L585K931K437J624J86
58769E62849j295k059k167k207k334k176j639j211j395k089k697k751k346j942
58755E34541j789j604j015p4Q95J841K876L713L723K780J616J075J270J772K303
58740E53923K934L696M297M371L916L414L396L911M551N047N514N953N997N495
58726F16415N012N089N329M905L887L263L555M176M425M371M401M500M445M331
58712F78104M371M451M225L549K608J751J286J183R26l7j619l227m603o032p605
$$ plain form
58815 496982 499838 502270 503845 504652 505342 506704 509008 511743 514124 515858 517266 518630 519674 519854 518989
58800 518989 517453 515873 514781 514420 514688 515303 516063 516894 517677 518224 518431 518279 517737 516980 516680 517675 520114
58783 520114 523308 526556 529771 533128 536564 540023 543761 547923 552086 555671 558602 561039 562663 562849
58769 562849 561554 559495 557328 555121 552787 550611 548972 547761 546366 544277 541580 538829 536483 534541
58755 534541 532752 531148 530133 530059 530954 532795 535671 539384 543107 545887 547503 548578 549848 551620 553923
58740 553923 556857 560553 564850 569221 573137 576551 579947 583858 588409 593456 598970 604923 610920 616415
58726 616415 621427 626516 631845 636750 640637 643900 647455 651631 656056 660427 664828 669328 673773 678104
58712 678104 682475 686926 691151 694700 697308 699059 700345 701528 702454 702417 700798 697571 692968 686936 679331
58697F79331q826r344r554j0075j0910j1587j1879j1906j1668j0920r579q025
58685E55058o776o063n732n543n370n052m226k737j227p53j443k074j484K3J395
58670E07996K416L675N154O006N878N439N317N401N533N913O387O177N006L720
58656E80018L178L061K507J322o5j342k355k787k575k343k731l568m146m120l506
58641E60548k277o00P44R93L52k62l33L4P74J945L124L516K873J812J035P01O90
58624E75669R40J302J477J456J724K703M160N414N991N904N467N018M785M798
58610F26808M854M642L982K966J896J091O71N03K34m94j733l017l672l496l035
58595F32200k935l168l166k599j689p20K95J334K156K549K635K779L278M190N252
$$ plain form
58697 679331 670505 661161 651607 641532 630622 619035 607156 595250 583582 572662 563083 555058
58685 555058 548282 542219 536487 530944 525574 520522 516296 513559 512332 511579 510136 508062 506578 506601 507996
58670 507996 510412 514087 519241 525247 531125 536564 541881 547282 552815 558728 565115 571292 576298 580018
58656 580018 583196 586257 588764 590086 590021 588679 586324 583537 580962 578619 575888 572320 568174 564054 560548
58641 560548 558271 557671 558415 559408 559760 559498 559165 559199 559973 561918 565042 568558 571431 573243 574278 574979 575669
58624 575669 576609 577911 579388 580844 582568 585271 589431 594845 600836 606740 612207 617225 622010 626808
58610 626808 631662 636304 640286 643252 645148 646239 646910 647413 647647 647153 645420 642403 638731 635235 632200
58595 632200 629265 626097 622931 620332 618643 617923 618218 619552 621708 624257 626892 629671 632949 637139 642391
58580F42391N979O152O123O432P113P760Q139Q330Q261P690O846O468O941P834
58566G42459Q584R325J0538J2249J3921J5077J5691J5978J6019J5643J4653J3220
58554I03357J1833J0707R448P671N786M588M105L383J621r31l392n222o545p861
58540I38548r488j1132j2056j1957j1497j1550j2103j2465j2334j1930j1224r922
58528H00890q283p052o366n538m150k529r50P31K308L077K899K627K862L166L022
58513G86714K736K682K463J670P92M36K49n08j643k323k348k322k636l060l330
58498G79572l475l570l598l570l408k922k166j590j503j604j383p18J76J124K004
58483G53369K724L441M452N727O867P697Q364Q774Q625Q120P901P959P467O065
$$ plain form
58580 642391 648370 654522 660645 667077 674190 681950 690089 698419 706680 714370 721216 727684 734625 742459
58566 742459 751043 760368 770906 783155 797076 812153 827844 843822 859841 875484 890137 903357
58554 903357 915190 925897 935345 943016 948802 953390 957495 960878 962499 961568 958176 952954 946409 938548
58540 938548 929060 917928 905872 893915 882418 870868 858765 846300 833966 822036 810812 800890
58528 800890 792607 785555 779189 773651 769501 766972 766022 766753 769061 772138 775037 777664 780526 783692 786714
58513 786714 789450 792132 794595 796265 797057 797493 797742 797234 795591 793268 790920 788598 785962 782902 779572
58498 779572 776097 772527 768929 765359 761951 759029 756863 755273 753770 752166 750783 750065 750241 751365 753369
58483 753369 756093 759534 763986 769713 776580 784277 792641 801415 810040 818160 826061 834020 841487 847552
58469H47552M398K973J429m20j824k189k068k149k101j387n04k62l98o4P97J613
58453H45396K354L389M411M625L950L076K392J701R11K63j66n09p83j003j382
58438H68625j892j962j265l46J91O55J672L010L986M604N415O420P128P571Q356
58423I12168R653J0862J1314J0840R718Q521P715P031N601L156N64j232k207k672
58409I91032k601k282k659l996n004m507l215k646k900k882k189j297l16R81K153
58394I57672K571K668L329M175M005K861K044K009J824J008L20K40N6q01j638
58379I82343j503n12N39J354K333L837N645P031P504P568Q352J0049J1358J1114
58365A057012R891R164R419J0139J1002J1979J2611J2503J2251J2610J3055J2407
$$ plain form
58469 847552 851950 854923 856352 855932 854108 851919 849851 847702 845601 844214 843710 843448 843050 842986 843783 845396
58453 845396 847750 851139 855550 860175 864125 867201 869593 871294 872205 872468 872302 871793 871010 870007 868625
58438 868625 866733 864771 863506 863160 863351 864006 865678 868688 872674 877278 882693 889113 896241 903812 912168
58423 912168 921821 932683 943997 954837 964555 973076 980791 987822 993423 996579 997143 995911 993704 991032
58409 991032 988431 986149 983490 979494 974490 969983 966768 964122 961222 958340 956151 954854 954538 955519 957672
58394 957672 960243 962911 966240 970415 974420 977281 979325 981334 983158 984166 984486 984726 984782 983981 982343
58379 982343 980840 980328 980867 982221 984554 988391 994036 1001067 1008571 1016139 1024491 1034540 1045898 1057012
58365 1057012 1066903 1076067 1085486 1095625 1106627 1118606 1131217 1143720 1155971 1168581 1181636 1194043
58353A194043J0687R089Q188P531O927O830P330P863Q096Q227Q437Q871R848J1298
58339A313265J2415J2868J3603J5244J6556J6114J4765J4542J5640J6420J6194
58328A477626J5815J5539J4491J2614J1210J0979J1149J0975J0631J0267R698
58317A610994R274R626J0380J0538J0258J0649J1837J2905J3788J5380J7531J8911
58305A762071J9117J9193J9631J9795J9672K0292K1800K2877K2752K2205K2113
58294A991518K2471K3256K4629K5917K6052K5316K5080K5677K6288K6954K8657
58283B271815L1171L2948L3554L4184L5440L6710L7972L9998M2373M3658M3968
58272B683791M5006M7122M8843M9819N1557N4506N7166N8892O1010O4092O6803
$$ plain form
58353 1194043 1204730 1213819 1222007 1229538 1236465 1243295 1250625 1258488 1266584 1274811 1283248 1292119 1301967 1313265
58339 1313265 1325680 1338548 1352151 1367395 1383951 1400065 1414830 1429372 1445012 1461432 1477626
58328 1477626 1493441 1508980 1523471 1536085 1547295 1558274 1569423 1580398 1591029 1601296 1610994
58317 1610994 1620268 1629894 1640274 1650812 1661070 1671719 1683556 1696461 1710249 1725629 1743160 1762071
58305 1762071 1781188 1800381 1820012 1839807 1859479 1879771 1901571 1924448 1947200 1969405 1991518
58294 1991518 2013989 2037245 2061874 2087791 2113843 2139159 2164239 2189916 2216204 2243158 2271815
58283 2271815 2302986 2335934 2369488 2403672 2439112 2475822 2513794 2553792 2596165 2639823 2683791
58272 2683791 2728797 2775919 2824762 2874581 2926138 2980644 3037810 3096702 3157712 3221804 3288607
58261C288607O8524P0529P3451P6082P7842P9880Q2578Q4567Q5414Q6682Q9125
58250D163281R1471R3220R5959J00587J05794J10675J16156J22675J29077J35112
58240E264007J42310J51130J60030J68384J77478J87619J97501K07388K19460
58231F875307K33997K48861K63739K80946L01012L21821L43329L68326L97101
58222I634439M26601M56736M92045N34816N82216O32764O89912P56321Q30629
58213A5036479R13264J009449J123175J254498J406366J587408J804357K059335
58205B6194331K359169K718948L149946L650482M214492M843843N550817O359220
58197E9041248P306900Q434156R761702J1287505J3002441J4886909J6886831
$$ plain form
58261 3288607 3357131 3427660 3501111 3577193 3655035 3734915 3817493 3902060 3987474 4074156 4163281
58250 4163281 4254752 4347972 4443931 4544518 4650312 4760987 4877143 4999818 5128895 5264007
58240 5264007 5406317 5557447 5717477 5885861 6063339 6250958 6448459 6655847 6875307
58231 6875307 7109304 7358165 7621904 7902850 8203862 8525683 8869012 9237338 9634439
58222 9634439 10061040 10517776 11009821 11544637 12126853 12759617 13449529 14205850 15036479
58213 15036479 15949743 16959192 18082367 19336865 20743231 22330639 24134996 26194331
58205 26194331 28553500 31272448 34422394 38072876 42287368 47131211 52682028 59041248
58197 59041248 66348148 74782304 84544006 95831511 108833952 123720861 140607692
58190A40607692J8911660K0836028K2419023K3175343K2426825J9669689J5000702
58183B83046962R162250L119212k434162p229373j1255423j4556612j7153336
58176B42699518j9028886k0128687k0404354j9893429j8747485j7174991j5371772
58169A11949914j3500854j1695630j0047388q595097p342603o282197n397851
58162D9088294m661757m044619l527247l096151k735012k428193k166962j945218
58154B4483135j753803j584747j436309j308282j196555j096828j009053r33440
58146A4164118q66096q03051p44729o92432o44146n97752n54632n16214m80468
58137H264598m45445m12832l84415l58320l32328l07847k86952k68456k50360
$$ plain form
58190 140607692 159519352 180355380 202774403 225949746 248376571 268046260 283046962
58183 283046962 292209212 295328424 292894262 285664889 274409466 259852854 242699518
58176 242699518 223670632 203541945 183137591 163244162 144496677 127321686 111949914
58169 111949914 98449060 86753430 76706042 68110945 60768342 54486145 49088294
58162 49088294 44426537 40381918 36854671 33758520 31023508 28595315 26428353 24483135
58154 24483135 22729332 21144585 19708276 18399994 17203439 16106611 15097558 14164118
58146 14164118 13298022 12494971 11750242 11057810 10413664 9815912 9261280 8745066 8264598
58137 8264598 7819153 7406321 7021906 6663586 6331258 6023411 5736459 5468003 5217643
58128E217643k33454k19056k05758j91819j78396j67218j57374j47496j38708
58119C578364j32225j26280j18728j10734j04653r9994r4707q8898q4144q0342
58109B537659p6270p2155o8986o6238o2739n8901n5821n3187n0203m7484m5892
58098A879783m4598m2435m0036l8573l7455l5456l3057l1447l0161k8001k5433
58087A493131k3866k3149k1960k0215j9044j8719j8412j7809j7380j7269j7238
58076A278070j7385j7738j7742j7166j6848j7361j7779j7026j5595j4607j4056
58065A094767j3313j2479j1874j1037r631q527q598r217r372r377r928j0414r784
58052I61216q468p699p538p185o693o748p126p011o505o342o381n905n155n057
$$ plain form
58128 5217643 4984189 4765133 4559375 4367556 4189160 4021942 3864568 3717072 3578364
58119 3578364 3446139 3319859 3201131 3090397 2985744 2885750 2791043 2702145 2618001 2537659
58109 2537659 2461389 2389234 2320248 2254010 2191271 2132370 2076549 2023362 1973159 1925675 1879783
58098 1879783 1835185 1792750 1752714 1714141 1676686 1641230 1608173 1576726 1546565 1518564 1493131
58087 1493131 1469265 1446116 1424156 1403941 1384897 1366178 1347766 1329957 1312577 1295308 1278070
58076 1278070 1260685 1242947 1225205 1208039 1191191 1173830 1156051 1139025 1123430 1108823 1094767
58065 1094767 1081454 1068975 1057101 1046064 1036433 1027906 1019308 1010091 1000719 991342 981414 971000 961216
58052 961216 952748 945049 937511 930326 923633 916885 909759 902748 896243 889901 883520 877615 872460 867403
58038H67403n595n834n520n365n780o470p182p772p794p065o385o606p202o964
58024G75869n858m998m898m953m646m242m111m229m378m186l123j225M43Q01k3
58009G26243j043j602j533p28N00J175P73J96O45J950L014L489L814L948L349
57994G44190K171J323J216J320J076N24K8J6P51J873K412J835P09j64p00j029
57978G57551q62k17nq20j821j888j271q85p10k53N5m83j197p91N33J338J233J196
57960G50703J589J557P54Q6K32P87J335K035K643K299R93O0M40J466K110K486
57944G71575L229M204M796M976N275N995P050Q341R722J0777J1102J0684R780
57931H67506Q662P538O518N505M314K937J433k71k157l871n074n874o413o371
$$ plain form
58038 867403 861808 855974 850454 845089 839309 832839 825657 817885 810091 803026 796641 790035 782833 775869
58024 775869 770011 765013 760115 755162 750516 746274 742163 737934 733556 729370 726247 725022 725465 726266 726243
58009 726243 725200 723598 722065 721337 721837 723012 723785 723981 724626 726576 729590 733079 736893 740841 744190
57994 744190 746361 747684 748900 750220 751296 751820 751848 751864 752615 754488 756900 758735 759444 759280 758580 757551
57978 757551 756689 756472 756467 755647 753826 751938 750667 749782 749072 748819 748874 748391 747194 746403 746936 748274 749507 750703
57960 750703 752292 753849 754603 754689 754921 755708 757043 759078 761721 764020 765013 765073 765513 766979 769089 771575
57944 771575 774804 779008 783804 788780 794055 800050 807100 815441 825163 835940 847042 857726 867506
57931 867506 876168 883706 890224 895729 900043 902980 904413 904142 901985 898114 893040 887166 880753 874382
57917H74382n556m705m796n678o267o095n753n661n314m132k337n97O73J362J545
57902H21071J476J358J004K05o43q02q0J126K492L700M044L122J987K309M141
57887H46510N624N378M113L246K994K707K234J829J341N07k09r5N86P41j45j407
57871H75954k224k605l033l514l444k448j042k04k62n40k79M63J153J671K229
57856H61875K626K446J994K183L155L891L636L010K977L322L004J838Q42Q44J391
57841H99034J348K54j266k161j876p08M81R49O42K44O10K031L908N250N497M909
57825I19146M197L979M454N283N686N082L831K943K845K837K209J372J237J766
57811I66867J917J101j3l55L02J207J479R40J80j08J53N83J145K182L458L905
$$ plain form
57917 874382 868826 864121 859325 853647 847380 841285 835532 829871 824557 820425 818088 817491 818164 819526 821071
57902 821071 822547 823905 824909 825114 824471 823669 823589 824715 827207 830907 834951 838073 840060 842369 846510
57887 846510 852134 857512 861625 864871 867865 870572 872806 874635 875976 876483 876274 876179 876765 877506 877361 875954
57871 875954 873730 871125 868092 864578 861134 858686 857644 857440 857178 856638 856359 856822 857975 859646 861875
57856 861875 864501 866947 868941 871124 874279 878170 881806 884816 887793 891115 894119 895957 896799 897643 899034
57841 899034 900382 900636 899370 897209 895333 894625 895106 896055 896697 896941 897551 899582 903490 908740 914237 919146
57825 919146 923343 927322 931776 937059 942745 947827 951658 954601 957446 960283 962492 963864 965101 966867
57811 966867 968784 969885 969872 969517 969819 971026 972505 973445 973625 973517 973670 974253 975398 977580 981038 984943
57795I84943K989J688J302J720J876J579J705K573L355L424L250L517M115M560
57781A022596M783M944M981M836M836N420O608P862Q380P665O177N143N191N412
57767A104834M538K802J602J459J491J080O66M94r2j246j801q99N09J052J031
57752A117520J700K999L524K681J443P67M95K61L34R32J499J456J093J000J058
57737A138762P64L83Q44K289L510L320K120J437K031L105L525L216K896K923K964
57722A174089K755K538K686L232L898M303M156L530K934K854L177L409L362L285
57708A220208L374L565L776L952L873L440L086L389M168M622M431M166M376M834
57694A275260N015M808M468M302M594N429O326O544O075N856O696Q337R867J0723
$$ plain form
57795 984943 987932 989620 990922 992642 994518 996097 997802 1000375 1003730 1007154 1010404 1013921 1018036 1022596
57781 1022596 1027379 1032323 1037304 1042140 1046976 1052396 1059004 1066866 1075246 1082911 1089088 1094231 1099422 1104834
57767 1104834 1109372 1112174 1113776 1115235 1116726 1117806 1118472 1118966 1118874 1117628 1115827 1114928 1115437 1116489 1117520
57752 1117520 1119220 1122219 1125743 1128424 1129867 1130634 1131129 1131390 1131724 1132656 1134155 1135611 1136704 1137704 1138762
57737 1138762 1139526 1139909 1140753 1143042 1146552 1149872 1151992 1153429 1155460 1158565 1162090 1165306 1168202 1171125 1174089
57722 1174089 1176844 1179382 1182068 1185300 1189198 1193501 1197657 1201187 1204121 1206975 1210152 1213561 1216923 1220208
57708 1220208 1223582 1227147 1230923 1234875 1238748 1242188 1245274 1248663 1252831 1257453 1261884 1266050 1270426 1275260
57694 1275260 1280275 1285083 1289551 1293853 1298447 1303876 1310202 1316746 1322821 1328677 1335373 1343710 1353577 1364300
57680A364300J0957J0984J1354J2455J4142J6020J8135K0895K4121K6889K8701
57669A558953L0064L1391L1805K9824K4885J7770R878K556l268p539j0968j4072
57657A701279j6504j7665j7529j6434j4594j2419j0720r790q609o021k490K24
57645A568728J202J297J736K719L663M228M501M595M532M443M574N018N536N635
57631A622407M998L989L532M191N468O337O320N791N291M983M765M580M499M735
57617A691886N574P028Q513R143Q466O911N511N121N769O668P088P186P581Q199
57603A790644Q163P161O219O423P427P945P464O670O351O673P511Q668R555R432
57589A896306Q330P301P317Q256R173R342Q796Q093P802Q095Q652Q963Q716P923
$$ plain form
57680 1364300 1375257 1386241 1397595 1410050 1424192 1440212 1458347 1479242 1503363 1530252 1558953
57669 1558953 1589017 1620408 1652213 1682037 1706922 1724692 1734570 1737126 1733858 1726319 1715351 1701279
57657 1701279 1684775 1667110 1649581 1633147 1618553 1606134 1595414 1585624 1577015 1570994 1568504 1568728
57645 1568728 1569930 1571227 1572963 1575682 1579345 1583573 1588074 1592669 1597201 1601644 1606218 1611236 1616772 1622407
57631 1622407 1627405 1631394 1634926 1639117 1644585 1650922 1657242 1663033 1668324 1673307 1678072 1682652 1687151 1691886
57617 1691886 1697460 1704488 1713001 1722144 1730610 1737521 1743032 1748153 1753922 1760590 1767678 1774864 1782445 1790644
57603 1790644 1798807 1805968 1812187 1818610 1826037 1833982 1841446 1848116 1854467 1861140 1868651 1877319 1886874 1896306
57589 1896306 1904636 1911937 1919254 1927510 1936683 1946025 1954821 1962914 1970716 1978811 1987463 1996426 2005142 2013065
57575B013065O913O340O824Q225R469R624Q997Q653Q918R034Q411P601P612Q660
57561B128346R999J0762J0657J0006R378R224R628J0365J1142J1737J1984J1804
57549B255032J1301J0701J0215R984J0047J0235J0252J0048R957J0219J0549J0527
57537B379067J0225J0100J0320J0616J0758J0823J0924J1057J1294J1759J2284
57526B499227J2408J1907J1093J0504J0461J0932J1625J2137J2258J2153J2122
57515B626827J2149J1997J1660J1414J1321J1104J0657J0387J0742J1577J2248
57504B752083J2350J2165J2305J3033J3918J4282J3889J3137J2530J2228J2134
57493B894054J2153J2145J1871J1339J1036J1430J2326J3050J3293J3386J3733
$$ plain form
57575 2013065 2019978 2026318 2033142 2041367 2050836 2060460 2069457 2078110 2087028 2096062 2104473 2112074 2119686 2128346
57561 2128346 2138345 2149107 2159764 2169770 2179148 2188372 2198000 2208365 2219507 2231244 2243228 2255032
57549 2255032 2266333 2277034 2287249 2297233 2307280 2317515 2327767 2337815 2347772 2357991 2368540 2379067
57537 2379067 2389292 2399392 2409712 2420328 2431086 2441909 2452833 2463890 2475184 2486943 2499227
57526 2499227 2511635 2523542 2534635 2545139 2555600 2566532 2578157 2590294 2602552 2614705 2626827
57515 2626827 2638976 2650973 2662633 2674047 2685368 2696472 2707129 2717516 2728258 2739835 2752083
57504 2752083 2764433 2776598 2788903 2801936 2815854 2830136 2844025 2857162 2869692 2881920 2894054
57493 2894054 2906207 2918352 2930223 2941562 2952598 2964028 2976354 2989404 3002697 3016083 3029816
57482C029816J4306J4806J5021J4931J4640J4381J4414J4765J5108J4963J4125
57471C191276J2949J2168J2193J2635J2797J2673J2967J3987J5018J5270J4909
57460C338842J4629J4561J4321J3907J3787J4141J4620J4936J5127J5224J5188
57449C499283J5250J5704J6359J6639J6373J5938J5595J5267J4990J4971J5082
57438C671451J4950J4720J5016J5925J6667J6652J6256J6117J6306J6609J7026
57427C847695J7398J7164J6168J5289J5551J6761J7814J8085J7860J7479J6919
57416D034183J6343J6311J7061J7986J8334J8108J7913J8032J8071J7634J7028
57405D227004J6945J7556J8230J8320J7940J7635J7555J7405J7120J7061J7370
$$ plain form
57482 3029816 3044122 3058928 3073949 3088880 3103520 3117901 3132315 3147080 3162188 3177151 3191276
57471 3191276 3204225 3216393 3228586 3241221 3254018 3266691 3279658 3293645 3308663 3323933 3338842
57460 3338842 3353471 3368032 3382353 3396260 3410047 3424188 3438808 3453744 3468871 3484095 3499283
57449 3499283 3514533 3530237 3546596 3563235 3579608 3595546 3611141 3626408 3641398 3656369 3671451
57438 3671451 3686401 3701121 3716137 3732062 3748729 3765381 3781637 3797754 3814060 3830669 3847695
57427 3847695 3865093 3882257 3898425 3913714 3929265 3946026 3963840 3981925 3999785 4017264 4034183
57416 4034183 4050526 4066837 4083898 4101884 4120218 4138326 4156239 4174271 4192342 4209976 4227004
57405 4227004 4243949 4261505 4279735 4298055 4315995 4333630 4351185 4368590 4385710 4402771 4420141
57394D420141J7688J7768J7910J8464J9259J9889K0308K0665K0795K0418J9767
57383D633072J9498J9856K0302K0174J9535J9048J9193J9796K0334K0455K0150
57372D851413J9574J8978J8732J9065J9669J9878J9481J8997J8870J8799J8355
57361E061811J7914J8207J9033J9350J8760J8141J8437J9489K0498K1081K1341
57350E274062K1370K1243K1206K1345K1302K0842K0387K0518K1149K1643K1597
57339E506664K1005J9963J8786J8222J8915K0651K2669K4667K6861K9088L0577
57328E758068L0983L0949L1193L1440L0871K9391K7910K7286K7466K7738K7570
57317F080865K6986K6337K5949K5937K6159K6333K6341K6344K6408K6106K4902
$$ plain form
57394 4420141 4437829 4455597 4473507 4491971 4511230 4531119 4551427 4572092 4592887 4613305 4633072
57383 4633072 4652570 4672426 4692728 4712902 4732437 4751485 4770678 4790474 4810808 4831263 4851413
57372 4851413 4870987 4889965 4908697 4927762 4947431 4967309 4986790 5005787 5024657 5043456 5061811
57361 5061811 5079725 5097932 5116965 5136315 5155075 5173216 5191653 5211142 5231640 5252721 5274062
57350 5274062 5295432 5316675 5337881 5359226 5380528 5401370 5421757 5442275 5463424 5485067 5506664
57339 5506664 5527669 5547632 5566418 5584640 5603555 5624206 5646875 5671542 5698403 5727491 5758068
57328 5758068 5789051 5820000 5851193 5882633 5913504 5942895 5970805 5998091 6025557 6053295 6080865
57317 6080865 6107851 6134188 6160137 6186074 6212233 6238566 6264907 6291251 6317659 6343765 6368667
57306F368667K3049K1630K1302K1419K0938J9887J9188J9115J8838J7803J6713
57295F588549J6549J7193J7689J7540J7102J6862J6856J6869J6704J6364J6182
57284F774459J6684J7956J9267J9722J9175J8157J7053J5873J4762J4111J4007
57273F961226J4035J3871J3694J3784J4029J4207J4464J5120J6049J6660J6642
57262G123781J6444J6769J7722J8713J9220J9240J8952J8314J7332J6427J6010
57251G318924J5900J5633J5267J5303J5818J6345J6662J7110J7867J8665J9511
57240G503005K0993K3334K5812K7644K8857K9693K9805K8870K7491K6541K5883
57229G797928K4721K3013K1549K0743K0375K0491K1444K2823K3487K3124K2873
$$ plain form
57306 6368667 6391716 6413346 6434648 6456067 6477005 6496892 6516080 6535195 6554033 6571836 6588549
57295 6588549 6605098 6622291 6639980 6657520 6674622 6691484 6708340 6725209 6741913 6758277 6774459
57284 6774459 6791143 6809099 6828366 6848088 6867263 6885420 6902473 6918346 6933108 6947219 6961226
57273 6961226 6975261 6989132 7002826 7016610 7030639 7044846 7059310 7074430 7090479 7107139 7123781
57262 7123781 7140225 7156994 7174716 7193429 7212649 7231889 7250841 7269155 7286487 7302914 7318924
57251 7318924 7334824 7350457 7365724 7381027 7396845 7413190 7429852 7446962 7464829 7483494 7503005
57240 7503005 7523998 7547332 7573144 7600788 7629645 7659338 7689143 7718013 7745504 7772045 7797928
57229 7797928 7822649 7845662 7867211 7887954 7908329 7928820 7950264 7973087 7996574 8019698 8042571
57218H042571K3765K5297K6254K6307K6063K5939K5754K5273K4495K3508K2474
57207H317700K1655K1116K0558J9772J9090J8979J9401J9860J9939J9414J8095
57196H535579J6032J3763J1872J0274Q384O032L732J980O42o86k086l359m456
57183H597703n569o776p903q793r629j0856j2715j4903j6820j8184j9321k0717
57171H445517k2437k4219k6068k8425l1536l5017l8258m1171m4097m7101m9747
57160H057441n1746n3365n4956n6406n7459n8281n9229o0119o0305n9614n8708
57149G427253n8303n8427n8716n8993n9163n8958n8349n8032n8916o0992o3190
57138F775214o4553o5186o5767o6446o6595o5674o3889o1672n8805n4573m8917
$$ plain form
57218 8042571 8066336 8091633 8117887 8144194 8170257 8196196 8221950 8247223 8271718 8295226 8317700
57207 8317700 8339355 8360471 8381029 8400801 8419891 8438870 8458271 8478131 8498070 8517484 8535579
57196 8535579 8551611 8565374 8577246 8587520 8595904 8601936 8605668 8607648 8608290 8607604 8605518 8602159 8597703
57183 8597703 8592134 8585358 8577455 8568662 8559033 8548177 8535462 8520559 8503739 8485555 8466234 8445517
57171 8445517 8423080 8398861 8372793 8344368 8312832 8277815 8239557 8198386 8154289 8107188 8057441
57160 8057441 8005695 7952330 7897374 7840968 7783509 7725228 7665999 7605880 7545575 7485961 7427253
57149 7427253 7368950 7310523 7251807 7192814 7133651 7074693 7016344 6958312 6899396 6838404 6775214
57138 6775214 6710661 6645475 6579708 6513262 6446667 6380993 6317104 6255432 6196627 6142054 6093137
57127F093137m2905l7590l2786k7587k1869j6493j1990p849l334J737P412J4030
57115E913913K1631K9619L7679M6535N7138O9717Q4513J02909J26723J56563J91975
57104F838915K33265K82221L40935M11007M94299N93700P12547Q53635J018876
57095A1779400J209293J424944J664831J926343K203916K488298K767809L029784
57087B8494618L259587L439240L550827L583694L536503L409038L192174K869712
57079E5335393K434077J902030J315170P23530J64403l49539q27256j286177j737827
57070E7673804k179127k591628k947669l220266l391907l457935l424322l303806
57062C3157144l113654k874384k607210k330744k059251j802989j569007j361286
$$ plain form
57127 6093137 6050232 6012642 5979856 5952269 5930400 5913907 5901917 5894068 5890734 5892471 5899883 5913913
57115 5913913 5935544 5965163 6002842 6049377 6106515 6176232 6260745 6363654 6490377 6646940 6838915
57104 6838915 7072180 7354401 7695336 8106343 8600642 9194342 9906889 10760524 11779400
57095 11779400 12988693 14413637 16078468 18004811 20208727 22697025 25464834 28494618
57087 28494618 31754205 35193445 38744272 42327966 45864469 49273507 52465681 55335393
57079 55335393 57769470 59671500 60986670 61710200 61874603 61525064 60697808 59411631 57673804
57070 57673804 55494677 52903049 49955380 46735114 43343207 39885272 36460950 33157144
57062 33157144 30043490 27169106 24561896 22231152 20171901 18368912 16799905 15438619
57054A5438619j180805j026097q94133p81364o84764o02294n32415m73538m24277
57045H838932l83923l51980l27254l07842k92175k79484k69260k60676k52829
57036F113509k45221k37742k30293k22587k14352k05659j97033j89026j81628
57027D189968j74285j66681j59153j52107j45361j38516j31661j25260j19478
57018B877466j14205j09604j06000j03153j00259r6874r3344r0234q7708q5625
57008A890460q3768q1766p9184p6015p2685o9412o5918o2044n8251n5083n2412
56997A133922m9613m6292m2526l8560l4664l1140k8111k5306k2285j8950j5580
56986G80895j2498r899p967o838o460o636p222q120r223j0485j1978j3597j4925
$$ plain form
57054 15438619 14257814 13231717 12337584 11556220 10871456 10269162 9736747 9263209 8838932
57045 8838932 8455009 8103029 7775775 7467933 7175758 6896274 6627014 6366338 6113509
57036 6113509 5868288 5630546 5400253 5177666 4963314 4757655 4560622 4371596 4189968
57027 4189968 4015683 3849002 3689849 3537742 3392381 3253865 3122204 2996944 2877466
57018 2877466 2763261 2653657 2547657 2444504 2344245 2247371 2154027 2063793 1976085 1890460
57008 1890460 1806692 1724926 1645742 1569727 1497042 1427630 1361712 1299668 1241417 1186334 1133922
56997 1133922 1084309 1038017 995491 956931 922267 891127 863016 837710 815425 796475 780895
56986 780895 768397 758498 750531 743693 737233 730597 723375 715255 706032 695547 683569 669972 655047
56973F55047j5655j5988j6190j5883j4437j2105j0079q975p917n710k503M65K538
56960E32608M252O130P781Q478Q045O713M505J403k176n534q337j0751j2977j4935
56946E25205j6291j6555j5302j2669r503o724m547k629p52J008K686M567O854
56933D55348R531J2402J4840J5672J3937R923N011L68l766p594j1214j4697j8022
56920D81739k0630k1696k1232k0266j9482j8292j5911j2795j0255q836p913o772
56908B97659n433m339l765l637l599l260k626k136j976j635o22P06J633K174K990
56893B72134M280N599O812Q346J0277J1970J3074J4095J5297J5649J3763R749
56881D01045N360K218M31r00k402l952n102n530n053l499p88K769O389R291J1455
$$ plain form
56973 655047 639392 623404 607214 591331 576894 564789 554710 545735 537818 532108 529605 530070 532608
56960 532608 536860 542990 550771 559249 567294 574007 578512 579915 577739 572205 563868 553117 540140 525205
56946 525205 508914 492359 477057 464388 454885 448161 443614 440985 440233 441241 443927 448494 455348
56933 455348 464879 477281 492121 507793 521730 531653 536664 537032 533266 525672 514458 499761 481739
56920 481739 461109 439413 418181 397915 378433 360141 344230 331435 321180 312344 304431 297659
56908 297659 292226 287887 284122 280485 276886 273626 271000 268864 266888 265253 264631 265337 266970 269144 272134
56893 272134 276414 282013 288825 297171 307448 319418 332492 346587 361884 377533 391296 401045
56881 401045 406405 408623 409054 408154 405752 401800 396698 391168 386115 382616 381828 384597 390986 400277 411732
56866D11732J3781J7218K1754K6457L0491L3669L5828L6123L3561K8230K1392
56855G10236J4148O603j274q522j3709j6525j7979j8903j8901j7090j3353q383
56843E96348k906K733Q470J4526K1309K8930L6860M4328N0772N5518N7264N4554
56831I68706M6886L5140K1064O632o424j7225k6080l3753m0172m4277m5290m3724
56819H21483m0713l6664l1089k3785j5662p986j017O093J3902K1646K8063L2733
56807G67004L5790L6407L2780K4224J2615R15r289j8101k5770l1917l6304l9257
56795G49097m0975m1071l9191l5642l1039k5732j9905j3942q380l513P60M762
56783D95229Q696J2312J4922J5826J4674J1395O188j59o333j1475j5887k0255
$$ plain form
56866 411732 425513 442731 464485 490942 521433 555102 590930 627053 660614 688844 710236
56855 710236 724384 730987 729713 721191 707482 690957 672978 654075 635174 618084 604731 596348
56843 596348 593442 596175 604645 619171 640480 669410 706270 750598 801370 856888 914152 968706
56831 968706 1015592 1050732 1071796 1078428 1072004 1054779 1028699 994946 954774 910497 865207 821483
56819 821483 780770 744106 713017 689232 673570 665584 664567 670660 684562 706208 734271 767004
56807 767004 802794 839201 871981 896205 908820 909735 900446 882345 856575 824658 788354 749097
56795 749097 708122 667051 627860 592218 561179 535447 515542 501600 493220 489707 490467 495229
56783 495229 503925 516237 531159 546985 561659 573054 579242 579083 572750 561275 545388 525133
56771E25133k4387k7298k8436k8147k6987k5262k3354k1680k0138j8172j5640
56760B65632j3095j1080r653q738q294p945p123n931n184n250n425m919l888l004
56746A66103k512k322k561l338m185m308l389j807k42O71N89k30j054j380j302
56731A38733j032n00K58P98P73M35J85mk92m85l37l4J41K70M84N23K78K57P86
56712A41237J127L63r99j400l25R71J141L11m79o78m64j37J54K83K30J10p3m76
56694A40896r43r49k78N42R07Q96R67J174J216J041Q63O10nq03j140p77k52r8
56676A43867j52l7J08r1m63m88j41O6k3J02P85J624K048J965J508O06o21j428
56658A49235j144k1J152K164L295M276M286L225K116J794J863J460N40k07l56
$$ plain form
56771 525133 500746 473448 445012 416865 389878 364616 341262 319582 299444 281272 265632
56760 265632 252537 241457 231804 223066 214772 206827 199704 193773 188589 183339 177914 172995 169107 166103
56746 166103 163591 161269 158708 155370 151185 146877 143488 141681 141439 142110 142699 142469 141415 140035 138733
56731 138733 137701 137201 137459 138257 139030 139465 139650 139646 139354 138869 138532 138498 138639 138909 139393 139916 140194 140451 141237
56712 141237 142364 142727 141728 140328 140003 140974 142115 142426 141947 141269 140805 140668 140822 141105 141335 141445 141372 140896
56694 140896 139953 139004 138726 139268 140175 141071 142038 143212 144428 145469 146332 146942 146937 146134 144994 144217 143965 143867
56676 143867 143715 143678 143786 143695 143232 142744 142603 142669 142646 142748 143533 145157 147205 149170 150678 151284 150663 149235
56658 149235 148091 148070 149222 151386 154681 158957 163243 166468 168584 170378 172241 173701 174241 174034 173678
56643A73678n5M09Q10Q72N00M8L0N17J137J516J473R08r7j120j682j668j301q65
56625A75110o92j131k094k788k441j327n77q74j726k201j942j287p16n22p99j366
56609A52627j801j802j495j176q23j96N63Q31K77n16n92K24J160J509J369J169
56593A51328R43N38J72K03M49L51j57m88k28L17O12M88R5l32m60o6N28O37J01
56574A55031l29J06J167J918J831J273R62J268J983K645L048L403L946M484M661
56559A87397M522M363M091L314K181J422J253R83J15p82r23n59o01j270j893j953
56543B01660j731j754k041k075j406k16P24Q57N52N77R03O62m31j412j366p11
56527A92792m49o73o87l19r7k54m38n10p93j344j645j325o38n5K67L96L58J83
$$ plain form
56643 173678 173623 174032 174842 175714 176214 176262 176292 176809 177946 179462 180935 181843 181746 180626 178944 177276 175975 175110
56625 175110 174418 173287 171193 168405 165964 164637 164060 163186 161460 159259 157317 156030 155314 154792 153993 152627
56609 152627 150826 149024 147529 146353 145530 145334 145897 146728 147005 146489 145897 146121 147281 148790 150159 151328
56593 151328 152271 152809 152981 153184 153633 153984 153827 153339 153111 153428 154040 154528 154623 154291 153831 153765 154293 154930 155031
56574 155031 154702 154808 155975 157893 159724 160997 161959 163227 165210 167855 170903 174306 178252 182736 187397
56559 187397 191919 196282 200373 203687 205868 207290 208543 209526 209641 208859 207936 207377 206776 205506 203613 201660
56543 201660 199929 198175 196134 194059 192653 192437 193161 194018 194570 195147 196050 196712 196281 194869 193503 192792
56527 192792 192343 191670 190983 190664 190567 190313 189875 189365 188572 187228 185583 184258 183620 183565 183832 184228 184586 184769
56509A84769q6m88j052j533j599j221o27P0Q81J546J608R92K39m1J40J56n13j576
56491A81665k042j297M5P26L13m16o49n08n10o73o91n27k84R7O23J002J116J238
56473A79228J354R09k27j139r94k58R7M3J77M12K41j1N70J938K950K874K073J049
56455A91286r1j079j370r82n63l93j16L26M28Q5r0J77L43O7j02L78J130J438J201
56436A92073Q41O87Q43J246J559J444J118J070J122N17p99j782j602o52K51Q93
56420A98829J353J377Q21K15J11K58J05k09o9N84J157J236R99P13L64j02m55l15
56402B06972L95J200J424R16L47M64J128J497J048J00o69p43J05J609K847K924
56386B21564J999J153J104J527J739J514J000L93p3k23j69q2K41J059K001K379
$$ plain form
56509 184769 184683 184195 183143 181610 180011 178790 178163 178233 179114 180660 182268 183260 183499 183458 183598 183754 183241 181665
56491 181665 179623 178326 178371 179097 179410 178994 178345 177837 177327 176654 175963 175436 175152 175249 175872 176874 177990 179228
56473 179228 180582 181491 181264 180125 179131 178873 178970 179013 179190 179602 179843 179832 180402 182340 185290 188164 190237 191286
56455 191286 191195 190116 188746 187764 187201 186808 186692 187018 187446 187531 187441 187618 187961 188028 187926 188304 189434 190872 192073
56436 192073 192914 193601 194444 195690 197249 198693 199811 200881 202003 202520 201721 199939 198337 197685 197936 198829
56420 198829 200182 201559 202380 202595 202706 202964 203069 202860 202791 203375 204532 205768 206767 207480 207844 207742 207287 206972
56402 206972 207367 208567 209991 210907 211254 211718 212846 214343 215391 215491 214822 214079 214184 215793 218640 221564
56386 221564 223563 224716 225820 227347 229086 230600 231600 231993 231920 231697 231528 231446 231687 232746 234747 237126
56370B37126K208K124K244J969J090K33j13j80j87J14P30J064P94M10L66L82J47
56353B50521J9M06R63J089P79M34J93l5j87j40R6N25J145J674J786J772K241L009
56335B66290L084K114J070J000J817K709L143K986K376J857K020K584K524J478
56321B97052K87k38k51j76JK57K92K00N08J109J182O60N29J088J289N51j00K74
56303C04514J044J378J686K410K720J951J107J244J616J238J117K616M532M407
56289C33580K318Q32J104J658J307R11J399K195K623L092L856M134L547L053L427
56274C69036L946L748L432M092N542O675P021O987O950P009P330P991Q625Q885
56260D57269R036R610J0644J1766J2865J4261J6182J8415K0517K2286K4000K6097
$$ plain form
56370 237126 239334 241458 243702 245671 246761 246994 246881 246701 246514 246628 247358 248422 249216 249626 249992 250374 250521
56353 250521 250540 250946 251909 252998 253777 254211 254404 254369 254182 254042 254138 254663 255808 257482 259268 261040 263281 266290
56335 266290 269374 271488 272558 273558 275375 278084 281227 284213 286589 288446 290466 293050 295574 297052
56321 297052 297339 297101 296850 296674 296675 296932 297224 297424 297932 299041 300223 300883 301412 302500 303789 304340 304240 304514
56303 304514 305558 306936 308622 311032 313752 315703 316810 318054 319670 320908 322025 324641 329173 333580
56289 333580 335898 336730 337834 339492 340799 341710 343109 345304 347927 351019 354875 359009 362556 365609 369036
56274 369036 372982 376730 380162 384254 389796 396471 403492 410479 417429 424438 431768 439759 448384 457269
56260 457269 466305 475915 486559 498325 511190 525451 541633 560048 580565 602851 626851 652948
56248F52948K8545L0786L2517L4139L5994L7499L7765L6884L5849L5155L4231
56237A032312L2355K9392K5471K0641J5241R996N325Q89l817q675j3047j6519
56225A129564j9278k1775k4127k5952k6928k7404k8054k8823k8791k7433k5452
56214H45547k3879k2760k1453j9837j8496j7753j7190j6173j4482j2456j0779
56203F50289r907r534q946q037p360p001o248m835l584l105k772j894j046j131
56189E74889j776j942j513j105p43n2P14J076J416K337L295L285K587K367K740
56174E87575K826K621L078M169M592L909L422M232N724O743P190P646Q269Q868
56160F60864R480J0275J1284J2513J3941J5275J6191J6925J8115K0075K2730K6029
$$ plain form
56248 652948 681493 712279 744796 778935 814929 852428 890193 927077 962926 998081 1032312
56237 1032312 1064667 1094059 1119530 1140171 1155412 1165408 1170733 1171622 1167805 1159130 1146083 1129564
56225 1129564 1110286 1088511 1064384 1038432 1011504 984100 956046 927223 898432 870999 845547
56214 845547 821668 798908 777455 757618 739122 721369 704179 688006 673524 661068 650289
56203 650289 640382 630848 621902 613865 606505 599504 593256 588421 584837 581732 578960 577066 576020 574889
56189 574889 573113 571171 569658 568553 567810 567758 568472 569548 570964 573301 576596 579881 582468 584835 587575
56174 587575 590401 593022 596100 600269 604861 608770 612192 616424 622148 628891 636081 643727 651996 660864
56160 660864 670344 680619 691903 704416 718357 733632 749823 766748 784863 804938 827668 853697
56148H53697K9864L3816L7731M2226M7805N3928N9826O5833P2622P9423Q4313
56137A461084Q6278Q5812Q3584P9683P4333O8262O2204N6635N1719M6729M0107
56126B196430L1275K1848J3860P426J511l906q387j3095j9957k8908l8019m6330
56114B113748n4313o1603o6686o9266p0628p1136o9594o5751o1186n6818n1670
56103A415097m5068l8132l1936k6082k0226j5259j1764q913o040l811k651j541
56091A203674M20K598M030M789N189N005M511M848O272P486P722Q041R365J0720
56077A284670J0821J0148R972J0377J0596J0609J1052J2161J3640J5094J6063
56066A415203J6393J6882J8470K0518K1252K0314J9410J9898K1252K2500K3516
$$ plain form
56148 853697 883561 917377 955108 997334 1045139 1099067 1158893 1224726 1297348 1376771 1461084
56137 1461084 1547362 1633174 1716758 1796441 1870774 1939036 2001240 2057875 2109594 2156323 2196430
56126 2196430 2227705 2249553 2263413 2270839 2272350 2268444 2260057 2246962 2227005 2198097 2160078 2113748
56114 2113748 2059435 1997832 1931146 1861880 1791252 1720116 1650522 1584771 1523585 1466767 1415097
56103 1415097 1370029 1331897 1299961 1273879 1253653 1238394 1226630 1217717 1211677 1207866 1205215 1203674
56091 1203674 1204094 1206692 1210722 1215511 1220700 1225705 1230216 1235064 1241336 1248822 1256544 1264585 1273950 1284670
56077 1284670 1295491 1305639 1315611 1325988 1336584 1347193 1358245 1370406 1384046 1399140 1415203
56066 1415203 1431596 1448478 1466948 1487466 1508718 1529032 1548442 1568340 1589592 1612092 1635608
56055A635608K4264K4383K4269K4982K6365K6981K6520K6479K7603K8705K8907
56044A925066K9101L0089L1179L1809L2701L4309L5896L7162L8911M1073M2169
56033B309465M1893M2081M3917M6239M7912M9657N2108N4309N5660N7277N9862
56022B860380O2282O3788O5469O8063P0517P2256P4628P8459Q2448Q5575Q8802
56011C672667R2835R6541R9277J02316J06473J10827J15219J21130J28537J35111
56001D780933J40229J46518J55428J64822J73056J81712J91968K02137K11464
55992F348267K22563K36998K52392K66973K83061L02730L24113L45563L69387
55983H952047L97654M28348M59619M93814N33363N77028O24218O78426P42147
$$ plain form
56055 1635608 1659872 1684255 1708524 1733506 1759871 1786852 1813372 1839851 1867454 1896159 1925066
56044 1925066 1954167 1984256 2015435 2047244 2079945 2114254 2150150 2187312 2226223 2267296 2309465
56033 2309465 2351358 2393439 2437356 2483595 2531507 2581164 2633272 2687581 2743241 2800518 2860380
56022 2860380 2922662 2986450 3051919 3119982 3190499 3262755 3337383 3415842 3498290 3583865 3672667
56011 3672667 3765502 3862043 3961320 4063636 4170109 4280936 4396155 4517285 4645822 4780933
56001 4780933 4921162 5067680 5223108 5387930 5560986 5742698 5934666 6136803 6348267
55992 6348267 6570830 6807828 7060220 7327193 7610254 7912984 8237097 8582660 8952047
55983 8952047 9349701 9778049 10237668 10731482 11264845 11841873 12466091 13144517 13886664
55974A3886664Q13247Q90966R80357J086270J208709J349294J516259J717639
55966B3449405J956402K238478K578258K989125L475732M042704M702849N470214
55958E0903167O356187P381519Q579460R974051J1564500J3338013J5279097J7352583
55950A40728577J9493898K1607341K3490091K4682277K4460602K2174092J7733949
55943B94370827J1781783N330023p86267o169077j0742457j4534603j7565495
55936B61684734j9817443k1228645k1735551k1361402k0258726j8654241j6766588
55929A21862138j4776290j2830861j1036244r444047q065238o894869n917633
55922E2896956n104494m423477l853232l378779k981312k642392k352707k107360
$$ plain form
55974 13886664 14699911 15590877 16571234 17657504 18866213 20215507 21731766 23449405
55966 23449405 25405807 27644285 30222543 33211668 36687400 40730104 45432953 50903167
55958 50903167 57259354 64640873 73220333 83194384 94758884 108096897 123375994 140728577
55950 140728577 160222475 181829816 205319907 230002184 254462786 276636878 294370827
55943 294370827 306152610 311482633 310696366 304527289 293784832 279250229 261684734
55936 261684734 241867291 220638646 198903095 177541693 157282967 138628726 121862138
55929 121862138 107085848 94254987 83218743 73774696 65709458 58814589 52896956
55922 52896956 47792462 43368985 39515753 36136974 33155662 30513270 28160563 26053203
55914B6053203j896948j711411j547951j407149j285083j176305j080455r98678
55906A4949223r26946q59671p96818p41152o91286o43520n97842n56420n18419
55897H617149m81690m47274m17171l89800l62456l36203l13626k93797k74023
55888E301109k54611k37473k21887k06059j91133j79369j69767j59683j49355
55879C531772j40882j34021j26869j19634j13921j09283j04018r8480r4294r1137
55869B399233q7401q3103p9172p4982o9600o4333o0988n8667n5345n1534m9197
55858A664911m7989m5866m2744m0355l8957l7190l4904l3251l2272l0955k9485
55847A250943k8953k9119k8778k7922k7334k6575k4734k2591k1654k1515k0563
$$ plain form
55914 26053203 24156255 22444844 20896893 19489744 18204661 17028356 15947901 14949223
55906 14949223 14022277 13162606 12365788 11624636 10933350 10289830 9691988 9135568 8617149
55897 8617149 8135459 7688185 7271014 6881214 6518758 6182555 5868929 5575132 5301109
55888 5301109 5046498 4809025 4587138 4381079 4189946 4010577 3840810 3681127 3531772
55879 3531772 3390890 3256869 3130000 3010366 2896445 2787162 2683144 2584664 2490370 2399233
55869 2399233 2311832 2228729 2149557 2074575 2004975 1940642 1879654 1820987 1765642 1714108 1664911
55858 1664911 1616922 1571056 1528312 1487957 1449000 1411810 1376906 1343655 1311383 1280428 1250943
55847 1250943 1221990 1192871 1164093 1136171 1108837 1082262 1057528 1034937 1013283 991768 971205
55836I71205j8856j7831j7601j6945j5765j5145j5095j4569j3607j3235j3319
55825G99237j2783j1847j1850j2768j3148j2649j2520j3225j3673j3247j2695
55814F58832j2532j2201j1383j0610j0085r187p667o193n337m895m395l501j995
55801E58851j76R03N90k99m06N42J879L132L948L685K319J121J106J399N15j428
55785E77681l292m914o878q802r720r809j0021j0288r802q780q146p705o450m616
55771D68458l572l724m222m764n851p106p305o382n687n798n729m807l754l248
55757C96509k859k159j667j940k673l328l868m393m815n200n775o341o405o019
55743C39067n756n829n939n881n585m735l312k171k157k811l054k825k852l085
$$ plain form
55836 971205 952349 934518 916917 899972 884207 869062 853967 839398 825791 812556 799237
55825 799237 786454 774607 762757 749989 736841 724192 711672 698447 684774 671527 658832
55814 658832 646300 634099 622716 612106 602021 592834 585167 578974 573637 568742 564347 560846 558851
55801 558851 558675 559578 560168 559869 559463 560005 561884 565016 568964 572649 574968 576089 577195 578594 579109 577681
55785 577681 574389 569475 562597 553795 544075 534266 524245 513957 504155 495375 487229 479524 473074 468458
55771 468458 464886 461162 456940 452176 446325 439219 431914 425532 419845 414047 408318 403511 399757 396509
55757 396509 393650 391491 389824 387884 385211 381883 378015 373622 368807 363607 357832 351491 345086 339067
55743 339067 333311 327482 321543 315662 310077 305342 302030 299859 297702 294891 291837 289012 286160 283075
55729B83075k769k019j858k591l347l511l347l168k978l029l548l838k901j037
55715B43134M07R30J197J466J120J21n43l26J81M65P74J152R52j02j403k436l335
55698B43754m103m337m128m206m695m782m059l237k994l079l008k817k565j962
55684A93782r68o0M98R48J361J451J243J111J038O56J87K53O15K88p98j467j032
55667A99106k25J03L3j40n48j057j058n73n24j162j344k08J384K051J686J186
55651A98710J068J240J539J691J280L96k16k02j93q16j817k679l308l576l115
55636A90002k281k324l646m812m438l272l130m189m800l840k037p54n17r88j720
55621A47254k449k999l165k733j699n18J67J95n0l32p57j191j090l61K81J91m22
$$ plain form
55729 283075 280306 278287 276429 273838 270491 266980 263633 260465 257487 254458 250910 247072 244171 243134
55715 243134 243541 244471 245668 247134 248254 248375 247832 247506 247687 248152 248926 250078 251030 250928 249525 247089 243754
55698 243754 239651 235314 231186 226980 222285 217503 213444 210207 207213 204134 201126 198309 195744 193782
55684 193782 192814 192754 193252 194200 195561 197012 198255 199366 200404 201060 201247 201500 202115 202403 201605 200138 199106
55667 199106 198881 198984 199017 198877 198329 197272 196214 195641 195117 193955 192611 192403 193787 195838 197524 198710
55651 198710 199778 201018 202557 204248 205528 205924 205708 205506 205313 204497 202680 200001 196693 193117 190002
55636 190002 187721 185397 181751 176939 172501 169229 166099 161910 157110 153270 151233 150479 149962 148974 147254
55621 147254 144805 141806 138641 135908 134209 133691 133858 134053 134003 133671 132914 131723 130633 130272 130553 130744 130322
55604A30322j016j413j583j370r34q53j285j578j284r09j013j201q39j22L21M67
55588A15710O26N96L9o31o76j92O1j19k50j86l44p99r72m78L36R49J241J308J133
55569A17352O72L2n68r10q65o35o43r54j036m96K20L47j66o95q67p99n75r6M33
55550A09751M91p9q00j180j230j219j266j344j359j100l58O75J449J615J316Q37
55534A06199K84j96j96N62J688K402K261J439L01q97j817k009j421o67l86m38
55518A07109k31L00N89L43j13n81j317k201k369j386j77R1l33k80M21O46k61j484
55500I8766j879j309m68J9p7n67q32l40N64Q65J39r19j440j307q65l63rk1k43
55481H9714j05N59J159J112N16k40r98j572j543q48j43p3m22m79K7P10J061Q80
$$ plain form
55604 130322 129306 127893 126310 124940 124006 123153 121868 120290 119006 118097 117084 115883 115044 114922 115243 115710
55588 115710 116336 116932 116971 116340 115664 115472 115533 115414 115164 114978 114634 113835 112863 112385 112721 113670 114911 116219 117352
55569 117352 118024 118056 117488 116578 115713 115078 114435 113481 112445 111949 112169 112516 112350 111655 110788 109989 109414 109318 109751
55550 109751 110242 110163 109363 108183 106953 105734 104468 103124 101765 100665 100307 100982 102431 104046 105362 106199
55534 106199 106483 106287 106091 106653 108341 110743 113004 114443 114744 113847 112030 110021 108600 107933 107547 107109
55518 107109 106878 107178 107767 108110 107997 107416 106099 103898 101529 100143 99966 100057 99724 99444 99865 100511 100250 98766
55500 98766 96887 95578 95110 95129 95052 94485 93653 93313 93877 94742 94881 93962 92522 91215 90350 89987 89978 89957 89714
55481 89714 89609 90168 91327 92439 92955 92715 91717 90145 88602 87754 87611 87538 87116 86637 86664 87374 88435 89315
55463H9315L95J18K89M37p5r91j318p21m2p4n52q16p97o90l61K32N55J17o50q72
55443H3499l07N63J198J318Q51J13k85j52jk58o30o67m53k25J21O22Q41N32J20
55424H6800k7k31p85j221j136j040j448j739j010L60J155R64L04n07j415j845
55408G7179j182Q5Q20Q43Q83J069Q66M82P66J481J295k0r36m12O11R05P83J105
55390H6623J528J153J40o14r79j522k267k583k190j310j11J118J530N47r10j227
55374G8926k07P48P18M34Q28J419J065k99j567j919j545r96m65N7L77K13l41p31
55356G6715m82K16O20K83l37m17J55O23M54K3k8K99N64P09J006J333J213O57L04
55337H3910M51N94K47l10o11q10j237j544j057J45J205J568J377Q40m4r72j241
$$ plain form
55463 89315 89710 89828 90117 90554 90479 89488 88170 87449 87407 87333 86781 85965 85168 84478 84117 84349 84904 85021 84371 83499
55443 83499 83192 83755 84953 86271 87122 87235 86950 86798 86797 86539 85909 85242 84789 84564 84685 85307 86148 86680 86800
55424 86800 86773 86542 85757 84536 83400 82360 80912 79173 78163 78523 79678 80642 80946 80439 79024 77179
55408 77179 75997 76082 76902 77745 78628 79697 80563 81045 81811 83292 84587 84567 83631 83219 83830 84735 85518 86623
55390 86623 88151 89304 89444 88830 87851 86329 84062 81479 79289 77979 77868 78986 80516 81063 80153 78926
55374 78926 78719 79467 80185 80619 81447 82866 83931 83632 82065 80146 78601 77605 77140 77197 77574 77787 77446 76715
55356 76715 76233 76449 77069 77352 77015 76598 76753 77376 77830 77853 77825 78124 78688 79397 80403 81736 82949 83606 83910
55337 83910 84361 84955 85202 84892 84281 83471 82234 80690 79633 79778 80983 82551 83928 84768 84724 83752 82511
55320H2511o39J20K39k55q12j095j072p74l56j86l74m86j17M85Q16Q53R69J180
55302H1007J061M40k68n46l64q1Nj09l01n50q95j208j182p13j68L7oJ38N42R09
55282G7748J149J475J786J607Q98L21K94L93J40j51Q0O57R56Q83R10J158J167
55265I1471N68m51j436j970j817j088l07M1k0j94m21p46r19o22l7K79J32j34j60
55246H2169O3L26M09K03j10j33J96L82P5l04j61K77K45l75q99q95o57m98k58J16
55226H0171J77l56r56r08k80K37L14K63L64L94R5k10P6R90J743J562N64l89o31
55207H3220j93M81R83J013M40m76j181j364j221j007o49k7O50R82Q02K59l16n03
55189H1893j14M54M99j12o99o27l8N00P19O40K99j70m81n57n50l39M87J709K269
$$ plain form
55320 82511 81872 81992 82231 81976 81164 80069 78997 78223 77867 77681 77307 76821 76704 77189 78005 78858 79827 81007
55302 81007 82068 82508 82240 81694 81330 81249 81254 81145 80844 80294 79399 78191 77009 76296 76128 76165 76159 76297 76839 77748
55282 77748 78897 80372 82158 83765 84663 84984 85278 85671 85811 85660 85740 86397 87353 88236 89146 90304 91471
55265 91471 92039 91588 90152 88182 86365 85277 84970 85011 84991 84797 84376 83630 82711 82089 82052 82331 82463 82329 82169
55246 82169 82232 82558 82967 83170 83060 82927 83123 83505 83580 83276 83115 83392 83637 83262 82363 81468 80811 80313 80055 80171
55226 80171 80348 79992 79036 78128 77848 78085 78399 78662 79026 79420 79515 79305 79381 80371 82114 83676 84240 83851 83220
55207 83220 83027 83508 84491 85504 85944 85468 84287 82923 81702 80695 80046 80019 80669 81651 82453 82712 82396 81893
55189 81893 81779 82233 82732 82620 81921 81294 81256 81756 82475 83115 83414 83244 82763 82206 81656 81317 81804 83513 85782
55170H5782J535K70l59k60j57l25m39l83l01r6L22M97k8p69q12j08N93R65J264
55151H7191J311N36p84j383o72M06O70J73k40k14j00j76k56m9M49R03R05M13j86
55132H8897n48p23q21o68j68K37J25k36l12k12m00p62p29k11L61P87J071Q20l16
55113H6192j594j681l75J111J811J876J588O83p36j650j272p4Q73J091P55J77
55097H8775k57k12J21J80o7mN14P29J57n85o33j0O92J132J195P25j32q17j064
55078I0439j215j447j300m46O94J537J954J851R87k26o00L40J465J534Q05L55
55062I6727L24N4n35q01m47J94Q31J326J313N52m81j082j204j140o72M88J683
55045I7130J774P12l32n24j95O2K23M07L87n7o73j052j071q89o92n65l78O6N98
$$ plain form
55170 85782 87317 87587 87228 86968 86811 86486 86047 85664 85363 85267 85589 86086 86058 85289 84477 84369 84962 85927 87191
55151 87191 88502 89038 88254 86871 86199 86605 87275 87448 87208 86994 86894 86718 86462 86413 86862 87765 88670 89083 88897
55132 88897 88349 87626 86805 86137 85969 86206 86331 86095 85783 85571 85171 84409 83680 83469 83830 84617 85688 86508 86192
55113 86192 84598 82917 82542 83653 85464 87340 88928 89611 88875 87225 85953 85879 86752 87843 88598 88775
55097 88775 88518 88306 88427 88607 88540 88536 89050 89779 89936 89351 88718 88708 89400 90532 91727 92452 92320 91503 90439
55078 90439 89224 87777 86477 86031 86725 88262 90216 92067 93054 92828 92228 92568 94033 95567 96372 96727
55062 96727 97051 97105 96570 95769 95322 95516 96347 97673 98986 99538 99057 97975 96771 95631 94959 95447 97130
55045 97130 98904 99616 99284 98760 98565 98627 98850 99257 99644 99587 98914 97862 96791 95902 95210 94645 94267 94333 94931
55026I4931O22o0p29o20q3p2o64r22l80K66K59j02k7O51J380J657J443R73M81
55007I9004J10j31k75l11k27j21r2r9p6j01j95j14L87J124J633J652J258O10j18
54988A03918o10o44m33m26o85p71k76O30J318J258N22k27l62O3M58N09M90O63
54970A05395P92N45J4m98r02j205j256r48m28J34O60Q60L83m46o92r3L84m7o83
54951A01969l83O37J139P16J62O6Q9j81n81q27q61n44K19R70R95L15l26n58o84
54932A02332p64l23O80J454J432J064J041J309J386J213J148J411J962K697L415
54917A21457L851L927L742L222K274J277R00J168J280O75l67j410k458l398l589
54902A32551k746j692j462j938k161j815j523j723k017j867j376r96q57o90k34
$$ plain form
55026 94931 95553 95493 94764 94144 94061 93989 93325 92403 92023 92289 92548 92446 92419 93070 94450 96107 97550 98523 99004
55007 99004 99114 98983 98708 98397 98170 98049 97957 97858 97782 97681 97486 97372 97759 98883 100516 102168 103426 104036 103918
54988 103918 103308 102664 102231 101805 101120 100349 100073 100703 102021 103279 103801 103574 103212 103275 103733 104242 104732 105395
54970 105395 106187 106732 106746 106248 105346 104141 102885 101937 101509 101643 102303 103163 103546 103100 102408 102315 102699 102652 101969
54951 101969 101586 102223 103362 104078 104240 104306 104395 104214 103633 102806 101945 101401 101620 102590 103585 103900 103574 103016 102332
54932 102332 101568 101245 101925 103379 104811 105875 106916 108225 109611 110824 111972 113383 115345 118042 121457
54917 121457 125308 129235 132977 136199 138473 139750 140650 141818 143098 143773 143406 141996 139538 136140 132551
54902 132551 129805 128113 126651 124713 122552 120737 119214 117491 115474 113607 112231 111235 110378 109688 109454
54887A09454M78J143J363J001M26L14R44J790K049J643J397J968K917L272K895
54872A33054K605K807K862K235J427J039N41q47k465k777j592m65n54j320j853
54857A34697k252k865l207k721j947j836k338k659k619k724l015k934k340j778
54843I9462j564j375r59n50l14k4M41Q14R66J171J505J477P28k93q06o44k64K2
54825I9793K93N68O13L94L23P20J277J343P62R1j15Rp0m77p36m36K22P36Q84Q09
54805A07003O88N66N11O17Q21Q60N47m1o67j126j369j458j468j365j009l73L02
54788A03039O86P08N89M92L40R0j1K64O95Q16N85M85Q26J278J418J396J597J902
54770A17195J826J434J412K021K650K734K563K714L156L455L585L774L817L204
$$ plain form
54887 109454 109932 111075 112438 113439 113865 114179 115123 116913 118962 120605 122002 123970 126887 130159 133054
54872 133054 135659 138466 141328 143563 144990 146029 146570 145723 143258 140481 138889 138424 137870 136550 134697
54857 134697 132445 129580 126373 123652 121705 119869 117531 114872 112253 109529 106514 103580 101240 99462
54843 99462 97898 96523 95564 95014 94700 94676 95117 95931 96897 98068 99573 101050 101778 101485 100679 100035 99771 99793
54825 99793 100086 100654 101267 101661 101984 102704 103981 105324 106086 106177 106062 106071 106001 105524 104788 104352 104574 105310 106194 107003
54805 107003 107691 108257 108768 109385 110206 111066 111613 111572 110905 109779 108410 106952 105484 104119 103110 102737 103039
54788 103039 103725 104433 105022 105514 105854 105944 105933 106197 106892 107708 108293 108778 109604 110882 112300 113696 115293 117195
54770 117195 119021 120455 121867 123888 126538 129272 131835 134549 137705 141160 144745 148519 152336 155540
54756A55540J931N18p50j997l089l522l204k768k684k639k141j387j033j253j546
54741A29976j447j056q36j036j402j472j097n99l10j45J74O30R64J125J225J110
54725A25804M83m22q08k04R62J969K615L130L598L821L648L109K280J270K46p03
54709A50798j689k790l797m278l941k895j646q06o66j031j523j883j946j550q65
54694A19492n32j013j857k152j671j057q19p99p14o32o21m72j07K04L15M86Q73
54677A08924J220J342J425J542J337O45o8l88n12o69n60j1K63m71j694k095j279
54660A08951j56M14N30N95N77K63k30o29q14o89o6R53J758J756J047L06J9L4j10
54641A14509n12p40m02K80O30L33j98l77q9L51O29N84K02k83m87k95L3L49Q84
$$ plain form
54756 155540 157471 157989 157239 155242 152153 148631 145427 142659 139975 137336 135195 133808 132775 131522 129976
54741 129976 128529 127473 126637 125601 124199 122727 121630 121031 120721 120576 120750 121380 122344 123469 124694 125804
54725 125804 126287 125865 125057 124853 125815 127784 130399 133529 137127 140948 144596 147705 149985 151255 151501 150798
54709 150798 149109 146319 142522 138244 134303 131408 129762 128956 128290 127259 125736 123853 121907 120357 119492
54694 119492 118960 117947 116090 113938 112267 111210 110391 109592 108878 108246 107625 107153 107046 107250 107565 108051 108924
54677 108924 110144 111486 112911 114453 115790 116435 116367 115979 115467 114798 114238 114227 114490 114019 112325 110230 108951
54660 108951 108795 109209 109739 110334 110911 111174 110944 110315 109501 108812 108746 109699 111457 113213 114260 114566 114585 114619 114509
54641 114509 113997 113257 112855 113135 113765 114098 113900 113523 113434 113785 114414 114998 115200 114917 114430 114135 114168 114517 115401
54622A15401J593J754P92p21j593j453j016r03q82m97J80P16Q47N15k42j124j578
54605A11789j305n89L7L17L05J25k9J14O43J267J542J344R73Q02Q73Q67M76j50
54587A19401n00l20M6J07o3K3M81P60L48n44j159r36MR93J380J113Q17J109J790
54568A24850J991J191j17r68r36m23q2j86m96n86k64K11L80J35n9L28J202J845
54550A28016J720J074N93N29N30L03M8J5nk99n37k3J260K373K440J556N60J24
54532A40277K92N51K75o37j369r65L70J247P81l70j045j096j099j131q36m30n67
54515A34248j174j358o56L92J122J433J304N61n37j148q66l09j54j73K01Q20J074
54498A34780Q84P14P98R60J054J000N11n18j377j073L32J497J319K24m62j36N92
$$ plain form
54622 115401 116994 118748 119540 118819 117226 115773 114757 113854 112972 112475 112655 113371 114218 114733 114491 113367 111789
54605 111789 110484 109895 109932 110249 110554 110679 110650 110764 111407 112674 114216 115560 116533 117335 118208 119075 119551 119401
54587 119401 118901 118581 118627 118734 118671 118694 119175 119935 120283 119739 118580 117644 117648 118641 120021 121134 121951 123060 124850
54568 124850 126841 128032 127915 126947 126011 125588 125506 125320 124824 124238 123974 124185 124565 124700 124641 124969 126171 128016
54550 128016 129736 130810 131403 131932 132462 132765 132813 132828 132823 132524 131987 131964 133224 135597 138037 139593 140153 140277
54532 140277 140569 141120 141395 140758 139389 138424 138794 140041 140822 140452 139407 138311 137212 136081 135245 134815 134248
54515 134248 133074 131716 131060 131452 132574 134007 135311 135872 135335 134187 133321 133012 132858 132685 132886 133706 134780
54498 134780 135664 136378 137176 138136 139190 140190 140701 140183 138806 137733 138065 139562 140881 141105 140643 140507 141099
54481A41099Q74O41M08M86O47O09M91O15J019J458J813K145K327J969R89j8l65
54464A57207p4K02J5m60q49r98q45k69O11J170Q02k34r03n86L1k67j609k676k232
54445A48036o41O18P25J91j69k52l04j38N66J400J383K37j003j102r3P12K86r77
54427A49475j824j645r28l61N3O18J133J064M64P2L00O28L61l98r46r25o72o57
54409A45812r47j243j202p28j31J21k8l5N18J167J085K84k84j8M97M32K8K81J431
54390A47040K429K201R79m1j02M09O40K82k89o12o10m87m06l85l66k49Q9O36J091
54371A52249J063N12j13l49k24j33k73l95k29R2J98o1m67p40p02k62N28J240J249
54352A53183L87o48r01k11O15P52K43k37k75m0J57K57L24L51L68N24Q33J039R24
$$ plain form
54481 141099 141973 142614 143022 143508 144155 144764 145255 145870 146889 148347 150160 152305 154632 156601 157590 157572 157207
54464 157207 157133 157335 157350 156890 156041 155043 154198 153929 154540 155710 156512 156278 155375 154789 154820 154553 152944 150268 148036
54445 148036 147395 148013 148738 148929 148760 148508 148204 148066 148632 150032 151415 151652 150649 149547 149454 150166 150452 149475
54427 149475 147651 146006 145078 144717 144770 145388 146521 147585 148049 148121 148421 149049 149410 149012 148066 147141 146469 145812
54409 145812 144865 143622 142420 141692 141561 141682 141654 141619 142137 143304 144389 144673 144389 144371 144868 145300 145328 145609 147040
54390 147040 149469 151670 152649 152608 152506 152915 153555 153837 153548 152936 152326 151839 151433 151048 150682 150433 150522 151158 152249
54371 152249 153312 153824 153711 153362 153138 153005 152732 152337 152108 152200 152398 152337 151870 151130 150428 150166 150694 151934 153183
54352 153183 153570 152922 152021 151810 152425 153177 153420 153183 152908 152868 153025 153282 153606 153957 154325 154849 155682 156721 157645
54333A57645N94K57j27o57j116j156q54o86r18j370j820k201k279j696n60M34
54317A43490P97P48O04J70o33j126o63K23L05o98j787k046j532o49M70J588K102
54300A41363J724R13K12m02j059j424j134m65kJ09J19J45J31J43K73M25M81M97
54282A42049M06n4p77j097o75q8J3n6L64J025J047K85m70o60n09l52k35l03p55
54263A39158j236j041j56O49J012J404K055K323J722Q32M61M81J91n27j164j320
54247A44844r19M5J300K047J637M40n26p82o87o91q78j178j483j473q70L0N53
54230A41409M87K63K03Q7l14p39q12o17m70m00k04R6K51J85J06J38J37m3k49j70
54210A39344K88Q82J256J193O54k13j049j355q93lO31O63L81K29K35O5l93q50
$$ plain form
54333 157645 158239 158496 158369 157712 156596 155440 154586 153900 152982 151612 149792 147591 145312 143616 143056 143490
54317 143490 144287 145035 145639 145809 145176 144050 143387 143610 143915 143217 141430 139384 137852 137203 137673 139261 141363
54300 141363 143087 144000 144212 143810 142751 141327 140193 139728 139726 139835 139954 140099 140230 140373 140646 141071 141552 142049
54282 142049 142455 142401 141624 140527 139852 139764 139777 139721 140085 141110 142157 142442 141972 141312 140803 140451 140216 139913 139158
54263 139158 137922 136881 136725 137374 138386 139790 141845 144168 145890 146722 147183 147664 147855 147328 146164 144844
54247 144844 143925 143970 145270 147317 148954 149394 148868 148086 147399 146708 145830 144652 143169 141696 140826 140856 141409
54230 141409 141896 142159 142362 142449 142135 141396 140584 139967 139497 139097 138893 138989 139240 139425 139531 139669 139806 139763 139514 139344
54210 139344 139632 140514 141770 142963 143617 143404 142355 141000 140107 140104 140735 141398 141779 142008 142243 142308 141915 141065
54192A41065r78p94n76n60q50j402j948k030j364k37P17J112J074Q57M67j39p05
54175A33709q64n69j06K61M01J68l90p52l08P60J514J362P10K06j74p38j208r99
54157A32983k07L94L92J41K0j32n09q42p37k39L12P13R38R15N99J73oK65Q38J229
54137A37240R40j7r22r75k00O45J006J033J015Q54M43J66M92J228J587J056r8
54120A45493j135j518j232o38r6L31P33J064J173J123J154J220Q66j93j573k493
54104A44279k459j542k42P36Q56J97n10n62M4P19R59P05J83l21n72m53o7L82P42
54085A43074R89J147J177R41L08n54j137j005l25K75M05K64K36M07O23P51P16
54068A48292M33n5m33l69J14O25P81N75L41L73O23Q30R30J085J354J590J823K321
$$ plain form
54192 141065 140087 139293 138717 138157 137307 135905 133957 131927 130563 130326 131043 132155 133229 134086 134553 134414 133709
54175 133709 132845 132276 132170 132431 132832 133000 132610 131858 131550 132310 133824 135186 135896 136102 135928 135190 133982 132983
54157 132983 132776 133170 133562 133703 133723 133591 133082 132240 131503 131264 131576 132289 133227 134142 134741 134914 134908 135173 136011 137240
54137 137240 138180 138163 137241 136266 136066 136711 137717 138750 139765 140619 141062 141228 141720 142948 144535 145591 145493
54120 145493 144358 142840 141608 140970 140874 141205 141938 143002 144175 145298 146452 147672 148538 148345 146772 144279
54104 144279 141820 140278 140036 140772 141628 141825 141315 140753 140797 141516 142475 143180 143363 143042 142470 142017 141950 142332 143074
54085 143074 144063 145210 146387 147328 147636 147082 145945 144940 144615 144890 145295 145559 145795 146202 146825 147576 148292
54068 148292 148725 148670 148237 147868 147982 148607 149388 149963 150304 150677 151300 152130 153060 154145 155499 157089 158912 161233
54050A61233L082L712M093M700N671O212N716M912M840N089M401K860J935K119
54036B20575K137J036n20j786l266n251o479n821m311l802m240m106l053k202
54022A78911j937j381l75j33j200k343k359j764j640j890j712j109p20o06k75
54007A59467L23O96O10K50l27j139j710j362k33N96L98k84l91K19O59K89m51p35
53989A56875n29n50j102j613j483r17m54j37L05P05N85l1n46n56j79M00J114J601
53971A53488J343M45k41j54K59K50j93n04m03j42N0K86P02J121J222Q91L72lo9
53952A58720J48N98J158J485J288Q58Q57J389J718J346Q88J256K397L528M334
53937A81968N037N491N215M355L671L463L359L358L957M946N192M197K925K369
$$ plain form
54050 161233 164315 168027 172120 176820 182491 188703 194419 199331 204171 209260 213661 216521 218456 220575
54036 220575 222712 223748 223228 221442 218176 212925 206446 200625 196314 192512 188272 184166 181113 178911
54022 178911 176974 175593 175218 175085 173885 171542 169183 167419 165779 163889 162177 161068 160348 159742 159467
54007 159467 159790 160486 161096 161346 161019 159880 158170 156808 156575 157171 157569 157285 156894 157113 157772 158061 157610 156875
53989 156875 156346 155796 154694 153081 151598 150681 150227 150090 150395 151100 151685 151654 151108 150552 150373 150773 151887 153488
53971 153488 154831 155276 155035 154881 155140 155390 155197 154693 154290 154148 154198 154484 155186 156307 157529 158420 158792 158789 158720
53952 158720 158868 159466 160624 162109 163397 164255 165112 166501 168219 169565 170453 171709 174106 177634 181968
53937 181968 187005 192496 197711 202066 205737 209200 212559 215917 219874 224820 230012 234209 237134 239503
53923B39503K177J506M34l71q65j477k206k771l296l962m281l691k634k076k062
53908B13928j728p87l5j38p52j139j023n07K79J192K051K832L570M154M514M943
53892B31354N598N807M608K098m62k047k732l012l078l148l738m955o073o405
53878B13815o199o068n906n048l431j932j444j970k666k610j599l37L07K69K11
53863A75392M10K81n97j577j711j071n93p55j179j452j536j332o13L58Q54O14
53847A65493K07J03N5j98l06J3K31k60j032j124n05j24m41p94n19Q7M24N19P80
53828A62609J150J252J079J001J050Q37K55j95j0N88Q78M82j57k62L83J151J302
53811A73393Q32L92L94O22P62Q21Q15N41P3L2P51J523J389N49J71P20J339J203
$$ plain form
53923 239503 241680 243186 243620 243249 242384 240907 238701 235930 232634 228672 224391 220700 218066 215990 213928
53908 213928 212200 211413 211378 211240 210488 209349 208326 207819 208098 209290 211341 214173 217743 221897 226411 231354
53892 231354 236952 242759 247367 249465 249003 246956 244224 241212 238134 234986 231248 226293 220220 213815
53878 213815 207616 201548 195642 190594 187163 185231 183787 181817 179151 176541 174942 174605 174912 175181 175392
53863 175392 175802 176083 175486 173909 172198 171127 170534 169779 168600 167148 165612 164280 163667 164025 164879 165493
53847 165493 165700 165803 165858 165660 165354 165367 165598 165338 164306 163182 162677 162553 162112 161318 160799 160886 161310 161829 162609
53828 162609 163759 165011 166090 167091 168141 168978 169233 169038 169028 169616 170494 170976 170819 170557 170940 172091 173393
53811 173393 174225 174617 175011 175633 176395 177216 178031 178572 178645 178677 179428 180951 182340 182889 183060 183780 185119 186322
53793A86322P33Q50J541J871J303L61r1J46M89L43k13n31k60J11j81j115j830
53776A89849j712j077n77l41r2K42M50L87K0o44j284j229k43Q18Q33j02p51m10
53758A84137J33j92j188j704j242m95k61m33l84R0O28R03R40Q55O34L47K41M42
53740A83451O62N65K87L51R57J645J790J310P79Q01J370J880J794J276R86J157
53724B01061J261Q34L39O69J803K656K464J727J415J654J819J600J354J424J682
53709B23762J880K023K167K183K015J952K359L130L636L327K342J434J253J700
53695B55163K164K257K188K282K403K142J480R16Q36R78P48j7q32j153r97p99
53679B69759q25r68j153j480j801j556n18N42N89l70j238j201n83j39r9k49m79
$$ plain form
53793 186322 187055 187905 189446 191317 192620 192981 192890 193036 193525 193868 193655 193124 192864 192975 192794 191679 189849
53776 189849 188137 187060 186483 186142 186050 186292 186742 187129 187149 186505 185221 183992 183749 184567 185400 185298 184547 184137
53758 184137 184270 184078 182890 181186 179944 179449 179188 178755 178371 178461 179089 179992 180932 181787 182421 182768 183009 183451
53740 183451 184113 184678 184965 185316 186273 187918 189708 191018 191797 192598 193968 195848 197642 198918 199904 201061
53724 201061 202322 203156 203495 204164 205967 208623 211087 212814 214229 215883 217702 219302 220656 222080 223762
53709 223762 225642 227665 229832 232015 234030 235982 238341 241471 245107 248434 250776 252210 253463 255163
53695 255163 257327 259584 261772 264054 266457 268599 270079 270995 271831 272809 273557 273540 272708 271555 270558 269759
53679 269759 268934 267966 266813 265333 263532 261976 261458 262000 262589 262219 260981 259780 259197 259058 258959 258710 258231
53662B58231p68r76j015j019j044q88n39l90n93o49j42M53L69l24q57q28m67P7
53644B48631Q81J699K015J846J807K141K326J953J380J147J210J220J125J088
53630B70469J008O71K15J40P95J967K941L000K139J230J148J779K346K681L454
53615B95983M878N957N658M337L299L257L772M061L798L162K634K654L055L060
53601C49565K245J300J220J883K183J597Q67Q68J542K281K797L098L020K430J659
53586C78555J176Q71K28p88j557j686j619j994k724l179l184l275l811m307m089
53571C48617l271k523k024j315l55Q2m95j385j519q82l36k79k48J00N07P89J243
53554C36706J978K449K243J847K060K905L670L841L526L107K923L216L881M432
$$ plain form
53662 258231 257463 256487 255472 254453 253409 252521 251982 251592 250999 250350 250208 250661 251030 250706 249849 249021 248554 248631
53644 248631 249512 251211 253226 255072 256879 259020 261346 263299 264679 265826 267036 268256 269381 270469
53630 270469 271477 272148 272363 272503 273298 275265 278206 281206 283345 284575 285723 287502 289848 292529 295983
53615 295983 300861 306818 312476 316813 320112 323369 327141 331202 335000 338162 340796 343450 346505 349565
53601 349565 351810 353110 354330 356213 358396 359993 360860 361728 363270 365551 368348 371446 374466 376896 378555
53586 378555 379731 380602 380830 380042 378485 376799 375180 373186 370462 367283 364099 360824 357013 352706 348617
53571 348617 345346 342823 340799 339484 339129 339211 338716 337331 335812 334930 334594 334315 334067 334167 334674 335463 336706
53554 336706 338684 341133 343376 345223 347283 350188 353858 357699 361225 364332 367255 370471 374352 378784
53540C78784M602M888N871P166P707P265O918P648R032R894R917R911J0570J1548
53526D91721J2002J1743J1458J1879J3007J4259J5251J6096J6958J7663J8062
53515F50099J8448J9219K0266K1175K1891K2647K3178K2890K1997K1690K2644
53504H86144K3911K4072K3039K1914K1332K0878K0158J9539J9481J9785J9920
53493A120173J9643J8981J7999J6999J6478J6532J6504J5771J4665J4125J4467
53482A302337J4951J4653J3412J1769J0261R007P820O442M670K468Q9k017l617
53469A392245m985o667q804j0906j2426j3390j4236j5149j5893j6362j6861j7631
53457A238935j8369j8584j8290j8051j8278j8729j8840j8489j8145j8213j8385
$$ plain form
53540 378784 383386 388274 394145 401311 409018 416283 423201 430849 439881 449775 459692 469603 480173 491721
53526 491721 503723 515466 526924 538803 551810 566069 581320 597416 614374 632037 650099
53515 650099 668547 687766 708032 729207 751098 773745 796923 819813 841810 863500 886144
53504 886144 910055 934127 957166 979080 1000412 1021290 1041448 1060987 1080468 1100253 1120173
53493 1120173 1139816 1158797 1176796 1193795 1210273 1226805 1243309 1259080 1273745 1287870 1302337
53482 1302337 1317288 1331941 1345353 1357122 1367383 1376390 1384210 1390652 1395322 1397790 1397879 1395862 1392245
53469 1392245 1387260 1380593 1371789 1360883 1348457 1335067 1320831 1305682 1289789 1273427 1256566 1238935
53457 1238935 1220566 1201982 1183692 1165641 1147363 1128634 1109794 1091305 1073160 1054947 1036562
53446A036562j7894j6388j4309j2321j0688r395q516q091p771o994n553l682j695
53433I13265J96J803L133M531O251P943R098R867J0869J2183J3294J4131J5303
53420A021867J6984J8426J9175J9953K1575K3598K5046K6067K7706L0178L2406
53409A282981L3593L4302L5555L7460L9307M0599M1548M2660M4214M6071M7786
53398A726076M9021M9824N0465N1056N1516N1826N2002N1843N1075M9701M8023
53387B282428M6203M4226M2158M0107L7870L5067L1765K8493K5533K2602J9456
53376B655908J6264J3089R389M558j314p627j4005k0397k6553l1942l6284l9805
53364B521281m2864m5636m8183n0497n2289n3013n2410n0983m9633m8804m8236
$$ plain form
53446 1036562 1018668 1002280 987971 975650 964962 955567 947051 938960 931189 924195 918642 914960 913265
53433 913265 913461 915264 918397 922928 929179 937122 946220 956087 966956 979139 992433 1006564 1021867
53420 1021867 1038851 1057277 1076452 1096405 1117980 1141578 1166624 1192691 1220397 1250575 1282981
53409 1282981 1316574 1350876 1386431 1423891 1463198 1503797 1545345 1588005 1632219 1678290 1726076
53398 1726076 1775097 1824921 1875386 1926442 1977958 2029784 2081786 2133629 2184704 2234405 2282428
53387 2282428 2328631 2372857 2415015 2455122 2492992 2528059 2559824 2588317 2613850 2636452 2655908
53376 2655908 2672172 2685261 2694650 2699208 2697894 2690267 2676262 2655865 2629312 2597370 2561086 2521281
53364 2521281 2478417 2432781 2384598 2334101 2281812 2228799 2176389 2125406 2075773 2026969 1978733
53353A978733m7578m6939m6624m6515m6116m5197m4043m2941m1769m0326l8746
53342A491939l7206l5438l3054l0295k7945k6410k5240k3772k1881j9932j8222
53331A192544j6812j5617j4557j3636j3050j2967j3055j2546j1031r067p588o848
53319A045770o255n244l990l050k604k205j333L8J494K756M030N679P624R341
53305A052051J0550J1629J3115J4938J6454J7273J7771J8653K0219K2153K3858
53294A238664K4799K4734K3937K3159K2975K3126K2810K1665K0141J8670J7014
53283A481694J4858J2645J1050R786P823M903J941l87k621n410q288j0418j2145
53270A505431j4571j7752k0439k1839k2667k4004k5847k7418k8308k8692k8725
$$ plain form
53353 1978733 1931155 1884216 1837592 1791077 1744961 1699764 1655721 1612780 1571011 1530685 1491939
53342 1491939 1454733 1419295 1386241 1355946 1328001 1301591 1276351 1252579 1230698 1210766 1192544
53331 1192544 1175732 1160115 1145558 1131922 1118872 1105905 1092850 1080304 1069273 1060206 1052618 1045770
53319 1045770 1039515 1034271 1030281 1027231 1024627 1022422 1021089 1021127 1022621 1025377 1029407 1035086 1042710 1052051
53305 1052051 1062601 1074230 1087345 1102283 1118737 1136010 1153781 1172434 1192653 1214806 1238664
53294 1238664 1263463 1288197 1312134 1335293 1358268 1381394 1404204 1425869 1446010 1464680 1481694
53283 1481694 1496552 1509197 1520247 1530033 1537856 1542759 1544700 1544313 1541692 1536282 1527994 1517576 1505431
53270 1505431 1490860 1473108 1452669 1430830 1408163 1384159 1358312 1330894 1302586 1273894 1245169
53259A245169k8432k8025k7835k7898k7916k7621k6959k5990k4929k4164k3992
53248I51408k4226k4339k3990k3309k2706k2461k2482k2320k1500j9953j8129
53237G05993j6592j5469j4408j3046j1499j0342j0031j0414j0833j0779j0300
53226E72280r779r538r757j0456j1286j1593j1134j0535j0512j0839j0693r936
53214D46222r291r090q707p684o642o446o933p273p248p343p711p801p240o398
53200C40415n861n687n505n056m442l966l823l909l861l493l073k955k993k681
53186B83110j953j471j823k678l078k574j734j371j492j373o55N6j4p29j270j313
53170B59638j405j968k570k567k021j497j232j101j180j640k115j900j024m66
$$ plain form
53259 1245169 1216737 1188712 1160877 1132979 1105063 1077442 1050483 1024493 999564 975400 951408
53248 951408 927182 902843 878853 855544 832838 810377 787895 765575 744075 724122 705993
53237 705993 689401 673932 659524 646478 634979 624637 614606 604192 593359 582580 572280
53226 572280 562501 552963 543206 532750 521464 509871 498737 488202 477690 466851 456158 446222
53214 446222 436931 427841 419134 411450 404808 398362 391429 384156 376908 369565 361854 354053 346813 340415
53200 340415 334554 328867 323362 318306 313864 309898 306075 302166 298305 294812 291739 288784 285791 283110
53186 283110 281157 279686 277863 275185 272107 269533 267799 266428 264936 263563 262908 262964 262950 262221 260951 259638
53170 259638 258233 256265 253695 251128 249107 247610 246378 245277 244097 242457 240342 238442 237418 236952
53156B36952q91j619j433k11Q61P57k18r44q24k58J04J11J7p8l10o61p90m46J59
53137B30278N49N23L09J98J88M6l23o61o21k05J64J24k53o51r09r83o50K73J422
53118B28818K048J847J274Q65O09K69p9k31l32o88j242j639j783j859j874j597
53102B24406r89l31J91O29R39Q86M48K9q2j27m51q13n69L90J315J424P88R5k97
53083B27881o24j007j018l64L77L74k60n48q3L76M0p50j126r47p78q55q22m55
53065B19411L3M91R83J300R05k50j377j677j249p48m61j19M35Q58O72j74j243
53048B17790j968k089j803j472j243r79n50ON90J135J447J232M62m06q32p91p57
53031B09772j030j291r82l0J026J636J701J402Q13P0l21J10R54J108J53r94j302
$$ plain form
53156 236952 236061 234442 233009 232798 233659 234416 234198 233254 232430 232172 232276 232387 232404 232326 232016 231355 230565 230119 230278
53137 230278 230827 231350 231659 231857 232045 232091 231768 231107 230486 230281 230445 230569 230316 229665 228756 227773 227123 227396 228818
53118 228818 230866 232713 233987 234852 235461 235730 235651 235420 235088 234400 233158 231519 229736 227877 226003 224406
53102 224406 223417 223086 223277 223906 224845 225731 226179 226208 226126 225999 225548 224735 224166 224556 225871 227295 228083 228178 227881
53083 227881 227257 226250 225232 224868 225245 225619 225359 224811 224728 225104 225144 224394 223268 222321 221543 220688 219866 219411
53065 219411 219444 219935 220918 222218 223123 222873 221496 219819 218570 217822 217361 217242 217677 218535 219207 219033 217790
53048 217790 215822 213733 211930 210458 209215 208236 207686 207692 208282 209417 210864 212096 212558 212152 211320 210529 209772
53031 209772 208742 207451 206469 206439 207465 209101 210802 212204 213017 213087 212766 212876 213830 214938 215091 214097 212795
53014B12795j048j242j906j984j052q5J0k22K84J382J892J322M98L23O67Q26N06
52997B12966N6n8L09Q67J103P90L23K17L14n4r13j330o00P42J684K042K275K331
52979B23064J688N81J52Q97J816J730Q99N38J086J825K034J740J238O13Ok64k21
52962B39422l88j090j912k236k048j772j578j314j007r08j076j198j040p36n28
52947B20591m09k40m8k4k16l55j21M17Q00O41J14k46k47k98q08j505j650r82j79
52928B15235j87j178k294k492j515j2J177J669J541R83J64o60j166j180p92l22
52912B08971r3j69k16J71R08J354J011R6q13j417j742j743j374q87n91l36K48
52895B03378J014J382J215J050J226J344R29J53m24n38l14m0pk53l29K61J206
$$ plain form
53014 212795 211747 210505 208599 206615 205563 205478 205488 205266 205550 206932 208824 210146 210644 210967 211634 212460 212966
52997 212966 213022 212964 213273 214140 215243 216033 216356 216573 216887 216833 215920 214590 213990 214732 216416 218458 220733 223064
52979 223064 224752 225333 225485 226382 228198 229928 230827 231365 232451 234276 236310 238050 239288 239901 239907 239643 239422
52962 239422 239034 237944 236032 233796 231748 229976 228398 227084 226077 225169 224093 222895 221855 221119 220591
52947 220591 220182 219942 219894 219870 219654 219299 219178 219595 220395 221036 221150 220904 220657 220359 219551 218046 216396 215414 215235
52928 215235 215048 213870 211576 209084 207569 207557 208734 210403 211944 212927 213091 212431 211265 210085 209293 208971
52912 208971 208878 208709 208493 208664 209572 210926 211937 212033 211220 209803 208061 206318 204944 204057 203466 203130 203378
52895 203378 204392 205774 206989 208039 209265 210609 211538 211691 211267 210729 210415 210375 210368 210115 209786 210047 211253
52878B11253J568J024L19J46K42J93L31J047J801J775J190R85J313J355P04m2
52862B25204k70j40q2j50k66n38r82j329j446j591j895j949j284j47N91L05p37
52845B13294j650j802j371j007r74r39o15k71k89n75p63q06q88r86r11o56l37
52828A98454M0L55J93o12j503j795j490r15M1J528K820K887J901J152J298J634
52812B05988J402Q44M93L18J07jK7j83p45j068p65l98p05j509k085k201k113j866
52794A95540j347p89n36m39n5N75R65Q53M32k8k95p1O90J403J365O26j10m31n70
52775A97778p95r47p69l58l7n6m00p80q08m34r7j44k17L35J433K137J745N63n43
52756A97606j045r49m75N7K94J59P0M92J270J779J712J430J373J459J336R50N15
$$ plain form
52878 211253 212821 213845 214164 214310 214552 214745 215076 216123 217924 219699 220889 221874 223187 224542 225246 225204
52862 225204 224934 224794 224712 224562 224296 223758 222776 221447 220001 218410 216515 214566 213282 213135 213726 214031 213294
52845 213294 211644 209842 208471 207464 206490 205551 204936 204665 204376 203801 203038 202232 201344 200358 199447 198791 198454
52828 198454 198494 198849 199042 198430 196927 195132 193642 192727 192768 194296 197116 200003 201904 203056 204354 205988
52812 205988 207390 208234 208727 209045 209152 209151 209178 208995 208250 207182 206417 206019 205314 203805 201720 199519 197406 195540
52794 195540 194193 193404 192868 192429 192374 192949 193914 194767 195199 195171 194876 194805 195495 196898 198263 198889 198779 198348 197778
52775 197778 196983 196036 195267 194909 194872 194816 194416 193636 192828 192394 192297 192153 191936 192271 193704 195841 197586 198149 197606
52756 197606 196561 195612 195137 195194 195488 195647 195717 196209 197479 199258 200970 202400 203773 205232 206568 207518 208033
52739B08033J18k06q7Q93K321K998K275R38K46L87M96op79j282j381j121m82L21
52721B13682P50N00j12o30r59j214j348j229r08n35k48k17n94j180j445j054k44
52704B03015M73P65O17K09j67l49m96p92r57n09M93J446J984K229K209J686Q00
52687B12656J96Q1j21p63j225r03k52j51n73p93o29n97q85r86m46N92J662K289
52669B09152K090J117J45R2R75J890K033J378L58o15j176j043l00N84J156J298
52653B19134J112P76M72K90J36r2l11m35n24n84m00J25O50P74N28J55k90p17o68
52634B20131P8Q14N66m55q86R7J739K686K494J732J073P18N11J89m10j144j614
52617B28319j592j271r87q13n94k66pl8l73p19o72q9P36J299J334R94P20Q83J395
$$ plain form
52739 208033 208151 207945 207858 208751 211072 214070 216345 217283 217529 217916 218412 218406 217627 216345 214964 213843 213361 213682
52721 213682 214432 214932 214820 214190 213231 212017 210669 209440 208532 207997 207749 207532 206938 205758 204313 203259 203015
52704 203015 203488 204253 204870 205079 204912 204563 204067 203275 202318 201809 202302 203748 205732 207961 210170 211856 212656
52687 212656 212852 212933 212812 212049 210824 209921 209669 209518 208945 208152 207523 206926 206041 205055 204609 205201 206863 209152
52669 209152 211242 212359 212504 212596 213571 215461 217494 218872 219230 218615 217439 216396 216096 216680 217836 219134
52653 219134 220246 221022 221494 221784 221920 221828 221517 221082 220558 219974 219574 219699 220349 221123 221651 221806 221516 220799 220131
52634 220131 220209 221023 221589 221134 220248 220345 222084 224770 227264 228996 230069 230787 231298 231487 231077 229933 228319
52617 228319 226727 225456 224469 223656 223062 222796 222789 222751 222378 221659 220987 220898 221634 222933 224267 225261 225981 226864 228259
52598B28259J647J090n2q72p79p2N87Q93Q55N02M4q9J43J12n70j207q04N21J646
52579B31854J904J653J400J122O85K21j56n63r45r76n82j94k24o03j007j223j120
52562B31246o47K9O11R62J065P91J22n01o11m15m82p59o70k57l34j125j619r03
52544B26503M86J275J122P89R09J222J083K98o04q08l3R55J004j5q93n64M68P78
52526B33975j64j400j760j131k76K22M80Q58J246J084K15o09m46O14J495J492
52510B35895J052R31J094J011O53N16P44Q43M22k62p17q74j070j473j841j878
52494B35046j648j427j238q93m70l61n86n07K53J016Q72N1l38Q5N70O22P24J235
52476B33006J565J181O62Q47J490J717J451J353J603J673J326R43P24L73j69l87
$$ plain form
52598 228259 229906 230996 230944 230072 229293 229221 229808 230701 231556 232058 232102 232013 232156 232268 231698 230491 229687 230208 231854
52579 231854 233758 235411 236811 237933 238618 238839 238683 238120 237175 236199 235617 235423 235199 234596 233589 232366 231246
52562 231246 230599 230628 231239 232201 233266 234057 234179 233678 233067 232652 232170 231411 230741 230484 230150 229025 227406 226503
52544 226503 226989 228264 229386 230175 231084 232306 233389 233687 233083 232275 232242 233197 234201 234186 233293 232729 233197 233975
52526 233975 233811 232411 230651 229520 229244 229466 229946 230804 232050 233134 233349 232740 232294 232908 234403 235895
52510 235895 236947 237878 238972 239983 240636 241152 241896 242739 243161 242899 242182 241308 240238 238765 236924 235046
52494 235046 233398 231971 230733 229840 229370 229009 228423 227916 228169 229185 230057 230108 229770 229855 230425 231047 231771 233006
52476 233006 234571 235752 236414 237261 238751 240468 241919 243272 244875 246548 247874 248817 249541 249914 249745 249358
52460B49358J07R56J486J365P01j54p82r94r97r66n88M74J722K124J387L13l90
52443B55122r58j809k602k708k169j561j119p15n11q41j396j255j15J123J424
52428B39910R80Q37J421J997J780J038O93J101J727K024K200K843M051N205N645
52413B73452N342M898M898N265N303M439K866J352L82k41r08j697k511l373m175
52398B95292m429l791k743k200k341k383j718p78l41m41m03J91J125J957K357
52383B79354K088J239N46Q61K011K773K379J608J730K735L423L192K879L421M452
52368C14691M810M111L147K825L186L566L351K494J468P97O21P58J199K185L588
52353C52797M659M844M650N044O154P152P526P750Q462R544J0472J1155J1919
$$ plain form
52460 249358 249465 250421 251907 253272 253973 253819 253037 252043 251046 250080 249492 249966 251688 253812 255199 255512 255122
52443 255122 254164 252355 249753 247045 244876 243315 242196 241481 240970 240129 238733 237478 237363 238486 239910
52428 239910 240890 241727 243148 245145 246925 247963 248656 249757 251484 253508 255708 258551 262602 267807 273452
52413 273452 278794 283692 288590 293855 299158 303597 306463 307815 308197 307956 307048 305351 302840 299467 295292
52398 295292 290863 287072 284329 282129 279788 277405 275687 274909 274568 274127 273724 273915 275040 276997 279354
52383 279354 281442 282681 283227 284088 286099 288872 291251 292859 294589 297324 300747 303939 306818 310239 314691
52368 314691 319501 323612 326759 329584 332770 336336 339687 342181 343649 344446 345067 345825 347024 349209 352797
52353 352797 357456 362300 366950 371994 378148 385300 392826 400576 409038 418582 429054 440209 452128
52340D52128J2863J3698J4219J4529J4798J5068J5383J5903J6686J7477J7842
52329F20594J7584J6965J6434J6140J5873J5414J4736J3754J2315J0665R494R046
52317G89014Q476O807M339K372J421O24q11k361l044k890k816l322l990m250m078
52302G85491l797l600l393k944k107j010RP43J217J512J748K313L676N664P321
52287G92843P940P974Q473R761J1156J1931J2022J1755J1309J0692R991R391Q948
52274I24186Q488P724O540N098L630K161N85j023k441l679m941o155o930p137
52260I26106p142p247p297p122o953p002p017o754o438o346o205n703n163n056
52246H34661n087m666m099m270n061n147l800k019j198j375j475q73J00R14J415
$$ plain form
52340 452128 464991 478689 492908 507437 522235 537303 552686 568589 585275 602752 620594
52329 620594 638178 655143 671577 687717 703590 719004 733740 747494 759809 770474 779968 789014
52317 789014 797490 804297 808636 811008 812429 813053 812242 809881 806837 803947 801131 797809 793819 789569 785491
52302 785491 781694 778094 774701 771757 769650 768640 768649 769392 770609 772121 773869 776182 779858 785522 792843
52287 792843 800783 808757 817230 826991 838147 850078 862100 873855 885164 895856 905847 915238 924186
52274 924186 932674 940398 946938 952036 955666 957827 958412 957389 954948 951269 946328 940173 933243 926106
52260 926106 918964 911717 904420 897298 890345 883343 876326 869572 863134 856788 850583 844880 839717 834661
52246 834661 829574 824908 820809 816539 811478 806331 802531 800512 799314 797939 796464 795591 795691 796605 798020
52231G98020J605J514J368J510K051K864L852M873N465N156M201L588M018N188
52217H45273O262O816O957O812O334N593M889M448M230M035L652K944K063J528
52203I11836J735K370K693K468K151K048J822J194N38K81J92j10l02J89J075J353
52187I31533N84o90j758k372k503k309k362l121l997l851k649j736k023k787k894
52172H97065k327j742j240n14K45N98O98J060J690K217K730L640M818N572N583
52157I20093N152M560L884L413L554M215M859N326O013P045P841P903P548P582
52143I98988Q338R413J0205J0606J1047J1868J2730J2904J2255J1527J1490J2154
52131A133525J3018J3708J4036J3891J3481J3320J3525J3571J3140J2632J2265
$$ plain form
52231 798020 799625 801139 802507 804017 806068 808932 812784 817657 823122 828278 832479 836067 840085 845273
52217 845273 851535 858351 865308 872120 878454 884047 888936 893384 897614 901649 905301 908245 910308 911836
52203 911836 913571 915941 918634 921102 923253 925301 927123 928317 928855 929136 929328 929218 928916 929105 930180 931533
52187 931533 932117 931427 929669 927297 924794 922485 920123 917002 913005 909154 906505 904769 902746 899959 897065
52172 897065 894738 892996 891756 891242 891487 892085 892783 893843 895533 897750 900480 904120 908938 914510 920093
52157 920093 925245 929805 933689 937102 940656 944871 949730 955056 961069 968114 975955 983858 991406 998988
52143 998988 1007326 1016739 1026944 1037550 1048597 1060465 1073195 1086099 1098354 1109881 1121371 1133525
52131 1133525 1146543 1160251 1174287 1188178 1201659 1214979 1228504 1242075 1255215 1267847 1280112
52120A280112J1388R490P323N955N144L829J883Q7j448l393n661p161p492p576
52106A292480q139q660q533q127p911p463o179m331k549q46J032K762L766M090
52092A241392M226M393M568M932N704O649P350P774Q223Q835R510J0106J0492
52079A334154J0620J0740J1100J1331J0663R076P535O706O016M629K665P85r06
52066A425114k769m791o687q508j0441j2240j3571j4659j5911j7127j7853j8286
52054A282271j8943j9639j9656j8928j8197j7851j7544j6996j6391j5711j4531
52043A087884j2918j1686j1248j0813r366p048m989l963l738l573l015k209j685
52030A001633j839k494l205l885m855o145p204p600p634p925q624r448j0294j1350
$$ plain form
52120 1280112 1291500 1300990 1308313 1314268 1319412 1323241 1325124 1325211 1323763 1320370 1314709 1307548 1300056 1292480
52106 1292480 1284341 1275681 1267148 1259021 1251110 1243647 1237468 1233137 1230588 1229742 1230774 1233536 1237302 1241392
52092 1241392 1245618 1250011 1254579 1259511 1265215 1271864 1279214 1286988 1295211 1304046 1313556 1323662 1334154
52079 1334154 1344774 1355514 1366614 1377945 1388608 1397684 1405219 1411925 1417941 1422570 1425235 1426020 1425114
52066 1425114 1422345 1417554 1410867 1402359 1391918 1379678 1366107 1351448 1335537 1318410 1300557 1282271
52054 1282271 1263328 1243689 1224033 1205105 1186908 1169057 1151513 1134517 1118126 1102415 1087884
52043 1087884 1074966 1063280 1052032 1041219 1031853 1024805 1019816 1015853 1012115 1008542 1005527 1003318 1001633
52030 1001633 999794 997300 994095 990210 985355 979210 972006 964406 956772 948847 940223 930775 920481 909131
52016I09131j2624j3693j4095j3773j3068j2412j2040j1857j1635j1288j0933
52005G71713j0631j0252r756r453r728j0477j1050j0845r849q587p646p233p085
51992F49121o737n960n049m596m897n520n662m995m195m367n860p698q521q005
51978E67059p142p030p679q263q192p562o672n634m548l612k853k021j008l1Q11
51963D95623J776K973L899L961L244K248J159k9q88q67l27m04j513k712l010k635
51947E02498k422k428j978p40R12K505L859M864N437N690N819N869N792N593N134
51932E46404M065K328M18j254k896m723o253o929p189q061r701j1152j1532j0879
51918D72646r744q590p668o879n729l995k389j855k221k209r52J231L527N398
$$ plain form
52016 909131 896507 882814 868719 854946 841878 829466 817426 805569 793934 782646 771713
52005 771713 761082 750830 741074 731621 721893 711416 700366 689521 679672 671085 663439 656206 649121
51992 649121 642384 636424 631375 626779 621882 616362 610700 605705 601510 597143 591283 583585 575064 567059
51978 567059 559917 552887 545208 536945 528753 521191 514519 508885 504337 500725 497872 495851 494843 494812 495623
51963 495623 497399 500372 504271 508232 511476 513724 514883 514854 513966 513099 512772 512368 510855 508143 505133 502498
51947 502498 500076 497648 495670 494930 495842 498347 502206 507070 512507 518197 524016 529885 535677 541270 546404
51932 546404 550469 552797 553215 551961 549065 544342 538089 531160 523971 515910 506209 495057 483525 472646
51918 472646 462902 454312 446644 439765 434036 430041 427652 425797 423576 421367 420415 421646 425173 430571
51904D30571O607P308Q224R931J1851J2845J2877J3029J3656J3663J2107R351
51892E62020O104K421j502m697o547p738r118j0341j0630j0152r503q518o771
51879D85028m757l309k211o44J234K426K773L153L894M157L210J331q17k925m724
51864D87819n798o035n831n604n541n707n861n256l451j315k50m17o38k34K01
51849D36082J90L02R03J039l58k691m225m147l239k606k558k783k890k598j904
51834D08517j209r71j074r14j87O18P60L2j083j884k029j732j588k099l137l943
51818C88077l777k704j551r93q79n95N5P55J287J800K276K271J503L53n67j133
51802C86178j556j810j725j525j807k784l911m374l822k604j453r07q90r00o49
$$ plain form
51904 430571 437178 444486 452710 462641 474492 487337 500214 513243 526899 540562 552669 562020
51892 562020 568124 570545 569043 564346 557799 550061 540943 530602 519972 509820 500317 491799 485028
51879 485028 480271 476962 474751 474107 475341 477767 480540 483693 487587 491744 494954 496285 495468 492543 487819
51864 487819 482021 475986 470155 464551 459010 453303 447442 442186 438735 437420 437170 436753 436115 435881 436082
51849 436082 436272 436574 437477 438516 438158 435467 431242 427095 423856 421250 418692 415909 413019 410421 408517
51834 408517 407308 406337 405263 404349 404162 404780 405540 405572 404489 402605 400576 398844 397256 395157 392020 388077
51818 388077 384300 381596 380045 379052 378173 377578 377633 378388 379675 381475 383751 386022 387525 387878 387311 386178
51802 386178 384622 382812 381087 379562 377755 374971 371060 366686 362864 360260 358807 357900 357010 356110 355461
51787C55461l70l36l83j89J14Qp46j691k014j238L11J716K241J975J520J267J285
51770C58931J794L021M541N497N742N973O401O243N109L861L224K468P36j124
51756D12417j626j185j759l955o109o725o373o278o292n340l215q99O54J296J501
51741C66112J874K721L737M317M387M538N115N609N308M282L309L029L333L482
51727D21153K693Q82j169k611l428m134m773m884m491m236m330m118l189k195
51713C81170j991k391k470j765o44L77J152J770K319K818L245L569L769L688L080
51698C97696K009J113R44J189J104O12K42K4o69j904k795k792k546k824l315l281
51682C84807k805k510k440k050j153j24P15J343J759K023K444L170L762L657L000
$$ plain form
51787 355461 355091 354755 354372 354183 354297 354305 353559 351868 349854 348616 348927 350643 352884 354859 356379 357646 358931
51770 358931 360725 363746 368287 373784 379526 385499 391900 398143 403252 407113 410337 412805 413541 412417
51756 412417 410791 409606 407847 403892 397783 391058 384685 378407 372115 366775 363560 362661 363315 364611 366112
51741 366112 367986 370707 374444 378761 383148 387686 392801 398410 403718 408000 411309 414338 417671 421153
51727 421153 423846 424728 423559 420948 417520 413386 408613 403729 399238 395002 390672 386554 383365 381170
51713 381170 379179 376788 374318 372553 371909 372286 373438 375208 377527 380345 383590 387159 390928 394616 397696
51698 397696 399705 400818 401762 402951 404055 404667 404909 404933 404264 402360 399565 396773 394227 391403 388088 384807
51682 384807 382002 379492 377052 375002 373849 373725 374440 375783 377542 379565 382009 385179 388941 392598 395598
51667C95598K444K258K160J999J937J948J728J336J378K239L376L738K773Q94
51653D25806r70k116k485k474k483k670l004l340l457l304l196l519m156m513
51639C84119m237l609l112k910k917l010k934k368j363m72j38k39l85m45m98n96
51623C54886q07j213j649j785j669j754k106k092j278k21K23J3k16p6L39R69J813
51606C43377K499K549K180K319L548N330O534O523N583M410L413K520J588P52
51592C93125J64l94j205j994k122j492o70O3J126K763M402N445O177P253Q708
51577D21349J0085J1176J1984J2303J2144J2297J3567J5403J6203J5233J3636
51566E65380J3196J4561J7003J9509K1750K4068K6800K9671L1924L2926L2461
$$ plain form
51667 395598 398042 400300 402460 404459 406396 408344 410072 411408 412786 415025 418401 422139 424912 425806
51653 425806 424836 422720 420235 417761 415278 412608 409604 406264 402807 399503 396307 392788 388632 384119
51639 384119 379882 376273 373161 370251 367334 364324 361390 359022 357659 357187 357049 356810 356425 355980 355482 354886
51623 354886 354079 352866 351217 349432 347763 346009 343903 341811 340533 340312 340535 340548 340332 340256 340595 341564 343377
51606 343377 345876 348425 350605 352924 356472 361802 368336 374859 380442 384852 388265 390785 392373 393125
51592 393125 393289 392895 391690 389696 387574 386082 385412 385475 386601 389364 393766 399211 405388 412641 421349
51577 421349 431434 442610 454594 466897 479041 491338 504905 520308 536511 551744 565380
51566 565380 578576 593137 610140 629649 651399 675467 702267 731938 763862 796788 829249
51555H29249L0428K6719K1632J5990J0389M627j788q730j5482k1367k6011k9276
51543H36380l1374l2819l3798l3873l2673l0626k8482k6422k4203k1823j9469
51532E20818j7068j4605j2592j1507j1000j0341r445q634p717o252m612l763l902
51519C99380m261m319m250m033l277k179j630j874k030j506r81j254j921k047
51505C63818j549j013o17o0O13R94R97R62J100J341J665K108K520K631K369J843
51489C79722J117K89m36j033j841l078m322m844m415l562l025l176l791m232m050
51474C39323l548l494m015m186l221j662p53p62p39nQ87J155J054J454K421L049
51458C26958K721J864J166O74J82j5N61J653K510L077M135N965P654Q208P784
$$ plain form
51555 829249 859677 886396 908028 924018 934407 939034 937246 928516 913034 891667 865656 836380
51543 836380 805006 772187 738389 704516 671843 641217 612735 586313 562110 540287 520818
51532 520818 503750 489145 476553 465046 454046 443705 434260 425626 417909 411657 407045 403282 399380
51519 399380 395119 390800 386550 382517 379240 377061 375431 373557 371527 370021 369040 367786 365865 363818
51505 363818 362269 361256 360639 360579 361192 362186 363183 364145 365245 366586 368251 370359 372879 375510 377879 379722
51489 379722 380839 381128 380692 379659 377818 374740 370418 365574 361159 357597 354572 351396 347605 343373 339323
51474 339323 335775 332281 328266 324080 320859 319197 318444 317682 316943 316938 317825 318980 320034 321488 323909 326958
51458 326958 329679 331543 332709 333383 333565 333550 334111 335764 338274 341351 345486 351451 359105 367313 375097
51443C75097P194O735O211N694N401N084M376L600L347L336K638J095m83j654
51429D27671k883m421n612n934n848n977o165o040n823n787n453m274k695j600
51415C59159j036m33O1l35j520k105j052R49K302K255J383O57N70J041J704K250
51399C65850K667L201M038N059O024O873P711Q585R435J0322J1525J3345J5804
51386D70439J8598K1338K3808K6044K8263L0725L3551L6533L9200M1069M1809
51375H11377M1193L9064L5505L0823K5259J8893J1915M718k553j0146j8002k5218
51363I62828l0795l4735l7787m0190m1453m1363m0361l8668l5931l2233k8688
51352E60624k6256k4485k2198j9138j6113j3675j1558r483p786o808o259n558
$$ plain form
51443 375097 382291 389026 395237 400931 406332 411416 415792 419392 422739 426075 428713 429808 429325 427671
51429 427671 424788 420367 414755 408821 402973 396996 390831 384791 378968 373181 367728 363454 360759 359159
51415 359159 358123 357690 357751 357416 355896 353791 352739 353688 355990 358245 359628 360285 360855 361896 363600 365850
51399 365850 368517 371718 375756 380815 386839 393712 401423 410008 419443 429765 441290 454635 470439
51386 470439 489037 510375 534183 560227 588490 619215 652766 689299 728499 769568 811377
51375 811377 852570 891634 927139 957962 983221 1002114 1014029 1018747 1016194 1006048 988046 962828
51363 962828 932033 897298 859511 819321 777868 736505 696144 657476 621545 589312 560624
51352 560624 534368 509883 487685 468547 452434 438759 427201 417718 409932 403124 396865 391307
51340C91307m607l809l468l466l499l373l010k430j787j386j412j680j812j665
51326C53903j424j223j020j014j741l269m637m696l522k337j962j983j690j132
51312C22253q03o90l08N27J372J644J169L13l26m44k48L1O10J721K779K788J742
51295C34130Q79J070J665J606J037R60J592K049J645P59K24M06J027J534J463
51280C52046P17l36j203j625j511q72n7L02l2n04n30l20l54m16O6Q28Q49j91j355
51261C45502j663j213p47n92o05p42j144j751k247k384k080j336k49Q43J413J086
51245C32091N1q95r47j80M41J76n30o50K1O24M27l42r77j078o61P6P45R85R79
51226C30356J373K312K944K398R76j74m52k64j66j39nM8k48o77p19l02O7L9n4
$$ plain form
51340 391307 386700 382891 379423 375957 372458 369085 366075 363645 361858 360472 359060 357380 355568 353903
51326 353903 352479 351256 350236 349222 347481 344212 339575 334879 331357 329020 327058 325075 323385 322253
51312 322253 321450 320760 320452 320979 322351 323995 325164 325477 325151 324707 324459 324490 325100 326821 329600 332388 334130
51295 334130 335009 336079 337744 339350 340387 341347 342939 344988 346633 347392 347616 348022 349049 350583 352046
51280 352046 352763 352427 351224 349599 348088 347216 347159 347461 347429 346925 346395 346075 345721 345305 345371 346199 347048 346857 345502
51261 345502 343839 342626 341879 341287 340682 339940 338796 337045 334798 332414 330334 328998 328749 329592 331005 332091
51245 332091 332142 331247 330300 330120 330561 330737 330207 329557 329578 330202 330629 330287 329310 328232 327571 327647 328392 329377 330356
51226 330356 331729 334041 336985 339383 340359 340185 339733 339469 339303 339164 339159 339207 338959 338282 337563 337261 337328 337367 337313
51207C37313L02R78J289Q99L47L95J109J788J716Q23k91p83j81J151K267K574
51191C51696K395K340K308J710N28l80l32L42Q47R18Q23O28K6j103k307k931k682
51174C54826j820r60o29r07j365j513j263q44l86K54J073J664J596J047P76J315
51158C52864K278K715K127R81J51K5K84M41K39l68j319k283k668k144j136n21
51142C51666o59r76o91J69P97O78K52K80Q07J200J110R58J265J865K118J702Q90
51125C63431J44k83l38n6M23Q62J024Q21L91O3J18M72P59P62O23N47M89M24N92
51106C71268J162J781J915J618J504J866K312K448K494K821L232L172K555J856
51092D02004J418J071O16K15J1k43p44j105p59N8M25j33j105j852k327k556k050
$$ plain form
51207 337313 337615 338593 339882 340781 341128 341523 342632 344420 346136 346959 346668 345885 345704 346855 349122 351696
51191 351696 354091 356431 358739 360449 360977 360597 360265 360607 361454 362372 363195 363823 363849 362746 360439 357508 354826
51174 354826 353006 352046 351417 350510 349145 347632 346369 345525 345139 345393 346466 348130 349726 350773 351549 352864
51158 352864 355142 357857 359984 360965 361116 361141 361425 361866 362105 361737 360418 358135 355467 353323 352187 351666
51142 351666 351007 350031 349340 349509 350306 350984 351236 351516 352323 353523 354633 355591 356856 358721 360839 362541 363431
51125 363431 363575 363292 362954 362898 363321 364183 365207 366028 366419 366482 366600 367072 367831 368593 369216 369763 370252 370676 371268
51106 371268 372430 374211 376126 377744 379248 381114 383426 385874 388368 391189 394421 397593 400148 402004
51092 402004 403422 404493 405109 405324 405335 405092 404348 403243 402484 402542 402967 402834 401729 399877 397550 394994 392944
51075C92944n49J065J581J082Q00J341K047K399K986M387O004O802O695O326N956
51060D41866N466N143N505O452P401Q183R050R865J0182J0125J0355J0913J0940
51047E51446R888Q286O849N506L794J779rj287k290l507n366p896j0430j1953
51033E44810j2069j1380j0731j0379j0073r605q920p902o450m671k819j145J25
51020D48791R30J561K424L458M169M413M692N446O472P310P841Q161Q246Q193
51006E22107Q472R446J0839J2084J3005J3805J4540J5095J5442J5568J5320J4662
50994F80385J3932J3400J2763J1604J0122Q913Q056P001N364L407J616K64n00
50981G76327m91L39J842L717N550O972Q183J0133J3579J7997K1976K4849K7396
$$ plain form
51075 392944 392395 393460 395041 396123 396923 398264 400311 402710 405696 410083 416087 422889 429584 435910 441866
51060 441866 447332 452475 457980 464432 471833 480016 489066 498931 509113 519238 529593 540506 551446
51047 551446 561334 569620 576469 581975 585769 587548 587539 586252 583962 580455 575089 567193 556763 544810
51033 544810 532741 521361 510630 500251 490178 480573 471653 463751 457301 452630 449811 448666 448791
51020 448791 449721 451282 453706 457164 461333 465746 470438 475884 482356 489666 497507 505668 513914 522107
51006 522107 530579 540025 550864 562948 575953 589758 604298 619393 634835 650403 665723 680385
50994 680385 694317 707717 720480 732084 742206 751119 759175 766176 771540 774947 776563 776827 776327
50981 776327 775836 776175 778017 781734 787284 794256 802439 812572 826151 844148 866124 890973 918369
50968I18369L0736L5015L9412M3087M5762M7675M9197N0469N1256N1298N0702
50957A412978M9637M7828M4882M1194L7792L5019L2010K7931K3214J8981J5570
50946A787036J2320Q586M416L52k987n205o566q029j0369j3229j5543j6876j7765
50933A716141j8797j9968k1219k2903k5305k8136l0985l3877l6864l9388m0682
50922A398017m0818m0665m0722m0482l9255l7222l5217l3668l2224l0417k8257
50911I99070k6043k3866k1629j9440j7603j6178j4827j3235j1596j0423r929r702
50899H04599r054p683o009m793m312m055l405k558k258k557k412j004R89K167
50885G57655K203K122K719L581L962L881L841M028M389N094O315P735Q915R926
$$ plain form
50968 918369 949105 984120 1023532 1066619 1112381 1160056 1209253 1259722 1310978 1362276 1412978
50957 1412978 1462615 1510443 1555325 1596519 1634311 1669330 1701340 1729271 1752485 1771466 1787036
50946 1787036 1799356 1807942 1812358 1812710 1809723 1804518 1797952 1789923 1779554 1766325 1750782 1733906 1716141
50933 1716141 1697344 1677376 1656157 1633254 1607949 1579813 1548828 1514951 1478087 1438699 1398017
50922 1398017 1357199 1316534 1275812 1235330 1196075 1158853 1123636 1089968 1057744 1027327 999070
50911 999070 973027 949161 927532 908092 890489 874311 859484 846249 834653 824230 814301 804599
50899 804599 795545 787862 781853 777060 772748 768693 765288 762730 760472 757915 755503 754499 755488 757655
50885 757655 759858 761980 764699 768280 772242 776123 779964 783992 788381 793475 799790 807525 816440 826366
50871H26366J1101J2375J3444J4460J5926J7950K0224K2708K5627K8736L1404
50860A040321L3651L6391M0272M4957M9952N5464O1856O8682P5116Q0977Q6706
50849A674345R2468R7945J02933J07474J11315J13783J14413J13299J10729J06712
50839B745416J00959R3152Q3251P1730N9524M7441L5741K4395J3607L761m825
50828C274152j1738j6291j8156j8072j7234j6024j4040j1472r593r514j1154j4016
50816C106848j8317k4619l2651m1290m9660n7756o5894p4004q1509q7574r1534
50805B482040r3327r3503r2465q9937q5514p9594p3160o6654n9638n1695m3215
50794A653338l5045k7778k1637j6566j2180p968l950q77O44R03N79k02j679l615
$$ plain form
50871 826366 837467 849842 863286 877746 893672 911622 931846 954554 980181 1008917 1040321
50860 1040321 1073972 1110363 1150635 1195592 1245544 1301008 1362864 1431546 1506662 1587639 1674345
50849 1674345 1766813 1864758 1967691 2075165 2186480 2300263 2414676 2527975 2638704 2745416
50839 2745416 2846375 2939527 3022778 3094508 3154032 3201473 3237214 3261609 3275216 3278977 3274152
50828 3274152 3262414 3246123 3227967 3209895 3192661 3176637 3162597 3151125 3141532 3132018 3120864 3106848
50816 3106848 3088531 3063912 3031261 2989971 2940311 2882555 2816661 2742657 2661148 2573574 2482040
50805 2482040 2388713 2295210 2202745 2112808 2027294 1947700 1874540 1807886 1748248 1696553 1653338
50794 1653338 1618293 1590515 1568878 1552312 1540132 1532164 1528214 1527337 1527981 1528884 1529463 1529261 1527582 1523967
50780A523967n443p257r744j2817j5207j6035j6235j7521k0218k2995k4662k5450
50768A330383k6273k7473k8674k9410k9443k8745k7584k6404k5253k3550k0747
50757A036827j7228j4114j2161j1046r744p485m306q76K176M795P307R860J2247
50744I96252J4388J6617J9296K2349K5562K9038L3033L7403M1656M5559M9305
50733A330458N3040N6534N9476O1831O3728O5073O5461O4463O2094N8888N5401
50722A996447N1437M6066L8717L0099K1608J3880O380j493r304j5797j9965k1676
50710B136399k1517k0279j8485j6235j3492j0497p745n530l834k777k965n055
50698B007988r043j4134j9389k4412k9372l4432l9162m2658m4297m4290m3337
$$ plain form
50780 1523967 1518524 1511267 1501523 1488706 1473499 1457464 1441229 1423708 1403490 1380495 1355833 1330383
50768 1330383 1304110 1276637 1247963 1218553 1189110 1160365 1132781 1106377 1081124 1057574 1036827
50757 1036827 1019599 1005485 993324 982278 972534 965049 960743 959867 962043 966838 974145 984005 996252
50744 996252 1010640 1027257 1046553 1068902 1094464 1123502 1156535 1193938 1235594 1281153 1330458
50733 1330458 1383498 1440032 1499508 1561339 1625067 1690140 1755601 1820064 1882158 1941046 1996447
50722 1996447 2047884 2093950 2132667 2162766 2184374 2198254 2204634 2203141 2193837 2178040 2158075 2136399
50710 2136399 2114882 2094603 2076118 2059883 2046391 2035894 2028149 2022619 2018785 2016008 2013043 2007988
50698 2007988 1998945 1984811 1965422 1941010 1911638 1877206 1838044 1795386 1751089 1706799 1663462
50687A663462m1800l9394l5652l0459k4082j6938r389j684O027J3541K0543K6751
50675A530926L2132L6734M0444M3085M4751M5648M5642M4298M1523L7806L3619
50664A976608K9007K4032J9346J5749J3279J1117Q547N637K863L55k097m437o148
50651B093858o835o679o094n114l456j068J766M870Q331J2070J5620J8590K1055
50638B146914K3288K5333K6957K7818K7593K6408K5177K4689K3922K0047J1189
50627B409335j225j3656k3714l1314l7101m1201m3782m5426m6175m5040m1219
50616B039482l5281k8532k1831j5582j0317o495m006k532k203l337n821r272j3655
50603A880618j9129k5320l1286l6265m0114m3092m5504m7495m8847m9066m7968
$$ plain form
50687 1663462 1621662 1582268 1546616 1516157 1492075 1475137 1465748 1464064 1470091 1483632 1504175 1530926
50675 1530926 1563058 1599792 1640236 1683321 1728072 1773720 1819362 1863660 1905183 1942989 1976608
50664 1976608 2005615 2029647 2048993 2064742 2078021 2089138 2097685 2103322 2106185 2106540 2104443 2100006 2093858
50651 2093858 2087023 2080344 2074250 2069136 2065680 2064612 2066378 2071248 2079579 2091649 2107269 2125859 2146914
50638 2146914 2170202 2195535 2222492 2250310 2277903 2304311 2329488 2354177 2378099 2398146 2409335
50627 2409335 2408110 2394454 2370740 2339426 2302325 2261124 2217342 2171916 2125741 2080701 2039482
50616 2039482 2004201 1975669 1953838 1938256 1927939 1921444 1917438 1914906 1912703 1909366 1903545 1894273 1880618
50603 1880618 1861489 1836169 1804883 1768618 1728504 1685412 1639908 1592413 1543566 1494500 1446532
50592A446532m6079m4122m2201l9806l6575l2741k8824k5139k1665j8236j4942
50581A096202j2208j0326q908p191n015l093k073j719j402q85k21P87K345M199
50567A050492N946P762J0250J3612J7424K1206K4744K7929L0780L3595L6641L9666
50555A320047M2152M4056M5715M7007M7184M5800M3366M0857L8900L7673L7150
50544A789907L7130L7286L7604L8536M0407M2789M4934M6768M9030N2307N6266
50533B272964O0129O3678O7367P1469P5609P9286Q2383Q4768Q5709Q4438Q1217
50522C109017P7207P2956O7582N9831M9572L7766K5254J2047k163j7170l2013
50511C459886m5463n6764o5990p3536p9293q2601q3077q1047p6955p0756o2297
$$ plain form
50592 1446532 1400453 1356331 1314130 1274324 1237749 1205008 1176184 1151045 1129380 1111144 1096202
50581 1096202 1083994 1073668 1064760 1057569 1052554 1049461 1047388 1045669 1044267 1043382 1043161 1043948 1046293 1050492
50567 1050492 1056438 1064200 1074450 1088062 1105486 1126692 1151436 1179365 1210145 1243740 1280381 1320047
50555 1320047 1362199 1406255 1451970 1498977 1546161 1591961 1635327 1676184 1715084 1752757 1789907
50544 1789907 1827037 1864323 1901927 1940463 1980870 2023659 2068593 2115361 2164391 2216698 2272964
50533 2272964 2333093 2396771 2464138 2535607 2611216 2690502 2772885 2857653 2943362 3027800 3109017
50522 3109017 3186224 3259180 3326762 3386593 3436165 3473931 3499185 3511232 3509069 3491899 3459886
50511 3459886 3414423 3357659 3291669 3218133 3138840 3056239 2973162 2892115 2815160 2744404 2682107
50500B682107n2045m0961k9792j8796q103J906J0476J6597J9460J9025J5911J0572
50488B626357K925p016j8586l0865m3219n5010o5255p3218p9056q3344q6180q7275
50476B000258q6680q4764q1714p7679p3277o9180o5245o0730n5525n0475m6365
50465A248624m3084l9945l6401l2327k8003k4012k0740j7935j5086j2236r942
50454I68913q438p280n910m220k439q53L08J077J855K877L685L656L004K734L436
50439I62405M747O089P401Q784J0003J0847J1597J2727J4243J5693J6802J7861
50427A099199J9392K1505K3694K5475K7101K9296L2125L4758L6667L8551M1333
50416A429096M4718M7558M9462N1024N2546N3465N3251N2073N0270M7845M4705
$$ plain form
50500 2682107 2630062 2589101 2559309 2540513 2532410 2534316 2544792 2561389 2580849 2599874 2615785 2626357
50488 2626357 2629282 2622266 2603680 2572815 2529596 2474586 2409331 2336113 2257057 2173713 2087533 2000258
50476 2000258 1913578 1828814 1747100 1669421 1596144 1526964 1461719 1400989 1345464 1294989 1248624
50465 1248624 1205540 1165595 1129194 1096867 1068864 1044852 1024112 1006177 991091 978855 968913
50454 968913 960475 953195 947285 943065 940626 939773 940081 941158 943013 945890 949575 953231 956235 958969 962405
50439 962405 967152 973241 980642 989426 999429 1010276 1021873 1034600 1048843 1064536 1081338 1099199
50427 1099199 1118591 1140096 1163790 1189265 1216366 1245662 1277787 1312545 1349212 1387763 1429096
50416 1429096 1473814 1521372 1570834 1621858 1674404 1727869 1781120 1833193 1883463 1931308 1976013
50405A976013M0842L6073L0268K3877J7527J0950L249n555j4145k1569k8383l5434
50393B033713m2259m7564n0804n2480n3106n2663n0941m7843m3363l7661l1116
50382A523913k4098j6883r976m117L17L601O105P682P858O345L187j230o192j1120
50368A485392j6116k1543k6949l1194l3961l6259l8846m0949m1363m0153l8431
50357A119628l6810l5066l3029l0952k8995k7082k5209k3372k1341j9018j6852
50346H21902j5216j3697j1690r512q067p403o468m575k309o51K40R95K101L395
50332G49045M353M690M733N093N908O595O700O704P430Q741R476Q755O889M798
50318H39910L058J782R79N92L29o3m04j65Q45K122K974L369M007N383P005P906
$$ plain form
50405 1976013 2016855 2052928 2083196 2107073 2124600 2135550 2138799 2133244 2119099 2097530 2069147 2033713
50393 2033713 1991454 1943890 1893086 1840606 1787500 1734837 1683896 1636053 1592690 1555029 1523913
50382 1523913 1499815 1482932 1472956 1468839 1469156 1472757 1478862 1486544 1494402 1500747 1503934 1502704 1496512 1485392
50368 1485392 1469276 1447733 1420784 1389590 1355629 1319370 1280524 1239575 1198212 1158059 1119628
50357 1119628 1082818 1047752 1014723 983771 954776 927694 902485 879113 857772 838754 821902
50346 821902 806686 792989 781299 771787 763720 756317 749849 745274 742965 742314 742554 743549 745650 749045
50332 749045 753398 758088 762821 767914 773822 780417 787117 793821 801251 809992 819468 828223 835112 839910
50318 839910 842968 844750 845729 846321 846650 846587 846183 846018 846863 848985 851959 855328 859335 864718 871723 879629
50302H79629P796P279O964O869O827O878P007O909O389N635M766L564J993N52
50288I59057l07p82j249j592j448p95J26J121J788J400l46k710m678o040p137
50273I36408p922q070p779p587p461o822n472l795k090m42Q27J447J964L349N559
50258H92114P301P546O672N741N307N293N512N813O025O138O308O494O443O223
50244I78930O367P265Q786J0669J2911J5500J8174K0673K3029K5386K7826L0417
50232A185933L3017L4934L5249L3798L1488K9387K7762K6256K4683K3239K1996
50221A507742K0452J7664J2989O767N7o571j3654k1703k9762l5986l9688m1958
50209A376349m3966m5441m5359m3474m0544l7426l4488l1694k8864k6062k3971
$$ plain form
50302 879629 887425 894704 901668 908537 915364 922242 929249 936158 942547 948182 952948 956512 958505 959057
50288 959057 958750 957968 956719 955127 953679 952884 953010 954131 955919 957319 956973 954263 949585 943545 936408
50273 936408 928486 920416 912637 905050 897589 890767 885295 881500 879410 878968 879795 881242 883206 886555 892114
50258 892114 899415 906961 913633 919374 924681 929974 935486 941299 947324 953462 959770 966264 972707 978930
50244 978930 985297 992562 1001348 1012017 1024928 1040428 1058602 1079275 1102304 1127690 1155516 1185933
50232 1185933 1218950 1253884 1289133 1322931 1354419 1383806 1411568 1437824 1462507 1485746 1507742
50221 1507742 1528194 1545858 1558847 1565614 1565671 1559100 1545446 1523743 1493981 1457995 1418307 1376349
50209 1376349 1332383 1286942 1241583 1198109 1157565 1120139 1085651 1053957 1025093 999031 975060
50198I75060k3432k4287k5185k5009k4096k3470k3345k3081k2319k1384k0473
50187G18979j9253j7511j5631j4085j2801j1393r824q442p395o290m684k755j266
50174E87649p23p93p51k83M34J192J946K623L215M014N233O452P006P043P482
50159F31739Q690R872J0238J0094J0187J0477J0301R522Q748Q440Q324P842O813
50146G51287N585M735M543M672M518M039L939M806O411Q148R757J1191J2230J2858
50132H48719J3717J5435J7678J9568K1010K2887K5826K9492L3326L7379M2070
50121A127107M7476N3262N8997O4320O9055P3290P7119Q0146Q1587Q1130P9424
50110A892913P7502P5903P4505P2909P0696O7447O2746N6207M7479L6497K3787
$$ plain form
50198 975060 951628 927341 902156 877147 853051 829581 806236 783155 760836 739452 718979
50187 718979 699726 682215 666584 652499 639698 628305 618481 610039 602644 596354 591670 588915 587649
50174 587649 586926 586133 585382 585099 585533 586725 588671 591294 594509 598523 603756 610208 617214 624257 631739
50159 631739 640429 650301 660539 670633 680820 691297 701598 711120 719868 728308 736632 744474 751287
50146 751287 756872 761607 766150 770822 775340 779379 783318 788124 794535 802683 812440 823631 835861 848719
50132 848719 862436 877871 895549 915117 936127 959014 984840 1014332 1047658 1085037 1127107
50121 1127107 1174583 1227845 1286842 1351162 1420217 1493507 1570626 1650772 1732359 1813489 1892913
50110 1892913 1970415 2046318 2120823 2193732 2264428 2331875 2394621 2450828 2498307 2534804 2558591
50099B558591J0348l083j6470l0075m3730n6624o7722p6256q2082q5661q7590
50088B019646q7989q6544q3308p9123p4897p0622o5638n9822n4114m9586m6355
50077A261648m3580m0423l6729l2919k9489k6654k4296k2170k0120j8154j6307
50066I50807j4517j2718j0959r357p948o679n529m526l669k834j915r86l39k65
50052H68566o93j117j076p53q39j689k787l281k953k330j988k064k418k894l320
50037H38364l540l540l341k815j952j299j476k184k286j233J77R18J084J365J711
50022H19953J419M74j34L60J559K456K463J798J203J422K543L870M812N804P717
50007H57719J0527J3284J5533J7887K1002K4771K8952L3727L8990M3769M7205
$$ plain form
50099 2558591 2568939 2565856 2549386 2519311 2475581 2418957 2351235 2274979 2192897 2107236 2019646
50088 2019646 1931657 1845113 1761805 1682682 1607785 1537163 1471525 1411703 1357589 1308003 1261648
50077 1261648 1218068 1177645 1140916 1107997 1078508 1051854 1027558 1005388 985268 967114 950807
50066 950807 936290 923572 912613 903256 895308 888629 883100 878574 874905 872071 870156 869170 868831 868566
50052 868566 867873 866756 865680 864927 864088 862399 859612 856331 853378 851048 849060 846996 844578 841684 838364
50037 838364 834824 831284 827943 825128 823176 821877 820401 818217 815931 814698 814875 815793 816877 818242 819953
50022 819953 821372 821846 821712 822072 823631 826087 828550 830348 831551 832973 835516 839386 844198 850002 857719
50007 857719 868246 881530 897063 914950 935952 960723 989675 1023402 1062392 1106161 1153366
49996A153366M9651N1945N3876N4255N2442M9049M5129M1302L7799L4695L1739
49985A655248K8275K3620J7465R905J344p601j6424k5034l3571m1922m9575n5946
49973A505784o0659o3608o4907o4744o3197o0246n6142n1523m6937m2402l7657
49962H93762l2688k7756k3073j8714j4725j1096p764m850k635j043N13K275L513
49949G55719L374K207J321J402J816J630P05m94j645k799m201o151q731j1465
49935G32688j3533j4586j5009j5248j5235j4737j3906j3032j2048j0723r166p732
49923E77733o475n116l597k317j621j323q87RJ145J957K065J685J582K437M171
49908E71448N938O921P126P318Q159R522J0732J1327J1306J0762R667Q148O672
$$ plain form
49996 1153366 1203017 1254962 1308838 1363093 1415535 1464584 1509713 1551015 1588814 1623509 1655248
49985 1655248 1683523 1707143 1724608 1734513 1735857 1728256 1711832 1686798 1653227 1611305 1561730 1505784
49973 1505784 1445125 1381517 1316610 1251866 1188669 1128423 1072281 1020758 973821 931419 893762
49962 893762 861074 833318 810245 791531 776806 765710 757946 753096 750461 749418 749931 752206 755719
49949 755719 759093 761300 762621 764023 765839 767469 768174 767680 766035 763236 759035 752884 744153 732688
49935 732688 719155 704569 689560 674312 659077 644340 630434 617402 605354 594631 585465 577733
49923 577733 571258 566142 562545 560228 558607 557284 556397 556406 557551 559508 561573 563258 564840 567277 571448
49908 571448 577386 584307 591433 598751 606910 616432 627164 638491 649797 660559 670226 678374 685046
49895F85046N595M761L767K499J060o56k891n532q053j0049j1490j2439j2847
49882F38771j2784j2621j2745j3176j3547j3312j2074r975p815o430n841n280
49870E13171m122k518r29M61J641K517L183M137N703P385Q303Q269P952P998Q399
49855E71550Q903R522J0233J0582R994Q528O959N951N407M728L611K258Q57q05
49841F58278k937n102o499o977p298q078q749q159o147l920k759k732k954k681
49827E83286j739j88J816L829N297O097O644P333Q145Q931R732J0516J0869J0375
49813F70943R206Q001P149O480N696M721L510J841l58k622m272n119n676o572
49799F92928p846q956r437r458r617j0205j0828j0904j0320r439q514p558o690
$$ plain form
49895 685046 690641 695402 699169 701668 702728 702072 699181 693649 685596 675547 664057 651618 638771
49882 638771 625987 613366 600621 587445 573898 560586 548512 538537 530722 524292 518451 513171
49870 513171 509049 506531 505602 506063 507704 510221 513404 517541 523244 530629 538932 547201 555153 563151 571550
49855 571550 580453 589975 600208 610790 620784 629312 636271 642222 647629 652357 655968 658226 659083 658278
49841 658278 655341 650239 643740 636763 629465 621387 612638 604479 598332 594412 591653 588921 585967 583286
49827 583286 581547 581359 583175 587004 592301 598398 605042 612375 620520 629451 639183 649699 660568 670943
49813 670943 680149 688150 695299 701779 707475 712196 715706 717547 717189 714567 710295 705176 699500 692928
49799 692928 685082 676126 666689 657231 647614 637409 626581 615677 605357 595918 587404 579846 573156
49786E73156o261o360o537o264n440m245k818j341k00L86P06J197J870K582L607
49771E44038N336P314Q372P977O973O520O716O725N997M819L777L117K691K164
$$ plain form
49786 573156 566895 560535 553998 547734 542294 538049 535231 533890 533690 534076 534782 535979 537849 540431 544038
49771 544038 549374 556688 565060 573037 580010 586530 593246 599971 605968 610787 614564 617681 620372 622536
$$ [...]
##END NTUPLES=NMR SPECTRUM
##END=
