##TITLE=AC1584_DECA0001_8281218_3LNIgvZUDM
##JCAMPDX= 6.0         $$ Bruker NMR JCAMP-DX V2.0
##DATA TYPE= NMR SPECTRUM
##DATA CLASS= NTUPLES
##ORIGIN= BRUKER
##OWNER= Administrator
$$ 1.72 TOPSPIN		Version 2.1
$$ 2013-10-18 23:53:35.560 -0700  Administrator@X
$$ Compression mode = diff/dup
##.OBSERVE FREQUENCY= 400.02188249412
##.OBSERVE NUCLEUS= ^1H
##.ACQUISITION MODE= SIMULTANEOUS (DQD)
##.ACQUISITION SCHEME= undefined
##.AVERAGES= 8
##.DIGITISER RES= 22
##SPECTROMETER/DATA SYSTEM= spect
##.PULSE SEQUENCE= zg30
##.SOLVENT NAME= COFFEE_meoh
##.SHIFT REFERENCE= INTERNAL, COFFEE_meoh, 1, 14.98509
##AUDIT TRAIL= $$ (NUMBER, WHEN, WHO, WHERE, PROCESS, VERSION, WHAT)
$$ ##TITLE= Audit trail, TOPSPIN		Version 2.1
$$ ##JCAMPDX= 5.01
$$ ##ORIGIN= Bruker BioSpin GmbH
$$ ##OWNER= Administrator
$$ $$ E:\/data/COFFEE/nmr/AC1584_DECA0001_8281218_3LNIgvZUDM/10/pdata/1/auditp.txt
$$ ##AUDIT TRAIL=  $$ (NUMBER, WHEN, WHO, WHERE, PROCESS, VERSION, WHAT)
(   1,<2013-10-18 23:53:28.513 -0700>,<Administrator>,<X>,<go>,<TOPSPIN 2.1>,
      <created by zg
	started at 2013-10-18 23:52:22.529 -0700,
	POWCHK enabled, PULCHK disabled,
       configuration hash MD5:
       C8 4E 4E 5D D3 5C D8 9E 9F 52 82 E0 59 8A DE 15
       data hash MD5: 64K
       47 61 A8 EE 69 46 06 19 72 4A 66 B8 2D 9A 49 7F>)
(   2,<2013-10-18 23:53:31.560 -0700>,<Administrator>,<X>,<proc1d>,<TOPSPIN 2.1>,
      <Start of raw data processing
       efp LB = 0 FT_mod = 6 PKNL = 1 PHC0 = 0 PHC1 = 0 SI = 32K 
       data hash MD5: 32K
       1D 9F 18 8A 58 22 3B 93 BC 0B 03 6E 08 4C 01 98>)
(   3,<2013-10-18 23:53:31.904 -0700>,<Administrator>,<X>,<proc1d>,<TOPSPIN 2.1>,
      <pk PHC0 = 93.25745 PHC1 = 0 
       data hash MD5: 32K
       59 56 67 0C 21 95 B4 0D EF 40 B0 84 E4 E0 D2 01>)
(   4,<2013-10-18 23:53:32.091 -0700>,<Administrator>,<X>,<proc1d>,<TOPSPIN 2.1>,
      <abs ABSG = 1 
       data hash MD5: 32K
       FF B2 67 DC 29 10 7A 45 46 DC 8B 20 BD CC 98 E1>)
(   5,<2013-10-18 23:53:32.154 -0700>,<Administrator>,<X>,<proc1d>,<TOPSPIN 2.1>,
      <abs ABSG = 2 
       data hash MD5: 32K
       96 24 BF 0C 39 C7 46 AE AF 42 7B 52 B8 2E 5E 15>)
(   6,<2013-10-18 23:53:32.216 -0700>,<Administrator>,<X>,<proc1d>,<TOPSPIN 2.1>,
      <abs ABSG = 3 
       data hash MD5: 32K
       39 CF F3 9E 9D 89 9D EF 5F A5 3F DC 55 2A 08 8E>)
(   7,<2013-10-18 23:53:32.279 -0700>,<Administrator>,<X>,<proc1d>,<TOPSPIN 2.1>,
      <abs ABSG = 4 
       data hash MD5: 32K
       21 A2 F9 CB 10 BD 67 BA 6B B5 06 01 84 DD DE 16>)
(   8,<2013-10-18 23:53:32.325 -0700>,<Administrator>,<X>,<proc1d>,<TOPSPIN 2.1>,
      <abs ABSG = 5 
       data hash MD5: 32K
       D4 4D B0 02 70 F2 93 F6 69 EF 5D 43 C9 2E 10 6D>)
$$ ##END=
$$ 
$$ $$ hash MD5
$$ $$ FA 89 32 00 C0 50 3D F4 CC 2C DF F8 0E A7 7C B8
##$RELAX= 
##$RELAX= 
##$RELAX= 
##$RELAX= 
##$RELAX= 
##$RELAX= 
##$RELAX= 
$$ Bruker specific parameters
$$ --------------------------
##$DU= <E:\>
##$EXPNO= 10
##$NAME= <AC1584_DECA0001_8281218_3LNIgvZUDM>
$$ [...]
##$TP= (0..7)
150 150 150 150 150 150 150 150
##$TP07= 0
##$TPNAME0= <>
##$TPNAME1= <>
##$TPNAME2= <>
##$TPNAME3= <>
##$TPNAME4= <>
##$TPNAME5= <>
##$TPNAME6= <>
##$TPNAME7= <>
##$TPOAL= (0..7)
0.5 0.5 0.5 0.5 0.5 0.5 0.5 0.5
##$TPOFFS= (0..7)
0 0 0 0 0 0 0 0
##$TUNHIN= 0
##$TUNHOUT= 0
##$TUNXOUT= 0
##$USERA1= <user>
##$USERA2= <user>
##$USERA3= <user>
##$USERA4= <user>
##$USERA5= <user>
##$V9= 5
##$VALIST= <valist>
##$VCLIST= <CCCCCCCCCCCCCCC>
##$VD= 0
##$VDLIST= <DDDDDDDDDDDDDDD>
##$VPLIST= <PPPPPPPPPPPPPPP>
##$VTLIST= <TTTTTTTTTTTTTTT>
##$WBST= 1024
##$WBSW= 4
##$XGAIN= (0..3)
0 0 0 0
##$XL= 0
##$YL= 0
##$YMAX_a= 640463
##$YMIN_a= -544466
##$ZGOPTNS= <>
##$ZL1= 120
##$ZL2= 120
##$ZL3= 120
##$ZL4= 120
##$ABSF1= 14.98509
##$ABSF2= -5.573092
##$ABSG= 5
##$ABSL= 3
##$ALPHA= 0
##$AQORDER= 0
##$ASSFAC= 0
##$ASSFACI= 0
##$ASSFACX= 0
##$ASSWID= 0
##$AUNMP= <proc_prof1d_extract_pilot.lims>
##$AXLEFT= 0
##$AXNAME= <>
##$AXNUC= <1H>
##$AXRIGHT= 0
##$AXTYPE= 0
##$AXUNIT= <>
##$AZFE= 0.1
##$AZFW= 0.1
##$BCFW= 0
##$BC_mod= 0
##$BYTORDP= 0
##$COROFFS= 0
##$CY= 15
##$DATMOD= 1
##$DC= 0
##$DFILT= <>
##$DTYPP= 0
##$F1P= 0
##$F2P= 0
##$FCOR= 0.5
##$FTSIZE= 32768
##$FT_mod= 6
##$GAMMA= 0
##$GB= 0
##$INTBC= 1
##$INTSCL= 1
##$ISEN= 128
##$LB= 0
##$LEV0= 0
##$LPBIN= 0
##$MAXI= 10000
##$MC2= 0
##$MEAN= 0
##$ME_mod= 0
##$MI= 0
##$NCOEF= 0
##$NC_proc= -8
##$NLEV= 6
##$NOISF1= 0
##$NOISF2= 0
##$NSP= 0
##$NTH_PI= 0
##$NZP= 0
##$OFFSET= 14.98509
##$PC= 1
##$PHC0= 93.25745
##$PHC1= 0
##$PH_mod= 1
##$PKNL= yes
##$PPARMOD= 0
##$PPDIAG= 0
##$PPIPTYP= 0
##$PPMPNUM= 2147483647
##$PPRESOL= 1
##$PSCAL= 4
##$PSIGN= 0
##$PYNMP= <proc.py>
##$REVERSE= no
##$SF= 400.02
##$SI= 32768
##$SIGF1= 0
##$SIGF2= 0
##$SINO= 400
##$SIOLD= 32768
##$SPECTYP= <>
##$SREGLST= <1H.CDCl3>
##$SSB= 0
##$STSI= 32768
##$STSR= 0
##$SW_p= 8223.68421052631
##$SYMM= 0
##$S_DEV= 0
##$TDeff= 65536
##$TDoff= 0
##$TI= <>
##$TILT= no
##$TM1= 0
##$TM2= 0
##$TOPLEV= 0
##$USERP1= <user>
##$USERP2= <user>
##$USERP3= <user>
##$USERP4= <user>
##$USERP5= <user>
##$WDW= 1
##$XDIM= 32768
##$YMAX_p= 470257937
##$YMIN_p= -715125
##$CURPLOT= <Network HP LaserJet P1505>
##$CURPRIN= <$Network HP LaserJet P1505>
##$DFORMAT= <normdp>
##$LAYOUT= <+/1D_H.xwp>
##$LFORMAT= <normlp>
##$PFORMAT= <normpl>
##$SURQMSG= 1
$$ End of Bruker specific parameters
$$ ---------------------------------
##NTUPLES= NMR SPECTRUM
##VAR_NAME=  FREQUENCY,     SPECTRUM/REAL,   SPECTRUM/IMAG
##SYMBOL=    X,             R,               I
##VAR_TYPE=  INDEPENDENT,   DEPENDENT,       DEPENDENT
##VAR_FORM=  AFFN,          ASDF,            ASDF
##VAR_DIM=   32768,         32768,           32768
##UNITS=     HZ,            ARBITRARY UNITS, ARBITRARY UNITS
##FACTOR=    0.250966925370066, 1,           1
##FIRST=     8223.43324360094, 55835,        -86537
##LAST=      0,             9506,            -41486
##MIN=       0,             -715125,         0
##MAX=       8223.43324360094, 470257937,    0
$$ Real data points
##PAGE= N=1
##DATA TABLE= (X++(R..R)), XYDATA
$$ [...]
$$ plain form
19541 -82181 -288312 20932 214891 -304885 -90934 -132292 58467 -194608 -27440 -43331 -337911
19530 -337911 159976 -33092 228310 -19976 -196048 -64504 -268431 -11665 9388 164298 -152347
19518 -90068 119328 63534 -100755 164528 -65646 -40801 -12117 35404 -77032 -183949 22712
19506 -103153 -314540 -127334 144179 51115 -88498 -209498 43554 99196 -196872 -70550
19495 -66346 92877 -129352 -178817 -228395 76607 -37130 265114 -126361 152508 -78692 -184568
19484 -184568 116207 323260 -272664 -75220 -5540 33117 -203194 -48392 -174380 341840
19473 -42287 -49797 10242 119048 15599 60957 44922 -77212 -206526 -167199 -321862 68891
19461 10147 -151125 23481 -13877 -167076 -159173 -137219 174037 -382151 -83900 -249051 -26478
$$ packed form
19541h2181k06131B0932J93959c04885i0934m1358E8467a94608b7440j5891k94580
19530c37911A59976c3092B28310a9976j76072f4504k03927a1665I388J54910a52347
19518i0068A19328n5794a00755A64528f5646K4845a2117C5404g7032j06917B2712
19506a03153k11387a27334A44179E1115h8498j21000D3554N5642a96872g0550
19495f6346I2877a29352m9465m9578G6607c7130B65114a26361A52508g8692j05876
19484a84568A16207K07053b72664g5220e540C3117b03194d8392j25988C41840
19473d2287p510A0242J08806A5599M5358j6035g7212j29314L9327j54663F8891
19461A0147a51125B3481a3877j53199P903K1954A74037c82151h3900j65151b6478
$$ plain form
19449 -78126 27165 45951 -63764 -197859 183040 41588 341646 -143690 -62720 28840 -132462
19437 25101 -173003 40597 -117812 267192 -164625 113914 -179412 6320 -276302 -290019
19427 -290019 -216728 -65307 -493351 56011 17631 -15261 212770 39753 -146814 30163 -228922
19415 18611 -89158 -312551 -526 -214896 -214012 263869 -27483 42818 -9676 -340013 -133329 -150583
19403 -150583 -413322 -263975 -73312 62557 -103404 -233523 -168617 165414 -3665 -119126
19393 -119126 -212367 -89726 -239765 -167668 -149975 39232 -89271 170027 32640 14202 -60305
19381 33247 156041 110447 -303720 -103729 -127181 -349850 -47159 215242 -57479 -345074
19371 -345074 -31705 228962 -160299 -192113 39252 -176642 -304594 228356 -80011 -209488
$$ packed form
19449g8126B7165J8786f3764j34095A83040D1588L00058a43690f2720B8840a32462
19437B5101a73003D0597a17812B67192a64625A13914a79412F320b76302j3717
19427b90019P3291f5307m28044E6011A7631a5261B12770C9753a46814C0163b28922
19415A8611h9158k23393e26k14370Q84B63869b7483D2818i676l30337a33329j7254
19403a50583k62739J49347g3312F2557a03404j30119O4906A65414c665j15461
19393a19126r3241h9726j50039P2097J7693C9232h9271A70027C2640A4202f0305
19381C3247J22794m5594c03720a03729k3452k22669d7159B15242e7479k87595
19371c45074c1705B28962a60299l1814C9252a76642j27952B28356h0011j29477
$$ plain form
19361 -209488 232210 -147014 -139553 -368670 30605 84074 94052 -363361 107216 -391810 -209161
19350 -209161 27668 -82099 108004 453413 77294 -212621 -8231 27491 -150723 -254591 191128
19338 -209834 -158418 174949 -70240 310016 -78670 -110685 -344218 -114078 42636 -175978
19327 -152339 -174193 272226 -36282 -465718 -15806 77599 -17046 -289976 -394422 -125122
19316 57875 159934 76221 -252348 70566 70167 -199087 -80297 -235866 182022 -94656 -97129
19305 -97129 185501 369858 -22827 61857 -72980 -103963 -295582 -127408 -241799 -52752 -418401
19294 -418401 -141036 211898 109920 306815 150876 -184297 182725 -247770 -429132 -31926
19283 -80071 -35787 -478333 262535 -7031 101511 -219202 -272375 -73947 70855 313584 -285995
$$ packed form
19361b09488B32210a47014P461k29117C0605N3469R978c63361A07216c91810J82649
19350b09161B7668h2099A08004L45409G7294b12621h231B7491a50723j03868A91128
19338b09834N1416A74949g0240C10016g8670l2015k33533a14078D2636a75978
19327a52339k1854B72226c6282m29436a5806G7599a7046k72930j04446a25122
19316E7875J02059G6221b52348G0566l99a99087h0297j55569A82022i4656k473
19305i7129A85501J84357b2827F1857g2980l0983j91619a27408j14391e2752l65649
19294d18401a41036B11898j01978J96895A50876a84297A82725b47770j81362c1926
19283h0071c5787m42546B62535g031A01511b19202n3173g3947G0855K42729b85995
$$ plain form
19271 -167752 -68992 201090 94107 -85915 135292 -219961 56368 220707 -294805 -101894
19260 -81626 8770 -41427 133169 -83917 46433 -422434 -19127 -93742 128962 -139826 -50868
19248 -277989 2497 -19182 37367 81182 -365942 -167275 -157715 76078 -258808 -73225 -250926
19237 -250926 -773 108415 -111096 166922 -33420 -441195 -45482 -137885 -153815 -16850 -66211
19226 -66211 -25155 -204795 -3111 -432479 -52852 -49311 64299 -100144 95689 -198285 -388990
19215 -388990 -190438 197669 83678 -112358 1479 -281013 -315438 -306617 195381 182034 -326185
19203 141398 270516 -161274 218814 -509013 -110916 -185787 200666 14857 -89601 -188158
19193 -188158 -225338 28156 170595 -58476 13502 -14001 -75322 -8521 -64322 169128 98610
$$ packed form
19271a67752f8992B01090I4107h5915A35292b19961E6368J64339b94805a01894
19260h1626H770d1427A33169h3917D6433d22434a9127p4615A28962a39826e0868
19248b77989B497a9182C7367M3815c65942a67275R560G6078b58808g3225j77701
19237b50926g73A08415a11096A66922c3420m07775d5482r2403j5930a6850m9361
19226f6211b5155j79640c111m29368e2852L541F4299a00144I5689a98285j90705
19215c88990a90438A97669H3678a12358A479b81013l4425Q821A95381j3347c26185
19203A41398J29118a61274B18814e09013a10916p4871B00666A4857h9601r8557
19193a88158l7180B8156J42439e8476A3502a4001o1321h521n5801A69128p0518
$$ plain form
19182 98610 -27059 -394866 -89285 288864 -183130 -26236 -337071 -162800 -78872 -175049 -135778
19171 -135778 -22470 -39235 -263348 -272081 20392 -115161 143492 -75914 -159482 -143538 33312
19159 -126610 -97075 137498 -126309 -83844 83413 -71107 -91366 -98291 -137921 -154132 -19891
19147 82586 195366 150 -240154 159507 212173 101666 144906 177729 -63252 -208882 127393
19135 -144207 -18218 187877 178844 210765 -62780 -150602 -102797 -88561 125146 -228649 -420356
19124 -420356 -400685 202656 26730 -8972 -294697 162554 -520377 47392 -122153 97896 -291106
19112 -30569 -254338 -161218 -139148 -236441 236556 -107014 237891 -51587 258288 -24410 149761
19100 -34446 108910 348543 2634 -34924 -320070 -312187 -204236 -204535 -88546 117084 -6530 -134210
$$ packed form
19182I8610b7059l67807h9285B88864a83130b6236l10835a62800g8872r6177L9271
19171a35778b2470j6765k24113q733B0392a15161A43492g5914q3568J5944C3312
19159a26610K9535A37498a26309M2465H3413g1107k0259o925l9630j6211a9891
19147H2586J12780A50b40154A59507N2666A01666M3240L2823f3252j45630A27393
19135a44207a8218A87877r033L1921f2780q7822M7805J4236A25146b28649j91707
19124d20356J9671B02656B6730h972k85725A62554e20377D7392a22153I7896b91106
19112c0569k23769R3120K2070r7293B36556a07014B37891e1587B58288b4410A49761
19100c4446A08910K39633B634c4924k85146P883J07951k99h8546A17084f530j27680
$$ plain form
19088 -134210 -294542 -116977 1973 15409 -309836 65556 -16944 -11371 -118634 -25408 -3146
19076 -199583 -145767 349980 -549808 29152 3160 -163570 -240401 -385657 -17118 -112915 -310573
19065 -310573 -10623 -67593 370549 12876 125216 -114653 -421451 89973 133945 -313258
19054 -290258 32850 -179565 130778 224433 -107645 -216484 -230275 -3200 51764 4739 -90728
19042 -59062 -105998 -148444 111003 -14420 25578 -117060 -159494 317233 -72928 -150848 20496
19030 -385562 87236 -90199 121675 184130 146820 104353 176133 -32668 256903 -211514 17804
19018 1377 -277289 162989 205193 -67332 56061 -300176 -300471 258607 -189559 -129910 185427
19006 60076 12078 214469 68130 79214 -52338 -168171 -6698 -25229 98144 -20862 -300709
$$ packed form
19088a34210j60332a16977A973J3436c09836F5556a6944N573j07263b5408c146
19076a99583N3816C49980e49808B9152C160a63570p6831j45256a7118r5797j97658
19065c10573a0623n6970C70549A2876J12340a14653l06798H9973M3972c13258
19054b90258C2850a79565A30778R3655a07645j08839j3791c200E1764D739i0728
19042e9062m6936m2446A11003a4420B5578a17060m2434C17233g2928p7920B0496
19030c85562H7236i0199A21675O2455l7310m2467P1780c2668B56903b11514A7804
19018A377b77289A62989M2204f7332E6061c00176k95B58607a89559N9649A85427
19006F0076A2078K02391F8130J1084e2338j15833f698j8531I8144b0862k79847
$$ plain form
18995 -300709 -25095 -41583 4698 -198418 49200 139056 -131057 4188 194053 -35639 -248585
18984 -248585 -189888 363882 -212747 -1711 -136715 -38664 24468 -215143 -298828 66334 183993
18973 183993 409610 -216923 -257927 -166780 17389 -151119 10853 -102802 -188728 156422
18962 -14246 -272095 -32805 -83509 7897 68521 -173039 97444 -63324 -11246 -11367 -13201 238354
18949 186394 -147093 -77229 -102405 -51230 -298606 -147316 146065 -7875 -53361 61148 110997
18938 110997 153903 -99824 -114812 37738 -117290 96059 -176253 10202 -28118 -491191 -292109
18927 -292109 -263250 236616 -2230 170502 -120222 -328650 -193316 5656 -4861 -106414 -27283
18915 -101962 -345615 1164 -172012 -32971 72779 107151 -343502 -161491 -48398 32711 -124367
$$ packed form
18995c00709b5095j6488D698a98418D9200Q9856a31057D188J89865c5639k12946
18984b48585N8697C63882b12747a711j35004c8664B4468b15143q3685F6334J17659
18973A83993K25617b16923m1004R1147A7389a51119A0853a02802q5926A56422
18962a4246k57849c2805n0704G897O0624a73039I7444f3324a1246j21j834B38354
18949A86394a47093O9864k5176N1175k47376a47316A46065g875m5486F1148M9849
18938A10997M2906i9824j4988C7738a17290I6059a76253A0202b8118m63073J99082
18927b92109K8859B36616b230A70502a20222k08428J35334E656d861j01553b7283
18915a01962k43653A164a72012c2971G2779L4372c43502a61491d8398C2711a24367
$$ plain form
18903 -3593 -330624 54032 -30306 -148823 18120 188850 -316505 -186176 -112919 -203422 7936
18891 -121217 -113050 -413468 -152411 -200988 58043 401513 61002 -64661 165306 200793 51107
18879 24553 -102004 -294768 29888 4732 175401 227626 -75749 257015 -257803 173120 87257
18868 87257 -226187 -61293 237107 -302639 -191233 -90054 -28107 -949 -51748 44556 -178554
18856 80134 51118 -190853 47893 -67598 -194935 -21846 -250842 229994 246117 321177 -56784
18844 17083 -275976 179652 -153240 -153887 73003 -148992 -69165 -314078 246247 -347058 -554494
18833 -554494 -173227 23823 -54107 93781 230753 -239740 27580 -138841 -297491 96049
18822 -35474 77586 -376463 153357 -389383 -175732 28508 -151109 -75930 77510 406333
$$ packed form
18903c593l27031E4032c0306j18517A8120J70730c16505J30329P3257r0503G936
18891a21217Q167l00418a52411m8577E8043L43470F1002f4661A65306L5487E1107
18879B4553a02004j92764B9888D732J70669N2225g5749B57015b57803A73120q5863
18868H7257b26187f1293B37107c02639J11406i0054b8107i49n0799D4556a78554
18856H0134k9016a90853D7893f7598j27337b1846k28996B29994J6123P5060e6784
18844A7083b75976A79652a53240o47G3003a48992f9165k44913B46247c47058k07436
18833e54494a73227B3823e4107I3781J36972b39740B7580a38841j58650I6049
18822c5474G7586c76463A53357c89383a75732B8508a51109P5179G7510L28823
$$ plain form
18812 406333 184187 127761 -29977 -160001 -2065 -60570 -141408 -336182 68255 -242997 289960
18800 302350 21977 133596 223711 128608 -213671 -328570 311451 -45551 -433527 43166
18789 -183798 -144581 3429 158006 221235 -275648 -97429 87656 -98553 -167892 -346297 -77245
18777 165174 141767 -161954 -301092 -98249 -1045 -137856 -20655 4219 59682 -132685 204214
18765 -157590 -114930 95326 -250724 -191883 -87991 309000 15936 20309 206560 154987 99212
18754 99212 -192656 -290725 173275 92858 -125349 250400 -56822 -33588 -182152 193785
18743 -130160 -10325 -70800 57231 -65279 64381 1721 -105553 -137896 -91470 153700 64084
18731 -210587 -265749 218085 -58619 -139195 -61644 -548779 -325630 -115634 32471 -81676 -290667
$$ packed form
18812D06333A84187n6426b9977j30024b065n8505q0838j94774F8255b42997B89960
18800C02350B1977J11619R0115r5103b13671j14899C11451d5551l87976D3166
18789a83798L9217C429J54577O3229b75648i7429H7656i8553o9339j78405g7245
18777A65174k3407a61954j39138i8249a045j36811b0655D219N5463a32685B04214
18765a57590M2660I5326b50724N8841h7991C09000A5936M373J86251n1573n5775
18754I9212a92656r8069A73275q0417a25349B50400e6822K3234j48564A93785
18743a30160a0325o0475E7231f5279F4381A721a05553l2343M6426A53700F4084
18731b10587n5162B18085e8619q0576f1644m87135K23149a15634C2471h1676k08991
$$ plain form
18720 -290667 -59720 47470 -4001 -118210 95600 -175172 302794 110063 -274150 -117381
18709 -26750 -272367 -163927 72347 -95702 137140 -3525 -280749 -129429 61226 -61384 49843
18697 -242444 -167492 -9226 -59443 -149600 -19925 -136660 -85466 -30471 -42703 -228236 -10875
18685 345354 -121952 -220737 349842 157862 -130834 -135947 297348 75095 -157754 150825
18674 -357012 212033 229856 93897 263704 -306592 -358754 -82901 59558 -257574 -36118 -205220
18663 -205220 127928 -225790 -25706 45281 -88748 188691 28450 103648 67219 -254036 -143017
18652 -143017 -175166 -548286 -22714 -75212 -123248 -127798 -157813 44059 -140153 -413280 253016
18640 96951 44013 105163 -70652 -79931 1300 -192354 -121352 -21701 -104581 -97815 -74588 -45326
$$ packed form
18720b90667e9720D7470d001j14209I5600a75172C02794A10063b74150a17381
18709b6750k45617J08440G2347i5702A37140c525k77224a29429F1226f1384D9843
18697b42444P4952i226n0217r0157a9925j16735N1194c0471j2232j85533a0875
18685C45354a21952r8785C49842A57862a30834n113B97348G5095a57754A50825
18674c57012B12033J7823I3897J69807c06592n2162h2901E9558b57574c6118j69102
18663b05220A27928b25790b5706D5281h8748A88691B8450P5198l6429b54036J11019
18652a43017l2149l73120b2714n2498m8036m550l0015D4059a40153k73127B53016
18640I6951D4013O1150g0652r279A300a92354P1002b1701q2880O766K3227K9262
$$ plain form
18628 -45326 -113518 -14877 35260 59751 -235042 156203 -49644 -145202 -288082 -77712 -102579
18617 -102579 -41346 -159669 -106351 197361 -77492 257132 -110120 -116170 -85972 15205 -228205
18605 7056 -175858 182617 12113 -478191 -109051 -164551 -337376 -47790 -100980 251169 -60044
18593 -56838 20788 375070 268565 133276 -302469 -49853 -166995 -39711 49439 -2767 -181545
18582 -181545 16383 44332 -213624 -40694 160137 -14322 -879 41369 -206870 67432 -80379
18570 20976 40412 -71398 -124463 -27412 -58319 -36198 -196186 -154497 -145124 -85989 44315 -121207
18557 -186443 121560 -173803 -38041 -76684 -43461 77755 69596 -69735 -17709 -164053 49432
18545 -113780 47578 -10058 -177689 82055 87969 -7489 238053 -172829 115228 -142042 -131595
$$ packed form
18628d5326o8192a4877C5260K4491b35042A56203d9644r5558j42880g7712k4867
18617a02579d1346j18323N3318A97361g7492B57132a10120o050L0198A5205b28205
18605G056a75858A82617A2113d78191a09051n5500j72825d7790n3190B51169f0044
18593e6838B0788L54282j06505A33276c02469d9853j17142c9711D9439b767j78778
18582a81545A6383K7949b13624d0694A60137a4322h79D1369b06870F7432h0379
18570B0976J9436g1398n3065b7412l0907K2121j59988M1689R373N9135D4315a21207
18557a86443A21560a73803c8041l8643L3223G7755q159f9735a7709j46344D9432
18545a13780D7578a0058j67631H2055N914g489B38053a72829A15228a42042J0447
$$ plain form
18534 -131595 12857 -201126 -392946 333613 -67141 -203701 -131397 11037 -108690 203455
18523 57096 87290 188798 247300 -85239 -299141 118749 141676 -27690 -1816 20206 -409912
18511 -166706 -187308 -6070 -122627 -206407 177456 -38366 99105 123509 -85011 -20798 -81514
18500 -81514 -327379 -145603 -88649 -115485 14427 -233367 135383 124863 149307 -49362 -161345
18489 -161345 -152935 -14019 17319 -9111 -137128 -52210 236993 6698 -55254 209716 -153354
18477 102169 165659 32449 -21220 -279743 -125320 -223725 -195038 12842 30462 141488 104140
18466 104140 22145 -45508 -46785 -18815 -113596 -170136 -214013 -157576 69286 136555 139560 -63392
18453 -144156 304954 -29757 -465310 -200517 49518 153610 -122380 -193115 38596 -217652
$$ packed form
18534a31595A2857b01126j91820C33613f7141j36560P2304A1037a08690B03455
18523E7096L0194J01508N8502h5239k13902A18749K2927b7690a816B0206d09912
18511a66706k0602f070j16557q3780A77456c8366I9105K4404h5011b0798o0716
18500h1514k45865a45603N6954k6836A4427b33367A35383j0520K4444d9362j11983
18489a61345Q410a4019A7319i111j28017e2210B36993F698e5254B09716a53354
18477A02169O3490C2449b1220k58523a25320r8405K8687A2842J7620J11026l7348
18466A04140B2145d5508j277a8815r4781n6540m3877N6437F9286O7269L005f3392
18453a44156C04954b9757m35553b00517D9518J04092a22380p0735C8596b17652
$$ plain form
18442 42794 -65757 -142312 335114 -52074 -147187 -94509 -522854 99553 55590 -79517 -314248
18431 -314248 -155559 -93332 131330 -23101 -108537 108480 -54653 -365147 124614 67728
18421 67728 26629 -376215 -96294 -147731 -100106 -14290 175155 -398050 -155477 -238270 42722
18409 -85562 112961 182528 109820 -57501 -190537 5651 -393349 8476 -353333 -278358 72792
18397 121907 -150762 84670 114597 -346276 -270614 -100253 -179103 312789 -59992 133246
18386 -31996 -13546 -252472 -3251 80086 11776 -89730 -64253 -193823 292417 -183659 37275
18374 -76768 250499 -343857 -130875 -36021 166564 176404 -21207 -219474 -385111 330402
18363 39200 -58449 -97369 -188262 -32021 186997 -52059 79985 21447 77841 76193 -140328
$$ packed form
18442D2794f5757p6555C35114e2074r5113N2678m28345I9553m3963g9517k34731
18431c14248a55559O2227A31330b3101q5436A08480e4653l10494A24614n6886
18421F7728B6629c76215i6294n1437M7625a4290A75155c98050a55477q2793D2722
18409h5562A12961O9567p2708e7501j33036E651c93349H476c53333P4975G2792
18397A21907a50762H4670K9927c46276P5662a00253p8850C12789e9992A33246
18386c1996a3546k38926c251H0086A1776h9730K5477j29570B92417a83659C7275
18374g6768B50499c43857a30875c6021A66564R840b1207j98267j65637C30402
18363C9200e8449l8920r0893c2021A86997e2059G9985B1447N6394j648a40328
$$ plain form
18351 627 126689 -40511 111046 -298662 120920 291440 -162296 280995 42252 -204650
18340 92543 -247555 -44819 202199 126533 223105 -97877 -117669 -517951 -153680 -51042 -118920
18329 -118920 48397 65247 -144643 -237154 252770 -105239 -218699 -259456 -21062 61136 -19002
18317 -100301 140304 -83842 11400 -49771 201399 -255868 134509 -103716 188842 -113056
18306 137913 149182 218359 18191 -162856 36250 -90825 433294 -206840 79063 133361 325464
18295 325464 38045 49151 275489 -164519 -93044 -199554 169201 417891 -362565 99520
18284 64830 8711 -421847 124597 269006 -9698 78611 -306130 228083 114088 6536 -267974
18272 -226669 -258917 -193662 -314183 -52161 -521100 -14403 -326152 -19429 -244707 81196 138316
$$ packed form
18351F27J26062d0511A11046b98662A20920J70520a62296B80995D2252b04650
18340I2543b47555d4819B02199p5666R6572i7877j9792m00282a53680e1042o7878
18329a18920D8397J6850a44643r2511B52770a05239j13460m0757b1062F1136a9002
18317a00301A40304h3842A1400d9771B01399b55868A34509a03716A88842a13056
18306A37913J1269O9177A8191a62856C6250i0825D33294b06840G9063N4298J92103
18295C25464C8045J1106K26338a64519P1475j06510A69201K48690c62565I9520
18284F4830H711d21847A24597J44409i698G8611c06130B28083j13995F536b67974
18272b26669l2248O5255j20521e2161m68939a4403l11749a9429k25278H1196N7120
$$ plain form
18261 138316 -86109 14644 -338522 66573 -78167 153532 -139748 176653 -54208 184757
18250 -271928 23630 239855 -237518 -229699 239775 31655 -586854 170155 -33976 -39490 -72162
18239 -72162 204728 -385955 357112 -24207 28144 78827 -228168 124338 -26948 -59506 -5531
18227 -28348 -24979 113071 -28978 -172523 -152829 -143987 142190 -250295 -23084 -38556 -108876
18216 -108876 -94812 -411326 -87327 -115451 -193543 -26052 116477 -476438 292899 93056 -254442
18204 -61817 -209033 -141841 -156638 -57604 -168270 117560 16271 -126692 -151828 -159495 -86095
18193 -86095 -226355 -292139 91349 -203472 -217254 -217811 -208641 76118 -491048 -302515 -532716
18182 -532716 204202 -9002 4480 -295702 -85500 -41901 89038 -98884 24017 91156 -11570
$$ packed form
18261A38316h6109A4644c38522F6573g8167A53532a39748A76653e4208A84757
18250b71928B3630K16225b37518P819B39775C1655e86854A70155c3976n514l2672
18239g2162B04728c85955C57112b4207B8144N0683b28168A24338b6948l2558e531
18227b8348L369A13071b8978j43545J9694Q842A42190b50295b3084j5472p0320
18216a08876J4064l16514h7327k8124p8092b6052A16477d76438B92899I3056b54442
18204f1817j47216O7192j4797e7604j10666A17560A6271a26692k5136p667P3400
18193h6095j40260o5784I1349b03472j3782n57R170G6118d91048J88533k30201
18182e32716B04202i002D480b95702h5500d1901H9038i8884B4017O7139a1570
$$ plain form
18170 -257193 -64369 259916 -207019 -1371 81541 -73164 -242387 143024 -142730 -329548
18160 -329548 208971 -169526 209152 29542 -212534 -370835 242239 287079 136261 7704
18149 133909 169214 40179 132838 -66547 -47838 24639 -223008 -66469 29016 -61445 -202673
18138 -202673 26330 19578 -172393 -87186 200524 168677 -66258 352881 -251816 275377 -61799
18126 -39934 104739 74194 235955 -102813 107095 -118667 -242460 8388 -47611 -51385 -6109
18114 -130953 -88946 60754 -196166 -52416 -111780 -124436 -121740 -76648 143812 -32136 -44768
18103 -44768 186537 -217487 53145 -143601 124824 -48607 -118315 -107922 -102229 -133838 -85899
18092 -85899 -283169 -16490 153934 -396651 214867 -57062 -274851 -139348 85542 -163671
$$ packed form
18170b57193f4369B59916b07019a371H1541g3164j69223A43024a42730j86818
18160c29548B08971a69526B09152B9542b12534j58301B42239M4840A36261G704
18149A33909L5305D0179R2659f6547J8709B4639b23008f6469B9016f1445j41228
18138b02673B6330o752a72393Q5207B00524l1847f6258C52881b51816B75377f1799
18126c9934A04739l0545J61761a02813A07095a18667j23793H388d7611l774f109
18114a30953M2007F0754a96166e2416n9364j2656K696M5092A43812c2136j2632
18103d4768A86537b17487E3145a43601A24824d8607o9708J0393N693l1609M7939
18092h5899j97270a6490A53934c96651B14867e7062k17789J35503H5542a63671
$$ plain form
18081 -77100 12720 -215968 -319561 89836 -358261 159866 21225 -1475 -492057 -13599 -30595
18070 -30595 -22237 -106990 146500 -197753 145932 -330148 209717 -248307 149915 136384
18060 136384 31158 422308 -114653 -120429 101334 238322 -109431 11971 -96347 -302903
18050 -302903 101890 -187700 88113 301114 41035 -180866 238097 -404454 -114860 -190160
18040 -190160 -499066 25188 -135197 -310853 -46141 14902 -295264 151327 -378826 -106142
18029 9070 -157293 68225 41336 31540 -8301 138351 113206 -104401 23151 -158460 315384
18017 -93959 -152060 221197 -63021 -81505 -54211 -175991 42325 -372256 37142 -296150 297816
18005 -332562 91971 -146444 2649 34918 -209418 -87856 108007 -59887 268365 8504 362802
$$ packed form
18081g7100A2720b15968j03593H9836c58261A59866B1225a475m90582a3599j6996
18070c0595Q358q4753A46500a97753A45932c30148B09717b48307A49915j3531
18060A36384C1158L91150a14653n776A01334J36988a09431A1971i6347k06556
18050c02903A01890a87700H8113K13001D1035a80866B38097d04454a14860p5300
18040a90160l08906B5188a35197j75656d6141A4902b95264A51327c78826a06142
18029I070a57293F8225k6889r796h301A38351k5145a04401B3151a58460C15384
18017i3959n8101B21197f3021j8484K7294j21780D2325c72256C7142b96150B97816
18005c32562I1971a46444B649L2269b09418h7856A08007e9887B68365H504L54298
$$ plain form
17994 362802 605377 -29717 -33820 102925 -434298 -164840 -95327 193394 288548 -198271
17983 297701 74368 -139360 -275226 -123556 -470914 -46447 -73833 248081 187960 24711
17972 -289048 170794 -157756 -60198 26335 -491701 -237168 63602 -247745 219410 193582
17962 193582 -58609 -127730 541751 106015 27776 46424 101916 -333708 141206 310584
17952 310584 -93299 -43784 -146050 -140777 191983 140805 167738 -110976 75324 -111677 142173
17940 93965 -198047 -272410 22173 181392 -172792 -226730 -165470 237025 -447332 -9247 -68970
17929 -68970 -112606 33307 120413 -26727 -8509 233492 -370855 284080 10978 100635 -473622
17917 51 -39387 255533 -124832 -79683 12895 219839 -41869 111503 -232005 112403 1052
$$ packed form
17994C62802K42575b9717m103A02925d34298a64840O9513A93394R5154a98271
17983B97701G4368a39360j35866a23556l47358d6447k7386B48081o0121B4711
17972b89048A70794a57756f0198B6335d91701b37168F3602b47745B19410k5828
17962A93582e8609o9121E41751A06015B7776J8648N5492c33708A41206J69378
17952C10584i3299d3784j02266N273A91983n1178K6933a10976G5324a11677A42173
17940I3965a98047p4363B2173J59219a72792n3938O1260B37025d47332i247n9723
17929f8970m3636C3307Q7106b6727h509B33492c70855B84080A0978Q9657d73622
17917E1c9387B55533a24832M5149A2895K06944d1869A11503b32005A12403A052
$$ plain form
17905 246847 -81793 -368177 85173 -106443 159007 15714 -37387 -376322 92708 -276259
17894 418404 -33917 -100595 -213328 -11447 232775 167618 -5334 -23131 -25300 -7381 -157365
17883 -157365 48677 -27483 -337481 116400 -66852 27987 -114100 -115287 -39069 -530125 198260
17871 -47809 117186 -359520 -7773 104001 102759 149046 155944 -410046 101278 155517 320020
17860 320020 -98015 -209562 225562 -196838 111384 -60434 30545 94208 106905 -231956
17849 74370 -214170 -39489 178151 119963 212392 -90518 -258797 -110493 -71281 132519 -171578
17837 183694 131577 191473 -342267 27738 41813 112219 306381 248114 104161 203710 142659
17826 142659 14709 -67163 -279135 101587 -10667 -188460 284281 177086 79230 -49853
$$ packed form
17905B46847h1793k86384H5173a06443A59007A5714c7387l38935I2708b76259
17894D18404c3917o6678j12733a1447B32775o5157e334j7797k169g381j49984
17883a57365D8677b7483l09998A16400f6852B7987a14100j187c9069m91056A98260
17871d7809A17186c59520g773A04001j242M6287O898d10046A01278N4239J64503
17860C20020i8015j11547B25562a96838A11384f0434C0545O3663J2697b31956
17849G4370b14170c9489A78151n8188R2429i0518j68279a10493L9212A32519a71578
17837A83694n2117N9896c42267B7738J4075P0406J94162n8267A04161R9549o1051
17826A42659A4709f7163k11972A01587a0667j77793B84281j07195G9230d9853
$$ plain form
17815 165844 -117885 48614 40402 -39161 -224251 -77933 152408 50318 292122 -131355 -33166
17803 -56283 -291766 210879 -75796 -249696 -267767 119768 -316249 24407 -169780 -223103
17793 -223103 -5930 -102837 -94847 -319816 -102869 -10170 -200521 -371158 25431 133874 -190103
17781 35005 50465 -50703 73 16562 -213891 -40701 141531 123030 -32297 -56290 -229064 142571
17768 -19484 5875 -122052 -206957 82857 177306 34290 3310 16826 45310 177534 128326 -150747
17755 -8315 207713 3663 -216497 329512 -64168 -27987 -153828 17213 228669 259034 -153943
17743 155493 -231494 144184 2543 58959 -59863 24320 161589 -57292 32155 142941 315002
17732 315002 -237364 263181 -69560 117981 -113371 134141 155324 147975 -266756 219224
$$ packed form
17815A65844a17885D8614q212c9161j85090g7933A52408E0318K41804a31355c3166
17803e6283k35483B10879g5796j73900j8071A19768c16249B4407a69780n3323
17793b23103e930r6907P990k24969a02869a0170j90351j70637B5431J08443a90103
17781C5005J5460e0703G3J6489b13891d0701A41531j8501c2297k3993j72774A42571
17768a9484E875a22052q4905H2857R4449C4290C310J3516K8484J32224m9208a50747
17755h315B07713C663b16497C29512f4168b7987j25841A7213K11456L0365a53943
17743A55493b31494A44184B543N6416e9863B4320J37269e7292C2155J10786J72061
17732C15002b37364B63181f9560A17981a13371A34141K1183p349b66756B19224
$$ plain form
17721 -28423 231549 217929 226739 -201070 3348 -134699 -67901 79864 -212249 296215 -191540
17709 -21577 -58513 81978 32531 -117768 -153397 -180406 359142 -134145 103659 -434718 229213
17697 25024 67743 79839 117739 161386 9532 143791 50933 -12463 -112833 32742 63519
17686 63519 -149130 -124310 91079 299535 85952 -163924 -99888 88743 200391 32503 -69611
17674 8090 -30290 38666 -76341 368226 -72887 -95250 -173037 -231388 -47941 -62163 -332663
17663 -332663 -167849 125184 213305 320592 -9761 287991 198487 -6475 -167497 -71741 -75481
17652 -75481 108595 76574 -149564 -79500 -60984 110325 72122 -166508 -71774 -135231 -187602
17641 -187602 -32412 240221 400710 436620 -27634 195997 178861 -28352 -28468 118390 50472
$$ packed form
17721b8423B31549j3620Q810b01070C348a34699O6798G9864b12249B96215a91540
17709b1577l6936H1978C2531a17768l5629k7009C59142a34145A03659d34718B29213
17697B5024M2719J2096L7900M3647I532J34259E0933a2463j00370C2742L0777
17686F3519a49130K4820I1079K08456H5952a63924O4036H8743J11648C2503f9611
17674H090c0290C8666g6341C68226g2887k2363p7787n8351d7941j4222k70500
17663c32663J64814A25184Q8121J07287i761B87991q9504f475j61022g1741l740
17652g5481A08595l2021a49564P0064J8516A10325l8203a66508g1774o3457n2371
17641a87602c2412B40221J60489L5910b7634A95997j7136b8352j16A18390E0472
$$ plain form
17629 84411 -300254 144940 273245 87294 -24592 -119389 120854 -171385 181161 32461
17618 8953 -199623 -188417 -302111 -81536 57689 76121 109416 -153164 -262100 144513 -49049
17606 -104173 -317285 -68735 228961 146887 70885 118904 27755 -279116 51780 68826 -199801
17594 -125675 101748 154540 113810 40464 -3751 -66701 118289 5813 131960 -12661 -171060
17583 -171060 135540 101720 94306 310937 12825 87199 315005 -54178 -57830 184369 -44549
17571 12683 -42855 -54288 144664 -155098 -122301 52413 -42850 114765 51918 163733 -177152
17559 -135160 -21830 127426 -58893 140062 -113011 -208246 -348655 14331 919 -62198 64438
17547 -59246 -141857 -159061 242218 106618 142903 -5815 -59372 138180 -49221 152528 -17204
$$ packed form
17629H4411c00254A44940J28305H7294b4592r4797A20854a71385A81161C2461
17618H953a99623J1206j13694h1536E7689J8432L3295a53164j08936A44513d9049
17606a04173k13112f8735B28961q2074G0885M8019B7755b79116E1780J7046a99801
17594a25675A01748N2792m0730D0464c751o2950A18289E813J26147a2661j58399
17583a71060A35540l3820p414K16631A2825P4374K27806e4178l652A84369d4549
17571A2683d2855j1433A44664a55098L2797E2413d2850A14765E1918J11815a77152
17559a35160b1830A27426e8893A40062a13011r5235j40409A4331I19f2198F4438
17547e9246q2611j7204B42218A06618L6285e815n3557A38180d9221A52528a7204
$$ plain form
17535 -290035 84964 180929 200621 36456 38305 152832 180418 163165 -94871 179967 -531915
17523 240268 -158326 -123107 205998 520618 -2214 92157 283016 60384 149454 -84985 -19620
17511 239577 113156 83780 -5946 -66564 40553 -171247 -205468 -77590 -225808 279841 229946
17500 229946 -39274 3535 19670 8936 382504 -85039 24292 202292 92187 160698 -124336
17488 295420 -13389 216566 -32043 103240 -67597 -175763 391986 -64261 56475 97800 129842
17477 129842 181379 78398 201544 147553 134241 351910 27004 -141687 110190 129277 280814
17466 280814 171210 178072 156439 284657 172560 147943 243562 -23986 -78198 127864 148417
17455 148417 206679 316064 437861 13204 271841 44001 329182 95427 -28218 243872
$$ packed form
17535b90035H4964R5965J9692C6456J849J14527K7586j7253i4871A79967e31915
17523B40268a58326L5219B05998L14620b214I2157J90859F0384Q9070h4985a9620
17511B39577A13156k9376e946o0618D0553a71247l4221g7590j48218B79841m9895
17500B29946c9274C535J6135H936L73568h5039B4292J78000I2187O8511a24336
17488B95420a3389B16566c2043A03240f7597j08166C91986f4261E6475M1325L2042
17477A29842N1537G8398J23146n3991j3312K17669B7004a41687A10190J9087J51537
17466B80814j09604O862k1633J28218j12097k4617R5619b3986n4212A27864K0553
17455A48417N8262J09385J21797A3204K58637D4001K85181I5427b8218B43872
$$ plain form
17444 283421 251624 227603 70283 145968 97221 320941 134158 60185 415883 163066 100808
17433 100808 51021 -5350 -37280 402722 90487 -148072 376948 392916 357270 351688 474916
17422 474916 226072 264914 -134240 127399 208806 145683 451748 185368 145456 212486
17412 212486 219284 562507 140154 187393 -94763 312635 85524 -33025 227449 266642 -34614
17400 211213 -71272 94237 79945 99205 126927 375984 449709 50033 -18790 178873 -135551
17388 -29471 392236 382944 63251 428375 -78058 226856 112087 98718 125797 287362 398990
17377 398990 418472 83858 103784 39052 103841 181237 -111037 360119 220877 317763 -331782
17365 134753 -44648 364211 154872 193197 -32329 306122 147930 -123820 298286 125969
$$ packed form
17444B83421l1797k4021G0283P5685m8747K23720A34158F0185L55698A63066o2258
17433A00808m9787e350l1930D02722I0487a48072C76948J5968l5646n582J23228
17422D74916B26072L8842a34240A27399Q1407o3123L06065A85368l9912O7030
17412B12486O798L43223A40154M7239i4763C12635H5524c3025B27449L9193c4614
17400B11213g1272I4237j4292J9260K7722K49057P3725E0033a8790A78873a35551
17388b9471C92236r292F3251L65124g8058B26856A12087j3369K7079J61565J11628
17377C98990J9482H3858J9926C9052O4789P7396a11037C60119j39242R6886c31782
17365A34753d4648C64211A54872L8325c2329C06122A47930a23820B98286A25969
$$ plain form
17354 123632 351563 306670 101067 111422 14236 243836 24635 116669 112265 200152 -132567
17342 286208 83086 444383 306276 335038 -73508 -30842 271465 153560 -204176 347761
17331 236488 66887 23167 -113368 79152 79488 204163 34858 -92998 -164522 11808 126375
17320 126375 1408 131754 46048 -50493 196103 162380 121067 34711 254575 211084 188350
17309 188350 -27065 -10588 102570 513911 248071 84194 68365 -191033 203624 83850
17298 117681 230022 197381 113078 326489 -75659 89665 85221 138381 271933 223336 75872
17286 402426 199937 92885 208292 -84438 173067 64165 152688 409316 139821 100102
17276 100102 545762 184282 -35126 250934 154990 539441 347994 269631 202848 290661
$$ packed form
17354A23632K27931m4893A01067J0355A4236K29600B4635R2034m404Q7887a32567
17342B86208H3086L61297j38107K8762g3508c0842B71465j17905b04176C47761
17331B36488F6887B3167a13368G9152L36J24675C4858i2998p1524A1808J14567
17320A26375A408J30346D6048e0493A96103l3723m1313C4711K19864m3491k2734
17309A88350b7065a0588A02570M11341B48071H4194j5829a91033B03624H3850
17298A17681J12341l2641q4303K13411g5659H9665m444N3160J33552m8597G5872
17286D02426A99937I2885J15407h4438A73067F4165Q8523K56628A39821l9719
17276A00102M45660A84282c5126B50934r5944L84451j91447p8363o6783Q7813
$$ plain form
17266 290661 199497 -218142 -1225 40805 501975 181792 186436 8785 360432 95409 230228
17255 230228 412493 431961 21664 207849 521485 257018 -46795 146333 331484 104804
17244 347210 254629 111006 33496 -233655 316352 -69560 424730 27919 90353 254212
17234 254212 238249 -50896 -54683 -85994 127811 180361 526298 125502 65441 198364 87535
17222 57324 237743 236700 62154 373826 -13632 94578 222357 247538 643026 263169 331481
17211 331481 146978 99547 -49881 236808 396544 281510 464412 -152634 341813 248047
17201 248047 75394 -18633 -2380 122519 191792 -130597 222360 172628 397053 226227 141361
17190 141361 220667 68388 242653 85731 311796 362071 83724 244992 34026 229417 280785
$$ packed form
17266B90661r1164b18142a225D0805M61170A81792M644H785L51647I5409J34819
17255B30228J82265J9468B1664J86185L13636B57018d6795A46333J85151A04804
17244C47210r2581A11006C3496b33655C16352f9560D24730B7919O2434J63859
17234B54212j5963e0896l787l1311A27811N2550L45937A25502o0061J32923H7535
17222E7324J80419j043F2154L11672a3632I4578J27779K5181L95488B63169O8312
17211C31481A46978m7431d9881B36808J59736j15034J82902a52634C41813r3766
17201B48047G5394a8633b380A22519O9273a30597B22360m9732K24425j70826q4866
17190A41361P9306F8388J74265H5731K26065N0275H3724J61268C4026J95391N1368
$$ plain form
17179 280785 322905 445245 20988 447171 305676 618792 513773 75822 406231 130469
17168 451963 -42300 427230 636113 127987 355156 377672 297356 417224 14204 -27048
17157 111783 199582 276261 144941 277405 108638 130708 324731 470790 373038 116277
17146 197990 407239 406097 -182091 646870 91323 308435 343609 99378 314194 540262
17136 540262 447484 402581 521072 183870 285748 344042 207418 474242 713828 328406
17125 98713 151860 470726 355254 341445 571428 436274 437550 673755 422165 508090 140874
17113 424592 223147 -156508 504013 315694 318819 585340 408575 435057 621153 473037
17103 473037 418207 296665 478990 216674 480256 291195 191367 611944 315169 163852
$$ packed form
17179B80785M2120J22340B0988M26183j41495L13116j05019G5822L30409A30469
17168D51963d2300D27230K08883A27987K27169K2516q0316J19868A4204b7048
17157A11783Q7799P6679j31320J32464A08638K2070J94023J46059r7752A16277
17146A97990K09249j142a82091F46870I1323K17112L5174I9378K14816K26068
17136E40262r2778m4903J18491A83870J01878N8294j36624K66824K39586C28406
17125I8713N3147L18866j15472j3809K29983j35154J276K36205k51590Q5925A40874
17113D24592k01445a56508E04013j88319L125K66521j76765K6482J86096j48116
17103D73037n4830j21542J82325B16674K63582j89061r9828M20577k96775j51317
$$ plain form
17093 163852 466861 403263 649465 428951 265563 436888 138203 237720 418541 343628
17083 343628 311367 648104 386915 393606 458625 373689 350538 600296 237091 307848 660842
17072 660842 718852 302389 360531 558918 217515 214655 388193 379431 587475 491226 491292
17061 491292 665800 661283 369105 557234 397097 560982 506901 327583 547628 470222
17051 470222 430025 656656 345855 540373 309095 636909 826410 519506 438793 452168
17041 452168 138523 694710 395968 766614 598538 746039 550930 691013 668585 297027
17030 846670 406048 736516 291828 799565 589096 700844 323484 779611 569441 428428
17020 428428 546728 602424 733035 691029 639708 681317 831694 563017 731039 748190
$$ packed form
17093A63852L03009o3598K46202k20514j63388J71325A38203R9517J80821p4913
17083C43628l2261L36737k61189O691O5019q4936k3151K49758B37091P0757L52994
17072F60842N8010C02389N8142J98387B17515k860J73538q762K08044r6249O6
17061D91292J74508m517k92178J88129j60137J63885n4081j79318K20045p7406
17051D70222m0197K26631l10801J94518k31278L27814J89501l06904q0713J3375
17041D52168A38523N56187k98742L70646j68076J47501j95109J40083k2428B97027
17030H46670D06048L30468B91828N07737k10469J11748C23484M56127k10170j41013
17020D28428J18300N5696J30611m2006n1321M1609J50377k68677J68022J7151
$$ plain form
17010 748190 476689 1043896 551625 712401 652823 715175 378354 930244 847243 777047
17000 777047 599168 940696 625412 562554 666653 770848 668422 870056 930173 993687
16990 993687 660352 824937 1002492 746164 634564 1007084 463168 825790 291290 721803
16980 721803 618423 612901 777661 866716 859120 736459 877185 861740 1111602 908901 794418
16969 794418 1241581 1019044 951351 993592 1171970 546395 1046697 767954 878617 977989
16959 977989 959029 1225706 1015129 808892 1373403 1079479 1143216 796239 1054807 1195663
16949 1195663 1187649 936044 1056079 1256428 1162953 771166 1295923 1281017 1094647 1304568
16939 1304568 1280110 1206919 1308977 930925 1071620 1158459 1064195 1077246 1133594 1614135
$$ packed form
17010G48190k71501N67207m92271J60776n9578O2352l36821N51890q3001p0196
17000G77047j77879L41528l15284o2858J04099J04195j02426K01634O0117O3514
16990I93687l33335J64585J77555k56328j11600L72520D63168L62622B91290M30513
16980G21803j03380n522J64760Q9055p596j22661J40726j5445K49862k02701j14483
16969G94418M47163k22537o7693M2241J78378E46395N00302k78743J10663R9372
16959I77989j8960K66677k10577k06237N64511k93924O3737l46977K58568J40856
16949A195663q014k51605J20035K00349r3475l91787N24757j4906j86370K09921
16939A304568k4458p3191J02058l78052J40695Q6839r4264J3051N6348M80541
$$ plain form
16929 1614135 1243174 1357660 1515068 1408653 1219057 1266599 1306699 1293668 1546289 1290399
16919 1290399 1486453 1439922 1663475 1592551 1366402 1564649 1292787 1293009 1637360 1473420
16909 1473420 1562664 1609151 1318394 1315039 1703002 1628524 1694507 1308002 1726732 1459997
16899 1459997 1696258 2019909 1773964 1681718 1551834 2097403 1914671 1789874 1961270 1879620
16889 1879620 2342343 1982935 1872776 2115766 2030058 2050059 2028142 2113197 2045419 2220989
16879 2220989 1964702 2119956 2461543 2303350 2579164 2145526 2429477 2431476 2533014 2511901
16869 2511901 2436294 2383507 2400953 2495560 2773450 2622287 2736045 2621250 2720221 2856252
16859 2856252 3010836 2948884 2582749 3119037 3190433 2774412 3088087 3031380 3168250 3016368
$$ packed form
16929A614135l70961J14486J57408j06415j89596M7542M0100j3031K52621k55890
16919A290399J96054m6531K23553p0924k26149J98247k71862K22L44351j63940
16909A473420Q9244M6487k90757l355L87963p4478O5983l86505M18730k66735
16899A459997K36261L23651k45945r2246j29884N45569j82732j24797J71396q1650
16889A879620M62723l59408j10159K42990q5708K0001k1917Q5055o7778J75570
16879B220989k56287J55254L41587j58193K75814m33638K83951J999J01538k1113
16869B511901p5607n2787J7446R4607K77890j51163J13758j14795R8971J36031
16859B856252J54584o1952l66135N36288P1396m16021L13675n6707J36870j51882
$$ plain form
16849 3016368 3305255 3068786 3520621 3408523 3483191 3433833 3655918 3420873 3640867 3570218
16839 3570218 3951538 4065867 3987989 4102982 4171033 4250151 4384902 4148406 4485183 4367690
16829 4367690 4653536 4803836 5025560 4685567 5037741 4833620 5229521 5132272 5031228 5716881
16819 5716881 5411638 5488261 5987173 5692706 5690753 5798904 6100973 6169369 6343232 6403225
16809 6403225 6525011 7067964 6875248 6866961 7496761 7219560 7788260 7905230 7834117 8140310
16799 8140310 8254394 8502820 8728343 8841981 9337172 9620757 9726874 9795308 10179942 10167095
16789 10167095 10708538 10990749 11314890 11509947 12051885 12420364 12705546 12845426 13579950
16780 13579950 13711608 13856985 14973299 15061020 15701912 16295270 16795577 17073416 17876233
$$ packed form
16849C016368K88887k36469M51835j12098P4668m9358K22085k35045K19994p0649
16839C570218L81320J14329p7878J14993O8051P9118J34751k36496L36777j17493
16829D367690K85846J50300K21724l39993L52174k04121L95901r7249j01044O85653
16819E716881l05243P6623M98912k94467j953J08151L02069O8396J73863N9993
16809F403225J21786N42953j92716q287O29800k77201N68700J16970p1113L06193
16799H140310J14084K48426K25523J13638M95191K83585J06117O8434L84634j2847
16789A0167095N41443K82211L24141J95057N41938L68479K85182J39880P34524
16780A3579950J31658J45377J116314Q7721O40892N93358N00307K77839Q02817
$$ plain form
16771 17876233 18573996 19301261 19860344 20111435 21038966 21745487 22770279 23770454 24839482
16762 24839482 25699054 26743595 27844599 29052794 30380459 31701591 33154759 34382334
16754 34382334 36023914 37657038 39388627 41387324 43324362 45711697 48216553 50799827
16746 50799827 53330670 55728553 58890934 62291450 66212542 69980175 74149004 78360155
16738 78360155 82952167 87792374 93355580 98814283 105094989 110954717 117798308 124490898
16730 124490898 131464161 139001480 146422086 153441205 161223909 168115181 174250583 180041095
16722 180041095 185254273 189241532 192375795 194051156 194394389 193474834 191344060 187950727
16714 187950727 183726812 178034962 172219232 165256440 158125978 151074359 143587846 135715305
$$ packed form
16771A7876233O97763P27265N59083K51091R27531P06521J024792J000175J069028
16762B4839482Q59572J044541J101004J208195J327665J321132J453168J227575
16754C4382334J641580J633124J731589J998697J937038K387335K504856K583274
16746E0799827K530843K397883L162381L400516L921092L767633M168829M211151
16738G8360155M592012M840207N563206N458703O280706N859728O843591O692590
16730A24490898O973263P537319P420606P019119P782704O891272O135402N790512
16722A80041095N213178L987259L134263J675361L43233r19555k130774l393333
16714A87950727m223915n691850n815730o962792p130462p051619p486513p872541
$$ plain form
16706 135715305 128636650 121252897 114486130 107816659 101661806 95530860 89950370 84496618
16698 84496618 79642687 75327965 71127194 67033521 63289985 59722473 56541824 53770248
16690 53770248 50694667 48395387 45927287 43837077 41745131 39632689 37549856 35338199
16682 35338199 33684802 32595822 31196912 29745912 28176398 27317845 26314496 25176320
16674 25176320 24201345 23184088 22070264 21756189 20584667 19708353 19002934 18113555 17894125
16665 17894125 16973241 16810974 16269115 15562874 15181741 14598273 14091639 13521744 13235731
16656 13235731 12896026 12405621 12206912 11513932 11262890 11395651 10572704 9915642 10146425
16647 10146425 9692801 9811503 9516109 8809410 8798379 8365584 8420659 7886456 7946730 7537315
$$ packed form
16706A35715305p078655p383753o766767o669471o154853o130946n580490n453752
16698H4496618m853931m314722m200771m093673l743536l567512l180649k771576
16690E3770248l075581k299280k468100k090210k091946k112442k082833k211657
16682C5338199j653397j088980j398910j451000j569514q58553j003349j138176
16674B5176320r74975j017257j113824l14075j171522q76314p05419q89379k19430
16665A7894125r20884j62267n41859p06241l81133n83468n06634n69895k86013
16656A3235731l39705m90405j98709o92980k51042J32761q22947o57062K30783
16647A0146425m53624J18702k95394p06699j1031m32795N5075n34203O0274m09415
$$ plain form
16637 7537315 7326982 7521166 7363286 7290680 6982781 6951917 6663100 6230436 6410423 5826087
16627 5826087 6272232 6004449 6135582 5375730 5167652 5431507 5219793 5181679 5062296 5243881
16617 5243881 4813145 5194015 5066289 4441988 4438463 4511633 4349745 4433495 4121084 4032519
16607 4032519 3989339 4040749 3773017 3902290 4197504 3422323 3659537 3704120 3424000 3350038
16597 3350038 3565998 3332725 3091195 3263196 3197660 3043706 3241393 3017529 2946576 2927109
16587 2927109 2477524 2835630 2842107 3009739 2473946 2643780 2646141 2221211 2573871 2604358
16577 2604358 2567026 2409965 2352421 2137365 2159471 2220278 2495595 2273252 2340018 2187263
16567 2187263 1968509 1984287 1865343 2181983 2223841 1982578 1842342 2175167 1947814 1656529
$$ packed form
16637G537315k10333J94184j57880p2606l07899l0864k88817m32664J79987n84336
16627E826087M46145k67783J31133p59852k08078K63855k11714l8114j19383J81585
16617E243881m30736L80870j27726o24301l525P3170j61888Q3750l12411q8565
16607D032519m3180N1410k67732J29273K95214p75181K37214M4583k80120p3962
16597C350038K15960k33273k41530J72001o5536j53954J97687k23864p0953j9467
16587B927109m49585L58106O477J67632n35793J69834K361m24930L52660L0487
16577B604358l7332j57061n7544k15056K2106O0807K75317k22343O6766j52755
16567B187263k18754J5778j18944L16640M1858k41263j40236L32825k27353k91285
$$ plain form
16557 1656529 1718053 1536160 2170388 1685348 1782996 1560975 1408731 1707478 1723616 1754061
16547 1754061 1675735 1699929 1503671 1378538 1344808 1481712 1408104 1662871 1441118 1622238
16537 1622238 1234097 1380807 1371149 1601503 1074402 1521060 861277 1047296 1441861 1262107
16527 1262107 955793 1528898 1088030 1247063 1304001 1250648 1225897 1580445 1250348 1156613
16517 1156613 1115521 1184348 940419 1066198 1033592 1129255 803865 961127 947949 1151080
16507 1151080 779399 671376 1103385 929857 1094087 1000608 701250 831606 1187119 675609
16497 675609 604439 856866 865043 755726 1035297 955387 846175 852025 1057921 803140 838638
16486 838638 838069 1135890 702955 972340 1014758 782187 714501 584500 897216 667182
$$ packed form
16557A656529O1524j81893O34228m85040R7648k22021j52244K98747J6138L0445
16547A754061p8326K4194j96258j25133l3730J36904p3608K54767k21753J81120
16537A622238l88141J46710r658K30354n27101M46658o59783J86019L94565j79754
16527A262107l06314N73105m40868J59033N6938n3353k4751L54548l30097r3735
16517A156613m1092O8827k43929J25779l2606R5663l25390J57262j3178K03131
16507A151080l71681j08023M32009j73528J64230r3479k99358J30356L55513n11510
16497F75609p1170K52427Q177j09317K79571p9910j09212N850K05896k54781L5498
16486H38638n69K97821m32935K69385M2418k32571o7686j30001L12716k30034
$$ plain form
16476 667182 748346 969686 913266 532083 691851 619788 700918 736062 368025 809455
16466 809455 420858 382922 874265 1022961 609282 564210 712490 877246 878621 767824
16456 767824 550255 795437 696428 425466 124264 774830 752411 518384 715941 339810
16445 792152 523308 1005409 689644 187587 580297 335773 522106 381904 585762 431261
16435 431261 456191 506452 511522 513491 540492 423254 397804 495211 636548 610152 622161
16424 622161 329673 138605 35556 538724 408185 452353 610351 494319 224070 281880
16414 281880 691273 509590 314404 627710 553639 352426 478861 195602 587456 223929
16403 407735 567513 594122 399849 432993 335002 650850 82498 148533 419811 235901
$$ packed form
16476F67182Q1164K21340n6420l81183J59768p2063Q1130L5144C68025M41430
16466H09455l88597l7936M91343J48696m13679m5072J48280J64756J375j10797
16456G67824k17569K45182r9009k70962A24264O50566k2419k34027J97557C39810
16445G92152k68844M82101l15765A87587L92710k44524J86333j40202K03858j54501
16435D31261K4930N0261N070J969K7001j17238k5450R7407J41337k6396J2009
16424F22161k92488A38605C5556N03168j30539M4168J57998j16032B24070N7810
16414B81880M09393j81683j95186L13306p4071k01213J26435A95602L91854B23929
16403D07735J59778K6609j94273L3144r7991L15848H2498O6035K71278j83910
$$ plain form
16393 235901 301347 454424 179733 677254 83174 397483 314562 313807 234116 430868 380657
16382 380657 200822 466342 347488 158779 114295 421246 538663 283678 327676 284301
16372 284301 184485 423442 -68354 106716 434616 491251 277471 255031 367035 326562
16362 326562 239895 401288 276452 114724 308254 304732 202598 274860 13315 575454
16352 575454 321258 -71902 416049 288707 220770 568051 347903 336431 471137 346990
16342 346990 279588 217414 192062 118208 131761 185693 271001 440405 172097 186676 191499
16331 191499 196053 395432 74415 -108216 -198071 226083 79724 389666 257705 -98649 419477
16319 174479 133021 242599 -103822 499453 160248 523986 217611 -105250 45284 100994
$$ packed form
16393B35901O5446J53077A79733M97521H3174L14309q2921p55p9691J96752n0211
16382C80657j79835K65520j18854A58779m4484L06951J17417k54985M3998m3375
16372B84301r9816K38957f8354A06716L27900N6635k13780k2440J12004m0473
16362C26562q6667J61393j24836A14724J93530l522j02134P2262A3315N62139
16352E75454k54196g1902D16049j27342o7937L47281k20148j1472J34706j24147
16342C46990o7402o2174k5352p3854J3553N3932Q5308J69404A72097J4579M823
16331A91499M554J99379G4415a08216q9855B26083G9724L09942j31961i8649D19477
16319A74479m1458J09578a03822D99453A60248L63738B17611a05250D5284N5710
$$ plain form
16309 100994 388423 -56929 -123336 316654 -273447 -74847 -8481 -96724 352987 10801 412053
16298 412053 -101977 125147 82863 76424 195504 -91429 127686 26481 233297 84464 250902
16287 250902 346412 455226 109797 338836 56983 85719 143439 323565 116394 336233
16277 336233 244629 117345 37888 250395 291690 245658 269266 -93025 -4967 182981 13772
16265 -220545 168551 146125 -2877 -121322 102282 78651 301653 506823 289254 355828
16255 355828 169647 87241 312711 -143188 331060 66965 196229 185234 48012 471870
16245 471870 140994 126897 129085 307361 -81545 23827 383813 31081 125822 12808 9027
16234 9027 458678 -73345 -334103 61358 293562 49264 140381 -247015 -53468 206134 325187
$$ packed form
16309A00994K87429e6929o6407C16654b73447g4847h481q8243C52987A0801M01252
16298D12053a01977A25147m2284o439J19080i1429A27686B6481K06816H4464J66438
16287B50902R5510J08814A09797K29039E6983K8736N7720J80126A16394K19839
16277C36233r1604A17345C7888K12507M1295m6032K3608i3025d967A82981A3772
16265b20545A68551k2426b877j18445A02282k3631K23002K05170k17569O6574
16255C55828A69647q2406K25470a43188C31060F6965J29264j0995D8012M23858
16245D71870A40994j4097K188J78276h1545B3827L59986C1081R4741A2808l781
16234I027M49651g3345k60758F1358K32204D9264R1117b47015e3468B06134J19053
$$ plain form
16223 325187 -123839 139666 149077 -13334 -90919 60550 116250 128825 -56863 -57107 316667
16211 186830 -90470 211123 -28037 9162 205949 -86842 45923 184700 152770 -149316 -42124
16199 467647 105189 325562 274935 94191 100985 -178684 -201148 480218 -116284 202665
16188 -106144 28645 12813 266275 152846 93352 156926 247996 -35260 224264 98185 -84591
16176 60366 -146814 191446 54981 95099 27168 157306 -232872 221056 152401 417814
16166 417814 173274 7108 -25756 55976 50891 -157132 220486 2146 51342 219144 -56046
16154 -260329 -1709 -206269 102769 33323 341725 343311 -29188 -155315 -21022 191724 255880
16143 255880 100918 22452 288373 5355 -35171 406200 49503 -17310 7564 272802 -37822
$$ packed form
16223C25187a23839A39666R411a3334p7585F0550N5700J2575e6863k44C16667
16211A86830i0470B11123b8037I162J96787h6842D5923J38777l1930a49316d2124
16199D67647A05189K20373n0627I4191O794a78684k2464D80218a16284B02665
16188a06144B8645A2813K53462j13429n9494O3574R1070c5260B24264I8185h4591
16176F0366a46814A91446E4981M0118B7168J30138b32872B21056o8655K65413
16166D17814A73274G108b5756E5976n085a57132B20486B146M9196J67802e6046
16154b60329a709k04560A02769C3323L08402J586b9188j26127b1022A91724O4156
16143B55880A00918B2452K65921E355c5171D06200D9503a7310G564K65238c7822
$$ plain form
16131 -285440 308176 292923 212461 161963 -85677 256986 -19033 284337 44846 275547 -86323
16119 -450483 188481 -256061 25951 -154180 -27005 60917 -36709 -33029 23209 -225769 -190812
16108 -190812 111597 356604 -184308 58148 86441 -195682 31805 -73764 -51336 370841
16097 -44081 205287 -24206 471210 233297 54537 -14347 -96875 91576 370446 -5657 -211878
16086 -211878 -270958 -239514 -190190 -328778 -21323 -38 166133 243855 -93718 -182238 247466
16074 -119636 -324238 -16070 17670 -165624 277737 -129355 260220 -171057 79112 19473
16063 -26088 -238112 -92914 61876 -107360 99172 -313406 86337 -211793 472 -36068 -268881
16052 -268881 -25684 -78009 -221607 -309517 183201 -140025 -198481 -196331 -25960 59446 -29996
$$ packed form
16131b85440C08176j5253q0462n0498h5677B56986a9033B84337D4846K30701h6323
16119d50483A88481b56061B5951a54180b7005F0917c6709L680B3209b25769L4957
16108a90812A11597K45007a84308E8148K8293a95682C1805g3764K2428C70841
16097d4081B05287b4206D71210B33297E4537a4347q2528I1576K78870e657k06221
16086b11878n9080L1444M9324j38588b1323c8A66133P7722i3718q8520B47466
16074a19636k04602a6070A7670a65624B77737a29355B60220a71057G9112A9473
16063b6088k12024i2914F1876a07360I9172c13406H6337b11793D72c6068k32813
16052b68881b5684n2325j43598q7910A83201a40025n8456K150b5960E9446b9996
$$ plain form
16040 -63285 -142808 -42163 -2799 -231124 -79081 125629 -216272 65994 -93859 -26542 -208522
16029 -208522 66044 -156430 -52798 -26853 20973 130051 -330937 -52592 -39579 -36596 56482
16017 202093 -41163 -193348 -12171 -29294 -52407 255047 -129327 193733 -203439 -251042
16007 -251042 137818 -332994 -165574 39298 -13494 1591 139094 25575 87461 -94061 50461
15995 60278 -154486 31436 57914 -451709 123444 -61119 73500 12477 31017 -35079 227591
15983 219272 322776 128436 69645 86178 -134509 -222657 -119655 50405 7745 106456 295854
15972 295854 -99088 -37531 154764 -28269 -7563 126376 -158849 91896 -75744 47204 -335430
15960 -71224 -126911 -206999 230960 199782 -300434 62198 183691 -318612 -123517 -127532 52354
$$ packed form
16040f3285p9523d2163b799k28325g9081A25629b16272F5994i3859b6542j81980
16029b08522F6044a56430e2798K5945B0973J09078c30937e2592J3013K983E6482
16017B02093d1163j52185a2171j7123k3113B55047a29327A93733b03439m7603
16007b51042A37818c32994a65574C9298a3494A591J37503B5575O1886i4061E0461
15995F0278a54486C1436K6478d51709A23444f1119G3500A2477J8540c5079B27591
15983B19272J03504A28436n8791J6533a34509q8148J03002E0405G745R8711J89398
15972B95854i9088c7531A54764b8269g563A26376a58849I1896g5744D7204c35430
15960g1224n5687q0088B30960l1178c00434F2198J21493c18612a23517m015E2354
$$ plain form
15948 -35291 -148117 -22909 10266 72489 181562 236843 -80915 -9180 -15312 123435 -88521
15936 181884 -230315 -175569 -21691 -10061 105466 -71310 -338931 265266 -62406 206096
15925 75491 -209381 -318158 -151565 -92839 -25874 -328536 4264 -344594 2068 53077 -42355
15913 -166361 -376564 -165900 138843 -99617 289949 399633 45499 100742 135703 273322
15903 273322 -222983 125969 -103571 240922 259655 8580 62462 -59795 103991 47484 54992
15892 54992 -144904 -5325 150678 37450 -26851 225494 118087 -237866 -133040 -153429 43351
15880 230615 -385324 127189 15968 -63944 195723 -195799 124994 -61686 105940 -82647
15869 310454 -260336 -35542 -229529 -112490 124834 -92218 310697 -38605 -193284 -33779
$$ packed form
15948c5291j12826b2909A0266O2223J09073N5281h0915i180o132A23435h8521
15936A81884b30315N4746b1691a0061A05466g1310k67621B65266f2406B06096
15925G5491b09381j08777a51565N8726b5874l02662D264c44594B068N1009d2355
15913a66361k10203a65900A38843i9617B89949J09684D5499N5243L4961J37619
15903B73322b22983A25969a03571B40922J8733H580N3882e9795A03991D7484P508
15892E4992a44904e325A50678C7450b6851B25494j07407b37866J04826k0389D3351
15880B30615c85324A27189A5968f3944A95723a95799A24994f1686A05940h2647
15869C10454b60336c5542j93987a12490A24834i2218C10697c8605j54679c3779
$$ plain form
15858 168779 66193 -323896 120545 -110779 -181743 102133 -238367 315426 10630 -188848
15847 -106880 -211000 -124882 127393 -48727 110679 -57785 -102708 -104960 -1133 -16793 48841
15835 -10638 -152364 16138 -267946 129849 -271908 108906 22853 -28688 -74673 -65966 130200
15823 -235338 213406 295948 51663 -14985 -149374 66985 204667 -497196 -147027 -307494
15813 -307494 -290433 -189433 159494 62622 31195 -38922 189056 -258379 -246483 -99135 48851
15801 80348 31482 13594 88894 390261 -86010 -18698 18157 22281 155472 91101 165391
15790 165391 167404 26345 270811 -398979 -266196 125108 18109 227718 280583 -1925 -44964
15779 -44964 9680 -175022 -49549 -97470 -9366 -170955 125154 105972 -358510 115364 -141701
$$ packed form
15858A68779F6193c23896A20545a10779p0964A02133b38367C15426A0630a88848
15847a06880j04120Q6118A27393d8727A10679e7785m4923k252a133j5660D8841
15835a0638j41726A6138b67946A29849b71908A08906B2853b8688m5985Q707A30200
15823b35338B13406Q2542E1663a4985j34389F6985J37682d97196a47027j60467
15813c07494J7061J01000A59494F2622C1195c8922A89056b58379J1896i9135D8851
15801H0348C1482A3594P5300L01367h6010a8698A8157M124J33191o4371P4290
15790A65391K013B6345K44466c98979J32783A25108A8109K09609N2865a925m3039
15779d4964I680a75022d9549m7921i366j61589A25154j9182c58510A15364a41701
$$ plain form
15767 -239776 32862 -60327 -72945 47774 20120 -222976 7348 24466 242064 112073 41237
15755 56187 -44873 254877 -247257 -150524 59367 81628 217771 25785 99715 107761 -339024
15743 228110 -65035 -228615 -132859 -36384 -32933 -229180 45018 152211 276962 -60370 176674
15731 -25242 -229419 -277670 235851 -45903 -101097 63841 170149 80528 -123576 -293452 -277963
15720 -277963 132276 -208132 -142312 36087 -95839 -225280 -134889 -327787 21380 -153439
15709 -1585 202821 -463171 -139080 -20364 -148040 -239714 -272583 -377230 -189493 337038
15698 -14491 -13402 -51877 -40338 210365 -217533 246644 8656 200594 232429 194233 306635
15687 306635 43822 81353 -396750 -178775 345190 84675 -352157 19062 12846 -354348 -151504
$$ packed form
15767b39776C2862f0327j2618D7774B0120b22976G348J7118K17598A12073D1237
15755E6187d4873B54877b47257R6733E9367K2261J36143B5785P3930Q046c39024
15743B28110f5035j63580R5756c6384L451j96247D5018J07193J24751f0370A76674
15731b5242k04177m8251B35851d5903n5194F3841J06308H0528a23576j69876J5489
15720b77963A32276b08132O5820C6087i5839j29441R0391j92898B1380a53439
15709a585B02821d63171a39080b0364j27676r1674l2869j04647J87737C37038
15698a4491J089l8475J1539B10365b17533B46644H656J91938L1835l8196J12402
15687C06635D3822L7531c96750a78775C45190H4675c52157A9062o216c54348a51504
$$ plain form
15675 -227730 114796 181895 -97374 24965 38270 -378865 124499 -47365 240861 -23036 26443
15663 -125790 -229927 -154786 297298 -145587 -146637 104821 -38116 -88333 -172660 20451 -347321
15651 -83194 -27712 -39274 -272721 -193574 -53356 4303 -178096 118823 96239 -398366 44540
15639 73137 -279462 65375 -148712 129250 65934 -210259 172310 -66102 780 19122 -353877
15627 271097 -258577 -6327 259729 -148714 -62203 95274 98532 -379849 179060 222826 -349102
15615 -95356 -36981 170950 -14875 351933 122225 -66928 -272628 163551 -137951 -95952
15605 -95952 115260 -140580 -5794 64612 331673 -527587 -118110 -179885 -23696 168866 30075
15593 19612 -77565 -85336 -37439 130438 -89156 429569 -6534 -60738 167003 173272 -170642
$$ packed form
15675b27730A14796O7099i7374B4965J3305c78865A24499d7365B40861b3036B6443
15663a25790j04137P5141B97298a45587j050A04821c8116n0217q4327B0451c47321
15651h3194b7712j1562k33447P9147e3356D303a78096A18823k2584c98366D4540
15639G3137b79462F5375a48712A29250o3316b10259A72310f6102G80J8342c53877
15627B71097b58577f327B59729a48714f2203I5274L258c79849A79060M3766c49102
15615i5356c6981A70950a4875C51933A22225f6928k05700A63551a37951M1999
15605i5952A15260a40580e794F4612K67061e27587a18110o1775b3696A68866C0075
15593A9612g7565p771c7439A30438h9156D29569f534n4204A67003O269a70642
$$ plain form
15581 131412 -154923 154152 -313403 -70729 -110054 -313854 142339 -237932 28813 -199266
15570 -84897 285961 253518 196644 -156802 -62510 304134 -58587 272286 30847 129365 -39816
15558 -237930 110363 -68335 -168080 148323 -128885 15136 282306 23995 -243070 18286
15547 271708 -63697 72787 98045 232024 -387913 -236079 61882 -47112 -454940 56118 -217382
15535 -97928 -28802 84985 -28132 -135809 -6579 -92586 116927 74317 -185344 142232 -233089
15523 -237460 66680 98170 125719 260590 -17648 -155963 32767 313020 38227 14990 62222
15512 62222 178290 -100 -390488 -99434 646 -98905 -84732 134266 -130315 121355 -214143
15500 -15978 104461 -163664 -241679 -223262 -158232 257253 -95736 -121038 209944 78030 -36590
$$ packed form
15581A31412a54923A54152c13403g0729l9325k03800A42339b37932B8813a99266
15570h4897B85961l2443n6874a56802f2510C04134e8587B72286C0847R8518c9816
15558b37930A10363f8335r9745A48323a28885A5136K67170B3995b43070A8286
15547B71708f3697G2787K5258J33979c87913J51834F1882d7112m07828E6118b17382
15535i7928b8802H4985b8132j07677f579q6007A16927m2610a85344A42232b33089
15523b37460F6680L1490K7549J34871a7648j38315C2767K80253C8227A4990M7232
15512F2222J16068a00l90388i9434F46i8905J4173A34266a30315A21355b14143
15500a5978A04461a63664p8015J8417O5030B57253i5736k5302B09944G8030c6590
$$ plain form
15488 -166649 -7568 29392 85648 -50969 -48689 20635 341952 194655 -98551 -136030 313536
15476 66673 39522 -26452 74616 72661 -210321 215107 166599 -54452 -204645 -328847 -93059
15464 351825 -13287 548435 94275 -129300 -110354 225970 -89104 -120621 -164395 68155 134777
15453 134777 303723 -91823 -3477 6923 -100398 336842 330623 -372457 59351 -98180 276207
15441 -73351 -338501 -49273 201990 -98712 264441 -205266 186853 274932 182694 38906 135475
15430 135475 62724 48765 69931 144369 134450 170222 473971 -316453 -347275 350203 181684
15419 181684 -166519 97519 -73366 52448 47579 93185 176359 -67880 -155363 71487 -20402
15407 22865 -40812 -43800 148809 -86118 -89347 -56058 193844 -273130 83268 -66116 169437
$$ packed form
15488a66649g568B9392N6256e0969K280B0635L21317j47297i8551l7479C13536
15476F6673k7151b6452G4616j955b10321B15107m8508e4452j50193j24202i3059
15464C51825a3287E48435I4275a29300J8946B25970h9104l1517m3774F8155O6622
15453A34777J68946i1823c477F923a00398C36842o219c72457E9351i8180B76207
15441g3351k65150d9273B01990i8712B64441b05266A86853Q8079r2238C8906R6569
15430A35475F2724j3959K1166P4438r919L5772L03749c16453l0822C50203j68519
15419A81684a66519I7519g3366E2448m869M5606Q3174f7880q7483G1487b0402
15407B2865d0812k988A48809h6118l229L3289A93844b73130H3268f6116A69437
$$ plain form
15395 17611 -120479 135792 -18548 127213 150597 -205185 -2132 -59386 -226612 -284840 208200
15383 -239118 370003 -78241 116719 -155441 -264885 -71972 -82450 71041 -298335 53067
15372 116862 148299 7354 225046 -63925 -175036 25887 -98342 -331945 -147267 -194226 -249991
15361 -249991 19126 -155149 332031 129395 220364 188029 85374 -8130 96091 -315865 -126198
15349 111049 -281391 45469 528376 254086 123499 100307 92887 32296 -54221 24935 178814
15338 178814 -87924 222843 82732 -98332 -125564 -218157 187270 -144215 180117 123716 -296487
15326 43710 139528 -55105 -333740 -63133 -149290 -201461 206320 66253 -57683 187165 -218654
15314 186843 -16940 -124336 -48596 142149 128614 -293462 79063 274148 -271453 -108527
$$ packed form
15395A7611a20479A35792a8548A27213K3384b05185b132n7254j67226n8228B08200
15383b39118C70003g8241A16719a55441j09444g1972j0478G1041b98335E3067
15372A16862L1437G354K17692f3925j11111B5887i8342k33603a47267m6959n5765
15361b49991A9126a55149C32031A29395R0969l2335H5374h130I6091c15865a26198
15349A11049b81391D5469M82907B54086A23499k3192p420C2296e4221B4935J53879
15338A78814h7924B22843H2732i8332k7232r2593A87270a44215A80117n6401b96487
15326D3710R5818e5105k78635f3133q6157n2171B06320F6253e7683A87165b18654
15314A86843a6940j07396d8596A42149j3535b93462G9063J95085b71453a08527
$$ plain form
15303 -143203 68294 238403 173123 -97950 214162 35860 -81665 32663 -72194 42129 -147477
15291 9923 268725 190776 99789 251585 -11411 114085 3605 35897 88052 148045 -213624
15279 152228 288381 252907 -167314 248154 -177277 -92987 86711 -173004 286435 468360
15269 468360 255289 -90115 -107644 385112 -197863 -98611 -143809 288182 262030 276530 123850
15257 40821 216594 246525 236422 165365 -83296 202035 271047 114212 491024 154841 88859
15246 88859 60252 89903 72464 -1580 196395 139529 56583 6397 -32407 142381 186542 144107
15234 144107 200674 -139710 54667 147213 60242 -208309 -202051 -19205 -105895 -322823 421621
15222 -5675 -55562 240676 263879 61860 -194546 -266883 -57215 -118778 -207424 6602 -56288 161280
$$ packed form
15303a43203F8294J70109o5280i7950B14162C5860h1665C2663g2194D2129a47477
15291I923K58802p7949r0987J51796a1411A14085C605L2292N2155N9993b13624
15279A52228J36153l5474a67314B48154a77277Q4290H6711a73004B86435J81925
15269D68360k13071i0115j7529C85112a97863i8611m5198B88182k6152J4500A23850
15257D0821J75773K9931j0103p1057h3296B02035O9012A14212L76812A54841o5982
15246H8859k8607K9651j7439a580A96395n6866E6583F397c2407A42381M4161m2435
15234A44107N6567a39710E4667R2546F0242b08309O258a9205q6690k16928D21621
15222e675m9887B40676K3203F1860a94546p2337e7215o1563q8646F602e6288A61280
$$ plain form
15209 98497 206753 141478 339544 225774 217061 -23198 -198700 344191 135141 -87869 -267038
15198 -267038 -268923 57153 114814 -41695 124807 -106658 -102275 256161 -58246 153745 232770
15187 232770 -86539 -225803 40516 127362 165786 9660 -16076 278394 -54378 -1265 -21084
15176 -21084 275369 16130 110481 371154 120803 -12409 210414 -198955 182331 -23236
15165 106603 116087 108879 56171 132881 292754 141653 76334 -106252 206642 -185448 -147772
15154 -147772 179405 -96193 -19212 520845 -208362 13103 182239 165089 130535 130972 21588
15142 -115956 55559 246374 -60050 274657 45747 56992 57083 200065 86924 169271 312867
15131 312867 52330 47475 108842 88636 215555 -51782 236772 560449 -158338 422491 -12991
$$ packed form
15209I8497J08256o5275J98066j13770q713b3198j75502C44191A35141h7869j79169
15198b67038j885E7153N7661d1695A24807a06658M383B56161e8246A53745P9025
15187B32770h6539j39264D0516Q6846L8424I660a6076B78394e4378a265j9819
15176b1084B75369A6130R4351K60673A20803a2409B10414a98955A82331b3236
15165A06603R484p208n2708P6710J59873A41653o5319a06252B06642a85448L7676
15154a47772A79405i6193a9212E20845b08362A3103J69136j7150l4554M37B1588
15142a15956E5559J90815f0050B74657D5747J1245R1J42982H6924Q2347J43596
15131C12867E2330m855O1367k0206J26919e1782B36772L23677a58338D22491a2991
$$ plain form
15119 83516 183943 251769 177454 -111154 214664 -113928 -21817 147415 218376 239505 28703
15107 253665 338877 114421 315114 41838 552967 127264 136587 354526 268329 206874 259064
15096 259064 428145 238536 -40396 -244924 244672 -42262 436 171220 254658 -32381 -136461
15085 -136461 239627 385375 234119 238261 314168 7892 23453 277097 169282 70939 -90626
15073 298743 88889 201087 -116676 89358 339368 -7401 146785 36238 -41830 24418 86622
15062 86622 167059 208898 237101 5965 213938 152082 400697 -122779 -246409 167770 418025
15051 418025 205592 329475 -43306 -14089 227111 265395 348647 37479 123204 355948 316697
15040 316697 371194 514640 308507 105359 -109284 292491 80999 223054 157676 -11776
$$ packed form
15119H3516J00427O7826p4315a11154B14664a13928b1817A47415P0961K1129B8703
15107B53665Q5212A14421K00693D1838N11129A27264R323K17939q6197o1455N2190
15096B59064J69081j89609d0396k04528B44672d2262D36J70784Q3438c2381j04080
15085a36461B39627J45748j51256M142P5907G892J5561K53644j07815G0939i0626
15073B98743H8889J12198a16676H9358K50010g401A46785C6238d1830B4418O2204
15062H6622Q0437M1839K8203E965K07973o1856K48615a22779j23630A67770K50255
15051D18025B05592J23883d3306a4089B27111L8284Q3252C7479Q5725K32744l9251
15040C16697N4497J43446k06133A05359a09284B92491H0999J42055o5378a1776
$$ plain form
15029 200914 94119 3749 298504 98948 182220 125227 124167 179846 180843 35829 242638 187427
15017 187427 400389 56006 182425 73645 -159185 259038 189284 245147 384332 -154974
15006 354799 111800 -9012 457783 -50918 148385 135751 187242 479471 284868 1792 487182
14995 487182 -123037 -26961 318839 387728 323483 91706 274963 -10573 132368 -272743
14984 397674 429257 371032 -199458 154632 163134 181336 39909 214836 432763 241817 20974
14972 474899 371864 7867 218063 188120 443677 384032 424330 265938 234722 114231 217466
14961 217466 303725 4769 491869 251969 445288 336959 357280 96678 155851 245984 600118
14950 600118 215097 330349 124906 195612 388604 246866 204245 258927 260318 165322 360938
$$ packed form
15029B00914I4119C749K94755I8948Q3272n6993j060N5679R97C5829K06809n5211
15017A87427K12962E6006J26419G3645a59185B59038o9754N5863J39185a54974
15006C54799A11800i012D57783e0918A48385j2634N1491K92229j94603A792M85390
14995D87182a23037b6961C18839O8889o4245I1706J83257a0573A32368b72743
14984C97674L1583n8225a99458A54632Q502J8202C9909J74927K17927j90946B0974
14972D74899j03035G867K10196k9943K55557n9645M0298j58392l1216A14231J03235
14961B17466Q6259D769M87100k39900J93319j08329K0321I6678N9173R0133L54134
14950F00118B15097J15252A24906P0706J92992j41738m2621N4682J391r4996J95616
$$ plain form
14939 360938 128155 -103175 64843 102487 390192 -128726 527420 151744 177133 294330
14929 294330 351706 316501 80021 309319 130006 307696 286094 609432 394882 585741
14919 585741 234378 31914 213217 112065 456719 384567 397955 27342 186700 222109
14909 222109 538167 171924 314096 555617 332550 234256 203401 49301 486571 392879
14899 392879 456005 445709 524021 377680 147795 83545 236079 932004 203690 194075 504901
14888 504901 486185 -9968 72732 272455 192550 334063 506569 368752 272877 195360 268646
14877 268646 241544 351849 524240 493822 230740 226315 296934 233957 800405 305244 229937
14866 229937 415063 449643 622424 287197 199733 -7059 414529 274555 427701 195434
$$ packed form
14939C60938A28155a03175F4843L7644K87705a28726E27420A51744K5389J17197
14929B94330N7376l5205H0021K29298A30006J77690k1602L23338k14550J90859
14919E85741B34378C1914J81303j01152L44654p2152J3388B7342J59358L5409
14909B22109L16058A71924J42172K41521k23067r8294l0855D9301M37270r3692
14899C92879O3126j0296P8312j46341A47795o4250J52534O95925B03690r615L10826
14888E04901j8716i968G2732J99723p9905J41513J72506j37817r5875p7517P3286
14877B68646k7102J10305J72391l0418B30740m425P0619o2977N66448C05244p5307
14866B29937J85126L4580J72781B87197q7464g059D14529j39974J53146A95434
$$ plain form
14855 370974 368462 478022 457813 487717 -17097 661932 488923 621978 477347 611707
14845 611707 204438 271030 691993 341270 182809 152806 474890 354923 460839 531686
14835 531686 353248 330790 569245 729232 496077 173459 372374 441576 282577 645384
14825 645384 367356 480186 685152 396857 261548 19323 700278 473873 366044 550460
14815 550460 540812 347172 376774 251721 482770 537779 634098 520803 90736 607655 289902
14803 618423 44954 334427 506872 697296 456184 1125117 783362 373375 666471 433456
14793 433456 566897 522063 550695 599474 882710 410962 844302 571983 681397 590264
14783 590264 783968 256067 577587 706637 484256 366171 630600 525394 427904 523473
$$ packed form
14855C70974k512J09560k0209K9904a7097F61932j73009J33055j44631J34360
14845F11707B04438O6592M20963C41270j58461l0003L22084j19967J05916P0847
14835E31686j78438k2458K38455J59987k33155A73459J98915O9202j58999L62807
14825F45384k78028J12830K04966k88295j35309A9323O80955k26405j07829J84416
14815E50460r648j93640K9602j25053K31049N5009R6319j13295I0736N16919B89902
14803F18423D4954K89473J72445J90424k41112O68933l41755C73375K93096k33015
14793D33456J33441m4834K8632M8779K83236D10962M33340k72319J09414r1133
14783E90264J93704B56067L21520J29050k22381j18085K64429j05206r7490R5569
$$ plain form
14773 523473 563824 646422 454639 660418 791236 203903 501160 617843 697795 526356
14763 526356 578218 502000 814468 330885 554392 296646 833659 498483 608700 561638
14753 561638 375540 428146 588809 965119 734009 229377 428183 876543 723237 303665
14742 559117 727455 583503 866319 750028 410885 676360 517574 711526 515959 767606
14732 767606 279470 670481 906249 770800 1093766 704978 793384 574449 825189 825414
14722 825414 625474 741475 780450 1089143 715667 732641 915825 738628 831340 851987
14712 851987 925925 920668 828824 910597 937871 970236 927728 831680 726111 645123 765437
14701 765437 818608 886172 926718 486731 633103 807753 791586 782637 948721 1090337 1059729
$$ packed form
14773E23473M0351Q2598j91783K05779J30818B03903K97257J16683P9952j71439
14763E26356N1862p6218L12468C30885K23507k57746N37013l35176J10217m7062
14753E61638j86098N2606J60663L76310k31110B29377J98806M48360j53306C03665
14742E59117J68338j43952K82816j16291l39143K65475j58786J93952j95567K51647
14732G67606B79470L91011K35768j35449L22966l88788Q8406k18935K50740K25
14722H25414j99940J16001L8975L08693l73476J6974J83184j77197R2712K0647
14712H51987P3938n257r1844Q1773K7274L2365m2508r6048j05569q0988J20314
14701G65437N3171O7564M0546m39987J46372J74650j6167q949J66084J41616l0608
$$ plain form
14690 1059729 1197388 1020138 732875 890001 1148401 936008 961290 791624 786691 924636
14680 924636 1299807 1158715 820688 1041984 945312 903348 1215583 865572 997723 1178962
14670 1178962 919659 1134602 1327367 819233 1169063 761099 997120 1274596 1250568 1302239
14660 1302239 1082436 1201081 1481862 1109032 1237019 1110555 1202222 1307102 1053178 1206145
14650 1206145 825337 1051350 1290217 1424386 1039694 971514 1264327 1140267 1701662 1329763
14640 1329763 1210953 1544675 1174168 1203122 1130450 959157 872554 1375069 982182 1292787
14630 1292787 1485106 1327688 1391265 1184421 1087169 1118130 1121042 1148415 1331158 1139652
14620 1139652 1541251 1131926 1384551 1323823 1437276 1320326 1284528 1351628 1525850 1380989
$$ packed form
14690A059729J37659j77250k87263J57126K58400k12393K5282j69666m933J37945
14680I24636L75171j41092l38027K21296r6672m1964L12235l50011J32151J81239
14670A178962k59303K14943J92765n08134L49830m07964K36021K77476k4028N1671
14660A302239k19803J18645K80781l72830J27987j26464R1667J04880k53924J52967
14650A206145l80808K26013K38867J34169l84692o8180K92813j24060N61395l71899
14640A329763j18810L33722l70507K8954p2672j71293q6603N02515l92887L10605
14630A292787J92319j57418O3577k06844r7252L0961K912K7373J82743j91506
14620A139652M01599m09325K52625o0728J13453j16950l5798O7100J74222j44861
$$ plain form
14610 1380989 1647478 1784735 1531149 1542820 1659732 1280524 1212767 1472750 1752389 1414022
14600 1414022 1573361 1477850 1382472 1818706 1541750 1519679 1633543 1644665 1806414 1792791
14590 1792791 1810529 1829850 1537806 1892452 1703741 1848275 1988105 2017757 1802077 2112217
14580 2112217 1743805 1868228 1902300 1897517 2126345 2060681 2137525 1955585 2196249 2163900
14570 2163900 2004394 2134861 2208412 2365570 2187830 2357017 2338770 2494035 2173775 2320054
14560 2320054 2532063 2524238 2555245 3013182 2842295 3045461 3544214 3713139 4050908 4912797
14550 4912797 5609397 7633407 11563472 21763207 42181087 44868055 17395663 7026166
14541 4142471 2696594 2614266 2149035 2006760 2091591 2217169 2080132 1934541 1927689 1896374
$$ packed form
14610A380989K66489J37257k53586J1671J16912l79208o7757K59983K79639l38367
14600A414022J59339r5511r5378M36234k76956k2071J13864J1122J61749j3623
14590A792791J7738J9321k92044L54646j88711J44534J39830K9652k15680L10140
14580B112217l68412J24423L4072m783K28828o5664P6844j81940K40664l2349
14570B163900j59506J30467P3551J57158j77740J69187j8247J55265l20260J46279
14560B320054K12009p825L1007M57937j70887K03166M98753J68925L37769Q61889
14550D912797O96600K024010L930065J0199735K0417880K686968A7395663G026166
14541D142471j445877q2328m65231j42275Q4831J25578j37037j45591o852l1315
$$ plain form
14531 1896374 2010051 2106834 2517896 2198446 2332257 1904079 2435562 2669490 2490765 2550957
14521 2550957 2600640 2535729 2349892 2849937 2229720 2331452 2671577 2492923 2841466 2732975
14511 2732975 2591076 2746130 3074028 2675277 2964180 2749808 3131286 2944075 3034866 2785184
14501 2785184 3194361 3020602 3067315 3343363 3360896 3334832 3061107 3268355 3613184 3302840
14491 3302840 3431789 3413829 3722252 3826038 3525186 3586924 3636133 3797693 3808402 3895333
14481 3895333 4006369 3852872 3833840 3991294 3820706 3799272 4202642 4081946 4294645 4256303
14471 4256303 4601816 4556953 4249677 4311852 4358646 4198002 4578194 4547921 4578189 4548921
14461 4548921 4947785 4602566 4749345 4791418 4930534 4911190 5030136 5063454 4917492 5281219
$$ packed form
14531A896374J13677R6783M11062l19450J33811m28178N31483K33928j78725O0192
14521B550957M9683o4911j85837N00045o20217J01732L40125j78654L48543j08491
14511B732975j41899J55054L27898l98751K88903k14372L81478j87211R0791k49682
14501B785184M09177j73759M6713K76048J7533k6064k73725K07248L44829l10344
14491C302840J28949j7960L08423J03786l00852O1738M9209J61560J0709Q6931
14481C895333J11036j53497j9032J57454j70588k1434M03370j20696K12699l8342
14471D256303L45513m4863l07276O2175M6794j60644L80192l0273L0268k9268
14461D548921L98864l45219J46779M2073J39116j9344J18946L3318j45962L63727
$$ plain form
14451 5281219 5315793 5470631 5236218 5477862 5531000 5387876 5579161 5598915 5566113 6174270
14441 6174270 6019599 5961032 5741453 6028796 6207901 6176938 6531557 6414121 6942783 6684143
14431 6684143 6916470 6769325 6658300 6689686 7131742 7078503 7100894 7321898 7105151 7523649
14421 7523649 7837917 7714102 7635568 8131619 7930894 8386559 8325872 8205981 8459919 8835518
14411 8835518 8712352 9214751 9272061 9104460 9500591 9335682 9287644 9903176 9690306 9990460
14401 9990460 10152226 10411842 10593648 10582978 10889694 11259077 11311869 11582020 11435674 11541708
14391 11541708 12215272 12261374 12475858 12515142 13006735 12942695 13442480 13856159 13681446 13899111
14381 13899111 14309896 14523356 14914419 15088385 15222773 15546366 16131194 16346223 16746570
$$ packed form
14451E281219L4574J54838k34413K41644N3138j43124J91285J9754l2802O08157
14441F174270j54671n8567k19579K87343J79105l0963L54619j17436N28662k58640
14431F684143K32327j47145j11025L1386M42056n3239K2391K21004k16747M18498
14421G523649L14268j23815p8534M96051k00725M55665o0687j19891K53938L75599
14411H835518j23166N02399N7310j67601L96131j64909m8038O15532k12870L00154
14401I990460J61766K59616J81806j0670L06716L69383N2792K70151j46346J06034
14391A1541708O73564M6102K14484L9284M91593o4040M99785M13679j74713K17665
14381A3899111M10785K13460L91063J73966J34388L23593N84828K15029M00347
$$ plain form
14372 16746570 16862543 17270949 17740308 17933572 18372631 18780343 19231588 19790948 19952181
14363 19952181 20083014 20723473 21409325 21872496 22333551 22873915 23332867 23781620 24420617
14354 24420617 24739908 25528124 26101897 26668287 27403256 27872603 28595284 29848322 30145781
14345 30145781 31091181 32031882 32872703 33632948 34638770 35127133 36125962 37645869 38687708
14336 38687708 39796261 41087402 41745455 43258484 44541714 45927118 47844228 48920120
14328 48920120 50221182 52232881 53609406 55802068 57428868 59351565 61875140 64064704
14320 64064704 66104155 68704619 71138160 74002193 76849119 79337831 82881574 86190459
14312 86190459 89407208 93412438 97088681 101347423 105907361 110509741 115193109 120662162
$$ packed form
14372A6746570J15973M08406M69359J93264M39059M07712M51245N59360J61233
14363A9952181J30833O40459O85852M63171M61055N40364M58952M48753O38997
14354B4420617L19291P88216N73773N66390P34969M69347P22681J253038K97459
14345C0145781R45400R40701Q40821P60245J005822M88363R98829J519907J041839
14336C8687708J108553J291141O58053J513029J283230J385404J917110J075892
14328D8920120J301062K011699J376525K192662J626800J922697K523575K189564
14320F4064704K039451K600464K433541K864033K846926K488712L543743L308885
14312H6190459L216749M005230L676243M258742M559938M602380M683368N469053
$$ plain form
14304 120662162 126116369 131823217 138010406 145077456 151511020 159190728 166842532 175214287
14296 175214287 184258308 193472708 203575278 213981354 225234647 237084161 249703545
14289 249703545 262519448 276171558 290476196 305116928 320166346 335395542 350658678
14282 350658678 366286999 381672473 396332797 410218771 424074341 436432429 447470800
14275 447470800 456802253 464571618 468967346 470257937 468977340 467348521 465357915 459754077
14267 459754077 454093114 445731896 436225730 423985809 410374577 395726347 380504396
14260 380504396 364727022 348709953 332714196 316958014 301654689 286796830 272662502
14253 272662502 259242929 246167627 233878255 221943112 210696737 200326978 190624429
$$ packed form
14304A20662162N454207N706848O187189P067050O433564P679708P651804Q371755
14296A75214287R044021R214400J0102570J0406076J1253293J1849514J2619384
14289B49703545J2815903J3652110J4304638J4640732J5049418J5229196J5263136
14282C50658678J5628321J5385474J4660324J3885974J3855570J2358088J1038371
14275D47470800R331453P769365M395728J290591j280597j628819j990606n603838
14267D59754077n660963q361218r506166j2239921j3611232j4648230j5221951
14260C80504396j5777374j6017069j5995757j5756182j5303325j4857859j4134328
14253B72662502j3419573j3075302j2289372j1935143j1246375j0369759r702549
$$ plain form
14246 190624429 181106704 172190178 164532811 156862846 149368135 142473856 136101070 129779515
14238 129779515 124550336 119167442 113686938 108729444 104135480 100273084 95910190 92781591
14230 92781591 88968112 85206780 82170095 78846608 75668348 73273784 70198283 68270323
14222 68270323 65525785 63448277 61286356 59322607 57455847 55234299 53518366 52081903
14214 52081903 50504443 49352474 47630616 45840509 44430547 43403799 42523574 41686042
14206 41686042 40338150 39008717 37939808 36374993 35685335 35156561 34512490 33142310
14198 33142310 32072811 31536882 30419449 29974128 29397839 28860698 27743845 26672825 26325021
14189 26325021 25844891 25075428 24632854 23958486 23334997 23293232 22961973 21972817 21526755
$$ packed form
14246A90624429r517725q916526p657367p669965p494711o894279o372786o321555
14238A29779515n229179n382894n480504m957494m593964l862396m362894l128599
14230I2781591l813479l761332l036685l323487l178260k394564l075501j927960
14222F8270323k744538k077508k161921j963749j866760k221548j715933j436463
14214E2081903j577460j151969j721858j790107j409962j026748q80225q37532
14206D1686042j347892j329433j068909j564815o89658n28774o44071j370180
14198C3142310j069499n35929j117433m45321n76289n37141j116853j071020l47804
14189B6325021m80130p69463m42574o74368o23489m1765l31259r89156m46062
$$ plain form
14180 21526755 21133524 20364161 20208581 19983042 19301450 18835719 18819539 18359524 17968942
14171 17968942 17801177 17090307 16974492 16561596 16576561 16119104 15618700 14969193 15202131
14162 15202131 14745869 14634992 14269387 13926144 13902453 13779015 13427339 13159569 13316616
14153 13316616 12736277 12851958 12295664 12175054 12295065 11800752 11286663 11303061 11386967 10990396
14143 10990396 10920028 10581267 10713557 10260176 10315379 10088505 9981263 9653945 9593584 9298992
14133 9298992 9158242 9075098 9031575 9138171 8812269 8772191 8676632 8551659 8349888 8500122
14123 8500122 8195744 8340716 7998389 7521963 7779187 7661475 7453373 7739152 7415743
14114 7415743 7194207 7347561 7146556 7110704 6910850 6577696 6851075 6609081 6291918 6335697
$$ packed form
14180B1526755l93231p69363j55580k25539o81592m65731j6180m60015l90582
14171A7968942j67765p10870j15815m12896J4965m57457n00404o49507K32938
14162A5202131m56262j10877l65605l43243k3691j23438l51676k67770J57047
14153A3316616n80339J15681n56294j20610J20011m94313n14089J6398Q3906l96571
14143A0990396p0368l38761J32290m53381N5203k26874j07242l27318o0361k94592
14133I298992j40750q3144m3523J06596l25902m0078r5559j24973k01771J50234
14123H500122l04378J44972l42327m76426K57224j17712k08102K85779l23409
14114G415743k21536J53354k01005l5852j99854l33154K73379k41994l17163M3779
$$ plain form
14104 6335697 6208088 6128505 6352344 6070275 6094656 6417541 5883653 5598053 5726878 6190255
14094 6190255 5616665 5102136 5422550 5582148 5636848 5297010 5146942 5553047 5250920 5123042
14084 5123042 4885772 4905673 4930774 4913671 5008936 4673544 4641945 4841992 4736325 4547589
14074 4547589 4747686 4366885 4518972 4515013 4188171 4202759 4256372 4301536 4309021 4217739 3906640
14063 3906640 3764991 3810138 3894979 3998701 4133961 3959415 3770207 3818808 3851580 3648676
14053 3648676 3492979 3423866 3358417 3643488 3331305 3604287 3404473 3525542 3338451 3126932
14043 3126932 3397403 3204476 3426889 3503352 3147053 3503670 3324693 3278828 3195891 3331749
14033 3331749 3051133 3158581 3227159 3358308 3123380 2926961 2582646 2816807 2680336 2827288
$$ packed form
14104F335697j27609p9583K23839k82069K4381L22885n33888k85600J28825M63377
14094F190255n73590n14529L20414J59598N4700l39838j50068M06105l02127j27878
14084E123042k37270J9901K5101j7103R5265l35392l1599K00047j05667j88736
14074D547589K00097l80801J52087l959l26842J4588N3613M5164P485r1282l11099
14063C906640j41649M5147Q4841J03722J35260j74546j89208M8601L2772k02904
14053C648676j55697o9113o5449K85071l12183K72982j99814J21069j87091k11519
14043C126932K70471j92927K22413P6463l56299L56617j78977m5865q2937J35858
14033C331749k80616J07448O8578J31149k34928j96419l44315K34161j36471J46952
$$ plain form
14023 2827288 2701673 2615183 2618239 2611218 2346973 2654563 2587266 2019622 2203799 2336816
14013 2336816 2365181 2368343 2181146 2500516 2309541 2427013 2296055 2348835 2020942 2072029
14003 2072029 1943843 2234914 2241992 1779017 2345731 1920678 2062385 2292684 1825798 2158820
13993 2158820 2444925 2373377 2241880 2295166 3832540 6223813 14150830 35176032 48947415
13984 48947415 24071906 12224151 7822276 5755223 4885582 4034544 3477701 3489415
13976 3489415 2957047 3163957 2887625 2515132 2784522 2226431 2601280 2609470 2241726 2620469
13966 2620469 2446610 2125096 2282090 1913567 1944568 2237835 1933564 2307226 2350787 2414230
13956 2414230 1979192 2369694 2130034 1998006 1796078 1886683 1883336 1884094 1501985 1800001
$$ packed form
14023B827288j25615q6490L056p021k64245L07590o7297n67644J84177J33017
14013B336816K8365L162j87197L19370j90975J17472j30958N2780l27893N1087
14003B072029j28186K91071P078m62975N66714m25053J41707K30299m66886L33022
13993B158820K86105p1548j31497N3286J537374K391273P927017K1025202J3771383
13984D8947415B4071906j1847755m401875k067053q69641q51038n56843J1714
13976C489415n32368K06910k76332l72493K69390n58091L74849Q190l67744L78743
13966B620469j73859l21514J56994l68523L1001K93267l04271L73662M3561O3443
13956B414230m35038L90502k39660j32028k01928R0605l347P58l82109K98016
$$ plain form
13946 1800001 1881270 1689837 1683827 1733380 1753802 1388531 1762496 1894731 1726041 1978443
13936 1978443 1588894 1890815 1624813 2081877 1505647 1644024 1871196 1602683 1892311
13927 1892311 1307931 1576723 1756813 1379862 1492919 1701917 1573923 1355899 1439499 1654742
13917 1654742 1326106 1335546 1586813 1489064 1016474 1392405 1448739 1615149 1344876 1555045
13907 1555045 1804343 1385050 1376824 1464055 1259593 1393615 1648266 1431732 1395097 1354537
13897 1354537 1047311 1141901 1173933 1351239 1283219 1341129 1364947 1465327 1292482 1112967
13887 1112967 1399628 1323341 1548277 1312974 870747 1303136 1276762 1297338 1094164 1365492
13877 1365492 991340 1566394 1326979 1336820 771069 890560 1465862 1121075 1023387 955433
$$ packed form
13946A800001Q1269j91433o010M9553K0422l65271L73965J32235j68690K52402
13936A978443l89549L01921k66002M57064n76230J38377K27172k68513K89628
13927A892311n84380K68792J80090l76951J13057K08998j27994k18024Q3600K15243
13917A654742l28636R440K51267r7749m72590L75931N6334J66410k70273K10169
13907A555045K49298m19293q226Q7231k04462J34022K54651k16534l6635m0560
13897A354537l07226R4590L2032J77306o8020N7910K3818J00380j72845j79515
13887A112967K86661p6287K24936k35303m42227M32389k6374K0576k03174K71328
13877A365492l74152N75054k39415R841n65751J19491N75302l44787r7688o7954
$$ plain form
13867 955433 1332967 1339162 1151487 1212915 1044695 1039641 1187774 1200118 867826 1275574 1092942
13856 1092942 903930 788754 992292 1006222 958710 1151927 1005710 1033513 1244412 1049260
13846 1049260 955590 1107921 1245642 945109 1161268 906089 1154997 1159460 950557 837377
13836 837377 849973 1108525 619078 1195325 930663 895125 1026169 995755 646507 903188
13826 903188 829664 501004 819950 723360 847268 774255 1005989 956445 735733 846046
13816 846046 713213 823966 1175205 519467 951199 1062079 1098524 879442 753693 1140554
13806 1140554 852424 679753 809399 1039950 783727 1061167 822624 973519 796803
13797 796803 806843 851544 488331 822295 618242 685043 692295 1156568 459108 762038
$$ packed form
13867I55433L77534O195j87675O1428j68220n054J48133J2344l32292M07748j82632
13856A092942j89012j15176K03538J3930m7512J93217j46217K7803K10899j95152
13846A049260r3670J52331J37721l00533K16159k55179K48908M463k08903j13180
13836H37377J2596K58552m89447N76247k64662l5538J31044l0414l49248K56681
13826I03188p3524l28660L18946r6590J23908p3013K31734m9544k20712J10313
13816H46046j32833J10753L51239E19467M31732J10880L6445k19082j25749L86861
13806A140554k88130j72671J29646K30551k56223K77440k38543J50895j76716
13797G96803J0040M4701l63213L33964k04053O6801P252M64273D59108L02930
$$ plain form
13787 762038 994760 772203 736745 905115 576478 544558 663108 898508 817216 746487
13777 746487 940661 644663 653649 795081 548449 816002 555392 527955 655602 420411
13767 420411 712661 778541 399529 552990 836882 715664 1082707 750138 838821 823280
13757 823280 841097 634651 696103 895100 668569 585221 866376 813937 777834 253207
13746 445369 589556 449227 598007 467076 903720 249617 644096 448507 518124 544565
13736 544565 498321 790514 684864 229017 375822 655962 818909 582135 461078 633038
13726 633038 647237 651895 507558 764618 350121 190173 388040 675059 614062 443280
13716 443280 520912 681877 640426 376118 494151 446260 526156 580544 371751 446116 652305
$$ packed form
13787G62038K32722k22557l5458J68370l28637l1920J18550K35400q1292p0729
13777G46487J94174k95998Q986J41432k46632K67553k60610k7437J27647k35191
13767D20411K92250O5880l79012J53461K83892j21218L67043l32569Q8683j5541
13757H23280J7817k06446O1452J98997k26531q3348K81155n2439l6103B53207
13746D45369J44187j40329J48780j30931M36644B49617L94479j95589O9617K6441
13736E44565m6244K92193j05650B29017J46805K80140J62947k36774j21057J71960
13726F33038J4199M658j44337K57060C50121j59948J97867K87019o0997j70782
13716D43280P7632J60965m1451k64308J18033m7891P9896N4388k08793P4365K06189
$$ plain form
13705 652305 696163 587435 313671 545404 326860 418491 379607 527397 903249 617565
13695 617565 286123 506258 592267 404572 766348 359326 625479 374707 401611 648499
13685 648499 834301 612812 388563 680411 259030 447654 315511 575724 384847 584281
13675 584281 826266 735610 368649 377955 477429 384077 641148 281879 349248 354052 471199
13664 471199 322791 817784 403624 470885 482509 537904 459413 562604 383738 680624
13654 680624 356684 414830 299394 334122 425402 57292 236150 342532 335880 648317 478936
13643 478936 351998 353473 310716 74596 535456 337744 335646 641590 779864 482087 551443
13632 551443 321041 353161 390669 286764 360504 417301 509562 626106 326379 228383 716955
$$ packed form
13705F52305M3858j08728k73764K31733k18544R1631l8884J47790L75852k85684
13695F17565B86123K20135Q6009j87695L61776C59326K66153k50772K6904K46888
13685F48499J85802k21489k24249K91848B59030J88624j32143K60213j90877J99434
13675E84281K41985r0656l66961R306R9474r3352K57071B81879O7369M804J17147
13664D71199j48408M94993D03624O7261J1624N5395p8491J03191j78866K96886
13654F80624l23940N8146j15436L4728R1280E7292J78858J06382o652L12437j69381
13643D78936j26938J475m2757G4596M60860j97712k098L05944J38274k97777O9356
13632E51443k30402L2120L7508j03905P3740N6797R2261J16544k99727r7996M88572
$$ plain form
13621 716955 762701 645687 544777 246552 263545 591473 415620 363326 387780 555350
13611 555350 122424 454899 231369 156795 503595 513101 293330 519036 667138 373966
13601 373966 151248 478503 456677 284396 239548 230300 534955 561413 291817 387072 261093
13590 261093 416114 406823 487969 406804 115138 264785 238588 300220 522236 388008 229582
13579 229582 262805 470966 522076 165522 452603 209585 371559 378908 288998 554582
13569 554582 270888 406231 467569 396089 459795 206287 139444 469097 728158 506217
13559 506217 367818 456101 119142 618749 44820 386066 294445 398801 406182 93724 650218
13548 650218 353214 542013 115829 415862 488023 654257 544948 707043 321041 384989
$$ packed form
13621G16955M5746j17014j00910B46552J6993L27928j75853n2294K4454J67570
13611E55350A22424L32475k23530p4574L46800R506k19771K25706J48102k93172
13601C73966A51248L27255k1826j72281m4848r248L04655K6458k69596R5255j25979
13590B61093J55021r291Q1146q1165A15138J49647k6197O1632K22016j34228j58426
13579B29582L3223K08161N1110A65522K87081B09585J61974P349q9910K65584
13569E54582B70888J35343O1338p1480O3706B06287o6843L29653K59061k21941
13559E06217j38399Q8283A19142M99607D4820L41246r1621J04356P381I3724N56494
13548F50218k97004J88799A15829L00033P2161J66234j09309J62095C21041O3948
$$ plain form
13538 384989 494538 6462 199759 279574 163592 414952 296384 250035 349489 -57124 653153
13526 519941 178546 -146570 171305 139604 222112 361401 97010 353050 90238 281910
13516 281910 105656 290725 75836 307618 282741 545864 139402 390450 525943 53499
13505 258777 -38697 102876 291267 217069 310242 273162 46690 267769 14959 -115915 21597
13493 517581 61917 163103 244062 230388 329627 258642 -16875 523374 137639 363100 271631
13482 271631 438611 120633 255920 45667 496377 114322 203522 6257 314092 105582
13471 435606 298081 271 373767 320471 284022 -18742 211475 425240 429625 558201 294058
13460 294058 -34595 439430 149379 498117 170345 285106 761001 108957 169862 454496
$$ packed form
13538C84989J09549F462J93297P9815j15982K51360j18568m6349R9454e7124F53153
13526E19941A78546a46570A71305l1701Q2508J39289I7010K56040I0238J91672
13516B81910A05656J85069G5836K31782k4877K63123A39402K51048J35493E3499
13505B58777c8697A02876J88391p4198R3173l7080D6690K21079A4959a15915B1597
13493E17581F1917J01186Q0959j3674R9239p0985a6875E23374A37639K25461r1469
13482B71631J66980A20633J35287D5667M50710A14322Q9200F257L07835A05582
13471D35606j37525B71L73496n3296l6449a8742B11475K13765M385J28576k64143
13460B94058c4595D39430A49379L48738A70345J14761M75895A08957O0905K84634
$$ plain form
13450 454496 267330 -136551 222270 174825 -27410 105028 -32915 161785 88783 489257
13440 489257 135228 127375 47479 553265 149149 472799 413991 251657 -9245 183157 222436
13429 222436 38568 -3692 174561 300788 -64437 235222 331311 251812 209585 257241 182884
13418 182884 75865 107693 107573 306316 466265 424814 -142887 442260 -73709 378428 310129
13407 310129 111223 369286 221659 569928 -69924 250184 -49707 -28251 387702 381893
13397 381893 234820 120093 226902 72137 364734 -103354 121748 10803 163405 497524
13387 497524 26795 273974 24161 97403 267267 -217275 427598 148561 442016 383347
13377 383347 170261 -22028 261242 290946 188568 189446 51334 241570 308559 245566 213705
$$ packed form
13450D54496j87166a36551B22270m7445b7410A05028c2915A61785p3002M00474
13440D89257A35228p853D7479N05786A49149L23650n8808j62334i245A83157L9279
13429B22436C8568c692A74561J26227f4437B35222R6089p9499m2227M7656p4357
13418A82884G5865L1828j20J98743J59949m1451a42887D42260g3709C78428o8299
13407C10129A11223K58063j47627L48269f9924B50184d9707K1456C87702n809
13397C81893j47073j14727J06809G2137K92597a03354A21748A0803J52602L34119
13387D97524B6795K47179B4161P3242J69864b17275D27598A48561K93455n8669
13377C83347A70261b2028B61242K9704j02378Q78E1334J90236O6989o2993l1861
$$ plain form
13366 213705 267132 514776 60152 383494 264182 58937 131448 146592 128153 253086 352324
13355 352324 534208 -70901 164546 47830 220147 419598 383812 27448 281978 -4376 14953
13343 272443 349685 177025 348642 -29301 461282 167722 251674 479082 346412 29281
13332 198507 -83709 383375 267069 183220 150277 -58235 -29114 418790 260335 349161 223231
13321 223231 234245 143076 304318 171603 147137 472379 442637 247730 96190 123979 241757
13310 241757 353043 173751 250094 -124561 -173701 474741 -117652 56871 -8536 326850
13299 -55441 110339 159481 185072 21196 110567 380203 120002 150125 341014 -79269 224797
13287 109229 227512 155684 115201 218566 -126889 93970 22658 320771 289909 434923
$$ packed form
13366B13705N3427K47644F0152L23342j19312E8937P2511J5144j8439J24933R9238
13355C52324J81884g0901A64546D7830J72317J99451l5786B7448K54530d376A4953
13343B72443P7242j72660J71617b9301D61282A67722Q3952K27408j32670B9281
13332A98507h3709C83375j16306q3849l2943e8235b9114D18790j58455Q8826j25930
13321B23231J1014r1169J61242j32715k4466L25242k9742j94907I6190K7789J17778
13310B41757J11286A73751P6343a24561m9140D74741a17652E6871h536C26850
13299e5441A10339M9142K5591B1196Q9371K69636A20002L0123J90889g9269B24797
13287A09229J18283p1828m0483J03365a26889I3970B2658K98113l0862J45014
$$ plain form
13277 434923 40082 33387 448553 -8737 -114729 251088 479030 154129 197893 107994 211195
13266 211195 68060 123348 97326 233151 52701 268047 118202 322379 175190 -54214
13255 -196598 190515 640356 -40819 178900 -86777 125083 75929 321871 -242714 12801
13244 222182 97169 -170212 310519 230913 -272052 172785 -158803 93836 -15189 274949
13233 200992 25934 -177968 185998 31493 222429 -76692 93212 245746 -106554 146505
13222 180855 5890 -118866 273521 91947 181059 160765 -144947 203237 -125869 80309 338747
13211 338747 360914 -42062 -22193 232052 6507 135812 275007 189362 -88361 224410 231424
13200 231424 106501 236363 -17194 199308 -87004 69998 79353 177360 131078 -116655 83812
$$ packed form
13277D34923D0082o695M15166h737j05992B51088K27942A54129M3764q9899J03201
13266B11195F8060N5288k6022J35825E2701K15346A18202K04177j47189e4214
13255a96598A90515M49841d0819A78900h6777A25083m9154K45942b42714A2801
13244B22182I7169a70212C10519p9606b72052A72785a58803I3836a5189B74949
13233B00992B5934a77968A85998C1493J90936g6692I3212J52534a06554A46505
13222A80855E890a18866B73521I1947Q9112k0294a44947B03237a25869H0309K58438
13211C38747K2167d2062J9869B32052F507J29305J39195q5645h8361B24410P014
13200B31424A06501J29862a7194A99308h7004F9998R355R8007m6282a16655H3812
$$ plain form
13188 -83815 -154133 201084 -128828 231109 57617 107470 300274 -176598 207217 23654
13177 7351 -149628 105215 178363 259645 -79693 -135502 92667 -83980 64219 308530 -60705
13165 185282 223550 222824 85437 157813 203833 162248 207708 334495 -50142 78695 -19070 208152
13152 128721 -113432 -84004 135002 2226 4888 1292 345150 104317 -168416 151310 -146190
13140 23965 17440 217200 -164292 -200956 150129 -74203 201551 140582 201600 -219849 232916
13128 124410 200808 154864 -62351 385124 178083 111723 -137980 52018 122682 165569 336801
13117 336801 -105782 -33809 392095 -62581 -201780 120819 -26430 -109060 202514 23339
13106 136923 -105724 -123889 225742 -147463 89972 -134859 99479 204282 299802 -77914
$$ packed form
13188h3815p0318B01084a28828B31109E7617M9853J92804a76598B07217B3654
13177G351a49628A05215P3148Q1282g9693n5809I2667h3980F4219K44311f0705
13165A85282L8268p26H5437P2376M6020m1585M5460J26787e0142G8695a9070B08152
13152A28721a13432K9428A35002B226K662A292L43858A04317a68416A51310a46190
13140B3965o525J99760a64292l6664A50129g4203B01551o0969O1018b19849B32916
13128A24410P6398m5944f2351C85124A78083o6360a37980E2018P0664M2887J71232
13117C36801a05782c3809C92095f2581j39199A20819b6430q2630B02514B3339
13106A36923a05724j8165B25742a47463H9972a34859I9479J04803R5520g7914
$$ plain form
13095 -34966 -60913 66636 344345 1050 31781 54877 -113962 -5133 -76175 -33525 245823
13083 198735 162372 436316 -125918 -117176 -227016 132125 49258 -13308 -27507 274652 257072
13072 257072 -127975 -210599 -23363 -206073 300577 343256 -42737 280741 160404 186196
13062 186196 -21387 49269 -207334 198227 239951 253439 108665 -52822 137819 69272 534085
13051 534085 586003 194722 63118 14939 171216 224141 99700 255366 -19200 32258 115937
13040 115937 167476 -100048 -80524 2417 117995 233507 -115515 -173768 252482 153531 296548
13029 296548 61743 108699 47769 37075 142276 -199533 30083 140453 269022 100096
13018 246719 128095 312890 126344 414070 110922 -21115 400869 -77325 -20106 36555
$$ packed form
13095c4966k5947F6636K77709A050L0731K3096a13962e133p1042c3525B45823
13083A98735l6363K73944a25918Q742j09840A32125D9258a3308j4199B74652j7580
13072B57072a27975q2624b3363j82710C00577M2679d2737B80741j20337K5792
13062A86196b1387D9269b07334A98227M1724J3488A08665e2822A37819o8547M64813
13051E34085N1918A94722F3118A4939J56277N2925I9700J55666a9200C2258Q3679
13040A15937N1539a00048J9524B417J15578J15512a15515n8253B52482r8951J43017
13029B96548F1743M6956D7769j0694J05201a99533C0083J10370J28569A00096
13018B46719j18624J84795A26344K87726A10922b1115D00869g7325b0106C6555
$$ plain form
13007 189129 295622 380219 53549 113840 -83509 52250 -104782 171394 72894 -26251 -102053
12996 -102053 194519 -62937 147120 -535842 -100719 63963 -109792 -305236 -86001 4986
12985 97617 62907 237833 -369646 287209 28343 -26529 -191219 -108004 189802 -95004 267249
12973 -241004 254621 188954 84754 123498 -112232 220223 -191823 162433 -63199 306625
12962 10583 125371 67340 163790 93961 8665 343797 16882 -19049 -22948 -315428 -346534
12951 -346534 28437 159224 -117964 -38856 385356 37106 297180 117393 31685 -34973
12940 157701 -33442 130510 -11477 -19565 -140442 301368 87168 205386 172394 62180 299812
12929 299812 157014 -22295 -77986 -14670 217924 -33727 -119306 -184870 -214492 -27475 -141812
$$ packed form
13007A89129J06493Q4597E3549O0291h3509E2250a04782A71394G2894b6251p5802
12996a02053A94519f2937A47120e35842a00719F3963a09792j95444h6001D986
12985I7617l4710J74926c69646B87209B8343b6529j64690Q3215A89802i5004B67249
12973b41004B54621o5667H4754L8744a12232B20223a91823A62433f3199C06625
12962A0583J14788n8031R6450o9829H665L35132A6882a9049l899k92480l1106
12951c46534B8437J30787a17964c8856C85356C7106K60074A17393C1685c4973
12940A57701c3442A30510a1477q088j20877C01368H7168J18218l2992F2180K37632
12929B99812j42798b2295n5691a4670B17924c3727q5579o5564k9622b7475j14337
$$ plain form
12918 -141812 -44872 -102603 84070 -68906 -274170 -117578 -75205 -135045 133413 204282 288956
12907 288956 -2321 -171669 -92476 157007 200989 -271048 38412 38209 82992 18323 -192572
12895 135529 155414 -31355 184666 126326 217807 -125931 -148444 134655 -84385 58474 92321
12884 92321 149909 439704 -33599 117628 -71462 -225566 41255 142754 22490 60594 302297
12873 302297 -22105 210926 -180221 -136474 38545 85751 245976 -8425 -73702 -22709 -34229
12862 -34229 94127 295459 41866 -173446 4251 302757 -129920 -149689 -258370 3133 304347
12851 304347 -175074 348782 233766 250399 259 -43123 -64552 -147498 132210 406022 33439
12839 -102826 127639 156640 59765 212737 -4773 -149742 185837 138219 177793 147793 -12339
$$ packed form
12918a41812d4872n7731H4070f8906k05264a17578M2373n9840A33413P0869Q4674
12907B88956b321j69348P9193A57007M3982b71048C8412k03M4783A8323a92572
12895A35529J9885c1355A84666n8340R1481a25931k2513A34655h4385E8474L3847
12884I2321N7588K89795c3599A17628g1462j54104D1255J01499B2490L8104K41703
12873C02297b2105B10926a80221M3747C8545M7206J60225h425o5277b2709j1520
12862c4229I4127K01332D1866a73446D251K98506a29920j9769j08681C133L01214
12851C04347a75074C48782j15016J6633B59d3123k1429q2946A32210K73812C3439
12839a02826A27639K9001E9765J52972d773j44969A85837m7618L9574l0000a2339
$$ plain form
12827 83927 67863 183474 244748 145526 -51535 219685 -209793 -185026 57024 154 -13837
12815 -83377 153379 -288008 61974 124508 -47386 -6845 -12101 -178054 -8343 32975 337123
12804 337123 -228236 152050 -375328 -142859 263235 14055 297072 295740 35902 -210795
12793 -139000 433608 -271921 -52651 -302731 -158781 -205980 -231892 179885 12596 44227
12783 44227 -66334 61173 -112680 -71806 284541 66666 295033 104432 -72929 88662 506873
12772 506873 20296 -269860 -286059 -15954 221856 220925 -144685 135638 -74748 2603 125685
12761 125685 279648 -71433 -56541 156224 -136370 245291 -169172 136072 112646 -98725
12750 -97059 4986 42735 401074 168069 -144777 244160 206911 -289449 93697 170866 -224246
$$ packed form
12827H3927j6064J15611O1274r9222e1535B19685b09793K4767E7024A54a3837
12815h3377A53379b88008F1974O2534d7386f845n256j65953h343C2975L04148
12804C37123b28236A52050c75328a42859B63235A4055K83017j332C5902b10795
12793a39000D33608b71921e2651k50080J43950m7199k5912A79885A2596L1631
12783D4227f6334F1173a12680M0874B84541F6666K28367A04432g2929H8662M18211
12772E06873B0296b69860j6199a5954B21856r31a44685A35638g4748B603J23082
12761A25685J53963g1433J4892A56224a36370B45291a69172A36072k3426i8725
12750i7059D986L7749L58339A68069a44777B44160l7249b89449I3697P7169b24246
$$ plain form
12738 297302 3991 82395 92745 479852 -14799 152678 19809 119776 -1830 132998 -60555
12726 -222889 -364649 -59786 -23829 -142215 -211904 94451 259409 -9853 -205844 -257302 -55945
12714 550593 -87549 109239 161772 -30955 259747 -103575 155338 390531 -97616 9380 181820
12703 181820 213677 3155 20426 -167763 402377 -66968 -45976 -8858 293314 22504 -237267
12691 253077 -113021 -201708 -303563 -17049 206100 215005 61782 414879 30025 -70380 330948
12679 -86314 252135 -30399 167717 76284 -34334 -191530 135603 173799 -222808 328472
12668 -48604 -135045 423662 -141269 306467 67889 153400 4577 70268 150129 38160 324099
12657 324099 450211 127518 135749 2202 -57165 619149 254008 -35264 135303 -5254 145481
$$ packed form
12738B97302C991P8404J0350L87107a4799A52678A9809R9967a830A32998f0555
12726b22889j41760e9786b3829j18386o9689I4451J64958i853j95991n1458e5945
12714E50593h7549A09239N2533c0955B59747a03575A55338K35193i7616I380J72440
12703A81820L1857C155J7271a67763D02377f6968K0992h858B93314B2504b37267
12691B53077a13021q8687j01855a7049B06100Q905F1782L53097C0025g0380C30948
12679h6314B52135c0399A67717G6284c4334j57196A35603L8196b22808C28472
12668d8604q6441D23662a41269C06467F7889Q5511D577O5691P9861C8160K85939
12657C24099J26112A27518Q231B202e7165F19149B54008c5264A35303e254A45481
$$ plain form
12645 183755 -343284 32877 317154 -120055 5239 -62849 218845 -325248 14813 -74627 293995
12633 192351 468941 205351 373399 187366 48246 240018 279403 290527 397409 54956
12622 469750 350489 -139342 84834 36362 186387 85013 -266087 185945 54150 433478
12612 433478 -40763 136136 -6588 164797 386361 -58597 -213345 27902 70674 514349 96434
12600 125210 -142519 8749 138851 349530 -44879 -74012 -62350 165123 -136194 125077
12589 301679 58084 -126964 161286 335325 -316107 187988 87791 12270 -24667 -125965
12579 -125965 -15035 48621 -41621 141760 -16083 -334026 153530 -132582 -177839 -220914 -68046
12567 216672 -38268 -13584 -110492 -12973 404982 24551 226812 -144100 42541 -122542 -40311
$$ packed form
12645A83755c43284C2877K84277a20055E239f2849B18845c25248A4813g4627B93995
12633A92351K76590B05351J68048j86033D8246J91772L9385J1124J06882E4956
12622D69750j19261a39342H4834C6362J50025H5013b66087A85945E4150L79328
12612D33478d0763A36136f588A64797K21564e8597j54748B7902M2772M43675I6434
12600A25210a42519H749J30102K10679d4879k9133J1662A65123a36194A25077
12589C01679E8084a26964A61286J74039c16107A87988H7791A2270b4667j01298
12579a25965a5035D8621d1621A41760a6083l17943A53530a32582m5257m3075f8046
12567B16672c8268a3584r6908a2973D04982B4551K02261a44100D2541a22542d0311
$$ plain form
12555 257732 364832 -82357 -91966 271262 12123 123319 -14193 -201080 82358 -32967 268114
12543 244574 -154053 301485 -241453 -384754 88284 76758 51633 118128 39310 9137 237116
12532 237116 114556 81259 -103924 322497 -58066 -62973 234044 -75021 -46414 115353 78
12520 -30861 88841 -210393 -117764 29545 295293 484 43440 169453 -142023 172594 -139629
12508 -218845 -32884 -175341 -268132 177367 -165126 129859 232031 205762 -83858 128897
12497 42900 59028 -386639 157401 23944 -153566 -122889 39210 -59334 100268 -67722 -4360
12485 -65316 -127033 -60525 203828 66996 185371 8783 -310888 -89336 73416 188429 18499
12473 182281 -57598 165618 262468 -588821 -74360 -169261 67302 -55713 98239 394043 62586
$$ packed form
12555B57732J07100h2357r609B71262A2123J11196a4193j86887H2358c2967B68114
12543B44574a54053C01485b41453j43301H8284j1526k5125O6495C9310I137K27979
12532B37116A14556l3297a03924C22497e8066m907B34044g5021K8607A15353G8
12520c0861H8841b10393R2629B9545K65748D84M2956J26013a42023A72594a39629
12508b18845c2884j42457r2791A77367a65126A29859J02172k6269h3858A28897
12497D2900J6128c86639A57401B3944a53566L0677C9210e9334A00268f7722d360
12485f5316o1717f0525B03828F6996J18375H783c10888h9336G3416J15013A8499
12473A82281e7598A65618R6850e88821g4360r4901F7302e5713I8239K95804F2586
$$ plain form
12461 62066 -334471 245581 -314080 -289100 165917 -307674 113695 -196784 -268758 55052
12450 -215370 363742 129656 -241784 193122 194057 -47211 283459 342353 -145588 -22784 -108669
12439 -108669 7714 -285917 -7870 -139873 230289 -170956 -30663 506094 167456 216474 183665
12428 183665 -67253 -304043 -51048 46002 92178 79044 -362620 -28580 124737 -397734 -363837
12417 -363837 145633 197743 -70540 201810 -19066 195602 -8975 -106662 -390669 134804 255911
12406 255911 -26647 -97281 -109396 319714 -174442 33631 4782 148973 92417 147250 28939
12394 -120770 -135389 -35126 57413 70151 216593 4440 -144317 -133739 126775 82953 98380
12383 98380 -172977 131265 -10644 -207259 -47562 -105934 43344 92205 -112772 179664 -251165
$$ packed form
12461F2066c34471B45581c14080K4980A65917c07674A13695a96784p1974E5052
12450b15370C63742A29656b41784A93122R35d7211B83459N8894a45588b2784q5885
12439a08669G714b85917g870j32003B30289a70956c0663E06094A67456M9018l2809
12428A83665f7253k36790e1048D6002M6176j3134c62620b8580A24737c97734L3897
12417c63837A45633N2110g0540B01810a9066A95602h975r7687k84007A34804J21107
12406B55911b6647p0634j2115C19714a74442C3631D782J44191n6556N4833B8939
12394a20770j4619c5126E7413J2738J46442D440a44317J0578A26775m3822J5427
12383I8380a72977A31265a0644j96615d7562n8372D3344M8861a12772A79664b51165
$$ plain form
12371 56659 -49278 87783 -25364 79766 138021 -201896 143675 128605 -272394 -83031 18341
12359 -211236 -187369 -204516 -187982 -146030 -109777 -159107 98085 121039 -461243 154951 73082
12347 -24580 -4679 150611 -51226 49637 -42774 22403 60423 110089 161182 -37312 36252 155582
12335 155582 -88541 -192591 -105986 -162074 -30413 78247 -83506 -200822 137963 -68585 -153888
12324 -153888 85413 26313 129955 -218138 206105 -66387 210903 80386 -92961 51017 -292530
12312 -35210 179846 15346 -91355 -50391 -202874 135089 12721 -48084 -95385 116778 46766
12300 112321 -94184 -47800 -82775 258655 200206 -179551 -50673 -140074 88022 3572 46775
12289 46775 272613 135558 -292998 -73967 199384 -32609 566 294431 -44228 290746 117817
$$ packed form
12371E6659d9278H7783b5364G9766N8255b01896A43675j5070b72394h3031A8341
12359b11236K3867j7147J6534M1952L6253m9330I8085K2954d61243A54951G3082
12347b4580d679A50611e1226D9637d2774B2403L8020M9666N1093c7312C6252J19330
12335A55582h8541j04050Q6605n6088c0413G8247h3506j17316A37963f8585q5303
12324a53888H5413B6313J03642b18138B06105f6387B10903H0386i2961E1017b92530
12312c5210A79846A5346i1355M0964j52483A35089A2721d8084m7301A16778D6766
12300A12321i4184M6384l4975B58655n8449a79551e0673q9401H8022C572M3203
12289D6775K25838A35558b92998g3967A99384c2609E66K93865d4228B90746A17817
$$ plain form
12277 81589 218648 -283751 179605 377527 84447 21462 -189022 74356 -30347 -6018 -67770
12266 -67770 21076 284436 267260 307063 -117864 -32407 153458 -128673 26567 204202 203180
12255 203180 -55525 59565 62032 -43147 -87958 -14992 -28459 51160 217334 -105960 315803
12243 -57809 215428 100305 -142674 124027 -173912 93902 97368 178753 96652 81998 100717
12232 100717 -194793 356971 152146 194086 314687 121179 214616 295567 -24677 2754 216595
12221 216595 238457 145511 229967 32839 175972 73359 675870 332827 51928 -123262 -7131
12209 -80630 61811 246800 67471 129607 3278 57215 -1027 293568 -22920 373066 95431
12197 342187 226581 288467 302741 165185 260100 215965 422183 399329 425638 194807 -270721
$$ packed form
12277H1589J37059b83751A79605J97922H4447B1462a89022G4356c0347f018o1752
12266f7770B1076K63360j7176L9803a17864c2407A53458a28673B6567J77635j022
12255B03180e5525E9565K467d3147m4811a4992j3467E1160J66174a05960C15803
12243e7809B15428A00305a42674A24027a73912I3902L466Q1385q2101j4654J8719
12232A00717a94793C56971A52146M1940J20601A21179R3437Q0951b4677B754K13841
12221B16595K1862r2946Q4456C2839J43133G3359O02511C32827E1928a23262g131
12209h0630F1811J84989F7471O2136C278N3937a027B93568b2920C73066I5431
12197C42187j15606O1886J4274j37556R4915m4135K06218k2854K6309A94807b70721
$$ plain form
12185 -30101 330903 466762 -252515 38302 -151338 30907 -111789 -246237 -52868 -58558 133290
12173 136653 192092 136358 10591 144759 1610 130245 270735 233763 162731 -101401 -65179
12162 -65179 144799 -278042 182411 -20043 221324 -220037 92831 -107483 40207 -145994
12151 -2505 -243557 -28906 76669 13358 6549 -272158 17891 -54662 -123801 -40224 -61078 -4580
12138 -72420 61452 347854 313639 -94011 -126776 66430 -71510 141856 -68197 213232 224103
12127 224103 120031 -75928 147944 15485 189680 18968 397769 -91670 27278 -218671
12116 -74991 -280826 -89726 -162008 196466 74311 162928 5264 175002 -83396 1071 -75567
12104 239170 -30154 -8915 108847 -70185 -138462 -44339 -310469 -223381 -60245 204415 -242674
$$ packed form
12185c0101C30903J35859b52515C8302a51338C0907a11789j34448e2868n690A33290
12173A36653N5439n5734A0591J34168A610J28635J40490l6972p1032a01401L6222
12162f5179A44799b78042A82411b0043B21324b20037I2831a07483D0207a45994
12151b505k41052b8906G6669A3358F549b72158A7891e4662o9139d0224k0854d580
12138g2420F1452K86402l4215i4011l2765F6430g1510A41856f8197B13232J0871
12127B24103j04072g5928A47944A5485J74195A8968L78801i1670B7278b18671
12116g4991k05835h9726p2282A96466G4311Q8617E264J69738h3396A071g5567
12104B39170c0154h915A08847g0185o8277d4339k66130Q7088f0245B04415b42674
$$ plain form
12092 238148 178069 24513 224537 103835 -150920 130952 -24998 61316 161995 -159900
12081 153214 36191 -279300 27374 -62141 68661 -111079 182166 900943 1625452 11162
12070 84518 -134066 -83891 145835 -80279 190595 -39918 -228666 -272152 306147 -59965 184093
12058 -117535 28501 -229582 12955 80736 183325 67188 75614 -53698 -224387 -170291 -44737
12046 209875 -22682 -290184 -171343 100539 50060 -173443 -5783 123996 -266514 73991
12035 -157788 150229 -258875 32475 448291 -264185 56021 87878 -101095 87671 -311782
12024 -300335 254256 -125041 197133 -170034 150555 -177859 -116642 23021 -112888 129430
12013 -52255 -85626 213901 -71411 188030 -63486 -91225 256761 97155 -17450 95195 256739
$$ packed form
12092B38148o0079B4513K00024A03835a50920A30952b4998F1316J00679a59900
12081A53214C6191b79300B7374f2141F8661a11079A82166P18777P24509A1162
12070H4518a34066N0175A45835h0279A90595c9918j88748m3486C06147e9965A84093
12058a17535B8501b29582A2955O7781J02589F7188Q426e3698j70689N4096d4737
12046B09875b2682k67502J18841A00539E0060a73443e783A23996b66514G3991
12035a57788A50229b58875C2475M15816b64185E6021L1857a01095H7671c11782
12024c00335B54256a25041A97133a70034A50555a77859O1217B3021a12888A29430
12013e2255l3371B13901g1411A88030f3486k7739B56761I7155a7450I5195J61544
$$ plain form
12002 256739 101352 -80005 142357 -227006 -134346 50179 -30374 177035 -53320 97342 53635
11991 53635 -194646 165464 -12991 -93957 -160464 -21235 71306 -31704 -116989 -73567 -107302
11980 -107302 158499 -39528 144676 -63349 -21828 -239777 56121 -31018 70752 -255950 154862
11968 -47958 -370564 65994 -334070 -77512 -34204 -271204 -178114 56371 50377 118653 -162227
11956 -307062 -137746 -126663 58611 -228980 -288549 -266584 239268 -40807 -156970 -193959 -118884
11945 -118884 -34832 91905 17997 254656 -34186 85691 144769 -178269 -66196 -155257 7627
11933 -55375 72516 -195400 -38043 138910 96829 -83574 196964 -39226 -23778 -72206 -93888
11922 -93888 299869 165840 -268971 -73400 -120001 -251769 14846 -17754 -225858 -10946 -83847
$$ packed form
12002B56739A01352h0005A42357b27006R2660E0179c0374A77035e3320I7342m3707
11991E3635a94646A65464a2991q0966o6507b1235G1306c1704q5285M3422l3735
11980a07302A58499c9528A44676f3349b1828k17949E6121c1018G0752b55950A54862
11968d7958l22606F5994c34070g7512c4204k37000R3090E6371n994O8276a62227
11956c07062a37746J1083E8611b28980n9569K1965B39268d0807j16163l6989P5075
11945a18884c4832I1905A7997K36659c4186H5691N9078a78269f6196q9061G627
11933e5375G2516a95400c8043A38910m2081h3574A96964c9226J5448m8428k1682
11922i3888B99869j34029b68971g3400m6601j31768A4846a7754k08104a0946p2901
$$ plain form
11911 -83847 -249729 36555 209759 -45884 -173496 -184812 -30328 -202955 250949 79415 63132
11900 63132 31609 21085 -207699 -90373 -95470 -346488 147213 -211103 -221011 91806 8394
11888 -62728 87490 -47263 129829 93593 -165537 178439 285967 -139958 -173518 -145296 -246249
11877 -246249 105797 -6332 52914 257369 -34723 -15782 30022 67729 96252 71347 153141
11866 153141 -52525 175133 -119740 -381707 -152326 -167886 -245127 121503 313885 23498
11855 -137955 100159 123399 -155652 215722 -243668 -83280 33914 -203158 -175012 87356
11844 -253087 -66124 -25784 103139 -339279 76831 -105645 51876 175636 40377 -207893
11833 -98172 -130784 41027 -100317 50997 -7802 351495 99022 71788 -84064 -131097 217307
$$ packed form
11911h3847j65882C6555J73204d5884j27612j1316c0328j72627B50949G9415j6283
11900F3132l1523j0524b07699i0373n097k51018A47213b11103r908I1806H394
11888f2728H7490d7263A29829l6236a65537A78439J07528a39958l3560K8222j00953
11877b46249A05797f332E2914K04455c4723a5782C0022L7707K8523k4905Q1794
11866A53141e2525A75133a19740k61967a52326j5560p7241A21503J92382B3498
11855a37955A00159K3240a55652B15722b43668h3280C3914b03158K8146H7356
11844b53087f6124b5784A03139c39279G6831a05645E1876J23760D0377b07893
11833i8172l2612D1027a00317E0997g802C51495I9022k7234h4064m7033B17307
$$ plain form
11821 -362005 37106 69676 120869 -68514 209582 -175574 -91050 61320 -204402 111368 -132119
11809 -133086 106458 88091 16289 116504 294782 221559 161122 -186786 41934 -73232 20419
11797 51804 -242805 169391 155459 -36943 -641 -119888 -25873 -99821 148364 431856 33367
11785 320438 -165730 -177039 67399 -215011 -254847 -92036 12677 121715 353790 142062
11774 195983 -59459 163888 -278351 145519 -110974 24710 -170691 -184123 -287196 -291285
11764 -291285 60782 64107 -155956 -110474 281661 123422 -157084 -65916 -174453 50088 -289201
11752 -265706 -28674 69445 -124931 134631 -247918 -230849 -457302 143224 111857 111396 -174673
11740 -153442 8967 79605 370983 59738 101894 -247896 30900 39938 349266 60964 -32098
$$ packed form
11821c62005C7106L2570N1193f8514B09582a75574Q4524F1320b04402A11368a32119
11809a33086A06458j8367A6289J00215J78278p3223o0437a86786D1934g3232B0419
11797E1804b42805A69391j3932c6943f41j19247b5873p3948A48364K83492C3367
11785C20438a65730j1309F7399b15011l9836i2036A2677J09038K32075A42062
11774A95983e9459A63888b78351A45519a10974B4710a70691j3432j03073m089
11764b91285F0782L325a55956M5482B81661A23422a57084f5916j08537E0088b89201
11752b65706b8674F9445a24931A34631b47918J7069k26453A43224l1367m61a74673
11740a53442H967P0638K91378E9738M2156b47896C0900R038L09328F0964c2098
$$ plain form
11728 109784 -181178 204345 50715 45588 29218 91126 -6408 -70384 131198 26717 -116061
11716 107857 99388 -55293 -28117 115902 56461 -18391 -39556 228621 -266998 -40365 126879
11704 48942 126995 -66290 -77583 -33716 7664 -46159 -73777 362701 -206876 16557 8471 161191
11692 161191 -54858 164804 114284 112772 8907 -29163 52332 40255 -179218 406257 -94418
11680 11603 463639 317108 60192 356602 10575 -266307 -62366 -134913 136713 157214 265376
11669 265376 -191343 -38541 120193 22080 57183 -354056 41587 34108 66311 3396 -27044
11657 -245831 -174950 -268586 95416 267035 8914 103984 137921 106307 205163 -76595 -302070
11646 -302070 111692 134111 50 -51828 31203 14093 80169 261659 78823 -326284 -6328 102604
$$ packed form
11728A09784a81178B04345E0715n127j6370O1908f408o3976A31198B6717a16061
11716A07857q469e5293K7176A15902E6461a8391k1165B28621b66998d0365A26879
11704D8942P8053f6290j1293c3716G664d6159k7618C62701b06876A6557q086J52720
11692A61191e4858A64804n0520j512H907b9163E2332j2077a79218D06257i4418
11680A1603M52036j46531F0192K96410A0575b66307f2366p2547A36713K0501J08162
11669B65376a91343c8541A20193B2080L5103c54056D1587p479L2203C396b7044
11657b45831P0881r3636I5416J71619H914R5070L3937l1614R8856g6595k25475
11646c02070A11692K2419E0e1828C1203A4093O6076J81490G8823c26284f328A02604
$$ plain form
11633 270650 -99351 -215590 -53173 -31857 328585 60091 98200 370703 -274834 3155 104418
11622 104418 148249 165072 -213882 -148827 45879 -217249 -59784 56554 277100 -173319 -111099
11611 -111099 182288 -60107 5158 -296563 -208031 -511403 -34819 319806 -26512 -84701 157271
11599 364245 -375467 -208934 -72415 160462 107551 154686 -87471 191356 192236 131902 -129064
11587 151639 -57454 -66661 101339 -57921 10363 -88241 67896 47519 159171 288647 134609
11575 130131 248886 134172 -45638 -151471 -19708 -181306 105548 -3101 183003 130996
11565 130996 -310159 99091 -47830 261311 125601 -125009 77057 152478 237573 -144537
11554 214366 110542 170084 210193 104749 -94628 -163506 54717 -177388 29287 265988 -74946
$$ packed form
11633B70650i9351j16239e3173K1316C28585F0091L8109K72503b74834C155J01263
11622A04418M3831J6823b13882O5055D5879b17249e9784E6554K20546a73319O2220
11611a11099A82288f0107E158b96563Q8532l03372c4819C19806b6512n8189A57271
11599C64245c75467J66533g2415A60462n2911M7135h7471A91356Q80o0334a29064
11587A51639e7454r207A01339e7921A0363h8241F7896k0377J11652J29476A34609
11575A30131J18755j14714d5638j05833a9708j61598A05548c101A83003n2007
11565A30996c10159I9091d7830B61311A25601a25009G7057P5421Q5095a44537
11554B14366j03824N9542M0109A04749i4628o8878E4717a77388B9287K36701g4946
$$ plain form
11542 53109 -121666 345836 64991 189537 229329 272386 10000 -99947 -252147 -140701 -229346
11531 -229346 -169373 -4039 27042 -62338 16737 52373 -73252 130025 196427 -88956 -68757
11520 -68757 -127103 482267 -66948 275407 71426 478538 138408 111685 298083 -65789 -110774
11509 -110774 188191 253167 227658 160762 594725 398910 51779 -117253 -112334 -32056 386181
11497 94752 415988 40654 539991 101457 245744 -41171 -163336 -2519 -51086 398917 358156
11486 358156 249636 258301 164517 162807 252484 -313466 230516 -188504 237769 134567 371258
11475 371258 121148 181379 18607 337722 77932 101084 119056 326581 162634 54749 -149946
11463 279580 -44922 -161656 -53923 337693 34057 40337 -256962 -65690 -1815 69887 -5209
$$ packed form
11542E3109a21666C45836F4991J24546L9792M3057A0000i9947j52200J11446q8645
11531b29346N9973d039B7042f2338A6737L5636g3252A30025O6402h8956K0199
11520f8757n8346D82267f6948B75407G1426M07112A38408k6723J86398f5789m4985
11509a10774A88191O4976k5509o6896M33963j95815E1779a17253M919c2056C86181
11497I4752L21236D0654M99337A01457J44287d1171j22165b519m8567C98917m0761
11486C58156j08520Q665r3784j710Q9677c13466B30516a88504B37769j03202K36691
11475C71258A21148O0231A8607L19115G7932K3152J7972K07525A62634E4749a49946
11463B79580d4922j16734e3923C37693C4057O280b56962f5690a815F9887e209
$$ plain form
11451 -20238 -149951 -104975 227466 227938 60599 235559 242535 -242054 192020 71493 378520
11440 378520 98811 392314 31483 -2543 194108 62705 -77187 -113962 473553 -89147 -46784
11429 -46784 277455 368341 -109659 12774 -202224 -715125 12321 232626 -54258 77580 -26899
11417 12860 -38458 85766 -115551 239128 -256953 -230728 126274 64811 70123 40389 74090
11406 74090 168543 175528 18234 53023 280108 207938 44361 26294 400420 -73276 57991
11394 -162175 -54328 44961 -10815 -80442 117004 82973 -6647 -150223 115719 -10645 2550
11382 -294057 66324 155824 34272 -209584 -305798 220407 7759 289460 -132623 -6766 105632
11370 -139499 -44872 -200763 -98822 -205456 -1621 -193387 -265505 104332 -36433 23506 -316568
$$ packed form
11451b0238j29713M4976B27466M72F0599J74960O976b42054A92020G1493L07027
11440C78520I8811K93503C1483b543A94108F2705g7187l6775D73553h9147M2363
11429d6784B77455R0886a09659A2774b02224n12901A2321K20305e4258G7580b6899
11417A2860c8458H5766a15551B39128b56953K6225A26274o1463N312k9734L3701
11406G4090R4453O985A8234L4789K27085p2170D4361j8067L74126g3276E7991
11394a62175e4328D4961a0815o9627A17004l4031f647j43576A15719a0645B550
11382b94057F6324Q9500C4272b09584r6214B20407G759K81701a32623f766A05632
11370a39499d4872j55891i8822j06634a621j91766p2118A04332c6433B3506c16568
$$ plain form
11358 8180 34166 -275864 -188771 -108929 95688 -129963 258097 245260 19189 -1532 110222
11346 -232566 158494 162287 -194339 73913 84537 -111356 162295 -111031 -19081 -200280
11336 -200280 40011 258338 -154959 -63648 -266561 -39207 -74219 151316 177452 19773 66747
11325 66747 292335 -103144 39859 -29192 80831 196151 26434 25838 256100 -70480 -232354
11314 -232354 -13699 -121629 101836 -319041 -95064 67119 -41789 -30980 334768 -99474 233433
11302 -124642 -70672 -100762 -81415 74483 -108775 168408 -193915 -220884 146870 43699 -16017
11290 -110140 -88230 89157 -263339 -19337 173606 -60942 -457652 -248951 -70530 -224926
11280 -224926 25986 251201 -467595 -109341 -111015 -120123 -186871 -89967 -200987 83952 58386
$$ packed form
11358H180K5986b75864Q7093P9842I5688a29963B58097j2837A9189a532A10222
11346b32566A58494L793a94339G3913J0624a11356A62295a11031a9081j81199
11336b00280D0011K18327a54959f3648k02913c9207l5012A51316K6136A9773M6974
11325F6747K25588a03144C9859b9192H0831J15320B6434n96K30262g0480j61874
11314b32354a3699j07930A01836c19041i5064F7119d1789J0809C34768i9474B33433
11302a24642N3970l0090J9347G4483a08775A68408a93915k6969A46870D3699a6017
11290a10140K1910H9157b63339a9337A73606f0942l96710K08701g0530j54396
11280b24926B5986K25215d67595a09341j674r108o6748h9967j11020H3952k5566
$$ plain form
11269 58386 -205171 -33350 -409479 118971 -531231 311776 17311 148467 8839 107416 -102505
11257 197366 68496 -221581 -25744 -159373 63615 -39393 126167 74111 -76675 -106370 -308839
11246 -308839 -419330 121103 -42784 -78705 95694 -50512 -132342 -191138 103538 287130 6114
11234 25275 76680 -236338 384133 284618 -312947 -196836 116378 60703 24656 327071
11224 327071 -200180 -317203 91624 -193975 -154704 197278 -262148 -99776 201187 174679
11214 174679 -45696 -289879 -150882 206685 165599 -208549 -51461 156907 225174 51685
11203 -318966 340468 192588 -292942 -4262 219916 -134217 -412980 -78936 194359 204660
11193 204660 182292 156496 -206710 65392 -86763 212832 -10741 173724 33937 -69311 40497
$$ packed form
11269E8386b05171c3350l76129A18971e31231C11776A7311J31156H839R8577a02505
11257A97366F8496b21581b5744j33629F3615c9393A26167n2056g6675k9695k02469
11246c08839j10491A21103d2784l5921I5694e0512q1830n8796A03538J83592F114
11234B5275N1405b36338C84133r9515c12947J16111A16378n5675B4656L02415
11224C27071b00180j17023I1624a93975L9271A97278b62148i9776B01187k6508
11214A74679d5696k44183J38997B06685m1086b08549e1461A56907O8267E1685
11203c18966C40468j47880b92942d262B19916a34217k78763g8936A94359J0301
11193B04660k2368k5796b06710F5392h6763B12832a0741A73724C3937f9311D0497
$$ plain form
11181 322236 -35526 -45081 238666 -38763 35268 -48675 -71037 3934 -98107 -153777 -53020 -112525
11169 -112525 -159362 211984 -903 26072 48640 8016 -92953 -186353 9912 -274903 -15395 -5911
11156 -3230 27041 27653 -88166 -155889 -121920 -129329 -60579 124429 -84497 -231053 134224 217485
11144 217485 -96607 -229376 -81548 -662473 -39776 -19058 143494 -37114 169120 -111356
11133 122816 116681 36780 194702 -255003 73932 193537 -124857 63216 143786 49142 64595
11122 64595 -139230 -87914 -194874 25366 126931 209325 62421 15434 93745 -1006 -73377
11111 -73377 -74464 -154911 459846 401577 15650 86369 -134149 186781 166872 457172 478836
11100 478836 -92610 51474 287513 -870 269023 244483 148700 -59819 239073 119313 234576
$$ packed form
11181C22236c5526r555B38666c8763C5268d8675k2362C934i8107n5670e3020n9505
11169a12525m6837B11984i03B6072K2568H016i2953r3400I912b74903a5395e911
11156c230B7041O12h8166o7723L3969p409f0579A24429h4497j46556A34224Q3261
11144B17485i6607j32769h1548n80925c9776a9058A43494c7114A69120a11356
11133A22816o135C6780J57922b55003G3932J19605a24857F3216Q0570D9142J5453
11122F4595a39230N1316j06960B5366J01565Q2394F2421A5434P8311a006p2371
11111g3377j087q0447D59846n8269A5650P0719a34149A86781j9909K90300K1664
11100D78836i2610E1474K36039h70B69023k4540r5783e9819B39073A19313J15263
$$ plain form
11089 234576 -15558 364268 248392 573038 65457 217154 245599 286885 219119 182087 404820
11078 404820 422063 2387 10267 127937 290116 194464 542399 667080 526806 578561 418265
11067 418265 497956 477711 206982 719378 252275 448632 210757 525786 437020 664333
11057 664333 679420 614241 678472 383958 450103 734249 608243 577996 568571 797371 932554
11046 932554 750146 943807 626084 834299 615329 829316 771313 875306 731198 871295
11036 871295 1036653 859590 966888 668443 745503 587284 739316 947994 779177 1024803
11026 1024803 717731 832511 633443 874764 521019 788130 443527 653569 676395 727762
11016 727762 585435 825454 497348 794761 754564 522836 795136 645734 682227 528616
$$ packed form
11089B34576a5558C64268j15876L24646F5457J51697K8445M1286o7766l7032K22733
11078D04820J7243B387P880J17670J62179r5652L47935J24681j40274N1755j60296
11067D18265P9691k0245B06982N12396B52275J96357B10757L15029q8766K27313
11057F64333J5087o5179O4231k94514O6145K84146j26006l0247r425K28800J35183
11046I32554j82408J93661l17723K08215k18970K13987n8003J03993j44108J40097
11036H71295J65358j77063J07298k98445P7060j58219J52032K08678j68817K45626
11026A024803l07072J14780j99068K41321l53745K67111l44603K10042K2826N1367
11016G27762j42327K40019l28106K97413m0197k31728K72300j49402L6493j53611
$$ plain form
11006 528616 662940 613705 397028 480032 597347 545798 378894 535419 741152 486888
10996 486888 648449 700638 846664 939559 465735 666561 825732 786026 866315 683653
10986 683653 903345 866970 945450 965485 1217616 1019528 1155621 1354566 1845656 1605117
10976 1605117 2001819 2546483 2633955 2603468 2943649 3037269 2641057 2869611 2324608 2277896
10966 2277896 1760201 1443883 1291275 1654655 1689020 1843573 1954228 1828382 1406083 1464978
10956 1464978 1748802 1365453 1119452 1246940 626408 283555 578595 402423 644248
10947 644248 303532 171781 68853 -10768 77694 256245 307730 356454 339782 58446 -54919
10935 221911 -802 557057 1428 221900 72365 365428 120428 137572 -252690 76895 -85478
$$ packed form
11006E28616J34324m9235k16677Q3004J17315n1549j66904J56525K05733k54264
10996D86888J61561N2189J46026R2895D65735K00826J59171l9706Q0289j82662
10986F83653K19692l6375P8480K0035K52131j98088J36093J98945M91090k40539
10976A605117L96702N44664Q7472l0487L40181R3620l96212K28554n45003m6712
10966B277896n17695l16318j52608L63380L4365J54553J10655j25846m22299N8895
10956A464978K83824l83349k46001J27488o20532B83555K95040j76172K41825
10947F44248C03532j31751F8853a0768G7694J78551N1485M8724j6672E8446e4919
10935B21911h02E57057A428K20472G2365K93063A20428J7144b52690G6895h5478
$$ plain form
10923 137 320435 6234 -38623 -228369 47550 38910 424313 -30542 36172 25777 130187 -267286
10910 -148533 -260685 -70192 9720 -22444 92769 275091 160373 87533 124452 -79118 55862
10898 95247 130147 350468 -148120 305758 -57880 135779 -89927 508990 156181 -144930
10887 -95376 140027 115841 115952 451925 117416 -247669 126819 57817 214435 70867 -56597
10875 -165398 143323 -55194 180932 53490 69462 -35998 21186 329736 66889 -4578 -192610
10864 -192610 28817 96046 -359606 18598 -192866 51331 126803 379866 65482 -93765 139892
10852 34691 -146790 275452 -96598 -303039 -100347 -200997 -104961 -67239 228019 190847
10842 190847 -109695 136578 111012 -84700 -219017 86270 248959 -179840 288822 -73463
$$ packed form
10923A37L20298F234c8623j89746D7550q640L85403c0542C6172j0395J04410b67286
10910a48533j12152g0192I720b2444I2769J82322j14718p2840L6919g9118E5862
10898I5247L4900K20321a48120C05758e7880A35779h9927E08990A56181a44930
10887i5376A40027k4186J11L35973A17416b47669A26819E7817J56618G0867e6597
10875a65398A43323e5194A80932E3490J5972c5998B1186L08550F6889d578j88032
10864a92610B8817O7229c59606A8598a92866E1331P5472K53063F5482i3765A39892
10852C4691a46790B75452i6598k06441a00347j00650R6036L7722B28019l7172
10842A90847a09695A36578k5566h4700j34317H6270J62689a79840B88822g3463
$$ plain form
10831 -306964 10669 66205 -53372 166933 -232011 112483 -29310 -226829 -241398 -154864 -163087
10820 -163087 63157 17680 -140146 -265212 -324875 -161087 -102813 90603 178476 35763 -19968
10808 13316 101728 -37839 82399 -215207 -56794 -318829 -158255 -2725 -56894 89420 -233991
10796 17911 -113494 -111878 -58900 -62080 -20439 -100081 -239099 -106279 -207212 180992 82913
10784 -298335 180002 46810 -35158 156457 -292636 -161392 -81996 32187 -25027 -167656
10774 -167656 -279588 183410 -11698 91957 190232 -114092 37395 238993 -331336 48379
10763 191251 145543 -158522 -80725 -223617 -18226 -314642 219723 -158974 106193 328369
10753 328369 29763 -233928 -243878 -395505 -50528 116436 98550 -109613 64649 -190162 99297
$$ packed form
10831c06964A0669N5536e3372A66933b32011A12483b9310j97519j4569Q6534q223
10820a63087F3157A7680a40146j25066n9663a61087N8274I0603Q7873C5763a9968
10808A3316Q8412c7839H2399b15207e6794k62035a58255b725n4169H9420b33991
10796A7911a13494J616N2978l180b0439p9642j39018a06279j00933A80992H2913
10784b98335A80002D6810c5158A56457b92636J31244P9396C2187b5027j42629
10774a67656j11932A83410a1698I1957R8275a14092C7395K01598c31336D8379
10763A91251m5708a58522P7797j42892a8226k96416B19723a58974A06193K22176
10753C28369B9763b33928r950j51627e0528A16436j7886a09613F4649a90162I9297
$$ plain form
10741 -6642 -213639 -121604 -129080 -194501 286534 567 -106922 -252047 -25410 11157 -272632
10729 -134002 -278595 356468 158535 -23334 -177486 108331 83627 47385 51060 43662 -163624
10717 -160763 128335 -146772 159995 -32116 182645 86345 131096 37029 52021 -114578
10706 9100 -65552 -171217 -164945 -111027 302427 -194002 -100685 -61707 39121 108669 -93472
10694 -403289 6504 -174524 15347 171713 -112147 -181008 -264204 -88485 3175 7785 -150695
10682 184221 291294 -344535 -86469 149593 104641 56426 -286723 -91561 70400 -50746 99091
10670 124686 25914 -69477 -26577 -213928 -18990 -169133 83821 -258797 -301609 167073 153850
10659 153850 -136494 -319787 -179142 58988 -77033 -163936 127918 -17182 -109744 -170242 56099
$$ packed form
10741f642k06997R2035p476o5421B86534E67a06922j45125b5410A1157b72632
10729a34002j44593C56468A58535b3334j54152A08331k4704l6242L675p398a63624
10717a60763A28335a46772A59995c2116A82645H6345M4751C7029J4992a14578
10706I100f5552j05665O272N3918C02427a94002R3317L8978C9121O9548i3472
10694d03289F504a74524A5347J56366a12147o8861q3196h8485C175M610a50695
10682A84221J07073c44535h6469A49593m4952m8215b86723i1561G0400e0746I9091
10670A24686B5914f9477b6577j87351a8990j50143H3821b58797m2812A67073j3223
10659A53850a36494j83293J40645E8988g7033q6903A27918a7182r2562o0498E6099
$$ plain form
10647 543 -56048 -348042 -105160 25212 285483 -272537 -327694 -133554 -273173 -112831 203594
10635 -126787 152147 366262 -218194 152721 -65871 280331 17968 111266 145704 -181788
10624 -2923 -227911 -96768 -194342 144347 -146446 19565 -255706 -78228 -313839 -60946 77194
10612 -184299 30765 -564 -122749 165844 26494 125364 -292493 71425 -131088 -16429 -277411
10601 -277411 154577 240654 -29182 -403020 -20338 372933 -105102 -143723 50464 -180147
10590 -312259 -157526 -297534 -349493 82620 -197353 162163 -40837 -133707 -191261 63869 -48058
10578 -98095 -239532 20967 86160 -38190 132766 -96799 -37655 405538 -283921 -137831 -86466
10567 -86466 -364446 342575 -101702 104349 -293509 122847 132375 52384 -178433 -184372 62457
$$ packed form
10647E43e6048k91994a05160B5212K60271b72537n5157a33554j39619a12831B03594
10635a26787A52147K14115b18194A52721f5871B80331A7968R3298L4438a81788
10624b923k24988i6768r7574A44347a46446A9565b55706g8228k35611f0946G7194
10612a84299C0765e64j22185A65844B6494R8870b92493G1425a31088a6429k60982
10601b77411A54577Q6077b9182l73838b0338C72933a05102l8621E0464a80147
10590c12259J54733j40008n1959H2620a97353A62163d0837r2870n7554F3869d8058
10578i8095j41437B0967O5193c8190A32766i6799c7655D05538b83921a37831N1365
10567h6466k77980C42575a01702A04349b93509A22847R528E2384a78433n939F2457
$$ plain form
10555 -357583 -218 -91954 49684 -142235 199472 73276 88699 11293 76058 -30350 7977 -129636
10542 305490 131935 -68597 -251795 76354 -16700 -17865 -56721 49634 -218568 -62685 -45705
10531 -45705 103522 -301152 119225 -37241 -244185 194238 -364895 -91259 -257027 -157870
10521 -157870 -151433 -255699 -26897 253447 -217846 167027 -227081 59054 140669 67691 -13622
10509 -167338 91748 93699 98646 7132 -164921 -369931 -46123 -107743 -98150 -69593 106962 14844
10496 -82448 13170 9716 148532 -34089 23589 -101216 -96134 27638 129536 -72380 367756
10484 362248 430475 534800 353828 154917 305956 243997 273656 100803 71267 15246
10473 -37788 56114 -42846 -111102 7572 124654 106795 90702 -155855 -102757 -197447 75615
$$ packed form
10555c57583b18r1736D9684a42235A99472G3276J5423A1293O4765c0350G977a29636
10542C05490A31935f8597j83198G6354a6700j165l8856D9634b18568f2685J6980
10531d5705A03522c01152A19225c7241k06944A94238c64895i1259j65768R9157
10521a57870O437j04266b6897B53447b17846A67027b27081E9054Q1615F7691a3622
10509a67338I1748J951M947G132a64921k05010d6123o1620R593K8557A06962A4844
10496h2448A3170l454J38816c4089B3589a01216N082B7638J01898g2380C67756
10484C62248O8227J04325j80972A54917J51039o1959K9659A00803k9536A5246
10473c7788E6114d2846o8256G572J17082j7859j6093a55855N3098r4690G5615
$$ plain form
10461 -202974 -40796 149185 -344943 -181568 180162 -182852 151568 -19259 -177194 -187304
10451 -187304 207878 -81077 -112127 -1693 20018 64467 -129438 -39128 381703 -84229 221412
10439 31398 -229905 118808 310814 137606 -203408 -17764 -68289 145345 78482 142014
10429 142014 108243 -246105 -61255 -193620 155029 -16493 23146 -108050 156957 -210145
10418 -132823 -54952 21609 48626 221771 -275288 -143596 -24851 2092 -93024 -134390 -12273
10406 7659 225315 -98425 -407325 -325951 112038 302897 -34707 -52801 141428 -147862 70969
10394 -57533 212284 202907 147215 156650 -124078 -48188 215643 201988 -65859 44206 -33564
10382 -153146 409408 -151125 240291 565933 225458 388555 353051 166195 262549 627671
$$ packed form
10461b02974d0796A49185c44943J63375A80162a82852A51568a9259j57935j0110
10451a87304B07878h1077l1050a693B0018M4449a29438c9128C81703h4229B21412
10439C1398b29905A18808J92006A37606b03408a7764n0525A45345o6863O3532
10429A42014l3771b46105f1255j32365A55029a6493B3146a08050A56957b10145
10418a32823e4952B1609K7017J73145b75288J31692b4851B092i3024m1366a2273
10406G659K17656i8425l08900Q1374A12038J90859c4707j8094A41428a47862G0969
10394e7533B12284r377n5692R435a24078d8188B15643j3655f5859D4206c3564
10382a53146D09408a51125B40291L25642B25458J63097l5504A66195R6354L65122
$$ plain form
10372 627671 275815 242079 451766 170740 307983 367625 483278 377973 485847 394514
10362 394514 32964 494050 134196 395548 420358 53492 56094 174228 66452 565902 683965
10351 683965 465326 662849 335139 263167 387226 345460 343075 324000 437330 260956
10341 260956 27050 -167123 494824 306403 217336 136834 -36526 -110515 192020 275210 -32601
10329 151559 321837 293423 112882 -3116 -265499 665297 299482 216033 154760 371889
10319 371889 209800 136103 177425 170117 313614 -140536 -261454 42823 316579 76008 -37243
10307 -186321 -59487 -352940 -45234 189510 21153 -33775 -20528 113330 -111084 -340104
10297 -340104 -38725 383 -135859 -64090 -316080 292292 106262 261299 212131 -310580 -246496
$$ packed form
10372F27671B75815l3736K09687A70740J37243N9642J15653j05305J07874r1333
10362C94514C2964M61086A34196K61352K4810E3492K602J18134F6452M99450J18063
10351F83965k18639J97523l27710p1972J24059m1766k385j9075J13330j76374
10341B60956B7050a67123D94824j88421q9067q0502c6526p3989A92020Q3190c2601
10329A51559J70278k8414A12882c116k62383F65297B99482q3449o1273K17129
10319C71889j62089p3697M1322p308J43497a40536j20918D2823K73756G6008c7243
10307a86321e9487k93453d5234A89510B1153c3775J3247A13330a11084k29020
10297c40104c8725C83a35859f4090k51990B92292A06262J55037m9168c10580O4084
$$ plain form
10286 -246496 -118510 -311318 -149521 -108409 18601 9470 248280 -77380 311683 191902
10276 191902 408581 -32503 -327514 -13784 -319246 -151655 3258 -177702 112962 20090
10265 15729 197928 -12378 179410 524566 297624 341909 -251170 398357 124348 -141437
10254 -25013 -93683 249666 111312 -162705 -254241 -213037 45034 -171272 -58143 -232804 103412
10242 307548 -153633 -97048 172759 333554 -18130 24843 225982 -153999 209585 -4911
10231 218278 -446756 103392 -92271 -51126 221621 -153730 28253 -234983 254111 135047
10221 135047 185947 159188 -456889 -245976 -125010 57138 228832 169145 161128 55337 -84418
10209 5238 30573 13256 -195432 42824 -73449 197622 -187743 284035 -180496 93932 2175
$$ packed form
10286b46496a18510j92808a49521M1112A8601r131K38810g7380C11683j19781
10276A91902K16679c2503k95011a3784l05462a51655C258a77702A12962B0090
10265A5729J82199a2378A79410L45156k26942M4285b51170C98357A24348a41437
10254b5013o8670B49666A11312a62705r1536M1204D5034a71272e8143j74661A03412
10242C07548a53633N6585A72759J60795a8130B4843K01139a53999B09585d911
10231B18278d46756A03392i2271M1145B21621a53730B8253b34983B54111j19064
10221A35047N0900k6759d56889K10913J20966E7138J71694n9687q017E5337h4418
10209E238K5335A3256a95432D2824g3449A97622a87743B84035a80496I3932B175
$$ plain form
10197 81156 -209605 116685 65166 272908 8344 3821 -33240 -150934 -62179 -278724 6723
10185 -257100 -162174 -204064 -39203 137253 -207144 5436 -143560 -95051 51952 106771 -96428
10173 -21610 -14901 47510 -98836 51262 208739 -61745 -147386 -284187 -344566 33964 -13506
10161 129349 -83003 -42036 55986 -150265 -109623 -128569 -334730 -244838 -317738 -119158 182394
10149 -122788 -69728 -40376 -119695 -12739 87080 -82550 -161048 -24281 82427 -150690 -5871
10137 -25187 -98073 -139469 -50403 -137065 86703 363205 -154466 -61018 9147 116252 -63611
10125 8078 -315018 -73793 -185885 -196030 84767 80788 -141878 -131680 -31139 -70382 -48743
10114 -48743 -78584 57900 -98486 -173230 -342599 145033 -104425 114452 77766 -252996 -23530
$$ packed form
10197H1156b09605A16685n1519K07742H344C821c3240j17694f2179k16545F723
10185b57100R4926m1890c9203A37253b07144E436a43560M8509E1952N4819i6428
10173b1610O709D7510i8836E1262J57477f1745q5641j36801o0379C3964a3506
10161A29349h3003M0967E5986a50265M0642j8946k06161Q9892p2900a19158A82394
10149a22788N3060K9352p9319a2739H7080h2550p8498b4281H2427a50690e871
10137b5187p2886m1396e0403q6662H6703K76502a54466f1018I147J07105f3611
10125H078c15018g3793j12092j0145H4767l979a41878J0198c1139l9243K1639
10114d8743k9841E7900i8486p4744j69369A45033a04425A14452l6686b52996b3530
$$ plain form
10102 -235885 109667 -208451 -1422 -201030 63844 -287579 -133923 125842 217312 -275178
10091 178152 -23749 163410 94535 62730 113576 -117553 2466 -116988 2631 -136225 -7487
10079 -145298 115461 -2849 -44092 -80592 464663 -138147 -45678 -29780 -403575 -44204 -421158
10068 -421158 -243415 106555 91107 65805 -205039 82088 -7470 -16510 45994 217848 10632
10056 -80161 -147220 110119 -19984 52910 -156750 -325682 -292415 -270220 68133 -128011 32790
10044 -155926 -217115 -204479 81480 41726 -280 40460 14998 -15873 -178005 -147536 27377 -249686
10031 121613 -72604 -555838 66097 149915 -168670 -178982 -183458 -45164 -217126 -110505 -234334
10020 -234334 -94023 164290 -58839 -368861 -341272 -108148 -96942 159205 113448 -325831
$$ packed form
10102b35885A09667b08451a422j99608F3844b87579a33923A25842R1470b75178
10091A78152b3749A63410o8875l1805N0846a17553B466a16988B631a36225g487
10079a45298A15461b849m1243l6500D64663a38147d5678J5898l73795d4204l76954
10068d21158J77743A06555j5448k5302b05039H2088g470r040D5994J71854A0632
10056h0161o7059A10119a9984E2910a56750j68932L3267K2195F8133a28011C2790
10044a55926o1189J2636H1480l9754b80D0460A4998a5873j62132L0469B7377b49686
10031A21613g2604m83234F6097Q3818a68670j0312m476d5164j71962J06621j23829
10020b34334i4023A64290e8839l10022K7589a08148J1206A59205m5757c25831
$$ plain form
10009 -301481 -300438 -92046 -107268 -84527 -256262 -29424 34846 87715 352475 -82330 -320542
9998 -320542 82602 7676 -162672 -131032 -18493 -20561 115826 -130437 -234200 -216267 94075
9986 -210920 -26768 -24619 -78239 10375 -195981 -233921 71222 312629 -66786 -59764 -46495 -20552
9973 158048 -209491 165854 -121863 123017 -139343 -334325 144862 52360 43809 -199512
9962 20473 120129 -221795 -12610 -302914 165602 -239807 193840 44093 -9052 -308382 76770
9950 -45425 152649 -215440 -76042 63237 -187670 -501518 -103633 190458 -285175 27200
9939 114817 -298118 -100864 -88551 63337 -278540 19834 -281845 -354470 364279 317636 182728
9928 182728 276448 156362 324570 -90912 -142817 132261 -113373 151778 -52541 -47230 -97998
$$ packed form
10009c01481J043i2046j5222K2741j71735b9424C4846N2869K64760h2330k38212
9998c20542H2602G676a62672L1640a8493k068A15826a30437j03763J7933I4075
9986b10920b6768K149n3620A0375a95981l7940G1222K41407f6786P022J3269b0552
9973A58048b09491A65854a21863A23017a39343j94982A44862E2360q551a99512
9962B0473R9656b21795a2610k90304A65602b39807A93840D4093i052k99330G6770
9950d5425A52649b15440g6042F3237a87670l13848a03633A90458b85175B7200
9939A14817b98118a00864J2313F3337b78540A9834b81845p2625C64279m6643j34908
9928A82728R3720j20086J68208i0912n1905A32261a13373A51778e2541N311n0768
$$ plain form
9917 -97998 62896 -332144 -25892 -45377 -86727 -63604 -90726 118318 84582 161770 85732
9906 85732 59357 -106977 -18056 -215703 -366976 -191283 -45950 71036 178920 -242030 -26561
9894 184973 23773 38982 -194501 261045 321464 54555 214928 45260 111204 -122809 -143907
9883 -143907 -263855 -231003 -166333 -144183 -350707 118449 19673 -304433 41952 51188 -294029
9871 -106819 -16623 -158742 -84751 -111563 83992 -95367 277645 -89360 -282420 14600 -213119
9859 -5713 43446 -164091 -268094 -285406 74721 -27903 -169212 85695 251604 -55159 -216268
9848 -216268 -77333 -168696 -151986 -195718 161934 24987 144356 -120490 27371 90633 -237567
9836 -92300 29855 274056 157731 -59156 -216890 2404 -283497 114828 -143957 115989 155236
$$ packed form
9917i7998F2896c32144b5892j9485m1350K3123k7122A18318l3736P7188p6038
9906H5732k6375a06977a8056j97647j51273J75693d5950G1036J07884b42030b6561
9894A84973B3773J5209a94501B61045O0419E4555J60373D5260O5944a22809k1098
9883a43907j19948L2852O4670K2150k06524A18449A9673c04433D1952R236b94029
9871a06819a6623j42119P3991k6812H3992i5367B77645h9360j93060A4600b13119
9859e713D3446a64091j04003j7312G4721b7903j41309H5695J65909e5159j61109
9848b16268g7333r1363J6710m3732A61934B4987J19369a20490B7371O3262b37567
9836i2300B9855K44201j16325e9156j57734B404b83497A14828a43957A15989L9247
$$ plain form
9825 155236 128531 -992 31923 -494513 -57207 -23089 86099 -101110 10526 201601 -225716
9813 114020 -434783 -132994 -10313 -359279 -13002 -334930 -171372 45865 240259 -87013
9802 -180018 -218093 -220127 -321373 -125113 -12967 -266078 -165021 -292033 -108386 349635
9791 17425 -236303 -151336 -9375 -167774 -7740 -147258 -343218 21988 -161063 -169770 10995
9779 6820 122202 50815 913 -169220 144059 102730 95809 -161692 -655986 70815 -219248
9767 156202 85157 -125282 -362150 -286828 -254096 224643 90885 -279693 -164932 -178607 19583
9755 -299348 232974 -114648 82947 -51870 59035 -43306 489955 -63033 -127613 55986 24828
9743 -102818 61795 -28586 -243292 -178241 -111318 84855 -437116 -303408 -72314 -159691 -200
$$ packed form
9825A55236k6705i92C1923d94513e7207b3089H6099a01110A0526J91075b25716
9813A14020d34783a32994a0313l48966a3002l21928J63558D5865J94394h7013
9802a80018l8075k034j01246a25113a2967k53111J01057j27012a08386C49635
9791A7425b36303Q4967i375j58399g740j39518j95960B1988a61063q707A0995
9779F820J15382E0815I13a69220A44059m1329o921a61692m94294G0815b19248
9767A56202p1045a25282k36868P5322L2732B24643I0885b79693J14761j3675A9583
9755b99348B32974a14648H2947e1870E9035d3306D89955f3033o4580E5986B4828
9743a02818F1795b8586k14706O5051O6923H4855d37116J33708g2314q7377b00
$$ plain form
9731 -18349 -148272 36937 -453833 -525181 37031 -249311 -6314 -225515 78844 182977 77953
9719 -261877 10966 -119160 -153329 5827 -28938 -42397 48577 33732 -310059 -63063 -1759 -236350
9707 -236350 -57894 -90482 -121570 182510 53635 206687 -174910 360998 101620 139577 9474
9695 -20324 -167507 -209001 -88104 -642 -42454 32235 52707 3367 -246276 -71910 -45200 84923
9682 54416 70336 87518 -107596 -54380 -190615 128485 109765 -86483 -127446 -426028 -47247
9670 -40679 -57822 -222023 -221144 80797 -79343 83708 20506 7010 27750 -164925 95743 9938
9657 26865 -45645 -11817 -60354 -195789 -195504 16397 -78480 -294699 77250 -280985 -39993 -27519
9645 -27519 -138393 -142884 -325693 -95088 48520 42013 -36633 -70264 141075 -248145 -139352
$$ packed form
9731a8349j29923C6937d53833p1348C7031b49311f314k19201G8844J04133G7953
9719b61877A0966a19160l4169E827b8938j3459D8577j4845c10059f3063a759k34591
9707b36350e7894l2588l1088A82510E3635J53052a74910C60998A01620L7957I474
9695b0324j47183m1494h8104f42m1812C2235K0472C367b46276g1910K6710H4923
9682E4416J5920J7182a07596N3216j36235A28485j8720h6483m0963k98582d7247
9670d0679j7143j64201Q79H0797g9343H3708B0506G010K0740a64925I5743I938
9657B6865d5645a1817m8537j35435K85A6397g8480k16219G7250b80985c9993J2474
9645b7519j10874m491j82809i5088D8520o507c6633l3631A41075b48145J08793
$$ plain form
9634 -139352 138205 -76352 -190336 164436 280273 356913 -166903 -7217 259075 59929 -232223
9622 447551 -173868 54813 -288961 -100460 248076 95676 5248 -303722 -216786 -119140 -93262
9611 -93262 -216498 -68935 -9056 42883 90506 -144383 77327 -33824 -3431 151421 -301723
9599 -1397 512884 16534 -417907 220329 -391883 112231 -111792 -194275 183246 27668 -140032
9587 119189 -116948 -265005 -94016 -492118 28472 -194830 56968 53888 65412 58247 -236314
9575 216107 -147427 -273862 246344 -225024 280095 4897 44226 72812 -47336 -168216 29232
9563 -36197 12738 69778 17469 -215705 100037 61809 -62394 -38872 -151126 -180386 -60113
9551 -144703 -246239 6783 -261939 -413017 -8702 -76164 -155854 -45949 -107087 -16456 -85227
$$ packed form
9634a39352A38205g6352j13984A64436J15837P6640a66903g217B59075E9929b32223
9622D47551a73868E4813b88961a00460B48076I5676E248c03722Q6936R7646K5878
9611i3262j23236f8935i056D2883M7623a44383G7327c3824c431A51421c01723
9599a397E12884A6534d17907B20329c91883A12231a11792q2483A83246B7668a40032
9587A19189a16948j48057i4016l98102B8472a94830E6968l080J1524p165b36314
9575B16107a47427j26435B46344b25024B80095D897L9329K8586d7336j20880B9232
9563c6197A2738N7040A7469b15705A00037l8228f2394K3522j12254k9260f0113
9551a44703j01536F783b61939j51078h702o7462p9690d5949o1138a6456o8771
$$ plain form
9540 -85227 -277424 98501 -356058 220338 -209421 78036 185561 -69014 -39543 113128 -183082
9528 -317898 -403065 43957 -206298 91679 -327453 41492 191503 66575 72355 -20026 -150632
9517 -150632 85026 -151413 -218860 -502516 -130919 4172 -279221 -187221 -332542 -228978 -168450
9506 -168450 9817 39420 -56030 -339449 273560 -217113 117090 103000 -124318 -443755 -70953
9494 3598 4396 -299466 63302 -56966 -16977 17005 -56158 -230273 -4378 46166 -304173 -73793
9481 -83502 -204318 -227336 64672 -169562 -13006 286152 166884 20851 78071 -114073 23650
9469 -60041 -297478 280749 121084 -22009 -163724 -285952 253722 101395 -347412 -293646
9459 -293646 233999 100419 -446663 -115108 -113461 96757 -292524 120734 -158133 -11790
$$ packed form
9540h5227j92197I8501c56058B20338b09421G8036J07525f9014K9471A13128a83082
9528c17898q5167D3957b06298I1679c27453D1492J50011F6575N780b0026j30606
9517a50632H5026a51413o7447k83656a30919D172b79221R2000j45321J03564O0528
9506a68450I817K9603e6030k83419B73560b17113A17090j4090a24318l19437g0953
9494C598P98b99466F3302e6966a6977A7005e6158j74115d378D6166c04173g3793
9481h3502j20816k3018F4672a69562a3006B86152j19268B0851N7220a14073B3650
9469f0041k37437B80749A21084b2009j41715j22228B53722A01395c47412N3766
9459b93646B33999A00419d46663a15108J647I6757b92524A20734a58133a1790
$$ plain form
9448 104858 58341 367046 295204 -118348 21231 207254 -39460 18056 11007 -133532 14842
9436 -58530 76037 109868 -430023 -84858 202186 -58466 -58250 111764 -54168 -179448 -107086
9425 -107086 -49069 -2559 -58261 -245869 -140361 -83114 153071 11721 172411 194377 -95181
9413 -168562 -30114 -257414 -311150 -284020 51261 -351037 57604 -162067 56604 -169067 395478
9401 -77584 -14081 315274 -205351 -338630 -306421 171574 -58571 54903 -273392 -163263 -91162
9390 -91162 61212 -99702 -145416 143256 -101918 39613 -27785 -66236 103281 88707 -162157
9378 -202910 115793 -39624 -222578 145993 -60441 -66405 84087 229736 385015 -126892 113456
9366 -142480 236872 -55355 -175002 -179049 -140082 158342 -177350 134003 -60087 -358570 370791
$$ packed form
9448A04858m6517L08705p1842a18348B1231J86023c9460A8056p049a33532A4842
9436e8530G6037L3831d30023h4858B02186e8466K16A11764e4168j25280P2362
9425a07086d9069b559n5702j87608J05508N7247A53071A1721J60690K1966i5181
9413a68562c0114k27300n3736K7130E1261c51037E7604a62067E6604a69067C95478
9401g7584a4081C15274b05351j33279L2209A71574e8571E4903b73392J10129P2101
9390i1162F1212i9702m5714A43256a01918C9613b7785l8451A03281j4574a62157
9378b02910A15793c9624j82954A45993f0441n964H4087J45649J55279a26892A13456
9366a42480B36872e5355j19647m047L8967A58342a77350A34003f0087k98483C70791
$$ plain form
9354 12436 -30675 225431 -112596 -138710 69568 -160977 219099 84108 -289199 -340362 -38544
9342 -363484 152922 -189536 129896 27514 -336525 -24224 -33836 -67130 260747 84285 -187343
9330 23715 35790 -55998 -165136 -164980 2653 -346422 16712 8819 -200145 -44211 -287451 232362
9317 -53094 -14494 -64265 89149 -485745 -252882 345173 237842 64934 175812 740 -141701
9305 126670 -76980 -170853 24303 -311587 -141023 -106666 -97591 -104054 -213605 -340726 191570
9293 -287603 -214624 -285294 210366 -26202 -22916 -14681 123658 -76525 -154171 25353 35910 132555
9281 132555 -55956 -317273 -256852 27285 92864 -315703 -151732 109472 -92298 153917 44055
9269 153846 65174 -171488 -220384 -42251 7092 -102022 187450 -89980 -278764 41732 -62491
$$ packed form
9354A2436c0675B25431a12596k6114F9568a60977B19099H4108b89199n1163c8544
9342c63484A52922a89536A29896B7514c36525b4224r612l3294B60747H4285a87343
9330B3715J2075e5998j09138J56B653c46422A6712p893b00145d4211k43240B32362
9317e3094a4494m9771H9149d85745K32863C45173j07331F4934J10878G40a41701
9305A26670g6980r3873B4303c11587a41023L4357R075o463j09551j27121A91570
9293b87603P2979p0670B10366b6202L286Q235A23658g6525p7646B5353J0557R6645
9281A32555e5956k61317O0421B7285O5579c15703a51732A09472i2298A53917D4055
9269A53846F5174a71488m8896d2251G092a02022A87450h9980j88784D1732f2491
$$ plain form
9257 -233250 81594 56086 21150 -211242 -158692 149880 -89976 207055 -45615 173725 -235511
9245 63275 -188988 -174064 -344123 -151904 -232806 -275250 -284562 -557507 11588 265664 -230171
9233 166067 46088 28646 154160 -106260 -89701 -266974 33717 -263652 184859 -49352 -352368
9222 -352368 -261084 28948 -52940 119342 -74550 -349362 -128028 110826 86718 186910 -378462
9210 191878 -94098 37843 -165475 -21145 209999 33423 -62820 -17777 19947 137951 -62642
9198 -34404 -28952 -117590 -62190 107503 -139821 -112091 28748 74037 279562 186391 -327366
9186 183382 -24691 -144168 -372101 -125397 -165773 317511 -224596 -92318 -274926 -23198
9175 -15439 206849 24778 364955 288645 -206637 -220714 -216922 69221 -407783 -281097 98826
$$ packed form
9257b33250H1594k5508B1150b11242N2550A49880h9976B07055d5615A73725b35511
9245F3275a88988J4924j70059a51904q0902m2444r312k72945A1588K54076b30171
9233A66067D6088j7442J25514a06260J6559j77273C3717b63652A84859d9352l03016
9222c52368R1284B8948e2940A19342g4550k74812a28028A10826k4108J00192c78462
9210A91878i4098C7843a65475b1145B09999C3423f2820a7777A9947J18004f2642
9198c4404N452q8638N5400A07503a39821K7730B8748M5289K05525r3171c27366
9186A83382b4691j19477k27933a25397m0376C17511b24596i2318j82608b3198
9175a5439B06849B4778L40177p6310b06637j4077L792F9221d07783J26686I8826
$$ plain form
9163 -419920 -232364 15308 162488 32823 -253557 -119006 383929 5824 226772 -133284
9152 -82607 -219032 -175734 -108081 250826 235825 -194786 234960 181287 -116788 -63241 -437180
9141 -437180 247218 -320445 186743 325631 -40474 -118631 -119420 1142 193268 -83442 42361
9129 -536876 -106257 -178534 -106809 39116 -25745 -305336 -229180 -87468 -104264 259764 296811
9118 296811 -12065 115536 97260 194556 17245 75351 -168202 -94500 102630 60223 58641
9107 58641 93803 -181752 128523 -151673 188500 248420 -256228 -53373 287500 -38927 48802
9095 73473 -55023 -237640 -37813 -76984 79327 -365342 158313 -205546 -164712 -23616 -134910
9084 -134910 -195088 -50294 256793 -378014 -122645 147525 -318664 71668 -115003 -324283
$$ packed form
9163d19920J87556A5308J47180C2823b53557a19006C83929E824K20948a33284
9152h2607j36425M3298O7653B50826j5001a94786B34960n3673a16788N3547l73939
9141d37180B47218c20445A86743J38888d0474p8157p89A142J92126h3442D2361
9129e36876a06257p2277P1725C9116b5745k79591P6156h7468j6796B59764L7047
9118B96811a2065A15536j8276R7296A7245N8106a68202P3702A02630m2407j582
9107E8641L5162a81752A28523a51673A88500N9920b56228e3373B87500c8927D8802
9095G3473e5023j82617c7813l9171G9327c65342A58313b05546M0834b3616j11294
9084a34910o0178e0294B56793c78014a22645A47525c18664G1668a15003k09280
$$ plain form
9074 -324283 108359 53308 93517 84694 -132428 143638 163840 266656 -125148 -457434 -98854
9062 109795 99151 -234937 -4870 -104469 -266400 -168167 82708 -172539 -142495 -21382 217426
9050 -175774 -334319 -162176 -55038 132420 164992 2181 -132047 -316229 233900 -93305 -72389
9039 -72389 -64813 -218205 45414 57246 -156050 -24510 104729 -74096 27813 76580 -198506
9027 -16476 -183283 -5390 -7712 -48398 -321593 66363 -99387 103452 -172864 -174126 -105564 -35187
9014 69476 -27058 -116247 7372 -246457 -331477 213703 -71097 71524 -109518 59591 -295353
9002 -321072 42779 -126789 -184825 -12781 -79997 9109 -260943 300231 -35530 230885 -98910
8990 117335 -81642 -53649 -144470 59823 79088 -179682 145391 209732 -310632 -203113 226781
$$ packed form
9074c24283A08359E3308M0209q823a32428A43638K0202J02816a25148l32286i8854
9062A09795j0644b34937d870r9599j61931R8233H2708a72539L0044b1382B17426
9050a75774j58545a62176e5038A32420L2572B181a32047j84182B33900i3305K0916
9039g2389P576j53392D5414J1832a56050b4510A04729g4096B7813M8767a98506
9027a6476j66807e390k322m0686k73195F6363i9387A03452a72864j262O8562c5187
9014F9476b7058q9189G372b46457q5020B13703g1097G1524a09518E9591b95353
9002c21072D2779a26789n8036a2781o7216I109b60943C00231c5530B30885i8910
8990A17335h1642K7993r0821E9823J9265a79682A45391O4341c10632J07519B26781
$$ plain form
8978 217105 62812 -137253 3405 -129483 -459407 -310428 -3209 -389926 -93375 -55529 557
8966 -129883 -146896 -109268 39918 46426 53775 -229929 -432079 -214933 -21250 -248355 225615
8954 -241219 23532 -183532 -40918 214728 -158634 57996 8902 -343139 71293 -238832 -89042
8942 -236249 406945 2903 26467 -282477 -187231 -185002 256350 376822 134980 -196995 -108515
8931 -108515 314445 195676 279757 -265056 58191 387583 750191 1946689 7458963 20033955
8921 20033955 4961133 1710226 779495 669150 224796 -136721 513366 -211117 210831
8911 -85498 -147376 49156 738750 -47260 -208334 -71966 148895 -107229 -8152 24113 67240
8900 67240 -192700 111808 -398015 91034 -61546 167660 153654 45679 210171 3668 -57480
$$ packed form
8978B17105F2812a37253C405a29483l29924J48979c209l86717i3375L7846E57
8966a29883j7013L7628C9918O508P349b29929k02150b14933b1250k27105B25615
8954b41219B3532a83532d0918B14728a58634E7996H902c43139G1293b38832h9042
8942b36249D06945B903K3564b82477R5246K229B56350J20472A34980a96995Q8480
8931a08515C14445j18769Q4081b65056E8191L29392L62608J196498N512274J2574992
8921B0033955D961133A710226G79495j10345B24796a36721E13366b11117B10831
8911h5498o1878D9156O89594d7260j61074g1966A48895a07229h152B4113M3127
8900F7240a92700A11808c98015I1034f1546A67660j4006D5679J64492C668e7480
$$ plain form
8888 19936 73785 -274174 -48194 122533 93059 27214 81776 330289 104028 278390 362908
8877 362908 137750 -148270 43787 -19207 -4741 253022 -252841 155300 -171218 -549034
8867 -549034 -191367 -47745 -26940 -208431 -184416 -273288 27399 265703 84586 168410 -178652
8855 182768 -433593 298383 -130523 -172585 -253918 -318168 53184 -128394 86334 237 -68968
$$ packed form
8888A9936N3849b74174d8194A22533k9474B7214N4562K48513A04028J74362Q4518
8877C62908A37750a48270D3787a9207d741B53022b52841A55300a71218l77816
8867e49034a91367d7745K0805j81491K4015q8872B7399K38304H4586Q3824a78652
8855A82768d33593B98383a30523m2062q1333o4250E3184a28394H6334B37f8968
$$ [...]
##END NTUPLES=NMR SPECTRUM
##END=
