##TITLE=AC1584_DECA0001_8281218_3LNIgvZUDM
##JCAMPDX= 6.0         $$ Bruker NMR JCAMP-DX V2.0
##DATA TYPE= NMR SPECTRUM
##DATA CLASS= NTUPLES
##ORIGIN= BRUKER
##OWNER= Administrator
$$ 1.72 TOPSPIN		Version 2.1
$$ 2013-10-19 00:06:36.032 -0700  Administrator@X
$$ Compression mode = diff/dup
##.OBSERVE FREQUENCY= 400.02188249412
##.OBSERVE NUCLEUS= ^1H
##.ACQUISITION MODE= SIMULTANEOUS (DQD)
##.ACQUISITION SCHEME= undefined
##.AVERAGES= 64
##.DIGITISER RES= 22
##SPECTROMETER/DATA SYSTEM= spect
##.PULSE SEQUENCE= noesygpps1d.comp
##.SOLVENT NAME= COFFEE_meoh
##.SHIFT REFERENCE= INTERNAL, COFFEE_meoh, 1, 14.96049
##AUDIT TRAIL= $$ (NUMBER, WHEN, WHO, WHERE, PROCESS, VERSION, WHAT)
$$ ##TITLE= Audit trail, TOPSPIN		Version 2.1
$$ ##JCAMPDX= 5.01
$$ ##ORIGIN= Bruker BioSpin GmbH
$$ ##OWNER= Administrator
$$ $$ E:\/data/COFFEE/nmr/AC1584_DECA0001_8281218_3LNIgvZUDM/12/pdata/1/auditp.txt
$$ ##AUDIT TRAIL=  $$ (NUMBER, WHEN, WHO, WHERE, PROCESS, VERSION, WHAT)
(   1,<2013-10-19 00:06:30.938 -0700>,<Administrator>,<X>,<go>,<TOPSPIN 2.1>,
      <created by zg
	started at 2013-10-18 23:55:00.577 -0700,
	POWCHK enabled, PULCHK disabled,
       configuration hash MD5:
       C8 4E 4E 5D D3 5C D8 9E 9F 52 82 E0 59 8A DE 15
       data hash MD5: 64K
       5C 20 04 7F 70 A7 FD 1B 5B 5A D5 62 2F E5 56 C0>)
(   2,<2013-10-19 00:06:33.891 -0700>,<Administrator>,<X>,<proc1d>,<TOPSPIN 2.1>,
      <Start of raw data processing
       efp LB = 0.3 FT_mod = 6 PKNL = 1 PHC0 = 0 PHC1 = 0 SI = 128K 
       data hash MD5: 128K
       52 1A 88 FD B2 47 6B DB CB 73 35 9D 08 71 3B DD>)
(   3,<2013-10-19 00:06:34.876 -0700>,<Administrator>,<X>,<proc1d>,<TOPSPIN 2.1>,
      <pk PHC0 = -84.47388 PHC1 = 0 
       data hash MD5: 128K
       EE 75 08 8E 41 E0 06 29 54 C0 81 FB 90 C9 29 1A>)
(   4,<2013-10-19 00:06:35.376 -0700>,<Administrator>,<X>,<proc1d>,<TOPSPIN 2.1>,
      <abs ABSG = 1 
       data hash MD5: 128K
       BE 25 96 CE EC C0 EC 38 01 AE 15 2D 49 98 75 33>)
(   5,<2013-10-19 00:06:35.501 -0700>,<Administrator>,<X>,<proc1d>,<TOPSPIN 2.1>,
      <abs ABSG = 2 
       data hash MD5: 128K
       A9 C0 D8 3E D1 B7 16 20 BC CF 11 6C B4 C8 29 26>)
(   6,<2013-10-19 00:06:35.610 -0700>,<Administrator>,<X>,<proc1d>,<TOPSPIN 2.1>,
      <abs ABSG = 3 
       data hash MD5: 128K
       B2 DD F2 8C E0 2B 64 C4 A7 13 06 94 B9 78 B5 F6>)
(   7,<2013-10-19 00:06:35.704 -0700>,<Administrator>,<X>,<proc1d>,<TOPSPIN 2.1>,
      <abs ABSG = 4 
       data hash MD5: 128K
       0B 58 EC 4A F8 B6 F1 AF C7 C2 D4 B2 5C E0 48 32>)
(   8,<2013-10-19 00:06:35.829 -0700>,<Administrator>,<X>,<proc1d>,<TOPSPIN 2.1>,
      <abs ABSG = 5 
       data hash MD5: 128K
       37 8D 8A EB 6F 9A 77 15 31 F3 01 B1 91 B2 9F DC>)
$$ ##END=
$$ 
$$ $$ hash MD5
$$ $$ DA D1 CA F3 0A 30 75 41 E8 07 22 F7 D8 FC 9F 31
##$RELAX= 
##$RELAX= 
##$RELAX= 
##$RELAX= 
##$RELAX= 
##$RELAX= 
##$RELAX= 
##$RELAX= 
$$ Bruker specific parameters
$$ --------------------------
##$DU= <E:\>
##$EXPNO= 12
$$ [...]
##$TP07= 0
##$TPNAME0= <>
##$TPNAME1= <>
##$TPNAME2= <>
##$TPNAME3= <>
##$TPNAME4= <>
##$TPNAME5= <>
##$TPNAME6= <>
##$TPNAME7= <>
##$TPOAL= (0..7)
0.5 0.5 0.5 0.5 0.5 0.5 0.5 0.5
##$TPOFFS= (0..7)
0 0 0 0 0 0 0 0
##$TUNHIN= 0
##$TUNHOUT= 0
##$TUNXOUT= 0
##$USERA1= <user>
##$USERA2= <user>
##$USERA3= <user>
##$USERA4= <user>
##$USERA5= <user>
##$V9= 5
##$VALIST= <valist>
##$VCLIST= <CCCCCCCCCCCCCCC>
##$VD= 0
##$VDLIST= <DDDDDDDDDDDDDDD>
##$VPLIST= <PPPPPPPPPPPPPPP>
##$VTLIST= <TTTTTTTTTTTTTTT>
##$WBST= 1024
##$WBSW= 4
##$XGAIN= (0..3)
0 0 0 0
##$XL= 0
##$YL= 0
##$YMAX_a= 6061219
##$YMIN_a= -11800014
##$ZGOPTNS= <>
##$ZL1= 120
##$ZL2= 120
##$ZL3= 120
##$ZL4= 120
##$ABSF1= 14.96049
##$ABSF2= -5.597692
##$ABSG= 5
##$ABSL= 3
##$ALPHA= 0
##$AQORDER= 0
##$ASSFAC= 0
##$ASSFACI= 0
##$ASSFACX= 0
##$ASSWID= 0
##$AUNMP= <proc_prof1d_extract.lims>
##$AXLEFT= 0
##$AXNAME= <>
##$AXNUC= <1H>
##$AXRIGHT= 0
##$AXTYPE= 0
##$AXUNIT= <>
##$AZFE= 0.1
##$AZFW= 0.1
##$BCFW= 0
##$BC_mod= 0
##$BYTORDP= 0
##$COROFFS= 0
##$CY= 15
##$DATMOD= 1
##$DC= 0
##$DFILT= <>
##$DTYPP= 0
##$F1P= 0
##$F2P= 0
##$FCOR= 0.5
##$FTSIZE= 131072
##$FT_mod= 6
##$GAMMA= 0
##$GB= 0
##$INTBC= 1
##$INTSCL= 1
##$ISEN= 128
##$LB= 0.3
##$LEV0= 0
##$LPBIN= 0
##$MAXI= 10000
##$MC2= 0
##$MEAN= 0
##$ME_mod= 0
##$MI= 0
##$NCOEF= 0
##$NC_proc= -2
##$NLEV= 6
##$NOISF1= 0
##$NOISF2= 0
##$NSP= 0
##$NTH_PI= 0
##$NZP= 0
##$OFFSET= 14.96049
##$PC= 1
##$PHC0= -84.47388
##$PHC1= 0
##$PH_mod= 1
##$PKNL= yes
##$PPARMOD= 0
##$PPDIAG= 0
##$PPIPTYP= 0
##$PPMPNUM= 2147483647
##$PPRESOL= 1
##$PSCAL= 4
##$PSIGN= 0
##$PYNMP= <proc.py>
##$REVERSE= no
##$SF= 400.020009839174
##$SI= 131072
##$SIGF1= 0
##$SIGF2= 0
##$SINO= 400
##$SIOLD= 131072
##$SPECTYP= <>
##$SREGLST= <1H.CDCl3>
##$SSB= 0
##$STSI= 131072
##$STSR= 0
##$SW_p= 8223.68421052631
##$SYMM= 0
##$S_DEV= 0
##$TDeff= 65536
##$TDoff= 0
##$TI= <>
##$TILT= no
##$TM1= 0
##$TM2= 0
##$TOPLEV= 0
##$USERP1= <user>
##$USERP2= <user>
##$USERP3= <user>
##$USERP4= <user>
##$USERP5= <user>
##$WDW= 1
##$XDIM= 131072
##$YMAX_p= 425692205
##$YMIN_p= -11719
##$CURPLOT= <Network HP LaserJet P1505>
##$CURPRIN= <$Network HP LaserJet P1505>
##$DFORMAT= <normdp>
##$LAYOUT= <+/1D_H.xwp>
##$LFORMAT= <normlp>
##$PFORMAT= <normpl>
##$SURQMSG= 1
$$ End of Bruker specific parameters
$$ ---------------------------------
##NTUPLES= NMR SPECTRUM
##VAR_NAME=  FREQUENCY,     SPECTRUM/REAL,   SPECTRUM/IMAG
##SYMBOL=    X,             R,               I
##VAR_TYPE=  INDEPENDENT,   DEPENDENT,       DEPENDENT
##VAR_FORM=  AFFN,          ASDF,            ASDF
##VAR_DIM=   131072,        131072,          131072
##UNITS=     HZ,            ARBITRARY UNITS, ARBITRARY UNITS
##FACTOR=    0.0627417313425164, 1,          1
##FIRST=     8223.62146879497, 1575,         -66936
##LAST=      0,             2986,            -67266
##MIN=       0,             -11719,          0
##MAX=       8223.62146879497, 425692205,    0
$$ Real data points
##PAGE= N=1
##DATA TABLE= (X++(R..R)), XYDATA
$$ [...]
63964C82908J1306J1658J1373J1262J2362J4748J7488J9858K2031K4501K7534
$$ 382908 394214 405872 417245 428507 440869 455617 473105 492963 514994 539495 567029
63953E67029L1398L6503M2998N0671N9393O9192P9783R0577J01350J12316J23342
$$ 567029 598427 634930 677928 728599 787992 857184 936967 1027544 1128894 1241210 1364552
63942A364552J33724J42996J51336J58753J64433J67436J67448J64227J56775
$$ 1364552 1498276 1641272 1792608 1951361 2115794 2283230 2450678 2614905 2771680
63933B771680J44066J26602J06464Q5500O3987M1280J7266p358l2027n6751q1348
$$ 2771680 2915746 3042348 3148812 3234312 3298299 3339579 3356845 3349487 3317460 3260709 3179361
63922C179361j04569j24537j40086j51334j58812j62569j62562j59520j54621
$$ 3179361 3074792 2950255 2810169 2658835 2500023 2337454 2174892 2015372 1860751
63913A860751j48325j40152j29854j18281j06647r5454q4566p4099o4584n6267
$$ 1860751 1712426 1572274 1442420 1324139 1217492 1122038 1037472 963373 898789 842522
63903H42522m8729m1475l4660k9011k5039k2513k0741j9219j7888j6766j5568
$$ 842522 793793 752318 717658 688647 663608 641095 620354 601135 583247 566481 550913
63892E50913j3983j2181j0748j0015r665r120q116o778n290l739k174o28R73K767
$$ 550913 536930 524749 514001 503986 494321 485201 477085 470307 465017 461278 459104 458476 459449 462216
63878D62216M710O501P872R015J0541J2850J5514J7562J8472J8731J9304K0633
$$ 462216 466926 473427 481299 490314 500855 513705 529219 546781 565253 583984 603288 623921
63866F23921K2294K3493K3678K2758K0980J8712J6300J4036J2049J0101P666M519
$$ 623921 646215 669708 693386 716144 737124 755836 772136 786172 798221 808322 815988 820507
63854H20507J204j550l832o423r551j2487j4701j6711j9111k1422k2806k3456
$$ 820507 821711 820161 816329 809906 800355 787868 773167 756456 737345 715923 693117 669661
63842F69661k4237k5169k5385k4660k3860k3609k3405k2608k1447k0436j9496
$$ 669661 645424 620255 594870 570210 546350 522741 499336 476728 455281 434845 415349
63831D15349j8261j6799j5371j3830j1993j0265r318r193r304r246r082q823q151
$$ 415349 397088 380289 364918 351088 339095 328830 319512 310319 301015 291769 282687 273864 265713
63818B65713o865n326m209l910m192m387l945k852j544m65Q6p0q61j759k117j876
$$ 265713 258848 253522 249313 245403 241211 236824 232879 230027 228483 228018 228104 228034 227173 225414 223297 221421
63802B21421j583j597j648j402j008p66o52n13m52o01q41j096j590k357k766k216
$$ 221421 219838 218241 216593 215191 214183 213417 212765 212252 211800 211199 210358 209262 207672 205315 202549 200333
63786B00333j128o10j016j478j088k8P95Q79N13J87K5j85o16j142j413j147m21
$$ 200333 199205 198595 197579 196101 195013 194985 195780 196659 197172 197359 197384 197199 196583 195441 194028 192881 192460
63769A92460L36O76N48L26L50M70K30l77p15k70N43Q44L80l15q08j209j553j407
$$ 192460 192796 193472 194020 194346 194696 195166 195396 195019 194304 194034 194577 195421 195801 195486 194678 193469 191916 190509
63751A90509n06O96J561J974K114J908J293P38P89J273J572J671K200L290M085
$$ 190509 190003 190699 192260 194234 196348 198256 199549 200287 201076 202349 203921 205592 207792 211082 215167
63736B15167L825K906K384K604K895K636K185K467L730N098N517M957M341M364
$$ 215167 218992 221898 224282 226886 229781 232417 234602 237069 240799 245897 251414 256371 260712 265076
63722B65076M755M883M569M004L182J964N55n82j360k198l378m615n348n313m685
$$ 265076 269831 274714 279283 283287 286469 288433 288988 288406 287046 284848 281470 276855 271507 266194 261509
63707B61509l881l251k858k473j897j208o16j53K63O05P86R22J299K031K977L905
$$ 261509 257628 254377 251519 249046 247149 245941 245325 245172 245435 246040 246826 247748 249047 251078 254055 257960
63691B57960M587M819M563M057L609L327L218L305L459L293K641J882J482J293
$$ 257960 262547 267366 271929 275986 279595 282922 286140 289445 292904 296197 298838 300720 302202 303495
63677C03495Q54J67l18l39O4R75K330L305K932J566P83J294J900J268j47r66j058
$$ 303495 304349 304516 304198 303859 303923 304898 307228 310533 313465 315031 315814 317108 319008 320276 320129 319163 318105
63660C18105j580l023m618n751o759p780p948o579m429k840k097j510q41o26j039
$$ 318105 316525 313502 308884 303133 296374 288594 280646 274067 269638 266798 264701 263191 262350 261724 260685
63645B60685j430j240p29k98K64J326K570L262L169K731K351K088K030K473L489
$$ 260685 259255 258015 257286 256988 257252 258578 261148 264410 267579 270310 272661 274749 276779 279252 282741
63630B82741M658N505N964O271O636P205Q175R634J1324J2787J3722J4193J4560
$$ 282741 287399 292904 298868 305139 311775 318980 327155 336789 348113 360900 374622 388815 403375
63617D03375J5301J6748J8833K1147K3352K5452K7612K9752L1460L2206L1570
$$ 403375 418676 435424 454257 475404 498756 524208 551820 581572 613032 645238 676808
63606F76808K9421K5978K1572J6341J0356M106j409n394p833r129r398q581p178
$$ 676808 706229 732207 753779 770120 780476 784582 783173 777779 769946 760817 751419 742838 735660
63593G35660o338p026r268j2378j5661j8739k1360k3223k4092k4009k3269k2108
$$ 735660 729322 722296 713028 700650 684989 666250 644890 621667 597575 573566 550297 528189
63581E28189k0502j8350j5861j3524j1611r955q357o939n840m735l075q04J509
$$ 528189 507687 489337 473476 459952 448341 438386 430029 423090 417250 412515 409440 408636 410145
63568D10145L346M767O211P967R916J1650J2782J3265J3510J3986J4744J5448
$$ 410145 413491 418258 424469 432436 442352 454002 466784 480049 493559 507545 522289 537737
63556E37737J5918J6415J7393J9060K1408K4483K8433L3144L7803M1031M1535
$$ 537737 553655 570070 587463 606523 627931 652414 680847 713991 751794 792825 834360
63545H34360L8753L2793K4077J3426K455o774j2982j6226j7092j5810j2628q630
$$ 834360 873113 905906 929983 943409 945864 939090 926108 909882 892790 876980 864352 855722
63533H55722n332l513l043l852o320j0568j5862k1036k5197k7972k9551l0621
$$ 855722 850390 846877 843834 839982 833662 823094 807232 786196 760999 733027 703476 672855
63521F72855l1745l2622l2402l0829k8563k6175k3514k0428j7491j5394j4024
$$ 672855 641110 608488 576086 545257 516694 490519 467005 446577 429086 413692 399668
63510C99668j2754j1382j0178r170q057o790n720n020m397l547k647k160k283
$$ 399668 386914 375532 365354 356184 348127 341337 335617 330597 326200 322653 320006 317846 315563
63497C15563k678k719k084j120m99m73n93k69O04J702K604K976K689K114J955
$$ 315563 312885 310166 308082 306962 306463 305990 305397 305128 305732 307434 310038 313014 315703 317817 319772
63482C19772K549L491M248M828N424N754N326M215K981J881O97o35j824k779l788
$$ 319772 322321 325812 330060 334888 340312 346066 351392 355607 358588 360469 361166 360531 358707 355928 352140
63467C52140m952n897o304o376o404o288n738m747l535k267j135m26k17r9M05
$$ 352140 347188 341291 334987 328611 322207 315919 310181 305434 301899 299632 298497 298071 297854 297755 298160
63452B98160J231J863K053K158K761M104N911P588Q651R186R860J1297J3512J6168
$$ 298160 299391 301254 303307 305465 308226 312330 318241 325829 334480 343666 353526 364823 378335 394503
63438C94503J9292K3183K7474L0710L1327K8982K4636J9489J4289R607O192M587
$$ 394503 413795 436978 464452 495162 526489 555471 580107 599596 613885 623492 629684 634271
63426F34271M705O064Q478J2119J6916K2164K6923L0738L3805L6416L8272L8427
$$ 634271 638976 645040 653518 665637 682553 704717 731640 762378 796183 832599 870871 909298
63414I09298L5967L0749K3473J5108O583j112o983j0530j1963j1767j0434q862
$$ 909298 945265 976014 999487 1014595 1021178 1020066 1013083 1002553 990590 978823 968389 959527
63402I59527q448j0100j3367j7173k1233k5905l0769l4372l5774l5531l4657l3353
$$ 959527 951079 940979 927612 910439 889206 863301 832532 798160 762386 726855 692198 658845
63390F58845l1332k8813k6358k4060k1568j8743j5804j2970j0463q579p244n720
$$ 658845 627513 598700 572342 548282 526714 507971 492167 479197 468734 460155 452911 447191
63378D47191l309k29K643M719N941O430O571P241R119J1796J4141J5675J6953
$$ 447191 443882 443653 446296 451015 456956 463386 469957 477198 486317 498113 512254 527929 544882
63365E44882J8659K0881K3401K6030K8562L0883L3196L5647L7724L8576L7875
$$ 544882 563541 584422 607823 633853 662415 693298 726494 762141 799865 838441 876316
63354H76316L5771L2069K6357J9010J1211L799l014q627j1876j2522j1965j1738
$$ 876316 912087 944156 970513 989523 1000734 1004533 1001519 992892 981016 968494 956529 944791
63342I44791j1965j2070j2307j3616j6343j9949k3785k7438l0491l2547l3397
$$ 944791 932826 920756 908449 894833 878490 858541 834756 807318 776827 744280 710883
63331G10883l2863l0836k7759k4548k1530j8099j3987j0121p320m974k341n62
$$ 710883 678020 647184 619425 594877 573347 555248 541261 531140 523820 518846 516505 515943
63319E15943j817o386j1944j5997j7837j7894j6572j4450j2549j1407j0433q893
$$ 515943 514126 507740 495796 479799 461962 444068 427496 413046 400497 389090 378657 369764
63307C69764p091n909n632n712n509m762l602k446j700j387j275j409j978k550
$$ 369764 362673 356764 351132 345420 339911 335149 331547 329101 327401 326014 324739 323330 321352 318802
63293C18802k167o00J029J423N01q15j802k416k856l175l245k841j962j171j189
$$ 318802 316635 316035 317064 318487 318988 318173 316371 313955 311099 307924 304679 301838 299876 298705 297516
63278B97516j962k569k377j769j391j264j072p74l83L25J268J769J498J210J693
$$ 297516 295554 292985 290608 288839 287448 286184 285112 284338 283955 284280 285548 287317 288815 290025 291718
63263B91718K478K580K217K551L752M572M137L159K836L336L977M319M490M768
$$ 291718 294196 296776 298993 301544 305296 309868 314005 317164 320000 323336 327313 331632 336122 340890
63249C40890N302O102O995P765Q529R673J1290J2986J4400J5634J6954J8389J9792
$$ 340890 346192 352294 359289 367054 375583 385256 396546 409532 423932 439566 456520 474909 494701
63236D94701K1090K2264K3236K3906K4124K3634K2375K0810J9613J8999J8742
$$ 494701 515791 538055 561291 585197 609321 632955 655330 676140 695753 714752 733494
63225G33494J8838J9620K1102K2681K3714K3933K3177K1275J8521J5730J3329
$$ 733494 752332 771952 793054 815735 839449 863382 886559 907834 926355 942085 955414
63214I55414J0765P175K295l651j0428j7570k3998k8598l1171l2314l2510l1802
$$ 955414 966179 973354 975649 971998 961570 944000 920002 891404 860233 827919 795409 763607
63202G63607l0286k8282k5842k2654j8660j4434j0717p718n094k465K57K927N359
$$ 763607 733321 705039 679197 656543 637883 623449 612732 605014 599920 597455 597712 600639 605998
63189F05998P461R265J0897J2477J4036J5485J6663J7483J8006J8322J8458J8489
$$ 605998 613459 622724 633621 646098 660134 675619 692282 709765 727771 746093 764551 783040
63177G83040J8572J8672J8375J7347J5947J4911J4266J2987J0051N558M93m357
$$ 783040 801612 820284 838659 856006 871953 886864 901130 914117 924168 929726 930219 925862
63165I25862q930j3435j7815k1772k5108k7883l0177l1810l2383l1779l0383k8640
$$ 925862 916932 903497 885682 863910 838802 810919 780742 748932 716549 684770 654387 625747
63153F25747k6541k3912k1051j8584j6717j5121j3565j2023j0210p731n016l245
$$ 625747 599206 575294 554243 535659 518942 503821 490256 478233 468023 460292 455276 452031
63141D52031k889l064k818k389k473l005l470l892m519m919m433l337k562k323
$$ 452031 449142 446078 443260 440871 438398 435393 431923 428031 423512 418593 414160 410823 408261 405938
63127D05938j992j345q58o81k44P46J773K276K305K119J888J971K748L798M040
$$ 405938 403946 402601 401743 401062 400818 401564 403337 405613 407918 410037 411925 413896 416644 420442 424482
63112D24482L123K030J810K332K774K705K145J224M64P31K135L400L236K019J224
$$ 424482 427605 429635 431445 433777 436551 439256 441401 442625 443089 443820 445955 449355 452591 454610 455834
63097D55834J420J798J608J088P52N78L41J27R2R2j7L0N86J523K340K789L163
$$ 455834 457254 459052 460660 461748 462500 463078 463419 463546 463638 463730 463713 463743 464329 465852 468192 470981 474144
63080D74144L846M743N366N498N644O453P799Q797Q951Q847R321J0279J1036J1608
$$ 474144 477990 482733 488099 493597 499241 505694 513493 522290 531241 540088 549409 559688 570724 582332
63066E82332J2881J5302J8123K0403K2262K4529K7479L0557L3315L5956L8742
$$ 582332 595213 610515 628638 649041 671303 695832 723311 753868 787183 823139 861881
63055H61881M1407M3562M5426M7586N0100N2232N3240N3148N2568N2046N1792
$$ 861881 903288 946850 992276 1039862 1089962 1142194 1195434 1248582 1301150 1353196 1404988
63044A404988N1913N2535N3654N5057N6476N7711N8651N9174N8957N7286N3231
$$ 1404988 1456901 1509436 1563090 1618147 1674623 1732334 1790985 1850159 1909116 1966402 2019633
63033B019633M6313L6925K5870J3596J95j3906k7770m0491n1565o0633o7358p1756
$$ 2019633 2065946 2102871 2128741 2142337 2142532 2128626 2100856 2060365 2008800 1948167 1880809 1809053
63021A809053p4222p4963p3687p0278o5319n9545n3113m5976l8677l2001k5851
$$ 1809053 1734831 1659868 1586181 1515903 1450584 1391039 1337926 1291950 1253273 1221272 1195421
63010A195421j9293j2008m913J095O449J2206J8335K3566K6965K8897L0184L1010
$$ 1195421 1176128 1164120 1159207 1160302 1166751 1178957 1197292 1220858 1247823 1276720 1306904 1337914
62998A337914L1215L1120L1294L1698L1794L1513L1264L0882K9415K6425K2729
$$ 1337914 1369129 1400249 1431543 1463241 1495035 1526548 1557812 1588694 1618109 1644534 1667263
62987A667263J9082J4799Q611N56q030j6395k5055l4365m3409n0898n6504o0618
$$ 1667263 1686345 1701144 1709755 1710311 1702281 1685886 1660831 1626466 1583057 1532159 1475655 1415037
62975A415037o3323o4317o3553o1404n8247n4364n0106m5788m1473l7203l3218
$$ 1415037 1351714 1287397 1223844 1162440 1104193 1049829 999723 953935 912462 875259 842041
62964H42041k9722k6596k3713k1310j9604j8275j6760j5021j3610j2947j2850
$$ 842041 812319 785723 762010 740700 721096 702821 686061 671040 657430 644483 631633
62953F31633j2784j2350j1536j0685j0210j0164j0201j0047r838r737r566r051
$$ 631633 618849 606499 594963 584278 574068 563904 553703 543656 533818 524081 514515 505464
62941E05464q245p381o478n449m397l439k527j745j510j860j943r66M82R07j96
$$ 505464 497219 489838 483360 477911 473514 470075 467548 465803 464293 462433 460490 459524 460006 460913 460717
62926D60717j769k781l498m618n835o125n256m189l881m233m473m155l494k834
$$ 460717 458948 456167 452669 448051 442216 436091 430835 426646 422765 418532 414059 409904 406410 403576
62912D03576k213j609j290j544k109k324j972j604j734k080k031j558j094p35
$$ 403576 401363 399754 398464 396920 394811 392487 390515 388911 387177 385097 383066 381508 380414 379679
62898C79679j82N31R70J098J459K280K873K442J144n1l98Q1Q26J282J234R03O95
$$ 379679 379497 380028 380998 382096 383555 385835 388708 391150 392294 392243 391845 391926 392752 394034 395268 396171 396866
62881C96866P75R69J086J050P48K1r44j586j535r97m35m6J54Mp16j875k912l165
$$ 396866 397641 398610 399696 400746 401494 401515 400571 398985 397450 396453 396018 395972 396126 396130 395414 393539 390627 387462
62863C87462k349p72Q07J770K109K188K103J604P06r9m05l52j84J95R04J602J788
$$ 387462 385113 384341 385148 386918 389027 391215 393318 394922 395628 395529 395124 394772 394588 394783 395687 397289 399077
62846C99077J438R57O03L40J37K8p0l01o20q86j117j334j267n82N84J614K028
$$ 399077 400515 401472 402075 402415 402552 402580 402510 402209 401589 400703 399586 398252 396985 396403 396987 398601 400629
62829D00629J822J243N61J19K47Q92J549J735J509J429J986L075L995M112L576
$$ 400629 402451 403694 404255 404374 404621 405513 407062 408797 410306 411735 413721 416796 420791 424903 428479
62814D28479L192L420L834L899L916M588N818O712O927P241Q429J0128J1419J2033
$$ 428479 431671 435091 438925 442824 446740 451328 457146 463858 470785 478026 486455 496583 508002 520035
62800E20035J2424J2901J3405J3973J4800J5795J6733J7950K0254K3889K8084
$$ 520035 532459 545360 558765 572738 587538 603333 620066 638016 658270 682159 710243
62789G10243L2014L5835M0297M5672N1534N7472O3432O9370P5008Q0150Q4788
$$ 710243 742257 778092 818389 864061 915595 973067 1036499 1105869 1180877 1261027 1345815
62778A345815Q8769R1560R2571R1482Q8044Q1849P2604O0577M6436L0749J3887
$$ 1345815 1434584 1526144 1618715 1710197 1798241 1880090 1952694 2013271 2059707 2090456 2104343
62767B104343l537k0541l6201n0003o1606p0587p6785q0703q3156q4441q4193
$$ 2104343 2100806 2080265 2044064 1994061 1932455 1861868 1785083 1704380 1621224 1536783 1452590
62756A452590q2190p8914p5041p0715o5770o0540n5817n1891m8137m3894l9367
$$ 1452590 1370400 1291486 1216445 1145730 1079960 1019420 963603 911712 863575 819681 780314
62745G80314l5277l1817k8515k4981k1409j8228j5674j3800j2539j1571j0407
$$ 780314 745037 713220 684705 659724 638315 620087 604413 590613 578074 566503 556096
62734E56096q803o976n301l986l102k641k391j988j234j99J054K517L866M518
$$ 556096 547293 540317 535016 531030 527928 525287 522896 520908 519674 519475 520529 523046 526912 531430
62720E31430M407M364N296P181R309J1293J3239J5053J6364J7345J8992K2092
$$ 531430 535837 540201 545497 552678 561987 573280 586519 601572 617936 635281 654273 676365
62708F76365K6262L0444L4136L7726M1659M5822M9895N3967N8367O3019O7270
$$ 676365 702627 733071 767207 804933 846592 892414 942309 996276 1054643 1117662 1184932
62697A184932P0458P2301P2583P0792O6573O0352N2917M4290L3610K0480N964
$$ 1184932 1255390 1327691 1400274 1471066 1537639 1597991 1650908 1695198 1728808 1749288 1755252
62686A755252q270k1342l3263m3991n3166o0686o6752p1130p3073p2356o9905
$$ 1755252 1746982 1725640 1692377 1648386 1595220 1534534 1467782 1396652 1323579 1251223 1181318
62675A181318o6986o4070o0868n7162n3075m8671m3875l8904l4427l0926k8157
$$ 1181318 1114332 1050262 989394 932232 879157 830486 786611 747707 713280 682354 654197
62664F54197k5482k2728k0342j8626j7143j5294j3221j1621j0663r645q060o481
$$ 654197 628715 605987 585645 567019 549876 534582 521361 509740 499077 489432 481372 474891
62652D74891n898o446p248p437o827n741m614l843l612l707l706l346k602j603
$$ 474891 468993 462547 455299 447862 441035 435294 430680 426837 423225 419518 415812 412466 409864 408261
62638D08261o76j93j08Q4N28N30m86j856k333j751j139j157j318r81k88L88J100
$$ 408261 407585 407392 407284 407368 407896 408426 407940 406084 403751 402000 400861 399704 398386 397405 397117 397505 398605
62621C98605J923K472K469K372K851L899M940N595N933O187O602P410Q558R677
$$ 398605 400528 403000 405469 407841 410692 414591 419531 425126 431059 437246 443848 451258 459816 469493
62607D69493J0547J1425J2669J4360J6474J9110K2234K5544K8833L2223L5701
$$ 469493 480040 491465 504134 518494 534968 554078 576312 601856 630689 662912 698613
62596F98613L8838M1283M3182M4662M5245M4239M1450L7159L1675K5234J8057
$$ 698613 737451 778734 821916 866578 911823 956062 997512 1034671 1066346 1091580 1109637
62585A109637J0160J481p440j5498k2174k8136l3968l8859m1506m1986m1645m1232
$$ 1109637 1119797 1121278 1113838 1098340 1076166 1048030 1014062 975203 933697 891711 850066 808834
62573H08834m0212l8075l5335l2758l0424k8044k5708k3739k2152k0598j8690
$$ 808834 768622 730547 695212 662454 632030 603986 578278 554539 532387 511789 493099
62562D93099j6218j3303j0515q522p461o917o552o316n992n111l623k253j702
$$ 493099 476881 463578 453063 444541 437080 430163 423611 417295 411303 406192 402569 400316 398614
62549C98614j827j884j444o84O7P05J314J975K601K866K423J362L26n6K28P25
$$ 398614 396787 394903 393459 392775 392842 393547 394861 396836 399437 402303 404726 406088 406414 406358 406586 407311
62533D07311J214J965L208M647N749O427P182Q469J0211J2089J4078J6325J8706
$$ 407311 408525 410490 413698 418345 424094 430521 437703 446172 456383 468472 482550 498875 517581
62520E17581K0959K3240K6011K9268L2421L5077L7369L9204L9839L8858L6945
$$ 517581 538540 561780 587791 617059 649480 684557 721926 761130 800969 839827 876772
62509H76772L4957L2553K8562K2599J5413P744k52q273j5505k1315k5746k8927
$$ 876772 911729 944282 972844 995443 1010856 1018600 1018348 1010075 994570 973255 947509 918582
62497I18582l0726l1422l1956l2766l2815l0668k6456k1904j8387j5573j2337
$$ 918582 887856 856434 824478 791712 758897 728229 701773 679869 661482 645909 633572
62486F33572q448m791k106j43J873M318O952R365J1251J2367J2584J1975J0617
$$ 633572 625124 620333 618227 618084 619957 624275 631227 640592 651843 664210 676794 688769 699386
62473F99386Q352N157J671j200l395n816r117j2894j6384j9321k1591k2711k2433
$$ 699386 707738 712895 714566 713366 709971 704155 695038 682144 665760 646439 624848 602137 579704
62460E79704k1418k0493j9612j8344j6990j6158j5438j3734j0979q410o873n925
$$ 579704 558286 537793 518181 499837 482847 466689 451251 437517 426538 418128 411255 405330
62448D05330m970m204l870l454k422j057J27J189K373L394L861L950L997L759
$$ 405330 400360 396156 392286 388832 386410 385353 385480 386669 389042 392436 396297 400247 404244 408003
62434D08003K857J637R17R62J232J042n9k228n033p299p944p030n643m671m136
$$ 408003 410860 412497 413414 414376 415608 416650 416591 414363 409330 402031 394087 387057 381414 376743 372607
62419C72607l657l061k484k157k279k819l430l743l604l029k134j345j276j983
$$ 372607 368950 365889 363405 361248 358969 356150 352720 348977 345373 342344 340210 338865 337589 335606
62405C35606k538k001o48K12j86j163j421m26J144K182K192J646J386J681K040
$$ 335606 333068 331067 330419 330631 330445 329282 327861 327435 328579 330761 332953 334599 335985 337666 339706
62390C39706J957J605J572K126L029L869M317M193L671L371L891N213O681P636
$$ 339706 341663 343268 344840 346966 349995 353864 358181 362374 366045 369416 373307 378520 385201 392837
62376C92837Q012Q384R432J1148J2593J2836J2154J1819J2502J3610J4592J6116
$$ 392837 400849 409233 418665 429813 442406 455242 467396 479215 491717 505327 519919 536035
62364E36035J9076K3028K6692K9781L3245L7589M2092M6014M9606N3265N6386
$$ 536035 555111 578139 604831 634612 667857 705446 747538 793552 843158 896423 952809
62353I52809N7789N6934N4028M9216M2368L3695K4013J4245M925l705j1390j7904
$$ 952809 1010598 1067532 1121560 1170776 1213144 1246839 1270852 1285097 1290022 1286317 1274927 1257023
62341A257023k3386k8394l3407l8279m2283m4824m5883m5719m4345m1669l7930
$$ 1257023 1233637 1205243 1171836 1133557 1091274 1046450 1000567 954848 910503 868834 830904
62330H30904l3731k9640k6010k3049k0728j8768j7029j5833j5529j5833j6062
$$ 830904 797173 767533 741523 718474 697746 678978 661949 646116 630587 614754 598692
62319E98692j5888j5432j4755j3909j3366j3614j4118j3564j1521r210q010p850
$$ 598692 582804 567372 552617 538708 525342 511728 497610 484046 472525 463315 455305 447455
62307D47455p682p008o171n469m829m264l940l710l179k259j222j88Q51J560J405
$$ 447455 439773 432765 426594 421125 416296 412032 408092 404382 401203 398944 397722 397534 398385 399945 401350
62292D01350N30j30Q2P88J241J359J691K548L631M435M711M561M272M081L978
$$ 401350 401880 401750 401832 402620 403861 405220 406911 409459 413090 417525 422236 426797 431069 435150 439128
62277D39128L796L599L787M608N705O477O860P451Q800J0767J2712J4224J5568
$$ 439128 442924 446523 450310 454918 460623 467100 473960 481411 490211 500978 513690 527914 543482
62264E43482J7429K0279K3920K7769L1560L5656M0529M6088N1724N6863O1099
$$ 543482 560911 581190 605110 632879 664439 700095 740624 786712 838436 895299 956398
62253I56398O3903O4609O2999N9457N4345M7457L8569K8291J7964Q669O25o489
$$ 956398 1020301 1084910 1147909 1207366 1261711 1309168 1347737 1376028 1393992 1402661 1403286 1396797
62241A396797j3123j9857k7261l5255m2787m8553n2106n4005n4872n4645n2921
$$ 1396797 1383674 1363817 1336556 1301301 1258514 1209961 1157855 1103850 1048978 994333 941412
62230I41412m9865m6384m3330m0633l7510l3527k9302k5924k3711k1902j9651
$$ 941412 891547 845163 801833 761200 723690 690163 660861 634937 611226 589324 569673
62219E69673j7096j5144j4247j3791j2816j1138r414q243p476o571n375m282l696
$$ 569673 552577 537433 523186 509395 496579 485441 476027 467784 460308 453737 448362 444080 440384
62206D40384l562l423k839j737n24K21L71N10J353K845M238N109N864P011Q353
$$ 440384 436822 433399 430560 428823 428299 428520 428891 429401 430754 433599 437837 442946 448810 455821 464174
62191D64174R353R923J0348J0593J0364R809R574R994J0703J1144J1084J0442
$$ 464174 473527 483450 493798 504391 514755 524564 534138 544132 554835 565979 577063 587505
62179E87505R138P407N849M839M225L911M378O140Q937J2051J5373J9589K5112
$$ 587505 596643 604050 609899 614738 618963 622874 627252 633392 642329 654380 669753 689342 714454
62166G14454L1215L6619M0718M3812M6071M6714M4665L9845L3401K6525J9527
$$ 714454 745669 782288 823006 866818 912889 959603 1004268 1044113 1077514 1104039 1123566
62155A123566J2285N149j254o770j1784j6564k1068k5304k9258l2506l4494l5243
$$ 1123566 1135851 1141000 1139746 1132976 1121192 1104628 1083560 1058256 1028998 996492 961998 926755
62143I26755l5188l4298l2177k9099k6062k3436k0450j6508j2250q610n617k906
$$ 926755 891567 857269 825092 795993 769931 746495 726045 709537 697287 688677 683060 680154
62131F80154p79K16L96O51J255J856K445L351M343M697M317L998M309M927N299
$$ 680154 679375 679591 679987 680638 681893 683749 686194 689545 693888 698585 702902 706900 711209 716136 721435
62116G21435N255M764L669K045L71j029k300l616m819n680o174o319o046n367
$$ 721435 726690 731454 735123 737168 737539 736510 734210 730594 725775 720095 713921 707602 701556 696189
62102F96189m385l066j364L71J583K292L143M551O156P349P908P900P423O712
$$ 696189 691804 688738 687374 687745 689328 691620 694763 699314 705470 712819 720727 728627 736050 742762
62088G42762O221O201O478O854P403Q219R154J0099J1184J2531J4035J5633J7388
$$ 742762 748983 755184 761662 768516 775919 784138 793292 803391 814575 827106 841141 856774 874162
62075H74162J9106K0249K0558K0455K0451K0477K0195J9747J9737K0544K2028
$$ 874162 893268 913517 934075 954530 974981 995458 1015653 1035400 1055137 1075681 1097709
62064A097709K3829K5617K7026K7618K6988K4912K1481J7156J2484P690K790j901
$$ 1097709 1121538 1147155 1174181 1201799 1228787 1253699 1275180 1292336 1304820 1312510 1315300 1313399
62052A313399n764q698j1540j5230j9792k4484k8704l2292l5116l6880l7503l7271
$$ 1313399 1307635 1298937 1287397 1272167 1252375 1227891 1199187 1166895 1131779 1094899 1057396 1020125
62040A020125l6535l5463l4079l2253k9691k6212k2190j8379j5203j2390r426
$$ 1020125 983590 948127 914048 881795 852104 825892 803702 785323 770120 757730 748304
62029G48304o210l152p28Q45J648J861J639J027J8j310k692l793m438m730m911
$$ 748304 742094 738942 738214 739059 740707 742568 744207 745234 745252 743942 741250 737457 733019 728289 723378
62014G23378n169n572o068o491o651o556o422o309n894m897l644k731k187j499
$$ 723378 718209 712637 706569 700078 693427 686871 680449 674140 668246 663349 659705 656974 654787 653288
62000F53288o67m69j297k359k745k788l494m984o416p337q143r121j0048j0860
$$ 653288 652621 652152 650855 648496 645751 642963 639469 634485 628069 620732 612589 603468 593420 582560
61986E82560j1818j2709j2791j2008j1336j1335j1176r828p583n583m280l311
$$ 582560 570742 558033 545242 533234 521898 510563 499387 489559 481976 476393 472113 468802
61974D68802k510k154k275k521k678k737k488j701o92p8R7L99J083J650J583R97
$$ 468802 466292 464138 461863 459342 456664 453927 451439 449738 449046 448968 449065 449464 450547 452197 453780 454777
61958D54777L98R3J34N62J436K721M274N889P337Q495R438J0348J1417J2847J4801
$$ 454777 455175 455268 455402 455964 457400 460121 464395 470284 477621 486116 495554 505902 517319 530166 544967
61943E44967J7160J9567K1825K4117K6612K9071L1001L2049L2069L1095K9554
$$ 544967 562127 581694 603519 627636 654248 683319 714320 746369 778438 809533 839087
61932H39087K8190K7361K6575K5134K3022K0766J8486J5657J1875P423L026p48
$$ 839087 867277 894638 921213 946347 969369 990135 1008621 1024278 1036153 1043576 1046602 1045854
61920A045854l725o031p733q518p829n507k097J667N477R343J3239J7127K0993
$$ 1045854 1042129 1036098 1028365 1019847 1012018 1006511 1004414 1006081 1011558 1020901 1034140 1051267 1072260
61907A072260K4377K6287K6105K4314K1692J8087J2751N778j633q400j4329j9500
$$ 1072260 1096637 1122924 1149029 1173343 1195035 1213122 1225873 1231651 1230018 1221618 1207289 1187789
61895A187789k3726k6897k9280l1035l1875l1463k9892k7622k5293k3631k3009
$$ 1187789 1164063 1137166 1107886 1076851 1044976 1013513 983621 955999 930706 907075 884066
61884H84066k2926k2423k1146j9625j8357j7297j6423j6116j6489j6853j6349
$$ 884066 861140 838717 817571 797946 779589 762292 745869 729753 713264 696411 680062
61873F80062j4819j2663j0272q019o445n809n602m958l539j636M17K644N255Q329
$$ 680062 665243 652580 642308 634289 627844 622035 616433 611475 607936 606300 606717 609361 614616 622945
61859F22945J1653J4814J7569K0194K3204K6688L0292L3920L7856M1963M5274
$$ 622945 634598 649412 666981 687175 710379 737067 767359 801279 839135 881098 926372
61848I26372M6909M7016M6349M5188M3170L9889L5096K8559K0324J1189K335n540
$$ 926372 973281 1020297 1066646 1111834 1155004 1194893 1229989 1258548 1278872 1290061 1292396 1286856
61836A286856j2362j7982k1817k3292k2377j9545j5367j0212m250K301Q901J4835
$$ 1286856 1274494 1256512 1234695 1211403 1189026 1169481 1154114 1143902 1139652 1141953 1150854 1165689
61824A165689J9647K3106K4690K3605J9697J3791O678j719j1490k1495k9961l6317
$$ 1165689 1185336 1208442 1233132 1256737 1276434 1290225 1296903 1295184 1283694 1262199 1232238 1195921
61812A195921m1406m5743m8478m8649m6718m4141m1782l9395l6470l2945k9131
$$ 1195921 1154515 1108772 1060294 1011645 964927 920786 879004 839609 803139 770194 741063
61801G41063k5338k1817j8782j6352j4504j3116j2010j0985r825q419o910n797
$$ 741063 715725 693908 675126 658774 644270 631154 619144 608159 598334 589915 583005 577208
61789E77208n576o075o375n778m753m488n384o504o653n635m250l335l158l473
$$ 577208 571632 565557 559182 553404 548651 544163 538779 532275 525622 519987 515737 512402 509244 505771
61775E05771l837l952l833l594l100k129j003n64j181k165k525k088j440r75n81
$$ 505771 501934 497982 494149 490555 487455 485326 484323 483759 482578 480413 477888 475800 474360 473385 472804
61760D72804j50J79L88P12J198J532J499J318J280J309J139P31K50k52q80j639
$$ 472804 472654 472833 473221 473933 475131 476663 478162 479480 480760 482069 483208 483939 484189 483937 483057 481418
61744D81418k350k852l119l187l089k898k737k715k823k884k661k111j497j147
$$ 481418 479068 476216 473097 469910 466821 463923 461186 458471 455648 452764 450103 447992 446495 445348
61730D45348j020o82J84J305K056K159J970K004K366K688K646K316K045K050K242
$$ 445348 444328 443646 443830 445135 447191 449350 451320 453324 455690 458378 461024 463340 465385 467435 469677
61715D69677K378K254J747Q51k44j207j840k302k930l818m670n089m941m396l746
$$ 469677 472055 474309 476056 476907 476663 475456 473616 471314 468384 464566 459896 454807 449866 445470 441724
61700D41724l224k924k826k905l225l759m166l980l163k326k159k729l474l852
$$ 441724 438500 435576 432750 429845 426620 422861 418695 414715 411552 409226 407067 404338 400864 397012
61686C97012l782l516l294l216l268l379l482l513l363k870k055j241q15q51j136
$$ 397012 393230 389714 386420 383204 379936 376557 373075 369562 366199 363329 361274 360033 359218 358367 357231
61671C57231j454j657j492p57K57Q33N28l48j157j598j697j433p49J64R17J300
$$ 357231 355777 354120 352628 351871 352128 352961 353489 353141 351984 350386 348689 347256 346507 346671 347588 348888
61655C48888J367J230J034J103J701K569L110L174L322M015M913N342N246N167
$$ 348888 350255 351485 352519 353622 355323 357892 361002 364176 367498 371513 376426 381768 387014 392181
61641C92181N343N290M466K977J397J08r22j893k919m010n032n692n863n852o138
$$ 392181 397524 402814 407280 410257 411654 411762 410840 408947 406028 402018 396986 391294 385431 379579 373441
61626C73441o670o711n638l738j971r80o43n23l83j11M08J042J191K78j528l389
$$ 373441 366771 360060 354422 350684 348713 347733 347090 346567 346184 346073 346481 347523 348714 348992 347464 344075
61610C44075m607n120n131m744m137l788m114m907n457n310m675m086l830l768
$$ 344075 339468 334348 329217 324473 320336 316548 312434 307527 302070 296760 292085 287999 284169 280401
61596B80401l584l117k567k364k642k920k608j857j495j934k518k377j586r25
$$ 280401 276817 273700 271133 268769 266127 263207 260599 258742 257247 255313 252795 250418 248832 247907
61582B47907p07n10j18J4m81j201j497j272q29k92L08O20L21k54m52k37k18o06
$$ 247907 247200 246690 246572 246586 246105 244904 243407 242135 241306 241014 241322 241942 242263 242009 241557 241320 241102 240496
61564B40496q16l75L18N44K28o5N7M38P35Q34R15J179J605J954K108K235K409
$$ 240496 239680 239305 239623 240167 240395 240330 240387 240825 241560 242394 243309 244488 246093 248047 250155 252390 254799
61547B54799K264J432L27j12L36Q22O76M13Q78J876K418K179J909K255K878K981
$$ 254799 257063 258495 258822 258710 259046 259868 260544 260957 261835 263711 266129 268308 270217 272472 275350 278331
61531B78331K278J148P4p35j322j794k113k058j517p45k16k00o17j199j595j487
$$ 278331 280609 281757 281831 281096 279774 277980 275867 273809 272292 271547 271331 271131 270514 269315 267720 266233
61515B66233q12N3O28P92P34N83L33N8j34l23o90j229j781k195k164j184P32K468
$$ 266233 265421 265474 266102 266894 267628 268211 268544 268602 268468 268145 267455 266226 264445 262250 260086 258902 259634 262102
61497B62102K692J426R1j92K88O59P12P90J003J187J336J463J279N24m32q59m90
$$ 262102 264794 266220 266311 266119 266407 267066 267778 268568 269571 270758 272094 273557 274836 275360 274928 274069 273579
61480B73579K81R82J390J358Q20R4k34M1M55M73J70Q9N20J136J350R43K00m55
$$ 273579 273860 274842 276232 277590 278410 278504 278270 278311 278766 279239 279409 279498 280018 281154 282504 283447 283647 283192
61462B83192q51j021j002q10n37k37K33J017J870K293K037J337N92J32K05P81
$$ 283192 282341 281320 280318 279508 278971 278734 278967 279984 281854 284147 286184 287521 288113 288245 288450 289231
61446B89231J343J325R29R42J572K054J772J210J134J429J500J471K043L217M113
$$ 289231 290574 291899 292828 293770 295342 297396 299168 300378 301512 302941 304441 305912 307955 311172 315285
61431C15285M191L889L764L727L478L107K828K560K227K144K573L154L268K843
$$ 315285 319476 323365 327129 330856 334334 337441 340269 342829 345056 347200 349773 352927 356195 359038
61417C59038K418K430K775L040K838J988P04m02q51r49j571l044m548m983m281
$$ 359038 361456 363886 366661 369701 372539 374527 375231 374829 373978 373029 371458 368414 363866 358883 354602
61402C54602l510l528m009m069l529l048l049l168k973k628k454k232j577p42
$$ 354602 351092 347564 343555 339486 335957 332909 329860 326692 323719 321091 318637 316405 314828 314086
61388C14086l67n15n80k52R6J22J2Ml4j92j59L17R66J375J555J732J890J962K116
$$ 314086 313719 313204 312624 312372 312468 312590 312602 312606 312572 312380 312221 312538 313504 314879 316434 318166 320056 322018 324134
61369C24134K376K315J650R26R07J515K074K446L121M105M587M047L055K532K785
$$ 324134 326510 328825 330475 331401 332308 333823 335897 338343 341464 345569 350156 354203 357258 359790 362575
61354C62575L575M617N628O378P137Q542J0491J1699J1061R110P399O616O164
$$ 362575 366150 370767 376395 382773 389910 398452 408943 420642 431703 440813 448212 454828 460992
61341D60992N518N103N477O323O747O231N025L781K971K502J769L06j612l269
$$ 460992 466510 471613 477090 483413 490160 496391 501416 505197 508168 510670 512439 512745 511133 507864
61327E07864m332n022n536n804n915o153o411o070m851l369k443k169k067j764
$$ 507864 503532 498510 492974 487170 481255 475102 468691 462621 457770 454401 451958 449789 447722 445958
61313D45958j169k76P50J532J924K325L149M292N523P037Q917J0351J0197Q382
$$ 445958 444789 444513 445263 446795 448719 451044 454193 458485 464008 471045 479962 490313 500510 508892
61299E08892O027M011K147kk186l838m913n756o397o528o109n606n510n847o229
$$ 508892 514919 518930 521077 521075 518889 515051 510138 504382 497985 491457 485348 479742 474232 468385 462156
61284D62156o244n789n063m306l556k759j920j030Q8J577L156M250M639M776N287
$$ 462156 455912 450123 445060 440754 437198 434439 432519 431489 431577 433154 436310 440560 445199 449975 455262
61269D55262O213O955O909O101N176M737M829N206N995P651J0097J2416J3786
$$ 455262 461475 468430 475339 481440 486616 491353 496182 501388 507383 515034 525131 537547 551333
61256E51333J4320J4477J4041J2480J0079P894O441N262L891K451J033p18k935
$$ 551333 565653 580130 594171 606651 616730 624624 631065 636327 640218 642669 643702 642984 640049
61243F40049n073o642p835q944r699r762r446r290r271q990q410p766p031o041
$$ 640049 634976 628334 620499 611555 601856 592094 582648 573358 564087 555097 546687 538921 531890 525849
61229E25849m925l888k732j143O14J849K125J449L4j544k307j698l11Q78J794
$$ 525849 520924 517036 514304 513161 513775 515624 517749 519198 519232 517688 515381 513683 513372 514250 516044
61214E16044K956M109M281L327K352K106J967J114r4p70q54q81p20L09K138L742
$$ 516044 519000 523109 527390 530717 533069 535175 537142 538256 538162 537392 536538 535657 534937 535246 537384 541126
61198E41126M559N435P565J0998J4601J7253J8593J8720J7750J5884J3573J1288
$$ 541126 545685 551120 558685 569683 584284 601537 620130 638850 656600 672484 686057 697345
61186F97345R248P483O066M966L876K529J190M42L65L59o6p92j623k771m301n550
$$ 697345 706593 714076 720142 725108 728984 731513 732703 733145 733510 733869 733803 733011 731388 728617 724316 718766
61170G18766n872n738o268p625q716q754q355q634r778j1100j2109j2777j2998
$$ 718766 712894 707156 700888 693263 684547 675793 667438 658804 649026 637926 625817 613040 600042
61157F00042j2456j1201r810q705p671o281m585l038j850p57L80J033M35j488
$$ 600042 587586 576385 566575 557870 550199 543918 539333 536295 534445 533688 534068 535101 535536 534048
61143E34048l919n971p467q668r597j0018r906r443q600p213n464l836k462r84
$$ 534048 530129 524158 516691 508023 498426 488408 478502 469059 460459 453246 447782 443946 441484 440500
61129D40500O48J842K176K262L181N188P463R174J0393J1813J3806J5999J7664
$$ 440500 441148 442990 445166 447428 450609 455797 463260 472434 482827 494640 508446 524445 542109
61116E42109J8449J8688J8977J9521J9975K0035J9862J9791J9767J9350J8272
$$ 542109 560558 579246 598223 617744 637719 657754 677616 697407 717174 736524 754796
61105G54796J6715J5017J3385J1919J0640R272P187L881m46n009r048j2210j4417
$$ 754796 771511 786528 799913 811832 822472 831744 838931 842812 842366 837357 828309 816099 801682
61092H01682j5769j6726j7995j9895k1849k2925k2833k2121k1414k0809k0103
$$ 801682 785913 769187 751192 731297 709448 686523 663690 641569 620155 599346 579243
61081E79243j9178j7971j6412j4702j3332j2507j1825j0791r481q361p625p091
$$ 579243 560065 542094 525682 510980 497648 485141 473316 462525 453044 444683 437058 429967
61069D29967o555n861m823l499k388j875j599q90K78J328K046K801L710M246M040
$$ 429967 423412 417551 412728 409229 406841 404966 403367 402477 402755 404083 406129 408930 412640 416886 420926
61054D20926L548L494M041M845N633O430P394Q689J0260J1701J2622J3297J4449
$$ 420926 424474 427968 432009 436854 442487 448917 456311 465000 475260 486961 499583 512880 527329
61041E27329J6225J7917J8948J9551K0029K0004J9116J8050J7950J8882J9681
$$ 527329 543554 561471 580419 599970 619999 640003 659119 677169 695119 714001 733682
61030G33682J9487J8855J9006K0336K1951K2653K2272K2037K3475K7019L2012
$$ 733682 753169 772024 791030 811366 833317 855970 878242 900279 923754 950773 982785
61019I82785L8049M5687N5633O8104Q3695J04105J31074J65016K05330K50068
$$ 982785 1020834 1066521 1122154 1190258 1273953 1378058 1509132 1674148 1879478 2129546
61009B129546K91936L14791K99173K36964J41970M4127k8141o1049n5206j9230
$$ 2129546 2421482 2736273 3035446 3272410 3414380 3458507 3430366 3369317 3314111 3294881
60999C294881L2365P7792R2127N9424j6424j12693k00627k59779k84242k79683
$$ 3294881 3327246 3405038 3497165 3556589 3540165 3427472 3226845 2967066 2682824 2403141
60989B403141k56594k24975j91847j60739j32544j07163q4839o6165n1239l9350
$$ 2403141 2146547 1921572 1729725 1568986 1436442 1329279 1244440 1178275 1127036 1087686
60979A087686k9564k1391j4690r229m541k00L946P747J0900J3218J4800J5909
$$ 1087686 1058122 1036731 1022041 1012812 1008271 1008071 1012017 1019764 1030664 1043882 1058682 1074591
60967A074591J6583J6562J5643J3925J1610Q712N177J160l071p322j1366j4799
$$ 1074591 1091174 1107736 1123379 1137304 1148914 1157626 1162803 1163963 1160892 1153570 1142204 1127405
60955A127405j7317j9069k0347k1037k0849k0084j9541j9448j9070j7816j6315
$$ 1127405 1110088 1091019 1070672 1049635 1028786 1008702 989161 969713 950643 932827 916512
60944I16512j5742j6309j7040j7085j6678j6637j7358j8528j9605k0318k0723
$$ 916512 900770 884461 867421 850336 833658 817021 799663 781135 761530 741212 720489
60933G20489k0977k1089k0949k0541j9989j9306j8313j7011j5756j4772j3654
$$ 720489 699512 678423 657474 636933 616944 597638 579325 562314 546558 531786 518132
60922E18132j1872r681q033p402p178o439n021l506k408j706j059k17P84J620
$$ 518132 506260 496579 488546 481144 473966 467527 462506 459000 456592 454886 453827 453610 454394 456014
60908D56014J937J765J629K055L012L955M473M654M789M948N079N340N909O388
$$ 456014 457951 459716 461345 463400 466412 470367 474840 479494 484283 489231 494310 499650 505559 511947
60894E11947N910M171K069P30R1q80k582m171m872n049n397n769n624n162n059
$$ 511947 517857 522028 524097 524827 524918 524038 521456 517285 512413 507364 501967 496198 490574 485412 480353
60879D80353n289n200m738m657n313o110o462o477o401o020n224m493m313m441
$$ 480353 475064 469864 465126 460469 455156 449046 442584 436107 429706 423686 418462 413969 409656 405215
60865D05215m312l849l384l045k708k379k195k100j908j569j225j037j156j608
$$ 405215 400903 397054 393670 390625 387917 385538 383343 381243 379335 377766 376541 375504 374348 372740
60851C72740k093k125j631j076p62l41O41J952K895L134K904K533K054J306K01
$$ 372740 370647 368522 366891 365815 365053 364712 365353 367305 370200 373334 376238 378771 380825 382131 382332
60836C82332j127k275k776k477j643o62K23Q56J218J517J966K372K380K096K017
$$ 382332 381205 378930 376154 373677 372034 371372 371595 372451 373669 375186 377152 379524 381904 384000 386017
60821C86017K182K051J451R73J054J218Q48J21m17p44j175j581j595j299j096
$$ 386017 388199 390250 391701 392674 393728 394946 395794 395915 395498 394754 393579 391998 390403 389104 388008
60806C88008j037q92p56r02j257j536j759k050k135j736j272j460k284l067l489
$$ 388008 386971 386079 385323 384421 383164 381628 379869 377819 375684 373948 372676 371216 368932 365865 362376
60791C62376l804m105m154m002m025m202m091l611l142k759k138j340q86p78l52
$$ 362376 358572 354467 350313 346311 342286 338084 333993 330382 327240 324481 322343 321003 320117 319339 318987
60776C18987N64J175R11K79j5o2j47J44J367L107M294M431L836K927J970J397
$$ 318987 319551 320726 321637 321916 321901 321839 321692 321836 323203 326310 330604 335035 338871 341798 343768 345165
60760C45165J575K187K433K012J437J262J477J819K263K890L507L694L204K236
$$ 345165 346740 348927 351360 353372 354809 356071 357548 359367 361630 364520 368027 371721 374925 377161
60746C77161J250N57J36j80m43q02j752l723o203p855p897p047o657p132p668
$$ 377161 378411 378968 379104 378924 378481 377679 375927 372204 366001 358146 350249 343202 336545 329413 321745
60731C21745p423o365n042l955l319l035k742k146j396r20q54r10q33o73n40l82
$$ 321745 314322 307957 302915 298960 295641 292606 289864 287718 286322 285402 284548 283638 282805 282132 281592 281210
60715B81210j47P9K10K16k9o43j342j522j007l77k48m53l81J15O47J034J489J999
$$ 281210 281063 281142 281352 281568 281539 280896 279554 278032 277025 276648 276400 275947 275566 275681 276328 277362 278851 280850
60697B80850K127J721J289J333J698K081K716L903N072N195M203L265L373M187
$$ 280850 282977 284698 285987 287320 289018 291099 293815 297718 302790 307985 312188 315453 318826 323013
60683C23013M750M751M573M457M229L793L322K903K416J845J389J108P00k20j659
$$ 323013 327763 332514 337087 341544 345773 349566 352888 355791 358207 360052 361441 362549 363249 363029 361370
60668C61370l148m119m357m106l702l173k459j868j964k818l734l979l509k728
$$ 361370 358222 354103 349746 345640 341938 338765 336306 334438 332474 329656 325922 321943 318434 315706
60654C15706j858r26r4M73R08J482K152K595K550J954Q64m12j403j978k564l381
$$ 315706 313848 312922 312828 313301 314209 315691 317843 320438 322988 324942 325806 325394 323991 322013 319449 316068
60638C16068l892l552k839k752l408l916l655k882k033j163m24k34n57o79j53
$$ 316068 312176 308624 305785 303033 299625 295709 292054 289172 287139 285976 285552 285318 284761 284082 283929
60623B83929N31P01M36K57K87K88K59L93O03O03L96K44K33J91M4r7j32n0J90N32
$$ 283929 284460 285161 285597 285854 286141 286429 286688 287081 287684 288287 288683 288927 289160 289351 289395 289298 289166 289116 289306 289838
60603B89838P28N26P2j44K04R63J626J778J400P85J82l56p08n59J81R75J130O43
$$ 289838 290566 291092 291164 291020 291224 292187 293813 295591 296991 297776 297958 297602 296894 296335 296516 297491 298621 299264
60585B99264J94K92Q81J683K416K668K243J801K380L954N268N578N769O931Q556
$$ 299264 299458 299750 300631 302314 304730 307398 309641 311442 313822 317776 323044 328622 334391 341322 349878
60570C49878R212Q658Q078Q125P873O148L141J07k109l598m698n332n172m193
$$ 349878 359090 367748 375826 383951 391824 397972 401113 401220 399111 395513 390815 385483 380311 376118
60556C76118k852j648o42M95J890L202M111M865N993P576R186J0506J1656J2784
$$ 376118 373266 371618 370976 371471 373361 376563 380674 385539 391532 399108 408294 418800 430456 443240
60542D43240J3667J3889J3225J1640R077N585J655j795m018n033n501n970o342
$$ 443240 456907 470796 484021 495661 504738 510323 511978 510183 506165 501132 495631 489661 483319
60529D83319o204n486m507l555k688j998j627j459j181p68n48n27j00J190K853
$$ 483319 477115 471629 467122 463567 460879 458881 457254 455795 454614 453846 453298 452771 452671 453861 456714
60514D56714L953M226M328N003O384Q180J0178J2468J5291J8801K2871K7115L1125
$$ 456714 460667 464893 469221 474224 480608 488788 498966 511434 526725 545526 568397 595512 626637
60501F26637L4608L7427L9541M0867M0819L8242L2279K3520J3618L574p010j8477
$$ 626637 661245 698672 738213 779080 819899 858141 890420 913940 927558 931132 924122 905645
60489I05645k9615l8405m3891m6484m6670m4506m0539l6181l2547k9477k6178
$$ 905645 876030 837625 793734 747250 700580 656074 615535 579354 546807 517330 491152
60478D91152k2460j8843j5798j3438j1801j0879j0293r351p709n839m586m265
$$ 491152 468692 449849 434051 420613 408812 397933 387640 378289 370580 364741 360155 355890
60466C55890m329m030l298k741k802l170l190k636j908j540j696k048k059j552
$$ 355890 351561 347531 344233 341492 338690 335520 332330 329694 327786 326246 324550 322502 320443 318891
60452C18891j015j143j900k411k039j166n64l61k08j43n09j081j036n6J120J550
$$ 318891 317876 316733 314833 312422 310383 309217 308653 308292 308084 307941 307432 306351 305315 305259 306379 307929
60436C07929J082K50l82n21j81K05jj006k282l089l075k296j028K10Q44Q60R62
$$ 307929 309011 309261 308879 308358 308177 308382 308381 307375 305093 302004 298929 296633 295605 295815 296659 297519 298481
60419B98481J685K590K748J916P56n4m20n40m89l19j29R8M81Q89R64O80N52R61
$$ 298481 300166 302756 305504 307420 308176 308122 307702 307162 306673 306354 306225 306323 306804 307693 308657 309337 309889 310850
60401C10850J565J779J623J594J805J836J548J495K146L069L348K700J759J253
$$ 310850 312415 314194 315817 317411 319216 321052 322600 324095 326241 329310 332658 335358 337117 338370
60387C38370J225J210J001R88J658K742L233K516J346J112K071K919K491J253
$$ 338370 339595 340805 341806 342794 344452 347194 350427 352943 354289 355401 357472 360391 362882 364135
60373C64135N71Q71J400J487J237R30N56J58k7J8Q8K71R25J922K616K759K893
$$ 364135 364706 365577 366977 368464 369701 370631 371187 371345 371318 371336 371424 371695 372620 374542 377158 379917 382810
60356C82810L496M333M976N364N423M786L381J814O01m46j572k414k633k657l032
$$ 382810 386306 390639 395615 400979 406402 411188 414569 416383 416984 416538 414966 412552 409919 407262 404230
60341D04230l376k903j776j030j221j881k316k290j877j224o15l51n06j048j972
$$ 404230 400854 397951 396175 395145 393924 392043 389727 387437 385560 384336 383721 383370 382864 381816 379844
60326C79844k917l028j868k62M74L6p25r83n34N99K275L903M807N078N482O412
$$ 379844 376927 373899 372031 371769 372243 372279 371554 370571 370037 370636 372911 376814 381621 386699 392181 398593
60310C98593P592Q784J0033J1049J1184J0215Q555O501L998J185j591m448p728
$$ 398593 406185 414969 425002 436051 447235 457450 466005 472506 476504 477689 476098 471650 463922
60297D63922j0837j2401j2000j0784r738q416o182l786k460k098j566n24K64L71
$$ 463922 453085 440684 428684 417900 408162 399746 393564 389778 387318 385220 383654 383130 383394 383765
60283C83765L39O19Q45N90J46K1J25q8q06j593j931j797j625j749k008k063j989
$$ 383765 384104 384723 385568 386158 386304 386325 386450 386362 385556 383963 382032 380235 378610 376861 374853 372790 370801
60266C70801k174k573k472j348L09J424J482R18M24J92q3o41j256j373p76J8K83
$$ 370801 368627 366054 363582 362234 362543 363967 365449 366367 366791 366983 366900 366259 365003 363630 362854 362872 363155
60249C63155l6l05j49O9o5l31l08j08j58m51n52k93P5M16R49J768K502K700K349
$$ 363155 363119 362814 362665 362734 362669 362338 362030 361922 361764 361313 360761 360468 360543 360959 361908 363676 366178 368878 371227
60230C71227J863J623J705J964K242K395K198J514O25J87N99J530K393L084L834
$$ 371227 373090 374713 376418 378382 380624 383019 385217 386731 387356 387543 388142 389672 392065 395149 398983
60215C98983M449M355L523K734K623K967L250L440L775M173M356M312M198M072
$$ 398983 403432 407787 411310 414044 416667 419634 422884 426324 430099 434272 438628 442940 447138 451210
60201D51210L998M177M573M724M311L601K969K351J653J198J235J369J185J002
$$ 451210 455208 459385 463958 468682 472993 476594 479563 481914 483567 484765 486000 487369 488554 489556
60187D89556J199J213K24j322k097j815j627k261k997l063k961l468m140l898
$$ 489556 490755 491968 492192 490870 488773 486958 485331 483070 480073 477010 474049 470581 466441 462543
60173D62543k705j600j236j269j196j002q25o57n94q19j156j113n98q7J13L66
$$ 462543 459838 458238 457002 455733 454537 453535 452710 452053 451459 450640 449484 448371 447773 447686 447799 448165
60157D48165J072J941K313J987J330P24L23K59N80R81J071J004J398K444L495
$$ 448165 449237 451178 453491 455478 456808 457532 457855 458114 458694 459675 460746 461750 463148 465592 469087
60142D69087L888L829M030M737N479N720N253M090K475J062N43Q63J216J052O89
$$ 469087 472975 476804 480834 485571 491050 496770 502023 506113 508588 509650 510193 511056 512272 513324 514013
60127E14013O34P22M46j56n28m85m91r51j633k006j864j321m73O24J709K310K093
$$ 514013 514647 515369 515815 515659 515131 514646 514155 513204 511571 509565 507701 506380 505907 506531 508240 510550 512643
60110E12643J153j5p81p20M0Q02P97q7j168j682j553j281j157r25l56K39M42L31
$$ 512643 513796 513781 513000 512280 512320 513122 513919 513832 512664 510982 509429 508148 506991 506066 505710 505949 506391 506722
60092E06722K98L92L37J85L62R20J231P91n8n36l65P8L39L21K33L79Q90J379J023
$$ 506722 507020 507412 507749 507934 508296 509216 510447 511238 511180 510644 510279 510357 510696 511017 511250 511629 512519 513898 514921
60073E14921o24k973m860n679n780n740n680n483n325n616o384p042o867n761
$$ 514921 514297 511324 506464 500785 495005 489265 483585 478102 472777 467161 460777 453735 446868 441107
60059D41107m403l651l720m086m124l695l040k291j344j83R26J679K038K256K588
$$ 441107 436704 433053 429333 425247 421123 417428 414388 412097 410753 410570 411496 413175 415213 417469 420057
60044D20057L035L350L328L109L136L653M307M401L613K365J403J073J127J118
$$ 420057 423092 426442 429770 432879 436015 439668 443975 448376 451989 454354 455757 456830 457957 459075
60030D59075P76l1j282k604l366l359l252l860m981n525m948l952l489l651m042
$$ 459075 459851 459820 458538 455934 452568 449209 445957 442097 437116 431591 426643 422691 419202 415551 411509
60015D11509m649n609o493o674o255n795n263m158k678j751j668j640j152q27
$$ 411509 406860 401251 394758 388084 381829 376034 370771 366613 363935 362184 360516 358876 357724 356897
60001C56897j306k021j931r50P6N73O88P46Q73J114J416J658J953K652L729M470
$$ 356897 355591 353570 351639 350689 350765 351338 352026 352772 353645 354759 356175 357833 359786 362438 366167 370637
59985C70637M223L169J929Q52J52K39J124J865J442M2j289k068k574k819k430
$$ 370637 374860 378029 379958 380810 380962 381201 382325 384190 385632 385674 384385 382317 379743 376924 374494
59970C74494j636j309j639j719r03J56M94J24k56l87n15o97o64l13K47R73J786
$$ 374494 372858 371549 369910 368191 367288 367444 367938 368062 367806 367419 366904 366207 365543 365230 365477 366450 368236
59953C68236K303K163J567J078R24Q46O33M44M87O88P77N07k25j275k231k693
$$ 368236 370539 372702 374269 375347 376271 377117 377750 378194 378681 379369 380146 380653 380428 379153 376922 374229
59937C74229k654k423k184j842j318p79m58l71m07m46l48J06J034K298L614M727
$$ 374229 371575 369152 366968 365126 363808 363029 362571 362200 361793 361347 360999 361105 362139 364437 368051 372778
59921C72778N389N433N105N095N744O327N669L661J589O66P44R43J006J373K109
$$ 372778 378167 383600 388705 393800 399544 405871 411540 415201 416790 417456 418200 419143 420149 421522 423631
59906D23631K632K563K172J765J273O78L00K80L05J67J86O38J058P28l30j206
$$ 423631 426263 428826 430998 432763 434036 434714 435014 435294 435599 435766 435952 436590 437648 438376 438046 436840
59890D36840j032J73J565K289K339K559L627N105N916N728N285N251N356N057
$$ 436840 435808 435981 437546 439835 442174 444733 448360 453465 459381 465109 470394 475645 481001 486058
59876D86058M382L589K524R58q15k231l066l331l030k537k688l704m522m024k638
$$ 486058 490440 494029 496553 497511 496696 494465 491399 488068 485038 482501 479813 476109 471587 467563 464925
59861D64925j733j633j414o47j82p68j918k646k609j984q68N06J504J629J091
$$ 464925 463192 461559 460145 459498 459316 458548 456630 453984 451375 449391 448523 449029 450533 452162 453253
59846D53253L81m27j504k656l388l511l228k715j978j116l86L3K50N05R07J320
$$ 453253 453634 453207 451703 449047 445659 442148 438920 436205 434227 433111 432725 432758 433008 433513 434420 435740
59830D35740J510J459J503J959K611K806K168J055J17m34r32j686k520k947k719
$$ 435740 437250 438709 440212 442171 444782 447588 449756 450811 450928 450494 449562 447876 445356 442409 439690
59815D39690k092j497j142j048j272j818k335k347j806j169p68n22l46l57m90
$$ 439690 437598 436101 434959 433911 432639 430821 428486 426139 424333 423164 422396 421874 421528 421171 420681
59800D20681m04j18k03q79j471j324q15p13r82r78n83k48j34n8j91q59j668j803
$$ 420681 420277 420159 419956 419077 417606 416282 415467 414754 413772 412794 412211 411963 411829 411771 411580 410721 409053 407250
59782D07250j336j210j753k120j680r43n69k96L81J089J066M42K08R42K127K828
$$ 407250 405914 404704 402951 400831 399151 398208 397639 397343 397724 398813 399879 400321 400529 401471 403598 406426
59766D06426K655J959J359J168J283J563K114K984L768M008L929M222M999N604
$$ 406426 409081 411040 412399 413567 414850 416413 418527 421511 425279 429287 433216 437438 442437 448041
59752D48041N596N363N412N626N679N715O026O298N803M341K548J202M70j4m94
$$ 448041 453637 459000 464412 470038 475717 481432 487458 493756 499559 503900 506448 507650 508120 508106 507612
59737E07612p21l57L61P01L33k08l49l35p37j413j662j339r86q67o58l44n54j604
$$ 507612 506891 506534 506895 507596 507929 507721 507372 507037 506300 504887 503225 501886 500900 500033 499375 499031 498477 496873
59719D96873k828l272k690j574n85j82l51n32k06L83O42P01J286K373K941K454
$$ 496873 494045 490773 488083 486509 485924 485742 485391 484859 484653 485036 485678 486379 487665 490038 492979 495433
59703D95433J707J639K090K365K344K295K149J751J410J477J691J576J179Q33
$$ 495433 497140 498779 500869 503234 505578 507873 510022 511773 513183 514660 516351 517927 519106 519939
59689E19939N74K68O6P8rm80j041j271j307j565k052k498k897l459m158m829n374
$$ 519939 520513 520781 520847 520925 520916 520436 519395 518124 516817 515252 513200 510702 507805 504346 500188 495359 489985
59672D89985n620n315m589l961l526k815j835j386j743j878r36L65Q65Q42J425
$$ 489985 484365 479050 474461 470500 466974 464159 462324 460938 459195 457317 456381 456746 457611 458453 459878
59657D59878K621L378L401L446L851M067L926M085M766N121M358K649O09j365
$$ 459878 462499 465877 469278 472724 476575 480642 484568 488653 493419 498540 502898 505547 506156 504791
59643E04791k901l666l947m488n352n684m985l908l314l173k884k180j254m19
$$ 504791 501890 498224 494277 489789 484437 478753 473768 469860 466546 463373 460489 458309 457055 456636
59629D56636m0l68j169j856k198k424k560k376k176k825m438n862o082n531n214
$$ 456636 456596 456228 455059 453203 451005 448581 446021 443645 441469 438644 434206 428344 422262 416731 411517
59614D11517n102m329k710j129l52k12o7M69J472K856M268N089M845L623K030
$$ 411517 406415 402086 399376 398247 397895 397683 397616 398085 399557 402413 406681 411770 416615 420238 422268
59599D22268P64K26L39P30J074J269J371J463J606J745J669J183L76m31r54j124
$$ 422268 423032 423258 423597 424327 425401 426670 428041 429504 431110 432855 434524 435707 436083 435652 434698 433574
59583D33574j099j238j874k791l177k563j645j544k256k619k042j412j728k565
$$ 433574 432475 431237 429363 426572 423395 420832 419187 417643 415387 412768 410726 409314 407586 405021
59569D05021k736k101j683k060k506k124j121m25l79m26l3O36J071J155J181J340
$$ 405021 402285 400184 398501 396441 393935 391811 390690 390265 389886 389460 389427 390063 391134 392289 393470 394810
59553C94810J536J749K271L360M726N658N690N123M807N470P124R198J1337J3953
$$ 394810 396346 398095 400366 403726 408452 414110 419800 424923 429730 435200 442324 451522 462859 476812
59539D76812J7538K1320K3015K0473J3648M809l037p879r417q722p224n651l842
$$ 476812 494350 515670 538685 559158 572806 577615 574578 566699 557282 548560 541336 535685 531843
59526E31843j627N39K134L270M212M511L504J619K07k27p41k516n285p808r287
$$ 531843 530216 530755 532889 536159 540371 544882 548386 550005 550212 549985 549244 546728 541443 533635 524348
59511E24348r767r511q761p950p521p388o994o020m750l722l276l412l905m376
$$ 524348 514581 505070 496309 488359 480838 473450 466456 460436 455686 451964 448688 445276 441371 436995
59497D36995m416l749k428r18J25L80J57J4P4M5j59j97K12R57J878K961M009M508
$$ 436995 432579 428830 426402 425484 425609 425989 426146 426160 426234 426279 426120 425923 426135 427092 428970 431931 435940 440448
59479D40448M293L955M220N036N691N632M844L654K492J731J282O22m26j162q15
$$ 440448 444741 448696 452916 457952 463643 469275 474119 477773 480265 481996 483278 483900 483474 482312 481497
59464D81497K49Q42N32K00Q79K605M690O502P681Q083Q073Q400R284R948R600
$$ 481497 481746 482588 483120 483320 484199 486804 491494 497996 505677 513760 521833 530233 539517 549465 559065
59449E59065Q487P425O562N337L464J160j496m597p631r557j0009r687r225q443
$$ 559065 567552 574977 581539 586876 590340 591500 590004 585407 577776 568219 558210 548523 539298 530855
59435E30855p199o132n776n559m676l436k780k636j879K3K372M461O486Q848J1339
$$ 530855 523656 517524 511748 506189 501513 498077 495297 492661 490782 490805 493177 497638 504124 512972 524311
59420E24311J3566J5622J7753J9778K1379K2791K4700K7288K9389K8579K2554
$$ 524311 537877 553499 571252 591030 612409 635200 659900 687188 716577 745156 767710
59409G67710J1160k707j4762k2170k4730k3654j9982j4178o474K566J1133J5815
$$ 767710 778870 776163 761401 739231 714501 690847 670865 656687 650213 652779 663912 679727
59397F79727J3509M440p370j7290k3231k5589k5344k3308k0375j7259j4083j0884
$$ 679727 693236 697676 690306 673016 649785 624196 598852 575544 555169 537910 523827 512943
59385E12943q088n927m001k163j191j580k334k095r75j33J35N28J238J680J734
$$ 512943 504855 498928 494927 492764 491573 489993 487659 485564 484589 484456 484591 485119 486357 488037 489771
59370D89771K008K648L018K772K219J516N99L3P18K375L532L519L368M148N457
$$ 489771 491779 494427 497445 500217 502436 503952 504551 504584 505302 507677 511209 514728 518096 522244 527701
59355E27701O362O897P735Q988J0237J1303J2238J2940J3352J3755J4301J4607
$$ 527701 534063 540960 548695 557683 567920 579223 591461 604401 617753 631508 645809 660416
59343F60416J4264J3429J2412J1078R184O898M528K029p05l344n512p353r217
$$ 660416 674680 688109 700521 711599 720783 727681 732209 734238 733533 730189 724677 717324 708107
59330G08107j0913j1831j1805j1386j1229j1479j1780j1686j1015r856q314o413
$$ 708107 697194 685363 673558 662172 650943 639464 627684 615998 604983 595127 586813 580400
59318E80400m504l405l623m538n031m972n296o477p728q158p910p558p057o106
$$ 580400 575896 572491 568868 564330 559299 554327 549031 542554 534826 526668 518758 511200 504143 498037
59304D98037n056m597m742m882m725m491m238l731l084k868l307l776l486k427
$$ 498037 492981 488384 483642 478760 474035 469544 465306 461575 458491 455623 452316 448540 445054 442627
59290D42627j298o54l68j0M84Q14Q87J077J666K347K597K471K618L509M959O467
$$ 442627 441329 440675 440307 440297 440781 441595 442482 443559 445225 447572 450169 452640 455258 458767 463726 470193
59274D70193P700Q667R657J0925J2168J2559J1649J0039Q607P360N708L658J843
$$ 470193 477893 486560 496217 507142 519310 531869 543518 553557 562164 569524 575232 578890 580733
59261E80733M28j092k769l879m117m225m954o056o835o995o542n488m228l531
$$ 580733 581161 580069 577300 573421 569304 565079 560125 554069 547234 540239 533697 528209 523981 520450
59247E20450l600l638k958j865q95K28J999M042N503O211O694P220P560P497O967
$$ 520450 516850 513212 510254 508389 507494 507722 509721 513763 519266 525477 532171 539391 546951 554448 561415
59232E61415N821M082K272Q85k21j387k369k768k974l866n507o957p473p224o719
$$ 561415 567236 571318 573590 574475 574254 572867 570498 567730 564756 560890 555383 548426 540953 533729 527010
59217E27010o138n571n315n517n802n666n067m449m200m261m203l704k953k541
$$ 527010 520872 515301 509986 504469 498667 493001 487934 483485 479285 475024 470821 467117 464164 461623
59203D61623k831l466l633k866j565o66p66j450j656q45M05J248J654K170K806
$$ 461623 458792 455326 451693 448827 447262 446596 445830 444380 442724 441879 442284 443532 445186 447356 450162
59188D50162K959K451J908J900K325K939L768M670N196N253N343N690N792N273
$$ 450162 453121 455572 457480 459380 461705 464644 468412 473082 478278 483531 488874 494564 500356 505629
59174E05629M601M377M509M680N038N815O676P228P654Q196Q391P608O063M514
$$ 505629 510230 514607 519116 523796 528834 534649 541325 548553 556207 564403 572794 580402 586465 590979
59160E90979L170J642j91k008l612n126o626q004r103r615r181q009o993o692
$$ 590979 594149 595791 595600 593592 589980 584854 578228 570224 561121 551506 542325 534316 527323 520631
59146E20631o642o181n544n361n575n661n568n586n576n201m750m789n122n003
$$ 520631 513989 507808 502264 496903 491328 485667 480099 474513 468937 463736 458986 454197 449075 444072
59132D44072m295l502k740j650m30J30q0p9R10K473L744M525N170N816O276O541
$$ 444072 439777 436275 433535 431885 431455 431585 431505 431426 432336 434809 438553 443078 448248 454064 460340 466881
59116D66881O978P982R512J0926J1521J1295J0953J0951J0970J0669J0428J0739
$$ 466881 473859 481841 491353 502279 513800 525095 536048 546999 557969 568638 579066 589805
59104E89805J1286J1329J0736R881Q832P381N752M353L030J362l88j526k008k352
$$ 589805 601091 612420 623156 633037 641869 649250 655002 659355 662385 663747 663359 661833 659825 657473
59090F57473k469j695j28J054R81k2j198k187k866l238l860n466p768r454r829
$$ 657473 655004 653309 653181 654235 655216 655194 653996 651809 648943 645705 641845 636379 628611 619157 609328
59075F09328r684r917j0180r596q194o729n632m899m632m925n330n263m849m730
$$ 609328 599644 589727 579547 569951 561757 555028 549396 544497 539865 534940 529610 524347 519498 514768
59061E14768n067n338n155m769m540m392m094l759l799m339m914m874m019k775
$$ 514768 509701 504363 499208 494439 489899 485507 481413 477654 473855 469516 464602 459728 455709 452934
59047D52934j704j083r16j123j438j425r13k94K3K60R29J980K783L035L094L326
$$ 452934 451230 450147 449231 448108 446670 445245 444332 444038 444061 444321 445250 447230 450013 453048 456142 459468
59031D59468L608L746L983M726N954P196Q046Q623R539J1321J3717J5639J6156
$$ 459468 463076 466822 470805 475531 481485 488681 496727 505350 514889 526210 539927 555566 571722
59018E71722J5417J4406J3728J2984J1332Q424M779J410r46k322l323m330n132
$$ 571722 587139 601545 615273 628257 639589 648013 652792 654202 653256 650934 647611 643281 638149
59005F38149n343m779l338r96J711L824N019O004P241P942P187N498M160L345
$$ 638149 632806 628027 624689 623693 625404 629228 634247 640251 647492 655434 662621 668119 672279 675624
58991F75624K204O68k78l77q24k571m956o775p851q672r215r069q321p444o449
$$ 675624 677828 678496 678218 677841 677017 674446 669490 662715 654864 646192 636977 627908 619587 612143 605694
58976F05694m916k860r19M73J631L128N049O866P939Q013P386O704O595P285Q436
$$ 605694 600778 597918 596999 597472 599103 602231 607280 614146 622085 630098 637484 644188 650783 658068 666504
58961F66504R410R816R748R316Q197O077L385Q97j374m183p624j0597j2127j2504
$$ 666504 675914 685730 695478 704794 712991 719068 722453 723350 721976 717793 710169 699572 687445 674941
58947F74941j2443j2008j1126j0376j0168r752q277o396n533n761n845n283m885
$$ 674941 662498 650490 639364 628988 618820 609068 600791 594395 588862 583101 577256 571973 567088
58934E67088n201n703n873n914n840n125l783k836k953l413l106j933o71N4P1
$$ 567088 561887 556184 550311 544397 538557 533432 529649 526813 523860 520447 517341 515408 514737 514791 514862
58919E14862n28j381k002k196k042j338K53K347L851M201M023M198M832N491O018
$$ 514862 514334 512953 510951 508755 506713 505375 505628 507975 511826 516027 520050 524248 529080 534571 540589
58904E40589O612P433Q398R214R564R490R524J0009J0489J0394J0005J0062J0607
$$ 540589 547201 554634 563032 572246 581810 591300 600824 610833 621322 631716 641721 651783 662390
58891F62390J1199J2093J4078J7035J9811K1706K3024K3882K3651K2052J9742
$$ 662390 673589 685682 699760 716795 736606 758312 781336 805218 828869 850921 870663
58880H70663J7211J4070J0011N606J496k440o505j0456j3927j6878j9111k0054
$$ 870663 887874 901944 911955 917561 919057 916617 910112 899656 885729 868851 849740 829686
58868H29686j9567j8258j6579j4335j1550q994p279o221n648n977p290q665r217
$$ 829686 810119 791861 775282 760947 749397 740403 733124 726903 721255 715278 707988 699323 690106
58855F90106r238r575j0426j1359j1956j1906j1013r667q656q091p197n704m534
$$ 690106 680868 671293 660867 649508 637552 625646 614633 604966 596310 588219 581022 575318 570784
58842E70784m475n009n268n273n435n593n541n743o497p029o495n421m976n180
$$ 570784 566309 561300 556032 550759 545324 539731 534190 528447 521950 514921 508426 503005 498029 492849
58828D92849n009m009k777j803r05M8P13Q78R74J562K607L407L326K577K123K504
$$ 492849 487840 483831 481054 479251 478346 478394 479107 479985 480959 482521 485128 488535 491861 494438 496561 499065
58812D99065L106L108K834L198L955L819K507J295J002P45m05j785k184j598r19
$$ 499065 502171 505279 508113 511311 515266 519085 521592 522887 523889 524634 524229 522444 520260 518662 517743
58797E17743o74j074k435m496n937n731m380k957j634k07P99Q02M65R59K331L736
$$ 517743 517069 515995 513560 509064 503127 497396 493016 490059 488425 488218 489017 489819 490284 491243 493574 497310
58781D97310M916O182P238P296O347N282M719M482M112L147J225j343l485m557
$$ 497310 502226 508408 515646 522942 529289 534571 539290 543772 547884 551031 552256 550913 547428 542871
58767E42871n137n893o334n760m736m329m349l820k824k376k557k226q31Q13J841
$$ 542871 537734 531841 525507 519747 515011 510682 506333 502513 499689 497313 494756 492530 491699 492512 494353
58752D94353K316K552K505K145J690J165M23k10l5J061K369L225L615L844M109
$$ 494353 496669 499221 501726 503871 505561 506726 507149 506939 506904 507965 510334 513559 517174 521018 525127
58737E25127M470M817M914M814N010N777O712P363P895Q582R162R299R132Q720
$$ 525127 529597 534414 539328 544142 549152 554929 561641 569004 576899 585481 594643 603942 613074 621794
58723F21794P496N183K706J270J042J566K919N290P927R750J0683J1306J1573
$$ 621794 629290 634473 637179 638449 639491 641057 643976 649266 657193 666943 677626 688932 700505
58710G00505J1065J0093R228P979N419J955r93l075n321q323j1497j4350j7067
$$ 700505 711570 721663 730891 738870 744289 746244 745251 742176 736855 728532 717035 702685 685618
58697F85618j9458k0660k0438j9652j8942j7978j6465j4874j3574j2112j0064
$$ 685618 666160 645500 625062 605410 586468 568490 552025 537151 523577 511465 501401
58686E01401p952o657o374o545o509n940m980m088l489k862j941j049m96J61J428
$$ 501401 493449 486792 480418 473873 467364 461424 456444 452356 448867 446005 444064 443015 442519 442680 444108
58671D44108K753L145K800L015M414O290P890R300J0771J1958J2380J1931J0624
$$ 444108 446861 450006 452806 455821 460235 466525 474415 483715 494486 506444 518824 530755 541379
58658E41379Q350N273K057n68k265l105l413l589l815m026m274m709n051m678
$$ 541379 549729 555002 557059 556491 554226 551121 547708 544119 540304 536278 532004 527295 522244 517566
58644E17566l644k852k768k723k193j742j803j531r9J651K299J933J734K005K162
$$ 517566 513922 511070 508302 505579 503386 501644 499841 498310 498211 499862 502161 504094 505828 507833 509995
58629E09995K218K650L048K518J330O34N64J98o37j080p73j83P16K460M601N785
$$ 509995 512213 514863 517911 520429 521759 522393 522957 523155 522518 521438 520665 520482 521198 523658 528259 534044
58613E34044N708N522N852N801M501K390M30r30j622j757j927k695l643l841l315
$$ 534044 539752 545274 551126 556927 561428 563818 564248 563318 561696 559939 558012 555317 551674 547833 544518
58598E44518l014l280l549l650m009m439m024k551q62M46J585K670L440M097N255
$$ 544518 541504 538224 534675 531025 527016 522577 518553 516002 515140 515586 517171 519841 523281 527378 532633
58583E32633O885Q375R567J0586J0861R816Q272P589P514O722N374N070O015O543
$$ 532633 539518 547893 557460 568046 578907 588723 596995 604584 612098 618820 624194 629264 635279 641822
58569F41822N950N681O846Q695J0511J3055J6781K0425K2712K4097K5436K6223
$$ 641822 647772 653453 660299 668994 679505 692560 709341 729766 752478 776575 802011 828234
58557H28234K5539K3649K1320J8438J4519R891N393J523j471l387m609o023p802
$$ 828234 853773 877422 898742 917180 931699 941590 946983 948506 947035 943648 939039 933016 925214
58544I25214r207j0028j1114j2889j4588j5593j6472j7821j9188j9886j9918j9368
$$ 925214 916007 905979 894865 881976 867388 851795 835323 817502 798314 778428 758510 739142
58532G39142j7829j5145j1958q940o271m140k770j701j87J465K174J894J692J811
$$ 739142 721313 706168 694210 685270 678999 674859 672089 670388 670201 671666 673840 675734 677426 679237
58518F79237J297r8j330j950k757l900m190l232k414k695l113k685k094k204k415
$$ 679237 680534 680436 679106 677156 674399 670499 666309 663077 660663 657968 654855 652170 650076 647872 645457
58503F45457j911j296j482k098k271k029j788j409q16n90r88j339j208j136j443
$$ 645457 643546 642250 640768 638670 636399 634370 632582 631173 630357 629767 628779 627440 626232 625096 623653
58488F23653j494q91j34N13J572L025M023M592O013Q679J1274J2943J4417J5922
$$ 623653 622159 621268 621134 621647 623219 626244 630267 634859 640872 649551 660825 673768 688185 704107
58474G04107J5983J3650J0156O933L679j26l525n520o661p652p933p116o256o079
$$ 704107 720090 733740 743896 750829 754508 754382 750857 745337 738676 731024 723091 715975 709719 703640
58460G03640n495l527j183L47J652L597N373O062O555P876Q976Q269O088L668
$$ 703640 698145 694618 693435 693782 695434 699031 704404 710466 717021 724897 733873 742142 748230 751898
58446G51898R83k317n088o048n908o074o270n506m297l714l197j551P37K278L089
$$ 751898 752881 750564 745476 739428 733520 727446 721176 715670 711373 707659 704462 702911 703648 705926 709015
58431G09015M036M828M690M244M638N548O084O828Q743J0773J0903R094P050N485
$$ 709015 713051 717879 722569 726813 731451 736999 743083 749911 758654 769427 780330 789424 796474 801959
58417H01959L748J762Q3j589l999o519p706p512p246p521p841p927p932p645o805
$$ 801959 805707 807469 807552 805963 801964 795445 787739 780227 772981 765460 757619 749692 741760 734115 727310
58402G27310n821m972l568j212J033K133K797M104N511N858N409N072M599L351
$$ 727310 721489 716517 712949 711737 712770 714903 717700 721804 727315 733173 738582 743654 748253 751604
58388G51604J950J341J103M50q3L24J086J353J660K603L170K491J919L132N270
$$ 751604 753554 754895 755998 756448 756365 756689 757775 759128 760788 763391 766561 769052 770971 774103 779373
58373G79373O303O135O098O327O108N832O278O797O459O030O668P734Q112Q412
$$ 779373 785676 791811 797909 804236 810344 816176 822454 829251 835710 841740 848408 856142 864254 872666
58359H72666R535J0444R896Q965R144R363P863N580M519M060K300Ok91J531L364
$$ 872666 882201 892645 902541 911506 920650 930013 937876 943456 947975 952035 954335 954341 954050 955581 958945
58344I58945M442N546O357O015N710P288R831J0989J1117J2500J5039J6403J6172
$$ 958945 963387 968933 975290 981305 987015 994303 1004134 1015123 1026240 1038740 1053779 1070182 1086354
58331A086354J6116J6518J5838J4027J2670J1790R934P391N857N093L356J109
$$ 1086354 1102470 1118988 1134826 1148853 1161523 1173313 1183247 1190638 1196495 1201588 1204944 1206053
58319A206053N90J769K401K223L273N763P385P306P297Q345R505J0614J2717J5353
$$ 1206053 1206643 1208412 1210813 1213036 1216309 1222072 1229457 1236763 1244060 1252405 1261910 1272524 1285241 1300594
58305A300594J6654J6641J7178J8398J8426J7043J6274J6901J7557J7578J7750
$$ 1300594 1317248 1333889 1351067 1369465 1387891 1404934 1421208 1438109 1455666 1473244 1490994
58294A490994J7932J7152J6115J6534J7993J8496J8033J8368J9670K0605K1302
$$ 1490994 1508926 1526078 1542193 1558727 1576720 1595216 1613249 1631617 1651287 1671892 1693194
58283A693194K2784K4131K3819K3135K4468K7088K8629K9680L2488L6172L8060
$$ 1693194 1715978 1740109 1763928 1787063 1811531 1838619 1867248 1896928 1929416 1965588 2003648
58272B003648L8892M1611M5720M8033M8405M9393N0891N0685M9830N1601N5515
$$ 2003648 2042540 2084151 2129871 2177904 2226309 2275702 2326593 2377278 2427108 2478709 2534224
58261B534224N8214N9808O3159O7350O8531O7036O6901O8320O7686O5178O5044
$$ 2534224 2592438 2652246 2715405 2782755 2851286 2918322 2985223 3053543 3121229 3186407 3251451
58250C251451O7876P0002P1109P4828Q1119Q5909Q9160R5299J04550J12044J16785
$$ 3251451 3319327 3389329 3460438 3535266 3616385 3702294 3791454 3886753 3991303 4103347 4220132
58239D220132J23200J32387J40443J47030J56779J70336J82825J93089K05582
$$ 4220132 4343332 4475719 4616162 4763192 4919971 5090307 5273132 5466221 5671803
58230E671803K21347K36317K50349K68260K90129L10612L29635L53255L82229
$$ 5671803 5893150 6129467 6379816 6648076 6938205 7248817 7578452 7931707 8313936
58221H313936M10854M38969M73237N14666N57588O02955O59180P27526Q01206
$$ 8313936 8724790 9163759 9636996 10151662 10709250 11312205 11971385 12698911 13500117
58212A3500117Q81363R78314J094445J222981J367050J542004J755588K005563
$$ 13500117 14381480 15359794 16454239 17677220 19044270 20586274 22341862 24347425
58204B4347425K300594K662503L104460L629059M247193M969536N782618O679919
$$ 24347425 26648019 29310522 32414982 36044041 40291234 45260770 51043388 57723307
58196E7723307P731563R084817J0885249J3241414J6266919K0074911K4687557
$$ 57723307 65454870 74539687 85424936 98666350 114933269 135008180 159695737
58189A59695737K9990818L5713801M1169339M4795627M4191374L7237647K3733141
$$ 159695737 189686555 225400356 266569695 311365322 355556696 392794343 416527484
58182D16527484O076129j1784685k6301035l5668063l9892476m0068550l7613556
$$ 416527484 422603613 410818928 384517893 348849830 308957354 268888804 231275248
58175B31275248l3786937k9480421k5218213k1279674j7808853j4850209j2369814
$$ 231275248 197488311 168007890 142789677 121510003 103701150 88850941 76481127
58168G6481127j0305902q605116p214441o072072n126680m349392l715706l192551
$$ 76481127 66175225 57570109 50355668 44283596 39156916 34807524 31091818 27899267
58160B7899267k752816k385731k082577j826428j604353j415644j259106j124351
$$ 27899267 25146451 22760720 20678143 18851715 17247362 15831718 14572612 13448261
58152A3448261j003081q97191q08441p30787o59440n97230n45706m99442m54766
$$ 13448261 12445180 11547989 10739548 10008761 9349321 8752091 8206385 7706943 7252177
58143G252177m15108l82477l52456l22510k96551k76530k57862k37793k20098
$$ 7252177 6837069 6454592 6102136 5779626 5483075 5206545 4948683 4710890 4490792
58134D490792k06964j94185j79058j65390j56034j47696j37630j28623j22802
$$ 4490792 4283828 4089643 3910585 3745195 3589161 3441465 3303835 3175212 3052410
58125C052410j17163j09560j02898r9170r5303q9083q3407q0664p8333p3994o9454
$$ 3052410 2935247 2825687 2722789 2623619 2528316 2439233 2355826 2275162 2196829 2122835 2053381
58114B053381o6332o2719n7626n3659n1968m9660m5382m2304m2292m2357m0231
$$ 2053381 1987049 1924330 1866704 1813045 1761077 1711417 1666035 1623731 1581439 1539082 1498851
58103A498851l8320l8578l8437l5604l2258l0771k9618k7171k5322k5680k6140
$$ 1498851 1460531 1421953 1383516 1347912 1315654 1284883 1255265 1228094 1202772 1177092 1150952
58092A150952k4730k3125k2953k2470k0170j7955j7366j6439j3676j1586j2694
$$ 1150952 1126222 1103097 1080144 1057674 1037504 1019549 1002183 985744 972068 960482 947788
58081I47788j5268j6468j6670j7345j7688j6711j5998j7138j8757j8970j8351
$$ 947788 932520 916052 899382 882037 864349 847638 831640 814502 795745 776775 758424
58070G58424j7948j6902j4621j2709j2235j1686r907q353q103p559n595m089m686
$$ 758424 740476 723574 708953 696244 684009 672323 662416 654063 645960 638401 632806 628717 624031
58057F24031n830n676n291o233p556p866p947q674q818p490o315o651p058o095
$$ 624031 618201 612525 607234 601001 593445 585579 577632 568958 560140 552650 546335 539684 532626 526531
58043E26531n175n937p189p156o563o768o998o108n000m775m562l614l407n051
$$ 526531 521356 515419 508230 501074 494511 487743 480745 474637 469637 464862 460300 456686 453279 448228
58029D48228o895p275p408q787r968q953o859o131o704o886o400n877m792k718
$$ 448228 441333 434058 426650 417863 407895 398942 392083 385952 379248 372362 365962 360085 355293 352575
58015C52575j153j509k665k936k856l511l864k607j045j180k305k316j300q48
$$ 352575 351422 349913 347248 344312 341456 337945 334081 331474 330429 329249 326944 324628 323328 322480
58001C22480r31l24P80J231J213J616J979J451Q45J319K017J514N92R64K110K077
$$ 322480 321549 321225 322005 323236 324449 326065 328044 329495 330340 331659 333676 335190 335782 336746 338856 340933
57985C40933P92p5j08m74j555k526l111l719m088l704l142l316l860l905l726
$$ 340933 341725 341650 341542 341068 339513 336987 333876 330157 326069 322365 319223 315907 312047 308142 304416
57970C04416l936l928k981j989k093k451j472M71J671J760J667J604J145P64J114
$$ 304416 300480 296552 293571 291582 289489 287038 285566 286037 287708 289468 291135 292739 293884 294648 295762
57955B95762J364K95j365j823j005m81q63j310j355j402j457j046k75M39J331
$$ 295762 297126 297421 296056 294233 293228 292747 291884 290574 289219 287817 286360 285314 285039 285478 286809
57940B86809K696L942M569N329O937Q568R249R696J0959J2143J1556R300O713
$$ 286809 289505 293447 298016 303345 310282 318850 328099 337795 348754 360897 372453 381753 388466
57927C88466M026P20k534m554n741p341r081r715r443r609j0274j0262r326q222
$$ 388466 392492 393212 390678 386124 380383 373042 363961 354246 344803 335194 324920 314658 305332 297110
57913B97110o964n145l546l235l318j916Q39L066M175N215O286O120M603L282
$$ 297110 290146 285001 281455 278220 274902 272986 273825 276891 281066 286281 292567 298687 303290 306572
57899C06572K885K460J475P40P14P62O63J052J891K210J801J509J478Q43m48j257
$$ 306572 309457 311917 313392 314132 314846 315608 316271 317323 319214 321424 323225 324734 326212 327055 326607 325350
57883C25350j119r21j250j659j993k773l897m485m515n029o243p027o699n875
$$ 325350 324231 323310 322060 320401 318408 315635 311738 307253 302738 297709 291466 284439 277740 271865
57869B71865n061l972k696k018j976j550l27Q96J700K751M346N673O227O615P367
$$ 271865 266804 262832 260136 258118 256142 254592 254265 255161 256861 259612 263958 269631 275858 282473 289840
57854B89840Q120Q569R013R364Q890P526O253N479M263J900q83l074m668o054
$$ 289840 297960 306529 315542 324906 333796 341322 347575 353054 357317 359217 358334 355260 350592 344538
57840C44538o988p138o903o999p566q164q218p332n726m376l985l983l353k224
$$ 344538 337550 330412 323509 316510 308944 300780 292562 285230 279504 275128 271143 267160 263807 261583
57826B61583j505j168m06N61M95p14j525j032k88n75j648k578l208l812m246m372
$$ 261583 260078 258910 258504 259065 259560 258846 257321 256289 256001 255426 253778 251200 247992 244180 239934 235562
57810B35562m617n296n951o026n600m959m055k946k128j915j993k021k112k319
$$ 235562 230945 225649 219698 213672 208072 203113 199058 196112 193984 192069 190076 188055 185943 183624
57796A83624k260j637o46M38J531K389K582K206K029K581L528M248M600M927N531
$$ 183624 181364 179727 179081 179519 181050 183439 186021 188227 190256 192837 196365 200613 205213 210140 215671
57781B15671O324O813O620O185O544P945R267R423Q757Q182P539N976L592J437
$$ 215671 221995 228808 235428 241613 248157 256102 265369 274792 283549 291731 299270 305246 308838 310275
57767C10275J9j054k114l134m286n729p012p668q055q603q647p440n824n361n984
$$ 310275 310294 309240 307126 303992 299706 293977 286965 279297 271242 262639 253992 246552 240728 235367 229383
57752B29383o124n049l522k185r89k94p11j654j661n34L81L16q5k86n71q40m52
$$ 229383 223259 218210 214688 212503 211514 211220 210509 208855 207194 206660 207041 207357 207272 206986 206415 205575 205123
57735B05123L59N25P9L28J597K606K690K822L597M021L251K000J170N88P4K09
$$ 205123 205482 206007 206086 206414 208011 210617 213307 216129 219726 223747 226998 228998 230168 230756 230830 231039
57719B31039J041J458Q89J78j59r39k464l373k739j868k424m037n299n969o444
$$ 231039 232080 233538 234427 234605 234446 233507 231043 227670 224931 223063 220639 216602 211303 205334 198890
57704A98890o192m520k312j193j359j688j577j383j338j302j312j424j320r56
$$ 198890 192698 188178 185866 184673 183314 181626 180049 178666 177328 176026 174714 173290 171970 171014
57690A71014j082k173l348l342k128o62M58J246J747K104K743L815M898N971P888
$$ 171014 169932 167759 164411 161069 158941 158279 158737 159983 161730 163834 166577 170392 175290 181261 189149
57675A89149J1104J4728J7818K0920K5259L1049L7608M4298M9903N1566M5990
$$ 189149 200253 214981 232799 253719 278978 310027 347635 391933 441836 493402 539392
57664E39392L2226J2758p956k5621l7569m3431m4629m2808l8867l3570k8146k3544
$$ 539392 571618 584376 576420 550799 513230 469799 425170 382362 343495 309925 281779 258235
57652B58235j9703j6267j3436j1475r987q489p055n770m197k194n70j43n94r91
$$ 258235 238532 222265 208829 197354 187367 178878 171823 166053 161856 159662 159092 158949 158355 157364
57638A57364q88l85K51N44J09m70j10R53J057m03j890k074j801k309k834j915
$$ 157364 156476 156091 156342 156886 156995 156525 156415 157368 158425 158022 156132 154058 152257 149948 147114 145199
57622A45199m2Q91K77q16j512j810j730j301j107j522j751r95l6j61j001j108
$$ 145199 145157 146048 146325 145509 143997 142187 140457 139156 138049 136527 134776 133781 133745 133584 132583 131475
57606A31475l78j07p53j349j288j018q35m44k9l19j269j867j655j267j224j255
$$ 131475 131097 130990 130237 128888 127600 126582 125747 125303 125274 124955 123686 121819 120164 118897 117673 116418
57590A16418j105r84r66q20o43p73r68o39O7M24L34M25P61N83m35j608k200k211
$$ 116418 115313 114329 113363 112543 111900 111127 110159 109520 109587 110011 110345 110770 111531 112114 111679 110071 107871 105660
57572A05660j993j830j973k412k635k266j696j398r88L9J029R02j23q11q03p97
$$ 105660 103667 101837 99864 97452 94817 92551 90855 89457 88469 88508 89537 90439 90316 89505 88702 87905
57556H7905q50n7J698L116L171K310J469Q81M37J94R0j54l94j06O51J150J068
$$ 87905 87055 86998 88696 91812 94983 97293 98762 99643 100080 100274 100364 100210 99816 99710 100361 101511 102579
57539A02579Q84R84J174J331J568J563O87q33j854j774j257j084j170j068p45
$$ 102579 103463 104447 105621 106952 108520 110083 110770 109937 108083 106309 105052 103968 102798 101730 100985
57524A00985l32J20L91J77k49k01M30R99J144J205J441J610J582J576J562J234
$$ 100985 100653 100773 101164 101341 101092 100891 101321 102320 103464 104669 106110 107720 109302 110878 112440 113674
57508A13674P23N40O58N99M85R74J884K052J010l23j071j485k038k418k266j959
$$ 113674 114397 114937 115595 116194 116679 117653 119537 121589 122599 122276 121205 119720 117682 115264 112998 111039
57492A11039j924j853j323o16k19r7k2j02m11o13m91l26l60l46q3J72J32j51o15
$$ 111039 109115 107262 105939 105323 105104 105007 104985 104883 104472 103859 103368 103042 102682 102336 102253 102425 102557 102406 101791
57473A01791j309j938j979j525j264j378j318q93n95m90K6Q77R36j49r37j45J296
$$ 101791 100482 98544 96565 95040 93776 92398 91080 90187 89592 89102 89128 90005 90941 90792 89855 89710 91006
57456I1006J460J31j046q70J42P73M67m55j242j256n10L43P40P30N52J93k80l86
$$ 91006 92466 92597 91551 90681 90823 91596 92063 91608 90366 89110 88600 88943 89683 90413 90965 91158 90878 90492
57438I0492J99J098J638J553R49J17l34J92J321J739Q17m33o97p6L55J98l0j9
$$ 90492 90691 91789 93427 94980 95929 96046 95712 95904 97225 98964 99781 99348 98651 98575 98930 99128 99098 99079
57420I9079k8j69j38K06N78O48L26k95r08j086p79m79n67p28m94k0J57r1m98r16
$$ 99079 99051 98882 98744 98950 99528 100176 100502 100207 99299 98213 97434 96955 96388 95660 95166 95146 95303 95212 94714 93798
57400I3798j246j067m6J269J806J213L15R9O15J098R67M24J56N71J449K260K618
$$ 93798 92552 91485 91439 92708 94514 95727 96042 96141 96756 97854 98821 99245 99401 99972 101421 103681 106299
57383A06299K332J350Nr89j223j126j282j457j068l65k73r24j384j071m81j32
$$ 106299 108631 109981 109986 108997 107774 106648 105366 103909 102841 102476 102203 101279 99895 98824 98343 98211
57367I8211K50R41J501J546J486J770K054J778J117O21M40M94R06J600J959J637
$$ 98211 98461 99402 100903 102449 103935 105705 107759 109537 110654 111275 111715 112209 113115 114715 116674 118311
57351A18311J190J282J626J476P54L7k56j4P78J759K092J377L51j4J84J18m14
$$ 118311 119501 120783 122409 123885 124639 124676 124420 124406 125184 126943 129035 130412 130763 130749 130933 131051 130637
57334A30637p34l00O45J369J272L09q52j438j430j371j207l33R42J160j58j388
$$ 130637 129903 129603 130248 131617 132889 133198 132346 130908 129478 128107 126900 126567 127509 128669 128511 127123
57318A27123r75K91O19L1N0J035J695J325P44O76O91L02j33j99j40j73mN13R51
$$ 127123 126148 126439 127058 127089 127139 128174 129869 131194 131938 132614 133305 133607 133474 133275 133135 132962 132958 133471 134422
57299A34422J060J229J775K364K566K432K196J900J660J749K189K662L032L425
$$ 134422 135482 136711 138486 140850 143416 145848 148044 149944 151604 153353 155542 158204 161236 164661
57285A64661L704L502K956K793L386M305M996N344N327M827M119L884M292M605
$$ 164661 168365 171867 174823 177616 181002 185307 190303 195647 200974 205801 209920 213804 218096 222701
57271B22701M170L368L052L433L951M043L611K943K529K767L600M543N141N177
$$ 222701 226871 230239 233291 236724 240675 244718 248329 251272 253801 256568 260168 264711 269852 275029
57257B75029M569L438K408K267L015L732L646L010K590K752L385M372N554O522
$$ 275029 279598 283036 285444 287711 290726 294458 298104 301114 303704 306456 309841 314213 319767 326289
57243C26289O982P219P785Q761R721J0387J0831J0987J0519R446Q512Q420Q896
$$ 326289 333271 340490 348275 357036 366757 377144 387975 398962 409481 418927 427439 435859 444755
57230D44755R059Q770Q978J0391J2287J3340J3281J3103J3587J4420J4904J4855
$$ 444755 453814 462584 471562 481953 494240 507580 520861 533964 547551 561971 576875 591730
57218E91730J4393J3565J2684J2489J3369J4690J5447J5399J5142J5331J6229
$$ 591730 606123 619688 632372 644861 658230 672920 688367 703766 718908 734239 750468
57207G50468J7722J9290K0240K0385K0254K0282K0170J9533J8624J7793J6670
$$ 750468 768190 787480 807720 828105 848359 868641 888811 908344 926968 944761 961431
57196I61431J4690J2197J0167Q966Q178P610P652Q542R955J1490J3028J4552J6072
$$ 961431 976121 988318 998485 1007451 1015629 1023239 1030891 1039433 1049388 1060878 1073906 1088458 1104530
57183A104530J7746J9610K1327K2514K3256K3775K3915K3466K2720K2099K1535
$$ 1104530 1122276 1141886 1163213 1185727 1208983 1232758 1256673 1280139 1302859 1324958 1346493
57172A346493K0951K0948K2062K3590K4280K4130K4378K5621K7057K7871K8311
$$ 1346493 1367444 1388392 1410454 1434044 1458324 1482454 1506832 1532453 1559510 1587381 1615692
57161A615692K9004L0025L1093L2007L2538L2562L2530L3061L3922L4274L4238
$$ 1615692 1644696 1674721 1705814 1737821 1770359 1802921 1835451 1868512 1902434 1936708 1970946
57150A970946L5251L8402M3110M7973N2116N5241N7118N7793N7846N7731N7294
$$ 1970946 2006197 2044599 2087709 2135682 2187798 2243039 2300157 2357950 2415796 2473527 2530821
57139B530821N6275N4939N3690N2601N1760N1767N3361N6776O1650O7239P2611
$$ 2530821 2587096 2642035 2695725 2748326 2800086 2851853 2905214 2961990 3023640 3090879 3163490
57128C163490P7163Q1171Q5312Q9541R3072R5642R7980J00784J04113J08216J13973
$$ 3163490 3240653 3321824 3407136 3496677 3589749 3685391 3783371 3884155 3988268 4096484 4210457
57117D210457J21821J30988J40532J50401J60820J71415J81929J93238K06694
$$ 4210457 4332278 4463266 4603798 4754199 4915019 5086434 5268363 5461601 5668295
57108E668295K22858K41803K64334K92017L26396L69138M22826M90710N75894
$$ 5668295 5891153 6132956 6397290 6689307 7015703 7384841 7807667 8298377 8874271
57099H874271O81655Q12647R74882J174487J416957J707088K048126K440121K879150
$$ 8874271 9555926 10368573 11343455 12517942 13934899 15641987 17690113 20130234 23009384
57090B3009384L357438L862795M377466M878645N341254N740709O054043O260457
$$ 23009384 26366822 30229617 34607083 39485728 44826982 50567691 56621734 62882191
57082F2882191O341303O276819O038737N585109M866939L849357K538162R96494
$$ 62882191 69223494 75500313 81539050 87124159 91991098 95840455 98378617 99375111
57074I9375111o59210k284160l741003m931170n808831o374475o656666o695224
$$ 99375111 98715901 96431741 92690738 87759568 81950737 75576262 68919596 62224372
57066F2224372o533059o214362n783422n282012m746991m209019l691552l210167
$$ 62224372 55691313 49476951 43693529 38411517 33664526 29455507 25763955 22553788
57058B2553788k773412k384984k045386j752391j501768j288790j109117r58270
$$ 22553788 19780376 17395392 15350006 13597615 12095847 10807057 9697940 8739670
57050H739670q31217p23259o31100n52517m85370m27453l77161l33775k97025
$$ 8739670 7908453 7185194 6554094 6001577 5516207 5088754 4711593 4377818 4080793
57041D080793k66592k41804k21451k03921j87793j72378j57754j44400j32733
$$ 4080793 3814201 3572397 3350946 3147025 2959232 2786854 2629100 2484700 2351967
57032B351967j22639j13424j04557r6390q9659q4274p9196p3649o7839o2282n7121
$$ 2351967 2229328 2115904 2011347 1914957 1825298 1741024 1661828 1588179 1520340 1458058 1400937
57021A400937n2507m8948m6604m4743m2553m0177l8319l7045l5623l3474l0788
$$ 1400937 1348430 1299482 1252878 1208135 1165582 1125405 1087086 1050041 1014418 980944 950156
57010I50156k8163k6027k4362k2823k1116j9422j8286j7948j7978j7745j6948
$$ 950156 921993 895966 871604 848781 827665 808243 789957 772009 754031 736286 719338
56999G19338j5675j4275j3298j3103j3252j2771j1299r529q196p127n687l713
$$ 719338 703663 689388 676090 662987 649735 636964 625665 616136 607940 600813 595126 591413
56987E91413j454J035L920P095R999J1733J1181P486R10o982j4317j9893k3199
$$ 591413 589959 590994 594914 602009 612008 623741 634922 642408 643318 636336 622019 602126 578927
56974E78927k4119k3086k1036j8676j6034j3070j0221p830n573l009l23K156M789
$$ 578927 554808 531722 510686 492010 475976 462906 452685 444855 439282 436273 435950 438106 442895
56961D42895Q304J2806J7762K2671K6967K9298K7706K1029J0067k654j4148k2407
$$ 442895 451199 464005 481767 504438 531405 560703 588409 609438 619505 616851 602703 580296
56949E80296k7032k8664k7903k5173k1420j8037j5611j3391j0492p014l440L63
$$ 580296 553264 524600 496697 471524 450104 432067 416456 403065 392573 385559 382119 382482
56937C82482M715R273J3507J7676K2446K7683L2299L5061L4723K9813J9500M981
$$ 382482 387197 396470 409977 427653 450099 477782 510081 545142 579865 609678 629178 634159
56925F34159j0625k4025l3212l7717l8332l6530l3505k9623k5135k0980j8111
$$ 634159 623534 599509 566297 528580 490248 453718 420213 390590 365455 344475 326364
56914C26364j6257j4255j1630r113p492o700o114n264m063k843k096j855j468
$$ 326364 310107 295852 284222 275109 267617 260917 254803 249539 245476 242633 240537 238682 237214
56901B37214m59O90J225J294J758K963M534O186P998R882J1648J3602J6298J9645
$$ 237214 236755 237445 238670 239964 241722 244685 249219 255405 263403 273285 284933 298535 314833 334478
56887C34478K2944K5747K7797K8095K5057J8080Q352k041j1247j7884k1166k1348
$$ 334478 357422 383169 410966 439061 464118 482198 490550 488509 477262 459378 438212 416864
56875D16864j9523j6618j2949q795m738j078K526O538J1114J6322K2358K9272
$$ 416864 397341 380723 367774 358979 354241 353163 355689 362227 373341 389663 412021 441293
56863D41293L6881M5123N4000O2838O9655P1388O4923M8771K4700k236k6119m3126
$$ 441293 478174 523297 577297 640135 709790 781178 846101 894872 919572 917336 891217 848091
56851H48091n2289n4425n1246m5141l8248l1232k3590j5241o867J265R811J9361
$$ 848091 795802 741377 690131 644990 606742 575510 551920 536679 529812 531077 540888 560249
56839E60249K9898M1516N4730O9680Q5689J01513J14632J19929J11012Q4813M4951
$$ 560249 590147 631663 686393 756073 841762 943275 1057907 1177836 1288848 1373661 1418612
56828A418612m3m1495p3614r3782j02100j00993r3905q3573p1476n8552m5773
$$ 1418612 1418569 1377074 1303460 1209678 1107578 1006585 912680 829107 757631 699079 653306
56817F53306l3917k3227j3444l953N930J6615K8154M0552N3762O7086P8513Q4669
$$ 653306 619389 596162 582718 578765 584695 601310 629464 670016 723778 790864 869377 954046
56805I54046Q1509O5985L8391L641l0571n7704p4940q2708q2922p7968p0111o0778
$$ 954046 1035555 1101540 1139931 1143572 1113001 1055297 980357 897649 814727 736759 666648 605870
56793F05870n0590m0316l1159k3627j6923j0087l148L487J0121J7323K4930L2278
$$ 605870 555280 514964 483805 460178 443255 433168 430020 433507 443628 460951 485881 518159
56781E18159L8873M3707M4252L7615K3221L813j6288l3386m5195n0869n1121m7880
$$ 518159 557032 600739 644991 682606 705827 709640 693352 659966 614771 563902 512781 464901
56769D64901m3140l8029l2972k8226k3960k0102j6541j3468j1193r701q586p509
$$ 464901 421761 383732 350760 322534 298574 278472 261931 248463 237270 227569 218983 211474
56757B11474o554o014n910n896n671n276m805m103l077k182k055k572k783k059
$$ 211474 204920 198906 192996 187100 181429 176153 171348 167245 164168 161986 159931 157359 154576 152517
56743A52517r45m93r79j655j665q75J16N46L5j160k366k968k756j878o78L80Q71
$$ 152517 151572 151079 150100 148445 146780 145905 146021 146567 146602 145442 143076 140108 137352 135474 134796 135176 136047
56726A36047P60N05O47J257J825J753R55n0o19n39j5O74J257J325O19l84p53k41
$$ 136047 136807 137312 137959 139216 141041 142794 143749 143699 143080 142541 142526 143200 144457 145782 146401 146017 145264 145023
56708A45023L49L84L24Q09J353R32k96r42k33R97J465Q78j57j033j463j348p94
$$ 145023 145372 145756 146080 146889 148242 149174 148878 147936 147703 148700 150165 151043 150886 149853 148390 147042 146248
56691A46248j45L26O49R41J142J156J104J232J551J628R54l14j123o03O82J271
$$ 146248 146103 146429 147078 148019 149161 150317 151421 152653 154204 155832 156786 156472 155349 154746 155428 156699
56675A56699P60L46R48J811J809J279J312J863J946J342Q16P22P37Q38J278J595
$$ 156699 157459 157805 158753 160564 162373 163652 164964 166827 168773 170115 170931 171653 172390 173228 174506 176101
56659A76101J039K0k40L25M59k61o64J01J269J831J915K022J975J534J094R62
$$ 176101 177140 177160 176920 177245 177704 177443 176779 176880 178149 179980 181895 183917 185892 187426 188520 189482
56643A89482Q25N53O61J166R96n40k500l390k873j706n92J01J81j34l07l05o58
$$ 189482 190307 190860 191521 192687 193683 193143 190643 187253 184380 182674 182082 182183 182364 182230 181923 181618 180960
56626A80960j343j566j126r62j569k003j384l65n5m01p38j072j631j857j169j93
$$ 180960 179617 178051 176925 175963 174394 172391 171007 170642 170587 170186 169448 168376 166745 164888 163719 163526
56610A63526J3m73p81o93o50o71m53j96k94m29o6M80M82P4K6L76M25J0k07J19
$$ 163526 163539 163066 162285 161592 160942 160271 159818 159622 159328 158899 158833 159313 159795 159869 159895 160271 160696 160706 160499 160618
56590A60618M87L37k53q31j051q81n74l67m1P56J691J908J359J058J515J869J285
$$ 160618 161105 161442 161189 160358 159307 158426 157852 157485 157444 158200 159891 161799 163158 164216 165731 167600 168885
56573A68885L16o1Q9J40J06L06N45O66J178K317L264L482L954N605P298P183N462
$$ 168885 169201 169140 169229 169369 169475 169781 170326 170992 172170 174487 177751 181233 185187 190792 198090 205273 210735
56556B10735M011L477K676R71n89r47m39N9K23J14j80l90k58m5j70m65n47o54
$$ 210735 214746 218223 220899 221870 221281 220334 219895 219954 220177 220291 220111 219721 219463 219418 219248 218783 218236 217582
56538B17582j182j704j552j101j284j992k242j780j260q63j84N48N68J02K38J031
$$ 217582 216400 214696 213144 212043 210759 208767 206525 204745 203485 202622 202438 202986 203554 203656 203894 204925
56522B04925J184Q7j181j516j186q92o27k65k68r23j583j469o98Q8O21R47R79
$$ 204925 206109 206196 205015 203499 202313 201421 200794 200529 200261 199338 197755 196286 195588 195676 196297 197244 198223
56505A98223O67K73J07J66K67K51Om15p22p54p83j035j175q02j98O0roJ3k89p23
$$ 198223 198890 199163 199270 199436 199703 199954 199960 199545 198823 198069 197286 196251 195076 194274 194076 194136 194127 194121 194134 193845 193122
56484A93122p75m61j93k3K43L61J7m15l72j02j77l29J59J061J378Q07M1l00j23
$$ 193122 192347 191886 191693 191670 191913 192274 192291 191876 191504 191402 191225 190896 191055 192116 193494 194301 194342 194042 193919
56465A93919N16J225J105j12j221j018j32J10KP54J942J857M06n87l72k95j175
$$ 193919 194435 195660 196765 196653 195432 194414 194282 194392 194394 195148 197090 198947 199353 198766 198394 198099 196924
56448A96924j767r24N54J369J505J511J269O17K1k68p04j271j059K12J398J536
$$ 196924 195157 194233 194787 196156 197661 199172 200441 201058 201079 200811 200107 198836 197777 197989 199387 200923
56432B00923J154J034Q98K78l58m14k21k74k60J82N53K55l77o75n88l11L20J326
$$ 200923 202077 203111 204009 204287 203929 203515 203294 203020 202760 202942 203495 203750 203373 202698 202110 201799 202119 203445
56414B03445K099K137J650R82J48n88o30n7K22j58m18m1L46K09J59Q14J661J912
$$ 203445 205544 207681 209331 210313 210461 209873 209243 209186 209408 209250 208832 208791 209137 209346 209505 210319 211980 213892
56396B13892J728J668J639J293P60L10j16l85lR56J608J543J411J694J887J642
$$ 213892 215620 217288 218927 220220 220980 221290 221174 220789 220786 221742 223350 224893 226304 227998 229885 231527
56380B31527J506J717J431J98r01p07L13R96J204J427J422O66l90p30j39P21J289
$$ 231527 233033 234750 236181 236379 235478 234771 235084 236080 237284 238711 240133 240799 240409 239679 239540 240261 241550
56363B41550J294N35o86j398j003n8O32R96J163Q04j06o35k7J163J954K245K372
$$ 241550 242844 243379 242693 241295 240292 240234 240866 241862 243025 243829 243723 243088 243061 244224 246178 248423 250795
56346B50795K117J295O32Q97J568J523O80r3l30k59J4N62J062J059P14O42J121
$$ 250795 252912 254207 254839 255736 257304 258827 259507 259414 259084 258825 258839 259401 260463 261522 262236 262878 263999
56329B63999J967K936L730L948L496K754K041J330P15M77M05q9q54r15m4O87N35
$$ 263999 265966 268902 272632 276580 280076 282830 284871 286201 286916 287393 287798 287709 286855 285940 285896 286583 287118
56312B87118K17O01J248J286Q55O87R18J309J970K975L782L943L829L944M063
$$ 287118 287335 287936 289184 290470 291325 292012 292930 294239 296209 299184 302966 306909 310738 314682 318745
56297C18745L793L336L037K765K357K107K171K242K215K448K938L187L213L599
$$ 318745 322538 325874 328911 331676 334033 336140 338311 340553 342768 345216 348154 351341 354554 358153
56283C58153M137L785K567J987K772L743L934M165N269O323O288N996O787Q148
$$ 358153 362290 366075 368642 370629 373401 377144 381078 385243 390512 396835 403123 409119 415906 424054
56269D24054Q605Q134P993Q699R723J0764J1959J3181J4297J5676J7461J9073
$$ 424054 432659 440793 448786 457485 467208 477972 489931 503112 517409 533085 550546 569619
56257E69619K0333K2257K5591K9464L2729L5765L9724M4791N0363N6202O2163
$$ 569619 589952 612209 637800 667264 699993 735758 775482 820273 870636 926838 989001
56246I89001O7627P2310P6858Q1471Q4978Q6404Q6383Q5658Q3273P7770O9303
$$ 989001 1056628 1128938 1205796 1287267 1372245 1458649 1545032 1630690 1713963 1791733 1861036
56235A861036N9043M7390L4212K0015N418r673k4965l8794m9684n8050o4987p0376
$$ 1861036 1920079 1967469 2001681 2021696 2027114 2017441 1992476 1953682 1903998 1845948 1780961 1710585
56223A710585p3674p5389p6208p5658p3302p0156o7239o3842n9064n3975n0194
$$ 1710585 1636911 1561522 1485314 1409656 1336354 1266198 1198959 1135117 1076053 1022078 971884
56212I71884m7297m3733l9485l5757l2681k9437k6073k3271k0761j7885j5215
$$ 971884 924587 880854 841369 805612 772931 743494 717421 694150 673389 655504 640289
56201F40289j3825j3403j2754j1629j0541r420q096p165o830n930l827k020j907
$$ 640289 626464 613061 600307 588678 578137 568717 560621 553456 546626 540696 536869 534849 532942
56188E32942k289j281M66J003M72N28J167Q76l91j084o60j5N25J427K397K658
$$ 532942 530653 529372 529838 530841 531313 531841 533008 533884 533493 532409 531749 531734 532259 533686 536083 538741
56172E38741K500K751L130K976K921L921N358O085O363O883O992O168N837P319
$$ 538741 541241 543992 547122 550098 553019 556940 562298 568383 574746 581629 588621 594789 600626 607945
56158F07945R218R592R385J0650J2738J3546J3543J4912J7507J9355K0714K3869
$$ 607945 617163 626755 636140 646790 659528 673074 686617 701529 719036 738391 759105 782974
56146G82974K9137L4687M0312M7816N7508O7797P8447R0739J03895J14527J20111
$$ 782974 812111 846798 887110 934926 992434 1060231 1138678 1229417 1333312 1447839 1567950
56135A567950J20160J14074J01338Q4442O8399N6607M9393M6139M5608M4337L8369
$$ 1567950 1688110 1802184 1903522 1987964 2056363 2112970 2162363 2208502 2254110 2298447 2336816
56124B336816K7332J4138R08j1626k1332k5656k5948k7125l2398m1513n4090p0405
$$ 2336816 2364148 2378286 2379194 2367568 2346236 2320580 2294632 2267507 2235109 2193596 2139506 2069101
56112B069101q8085j02165j09830j12008j09663j02271r0809p8530o7325n6496
$$ 2069101 1981016 1878851 1769021 1657013 1547350 1445079 1354270 1275740 1208415 1151919
56102A151919m5955l7300l0839k4904j9048j4700j1901q824n263l054k324r63
$$ 1151919 1105964 1068664 1037825 1012921 993873 979173 967272 958448 953185 950131 947807 946844
56090I46844J385K548J927J613K491L034K895L798N817O688O011O190Q054R430
$$ 946844 948229 950777 952704 954317 956808 959842 962737 966535 972352 979040 985051 991241 999295 1008725
56076A008725R329R504J0667J1150J0610J1041J2747J3430J2551J2452J3873J4623
$$ 1008725 1018054 1027558 1038225 1049375 1059985 1071026 1083773 1097203 1109754 1122206 1136079 1150702
56064A150702J4068J4521J6655J7986J7511J7415J8546J8782J7531J7226J8540
$$ 1150702 1164770 1179291 1195946 1213932 1231443 1248858 1267404 1286186 1303717 1320943 1339483
56053A339483J8797J7035J5915J6685J7029J5931J5803J7676J9118J8997J9460
$$ 1339483 1358280 1375315 1391230 1407915 1424944 1440875 1456678 1474354 1493472 1512469 1531929
56042A531929K1141K1517K0176K0426K3414K6021K6863K8728L2624L5293L5474
$$ 1531929 1553070 1574587 1594763 1615189 1638603 1664624 1691487 1720215 1752839 1788132 1823606
56031A823606L6753M1006M4759M5371M5145M6133M6476M5264M5246M7435M8782
$$ 1823606 1860359 1901365 1946124 1991495 2036640 2082773 2129249 2174513 2219759 2267194 2315976
56020B315976M8359M9783N4293N7798N8220N9197O2972O6387O7683P0154P5119
$$ 2315976 2364335 2414118 2468411 2526209 2584429 2643626 2706598 2772985 2840668 2910822 2985941
56009B985941P8579P9104Q1550Q8375R4916R7992J01466J08240J14810J18977
$$ 2985941 3064520 3143624 3225174 3313549 3408465 3506457 3607923 3716163 3830973 3949950
55999C949950J24776J34175J42306J46769J53025J64566J76498J85225J95358
$$ 3949950 4074726 4208901 4351207 4497976 4651001 4815567 4992065 5177290 5372648
55990E372648K10401K25978K39135K54628K74979K94533L10825L31019L59322
$$ 5372648 5583049 5809027 6048162 6302790 6577769 6872302 7183127 7514146 7873468
55981G873468L89371M17273M49952M91719N35620N77904O27395O90036P58446
$$ 7873468 8262839 8680112 9130064 9621783 10157403 10735307 11362702 12052738 12811184
55972A2811184Q28276R09604J009922J122220J243533J387948J566777J774850
$$ 12811184 13639460 14549064 15558986 16681206 17924739 19312687 20879464 22654314
55964B2654314K012652K301910K662189L095348L613405M257080N065709O058802
$$ 22654314 24666966 26968876 29631065 32726413 36339818 40596898 45662607 51721409
55956E1721409P274061Q792526J0700492J3069131J6003095J9646556K4078624
$$ 51721409 58995470 67787996 78488488 91557619 107560714 127207270 151285894
55949A51285894K9237488L4926905M0631088M5016059M5729880M0314637K7959707
$$ 151285894 180523382 215450287 256081375 301097434 346827314 387141951 415101658
55942D15101658J0590547p874116k3540034l4177564l9503660m0483634l8516700
$$ 415101658 425692205 417818089 394278055 360100491 320596831 280113197 241596497
55935B41596497l4917938l0668412k6366185k2331099j8733654j5643612j3041501
$$ 241596497 206678559 176010147 149643962 127312863 108579209 92935597 79894096
55928G9894096j0866303r065579p592348o385227n385296m559855l887799l336516
$$ 79894096 69027793 59962214 52369866 45984639 40599343 36039488 32151689 28815173
55920B8815173k873348k485153k166457j900261j668113j467319j301019j161038
$$ 28815173 25941825 23456672 21290215 19389954 17721841 16254522 14953503 13792465
55912A3792465j035586r24206q30690p49916o74891o08306n54590n08441m62861
$$ 13792465 12756879 11832673 11001983 10252067 9577176 8968870 8414280 7905839 7442978
55903G442978m20777l87515l59309l30193l03013k82858k66197k47023k27622
$$ 7442978 7022201 6634686 6275377 5945184 5642171 5359313 5093116 4846093 4618471
55894D618471k13329k02195j89303j76043j66140j57576j46869j36500j30059
$$ 4618471 4405142 4202947 4013644 3837601 3671461 3513885 3367016 3230516 3100457
55885C100457j24848j16960j08801j04103j00369r3725q6432q2225p8909p2957
$$ 3100457 2975609 2858649 2749848 2645745 2545376 2451651 2365219 2282994 2204085 2131128
55875B131128o6854o4592o4095o1375n8033n7487n7737n4986n0755m8467m6572
$$ 2131128 2064274 1999682 1935587 1874212 1816179 1758692 1700955 1645969 1595214 1546747 1500175
55864A500175m2012l7118l6021l7210l6344l3720l2297l1129k7394k2700k0853
$$ 1500175 1458163 1421045 1385024 1347814 1311470 1277750 1245453 1214324 1186930 1164230 1143377
55853A143377k1270k0604j9073j9443k1390k2335k2312k3029k3777k3026k2132
$$ 1143377 1122107 1101503 1082430 1062987 1041597 1019262 996950 973921 950144 927118 904986
55842I04986k2886k3519k1692j9116j8576j8809j7121j4690j4215j4639j3343
$$ 904986 882100 858581 836889 817773 799197 780388 763267 748577 734362 719723 706380
55831G06380j1348j1209j1743j0082p140n906o028n152m080n341q081r349r309
$$ 706380 695032 683823 672080 661998 654858 648952 642924 637772 633692 628351 620270 610921 601612
55818F01612j0240j1631j1206r706r706j0593r610p109n952o347n985m743m600
$$ 601612 591372 579741 568535 558829 549123 538530 528920 521811 515859 509512 503527 498784 494184
55805D94184n241m296j735K77J715M546Q309J0126R301Q097P702P089N957N271
$$ 494184 488943 484647 482912 483189 484904 489450 497759 507885 517186 525283 532985 540074 546031 551302
55791E51302M722L044R77O03J626J366j373n363r623j4031j7453j8249j6722j4461
$$ 551302 556024 559068 560045 560648 562274 563640 562267 556904 547281 533250 515797 497548 480826 466365
55777D66365j1570p041j284M455J0207J5819J8360J4534N414m498j2488j8710
$$ 466365 454795 447754 446470 450925 461132 476951 495311 509845 515259 510761 498273 479563
55765D79563k2805k3317k0705j7475j4848j2120r409p963p630o901n668n203n359
$$ 479563 456758 433441 412736 395261 380413 368293 358884 350921 343291 336390 330722 325519 320160
55752C20160m729l547l497m441m356k818j692j861k061j455q19n85j57K46o02
$$ 320160 315431 311884 308387 303946 299590 296772 295080 293219 291158 289703 288884 288299 288142 288388 287786
55737B87786k715m566n380n843o228n813m531l261k357j540j232k180l802m692
$$ 287786 285071 280505 275125 269282 263054 257241 252710 249449 247092 245552 244320 242140 238338 233646
55723B33646m575m149l477k405j866k530k814p14K905N322N873O190O758O105
$$ 233646 229071 224922 221445 219040 217174 214644 211830 211116 214021 219343 225216 231406 238164 244269
55709B44269L601N52j792l196l362k078n82o15k069l453m388n563o649o639n913
$$ 244269 247870 248422 246630 243434 240072 237994 237412 236797 234728 231275 226887 221324 214675 208036 202123
55694B02123n634n438m200k627k406l146k982j985j898k646k315p53P4k33K43
$$ 202123 196489 191051 186851 184224 181818 178672 175690 173705 171807 169161 166846 166093 166167 165934 166177
55679A66177K102L427L160K742L175L244J978M46l08q63j788k389k276k242k530
$$ 166177 168279 171706 174866 177608 180783 184027 186005 186451 186143 185280 183492 181103 178827 176585 174055
55664A74055k074m56J140J835K221K867L376L545L761L736K693J275J249K758
$$ 174055 171981 171525 172665 174500 176721 179588 182964 186509 190270 194006 196699 197974 199223 201981
55650B01981L914L701L178L208L155K640K323K145R37j265k727k862l337n253
$$ 201981 205895 209596 212774 215982 219137 221777 224100 226245 227182 225917 223190 220328 216991 211738
55636B11738p340q290q701r274r051p168m744l329k785k156j410r25m11L90R53
$$ 211738 204398 196108 187407 178133 169082 161914 157170 153841 151056 148900 147490 146565 146154 146544 147497
55621A47497R20P88P97L32p63j592j721j919k517k641j932j583k401l323l170
$$ 147497 148417 149205 150002 150334 149571 147979 146258 144339 141822 139181 137249 135666 133265 129942 126772
55606A26772k554k620l022k599j319j75K85K31j16o21j032j317j643j794j320
$$ 126772 124218 121598 118576 115977 114658 114483 114768 114999 114883 114262 113230 111913 110270 108476 107156
55591A07156n06k68p34r64l85N24J227J701J773J101J72L2P56J415J748K427L440
$$ 107156 106650 106382 105648 104684 104299 104823 106050 107751 109524 110625 110797 110829 111585 113000 114748 117175 120615
55574A20615L871L639L750M286L940K227M28m43r54j676k039j752j794k805l872
$$ 120615 124486 128125 131875 136161 140101 142328 142756 142313 141359 139683 137644 135892 134098 131293 127421
55559A27421l960l385k808k111j179o08o85q58r47j577k668k929j838o55m95p33
$$ 127421 123461 120076 117268 115157 113978 113370 112685 111827 110880 109303 106635 103706 101868 101213 100718 99985
55543I9985l94K71O42Q75J095P41k07o23P2Q37P17K65K26J66l28m86K55R15M64
$$ 99985 99591 99862 100504 101379 102474 103215 103008 102385 102457 103294 104011 104276 104502 104668 104340 103854 104109 105024 105488
55524A05488m89q97j040j623k114j615o06k93p60j135j115j090j199j326j571
$$ 105488 104999 104102 103062 101439 99325 97710 97104 96811 96051 94916 93801 92711 91512 90186 88615
55509H8615j885j804j269r42j042p83J84Q42L27o47r69p90q41j017q39n64o64
$$ 88615 86730 84926 83657 82715 81673 80890 81074 81916 82243 81596 80627 79837 78996 77979 77140 76576 75912
55492G5912q50o42k81j06K64J148J894J735R09J98k7L13J176J836J200n05j578
$$ 75912 75062 74420 74139 74033 74297 75445 77339 79074 79983 80181 80154 80467 81643 83479 84679 84174 82596
55475H2596j098j23J76J99O27R93P86O47J018R37k97j495j313m36l15p71o98k70
$$ 82596 81498 81375 81551 81750 82377 83370 84156 84803 85821 86758 86461 84966 83653 83217 82902 82131 81433 81163
55457H1163m74j108j163p44p52j091q55j09K60J89L93Q72R59O93P68J225J480
$$ 81163 80689 79581 78418 77674 76922 75831 74976 74867 75127 75316 75709 76581 77540 78233 79001 80226 81706
55440H1706J434J428J320Q11L29L74M02l33j262j178o2J065J751K196K124J097
$$ 81706 83140 84568 85888 86699 87028 87402 87804 87471 86209 85031 84969 86034 87785 89981 92105 93202
55424I3202k34o25KN88N85L36Q8j84q6O86J395J068P3m22l22n44j263j724j757
$$ 93202 92968 92343 92345 92933 93518 93854 93942 93758 93672 94358 95753 96821 96894 96472 96150 95606 94343 92619 90862
55405I0862j987k391k105r81m3m2o14j134j366j162m08M55Q12Q26J138J652J625
$$ 90862 88875 86484 84379 83398 83355 83313 82699 81565 80199 79037 78629 79084 79896 80722 81860 83512 85137
55388H5137R64M09K78Q7l85o14k21M91J082J390J272N98k74p15n36j39K4k51q94
$$ 85137 86101 86510 86788 86875 86490 85876 85655 86146 87228 88618 89890 90488 90214 89499 88963 88824 88848 88597 87703
55369H7703j415j192l70Q6k50n88l09j50r11j822j578m06K72j01p94j114r36k07
$$ 87703 86288 85096 84726 84812 84562 83974 83665 83515 82604 80782 79204 78798 79070 78969 78175 77061 76125 75918
55351G5918Q72J446R94K43ol40j538k658k151m87L82J7j14O32J115O71L36R62
$$ 75918 76790 78236 79230 79473 79467 79127 77589 74931 72780 72293 72675 72692 72578 73210 74325 74996 75332 76294
55333G6294J775J722R44J39l61l04N25J479J399L44k71J54M60l19j332j246j41
$$ 76294 78069 79791 80735 80874 80513 80209 80734 82213 83612 83956 83685 83839 84299 83980 82648 81402 81261
55316H1261R24J396J316P01l10j159j473j483j386r71l50k28p87j053j84J244
$$ 81261 82185 83581 84897 85598 85288 84129 82656 81173 79787 78816 78466 78238 77451 76398 76214 77458
55300G7458J993J731J101O47L82K26J50N3j26k29q7K10M14L37p5o09p82k85N24
$$ 77458 79451 81182 82283 82930 83312 83538 83688 83741 83615 83386 83299 83509 83923 84260 84185 83576 82794 82509 83033
55281H3033R99R63P04L86J9j86j01j07n65j011p26QK18k45n18j77K13K22K39N53
$$ 83033 84032 84995 85699 86085 86104 85918 85817 85710 85145 84134 83408 83416 83634 83389 82871 82694 82907 83129 83368 83921
55261H3921P31L96j10l31l67m68n01k62J59N77Q99J002Q32O01M38Lr00j659j596
$$ 83921 84652 85048 84938 84607 84240 83772 83271 83009 83168 83745 84644 85646 86478 87079 87517 87520 86620 84961 83365
55242H3365j124j066j097k24J223J666O57l55k54K26R1k29R1O69O31J79J74O77
$$ 83365 82241 81175 80078 79854 81077 82743 83400 83045 82791 83017 83108 82879 82970 83639 84270 84449 84623 85300
55224H5300J037J075J112J072N42l73r95r05k75N44J216J372Q62M0n56p12n36
$$ 85300 86337 87412 88524 89596 90138 89765 88770 87865 87590 88134 89350 90722 91584 91624 91068 90356 89820
55207H9820k04j8l49j184j922j949j194J3J295K209K267J419K57m99n60p4O18
$$ 89820 89616 89598 89249 88065 86143 84194 83000 83013 84308 86517 88784 90203 90460 89961 89401 89327 89945
55190H9945J050R06L60r9k95m20n01l46j02k39p70j121r43n40k18J00L98L66R2
$$ 89945 90995 91901 92261 92162 91867 91447 90946 90600 90498 90259 89489 88368 87425 86885 86667 86767 87165 87531 87623
55171H7623K49J075J758J384J34j025j436j145n32o0n4l28k21N62J460J687J116
$$ 87623 87872 88947 90705 92089 92223 91198 89762 88617 88085 88025 87971 87643 87422 87984 89444 91131 92247
55154I2247K36m88q44q13o32o97j106j464j369r20n25m51o46q12n17M02J425J756
$$ 92247 92483 91995 91151 90338 89706 89009 87903 86439 85070 84150 83625 83174 82528 81716 81199 81601 83026 84782
55136H4782J235N43K40J01l28r14j066n40K58P11N72J66M0L79Q30J064J215J513
$$ 84782 86017 86560 86800 86901 86573 85659 84593 84053 84311 85022 85594 85760 85800 86179 87009 88073 89288 90801
55118I0801J732J499R26L66k67j212j970j616j99R67Q20k03q61n93J09M56R5p02
$$ 90801 92533 94032 94958 95324 95057 93845 91875 90259 90060 91027 91847 91644 90783 90190 90299 90755 90850 90148
55100I0148j259j021m0J069J650J427O17j26j22O44J404J472R65L25l35r42r80
$$ 90148 88889 87868 87828 88897 90547 91974 92591 92465 92343 92987 94391 95863 96828 97153 96818 95876 94896
55083I4896j40Q73J057M57p1k17m01p22o90j45M22O05M33Jn35o42K3Q74J034O47
$$ 94896 94756 95629 96686 97143 97072 96855 96454 95732 95042 94897 95319 95924 96357 96358 95823 95181 95204 96078 97112 97759
55063I7759N41P22L85n46j121q23k10J50L37M57L15J6q7j30m46o01O5R45O77o68
$$ 97759 98300 99022 99407 98861 97740 96917 96707 96857 97194 97651 97966 97982 97895 97765 97319 96718 96783 97728 98405 97737
55043I7737j489j061m07k65N0R27J331M83o98j013o64l56L7O88Q53J22l99M41
$$ 97737 96248 95187 94780 94515 94565 95492 96823 97306 96608 95595 94931 94575 94612 95300 96153 96275 95876 96317
55025I6317J900K282J197k92j287j559j000J85J090J023M78L36N30N04L86O25
$$ 96317 98217 100499 101696 101404 100117 98558 97558 97743 98833 99856 100334 100670 101200 101704 102090 102715
55009A02715Q95N16l11o99l57K68Q03J085Q67K00k23M1L25j64r65j012l08K00
$$ 102715 103610 104126 103815 103116 102759 103027 103830 104915 105782 105982 105759 105800 106125 105961 104996 103984 103676 103876
54991A03876J75J94N17O18J65m04m92p5L35J59o59j294o90J019K330K131J044
$$ 103876 104051 104245 104762 105380 105545 105141 104649 104574 104909 105068 104409 103115 102425 103444 105774 107905 108949
54974A08949M02N29Q26R59R77P41J83j91M8M59L92N4PR2j75n36m07m9j91p18q29
$$ 108949 109351 109880 110706 111665 112642 113383 113566 113375 113423 113882 114274 114328 114335 114427 114252 113716 113309 113260 113069 112351 111522
54953A11522m06p4nK32O25O34K20J0J61P9n29j154j312j156q84l34N24J174J032
$$ 111522 111116 111042 111037 111269 111894 112528 112748 112758 112919 112998 112469 111315 110003 108847 107963 107629 108153 109327 110359
54934A10359J48q06j035k85Q54J399J068O10P52J304J694J913K259K637K855L256
$$ 110359 110507 109701 108666 108381 109235 110634 111702 112312 113064 114368 116062 117975 120234 122871 125726 128982
54918A28982M220N347N878N702N173M230K537L96j368k378k838k909k640k434
$$ 128982 133202 138549 144427 150129 155302 159532 162069 162465 161097 158719 155881 152972 150332 147898
54904A47898k775l537m131m255l970l345k578k156k143j759m55R97J383P00m0
$$ 147898 145123 141586 137455 133200 129230 125885 123307 121151 119008 117249 116794 117791 119174 119874 119834
54889A19834l41n42p85p94o33o19m84L25J501K050J776J593K189L235M170M921
$$ 119834 119493 118951 118166 117372 116739 116120 115636 115961 117462 119512 121288 122881 125070 128305 132475 137396
54873A37396N530N809N646N139M232K756R13q37k337l697m758n211n178n047m839
$$ 137396 142926 148735 154381 159520 163752 166508 167421 166584 164247 160550 155792 150581 145403 140356 135517
54858A35517m307l536k840k247j693j448j637j689j108m35n01j050j131p11o38
$$ 135517 131210 127674 124834 122587 120894 119446 117809 116120 115012 114577 114076 113026 111895 111184 110546
54843A10546j086j261p87l01l94q65j260j315p98L00J321J522J130R72J145J000
$$ 110546 109460 108199 107412 107111 106717 105852 104592 103277 102479 102779 104100 105622 106752 107724 108869 109869
54827A09869M41P4k2n00j450j962j420l58L52M53J79j29p0M09O70J49o09o03R7
$$ 109869 110310 110384 110362 109862 108412 106450 105030 104672 105024 105477 105656 105527 105457 105866 106536 106685 106076 105473 105570
54808A05570N16L67L07N12L91p5oQ74J618J479Q64M29J93Q0K85N94L27n01r32
$$ 105570 106086 106453 106760 107272 107663 107588 107582 108456 110074 111553 112417 112846 113039 113119 113404 113998 114325 113824 112892
54789A12892n10jj20m46k87K37O35Q30R37R06Q15R24J136J119J078J547K245K269
$$ 112892 112382 112381 112261 111815 111528 111765 112400 113230 114167 115073 115888 116812 117948 119067 120145 121692 123937 126206
54771A26206J664J518K151K537K142J905K674L892M763N367N764N251L703K438
$$ 126206 127870 129388 131539 134076 136218 138123 140797 144689 149452 154819 160583 165834 169537 171975
54757A71975K415K591J472n83k141l000m079n507o392o378n980n393m242k688
$$ 171975 174390 176981 178453 177870 175729 172729 168650 163143 156751 150373 144393 139000 134758 132070
54743A32070j559j214j143r21p59r32j261j398j174n76K41R15J145R78O71N34
$$ 132070 130511 129297 128154 127233 126474 125542 124281 122883 121709 121133 121374 122289 123434 124412 125083 125617
54727A25617R03J845K727K767K237K270L164L867L695L450L863M064K873Q60m28
$$ 125617 126520 128365 131092 133859 136096 138366 141530 145397 149092 152542 156405 160469 163342 164202 163774
54712A63774p74j321k457l255l152k879l197l825m053l729l125k462j912j675
$$ 163774 163000 161679 159222 155967 152815 149936 146739 142914 138861 135132 132007 129545 127633 125958
54698A25958j716j785j760j702j561j249r26q02p27m20m4j9k85k91K72J066J524
$$ 125958 124242 122457 120697 118995 117434 116185 115259 114457 113730 113310 113266 113247 112962 112671 112943 114009 115533
54681A15533J362O50k00n83k01N66J015Q32K83j56k76k75n67j204j527r08J65
$$ 115533 116895 117545 117345 116762 116561 117127 118142 118974 119257 119101 118825 118550 117983 116779 115252 114344 114509
54664A14509M49l32r57m41N29O80j1n27m52l07m54o43o52n47l10J43N65O42O45
$$ 114509 114958 114626 113669 113228 113757 114437 114426 113899 113447 113140 112686 112043 111391 110844 110534 110677 111242 111884 112529
54645A12529J093J848K204J886J302P97L38j0l9Q6r5n82q22n50j12K08N47R00
$$ 112529 113622 115470 117674 119560 120862 121659 121997 121987 121948 122034 121939 121357 120535 119985 119873 120081 120628 121528
54627A21528P52j87j321j709j164m39l01o85q30k60N08N25l43j093p70L67J259
$$ 121528 122280 122093 120772 119063 117899 117460 117159 116474 115644 115384 115892 116417 116074 114981 114211 114578 115837
54610A15837J325Q58L37o4l11l16o0L99J020J580J577P35m66j182j101o06j08
$$ 115837 117162 118020 118357 118293 117982 117666 117606 118005 119025 120605 122182 122917 122451 121269 120168 119562 119454
54593A19454L14N65L90k50r16j124q38m73m33o74p38k31O26J174J057O17L73M05
$$ 119454 119768 120333 120723 120473 119557 118433 117595 117122 116689 116015 115277 115046 115672 116846 117903 118520 118893 119298
54575A19298M89N02M11Q4m74q72o86J1P28J105J107Q59N18J99j36n51p79m10L79
$$ 119298 119787 120289 120700 120784 120310 119438 118752 118763 119491 120596 121703 122562 123080 123279 123143 122592 121813 121403 121782
54556A21782P60L57k9N71J848K474J743L48o20q47p69p07m55L04J362K011J811
$$ 121782 122542 122899 122870 123441 125289 127763 129506 129854 129234 128387 127618 126911 126456 126760 128122 130133 131944
54539A31944J086M35m9n96j001p37J05P18O66L38J25j07l09K2Q08R41k77j916
$$ 131944 133030 133465 133416 132820 131819 131082 131187 131905 132571 132909 133034 132927 132618 132640 133448 134389 134112 132196
54521A32196k500j848r50n14n55r78j536j503l95J101J826J618J187Q04J66n52
$$ 132196 129696 127848 126898 126384 125829 124851 123315 121812 121417 122518 124344 125962 127149 127953 128119 127567
54505A27567o89k00K73N27R91J554J339L9j453k190k132j553m04J099J992J542
$$ 127567 126878 126678 126951 127478 128469 130023 131362 131401 129948 127758 125626 124073 123669 124768 126760 128302
54489A28302L25l49Q7J063J740J792J409R51O11L21n2m12m99k15L00Q92J379J489
$$ 128302 128627 128278 128365 129428 131168 132960 134369 135320 135931 136252 136200 135788 135289 135074 135374 136266 137645 139134
54471A39134J172Q98J170J722J755R91P3k62L5M65N08m7r09j305p03M13R49N78
$$ 139134 140306 141204 142374 144096 145851 146842 146915 146653 146688 147153 147661 147614 146705 145400 144697 145110 146059 146637
54453A46637P6J17L10m0p66j072o87j95k55r11j709k121j866j104m08k36l73j59
$$ 146637 146713 146830 147140 147100 146334 145262 144575 144380 144125 143214 141505 139384 137518 136414 136006 135770 135397 135238
54435A35238N87J176Q90k9o79o71m85n14m21J27O89P08N58J042J993K306J504
$$ 135238 135825 137001 137891 137862 137183 136512 136027 135513 135092 135219 135908 136616 137174 138216 140209 142515 144019
54418A44019L15n26j099j582j625j086n22l15j3O98J153P78L66J068K527L176
$$ 144019 144334 143808 142709 141127 139502 138416 137894 137579 137566 138264 139417 140195 140561 141629 144156 147332
54402A47332K358J056M01M58O37N59J98k84n98n61l76l06k20J31N51N77J89k07
$$ 147332 149690 150746 151147 151605 152242 152801 152999 152715 152117 151556 151180 150874 150654 150785 151336 151913 152102 151895
54384A51895l48k77q5N6j37o22q19l93J46K31K30Q22J731J982J328M79K9o3L0
$$ 151895 151547 151270 151185 151241 151104 150482 149663 149270 149416 149647 149877 150699 152430 154412 155740 156219 156248 156185 156215
54365A56215K05J25l85p13l9J375K334K248J697J349J236J239J446J665J326K70
$$ 156215 156420 156545 156160 155447 155408 156783 159117 161365 163062 164411 165647 166886 168332 169997 171323 171593
54349A71593r24j635j827j793j809k046k392k415k011j839k434l128k777j447
$$ 171593 170669 169034 167207 165414 163605 161559 159167 156752 154741 152902 150468 147340 144563 143116
54335A43116l60j59k40L9N08Q05Q82O48r8j055j520j321q53k18Q07J786J772P39
$$ 143116 142756 142597 142357 142396 142904 143709 144591 145239 145141 144086 142566 141245 140392 140174 140981 142767 144539 145278
54317A45278j89k65Q3L40O21Q80N37m29j059p94l15l54n51k95J88M03M14L72l1
$$ 145278 145089 144824 144907 145247 145868 146748 147285 146856 145797 145003 144688 144334 143783 143488 143676 144079 144493 144865 144834
54298A44834p05o82N57J928J987Q12l86r94j251j240q00l34n27j164j195j69J086
$$ 144834 144129 143447 144004 145932 147919 148731 148345 147351 146100 144860 144060 143726 143199 142035 140840 140671 141757
54281A41757J451O70n66j320j099j95O02Q38P54O79M74r5p35q87l92M24J116J340
$$ 141757 143208 143878 143312 141992 140893 140698 141300 142138 142892 143571 144045 143950 143215 142328 141936 142360 143476 144816
54263A44816J000N08M96R56J090M53k56q9Q26J459J188L22n67j187j403j087l48
$$ 144816 145816 146324 146820 147776 148866 149319 149063 148974 149800 151259 152447 152769 152202 151015 149612 148525 148177
54246A48177L54M89m7p37q27j54N25M03l28p29m21ln9l98n01k47J12L30L08K53
$$ 148177 148531 149020 148973 148236 147409 147255 147780 148183 147855 147126 146705 146702 146643 146245 145744 145497 145609 145939 146247 146500
54226A46500O02J345J625Q01k84j69J107J981J699J195J188Q67n01j960k181j453
$$ 146500 147102 148447 150072 150873 150589 150420 151527 153508 155207 156402 157590 158457 157956 155996 153815 152362
54210A52362j007j047q06j86Q3k77p69j032j162j122p29j24L62P36J130J295R83
$$ 152362 151355 150308 149502 149316 149399 149122 148353 147321 146159 145037 144308 144184 144546 145282 146412 147707 148690
54193A48690N11K29k31j299k391k401j251rN23N26M11J46l87r05r21k41P69J320
$$ 148690 149201 149430 149199 147900 145509 143108 141857 141848 142371 142897 143308 143454 143067 142162 141241 141000 141769 143089
54175A43089Q92n2m74j18J67j72m29J50R92R69J61l48j09K82L06Q1k21o16r04
$$ 143089 143981 143929 143455 143337 143504 143332 142903 143053 144045 145014 145175 144827 144718 145000 145306 145387 145166 144550 143646
54156A43646q30o43q24j224j226p78n10p38j020q29j07Q77J739K065J799J479
$$ 143646 142816 142173 141349 140125 138899 138121 137611 136873 135853 135024 134917 135794 137533 139598 141397 142876
54140A42876J615J938J820J185M70j39p52j254j385j179p05K96J815K917K639
$$ 142876 144491 146429 148249 149434 149904 149765 149013 147759 146374 145195 144490 144786 146601 149518 152157
54125A52157J363M24L75N76M42J37q9k67k55K28Q78Q98Q1q53j188q95k54M88R15
$$ 152157 153520 153944 154319 154895 155337 155474 155385 155118 154863 155091 155969 156867 156948 156095 154907 154012 153758 154246 155161
54106A55161O17j59o27m62j53j78l84l53O2O72J062Q04Nm76K6J024J537J479J612
$$ 155161 155778 155619 154992 154530 154377 154199 153815 153462 153524 154196 155258 156062 156067 155591 155617 156641 158178 159657 161269
54087A61269K255K993L619M390N310O107O996Q396R746R663P616M500J255k047
$$ 161269 163524 166517 170136 174526 179836 185943 192939 201335 211081 220744 228360 232860 234115 232068
54073B32068n280p526q078p401o469n694n007m311l399k067p94n51j419k122j559
$$ 232068 226788 219262 211184 203783 197314 191620 186613 182302 178903 176836 176042 175491 174072 171950 170391
54058A70391j80Q52J223J442J742J877J761J598J479J403J492J761J942J921K081
$$ 170391 170211 171063 172286 173728 175470 177347 179108 180706 182185 183588 185080 186841 188783 190704 192785
54043A92785K780L747M457M814N051N233N270N261N365N492N408N038M486L901
$$ 192785 195565 199312 203769 208583 213634 218867 224137 229398 234763 240255 245663 250701 255187 259088
54029B59088L474L250K896K018P77k89j173k443m210n690o258o279o433o688o608
$$ 259088 262562 265812 268708 270726 271503 271214 270041 267598 263388 257698 251440 245161 238728 232040 225432
54014B25432o149n556m847l999l310l065l089l094l097l068k609j591p01o07r04
$$ 225432 219283 213727 208880 204881 201571 198506 195417 192323 189226 186158 183549 181958 181257 180650 179746
53999A79746o98NL15j91r73j432j567j517j130l37N69J234J500J240L57p84j394
$$ 179746 179048 179053 179368 179177 178204 176772 175205 173688 172558 172221 172790 174024 175524 176764 177121 176337 174943
53982A74943j021p7O07N93L8o15r13o17M8M67K43k98m48Q5R18J522J714J521R17
$$ 174943 173922 173845 174452 175045 175083 174468 173555 172938 172986 173453 173696 173398 172950 173035 173953 175475 177189 178710 179627
53963A79627N7m58p3R04J480J160N66N44J117J751K221K598K642K012J128R69
$$ 179627 179684 179226 179153 180057 181537 182697 183263 183807 184924 186675 188896 191494 194136 196148 197276 198245
53947A98245J852L012L690M043M586N342O035O739P769R191J0896J2977J5463
$$ 198245 200097 203109 206799 210842 215428 220770 226805 233544 241313 250504 261400 274377 289840
53934B89840J7663J8248J6212J1641N532p78o031r246j0081r061p296n600m008
$$ 289840 307503 325751 341963 353604 359136 358358 352327 343081 333000 323939 316643 311043 307035
53921C07035k290p94j98l91k94O90J601J103o04j927j895j198r98j512k121k301
$$ 307035 304745 303951 303753 303362 303068 303758 305359 306462 305858 303931 302036 300838 299840 298328 296207 293906
53905B93906k061j783j967k790l855m591m920n141n151m553l585l162l696m523
$$ 293906 291845 290062 288095 285305 281450 276859 271939 266798 261647 257094 253509 250347 246651 242128
53891B42128m866m702m276l506k486j864k034k428k350k079k260k620k233j039
$$ 242128 237262 232560 228284 224778 222292 220428 218394 215966 213616 211537 209277 206657 204424 203385
53877B03385r1j48q17j380j745k113k255j740p29Kr0p72j455j843k039k116j976
$$ 203385 203294 203146 202329 200949 199204 197091 194836 193096 192367 192369 192279 191507 190052 188209 186170 184054 182078
53860A82078j587j161q90p38o19n55m90k07L10O80O69O25R20J241J043N14L75
$$ 182078 180491 179330 178440 177702 177083 176528 176038 175831 176141 176821 177490 178115 179035 180276 181319 181833 182208
53843A82208P50R79O14l7n01n91j73P95J761J858R89N7k28n6J83N39R36Q15Po74
$$ 182208 182958 183937 184551 184514 184013 183422 183249 184044 185805 187663 188652 188709 188481 188425 188608 189147 190083 190898 190905 190231
53823A90231m48L09O91N53M69P39J232J903K712L217K948K241J969K438L091L317
$$ 190231 189783 190092 190783 191336 191805 192544 193776 195679 198391 201608 204556 206797 208766 211204 214295 217612
53807B17612L068K633K241J999J880J699J296P68L95M27R85J953K778K745J753
$$ 217612 220680 223313 225554 227553 229433 231132 232428 233196 233591 234018 235003 236956 239734 242479 244232
53792B44232N57mJ60N52P08M29k56j028j474j672k167l097l801l716l225l040
$$ 244232 244789 244785 244945 245497 246205 246634 246378 245350 243876 242204 240037 236940 233139 229423 226198 223158
53776B23158l206l314l290l293l083k288j218o81r44j453j676j637j557j411j099
$$ 223158 219952 216638 213348 210055 206972 204684 203466 202785 201841 200388 198712 197075 195518 194107 193008
53761A93008o86l09j0K22L67L40N6l76n58j60N20P76L85n9O7O56J148J140N14
$$ 193008 192322 192013 192003 192225 192592 192932 192988 192612 192054 191894 192414 193190 193575 193516 193583 194239 195387 196527 197041
53742A97041n43j345j082K09J485J927J760J504J147O61N80J234J888J618O65
$$ 197041 196498 195153 194071 194280 195765 197692 199452 200956 202103 202764 203344 204578 206466 208084 208749
53727B08749J3j1J79M50J097K007K639K805K743K469J860J298J428K284L283L970
$$ 208749 208762 208751 208930 209380 210477 212484 215123 217928 220671 223140 225000 226298 227726 230010 233293 237263
53711B37263M140L438J801J01n73k41K40O71J679L300M635N118N146N125M874
$$ 237263 241403 244841 246642 246743 246170 245929 246169 246840 248519 251819 256454 261572 266718 271843 276717
53696B76717M247L477K588J368K81K72J258J851J221K47J0J45l66j479k212k088
$$ 276717 280964 284441 287029 288397 288678 288950 290208 292059 293280 293527 293537 293682 293316 291837 289625 287537
53680B87537j419n58K46M39m67k005k934k388o34J232J995J150n48j587j226k98
$$ 287537 286118 285560 285806 286245 285778 283773 280839 278451 277817 279049 281044 282194 281646 280059 278833 278535
53664B78535k9m75p23l62J09J76q9m42q29j151j177q97n92m16k12J83P25J381
$$ 278535 278506 278031 277308 276946 277055 277231 277142 276700 275871 274720 273543 272646 272054 271638 271426 271609 272334 273715
53646B73715K173K826K729J509l13j493j042Q02K621L052K135J178J199J839K162
$$ 273715 275888 278714 281443 282952 282639 281146 280104 280906 283527 286579 288714 289892 291091 292930 295092
53631B95092K045K142K629K929K778K802L513M333M292L403K650K696L293M029
$$ 295092 297137 299279 301908 304837 307615 310417 313930 318263 322555 325958 328608 331304 334597 338626
53617C38626M934O020O792O792O358O252O670P127P275P266P077O146M097J564
$$ 338626 343560 349580 356372 363164 369522 375774 382444 389571 396846 404112 411189 417335 421432 422996
53603D22996k21o12o7M48K97m70j334j803j865j890k076k112j613p28k9J14j75
$$ 422996 422775 422163 422096 422544 422841 422371 421037 419234 417369 415479 413403 411291 409678 408950 408921 409035 408860
53586D08860n90r85j393j820k139k145j750j182q53r35j168j190r43o14l77l41
$$ 408860 408270 407285 405892 404072 401933 399788 398038 396856 396003 395068 393900 392710 391767 391153 390776 390435
53570C90435n56q70r17m98J32N25N32L70L26M99P89R54Q57P11Q36J134J119O03
$$ 390435 389879 389009 388092 387594 387726 388251 388783 389153 389479 389978 390767 391721 392578 393289 394125 395259 396378 396981
53552C96981K2j14K14P60J428K133K606K688K581K508K471K555L085M024M789
$$ 396981 397003 396889 397103 397863 399291 401424 404030 406718 409299 411807 414278 416833 419918 423942 428731
53537D28731N042N257N947O840P466Q070R117J0256J0757J0721J0974J1830J2776
$$ 428731 433773 439030 444977 451817 459283 467353 476470 486726 497483 508204 519178 531008 543784
53524E43784J3389J3728J3896J4005J4572J6093J8161J9812K0798K1642K2442
$$ 543784 557173 570901 584797 598802 613374 629467 647628 667440 688238 709880 732322
53513G32322K2648K2269K2223K3082K4359K5444K6336K7013K6927K5830K4399
$$ 732322 754970 777239 799462 822544 846903 872347 898683 925696 952623 978453 1002852
53502A002852K3409K2832K2262K1619K0877J9777J8520J8051J8846J9888J9732
$$ 1002852 1026261 1049093 1071355 1092974 1113851 1133628 1152148 1170199 1189045 1208933 1228665
53491A228665J8334J6968J6534J6721J6847J6795J6881J7377J8254J9113J9213
$$ 1228665 1246999 1263967 1280501 1297222 1314069 1330864 1347745 1365122 1383376 1402489 1421702
53480A421702J7959J5491J2666J0312Q590O978M843K015j086l958o487q837j1012
$$ 1421702 1439661 1455152 1467818 1478130 1486720 1493698 1498541 1500556 1499470 1495512 1489025 1480188 1469176
53467A469176j2885j4445j5637j6139j5874j5570j6068j7116j7760j8022j9079
$$ 1469176 1456291 1441846 1426209 1410070 1394196 1378626 1362558 1345442 1327682 1309660 1290581
53456A290581k1316k3342k3726k2895k2260k2201k2011k1472k1160k1148k0543
$$ 1290581 1269265 1245923 1222197 1199302 1177042 1154841 1132830 1111358 1090198 1069050 1048507
53445A048507j8629j5834j3109j0888q944o986n087l625k870k541k002r36L29
$$ 1048507 1029878 1014044 1000935 990047 981103 974117 969030 965405 962535 959994 957992 957056 957385
53432I57385J418K454L714N070O273P496R071J0892J2608J4273J6156J7997J9109
$$ 957385 958803 961257 964971 970041 976314 983810 992881 1003773 1016381 1030654 1046810 1064807 1083916
53419A083916J9396J9634K0558K2113K3885K5776K7863K9925L1581L2870L4285
$$ 1083916 1103312 1122946 1143504 1165617 1189502 1215278 1243141 1273066 1304647 1337517 1371802
53408A371802L6156L8227M0087M1856M4134M7118N0103N2219N3428N4388N5412
$$ 1371802 1407958 1446185 1486272 1528128 1572262 1619380 1669483 1721702 1775130 1829518 1884930
53397A884930N6222N6765N7558N8772N9609N9196N7738N6139N4738N3098N0990
$$ 1884930 1941152 1997917 2055475 2114247 2173856 2233052 2290790 2346929 2401667 2454765 2505755
53386B505755M8889M7259M5868M4038M1355L7908L4042L0043K6001K1943J7967
$$ 2505755 2554644 2601903 2647771 2691809 2733164 2771072 2805114 2835157 2861158 2883101 2901068
53375B901068J4114J0021M917j798j0055j9197k8336l6573m3258m8346n2265n5233
$$ 2901068 2915182 2925203 2930120 2928322 2918267 2899070 2870734 2834161 2790903 2742557 2690292 2635059
53363B635059n7041n7729n8027n8622n9258n9142n8045n6401n4456n2047m9333
$$ 2635059 2578018 2520289 2462262 2403640 2344382 2285240 2227195 2170794 2116338 2064291 2014958
53352B014958m7120m6133m6301m6957m7421m7218m6117m4305m2315m0478l8476
$$ 2014958 1967838 1921705 1875404 1828447 1781026 1733808 1687691 1643386 1601071 1560593 1522117
53341A522117l5747l2333k9036k6604k4862k2884k0058j6781j3958j2080j1056
$$ 1522117 1486370 1454037 1425001 1398397 1373535 1350651 1330593 1313812 1299854 1287774 1276718
53330A276718j0750j1158j2005j2689j2888j2859j2889j2789j2207j1145r800
$$ 1276718 1265968 1254810 1242805 1230116 1217228 1204369 1191480 1178691 1166484 1155339 1145539
53319A145539q171o231m269k668j465m20N95J579K628L819N013O046P033Q186
$$ 1145539 1137368 1131137 1126868 1124200 1122735 1122315 1122910 1124489 1127117 1130936 1135949 1141995 1149028 1157214
53305A157214R506J0984J2840J5154J7464J9206K0543K2246K4598K6932K8453
$$ 1157214 1166720 1177704 1190544 1205698 1223162 1242368 1262911 1285157 1309755 1336687 1365140
53294A365140K9125K9495K9778K9523K8220K6050K3899K2494K1698K0783J9368
$$ 1365140 1394265 1423760 1453538 1483061 1511281 1537331 1561230 1583724 1605422 1626205 1645573
53283A645573J7686J5918J3671J0488O539K506j175m577p924j1196j4094j6355
$$ 1645573 1663259 1679177 1692848 1703336 1709875 1712381 1711206 1706629 1698705 1687509 1673415 1657060
53271A657060j8166k0247k3176k6516k9066l0199l0563l1125l2019l2754l3175
$$ 1657060 1638894 1618647 1595471 1568955 1539889 1509690 1479127 1448002 1415983 1383229 1350054
53260A350054l3508l3677l3235l2078l0686k9609k9020k8854k8984k9184k9179
$$ 1350054 1316546 1282869 1249634 1217556 1186870 1157261 1128241 1099387 1070403 1041219 1012040
53249A012040k8782k7991k7065k6524k6681k7000k6459k4858k3228k2411k1807
$$ 1012040 983258 955267 928202 901678 874997 847997 821538 796680 773452 751041 729234
53238G29234k0301j7955j5775j4105j2366j0407q993q565q467p958p270p091p509
$$ 729234 708933 690978 675203 661098 648732 638325 629332 620767 612300 604342 597072 589981 582472
53225E82472q091q665r483j0747j2286j3612j4114j3542j2417j1605j1318j0945
$$ 582472 574381 565716 556233 545486 533200 519588 505474 491932 479515 467910 456592 445647
53213D45647j0088r124q402p517o095m863m983o357p486p304o428o161o725p156
$$ 445647 435559 426435 418033 410516 404421 399558 394575 388218 380732 373428 367000 360839 354114 346958
53199C46958o755n958n598n789n901n441m475l334k277j597j630k363l152l240
$$ 346958 340203 334245 328647 322858 316957 311516 307041 303707 301430 299833 298203 295840 292688 289448
53185B89448k597k005k201l018l482k861j498n45p28j591k114j957j692j867k245
$$ 289448 286851 284846 282645 279627 276145 273284 271786 271241 270513 268922 266808 264851 263159 261292 259047
53170B59047k176j428m22J38k03j250k198k316j730j197j080j028p74o72r94j302
$$ 259047 256871 255443 255021 255159 254956 253706 251508 249192 247462 246265 245185 244157 243383 242711 241717 240415
53154B40415j064n26l25n15n17O3J023J856K069J407K83l24J00Q97J064N21rj84
$$ 240415 239351 238825 238500 237985 237468 237531 238554 240410 242479 243886 244169 243845 243945 244842 245906 246427 246418 246234
53136B46234l29o85j036j143r56m12L79Q71O21Q1R1N97P42K70KN58J477J958J859
$$ 246234 245905 245220 244184 243041 242085 241673 242052 242923 243544 243625 243716 244313 245055 245325 245327 245885 247362 249320 251179
53117B51179J470R49M21J46O6l07j075j517j043j82N7n11j230j664j958k221k208
$$ 251179 252649 253598 254019 254165 254231 253924 252849 251332 250289 250107 250164 249653 248423 246759 244801 242580 240372
53100B40372j812j352j150j090q37k46N51J280J662J506Q97K01k46m45o77j137
$$ 240372 238560 237208 236058 234968 234131 233885 234436 235716 237378 238884 239781 239982 239736 239291 238614 237477
53084B37477j657j840j460o57J76O98Q07O30L94K02k9l37n64n51m39n15p37q20
$$ 237477 235820 233980 232520 231863 232039 232737 233544 234174 234568 234770 234741 234404 233840 233289 232850 232335 231598 230778
53066B30778p24o75o18j96N10Q32M38j26k85k83o02r91q31j53M68Q14J047R81
$$ 230778 230054 229379 228761 228565 229075 229907 230345 230219 229934 229651 229049 228058 227227 227074 227542 228356 229403 230384
53048B30384K10j011j830j917j787j853j819j298m69K31N90O58O07O96R71J029
$$ 230384 230594 229583 227753 225836 224049 222196 220377 219079 218610 218841 219431 220089 220696 221392 222363 223392
53032B23392N84J74N87J513J639L61j282j868j186j03O16Q14O63M05L03M58O67
$$ 223392 223976 224150 224737 226250 227889 228250 226968 225100 223914 223811 224427 225241 225904 226309 226612 227070 227737
53015B27737O42K24n60j370j584q51K86Q54O27K72L05M61L81K27K42K50K4k37
$$ 227737 228379 228603 228043 226673 225089 224238 224524 225378 226005 226277 226582 227043 227424 227651 227893 228143 228167 227930
52997B27930k14J07N72J038J164N28o66j442j129k03L69L09J02J43L67N56O09
$$ 227930 227716 227823 228395 229433 230597 231125 230459 229017 227888 227685 228054 228363 228465 228608 228975 229531 230140
52980B30140N14L61L29M79O74Q23J017J283J455J429J325J266J180R17L66n11
$$ 230140 230654 231015 231344 231823 232497 233320 234337 235620 237075 238504 239829 241095 242275 243192 243558 243047
52964B43047j463j879j347k60N92R49J050Q17o8j246j796j550j377j679j651o84
$$ 243047 241584 239705 238358 238098 238690 239639 240689 241506 241438 240192 238396 236846 235469 233790 232139 231455
52948B31455L48J70j034j838j368r1R46J068K73p82j228q34k49j28l57n32o18
$$ 231455 231803 231973 230939 229101 227733 227642 228588 229656 229929 229147 227919 227085 226836 226708 226351 225819 225201
52931B25201o86m37K70Q92Q34L38Nj74n54r06o95j43j02p54j277r86j64M78O03
$$ 225201 224515 224078 224348 225240 226074 226412 226417 226243 225689 224783 224088 223945 223843 223089 221812 220826 220662 221140 221743
52912B21743L19r3k90m1M79P84O04J41k41m35o86j283k059k277j373J02R06O97
$$ 221743 222062 221969 221679 221638 222117 222901 223505 223646 223405 222970 222284 221001 218942 216665 215292 215394 216300 216997
52894B16997N54J368K400K269R60j89l05J57M19L85L01J47k44p58j078j020o95
$$ 216997 217551 218919 221319 223588 224548 224359 224054 224211 224630 225015 225316 225463 225219 224461 223383 222363 221668
52877B21668m43m76n16p6P69J253J008P15J131J856J956J496J451K133K678K368
$$ 221668 221225 220749 220233 220157 220926 222179 223187 223902 225033 226889 228845 230341 231792 233925 236603 238971
52861B38971J534Q20K10o30j605k282k527k576k644k725k734k680k673k710k508
$$ 238971 240505 241325 241535 240905 239300 237018 234491 231915 229271 226546 223812 221132 218459 215749 213241
52846B13241j711m98L29K18m34q47q20o41l21L69J192J560J426J361J567J440
$$ 213241 211530 211032 211361 211579 211145 210298 209478 208837 208516 208885 210077 211637 213063 214424 215991 217431
52830B17431M48j051k167k318j492j41R60J105K71q01j323j111n05J2J09k06n31
$$ 217431 217879 216828 214661 212343 210851 210710 211670 212775 213046 212245 210922 209811 209306 209318 209427 209221 208690
52813B08690l64M74J775L118L928L682K483J236O98M79l77j925l151l313k822
$$ 208690 208326 208800 210575 213693 217621 221303 223786 225022 225720 226199 225822 223897 220746 217433 214611
52798B14611k487k500k471k088j400o69j60N2J15R1j56n32m38M61J484J663J070
$$ 214611 212124 209624 207153 205065 203665 202996 202836 202888 203003 203094 202938 202406 201968 202429 203913 205576 206646
52781B06646O09N73L91j33m13k26k38q29j290r63l24j72l44j73K79M21K56L91
$$ 206646 207255 207828 208219 208086 207673 207447 207209 206380 205090 204127 203803 203631 203287 203114 203393 203814 204070 204461
52763B04461R03J160Q28L65K90N28O72N40K48qm8K16P25J296J697J667J088K92
$$ 204461 205364 206524 207352 207717 208007 208535 209207 209747 209995 209987 209939 210155 210880 212176 213873 215540 216628 216920
52745B16920j12N2K82J12k00r5M69J129J758K412K749K283J243N04M58N00rq59
$$ 216920 216808 216860 217142 217254 217054 216959 217428 218557 220315 222727 225476 227759 229002 229506 229964 230464 230455 229596
52727B29596j427j564j521j319q56m00l96p34q42n53k97k53M2P82J211N42p72
$$ 229596 228169 226605 225084 223765 222909 222509 222113 221379 220537 219984 219687 219434 219476 220258 221469 222011 221239
52710B21239j509j318j042j245j287m01J011J821J623J028O29L46j21o91r63o39
$$ 221239 219730 218412 217370 216125 214838 214437 215448 217269 218892 219920 220549 220895 220774 220083 219120 218481
52694B18481K21J174J666J504J039P79Q78J086J098P63J63l53m35k48l71r47j225
$$ 218481 218702 219876 221542 223046 224085 224864 225742 226828 227926 228689 228852 228499 228064 227816 227445 226498 225273
52677B25273m81Q91J756J579Q66L76L55N50N50J26m56o04j90J36j22m62j75L66
$$ 225273 224792 225683 227439 229018 229884 230260 230615 231165 231715 231841 231385 230781 230591 230727 230605 230143 229968 230334
52659B30334J72o68q56K88J829K473K010J033m3j023j575j457r07l17J87N37M96
$$ 230334 230506 229838 228982 229270 231099 233572 235582 236615 236572 235549 233974 232517 231610 231293 231480 232017 232513
52642B32513On35o94m79r8L61P42P29K50l00n33m43p6P04J782K582K662K207J615
$$ 232513 232519 231984 231290 230811 230713 231074 231816 232545 232795 232495 231962 231519 231443 232147 233929 236511 239173 241380 242995
52623B42995R95M08L9j82o49j354j678j400j202j513j547n14Q24R82r0r59q31
$$ 242995 243990 244398 244437 244255 243606 242252 240574 239174 237972 236459 234912 234398 235222 236204 236114 235155 234324
52606B34324m32m50l64N05J664K042J407M53j78l00J03R13J629J672J004K08j09
$$ 234324 233892 233442 233078 233583 235247 237289 238696 239149 238971 238671 238774 239687 241316 242988 243992 244200 244091
52589B44091J90P83J143R14K85n5L70J222J749J710J512J388R94N3r14j118n93
$$ 244091 244281 245064 246207 247121 247406 247351 247721 248943 250692 252402 253914 255302 256296 256349 255435 254317 253724
52572B53724k63p74j696k141j868j388j128r98p91o15p08r91j117q25k00M37P48
$$ 253724 253461 252687 250991 248850 246982 245594 244466 243468 242677 242062 241354 240363 239246 238421 238221 238658 239406
52555B39406O03K01j8K49Q13J067N48m64j059o13L99Q48K41o94r71m77J39M90
$$ 239406 240009 240210 240192 240441 241254 242321 242869 242405 241346 240733 241132 241980 242221 241527 240556 240079 240218 240708
52537B40708P65J124J305J088P05N19N14L99R5j35l6L32O86Q12O62K15n42j337
$$ 240708 241473 242597 243902 244990 245695 246214 246728 247127 247222 247087 247051 247383 248069 248881 249543 249758 249216 247879
52519B47879j522p15N39J231J158J066J369J475R47N27J082K049K134J283P02
$$ 247879 246357 245642 246181 247412 248570 249636 251005 252480 253427 253954 255036 257085 259219 260502 261204
52504B61204Q66Q64R5o73o13j96k89p05o62k06r8n13p81m93r7j85p32j195j059
$$ 261204 262070 262934 263029 262356 261743 261547 261258 260553 259891 259685 259587 259074 258293 257800 257703 257518 256786 255591 254532
52485B54532k23Q92J533J264L89m01p23p22o92p73r35j003p35r5N87R30R51J032
$$ 254532 254309 255201 256734 257998 258387 257986 257263 256541 255849 255076 254141 253138 252403 252308 252895 253825 254776 255808
52467B55808J476K193K837L201L365L488L448K888J729M28m91j002j378j651j705
$$ 255808 257284 259477 262314 265515 268880 272368 275816 278704 280433 280861 280370 279368 277990 276339 274634
52452B74634j665j727j699j307q83j058j758k163j781r12k1O23O01m35j883k425
$$ 274634 272969 271242 269543 268236 267353 266295 264537 262374 260593 259681 259660 260283 260884 260449 258566 256141
52436B56141j582l04L58M18K95j1m66n49r5K21j2q5O41J478J450R61J144K051
$$ 256141 254559 254255 254613 255031 255326 255315 254849 254300 254205 254426 254414 254329 254970 256448 257898 258859 260003 262054
52418B62054K797L270M216N726O989P829R066J0965J2398J2130J0033O575K014
$$ 262054 264851 268121 272337 278063 285052 292881 301947 312912 325310 337440 347473 354048 356062
52405C56062l117p480r735r792q722p625o822n953m578k784j322q17r48p52J15
$$ 356062 352945 345465 335730 325938 317216 309591 302769 296816 292238 289454 288132 287315 286367 285615 285730
52390B85730R76J058L83m15p75m55M47J462K039K107K098K360K795L212L605L947
$$ 285730 286706 287764 288147 287732 286957 286502 286949 288411 290450 292557 294655 297015 299810 303022 306627 310574
52374C10574M083M021M076M465N030N486N657N381M517L200J824O59k91r28r30
$$ 310574 314657 318678 322754 327219 332249 337735 343392 348773 353290 356490 358314 358973 358682 357754 356824
52359C56824j69J006K073K782L207L575M099M783N321N505N673O438P867R327
$$ 356824 356655 357661 359734 362516 365723 369298 373397 378180 383501 389006 394679 401117 408984 418311
52345D18311J0203J0489J0545J0717J1345J2700J4575J6193J6880J6745J6559
$$ 418311 428514 439003 449548 460265 471610 484310 498885 515078 531958 548703 565262
52334E65262J7020J8234J9686K0654K0865K0744K0849K1095K0930K0253J9646
$$ 565262 582282 600516 620202 640856 661721 682465 703314 724409 745339 765592 785238
52323G85238J9453J9124J7850J5611J3141J1021R230P531N870M288K656P78j237
$$ 785238 804691 823815 841665 857276 870417 881438 890668 898199 904069 908357 911013 911791 910554
52310I10554k930l941m459n027n848o536o731o624o563o376n607m374l407l097
$$ 910554 907624 903683 899224 894197 888349 881813 875082 868458 861895 855519 849912 845538 842131 839034
52296H39034k957k294j119m8M85P21J293K627M600O698Q517J0053J1480J2817
$$ 839034 836077 833783 832664 832616 833101 833822 835115 837742 842342 849040 857557 867610 879090 891907
52282H91907J3981J4965J5711J5978J5608J4908J4395J4127J3641J2465J0493
$$ 891907 905888 920853 936564 952542 968150 983058 997453 1011580 1025221 1037686 1048179
52271A048179P947N276L063J594M78r00k577m094n317o609q067r104r208q702
$$ 1048179 1056126 1061402 1064465 1066059 1066537 1065637 1063060 1058966 1053649 1047040 1038973 1029869 1020661 1011959
52257A011959q414q751r428r902r911r631r481r671r922r804r312q771q230p446
$$ 1011959 1003545 994794 985366 975464 965553 955922 946441 936770 926848 917044 907732 898961 890731 883285
52243H83285o557o190o524o700n702l601j456r0N67R51J228J412J743K529L617
$$ 883285 876728 870538 864014 857314 851612 848011 846555 846465 847032 847983 849211 850623 852366 854895 858512
52228H58512M295L937K742J735J881L222M848N742N630N096M945N499O467P398
$$ 858512 862807 866744 869486 871221 873102 876324 881172 886914 892544 897640 902585 908084 914551 921949
52214I21949Q077Q424Q244P468O465N725N137M102K531J224Q72J124J112N77m7
$$ 921949 930026 938450 946694 954162 960627 966352 971489 975591 978122 979346 980218 981342 982454 983031 982984
52199I82984m20n87n80k86K43P41J041J159J084P96M36J44r1k57k08j40p59k486
$$ 982984 982564 981977 981397 981111 981354 982095 983136 984295 985379 986175 986611 986755 986664 986407 986199 986059 985300 982814
52181I82814m640o065o414o285o140n823n129m256l461k732j924r78M8Q98J239
$$ 982814 978174 972109 965695 959410 953270 947447 942318 938062 934601 931869 929945 928967 929015 929913 931152
52166I31152J199J466K331L110L166L134M071N686O567O199N487N131M697L855
$$ 931152 932351 933817 936148 939258 942424 945558 949629 955315 961882 968081 973568 978699 983396 987251
52152I87251L361L935M998N532N589O131P625R573J1266J2413J3127J3636J3987
$$ 987251 990612 994547 999545 1005077 1010666 1016797 1024422 1033995 1045261 1057674 1070801 1084437 1098424
52139A098424J3909J3244J2524J2585J3490J4417J4868J5256J6008J6764J7100
$$ 1098424 1112333 1125577 1138101 1150686 1164176 1178593 1193461 1208717 1224725 1241489 1258589
52128A258589J7316J7873J8511J8607J8107J7418J6657J5583J4060J2090R675
$$ 1258589 1275905 1293778 1312289 1330896 1349003 1366421 1383078 1398661 1412721 1424811 1434486
52117A434486P089M909L247J342j461m611o917q107r080j0685j2786j4599j5428
$$ 1434486 1441575 1446484 1449731 1451073 1449612 1445001 1438084 1429977 1420897 1410212 1397426 1382827 1367399
52104A367399j5010j3583j1751j0031q432o620m439k100J4J658K925M162N440
$$ 1367399 1352389 1338806 1327055 1317024 1308592 1301972 1297533 1295433 1295447 1297105 1300030 1304192 1309632
52091A309632O170N768M771M570N773P479Q708R741J1329J3182J4359J4804J5400
$$ 1309632 1315802 1321570 1326341 1330911 1336684 1344163 1352871 1362612 1373941 1387123 1401482 1416286 1431686
52078A431686J6410J6927J6240J4926J4018J3542J2562J0530P975N723L795J461
$$ 1431686 1448096 1465023 1481263 1496189 1510207 1523749 1536311 1546841 1554816 1560539 1564334 1565795
52066A565795j687n153q216j0862j3557j6278j8406j9622k0289k0757k0901k0648
$$ 1565795 1564108 1558955 1550739 1539877 1526320 1510042 1491636 1472014 1451725 1430968 1410067 1389419
52054A389419k0433k0712k1437k2273k2988k3319k2965k2074k1274k0839k0286
$$ 1389419 1368986 1348274 1326837 1304564 1281576 1258257 1235292 1213218 1191944 1171105 1150819
52043A150819j9169j7731j6307j4637j2336r643p076m733k566r34k17j72l10o24
$$ 1150819 1131650 1113919 1097612 1082975 1070639 1060996 1053920 1049187 1046621 1045687 1045470 1045298 1044988 1044364
52029A044364j302k072k555l093m407o540q747j0373j1286j1585j1476j1332j1337
$$ 1044364 1043062 1040990 1038435 1035342 1030935 1024395 1015648 1005275 993989 982404 970928 959596 948259
$$ [...]
##END NTUPLES=NMR SPECTRUM
##END=
