##TITLE=AC1585_DECA0002_8281262_Y2MnwaBRaM
##JCAMPDX= 6.0         $$ Bruker NMR JCAMP-DX V2.0
##DATA TYPE= NMR SPECTRUM
##DATA CLASS= NTUPLES
##ORIGIN= BRUKER
##OWNER= Administrator
$$ 1.72 TOPSPIN		Version 2.1
$$ 2013-10-19 00:27:44.985 -0700  Administrator@X
$$ Compression mode = diff/dup
##.OBSERVE FREQUENCY= 400.02188249412
##.OBSERVE NUCLEUS= ^1H
##.ACQUISITION MODE= SIMULTANEOUS (DQD)
##.ACQUISITION SCHEME= undefined
##.AVERAGES= 8
##.DIGITISER RES= 22
##SPECTROMETER/DATA SYSTEM= spect
##.PULSE SEQUENCE= zg30
##.SOLVENT NAME= COFFEE_meoh
##.SHIFT REFERENCE= INTERNAL, COFFEE_meoh, 1, 14.98509
##AUDIT TRAIL= $$ (NUMBER, WHEN, WHO, WHERE, PROCESS, VERSION, WHAT)
$$ ##TITLE= Audit trail, TOPSPIN		Version 2.1
$$ ##JCAMPDX= 5.01
$$ ##ORIGIN= Bruker BioSpin GmbH
$$ ##OWNER= Administrator
$$ $$ E:\/data/COFFEE/nmr/AC1585_DECA0002_8281262_Y2MnwaBRaM/10/pdata/1/auditp.txt
$$ ##AUDIT TRAIL=  $$ (NUMBER, WHEN, WHO, WHERE, PROCESS, VERSION, WHAT)
(   1,<2013-10-19 00:27:38.141 -0700>,<Administrator>,<X>,<go>,<TOPSPIN 2.1>,
      <created by zg
	started at 2013-10-19 00:26:31.329 -0700,
	POWCHK enabled, PULCHK disabled,
       configuration hash MD5:
       C8 4E 4E 5D D3 5C D8 9E 9F 52 82 E0 59 8A DE 15
       data hash MD5: 64K
       B1 EB F5 9C EC 72 19 02 64 5F 61 01 EA 5A 5E 84>)
(   2,<2013-10-19 00:27:41.095 -0700>,<Administrator>,<X>,<proc1d>,<TOPSPIN 2.1>,
      <Start of raw data processing
       efp LB = 0 FT_mod = 6 PKNL = 1 PHC0 = 0 PHC1 = 0 SI = 32K 
       data hash MD5: 32K
       56 07 EE 61 3E 74 2B 1D 30 79 3E 2A EE FC 17 38>)
(   3,<2013-10-19 00:27:41.454 -0700>,<Administrator>,<X>,<proc1d>,<TOPSPIN 2.1>,
      <pk PHC0 = 95.02075 PHC1 = 0 
       data hash MD5: 32K
       F1 73 C0 66 A1 F7 3F 15 6F 22 9C C4 E4 67 AD C7>)
(   4,<2013-10-19 00:27:41.548 -0700>,<Administrator>,<X>,<proc1d>,<TOPSPIN 2.1>,
      <abs ABSG = 1 
       data hash MD5: 32K
       C3 C8 D0 C1 1D 2D 91 EF E6 63 F6 0E 2B 44 E0 8D>)
(   5,<2013-10-19 00:27:41.688 -0700>,<Administrator>,<X>,<proc1d>,<TOPSPIN 2.1>,
      <abs ABSG = 2 
       data hash MD5: 32K
       0A 35 AD 59 09 46 FE 02 FE 06 D3 A7 DA 00 27 9B>)
(   6,<2013-10-19 00:27:41.782 -0700>,<Administrator>,<X>,<proc1d>,<TOPSPIN 2.1>,
      <abs ABSG = 3 
       data hash MD5: 32K
       72 52 B7 30 A6 2E DE A1 AB 56 4E EB D7 5B CF EE>)
(   7,<2013-10-19 00:27:41.829 -0700>,<Administrator>,<X>,<proc1d>,<TOPSPIN 2.1>,
      <abs ABSG = 4 
       data hash MD5: 32K
       56 A8 BC C7 92 C6 7F 47 71 BB 4B 99 DD D8 AB E1>)
(   8,<2013-10-19 00:27:41.907 -0700>,<Administrator>,<X>,<proc1d>,<TOPSPIN 2.1>,
      <abs ABSG = 5 
       data hash MD5: 32K
       34 70 7C 0B 8F 8A E1 BA 67 75 CF 58 52 81 2A 25>)
$$ ##END=
$$ 
$$ $$ hash MD5
$$ $$ 6E 6B C6 FB 1A B0 60 F0 AC E8 27 18 F7 6F AC 49
##$RELAX= 
##$RELAX= 
##$RELAX= 
##$RELAX= 
##$RELAX= 
##$RELAX= 
##$RELAX= 
$$ Bruker specific parameters
$$ --------------------------
##$DU= <E:\>
##$EXPNO= 10
##$NAME= <AC1585_DECA0002_8281262_Y2MnwaBRaM>
$$ [...]
150 150 150 150 150 150 150 150
##$TP07= 0
##$TPNAME0= <>
##$TPNAME1= <>
##$TPNAME2= <>
##$TPNAME3= <>
##$TPNAME4= <>
##$TPNAME5= <>
##$TPNAME6= <>
##$TPNAME7= <>
##$TPOAL= (0..7)
0.5 0.5 0.5 0.5 0.5 0.5 0.5 0.5
##$TPOFFS= (0..7)
0 0 0 0 0 0 0 0
##$TUNHIN= 0
##$TUNHOUT= 0
##$TUNXOUT= 0
##$USERA1= <user>
##$USERA2= <user>
##$USERA3= <user>
##$USERA4= <user>
##$USERA5= <user>
##$V9= 5
##$VALIST= <valist>
##$VCLIST= <CCCCCCCCCCCCCCC>
##$VD= 0
##$VDLIST= <DDDDDDDDDDDDDDD>
##$VPLIST= <PPPPPPPPPPPPPPP>
##$VTLIST= <TTTTTTTTTTTTTTT>
##$WBST= 1024
##$WBSW= 4
##$XGAIN= (0..3)
0 0 0 0
##$XL= 0
##$YL= 0
##$YMAX_a= 585447
##$YMIN_a= -498520
##$ZGOPTNS= <>
##$ZL1= 120
##$ZL2= 120
##$ZL3= 120
##$ZL4= 120
##$ABSF1= 14.98509
##$ABSF2= -5.573092
##$ABSG= 5
##$ABSL= 3
##$ALPHA= 0
##$AQORDER= 0
##$ASSFAC= 0
##$ASSFACI= 0
##$ASSFACX= 0
##$ASSWID= 0
##$AUNMP= <proc_prof1d_extract_pilot.lims>
##$AXLEFT= 0
##$AXNAME= <>
##$AXNUC= <1H>
##$AXRIGHT= 0
##$AXTYPE= 0
##$AXUNIT= <>
##$AZFE= 0.1
##$AZFW= 0.1
##$BCFW= 0
##$BC_mod= 0
##$BYTORDP= 0
##$COROFFS= 0
##$CY= 15
##$DATMOD= 1
##$DC= 0
##$DFILT= <>
##$DTYPP= 0
##$F1P= 0
##$F2P= 0
##$FCOR= 0.5
##$FTSIZE= 32768
##$FT_mod= 6
##$GAMMA= 0
##$GB= 0
##$INTBC= 1
##$INTSCL= 1
##$ISEN= 128
##$LB= 0
##$LEV0= 0
##$LPBIN= 0
##$MAXI= 10000
##$MC2= 0
##$MEAN= 0
##$ME_mod= 0
##$MI= 0
##$NCOEF= 0
##$NC_proc= -8
##$NLEV= 6
##$NOISF1= 0
##$NOISF2= 0
##$NSP= 0
##$NTH_PI= 0
##$NZP= 0
##$OFFSET= 14.98509
##$PC= 1
##$PHC0= 95.02075
##$PHC1= 0
##$PH_mod= 1
##$PKNL= yes
##$PPARMOD= 0
##$PPDIAG= 0
##$PPIPTYP= 0
##$PPMPNUM= 2147483647
##$PPRESOL= 1
##$PSCAL= 4
##$PSIGN= 0
##$PYNMP= <proc.py>
##$REVERSE= no
##$SF= 400.02
##$SI= 32768
##$SIGF1= 0
##$SIGF2= 0
##$SINO= 400
##$SIOLD= 32768
##$SPECTYP= <>
##$SREGLST= <1H.CDCl3>
##$SSB= 0
##$STSI= 32768
##$STSR= 0
##$SW_p= 8223.68421052631
##$SYMM= 0
##$S_DEV= 0
##$TDeff= 65536
##$TDoff= 0
##$TI= <>
##$TILT= no
##$TM1= 0
##$TM2= 0
##$TOPLEV= 0
##$USERP1= <user>
##$USERP2= <user>
##$USERP3= <user>
##$USERP4= <user>
##$USERP5= <user>
##$WDW= 1
##$XDIM= 32768
##$YMAX_p= 423065212
##$YMIN_p= -825532
##$CURPLOT= <Network HP LaserJet P1505>
##$CURPRIN= <$Network HP LaserJet P1505>
##$DFORMAT= <normdp>
##$LAYOUT= <+/1D_H.xwp>
##$LFORMAT= <normlp>
##$PFORMAT= <normpl>
##$SURQMSG= 1
$$ End of Bruker specific parameters
$$ ---------------------------------
##NTUPLES= NMR SPECTRUM
##VAR_NAME=  FREQUENCY,     SPECTRUM/REAL,   SPECTRUM/IMAG
##SYMBOL=    X,             R,               I
##VAR_TYPE=  INDEPENDENT,   DEPENDENT,       DEPENDENT
##VAR_FORM=  AFFN,          ASDF,            ASDF
##VAR_DIM=   32768,         32768,           32768
##UNITS=     HZ,            ARBITRARY UNITS, ARBITRARY UNITS
##FACTOR=    0.250966925370066, 1,           1
##FIRST=     8223.43324360094, 149235,       -38602
##LAST=      0,             -67624,          -263552
##MIN=       0,             -825532,         0
##MAX=       8223.43324360094, 423065212,    0
$$ Real data points
##PAGE= N=1
##DATA TABLE= (X++(R..R)), XYDATA
$$ [...]
19554H5966c47855d3612a6422n147A04197B5817K06773b31333A17626j835K787
19543A18578a78741L5942E3096a32063F9184j7023a84769K2382q8492I2991a65138
19531a46481L246A10147a08331o1876p0158C2629a34668b2083F8078i0533H9413
19519C3730Q8779l4115a73081C19295b3297p5493j43368I1765g9483c0506k32876
19508b63382Q8824a67k04201o009j26973I0420J50759a43318J2680m1199i344
19496a90782j07410a36602l0543j20847A32249a9925k03890E69091A9043c069
19485C05376e8534m0412k0316j55950E0968J93792a51944F9560b00448d5245l0488
19474g5733A06570b77648B03091o3733a98432E8752b08778g7066j5938A57010
$$ y = [85966, -347855, -43612, -16422, -21569, 104197, 25817, 232590, -231333, 117626, 115791, 118578, -178741, -142799, 53096, -132063, 69184, 52161, -184769, -162387, -250879, 92991, -165138, -146481, -143235, 110147, -108331, -170207, -240365, 32629, -134668, -22083, 68078, -90533, 89413, 33730, 122509, 88394, -173081, 319295, -23297, -98790, -242158, 91765, -79483, -30506, -263382, -174558, -167, -204368, -210377, -337350, 90420, 241179, -143318, -130638, -171837, -9344, -190782, -298192, -136602, -167145, -287992, 132249, -19925, -223815, 569091, 19043, -3069, 305376, -58534, -98946, -119262, -275212, 50968, 244760, -151944, 69560, -200448, -45245, -75733, 106570, -277648, 203091, 139358, -198432, 58752, -208778, -77066, -93004, 157010]
19463b08639R1605k4821J8408J8557j1409O300B20691H8279f0128r1700o4306
19452b16134P5237k22205A20835N6798e177D0097a22501A99776a07702n7265K0011
19441a44956E9999J46743g5240l1684e603B53260b93316a46593I1075a27563A9218
19429c13492B36290D8876b6655j69118F0870a31814A15996h7093F0972b10171
19418c29858K368p7504H1871a14314b875j11388A44823P0773e4397R052n6901
19407a02246m56267a58897g8252j69381j03343b991j09124A74842h4720j4561
19397i9281j70715a916F0295A7838L883K0695K57031E0760J09601G8269a73907
19385E7203a73149r3752D482c59603a32819D5362f4753H445J83779a29714c3484
$$ y = [-208639, -117034, -141855, -123447, -104890, -116299, -109999, 220691, 88279, -60128, -151828, -216134, -140897, -363102, 120835, 177633, -5177, 40097, -122501, 199776, -107702, -164967, -144956, 59999, 206742, -75240, -106924, -5603, 253260, -293316, -146593, 91075, -127563, 19218, -313492, 236290, 48876, -26655, -195773, 60870, -131814, 115996, -87093, 60972, -210171, -329858, -327490, -404994, 81871, -114314, -2875, -114263, 144823, 215596, -54397, -45345, -102246, -558513, -158897, -78252, -247633, -350976, -2991, -112115, 174842, -84720, -99281, -269996, -1916, 60295, 17838, 21721, 42416, 299447, 50760, 160361, 78269, -173907, 57203, -173149, -266901, 4482, -359603, -132819, 45362, -64753, 8445, 192224, -129714, -33484]
19373b66266C95103A4990b16804M2803d0918B04912K5371I4333j6914J40305a29147
19361g484n6646C1366a40825A15365b52296J20184j07042j18103J48325B93700
19350d23889h4638p8349a6367A7600a41437A7738a12499a1084o4058L7048C6335
19338A85681A6169R2086a48524k92206J58630D4737I607O138P03J66127a11702
19326b64776a19113A123a37039G0169e8865l49916n3854A83874b42097a0876j24307
19315a35183C1737a75422L6924A25067J87351b86942i3596j65935J05188C0952
19304a87142a768j21188c8730A41205n0093b15432B7600i072k77700B28639e9604
19292a38720A59379c42721A51865o1200B4504a52879A38338a58716A73482a00652
$$ y = [-266266, 395103, 14990, -216804, -174001, -40918, 204912, 230283, 94333, 77419, 217724, -129147, -7484, -64130, 31366, -140825, 115365, -252296, -132112, -239154, -357257, -208932, 293700, -423889, -84638, -162987, -16367, 17600, -141437, 17738, -112499, -11084, -75142, -38094, 36335, 185681, 16169, 108255, -148524, -440730, -282100, 44737, 9607, 15745, 16448, 182575, -111702, -264776, -119113, 1123, -137039, 70169, -58865, -408781, -462635, 183874, -242097, -10876, -135183, 31737, -175422, -138498, 125067, 312418, -286942, -93596, -259531, -154343, 30952, -187142, -1768, -122956, -38730, 141205, 91112, -215432, 27600, -9072, -286772, 228639, -59604, -138720, 159379, -342721, 151865, 90665, 24504, -152879, 138338, -158716, 173482, -100652]
19281B75585A3745a86600F5710J28419f7835k58950a39328j23251A21511a99182
19270a97298q4547I6472b9159j34732k05867h830j1425k41707b834j74152I8632
19258c30499J02265C24496e8018A74143D2812b21045K0932Q7422d9661l8345b1426
19246F2899a23602M3713j8142j95235J07175j20042a23551A60031a69339B7131
19235a22303G9887c37494i5045D0105e8334k02648C914J09507F658b71048E5524
19223B21753a3503l41096A04541c53296J54573O5339a6092p3973J2535D8445f7220
19211D7144b5476j56146A04639a24859M8511j2172m7565i708j38152e1716l83212
19200d34928a96125C7553a82428h0714A79349a12012A03360a97921G0380a29106
$$ y = [275585, 13745, -186600, 65710, 194129, -67835, -326785, -139328, -262579, 121511, -199182, -197298, -281845, 96472, -29159, -163891, -369758, -8830, -20255, -261962, -2834, -176986, 98632, -330499, -228234, 324496, -58018, 174143, 42812, -221045, -200113, -112691, -49661, -88006, -21426, 62899, -123602, -79889, -98031, -293266, -186091, -306133, -123551, 160031, -169339, 27131, -122303, 79887, -337494, -95045, 40105, -58334, -260982, 3914, 113421, 6658, -271048, 55524, 221753, -13503, -354599, 104541, -353296, -198723, -133384, -16092, -90065, -77530, 48445, -67220, 47144, -25476, -181622, 104639, -124859, -76348, -88520, -136085, -9708, -147860, -51716, -434928, -196125, 37553, -182428, -80714, 179349, -112012, 103360, -197921, 70380, -129106]
19189a53014B74722C6470a3856G2928Q620C8786L5483M703R170c46525h8038j28465
19177b16503A56721f7189E8619c33048f1261q7051m8711K348g0698E6613b29068
19165A77643q8337j153J51428c50523A66300b445A76969c4599B43504c12592a29007
19153d4092r3326a0764r3120j04170A90702p8331C5922c47423A46739c6668l32066
19142c68734e6034k9910L7356l14042B99581j16957b36175c5222A18332b94342
19131a27533A86939o6249D933a56956m2504j04971c8569K869m7169L6288p7662
19120a24243C80893b15681B0349a5650k21122A67282b46220B4494c42052B59278
19109c52569C8548d7052E6571J33567q1191d8574j79931g6834B12h7163m6816
$$ y = [-153014, 274722, 36470, -13856, 72928, 81548, 38786, 74269, 78972, 88142, -346525, -88038, -216503, 156721, -67189, 58619, -333048, -61261, -148312, -197023, -194675, -70698, 56613, -229068, 177643, 89306, 88153, 239581, -350523, 166300, -2445, 176969, -34599, 243504, -312592, -129007, -44092, -137418, -10764, -103884, -208054, 190702, 112371, 35922, -347423, 146739, -36668, -368734, -56034, -85944, -48588, -362630, 299581, 182624, -236175, -35222, 118332, -294342, -127533, 186939, 120690, 4933, -156956, -199460, -304431, -38569, -35700, -82869, -46581, -124243, 380893, -215681, 20349, -15650, -236772, 167282, -246220, 24494, -342052, 259278, -352569, 38548, -47052, 56571, 190138, 108947, -48574, -228505, -76834, 212, -87163, -133979]
19098a33979A6801b36115J15972p4770o7662f440l76773A6589a30860B520J83970
19087A86490E4355a7425k02811A01345c48933i8101A26316A5757a58073A71545
19076a19611I2783a2756A16037E7970a57920k8408f0924G0445J16113E6547j1787
19065D4760J73661d6312j3191C5996P22b48838A56794E2457M2899R6839e5886
19053c66790a805G3235b19953G4136C1105e2361B29221a90865O5302A1796d18062
19041H3912a13973A02911K1891l2071O8257b23544a10584A6370K00758A04101
19030e6726l5001A85417B4466J56756J09146I0273h6043H0450a78529A41226L28287
19019D69513A22284g7970q0134B14991L31494A3685J63440a49884C5893a79990
$$ y = [-133979, 16801, -236115, -120143, -194913, -262575, -6440, -383213, 16589, -130860, 2520, 186490, 54355, -17425, -220236, 101345, -348933, -98101, 126316, 15757, -158073, 171545, -119611, 92783, -12756, 116037, 57970, -157920, -186328, -60924, 70445, 186558, 56547, 44760, 218421, -46312, -59503, 35996, 36718, -248838, 156794, 52457, 95356, 192195, -55886, -366790, -1805, 73235, -219953, 74136, 31105, -52361, 229221, -190865, -125563, 11796, -418062, 83912, -113973, 102911, 124802, 92731, 160988, -223544, -110584, 16370, 217128, 104101, -56726, -91727, 185417, 24466, 181222, 290368, 90273, -86043, 80450, -178529, 141226, 469513, 122284, -77970, -158104, 214991, 546485, 13685, 177125, -149884, 35893, -179990]
19008i1242c507r5854l28628a49070N3569C6399J48273i6151q2032J7287j43724
18997c04620i8311J9480b6859m4306A39608d2562j9088p2366B38807a1814j46726
18986a58540O2214G8314c21961D334b1821j81928R0719K7771C5494L0989J9611
18975H6094R5510C0148a3572j23596n1824F2931k2402j3039K16394c40404A9396
18963b05683b1382k55054a13924l2160d9343j3172n8984b6974k23486G2359k8335
18952D4024c66139J79864j59628A9546J15376n3669b8317B06766A8913J95683
18942B14596G3994M0818g813j3805k76044a27181N9733k12863o2586c4874k72781
18931c07655a5664l72G6423b3999B17586b13315j14655a6901A50480a23778j12757
$$ y = [-91242, -3507, -99361, -427989, -149070, -95501, 36399, 184672, -96151, -178183, -160896, -304620, -98311, -78831, -26859, -71165, 139608, -42562, -61650, -134016, 238807, -11814, -158540, -96326, 78314, -321961, 4334, -21821, -203749, -113030, -85259, 35494, 66483, 86094, 181604, 30148, -13572, -137168, -188992, 62931, 40529, 27490, 243884, -340404, 19396, -205683, -21382, -276436, -113924, -146084, -49343, -62515, -121499, -26974, -250460, 72359, 44024, -366139, -186275, -345903, 19546, 134922, 81253, -28317, 206766, 18913, 214596, 73994, 114812, -7813, -21618, -297662, -127181, -67448, -280311, -342897, -34874, -307655, -15664, -16036, 76423, -23999, 217586, -213315, -327970, -16901, 150480, -123778, -236535]
18920b36535j9818b515C2890K70528a48344G7231i0786L8605A3893K58043H9385
18908a41293o2566o0829B54032b61454j20539a42749A92395b42690J4341g7470
18897A62730a77980c307k29281r0121a1401l35007A51612a16672n6064c7467E7958
18885a90892b3081B37248A14073K3903d00636a70215j485j24301g0497l8519q7308
18874a96324N7389B3122a60183A49824A6875b42390M9524a1518j53557E4919a05411
18862b03689Q5750D1113K07339a67823F2618e6072k0927D8216r61j5794h0574
18850a13128A72242J17280i5266F3386O3772a39100c9226F754J61238K94761A65512
18838B9165a06871p5847c2455H1961Q9414m8047J17406a40568c4278j45250a6883
$$ y = [-236535, -256353, -2515, 32890, 303418, -148344, 77231, -90786, -52181, 13893, 271936, 89385, -141293, -203859, -264688, 254032, -261454, -381993, -142749, 192395, -242690, -228349, -77470, 162730, -177980, -3307, -232588, -322709, -11401, -346408, 151612, -116672, -172736, -37467, 57958, -190892, -23081, 237248, 114073, 137976, -400636, -170215, -171700, -296001, -70497, -109016, -196324, -138935, 23122, -160183, 149824, 16875, -242390, -192866, -11518, -165075, 54919, -105411, -203689, -117939, 41113, 248452, -167823, 62618, -56072, -76999, 48216, 47255, 31461, -80574, -113128, 172242, 289522, -95266, 63386, 127158, -139100, -39226, 6754, 167992, 462753, 165512, 29165, -106871, -182718, -32455, 81961, 171375, 123328, 240734, -140568, -34278, -179528, -16883]
18826a3548e034j06996B54129c98853b4382C13119a71420A99300r6616b22243
18815b2179m9923A4016J34938F1075K6438J26846c5453F5447k0767b25976A21338
18803a2287j33685d4503j6730m28953K23907a11659j01825m2368B21070P174A0346
18791c27011i4221F8103J42883h700q3288D76755A59054i6461A04262c37570a42559
18779B13649D8891b6721m7365j57166b1102B66276j08729H961K59286a36718A06614
18767d2871j4844k12979b2365C4825a58992h30G6456M3519b90994D7045j2191
18756C4854Q1169c05177N4142f2939G9877Q487a53047p89j40066g2605A81549
18744a49702p669g0506o3908b4617G3953A8143a25774r2847P3837F3391d2333
$$ y = [-13548, -5034, -112030, 254129, -398853, -24382, 313119, -171420, 199300, 102684, -222243, -22179, -72102, 14016, 148954, 61075, 87513, 214359, -35453, 65447, 44680, -225976, 121338, -12287, -145972, -44503, -61233, -490186, -266279, -111659, -213484, -255852, 221070, 228244, 10346, -327011, -94221, 68103, 210986, -8700, -91988, 476755, 159054, -96461, 104262, -337570, -142559, 213649, 48891, -26721, -74086, -231252, -21102, 266276, 157547, 8961, 268247, -136718, 106614, -42871, -57715, -270694, -22365, 34825, -158992, -830, 76456, 119975, -290994, 47045, 34854, 116023, -305177, -251035, -62939, 79877, 88364, -153047, -153836, -293902, -72605, 181549, -149702, -157371, -70506, -134414, -24617, 73953, 18143, -125774, -218621, -144784, 63391, -42333]
18732C5274a1551l04543e9535F6292e27k30658R6032C0580N2091C9266J24254
18721A63520J78117a73622l39384b30288h6215k18034a4323k10587H4327g885
18710B31768j09775f6015A68823a32126J6126B7995M1643J11492K40188G2832
18699c13419a1924B08525b05285N7212B98357a0810B0374b37082A33657m5665
18689H7992a08488l1333b5732A28634B3390b39744f470I5856b37484K0322l0201
18678b47363B82235f9733B0245j500a20048b4850D019J56626E4011b54688p5254
18667c29942g3922F3221Q7785k3118a63196d5907j92089a00513B31506D3954J31488
18656A75442a46970f4128C5325b5803l18278J42651G6684B6422a3399k01855f0101
$$ y = [35274, -11551, -316094, -59535, 66292, -527, -231185, -135153, 30580, 82671, 39266, 163520, 341637, -173622, -513006, -230288, -86215, -304249, -14323, -224910, 84327, -7885, 231768, 121993, -66015, 168823, -132126, -116000, 27995, 69638, 181130, 421318, 72832, -313419, -11924, 208525, -205285, -148073, 298357, -10810, 20374, -237082, 133657, 87992, -108488, -139821, -25732, 128634, 23390, -239744, -6470, 95856, -237484, -217162, -247363, 282235, -69733, 20245, 18745, -120048, -24850, 4019, 160645, 54011, -254688, -329942, -73922, 63221, 151006, 127888, -163196, -45907, -237996, -100513, 231506, 43954, 175442, -146970, -64128, 35325, -25803, -344081, -201430, 76684, 26422, -13399, -215254, -60101]
18644I9453h4028A24896a53891G1326K61174j22229r8101a53792o0122C31595
18633h4498A04661l8565K4523i9323A87118a15597o7027a1013E9932a35965c7632
18621E8910J4688P1841b81962m9140i2187A78545b60714A86622K9306A7204K05233
18610B22437H7330b41668a18027d3299c938C06020g3423j42359N2416C51353f8747
18598b01249P9857j66554a20432H3378b31053I2255h5484l3191q4690B5107a48804
18586i012k95875a2223m41226G8341M0265J65683D3820b91224E4790c08556J37960
18575a70596c979j73097m7847d9433j22779j86427j13906g1194A7056d34351a46596
18563h5844k2436A25083M747a11688F0200b00298f2351F5112d70210a20966D6763
$$ y = [99453, -84028, 124896, -153891, 71326, 332500, 210271, 112170, -153792, -213914, 331595, -84498, 104661, 66096, 90619, -99323, 187118, -115597, -182624, -11013, 59932, -135965, -37632, 58910, 73598, 145439, -281962, -331102, -92187, 178545, -260714, 186622, 215928, 17204, 222437, 87330, -241668, -118027, -43299, -3938, 306020, -73423, -215782, -163366, 351353, -68747, -201249, -121392, -287946, -120432, 83378, -231053, 92255, -85484, -118675, -203365, 25107, -148804, -9012, -304887, -12223, -453449, 78341, 118606, 284289, 43820, -291224, 54790, -308556, -170596, -3979, -177076, -224923, -49433, -172212, -358639, -472545, -71194, 17056, -434351, -146596, -85844, -108280, 125083, 129830, -111688, 60200, -200298, -62351, 65112, -470210, -120966, 46763]
18551A2166K70064G8696K73721a26021G9654b7764j84287j04243J44441P063G601
18539a09960L0297c8624A2795i3641L737o4695P1184j2280k8902a8078l49732
18528c67810A32974M6796m4200h9674j2309K5773A39325m6020b92140D6337i9944
18516b21124J02889K6114I2980h6120A32700J9465d43267J99160a21701e5471
18505A20339c16405J19274B33807h0158j86709A54555a74966M4021B08994a47440
18494a06470I845J21514N0152c24316A48563b9132K865A19560b03786R9178a474
18482B32082M3908a36460K5044j3310c7190A54281B6097R8869j8227a43102j3274
18471a56376K5245H1287C0681J38538f7994j68237k08505A28123m0222c8482f578
$$ y = [12166, 282230, 78696, 352417, -126021, 79654, -27764, -212051, -316294, -171853, -164790, 7601, -109960, -79663, -38624, 12795, -93641, -89904, -154599, -83415, -95695, -124597, -18078, -367810, 132974, 179770, 135570, -89674, -101983, -76210, 139325, 93305, -292140, 46337, -99944, -221124, -118235, -92121, 92980, -86120, 132700, 152165, -443267, -244107, -121701, -55471, 120339, -316405, -197131, 233807, -80158, -266867, 154555, -174966, -130945, 208994, -147440, -106470, 9845, 131359, 181511, -324316, 148563, -29132, -26267, 119560, -203786, -104608, -1474, 232082, 275990, -136460, -111416, -124726, -37190, 154281, 26097, 124966, 106739, -143102, -156376, -131131, 81287, 30681, 169219, -67994, -236231, -444736, 128123, 87901, -38482, -6578]
18459a83093q8497R7403B788J02612a75722j62500a65072A10736a49335k44070
18449c93405A66559G3158c44996Q65d2095b472j21342H5226Q1165b4627I1118
18437B8519e1F9630M9843d9000B98500c59967A51044a02271C5529c0966E1038
18425b50312J01985A62160a36015K6711d7487j00706a2370e836A02614a68288
18414I371K55886A7349N9407J68219f912I5978H131J21171i227A52879B7761d6685
18401A54082h1287B03083f8102l16153a16585B70072g4693q4371q461A63540K3286
18390A86826A2015g5081k3374b4599k62330b0967C9209K05787b09264D9785P9854
18379A29639J74359i1116c6485j0442j63363m12927C5785a44280l25042b2687
$$ y = [-183093, -271590, -174187, 2788, 105400, -175722, -338222, -165072, 110736, -149335, -393405, 166559, 73158, -344996, -344131, -42095, -2472, -123814, 85226, 166391, -24627, 91118, 28519, -51, 69630, 119473, -49000, 298500, -359967, 151044, -102271, 35529, -30966, 51038, -250312, -148327, 162160, -136015, -109304, -47487, -148193, -12370, -5836, 102614, -168288, 9371, 265257, 17349, 76756, 244975, -6912, 95978, 8131, 129302, -9227, 152879, 27761, -46685, 154082, -81287, 203083, -68102, -384255, -116585, 270072, -74693, -159064, -167525, 163540, 186826, 12015, -75081, -98455, -24599, -286929, -20967, 39209, 244996, -209264, 49785, 129639, 303998, -91116, -36485, -46927, -210290, -623217, 35785, -144280, -469322, -22687]
18368c1985D4675K09388a13193M3037A24503a24284A69920a64017M2726K8641
18358i2650a0953k08628C26012a71796B28685b05611e919j55715g5749o452B30722
18346a04542j63044a3974F0905c61745a1145n5120l1013k5819N88J3125k9256
18335a38640q9502A82518g0453q7417O481c7844A02612a84363R0790n1813k33405
18324c78791C63288i0734A11100a12729A77211B6392c88415B23196b19714r3133
18314c12847J14290I5093b10284k28514K05792g3304D6955f4918m7951D8857M7858
18303I6715a61180M8099B90437a13298j83153O878R1011j9950A09753l7732g5984
18291D9876a17319E4800Q6566c05396B91980a10667b3357I4072l3412B8906b34606
$$ y = [-31985, 44675, 254063, -113193, -70156, 124503, -124284, 169920, -164017, -121291, -92650, -10953, -219581, 326012, -171796, 228685, -205611, -5919, -161634, -75749, -82201, 230722, -104542, -267586, -13974, 60905, -361745, -11145, -66265, -97278, -123097, -122509, -109384, -138640, -228142, 182518, -70453, -157870, -151389, -37844, 102612, -184363, -93573, -145386, -378791, 363288, -90734, 111100, -112729, 177211, 26392, -388415, 223196, -219714, -312847, -198557, 95093, -210284, -438798, -233006, -73304, 46955, -64918, -112869, 48857, 96715, -161180, -113081, 290437, -113298, -296451, -289573, -198562, -218512, 109753, 72021, -75984, 49876, -117319, 54800, 141366, -305396, 291980, -110667, -23357, 94072, 60660, 28906, -234606]
18279c4033k95247L1671G9755j4148K7101C8880b75535k2856a25926A35451D0373
18267C3541J2032b22625I9695J61187a14009H8694h9653k7196G3322c00878J35001
18256a65877j49525A78306b06539O263B04927c55300J62119A71893b6998k1276
18246d8274r4167B3265i8962a2264A91062b05526H7261Q7941a77712K5769L9805
18235a12138k11400B01613L509a06175k39305a55835A1517i8317C54616e8070
18224A01212D9548J26862G4911a63450P8793a8902H8101c88465C00729a60690
18213f9630m0515G4109K3400a61348B29653d9311B27699j11845a78786O9676j73936
18202b83046P4578A86306H7625M7583d68749A35360j8563a23649k07665E6398
$$ y = [-34033, -329280, -297609, 79755, 65607, 92708, 38880, -275535, -298391, -125926, 135451, 40373, 33541, 45573, -222625, 99695, 260882, -114009, 88694, -89653, -116849, 73322, -300878, -165877, -315402, 178306, -206539, -200276, 204927, -355300, -193181, 171893, -26998, -48274, -142441, 23265, -98962, -12264, 191062, -205526, 87261, 175202, -177712, -151943, -112138, -323538, 201613, 205122, -106175, -345480, -155835, 11517, -98317, 354616, -58070, 101212, 49548, 176410, 74911, -163450, -84657, -18902, 88101, -388465, 300729, -160690, -69630, -110145, 74109, 97509, -161348, 229653, -49311, 227699, 115854, -178786, -109110, -283046, -208468, 186306, 87625, 135208, -468749, 135360, 116797, -123649, -331314, 56398]
18191A15745a47248C01815F7963A5885g2550I9817H812a49132Q421A18577d90280
18179D5845d72349G3027b17619B26865J5736B3079b0988D5338j9824b09929L8307
18168a71622A84134e1324I5698P6531m77M0175o7178l6442D4463a39360l64925
18157e04285f4540A04807D9085Q0671E5097b63500h5880a0425m25289a35193j3470
18146a48663K007C3324a68444A39085m5100a20470A60582a39207g902j00687D8200
18134e178j58999O7729a7083G4649L03249B7784Q8894e3744K3287B4301b08574
18122B4001I243P4521a11083p4053I7700a0797l37564J63244H885K91047C4468
18110a41559E8629f5099L734j20457A3520M7342Q4452a13810j55368B8872a2483
$$ y = [115745, -147248, 301815, 67963, 15885, -72550, 99817, 8812, -149132, -140711, 118577, -490280, 45845, -472349, 73027, -217619, 226865, 242601, 23079, -20988, 45338, 25514, -209929, -171622, 184134, -51324, 95698, 172229, 171752, 211927, 144749, 108307, 44463, -139360, -504285, -64540, 104807, 49085, 129756, 55097, -263500, -85880, -10425, -435714, -135193, -148663, -146656, 33324, -168444, 139085, 93985, -120470, 160582, -139207, -7902, -108589, 48200, -5178, -164177, -96448, -17083, 74649, 377898, 27784, 116678, -53744, -30457, 24301, -208574, 24001, 9243, 83764, -111083, -185136, 97700, -10797, -348361, -185117, 8885, 299932, 34468, -141559, 58629, -65099, -61365, -181822, 13520, 60862, 145314, -113810, -269178, 28872, -12483]
18098B04383a34958a7130l8173k38421b9345j5429j87987j00180A47738b9905
18087a66567e7233A8282h2692E5884K6951C7715J81567b59290B22756A07951c65788
18075a40747G0177b0188j51655e3906P952b2435l9241B57826K6236q3361N8151
18064B58852a29730B84688e0041l8819B72542c1055A5232J11109K04268b28546
18053b74272A36841d4671f927l42122A45541i1247k1538d4865A5651a91445F6277
18041h8673n1959A42126d8000k41929K2871A40716b8878n4942J6133j40817M6565
18030a61939O4823H968A410Q8774K7445a9583q8250H6410h1682a2933l6628J3098
18018c6463A20474a50408A63511c42709A00310a44019l27870B54098a7172j63917
$$ y = [204383, -134958, -17130, -55303, -293724, -29345, -44774, -232761, -332941, 147738, -29905, -166567, -57233, 18282, -82692, 55884, 82835, 37715, 219282, -259290, 222756, 107951, -365788, -140747, 70177, -20188, -171843, -53906, -45954, -22435, -61676, 257826, 284062, 200701, 258852, -129730, 284688, -50041, -88860, 272542, -31055, 15232, 126341, 330609, -228546, -274272, 136841, -44671, -6927, -349049, 145541, -91247, -112785, -44865, 15651, -191445, 66277, -88673, -140632, 142126, -48000, -289929, -267058, 140716, -28878, -83820, -67687, -208504, -161939, -97116, 8968, 1410, 90184, 117629, -19583, -107833, 86410, -81682, -12933, -49561, -36463, 120474, -150408, 163511, -342709, 100310, -144019, -471889, 254098, -17172, -181089]
18008a81089e838l1469e406j57842F11544i6845k3557A70961b2158k1916J3627
17997c0447l0912C7046a35443D6212c87459a26525j63219J03218A5029J62231
17987A77260c5787C7796c37590a21104C99997B9687h7559k01209K182J04966r2075
17976b73695O6395b4004k11335J06961c9720r9629O2C84635H7942b20634D05334
17964d00521J78807j82102a1095k07653A66384b13115g3149H2585h3961r507n0012
17953a43480A01681l6690b63457J00351k22656B6347N8941a28904E6559J4711
17943G1270K1084a8874p190p532O564k9521r7928C143J97014a11973J6121k65442
17931c61294a01669C38016G550J51106h491n4343D7886L1226M7915b9952A3127
$$ y = [-181089, -5838, -37307, -5406, -163248, 611544, -96845, -120402, 170961, -22158, -44074, -30447, -61359, 37046, -135443, 46212, -387459, -126525, -289744, -186526, 15029, 177260, -35787, 37796, -337590, -121104, 399997, 29687, -87559, -288768, -286586, -181620, -273695, -207300, -24004, -235339, -128378, -39720, -139349, -139287, 384635, 87942, -220634, 405334, -400521, -221714, -403816, -11095, -218748, 166384, -213115, -73149, 82585, -83961, -93468, -143480, 101681, 64991, -263457, -163106, -385762, 26347, 85288, -128904, 56559, 71270, 92354, -18874, -26064, -33596, -27032, -56553, -154481, 3143, 200157, -111973, -95852, -361294, -101669, 338016, 7550, 158656, -8491, -62834, 47886, 79112, 127027, -29952, 13127]
17919a1964A73704a56519C7568J03405E5701a08836j56530a19931e4112k0087
17909g4199G2764b136n6223k20413F7594a14544B22895J49644A9822p947J1080
17898B2955b56992J23972L8651q4869P7595E412c72615C09560i0814a0866A29536
17886C2504b88477A69832c32078a23485B51082a30385G6128i1733j83317g5514
17875a58938o9342M2192f4401m4938M30j41571B69809g9310m1621C6698a87321
17863B68803j33016c0696D00289c00581J13332d8529B04686g2039H1302a61816
17852F8233b8894I9489J41293j17090a06959A48151a01819A8050K53725a8640
17841a25243j5492A81361O4936i7505j3443C1691b2580k1958j99107g816C78068
$$ y = [-11964, 173704, -156519, 37568, 140973, 55701, -108836, -265366, -119931, -54112, -74199, 72764, -2136, -58359, -278772, 67594, -114544, 222895, 372539, 19822, 11875, 22955, -256992, -133020, -94369, -179238, -101643, 5412, -372615, 309560, -90814, -10866, 129536, 32504, -288477, 169832, -332078, -123485, 251082, -130385, 76128, -91733, -275050, -75514, -158938, -228280, -186088, -64401, -109339, -108909, -250480, 269809, -79310, -120931, 36698, -187321, 268803, 135787, -30696, 400289, -300581, -187249, -48529, 204686, -72039, 81302, -161816, 68233, -28894, 99489, 240782, 123692, -106959, 148151, -101819, 18050, 271775, -18640, -125243, -140735, 181361, 246297, -97505, -110948, 31691, -22580, -44538, -243645, -7816, 378068]
17829b9980A86483M5404e3531q9318j16441C31557j58723n5385Q1974q8367e9184
17817a92984C1833K55801a25843N2396p8181A5759a44887B49463B4170b6665J3046
17806a3619j32898A03547c468j50259M4868L5526I3637a07270m3951A07816K14604
17795C22420A44918b25871e8860B07986R524a89271j97599A30715K356A1282a82883
17783f4556A69587k8432a49711e5986A18138A5409R7536e6955j33149A67300h4927
17771H028b1719k40069P1162e8119G2960J59638b07880c2490m1067B32322F2433
17759A4101J8869J77369P3490a64075B91080G7680J13737c64874a79740A05924
17748E0670a91162k13441c2539B75751a803B59796A12674a41716f1613o0935F627
$$ y = [-29980, 186483, 231887, -53531, -142849, -259290, 331557, 172834, 117449, 199423, 111056, -59184, -192984, 31833, 287634, -125843, -73447, -151628, 15759, -144887, 249463, 24170, -26665, -13619, -146517, 103547, -3468, -153727, -108859, -73333, 93637, -107270, -151221, 107816, 322420, 144918, -225871, -58860, 207986, 217510, -189271, -386870, 130715, 133071, 11282, -182883, -64556, 169587, 141155, -149711, -55986, 118138, 15409, 112945, -56955, -190104, 167300, -84927, 8028, -21719, -261788, -190626, -58119, 72960, 232598, -207880, -32490, -73557, 232322, 62433, 14101, 32970, 210339, 283829, -164075, 291080, 77680, 191417, -364874, -179740, 105924, 50670, -191162, -404603, -32539, 275751, -1803, 259796, 112674, -141716, -61613, -122548, 6627]
17736A3007h5287D0792d17349a30847o7623A20600J57003j25169f6033A31095
17725a10938B47603b49491A5603b40713d7985A4361L6956b4138H1801K6460d2232
17713a06011K883I6200L0804C0656a858D05425i9634B96495A5568c60571A39089
17701c08914g2938C5564R3815A6274J37541e6225j47532A09268a39904b7731q4069
17690a11800L9653l605A80805J6830a43720L2831G0678a43066j620d1786r0639
17679a32425G205c00220B4380L3620K7540a54750l3179C23884D3921A5624L58733
17668C74357G7347b64561B30177a63013d5836C71201b12346J0535B15223a82121
17657B69532f9868D6532M3960K4428a60946B55112a22429B67752a37950M3229
$$ y = [13007, -85287, 40792, -417349, -130847, -198470, 120600, 277603, 152434, -66033, 131095, -110938, 247603, -249491, 15603, -240713, -47985, 14361, 51317, -24138, 81801, 108261, -42232, -106011, -103128, 96200, 127004, 30656, -1858, 405425, -99634, 296495, 15568, -360571, 139089, -308914, -72938, 35564, 129379, 16274, 153815, -56225, -203757, 109268, -139904, -27731, -111800, -72147, -75752, 180805, 197635, -143720, -110889, 70678, -143066, -144686, -41786, -132425, 7205, -300220, 24380, 58000, 85540, -154750, -187929, 323884, 43921, 15624, 374357, 77347, -264561, 230177, -163013, -45836, 371201, -212346, -201811, 215223, -182121, 269532, -69868, 46532, 90492, 114920, -160946, 255112, -122429, 267752, -137950, -94721]
17647i4721c4153A94207J37681I9897b72882A11688l9224O5999l0493i4093H557
17635b93001A62498e1528A27149F2501c03199F0664J7843J81872d7214B02082
17624e8385r05B38299q0715O4487A933c01824A35501a1125h87A09147P8582I1783
17611g4611B99519J13840a36764G1333J08371j5934l6584J05248b5827j55949
17601a81776L9558C1716j0686b16879C8333a59957F7161g6973A6170a2419A28120
17589h984k16434G2787h2782A64157O0326a17730B24105J2484J06834A12189N0320
17578A62509p1159b78512b0485H9978M380D2012J10744e7288N501j19731E6441
17566B85062a68440I2498a25360D8060b7033g003l36001B37853A2726a77056L1163
$$ y = [-94721, -34153, 194207, 331888, 99897, -272882, 111688, 72464, 138463, 107970, -94093, 8557, -293001, 162498, -51528, 127149, 62501, -303199, 60664, 78507, 260379, -47214, 202082, -58385, -59290, 238299, 157584, 222071, 1933, -301824, 135501, -11125, -887, 109147, 187729, 91783, -74611, 299519, 413359, -136764, 71333, 179704, 163770, 127186, 232434, -25827, -181776, -142218, 31716, 21030, -216879, 38333, -159957, 67161, -76973, 16170, -12419, 128120, -8984, -225418, 72787, -82782, 164157, 224483, -117730, 224105, 236589, 343423, 112189, 162509, 91350, -278512, -20485, 89978, 94358, 42012, 152756, -57288, -51787, -171518, 56441, 285062, -168440, 92498, -125360, 48060, -27033, -7003, -343004, 237853, 12726, -177056, -145893]
17555a45893B57292O9532I415J44801a77215K653C09753a27596a3976I3211a45273
17543d0438n6396F448A833J18461c5119B28642a59636G9172d90333A83273q4904
17532I8369f3437A936K58483a7624A14069m1360a24993l8072B03293p6480J22720
17521B49533o3362J84740q9603K1030a53808J9788c2647A9534J12972P7841E86
17509a15568G2988M7668b21886A52109b01541A85831A5564J30802m2590b13026
17498E5671a84730A56007L3231o8110m0260J30295G1476J22612a5283j2631j62022
17487a89936D93571a28704C16514p592h6342F2698g3995j13907A4756E052a74548
17475a12263A64799K38938R7820D5914K0027J07613C2572L25109D1549i0549B16305
$$ y = [-145893, 257292, 326824, 9415, 154216, -177215, -174562, 309753, -127596, -13976, 93211, -145273, -40438, -96834, 6448, 1833, 120294, -35119, 228642, -159636, 79172, -490333, 183273, 98369, -63437, 1936, 260419, -17624, 114069, 72709, -124993, -163065, 203293, 126813, 249533, 186171, 370911, 281308, 302338, -153808, -134020, -32647, 19534, 132506, 210347, 586, -115568, 72988, 120656, -221886, 152109, -201541, 185831, 15564, 146366, 103776, -213026, 55671, -184730, 156007, 189238, 121128, 80868, 211163, 71476, 194088, -15283, -27914, -189936, 493571, -128704, 316514, 308922, -86342, 62698, -73995, -187902, 14756, 5052, -174548, -112263, 164799, 403737, 501557, 45914, 65941, 173554, 32572, 357681, 41549, -90549, 216305]
17463C66263A56249F1033L74251e8011A76293O792J84725b4508j6186A89622q0374
17452A09248f2380C09057q9840N2241i8393B90479o6678o320a994B03658K55258
17441D58916a01131c2214B35157l4838p6412k9040e4105a9574B27691p3335J28436
17430B82792a19699B24000j2395g3406G4223K78499j23253L7949N1055C8334J02624
17419A40958g6575A84848Q1325k0528L4269i8604b7322H8058J99325A01086r590
17408I1496K07257E3272N6622m1087J39902j7989M7120r2904f8677B16842D3627
17396g4238A70981J5020a74215I6369l939O8099e0396D13500A42706M1794K28615
17385D13115j53131D597J47894a18276k10741G5806d06020I9815M0778M5650A3758
$$ y = [366263, 156249, 61033, 435284, -58011, 176293, 183085, 367810, -24508, -40694, 189622, 109248, -62380, 309057, 219217, 271458, -98393, 290479, 223801, 217481, -1994, 203658, 458916, -101131, -32214, 235157, 200319, 123907, 94867, -54105, -19574, 227691, 154356, 282792, -119699, 224000, 211605, -73406, 74223, 352722, 229469, 267418, 318473, 38334, 140958, -76575, 184848, 266173, 245645, 279914, -98604, -27322, 88058, 287383, 101086, 91496, 298753, 53272, 109894, 68807, 208709, 190720, 237840, 144936, -68677, 216842, 43627, -74238, 170981, 186001, -174215, 96369, 92430, 160529, -50396, 413500, 142706, 184500, 413115, 259984, 4597, 152491, -118276, -329017, 75806, -406020, 99815, 140593, 186243, 13758]
17373B90013Q4009F6302i8774C04278F6088J98956e7679q9737K6278F7400b29859
17361H8902Q980a37337B00427n576c68340D80026A11349J91372p9126F6740J74351
17350B41091j01806g7093n994B60884a1431m929A51992K10035j06625j22178K41050
17339C74274G3595J60197a01305n5766B31866d416B71847A14810m6751b74003
17328B57651h7140B4365Q2666a72517M2098A03781j0133J66123n2689p9638L35941
17317D63385A00182N9427p8463N74856F0586e802A70238b1079C36057c8228A69675
17305A58005m7071L7868B1296P3522J01799J72990A23001o1495K53041n5562J5572
17294B74557A28621a36489f167A22619J14158k8944F6105K19387l4576G888K71585
$$ y = [290013, 374022, 66302, -98774, 304278, 66088, 265044, -57679, -147416, -121138, 67400, -229859, 88902, 97882, -137337, 200427, 194851, -368340, 480026, 111349, 302721, 223595, 66740, 241091, 139285, -77093, -83087, 260884, -11431, -16360, 151992, 362027, 255402, 133224, 374274, 73595, 233792, -101305, -157071, 231866, -4416, 271847, 114810, 68059, -274003, 257651, -87140, 24365, 107031, -172517, -130419, 103781, 93648, 259771, 207082, 127444, 463385, 100182, 159609, 81146, 656002, 60586, -5802, 170238, -21079, 336057, -38228, 169675, 158005, 110934, 148802, 21296, 94818, 196617, 369607, 123001, 61506, 314547, 258985, 274557, 128621, -136489, -6167, 122619, 236777, 207833, 66105, 285492, 250916, 7888, 279473]
17283B79473E9425L91015B3713b66286C29960E5469A7684K36094b22822D105J67844
17272A71949G8843M6796a8293B5190f3803A06021N3844E2101K35073a41821A15668
17260C37025D4593J09145K32126j30356A23661M15987c9037C23499A50323J1228
17250A61551J97748A3011c4985l86045B33120b21579D7485J27834B027a0609C66610
17238b19110B35251q8483a8527j91523A51944J39382A05256a978j87817B74262
17227B40978K7165a61130A89449h7500A25297d4037B17017J04176C6035K49183
17217B85218j25839L1595r3081J54375o4055a50481a9398A54080l4361O4360A8656
17205A40602K06002c2855A43186a35826f2276D15186b1028C84630g4448B26295
$$ y = [279473, 59425, 450440, 23713, -266286, 329960, 55469, 17684, 253778, -222822, 4105, 171949, 78843, 125639, -18293, 25190, -63803, 106021, 159865, 52101, 287174, -141821, 115668, 337025, 44593, 153738, 385864, 255508, 123661, 539648, -39037, 323499, 150323, 161551, 359299, 13011, -34985, -421030, 233120, -221579, 47485, 175319, 2027, -10609, 366610, -219110, 235251, 146768, -18527, -210050, 151944, 291326, 105256, -1978, -189795, 274262, 240978, 268143, -161130, 189449, -87500, 125297, -44037, 217017, 321193, 36035, 285218, 159379, 190974, 97893, 252268, 188213, -150481, -19398, 154080, 119719, 184079, 18656, 140602, 346604, -32855, 143186, -135826, -62276, 415186, -21028, 384630, -74448, 226295]
17194a63619E02791F2365J25988N409M980B1685M55679j40482K3212K9780d2649
17182H7635C9620L26520j51597L5489j0233p3497R5627K23976n8782D0388N12530
17171E52918k50521E2343O8478L7561l7636E5043J03273f5128A79428J99802A44952
17159b03144B03118m8211P2082m9653L65758o8993a0031D12545j37845A01271
17148A97076N9648j01947L83577A78295L58776j74485A22781a37033C22474k6421
17138B96053r623A35273Q4735L2382J92790a07121B90700J94764c5275B39667
17127B38061E0714K89502h1052B77959E6558O4841P591Q2988r4534M80366A83344
17115E17288B39898j01131a08489B26793M7168A23541K89373k615r0930j58857
$$ y = [-163619, 502791, 62365, 188353, 193762, 198742, 21685, 477364, 336882, 360094, 389874, -42649, 87635, 39620, 366140, 214543, 250032, 239799, 166302, 261929, 485905, 427123, 40388, 552918, 302397, 52343, 120821, 158382, 120746, 55043, 158316, -65128, 179428, 379230, 144952, -203144, 203118, 154907, 226989, 177336, 543094, 474101, -10031, 412545, 274700, 101271, 197076, 256724, 154777, 538354, 178295, 537071, 362586, 122781, -137033, 322474, 296053, 286430, 135273, 220008, 252390, 445180, -107121, 290700, 485464, -35275, 239667, 238061, 50714, 340216, -81052, 277959, 56558, 121399, 128990, 211978, 117444, 597810, 183344, 517288, 239898, 138767, -108489, 226793, 273961, 123541, 412914, 410299, 319369, 160512]
17105A60512K64836o3336j53316R1649o87j41902k665N08028a0085C82105A87225
17093C90322A3513K22733K79665O2807R668k06956n9071q2512H2994L36739n0531
17082C69202J21530L04529C85101o8771J88618A85245K30072p8088J57954j69315
17072C25868j7730J40839j95707a5776C42611J6855J53529j56860J81254j49333
17062C88056m631q385N2002q1654J94399j68992j27863J33934J18377k5126k19549
17051B50568L39494j42252l4218r6421l8421J56097J47320A35569M73194A28713
17040B35844L14100N515l1546j81629J26096O6085r4837l7364H7208K77394J39467
17029E04069J13676O3057j41312j42166K82595k48497L91945C99965A55532K71803
$$ y = [160512, 425348, 362012, 208696, 300345, 299658, 157756, 155091, 663119, -10085, 382105, 187225, 390322, 13513, 236246, 515911, 578718, 588386, 381430, 322359, 239847, 82994, 419733, 369202, 490732, 795261, 385101, 316330, 504948, 185245, 415317, 337229, 495183, 325868, 308138, 448977, 253270, -15776, 342611, 359466, 512995, 356135, 537389, 388056, 383425, 375040, 427042, 345388, 539787, 370795, 242932, 376866, 495243, 470117, 250568, 590062, 447810, 413592, 317171, 278750, 434847, 582167, 135569, 608763, 128713, 235844, 549944, 555459, 523913, 342284, 468380, 534465, 439628, 402264, 87208, 364602, 504069, 617745, 680802, 539490, 397324, 679919, 431422, 823367, 399965, 155532, 427335]
17019D27335O0285M5831j43749L11516o6135j12659r7265L24646k53345K36012
17009G32472l57389R4454J64801M6972m9677j54316J2102j9810J7403J01412N220
16998E93644M7042j90104N5813K37886j55091K64103k07008J67623k83058K47048
16988G77898Q8483j35616n2070J48615j42742P2977j91409m0063L01761k45307
16978E82527R9520M38808k26646k06405j68716J56407L5387O3841K1558q1246
16968G15035K34542k80650J65603J92585m26664M28507k02151P8705l57818J25245
16958F72939J54648J27763k60658J75374r9938j5854L93690j70869p3917L60188
16948A263366o6564l25704L06841K44813l74755l54708M26560r1882K2757R8174
$$ y = [427335, 487620, 533451, 389702, 701218, 635083, 522424, 425159, 749805, 496460, 732472, 375083, 469537, 634338, 681310, 631633, 477317, 489419, 469609, 487012, 588424, 593644, 640686, 450582, 506395, 744281, 589190, 853293, 646285, 813908, 530850, 777898, 866381, 730765, 678695, 827310, 684568, 757545, 566136, 526073, 827834, 582527, 682047, 1120855, 894209, 687804, 519088, 675495, 710882, 774723, 796281, 715035, 949577, 668927, 834530, 1027115, 600451, 1028958, 826807, 905512, 547694, 672939, 827587, 955350, 694692, 870066, 770128, 754274, 1147964, 977095, 903178, 1263366, 1196802, 871098, 1177939, 1422752, 1047997, 693289, 1119849, 1027967, 1050724, 1148898]
16938A148898j70271k40402K05805L6984K72545j8l40739K70829r0394L34026
16928A427263l75860J07646Q8793m60456P34659k30968n0833k81715L87990J84274
16918A530793j78634J33731k39637O5278j26639l62792N20628j05450N741p7623
16908A165396o845K46648j89229Q3447K93728j77657j17401l9592l6965J77456
16898A398986J68565q8397J73846j14040l952K4536L6643j70135Q7231K78849
16888A792132j30989J34391p4038n8671k3712N6570l1971L71068r7204K70257
16878B207833k92581j41879M49209l08128k87151M79638J76480k17571r305k7797
16868B028748Q523J57279J07888q0472n7940k03698K23558N04685n60370L3770
$$ y = [1148898, 978627, 738225, 944030, 981014, 1253559, 1253541, 912802, 1183631, 1093237, 1427263, 1051403, 1159049, 1247842, 787386, 1522045, 1291077, 1240244, 958529, 1346519, 1530793, 1352159, 1485890, 1246253, 1311531, 1184892, 822100, 1342728, 1237278, 1243019, 1165396, 1158551, 1405199, 1215970, 1299417, 1593145, 1415488, 1298087, 1258495, 1221530, 1398986, 1567551, 1479154, 1653000, 1538960, 1535008, 1559544, 1596187, 1426052, 1513283, 1792132, 1661143, 1795534, 1721496, 1662825, 1639113, 1695683, 1663712, 2034780, 1937576, 2207833, 1915252, 1773373, 2222582, 1914454, 1627303, 2106941, 2283421, 2065850, 2056545, 2028748, 2037271, 2194550, 2302438, 2221966, 2164026, 1960328, 2183886, 2688571, 2128201, 2161971]
16858B161971J04518L13771K90110j03588j20113l06276L38465j66690K15385
16849B727553J84291L96646n18343N04331l91271m00505O70147j29824J36682
16840C179707M7971J58903k79485K96274M58428k68042o748L38099l70198M05425
16830C960334l23347L31827K09057j56982j47211L15875N13190l12129L96737
16821D787351L9066L73549m49881o7651K62644J49937k14624L47631J76918L47144
16811E752084k87591J80064Q9850J70247K15120K70010p642J02209N1123L74558
16801F910032k7157N33624m0224K92013O7813N43977k27434M13347l36027P75728
16791H905692k6966O5556P44559J0996J51952M95096M50141j00236J33098M31036
$$ y = [2161971, 2266489, 2580260, 2870370, 2766782, 2646669, 2340393, 2678858, 2512168, 2727553, 2911844, 3308490, 2790147, 3294478, 2903207, 2502702, 3172849, 3043025, 3179707, 3227678, 3386581, 3107096, 3403370, 3861798, 3593756, 3587008, 3925107, 3554909, 3960334, 3636987, 3968814, 4177871, 4020889, 3873678, 4189553, 4702743, 4390614, 4787351, 4826417, 5199966, 4750085, 4682434, 4945078, 5095015, 4880391, 5228022, 5404940, 5752084, 5464493, 5644557, 5734407, 5904654, 6119774, 6389784, 6382142, 6484351, 6535474, 6910032, 6882875, 7416499, 7376275, 7668288, 7736101, 8280078, 8052644, 8465991, 8129964, 8905692, 8878726, 8944282, 9688841, 9699837, 9851789, 10346885, 10797026, 10696790, 10829888, 11260924]
16781A1260924M50176N53728L43121K78300M34666M73840P24741M26964L42036
16772A5288496M60698P80064L22521P63770L96229Q68971O80032O26514J018415
16763B1205710P91654Q68616J139136O91385P44315J533000J258156J315087J203294
16754C0750353J239140K106852J323390J857790J850914K302507K068240K002891
16746D5502077K855695K593908K771219L198810L228833L983578L857568L906912
16738G1898600M249558M854866M876737N427619N627686O022313O518916O495819
16730A15972114O800159O950623P140044O839575O902208O887149N626791N221542
16722A68340205M454937L260291K576750J145808l00388j072345k722737l456256
$$ y = [11260924, 11711100, 12264828, 12607949, 12886249, 13320915, 13794755, 14519496, 14946460, 15288496, 15749194, 16529258, 16851779, 17615549, 18011778, 18880749, 19560781, 20187295, 21205710, 21997364, 22865980, 24005116, 24696501, 25440816, 26973816, 28231972, 29547059, 30750353, 31989493, 34096345, 35419735, 37277525, 39128439, 41430946, 43499186, 45502077, 48357772, 50951680, 53722899, 56921709, 60150542, 64134120, 67991688, 71898600, 76148158, 81003024, 85879761, 91307380, 96935066, 102957379, 109476295, 115972114, 122772273, 129722896, 136862940, 143702515, 150604723, 157491872, 163118663, 168340205, 172795142, 176055433, 178632183, 179777991, 179477603, 178405258, 175682521, 172226265]
16714A72226265m681493m978021o056294o608226o407020o952088p362102p013488
16706A22167533o765638o673100o296799o204763n573870n262638n204253m895571
16698G5290901m211985m016159m128232l551791l287687l212528k603442k750668
16690D7528409k594158k625860k011847j977704j578053j793467j600384k147793
16682C1199143j055591j364902j178120j122492j491755o51360j258688p11444
16674B2364791j013203q80716r26950j024618m49333n71137k86197r51229o17101
16665A5644307o20241k75410r79591k68552l56939o39670l54030l29412k55220
16656A1565242l76065l12815k65668k89442k58223m05429O0708o67908k02689
$$ y = [172226265, 167544772, 162566751, 156510457, 149902231, 143495211, 136543123, 129181021, 122167533, 115401895, 108728795, 102431996, 96227233, 90653363, 85390725, 80186472, 75290901, 71078916, 67062757, 62934525, 59382734, 56095047, 52882519, 50279077, 47528409, 44934251, 42308391, 40296544, 38318840, 36740787, 34947320, 33346936, 31199143, 30143552, 28778650, 27600530, 26478038, 24986283, 24334923, 23076235, 22364791, 21351588, 20470872, 19543922, 18519304, 18069971, 17498834, 17212637, 16261408, 15644307, 15024066, 14748656, 13769065, 13500513, 13143574, 12503904, 12149874, 11820462, 11565242, 11189177, 10876362, 10610694, 10321252, 10063029, 9657600, 9718308, 9050400, 8847711]
16647H847711k58569k5638l61098m68747j75988K62490l81120K2748m76506j81798
16637F803485l19803j07623l39985K86874j99821l41237j03291P2301n50169K93070
16627E493801q2612l89555q9609j05904P804L47167n05196j83696k60623Q7907
16617D319484M6960j3534m65281K61248l24739K87491l35914K7547l5638M3436
16607C811060k28968K25358l36485M9382M7908m0710j34212k12151P3638m62377
16597B792443L2730K64100m47572K67554J01486j83032k75881j41417M45776p1495
16587B784692n02293P4605K28734j15266q4382j45120J68345r8922N0981J67125
16577B528499k20659k23889P9186l02174O84943m69138r0038P86J05480j6357
$$ y = [8847711, 8589142, 8563504, 8202406, 7733659, 7557671, 7820161, 7439041, 7461789, 6985283, 6803485, 6483682, 6376059, 6036074, 6322948, 6123127, 5781890, 5678599, 5750900, 5200731, 5493801, 5411189, 5021634, 4932025, 4826121, 4833925, 5181092, 4675896, 4492200, 4231577, 4319484, 4366444, 4352910, 3887629, 4148877, 3824138, 4111629, 3775715, 3803262, 3767624, 3811060, 3582092, 3807450, 3470965, 3520347, 3568255, 3527545, 3393333, 3181182, 3254820, 2792443, 2825173, 3089273, 2641701, 2909255, 3010741, 2827709, 2551828, 2410411, 2856187, 2784692, 2282399, 2357004, 2585738, 2470472, 2386090, 2240970, 2409315, 2310393, 2361374, 2528499, 2307840, 2083951, 2163137, 1860963, 2545906, 2076768, 1986730, 1987516, 2092996, 2076639]
16567B076639m5924r520j33175j18545K76107j34504m53658J65705J55291j22191
16557A656225J02346K0362m22700j37988L41055n8973k63240J68552J06483J97123
16547A709245k81845j15991J8623j99243L30134o3681k15766K51898o6344P117
16537A374147m8597J8469k02104q6087O0120M20398m78243J29919L6459J23058
16527A347539r6564k12377J09750j99969N8419m773j7816m74974M96038k08826
16517G96447L98648k46185N5987N1064M1048N5108k60891L06851l26799j09109
16507G62169N45707o33049Q8877p877L78806j69945m29741J41060Q978L9400Q3301
16496H07686L40309l08494m7498o7268K00885m41408K90747k35780j42990O365
$$ y = [2076639, 2030715, 2021195, 1888020, 1769475, 2045582, 1911078, 1457420, 1623125, 1778416, 1656225, 1758571, 1778933, 1356233, 1218245, 1559300, 1500327, 1237087, 1405639, 1512122, 1709245, 1427400, 1311409, 1330032, 1130789, 1460923, 1397242, 1181476, 1433374, 1367030, 1374147, 1325550, 1344019, 1141915, 1055828, 1115948, 1536346, 1058103, 1188022, 1224481, 1347539, 1250975, 1038598, 1148348, 948379, 1006798, 1002025, 984209, 509235, 1005273, 796447, 1195095, 948910, 1004897, 1055961, 1097009, 1152117, 891226, 1198077, 871278, 762169, 1307876, 674827, 763704, 755827, 1134633, 964688, 534947, 676007, 684985, 724385, 807686, 1147995, 839501, 792003, 724735, 925620, 484212, 774959, 539179, 396189, 402554]
16486D02554K90509K11635k59949N3290J71567D17471L37278R7957r0029l3263
16476G29414J24478J99016m51624J60217k69722N9424M0578j53973O7552J06116
16466F11476r5439K77326j73751p2557p4669j26538L05882P94l2976B49965K12544
16455D62509O8582n1463J71456J01526l44110J09309N4150J82449k69856J54962
16445F39514K38376k35886k95333M18641j12188l3056j31299j27295K44079r860
16435E95693k87703M48508B76097M40526j79361j87354J98272J35222k52751A68749
16424A76688K11185M1897J200r1097O4342q4120L01478j57811G6673L36605K3600
16413D36878n0256K94335j76018k2338O3461j35839O3987j36293Q8032J7857j21254
$$ y = [402554, 693063, 904698, 644749, 698039, 869606, 417471, 754749, 852706, 762677, 729414, 853892, 1052908, 601284, 761501, 491779, 551203, 591781, 437808, 505360, 611476, 516037, 793363, 619612, 547055, 472386, 345848, 651730, 652524, 619548, 249965, 462509, 531091, 479628, 651084, 752610, 408500, 517809, 571959, 754408, 484552, 639514, 877890, 642004, 346671, 765312, 653124, 620068, 488769, 361474, 605553, 595693, 307990, 756498, 276097, 716623, 537262, 349908, 548180, 683402, 430651, 168749, 176688, 387873, 429770, 430970, 339873, 404215, 320095, 621573, 463762, 76673, 413278, 436878, 386622, 680957, 504939, 482601, 546062, 410223, 474210, 337917, 425949, 443806, 322552]
16402C22552K23317N7892B20078L2373J81831A12442J88446K61704j19453j68020
16392B75119J50533m6382R4546O629j6663A94472J86513K32226k86502K8825n3936
16381C01598K2229J7807L7338j39968k2649a1642C05115j2581N9940J36902K04470
16370F93846A70356J3057J4002O0161J77044o9423j69950K69540A16638K10085
16360C26723O450e4483C63197k630r1906m0722p3970k2077J49261N9270j18845
16349B21578Q3962j8374l9372K15005D8019O0384K81729A91123J64566R782A28555
16337A18953L49553E8454C505M07241A71982a97751B42451k6494J35600N7477
16327D09034K7415A45651F2451R820J19083l633D4545p252Q8252l2149K41313
$$ y = [322552, 545869, 603761, 220078, 252451, 434282, 112442, 300888, 562592, 443139, 275119, 425652, 379270, 473816, 480445, 463782, 194472, 380985, 613211, 326709, 355534, 301598, 323827, 341634, 378972, 239004, 216355, -11642, 305115, 292534, 352474, 489376, 693846, 170356, 183413, 197415, 257576, 434620, 365197, 195247, 464787, 116638, 326723, 333173, -54483, 363197, 360567, 268661, 227939, 153969, 131892, 281153, 340423, 221578, 305540, 287166, 247794, 462799, 48019, 108403, 390132, 191123, 355689, 365471, 128555, 118953, 468506, 58454, 3505, 410746, 171982, -197751, 242451, 215957, 351557, 409034, 436449, 145651, 62451, 72271, 191354, 187721, 44545, 37293, 125545, 93396, 334709]
16316C34709J04984j76605m7380C3575L00193i6507D47663o3812A24192J43007
16306B67199J2191K36624b82627C16151r5151J29402j14063A10465a70721B12576
16295D0231a03650A77043g189m7146A29673J54970b9561A49563k7454b32096H8965
16283b8015C70063j75640k5183c1668A1298L66767A6576J15780N802l8618K21234
16272C20774a37782B09177a46786A83692h3050r9340B56083J35371H7194q559
16262G8635J87328A03185J48749Q0312a42552A89194R6974b11164D8130K83639
16252C31769q2034m8503J3080K6945D8309Q6791b0203A3478i8415A66371o7238
16241I9133q785d8843q6754B18492o2601J79034a64068B30032P8298J96468e9286
$$ y = [334709, 439693, 263088, 215708, 33575, 333768, -96507, 447663, 383851, 124192, 267199, 279390, 516014, -282627, 316151, 221000, 350402, 236339, 110465, -170721, 212576, 40231, -103650, 177043, -7189, -54335, 129673, 284643, -29561, 149563, 122109, -232096, 88965, -28015, 370063, 194423, 169240, -31668, 11298, 378065, 16576, 132356, 138158, 99540, 320774, -137782, 209177, -146786, 183692, -83050, -182390, 256083, 391454, 87194, 78635, 265963, 103185, 251934, 332246, -142552, 189194, 286168, -211164, 48130, 331769, 249735, 201232, 214312, 241257, 48309, 135100, -20203, 13478, -98415, 166371, 99133, 90348, -48843, -135597, 218492, 155891, 334925, -164068, 230032, 308330, 504798, -59286]
16229B06453J34980g2402B885J19740L6303a80720A13422n2066j615K3670K55341
16218C38752o8727C1730o146J72802d2616A28851K78584G1311L18576A58759G2988
16206A78334D4274c4671C53327j31845a9553A47737A1051L00686a02893a6819
16195H6285M7930j125A7065a0081C81423A24167A5271J14589K14905O5487A17794
16183d3703I4865d9251j09801g1350C8417L46817j63020C5926J5229a29963A38412
16171A81592C9207A2497B697J2696Q361K8796P384H834O7918J68114k7323b95268
16158B34693M0592b72847A58361Q9756I5287d1458A29854a58903A10871b174B98909
16146A75574o8295g2707j38882B43179D707K1375e7638K2963A43067a09296q648
$$ y = [206453, 341433, -72402, 2885, 122625, 158928, -180720, 113422, 61356, 59741, 83411, 338752, 270025, 31730, 25584, 198386, -42616, 128851, 407435, 71311, 389887, 158759, 72988, 178334, 44274, -34671, 353327, 221482, -19553, 147737, 11051, 311737, -102893, -16819, 86285, 134215, 133090, 17065, -10081, 381423, 124167, 15271, 129860, 344765, 410252, 117794, -43703, 94865, -49251, -159052, -71350, 38417, 385234, 222214, 35926, 51155, -129963, 138412, 181592, 39207, 12497, 2697, 15393, 23754, 52550, 59934, 8834, 76752, 244866, 217543, -295268, 234693, 275285, -272847, 158361, 248117, 95287, -41458, 129854, -158903, 110871, -2174, 298909, 175574, 107279, -72707, -211589, 243179, 4707, 26082, -57638, -34675, 143067, -109296, -117944]
16135a17944m8871B38315l2341J17128I5417i6763k6169e9172n6986b9861j06168
16124a36029o0282B05730E5776K29141a2841B67016a3029A53613a47954A0858
16113A72104a5659j65239M2396c1965k28018i0896j6776i995C7073J23807p3602
16102H7278a3837A30239E9464f9396B4369P0827K0392J60209c48886I6806H969
16090b07641A27510d5619q1995N9933j23961A05987b38976d2033C440c54387A01429
16078A11503b40043A69038L6908f5397B70602i9277H2300J41926M3260a28321
16067d0591q0317L4388A13701b13203D450a45031m4629A12690i0625A58501F7761
16055A48576K1336b5508A52885L2930a30175k7570I0780a29879d3125A21636a4994
$$ y = [-117944, -166815, 238315, 205974, 323102, 95417, -96763, -122932, -59172, -116158, -29861, -136029, -196311, 205730, 55776, 284917, -12841, 267016, -13029, 153613, -147954, 10858, 172104, -15659, -180898, -138502, -31965, -259983, -90896, -107672, -9995, 37073, 160880, 87278, -13837, 130239, 59464, -69396, 24369, 95196, 115588, 275797, -348886, 96806, 8969, -207641, 127510, -45619, -127614, -67681, -191642, 105987, -238976, -42033, 3440, -354387, 101429, 111503, -240043, 169038, 205946, -65397, 270602, -99277, 82300, 224226, 267486, -128321, -40591, -120908, -86520, 113701, -213203, 4450, -145031, -189660, 112690, -90625, 158501, 67761, 148576, 169912, -25508, 152885, 185815, -130175, -157745, 90780, -129879, -43125, 121636, -14994]
16043F9776H953c25300A01064K75291j43258g3662I670Q5885c19726C7755b09057
16031F7567A4237a44270f530G4602l2619a28952a3071j6172A17974k0162a90932
16019a10390d5418I3054B3950J0975K70h3890l2577c9814q6531K3015k36605D6630
16006E8793N9817a76287B1631a05237M4196j06049b1464j27923B4681K44922j33044
15995A36559E7009O511P6540e8124k33205M6553E9424N0705m3435a75828j01772
15984b77600J5559c4355q125o6721A37708J25619E2041e1422C37260e6363j53119
15973b09482D1820A0079J05245f7729D6568b43881H5247L64N4772B5541a54443
15961b20593C9341b42576M91A85100l8802a042p9234A21331M5426a8426A96339
$$ y = [69776, 8953, -325300, 101064, 376355, 233097, -73662, 9670, 95555, -319726, 37755, -209057, 67567, 14237, -144270, -6530, 74602, 41983, -128952, -13071, -29243, 117974, 97812, -190932, -110390, -45418, 93054, 23950, 34925, 35195, -83890, -116467, -39814, -126345, -103330, -339935, 46630, 58793, 118610, -176287, 21631, -105237, -61041, -167090, -21464, -149387, 24681, 269603, 136559, 57009, 63520, 140060, -58124, -291329, -244776, 59424, 110129, 66694, -175828, -277600, -262041, -34355, -42480, -109201, 137708, 263327, 52041, -51422, 337260, -56363, -209482, 41820, 10079, 115324, -67729, 46568, -243881, 85247, 85611, 140383, 25541, -154443, -220593, 39341, -242576, -242085, 185100, 146298, -1042, -80276, 121331, 166757, -18426, 196339]
15949d2284r8778c7310B0314b730j54078Q371E5521k200a00235l3438r0917A01774
15936a22292d2446r3194J3543g076l60443c3670p2314A6588a79504c5359A2853
15924a45654K1824A45386a25518I0306b30637B38324a83592B54486a60637e0075
15913a14894A04861a69375F5569A5825P9180b70269A15618b12245g5564a108B8760
15901A0442d7353B71807A02789a88620Q9342B18285h5972C37080b94331E5242
15890g1650k42696D89935a0009q8752M2026m204A91560G506f3643A36691F0748
15878d1148q3300A48967f7627j84062D1881b44444O4059g56j19383E0617b38717
15866A45022c56010L3145C3989a24161B87146I7376a53462F9660P0150i3133k02155
$$ y = [-42284, -141062, -37310, 20314, -2730, -156808, -148437, 55521, 53321, -100235, -133673, -224590, 101774, -122292, -42446, -135640, -122097, -7076, -367519, -33670, -105984, 16588, -179504, -35359, 12853, -145654, -123830, 145386, -125518, 90306, -230637, 238324, -183592, 254486, -160637, -50075, -114894, 104861, -169375, 65569, 15825, 95005, -270269, 115618, -212245, -75564, -1108, 28760, 10442, -47353, 271807, 102789, -188620, -99278, 218285, -85972, 337080, -294331, 55242, -71650, -314346, 489935, -10009, -98761, -56735, -60939, 191560, 7506, -63643, 136691, 60748, -41148, -124448, 148967, -67627, -251689, 41881, -244444, -180385, -756, -120139, 50617, -238717, 145022, -356010, -322865, 33989, -124161, 287146, 97376, -153462, 69660, 139810, -93133, -295288]
15855b95288B5702L44041b01371a00411p1895l147A20790a76399B4595h949j16283
15844a25232M1876k7871B14105o9243c0372G575L17120C5274b80442i5642B91068
15832a73006A7810J99163d5649a6740k38043A4887R1188P8070c22291i4057C35489
15820A82029P4600A20452b86401M8243A57124i3407I8710J52224a33044A75354
15809G0411K0877b6569E8186f2468A90289q5495c0666l5673j9986L1164l65513
15798d20674B11168a77978G6691J26313I1310g3472J5547K469A09824n0866a33767
15786B27692b97314J15394b8240n3374B26038e0095H2559a10304j37885N4920
15776a93269C3389J7489b29274k22992k8682I1003p730a91893g7793J5413j9173
$$ y = [-295288, 25702, 369743, -201371, -100411, -172306, -175453, 120790, -176399, 24595, -8949, -125232, -83356, -111227, 214105, 144862, -30372, 7575, 324695, 35274, -280442, -95642, 291068, -173006, 17810, 216973, -45649, -16740, -254783, 14887, 106075, 184145, -322291, -94057, 335489, 182029, 256629, 120452, -286401, -238158, 157124, -93407, 98710, 250934, -133044, 175354, 70411, 91288, -26569, 58186, -62468, 190289, 104794, -30666, -66339, -86325, -55161, -420674, 211168, -177978, 76691, 203004, 91310, -73472, -57925, -55456, 109824, 58958, -133767, 227692, -297314, -181920, -28240, -81614, 226038, -50095, 82559, -110304, -248189, -193269, 33389, 50878, -229274, -452266, -480948, 91003, 83273, -191893, -77793, -62380, -81553]
15765h1553A5700C949a28761m6497M5365A49134b0577p8310I9045L88489A40459
15753G3925K504j7077L8446J02880a39357b8183r9420F9834A2786c9500l23280
15742c62780J30269A21935a14752M6916J9234B32509F8043j1074b56490o9217
15732c25707J19990A27720c49663A54708b90128J21872l9543B3601b86137B64176
15721b17682k2082j48076Q8858A3208n977J17429b3663B22816a20805d9368k10353
15710b59721a27228L8718j2737d0402H0928b48196J06510L9662o5495N1052A29997
15698G3027i723j73793C07147A43454O6564a50553k5927e0642A85578J86108A19756
15686I4000a94570A82138o3208L4800K0902a16362m71777b0813j0109A75803a09279
$$ y = [-81553, 15700, 3949, -128761, -175258, -129893, 149134, -20577, -98887, 99045, 487534, 140459, 73925, 76429, 59352, 97798, 200678, -139357, -28183, -127603, 69834, 12786, -39500, -362780, -232511, 121935, -114752, -67836, -48602, 232509, 68043, 56969, -256490, -325707, -205717, 127720, -349663, 154708, -290128, -168256, -207799, 23601, -286137, 264176, -217682, -239764, -387840, -298982, 13208, 7231, 124660, -23663, 222816, -120805, -49368, -259721, -127228, -88510, -101247, -40402, 80928, -248196, -141686, -102024, -167519, -116467, 129997, 73027, -9723, -183516, 307147, 143454, 210018, -150553, -176480, -50642, 185578, 371686, 119756, 94000, -194570, 182138, 118930, 153730, 174632, -116362, -588139, -20813, -30922, 175803, -109279]
15674a05657C3900K5052J99299a29627O488J6965l02973G271M2002J3525b02049
15662D6274R1219k375J88129c26763O8040D5849c00563h5464K0003b905k0800
15651b3705B21401N8319e3166j19952A65087a7663j41827A78102a21954A86683
15640a66354G7440k2138a08169E7665f5559G6439b98668P1407A38478c6140B5075
15628b9860C42737L0163g4690H0758J22494b00162C39442b5686A53925J60914
15618C14839J04248I0477b64840A08922a24974j47089A94797c21889Q5329C190
15607A56390G3453f6449q3307n5103i5073B89201j13459H6836j8065g8107B5230
15595B2139g295l09632A34903A2925K87542b10141A99363c9699k89103G2848e5931
$$ y = [-105657, 33900, 58952, 258251, -129627, -123139, -106174, -409147, 7271, 49273, 62798, -202049, 46274, 137493, 135118, 323247, -326763, -258723, 45849, -300563, -85464, -65461, -2905, -23705, 221401, 279720, -53166, -173118, 165087, -17663, -159490, 178102, -121954, 186683, -166354, 77440, 55302, -108169, 57665, -65559, 76439, -298668, -227261, 138478, -36140, 25075, -29860, 342737, 372900, -74690, 80758, 203252, -200162, 339442, -25686, 153925, 314839, 419087, 90477, -264840, 108922, -124974, -272063, 194797, -321889, -236560, 3190, 156390, 73453, -66449, -149756, -204859, -95073, 289201, 175742, 86836, 68771, -78107, 25230, 22139, -7295, -316927, 134903, 12925, 300467, -210141, 199363, -39699, -328802, 72848, -55931]
15583F3530k4363K0770b44511J359A2221a43290c2260D4572N5825a00127E8428
15571a3889K783j81518m5647a934B70452l0855p3668M7187D2996c41858B21071
15559i0939A21305a85457C4833N4268k3746K61373C156M4293J21423a0185l16382
15548c26567A2880a29284B7196a2293m17103B907f262k4085A91622a57268P2586
15537h4682B5760a91658A06349g5879a2807k12598A88145a22530D4817b14537
15526f2948k0231j69711L8979A56374Q4345a81565h1650A39750C0608J22560b58854
15514C36132h5431j77089H7004a73568Q3667j90580C5108J94172c1746C9833c4410
15502h6581r2609B20927a2188F1693O1655P1496e3371C3185c40259b5257p2985
$$ y = [63530, 39167, 59937, -244511, -243152, 12221, -143290, -32260, 44572, 100397, -100127, 58428, -13889, -11106, -192624, -238271, -1934, 270452, 239597, 165929, 213116, 42996, -341858, 221071, -90939, 121305, -185457, 34833, 89101, 65355, 326728, 3156, 47449, 168872, -10185, -326567, 12880, -129284, 27196, -12293, -429396, 2907, -6262, -30347, 191622, -157268, -84682, 25760, -191658, 106349, -75879, -12807, -225405, 188145, -122530, 44817, -214537, -62948, -83179, -252890, -213911, 156374, 240719, -181565, -81650, 139750, 30608, 153168, -258854, 336132, -85431, -262520, 87004, -173568, -89901, -280481, 35108, 229280, -31746, 39833, -34410, -86581, -179190, 220927, -12188, 61693, 123348, 194844, -53371, 33185, -340259, -25257, -98242]
15491i8242R731p5322j67980a20211j7731B1465J35321O3204G5654J96543b04931
15479C5117K5376J22264e21381b59957C25346A18191C1783P63Q4893h2756k01924
15468b84680h9853j66205A04483j6533b42278J0375e294C24726I9969b75755A54764
15456A25182k3139a8044D4203a12936k3278K6626n3367d5464A73464a8305G9833
15444I1654b06880d7245E9688K43317J1648A07544O7433g2348j77824f3411b802
15432A21198b71579A35770o5828c06096G2459d746j73679N0647j09030R396J6118
15421b11294j3761B66549h3081d0755A67817a12118a7342o5928B92155A8176J12853
15410A31029b94582A25022B5186J24571A3686K41218h7925A96943a51110f7655
$$ y = [-98242, -88511, -163833, -331813, -120211, -137942, 21465, 156786, 219990, 75654, 272197, -204931, 35117, 60493, 182757, -521381, -259957, 325346, 118191, 31783, 32546, 117439, -82756, -284680, -89853, -256058, 104483, 87950, -242278, -231903, -5294, 324726, 99969, -275755, 154764, 125182, 102043, -18044, 44203, -112936, -136214, -109588, -162955, -45464, 173464, -18305, 79833, 91654, -206880, -47245, 59688, 303005, 314653, 107544, 174977, -72348, -250172, -63411, -2802, 121198, -271579, 135770, 69942, -306096, 72459, -4746, -178425, -127778, -236808, -227412, -211294, -225055, 266549, -83081, -40755, 167817, -112118, -17342, -83270, 292155, 18176, 131029, -294582, 125022, 25186, 149757, 13686, 254904, -87925, 196943, -151110, -67655]
15399a72696o7774e6546A07333K8678a45060C0300J01565J2376a45r177D3986
15387b11202b1943q8339c1383m3578j31706Q0751k55792d1203E8936b74301I1623
15375E5067d9706C40956a25639B87382r9038a82789A11796Q6807a67550g4200
15364b08240j30084D7848J7233K85330H0152b29274A03895b58590f1940B58427
15353C9456K4949a37227a0315r7060G6957K94965m8973c78132B13116F9521l618
15342F5903K97834A70566a9787A01725N2016b30585a00043C99279G7683b32153
15331i2372I0103j4780A2592b46437B46153A17418R6996r1240J92156b55850Q5266
15320a70584d7932j00104A24942H453c25947i9256A51097A806J44803P9064D6682
$$ y = [-172696, -240470, -56546, 107333, 136011, -145060, 30300, 131865, 144241, -145, -9322, 43986, -211202, -21943, -110282, -31383, -74961, -206667, -125916, -381708, -41203, 58936, -274301, 91623, 55067, -49706, 340956, -125639, 287382, 188344, -182789, 111796, 198603, -167550, -74200, -208240, -338324, 47848, 65081, 350411, 80152, -229274, 103895, -258590, -61940, 258427, 39456, 64405, -137227, -10315, -107375, 76957, 371922, 322949, -378132, 213116, 69521, 65903, 363737, 170566, -19787, 101725, 153741, -230585, -100043, 399279, 77683, -232153, -92372, 90103, 75323, 12592, -246437, 246153, 117418, 214414, 123174, 315330, -255850, -170584, -47932, -148036, 124942, 8453, -325947, -99256, 151097, 1806, 146609, 225673, 46682]
15308C8201J6366j0520h512A00589c1617B85418A04968E1435Q2474g6733G613
15296C2067b75524a04876M6454r6861p4077e9413E2464a52997A08002a12185L5224
15285g6961B16009d3760A62109l8202b35096A56221C9985J22058d05872b0483
15274B71390J63654A37765f9790A08000g9966F1511O0985e1798C8674J33373L444
15263A75491M57756i878B26264E037K35139r2829b56792A53414o8554J12425a11458
15251D09317n211L8794j38667A20734e3603b2814E3222l907a61656A57342L4333
15240A91675g4253B15128a29352j4093G2739i1174j1700n2990b6616q5038k19091
15229c30745A31101a02188j1442A59282e8241B77707a30519M3461A4500a7765
$$ y = [38201, 54567, 44047, -8512, 100589, -31617, 285418, 104968, 51435, 133909, -76733, 7613, 32067, -275524, -104876, -58422, -155283, -229360, -59413, 52464, -152997, 108002, -112185, -76961, 216009, -43760, 162109, 123907, -235096, 156221, 39985, 162043, -405872, -20483, 271390, 435044, 137765, -69790, 108000, -79966, 61511, 122496, -51798, 38674, 172047, 175491, 633247, -9878, 226264, 5037, 240176, 147347, -256792, 153414, 84860, 197285, -111458, 409317, 404106, 442900, 304233, 120734, -53603, -22814, 53222, 49315, -161656, 157342, 191675, -74253, 215128, -129352, -143445, 72739, -91174, -102874, -155864, -26616, -111654, -330745, 131101, -102188, -113630, 159282, -58241, 277707, -130519, -87058, 14500, -17765]
15218B15393c06206B59964F3671a28301B22893b54379A14433L4489n6607h3896
15207B47424a15567E68228g7207k7850B4445K42508r7395f3270A84873c624n7467
15196f1091j59069f1261m2120H3586i6159C02854E059c27453c905B23001j5586
15185B07415G0515h3510A44145E0160d6251j02210e2070A45748b60852H2994l6433
15174D6561K7409C3263c36706J13148j45557B37599a15824A95045B185J99579
15164B01764J85254G6770f4260E2877h4648F4235b04923E3365b4819j17086A70013
15152C2668B932K19412K8494a80121D28872A33031b0971l90028A83512D0086J46682
15141A86768D2939P7740J70587a66683B47826a1294A32863i868n1912l6173B30261
$$ y = [215393, -306206, 259964, 63671, -128301, 222893, -254379, 114433, 148922, 92315, -83896, 247424, -115567, 568228, -77207, -105057, 24445, 266953, 169558, -63270, 184873, -3624, -61091, -220160, -61261, -103381, 83586, -96159, 302854, 5059, -327453, -3905, 223001, 207415, 70515, -83510, 144145, 50160, -46251, -148461, -52070, 145748, -260852, 82994, 46561, 73970, 33263, -336706, -223558, -369115, 237599, -115824, 195045, 2185, 201764, 387018, 76770, -64260, 52877, -84648, 64235, -204923, 53365, -24819, -141905, 170013, 32668, 2932, 222344, 250838, -180121, 428872, 133031, -20971, -410999, 183512, 40086, 186768, 42939, 120679, 291266, -166683, 247826, -11294, 132863, -9868, -61780, -97953, 230261]
15129A96509a27343a0304l3074k6888K6375C25069A15404L37137A60169J5206
15119A75375H3198f7570A09065J83040I5732N5932m1870j1930d69l3098C34608
15107B87244A42831R8022j2899A9054J10898B4724K94748B9784M0306j0251a5831
15095c4327C48791b09276E4086K79148b1759D06283C8358e2348k03783g4431B25560
15083A21628r451g6508C2138J27156a36236B68742F6945J83608D9964e8091E94870
15071F5480N4816f894B03867g797I8123C3052g256C63588F351N64340B6613R4045
15059A20658E0844J24696K83025I4688d7634C00208B1515J91570D7493J68637
15049B16130K2852p2068Q523L26091A60377E5526J10054K08883A28122P5387k1158
$$ y = [196509, -127343, -10304, -43378, -70266, -43891, 325069, 115404, 452541, 160169, 175375, 83198, -67570, 109065, 292105, 95732, 151664, 109794, 97864, -469, -33567, 334608, 287244, 142831, 240853, 227954, 19054, 129952, 24724, 319472, 29784, 70090, 59839, -15831, -34327, 348791, -209276, 54086, 333234, -21759, 406283, 38358, -52348, -256131, -74431, 225560, 121628, 112177, -76508, 32138, 159294, -136236, 268742, 66945, 250553, 49964, -58091, 594870, 65480, 120296, -6894, 203867, -7797, 98123, 33052, -7256, 363588, 6351, 570691, 26613, 120658, 50844, 175540, 458565, 94688, -47634, 300208, 21515, 213085, 47493, 216130, 238982, 166914, 175437, 501528, 160377, 55526, 165580, 374463, 128122, 203509, 182351]
15038A82351p4455P6009o7396m1681A3909b3888C88850n8131A01191l2466B0548
15026A12165K01763J25708q5602c29524B73245A22636J10586H5999J81040A17318
15015A76268o7246J80773H2225j4327K00462A11434J75806q2761M7422p9601b969
15003B69055J00739A32322K31478O5113a41328A32606L2877i9131i919A26051
14992B11253P309M5201a58823B11057a8984E22765A67481F7291N04403c47116
14981G8615J92418h577C58544D3243O05976C18782J29358O3024D7759J12578L07166
14970D67503B12583N6757q6119c36208D7891c3554A75047L45901A60925k043P9537
14959B38419R8502A55827L0243L74989a17762B19868c2782A59805K04417Q1348
$$ y = [182351, 107896, 183905, 116509, 74828, 13909, -23888, 388850, 330719, 101191, 68725, 20548, 112165, 313928, 439636, 354034, -329524, 273245, 122636, 233222, 85999, 267039, 117318, 176268, 109022, 289795, 82225, 67898, 268360, 111434, 287240, 204479, 251901, 172300, -2969, 269055, 369794, 132322, 363800, 428913, -141328, 132606, 165483, -99131, -9919, 126051, 211253, 218562, 263763, -158823, 211057, -18984, 522765, 167481, 67291, 571694, -347116, 78615, 271033, -8577, 358544, 43243, 649219, 318782, 448140, 511164, 47759, 160337, 467503, 212583, 269340, 183221, -336208, 47891, -33554, 175047, 520948, 160925, 158882, 238419, 336921, 155827, 186070, 561059, -117762, 219868, -32782, 159805, 364222, 445570]
14949D45570k11670o5635J65482j54725L60454k24866b7426C58617j61423J29745
14939C26939e4237E68098k68313a61877D73826j00779A59071K86873A50323L04982
14929D55305A36366J52637a594B56697f6194B73151R5663j03860j08286K22412
14919C79080q9396c3759A8494J31201K25997j75019J62138j40492L1036j2967
14909B40388k2238l1030K88620K6451A95617K48111e7990C33051H1659J88650
14899B70309C5596K79514e7305E09484e9030C20941j53594K8396Q980K31943j19034
14888C17632J29593B14720J46654j14259K33044B34697J76550H9871M24745j69787
14878C44829j55277K00988j85575M3957G8080L3735R1888b0422A52197L79788
$$ y = [445570, 233900, 168265, 333747, 179022, 539476, 314610, -27426, 358617, 197194, 326939, -54237, 568098, 299785, -161877, 473826, 373047, 159071, 445944, 150323, 455305, 136366, 289003, -1594, 256697, -66194, 273151, 368814, 264954, 156668, 379080, 289684, -33759, 18494, 149695, 375692, 200673, 362811, 222319, 253355, 240388, 218150, 187120, 475740, 502191, 195617, 443728, -57990, 333051, 81659, 270309, 35596, 315110, -57305, 509484, -59030, 320941, 167347, 195743, 204723, 436666, 317632, 447225, 214720, 361374, 247115, 480159, 234697, 411247, 89871, 514616, 344829, 189552, 390540, 204965, 248922, 78080, 111815, 203703, -20422, 152197, 531985]
14868E31985a32932O5754D47481n4360m2556M1704A88189Q5966K3402l9833R288
14857B67012J20622A83501J85804J33035J51015j07540o4870j48641J56646j24201
14847C64749k9619P3070o4256k0687P2280n0171F5302M26872j18030K73j84125
14836A90292M15505j48114p2612j49577H7930M7450K15627L2154J11954I763M16730
14825D26493j57481K80561j88049B0429L36369J19787m1904l2414A25575J69792
14815B95367K37534F7409M66077I1793K08724L571J63443J3010k28019K4701J63563
14804D40786R9331k13395r5202M80425k48975Q424J63821K82512B45668J83803
14794D29471k2290J70045m9933r9934r467l1839m8895L27410B92123K23165K040
$$ y = [531985, -132932, -67178, 447481, 393121, 350565, 392269, 188189, 274155, 297557, 257724, 267012, 387634, 183501, 369305, 502340, 653355, 545815, 480945, 332304, 488950, 364749, 335130, 408200, 343944, 323257, 395537, 345366, 65302, 492174, 374144, 374417, 190292, 605797, 457683, 385071, 235494, 87930, 135380, 351007, 383161, 495115, 9763, 426493, 269012, 549573, 361524, 20429, 356798, 476585, 434681, 402267, 125575, 295367, 532901, 67409, 533486, 91793, 300517, 304088, 467531, 480541, 252522, 277223, 440786, 540117, 326722, 231520, 711945, 462970, 471394, 635215, 917727, 245668, 429471, 407181, 577226, 527293, 427359, 417892, 386053, 337158, 664568, 292123, 515288, 517328]
14783E17328j4052J10702j43846A24668J25964R3524l4278J01609N7705k5154
14773D44038K24087B44818J68268J78778j45534r4247N54460l07703M2431j01528
14763E39743j58886K66879M63025D35023L8235M5743L33809j86490j59980Q8632
14753E94972K99200C53535J85078R8958j00820k62135L95070k13466m6715J43956
14743E53461j74277M69378k98297N12819B55194L85465q0614J36264J19332l65875
14733D49766O573J14849q6935J04301k27830M71607l49073L63137K94450n26573
14723F14272L21194l57332J14421M2327j24417J6221l09210M98783C52067K43483
14713E95550J04729K50397l12186J89035k61528L9644j583L5230j6643L13200
$$ y = [517328, 503276, 613978, 470132, 124668, 250632, 344156, 309878, 411487, 469192, 444038, 668125, 244818, 413086, 591864, 446330, 352083, 906543, 598840, 641271, 539743, 380857, 647736, 1110761, 435023, 473258, 519001, 852810, 666320, 506340, 594972, 894172, 353535, 538613, 637571, 536751, 274616, 669686, 456220, 409505, 553461, 379184, 848562, 550265, 1063084, 255194, 640659, 560045, 696309, 815641, 449766, 456339, 571188, 484253, 588554, 360724, 832331, 483258, 846395, 1140845, 614272, 935466, 578134, 692555, 734882, 610465, 626686, 317476, 816259, 352067, 595550, 700279, 950676, 638490, 827525, 565997, 605641, 604058, 639288, 622645, 935845]
14703I35845k14113J36659j9201k83069K78658k92844K45962B84345M71650J74912
14693I30907J04199D68480L07830J15086j38638K51994k09558j66582J47822k77896
14683D98538L80610l41550M05901O4507o9052k43311K43410j32302K2830r9947
14673G29634K20345l02363J17895J08093q139k4982j1513K65708l32645J00506
14663H62539J86833l02020K85892k86967J73989j5738j08293R3859k36165M31891
14653A085820j9810O8795l28312N40512m90308K11239K6362m3643J44977M969
14643A200601n7877j68115J62759k97076J90225M09336k29604k01408J60719j90
14633A169370M5250l90335L26149l6822k3674O0969m7948P2473k00676N83801
$$ y = [935845, 721732, 858391, 839190, 556121, 834779, 541935, 787897, 284345, 755995, 930907, 1035106, 468480, 776310, 891396, 752758, 1004752, 795194, 628612, 776434, 498538, 879148, 537598, 943499, 1008006, 938954, 695643, 939053, 806751, 829581, 729634, 949979, 647616, 765511, 873604, 865465, 840483, 828970, 1094678, 762033, 862539, 1049372, 747352, 1033244, 746277, 920266, 904528, 796235, 890094, 653929, 1085820, 1066010, 1134805, 806493, 1347005, 856697, 1067936, 1094298, 1050655, 1195632, 1200601, 1142724, 974609, 1137368, 840292, 1030517, 1439853, 1210249, 1008841, 1169560, 1169370, 1214620, 824285, 1150434, 1113612, 1089938, 1150907, 1102959, 1175432, 974756, 1558557]
14623A558557m09189q8029Q1830j0576j34021N31801Q5442m14448L70525k62627
14613A309265N4651J66682n43405N09871j36905P9211k71892L43489k78318K19546
14603A452195j35411J30743k67504P4038J39002p8345K54343j5902k32323L6170
14593A357006K21057Q4646O487j61163J0951M4891K81420j11277k98766K30715
14583A665967k5024j86139J10781J16132k55793N6131L75626j67090j29892J73223
14573A733922L10262j47004p7393K36958l20866L06260P9449m1393O3377j63599
14563A979973M3662L41200K7370J19352k60048K35015K42327M8710k1338M98538
14553C254761L30594J09519O58524Q68286K229063M065994R012115J2809086j030171
$$ y = [1558557, 1149368, 1061339, 1143169, 1132593, 998572, 1530373, 1615815, 1201367, 1571892, 1309265, 1363916, 1530598, 987193, 1497064, 1360159, 1439370, 1167478, 1510967, 1232649, 1452195, 1316784, 1447527, 1180023, 1254061, 1393063, 1314718, 1569061, 1553159, 1320836, 1357006, 1578063, 1662709, 1669196, 1508033, 1518984, 1563875, 1845295, 1734018, 1435252, 1665967, 1640943, 1454804, 1565585, 1681717, 1425924, 1482055, 1857681, 1690591, 1560699, 1733922, 2044184, 1897180, 1819787, 2056745, 1735879, 2042139, 2121588, 2080195, 2143572, 1979973, 2023635, 2364835, 2392205, 2511557, 2251509, 2486524, 2728851, 2777561, 2756223, 3254761, 3585355, 3694874, 4353398, 5221684, 7450747, 11516741, 20528856, 33337942, 32307771]
14544C2307771j2543860r681767m799752j987390q41639o53522K39521k7162k3374
14535A988826k46923O1857n0770j65938M32433L01546l88453k3828j42901O24693
14525B390542l85525l9957J98645Q0644j31029j20513N39056m44652K26439J18486
14515B432136j49413L62028k53436J57460K05313l25849p2627M22485q8237N5315
14505B745175l7498j74322J40804P9110p9876N8906o3447r4768M53786k70724
14495B757146J3422J44451j25503J40961K51073L7789j80119J23692J32763Q0769
14485C376444l28786K81882r3878O8267j13195J68594K56624j19888J57725Q3711
14475C737500l15364J26051L79057k39058J86854j18394J06745k5291q3653M13769
$$ y = [32307771, 19763911, 10082144, 5282392, 3295002, 2453363, 1799841, 2039362, 2012200, 1988826, 1741903, 1803760, 1752990, 1587052, 2019485, 2321031, 1932578, 1908750, 1765849, 2390542, 2005017, 1965060, 2163705, 2244349, 2113320, 1992807, 2531863, 2087211, 2313650, 2432136, 2282723, 2644751, 2391315, 2548775, 2754088, 2428239, 2355612, 2778097, 2689860, 2745175, 2707677, 2533355, 2674159, 2753269, 2673393, 2732299, 2668852, 2574084, 3027870, 2757146, 2770568, 2915019, 2789516, 2930477, 3181550, 3219339, 3039220, 3162912, 3295675, 3376444, 3047658, 3329540, 3235662, 3303929, 3190734, 3359328, 3615952, 3496064, 3653789, 3737500, 3422136, 3548187, 3927244, 3688186, 3875040, 3756646, 3863391, 3838100, 3754447, 4168216]
14465D168216K19718k76429j72545J59875K67395j5715O1574j76750M26887k01397
14455D460829J07251K59181l38471K76309J30394J25218j71848N89296l48826
14446E089333J489J80005j61228j08003k6857J84466J98647J88627j4389k59871
14436E272219J9348M60049j35827K18087J60767K02187k52856L99292k19716J7360
14426F140910K84272L14930j4154j80800L67934o1161J43319p7764L53662K34388
14416G505536j59880L14098K8249J17977O7701k5334L36138k8691L53113m18076
14406H090831O06715M7281J10915K57113l41276N41625L65249j50445j65066M38502
14396I801444L8416K81708L78787m10799N99626n153N29256M1878L49171P579
$$ y = [4168216, 4387934, 4111505, 3938960, 4098835, 4366230, 4350515, 4412089, 4235339, 4662226, 4460829, 4568080, 4827261, 4488790, 4765099, 4895493, 5020711, 4848863, 5438159, 5089333, 5090822, 5270827, 5109599, 5001596, 4974739, 5159205, 5357852, 5546479, 5532090, 5272219, 5291567, 5751616, 5615789, 5833876, 5994643, 6196830, 5943974, 6343266, 6123550, 6140910, 6425182, 6740112, 6725958, 6545158, 6913092, 6851931, 6995250, 6917486, 7271148, 7505536, 7345656, 7659754, 7688003, 7805980, 7873681, 7848347, 8184485, 8155794, 8508907, 8090831, 8697546, 8744827, 8855742, 9112855, 8771579, 9313204, 9678453, 9528008, 9362942, 9801444, 9839860, 10121568, 10500355, 10089556, 10689182, 10684029, 11213285, 11255163, 11604334, 11611913]
14386A1611913K83986K77105L24242j07598K76429L78776L059N07732N06175j06855
14376A3954964L66938K20898J5559N19957L20109L27461J58532M66282K57961
14367A6608661N62867K45566M57645L46978P4832P50627N30654R5119Q00986M05606
14357B0879541K15529O29848O47132K37852O06218P16796L22531L76507J033181
14348B5665135M74777P24900N82150M41529Q56317Q16811O19167J197887L19425
14339C1698098J243897Q64274M16715J550530J012391J042342J136037J193366
14331D0157650J302775J316452J176883J326156J300740J754003J682942J595208
14323E1612809J564716J911210J980050K129823J929173K399862K207509K526520
$$ y = [11611913, 11895899, 12173004, 12497246, 12389648, 12666077, 13044853, 13047912, 13555644, 14061819, 13954964, 14321902, 14542800, 14558359, 15078316, 15398425, 15725886, 15884418, 16350700, 16608661, 17171528, 17417094, 17874739, 18221717, 18296549, 19047176, 19577830, 19672949, 20473935, 20879541, 21095070, 21724918, 22372050, 22609902, 23216120, 23932916, 24255447, 24631954, 25665135, 26139912, 26864812, 27446962, 27888491, 28744808, 29561619, 30180786, 31378673, 31698098, 32941995, 33806269, 34222984, 35773514, 36785905, 37828247, 38964284, 40157650, 41460425, 42776877, 43953760, 45279916, 46580656, 48334659, 50017601, 51612809, 53177525, 55088735, 57068785, 59198608, 61127781, 63527643, 65735152, 68261672]
14315F8261672K769429K759530L074085L114035L136536L299110L686856L940851
14307I4042104M226046M319394M134267N458448M668770N933543N642262O134198
14299A34559032O773021P133307P289409P652372Q543542Q765525R622707R644309
14291A99983224J0524657J1040340J1591417J2021230J2646764J3157102J3513887
14284B84478621J3918237J3806096J4182590J4047694J3950274J3142860J2426070
14277C79952442J1986417J0541490R501368P187909L895586m41545j668809l377978
14269D17576880j156960l950951k674658m081902p918701r135893j0497152j2154810
14261C66005853j3038937j3859973j3917906j4860394j4196775j4167786j3372736
$$ y = [68261672, 71031101, 73790631, 76864716, 79978751, 83115287, 86414397, 90101253, 94042104, 98268150, 102587544, 106721811, 112180259, 116849029, 122782572, 128424834, 134559032, 141332053, 148465360, 155754769, 163407141, 171950683, 180716208, 190338915, 199983224, 210507881, 221548221, 233139638, 245160868, 257807632, 270964734, 284478621, 298396858, 312202954, 326385544, 340433238, 354383512, 367526372, 379952442, 391938859, 402480349, 411981717, 419169626, 423065212, 422623667, 420954858, 417576880, 416419920, 412468969, 409794311, 405712409, 397793708, 388657815, 378160663, 366005853, 352966916, 339106943, 325189037, 310328643, 296131868, 281964082, 268591346]
14254B68591346j3263664j2453477j2365041j1170678j1105503j0297188r612841
14247A88322954r334790q733299p927055p548555p481116o933031o714531n818923
14239A27831654n673931n175689n054334m747779m939235m315959l936354l637367
14231I0351006l397775l458711l248769l302090k421230l132826k828530k408095
14223F6152980k427413k276589k249746k017581j641999k305127j228666j693879
14215E0311980k144713j156609j082657j542206j198690j559830j223978j064973
14207C9338324p92121o93157j706041o05372j528890o98833p72862j075165o21080
14198C0844803p19196j043446n37855r22185o52327m10024p43868n84832n27514
$$ y = [268591346, 255327682, 242874205, 230509164, 219338486, 208232983, 197935795, 188322954, 178988164, 170254865, 162327810, 154779255, 147298139, 140365108, 133650577, 127831654, 122157723, 116982034, 111927700, 107179921, 102240686, 97924727, 93988373, 90351006, 86953231, 83494520, 80245751, 76943661, 74522431, 71389605, 68561075, 66152980, 63725567, 61448978, 59199232, 57181651, 55539652, 53234525, 52005859, 50311980, 48167267, 47010658, 45928001, 44385795, 43187105, 41627275, 40403297, 39338324, 38546203, 37853046, 36147005, 35541633, 34012743, 33313910, 32541048, 31465883, 30844803, 30125607, 29082161, 28544306, 27622121, 26969794, 26559770, 25815902, 25231070, 24703556]
14189B4703556l85322r73531n53852o57946m94390j55675p00993j00506r05471
14180A9775870k34873l47018k74909o20903m43343k80647k93776m53673l71402
14171A6455326j82990l71712l26775k58166k07361k54707j01587n94327q4008
14162A4073693k04211l88445J66107l62578l22345m67649n936m56569l66855K17728
14152A1882940k38133n2049m91347k12041K78221j72944p01267J04101n06563
14143I890918M38397p27062k4445R8884j18316k31239N186o05104O9549j65372
14133H631396J08590o66393O31084m83071K5361l29191o1593J42754k00017k70820
14123G528100L4396j82584l37766J9257M28712m96357M050k21132l4756j74310
$$ y = [24703556, 24318234, 23344703, 22790851, 22132905, 21638515, 21482840, 20781847, 20681341, 19775870, 19540997, 19193979, 18919070, 18298167, 17854824, 17574177, 17280401, 16826728, 16455326, 16272336, 15900624, 15573849, 15315683, 15108322, 14853615, 14752028, 14157701, 14073693, 13869482, 13481037, 13647144, 13284566, 12962221, 12494572, 12488636, 12032067, 11665212, 11882940, 11644807, 11592758, 11101411, 10889370, 11167591, 10994647, 10293380, 10397481, 9890918, 10329315, 9602253, 9577808, 9676692, 9558376, 9327137, 9332323, 8727219, 8796768, 8631396, 8739986, 8073593, 8704677, 8221606, 8246967, 7917776, 7856183, 7998937, 7798920, 7528100, 7562496, 7379912, 7042146, 7061403, 7490115, 6993758, 6997808, 6776676, 6741920, 6567610]
14113F567610L31295j45671n84693J13452j98462q6870N4882m338J60587o56919
14103E550873L92858l34159o9590J93838m35585K86031J904k97879J14247N6814
14093E459352n48476n3305L0555K65735l18643j75153J8789r7410J1508K53422
14083D846374r2077k61360n3489K56672l3728k94675k4763J41870l12433K60294
14073D432685l70604p7646J21625K56248m76756j98419j978J79818p2488k66875
14063C525610O25754m78202L53822m36641L61748j76645j82831j90590K40994
14054C643019M2085K4232k81809J57411k45082r8651P7998J764k19091N4596l6214
14043C120258K89810m6321k34055l1207Q6360n6851P908k35630p1831R8145l27595
$$ y = [6567610, 6898905, 6753234, 6168541, 6281993, 6083531, 5996661, 6051543, 6047205, 6207792, 5550873, 5943731, 5609572, 5539982, 5733820, 5298235, 5584266, 5586170, 5288291, 5402538, 5459352, 4910876, 4857571, 4888126, 5153861, 4835218, 4660065, 4678854, 4581444, 4592952, 4846374, 4754297, 4492937, 4439448, 4696120, 4662392, 4367717, 4342954, 4484824, 4172391, 4432685, 4062081, 3984435, 4106060, 4362308, 3885552, 3687133, 3685155, 3864973, 3792485, 3525610, 4151364, 3673162, 4026984, 3590343, 3952091, 3775446, 3592615, 3402025, 3643019, 3685104, 3709336, 3427527, 3584938, 3339856, 3241205, 3319203, 3320967, 3101876, 3156472, 3120258, 3410068, 3363747, 3129692, 3098485, 3184845, 3127994, 3135902, 2900272, 2828441, 2926586, 2598991]
14032B598991o6860K01539l9489q519K76929m34039K54887k49045N04621p09545
14022B329470r8654K88519k85305j24845L26375K7965n5946j29631n1337M92385
14012B718996m30207J93921j64675p2869R3505j90992K41620j70382j88008k82922
14002A747987L65524k94570M29527k61052j78001k5804L1447J17346J18004q2977
13992A967431P8851K26503M68653R16754L447714P714483J4753558M155659r858797
13983B3870809r113262n826232k967683j278827p26877n72527j90888k49826N9474
13974C004161l21781K85238l43082K1189j79074m32007L32068k25698q4846K348
13964B058516J73690M2813k66162K62085l93394R2025r0284R63m0154p3841L6962
$$ y = [2598991, 2532131, 2733670, 2694181, 2685662, 2962591, 2528552, 2783439, 2534394, 3039015, 2329470, 2230816, 2519335, 2234030, 2109185, 2435560, 2463525, 2407579, 2277948, 2226611, 2718996, 2288789, 2482710, 2318035, 2245166, 2338671, 2147679, 2389299, 2218917, 2030909, 1747987, 2113511, 1818941, 2248468, 1987416, 1809415, 1783611, 1815058, 1932404, 2050408, 1967431, 2046282, 2272785, 2741438, 3658192, 7105906, 14820389, 29573947, 33729606, 23870809, 14757547, 8931315, 5963632, 4684805, 3957928, 3385401, 3194513, 2944687, 3004161, 2682380, 2967618, 2624536, 2645725, 2466651, 2034644, 2366712, 2141014, 2056168, 2058516, 2232206, 2275019, 2008857, 2270942, 1877548, 1969573, 1879289, 1880252, 1840098, 1766257, 1803219]
13953A803219K5521j23834M42654m58997n025J61519r6397J78256K13174k46415
13943A893675k30941P8627k44460K13096J52365k76098l9582M90838m90682J57528
13933A704366l73829L46679m6550j27634L2963p2262R5709M91498o90012K55459
13923A616387k07786R9927O8294k90269Q9310j51929K19955L71487o32309j0215
13913A172852J13907J87589j07095k96617L53495k9678q8959j43350J03423K7738
13903A293305q1307J22447P019L73194n01536J40013L0864j80397M1313q0586
13893A164329j97963L02178n15961O55189m23723L53873k83158J13519O600J54761
13883A329644p7221k49273J45960j85850l7534Q3730K41410k48885P3403p1547
$$ y = [1803219, 1828740, 1704906, 2147560, 1688563, 1683538, 1845057, 1748660, 1926916, 2140090, 1893675, 1662734, 1741361, 1496901, 1709997, 1862362, 1586264, 1546682, 2037520, 1546838, 1704366, 1330537, 1677216, 1630666, 1503032, 1535995, 1463733, 1559442, 2050940, 1360928, 1616387, 1408601, 1508528, 1576822, 1286553, 1375863, 1223934, 1443889, 1815376, 1183067, 1172852, 1286759, 1474348, 1367253, 1070636, 1424131, 1394453, 1305494, 1162144, 1265567, 1293305, 1211998, 1334445, 1341464, 1714658, 1213122, 1353135, 1383999, 1203602, 1244915, 1164329, 966366, 1268544, 752583, 1407772, 984049, 1337922, 1054764, 1168283, 1174883, 1329644, 1252423, 1003150, 1149110, 963260, 925726, 1009456, 1250866, 1001981, 1075384, 1003837]
13873A003837k4987N31486k8131n11918r4560L30191R0645k66185J03764m99350
13863F34792O31821j01178j96682K34365m7479j79583p4139R1611J26779p1312
13853A048995J22331k17292O8439N999j50946J27280k6281K46138E73045J86037
13843G59082L47318l23039K68516O2143m24406K89024k0164k85857M9295K16362
13833I38274k99201J48170K80196L8307k54203l71489K82281M40297n47295K60273
13823I15610n6058L14505l19481J08844l40264M76885E28364M28330m33409K09262
13813G32547L97914l33405R5066l54551L7593J19261j33189J1504J56716R0934
13803H20390k879j82714K00897N2883J73645n12491N1547j25778K33642r8537
$$ y = [1003837, 978850, 1510336, 1482205, 970287, 875727, 1205918, 1296563, 1030378, 1134142, 634792, 1266613, 1165435, 968753, 1203118, 1155639, 976056, 901917, 993528, 1120307, 1048995, 1171326, 954034, 1022473, 1028472, 877526, 1004806, 978525, 1224663, 573045, 759082, 1106400, 783361, 1051877, 1114020, 689614, 978638, 958474, 672617, 721912, 938274, 639073, 787243, 1067439, 1105746, 851543, 480054, 762335, 1202632, 655337, 915610, 859552, 1174057, 854576, 963420, 623156, 1100041, 528364, 956694, 523285, 732547, 1130461, 797056, 892122, 537571, 575164, 694425, 561236, 572740, 729456, 820390, 817511, 634797, 835694, 888577, 1062222, 549731, 601278, 475500, 709142, 610605]
13793F10605J59832M5931O2679j12733j86031J45862J78012l05494q6252L75199
13783H87610K18891k72092j73453j03732J32599R849L37907D99304N08514m61698
13773E46120p5537J67720q1326K18850k81176M83232D85022j3045K16778J18623
13763H07378K5632j42265k99073L54887J00837j06435k02516J86841M1170o9519
13753F96937J82421k53889p0809J47043J01578k64581K2901L78901m37030J14229
13743F17701O4193J13225l9462N8753C61501K44310R7730O1847C40344L60440
13733G00784k94265J15992A43438K80852J82586J08640k08609K86265r9377l32825
13723C60970j75031M47385K67436l28080j00268B01431K06606P927L05791k03646
$$ y = [610605, 770437, 816368, 879047, 766314, 580283, 726145, 904157, 598663, 512411, 887610, 1106501, 834409, 660956, 557224, 689823, 699672, 1037579, 499304, 1007818, 546120, 470583, 638303, 556977, 775827, 494651, 977883, 485022, 471977, 688755, 807378, 833010, 690745, 391672, 746559, 847396, 740961, 538445, 725286, 766456, 696937, 879358, 625469, 554660, 701703, 803281, 538700, 561601, 940502, 503472, 617701, 681894, 795119, 755657, 814410, 361501, 605811, 703541, 765388, 340344, 700784, 406519, 522511, 143438, 424290, 606876, 715516, 506907, 793172, 693795, 360970, 185939, 633324, 900760, 572680, 472412, 201431, 408037, 415964, 721755, 518109]
13713E18109k28529K72006J212B56612J54720J75177j89512L2877K7003j09703
13703C47174o5606K29969j71822P3382J23742N891A03325M57506l922j8953k20344
13692C17612j54990P22563C60382F8641M91872P9189L8145C09555J53632l9216
13682D23971Q831J35605r1857o1180K49650k50794J38755k04259L48746k80426
13672D17042a48357D39089J43638r6633O3693D4806M70722k48270M65193k28949
13662E03502j95678r167L1196P5912K38196k02395Q0747A62694L82544J10735
13652F55973B91502J85835j07955J17279O3790J37131C09233J51495J56205j40461
13642D76472P4288j78410N5462K23925B51998K50380j84071j3909J11945k3714
$$ y = [518109, 289580, 561586, 562798, 256612, 411332, 586509, 396997, 429874, 456877, 347174, 281568, 511537, 339715, 413097, 536839, 542730, 103325, 560831, 556909, 537956, 317612, 162622, 885185, 360382, 68641, 560513, 639702, 677847, 309555, 463187, 423971, 432802, 568407, 476550, 415370, 665020, 414226, 552981, 348722, 697468, 417042, -148357, 439089, 582727, 486094, 549787, 44806, 515528, 267258, 732451, 503502, 307824, 298657, 329853, 405765, 643961, 441566, 522313, 162694, 545238, 655973, 291502, 477337, 369382, 486661, 550451, 687582, 309233, 460728, 616933, 476472, 550760, 372350, 427812, 651737, 251998, 502378, 318307, 304398, 416343, 392629]
13632C92629j87545r9799L73670J39333B88885K32057J01155j16795r5806j39572
13622B69924J26390N4625r9528N2850M44801A89542K44032p5769j43443L48242
13612E62604A52729N119J74662j29057L7073J9445J93146A36390L24917J9923
13602D81230j69116R0694j99546J47436J35957j92977K06073L0438j63023J30008
13592D97174j38598L06099B47077d5017D14353j62553j02598L9559J65731J18098
13582D72590j60327L42553B46328M19025F2740K05306P4713K88284j48995J64965
13572F47013B69560k5443J41593A67816l7174l9356i7746B96114J24108A47261
13561B99012J46178j6315j81977J02551M27778A29757k8782a03901A2359K59484
$$ y = [392629, 205084, 105285, 478955, 618288, 288885, 520942, 622097, 505302, 409496, 269924, 396314, 450939, 351411, 404261, 849062, 189542, 433574, 357805, 214362, 562604, 152729, 157848, 332510, 203453, 240526, 259971, 453117, 136390, 461307, 481230, 312114, 402808, 203262, 350698, 486655, 293678, 499751, 530189, 367166, 497174, 358576, 664675, 247077, -45017, 414353, 251800, 149202, 188761, 354492, 472590, 312263, 654816, 246328, 665353, 62740, 268046, 342759, 631043, 482048, 647013, 269560, 244117, 385710, 167816, 130642, 91286, -97746, 296114, 420222, 147261, 299012, 445190, 428875, 246898, 349449, 777227, 129757, 100975, -103901, 12359, 271843]
13551B71843m2015K25913j59737L6915J69396B44804p902B6797J58829o5685O03551
13540G23492k21652k3453o1466l4953L7387r0670H2205K39227J87731j16302M3146
13529D36007I7074L54442J00468j04630j67843o7406I9180L58523d6471C22208
13518h9983A78091J09351A19865M33969k66104K6398d8270C26191d8789F65657
13507B86228K00858k40500o4279m1919K39441p7285L55286A94779J4373r0099
13497A19053K01206R022K49626g8340C03908M5283j72434J27781Q8729A81399
13486A66807M3227K06071r4629J07869E4509K6569K5783K39657q35r3301I8284
13474C65778o3517j34703R0115K80447B6702O7185P609M7358J2415J70662j63260
$$ y = [271843, 229828, 455741, 296004, 332919, 502315, 244804, 236902, 26797, 185626, 119941, 723492, 501840, 478387, 416921, 381968, 419355, 328685, 82205, 321432, 509163, 392861, 436007, 97074, 451516, 551984, 447354, 279511, 212105, 99180, 457703, -46471, 322208, -89983, 178091, 287442, 119865, 553834, 287730, 314128, -48270, 326191, -48789, 665657, 286228, 487086, 246586, 182307, 140388, 379829, 302544, 657830, 194779, 209152, 119053, 320259, 329281, 578907, -78340, 303908, 349191, 176757, 304538, 393267, 181399, 166807, 210034, 416105, 321476, 429345, 54509, 81078, 106861, 346518, 345683, 252382, 98284, 365778, 302261, 167558, 257673, 538120, 26702, 93887, 101496, 148854, 161269, 331931, 168671]
13463A68671J08551B6121b21296A76191a48599r002E45071C4120J63401b9185
13452H7077N1598P2205J01343j03268R2242n0311m6131J41977J3669A38308N1844
13441A90152K69367J99713e6713C15396A27570n2990L08390j7895b66389B28970
13430C01019J08823c4995F0901E32L58857j16253H7912J73108J61523h2821E46584
13418A61870J45897o5587A05338m2664L7357h8289B99103m8257r9202L751K61358
13407D16753A92579E8627A8456J06270l2752k6049J78914A03222L15294f8767
13396A70342a75502D9214a05965A53347K7974J9360l3183c0524k530C04978q3414
13385B21564r4017J0800b5103B45193J60474n3900r0326K09598B02767j5264M9066
$$ y = [168671, 277222, 26121, -221296, 176191, -148599, -157601, 545071, 34120, 197521, -29185, 87077, 138675, 210880, 312223, 208955, 301197, 250886, 204755, 346732, 360401, 138308, 190152, 459519, 659232, -56713, 315396, 127570, 74580, 382970, 365075, -266389, 228970, 301019, 409842, -34995, 60901, 532, 359389, 243136, 87912, 261020, 422543, -82821, 546584, 161870, 307767, 242180, 105338, 62674, 100031, -88289, 299103, 250846, 151644, 155395, 416753, 192579, 58627, 18456, 124726, 91974, 65925, 244839, 103222, 418516, -68767, 170342, -175502, 49214, -105965, 153347, 181321, 200681, 167498, -30524, -33054, 304978, 221564, 127547, 138347, -25103, 245193, 405667, 351767, 261441, 471039, 202767, 187503, 236569]
13374B36569L14948D6167K20861l8862k7042K95092Q4371k52590k5220q9865r
13363B12903J25240A03098J63460b1412o37B54944o7914M3056Q5792j46799k0089
13352A48990Q2096L8472N5269j48242R3329J9592N6953c13m9491C23039g5242
13340E9204M12840l2046j22808I4219J32059J95719A16554k3273c9616C46420
13329B06404J99444A13097J37026I6559b09154A36726D360L54573k7933j16242
13319B14758m0355M1376O0420J49323D6070j5864N8846a76022A15495m6029J10122
13308A79588j7418m2880J68623I9945f0716p1151D4360L33461o4782C5265a14434
13296B43311l7865b06466e862B66531A04923m1027K68681A50059d3896C2253M20599
$$ y = [236569, 551517, 46167, 267028, 228166, 201124, 496216, 580587, 327997, 302777, 212912, 212903, 338143, 103098, 266558, -21412, -22049, 254944, 187030, 230086, 315878, 169079, 148990, 231086, 269558, 324827, 176585, 269914, 289506, 346459, -313, -49804, 323039, -75242, 59204, 472044, 439998, 317190, 94219, 226278, 421997, 116554, 93281, -39616, 346420, 206404, 405848, 113097, 250123, 96559, -209154, 136726, 4360, 358933, 331000, 214758, 174403, 215779, 276199, 425522, 46070, 30206, 89052, -176022, 115495, 69466, 179588, 162170, 119290, 287913, 99945, -60716, -131867, 44360, 377821, 313039, 35265, -114434, 243311, 205446, -206466, -5862, 266531, 104923, 63896, 332577, 150059, -43896, 32253, 452852]
13285D52852l3677j30097L70901B67858A08006k4044L8948h9605A39409E8121
13274F6845K4930J21765n2509p7986B7560K67268J0082a40862N5718B3226K3745
13263D6971O3532N00965b02816A77949p2167j9180K83338A82242a02596m1108
13253a43704A37923Q4563j1337o9781K10123a4317k18379E5056a2458p5142o3255
13242a50855A52558Q3069J13510A70012J1834J57448a04421A06414K5282B8810
13231A60513J43888a0354k1361r2339B32237i731p9315A56275g3116C81855A71435
13219B24619F6086J55629a19454C83235l5819A42983E3562L45514C4595J32871
13209A67466a81871A53250M03329A13889R6752K294M9231G7606P1921J59553J37278
$$ y = [452852, 419175, 289078, 659979, 267858, 108006, 83962, 122910, -89605, 139409, 58121, 66845, 91775, 213540, 161031, 83045, 27560, 294828, 304910, -140862, -85144, 23226, 46971, 110503, 611468, -202816, 177949, 105782, 86602, 369940, 182242, -102596, -143704, 137923, 222486, 211149, 141368, 351491, -14317, -232696, 55056, -12458, -87600, -150855, 152558, 235627, 349137, 170012, 181846, 339294, -104421, 106414, 131696, 28810, 160513, 304401, -10354, -31715, -124054, 232237, -9731, -89046, 156275, -73116, 381855, 171435, 224619, 66086, 221715, -119454, 383235, 347416, 142983, 53562, 399076, 34595, 167466, -181871, 153250, 556579, 113889, 210641, 212935, 262166, 77606, 149527, 309080, 446358]
13198D46358A66760K01439R4120A6542i4681A93030J92027a21247C31898a14016
13187b20520I6412J83250B6618J72699M64749k66638A60074J91031j22370b3493
13176e7000E1244A309d6241C57732d046p2838C36287I223L67848c23470C19694
13164C97108j92870e2906k79992d9775A78691a75420A35306b4597A09799K81648
13154C91447d1069A96979J55345B6230R153d0590J498O235C3371a98484L0431
13143a68053p325C8998a24401A30448J35884C7333K44296b9473A06988D3748a47515
13131A14701a26175J0001F1115q858J16978a00252A0776K32830a28155A35539
13120a53782j5798F5551N1357a1482I1098m05L17764i711B86913d5720p9998J0970
$$ y = [446358, 166760, 368199, 462319, 16542, -94681, 193030, 385057, -121247, 331898, -114016, -220520, 96412, 279662, 26618, 199317, 664066, 397428, 160074, 351105, 228735, -23493, -57000, 51244, 1309, -46241, 357732, -4046, -76884, 336287, 9223, 377071, -323470, 319694, 397108, 204238, -52906, -332898, -49775, 178691, -175420, 135306, -24597, 109799, 391447, -41069, 196979, 352324, 26230, 35383, -40590, -39092, -32857, 33371, -198484, -168053, -175378, 38998, -124401, 130448, 266332, 37333, 281629, -29473, 106988, 43748, -147515, 114701, -126175, -116174, 61115, 52257, 169235, -100252, 10776, 243606, -128155, 135539, -153782, -169580, 65551, 116908, -11482, 91098, 90693, 408457, -9711, 286913, -45720, -125718, -114748]
13108a14748c2192l0681C2473f5505A38996P1271b21929C54907H2768A0838K80980
13097B91818A02610R9408J3002p4090a98667h5022c4859B82744n0547b20759A08882
13085A73360j2392C260d10438A66301j3464f7850A27800J20764m7274G0651B6331
13073B52829r0756C9048g562D25764I5127c3400J2612A32234a79505B97420e3441
13061B04774b1169B89447J17620G998i4016C3692J0360K44718G6329K47651j27272
13050A96708k137a89933A42800b8961A80432L1913a37546B49893n1620c6130k28653
13039b64783C19657A55450b22404C68545E9858a06740D31302d068A69662K10417
13029C80079H787Q0669J52654K2238j12022J24444O5205b22286A63290h2940j24112
$$ y = [-114748, -32192, -62873, 32473, -65505, 138996, 210267, -221929, 354907, 82768, 10838, 291818, 102610, 202018, 215020, 140930, -198667, -85022, -34859, 282744, 232197, -220759, 108882, 173360, 160968, 3260, -410438, 166301, 152837, -67850, 127800, 248564, 201290, 70651, 26331, 252829, 162073, 39048, -7562, 425764, 95127, -33400, -20788, 132234, -179505, 297420, -53441, 204774, -21169, 289447, 407067, 7998, -94016, 33692, 44052, 288770, 76329, 323980, 196708, 194571, -189933, 142800, -28961, 180432, 212345, -137546, 249893, 198273, -36130, -264783, 319657, 155450, -222404, 368545, 59858, -106740, 431302, -4068, 169662, 380079, 8787, 89456, 242110, 264348, 152326, 276770, 341975, -222286, 163290, -82940, -207052]
13018b07052A72609l5955Q0394h9878A24704L46004j47793j12165B0025P5885
13008I5910d7743B2776L21486p0491e0635r5391G3588L64486r6826F4870h1168
12996E7695j7983b2997k87293A81176G1501a02061D52289g0885H5009J34607J72574
12985C92190h2740l7702A859L29680g7227D48034A92206j5945a96104N7554a6710
12973B74674j11422G7517J28094p3311j0200a20278G033O9785A8898c03630H507
12961A3800c56344H3455O2266c776B64074E204J59457h7972D8472h6549I331b6253
12948A74814k5337a83999A2067h3382F4033Q8792J41691j18496e2116b1367k85
12937b1652D50764b41727C34398l3401a93818A17643a32705A12040J28668A9970
$$ y = [-207052, 172609, 136654, 217048, -89878, 124704, 470708, 322915, 210750, 20025, 95910, -47743, 22776, 344262, 273771, -50635, -146026, 73588, 438074, 341248, 64870, -81168, 57695, 39712, -22997, -310290, 181176, 71501, -102061, 452289, -70885, 85009, 219616, 392190, -82740, -120442, 1859, 331539, -77227, 448034, 192206, 176261, -196104, -138550, -16710, 274674, 163252, 77517, 205611, 132300, 122100, -120278, 7033, 76818, 18898, -303630, 8507, 13800, -356344, 83455, 145721, -3776, 264074, 5204, 164661, -87972, 48472, -86549, 9331, -26253, 174814, 149477, -183999, 12067, -83382, 64033, 152825, 294516, 176020, -52116, -21367, -21652, 450764, -241727, 334398, 300997, -193818, 117643, -132705, 112040, 240708, 19970]
12926a60764A73275a08393b1479C12151h8582j16492A66021L112a54302j01774
12916b56076a4632H12b00302C2405a11159B27377o8327O3256H5021B629a6692
12904A75332l1774l8152J8643O366A5631a53669n3783R7022j67178I5876a05690
12892B4712b6076C39029q4555a05792A44288J36340o2504b77874e423l68951d4166
12880g4554j02748m7340e7612j48474J7462l5673d1831A45146O0548J31041j58956
12869A77779o9906a08278b2441B95220A20203g6498I6645i2521j39200H9708j5952
12858G3756d0345I8709g9613C3045a89077C2079a8180B7610K07163a25832d9721
12846b2980A31015O8445Q762I7687a09929N3810k2035E2845L5106O5824q848R0646
$$ y = [-160764, 173275, -108393, -21479, 312151, -88582, -205074, 166021, 169133, -154302, -256076, -14632, 812, -200302, 32405, -111159, 227377, 159050, 222306, 85021, 2629, -16692, 175332, 143558, 105406, 124049, 130415, 15631, -153669, -207452, -110430, -277608, 95876, -105690, 24712, -26076, 339029, 254474, -105792, 144288, 280628, 218124, -277874, -5423, -374374, -44166, -74554, -177302, -224642, -57612, -206086, -188624, -224297, -41831, 145146, 205694, 336735, 177779, 107873, -108278, -22441, 295220, 120203, -76498, 96645, -92521, -231721, 89708, 73756, -40345, 98709, -79613, 33045, -189077, 32079, -18180, 27610, 234773, -125832, -49721, -22980, 131015, 199460, 208222, 97687, -109929, -56119, -78154, 52845, 87951, 153775, 144927, 235573]
12834B35573c35730B51241k8763B8512M840J70175b51210C9954O47P8343b37102
12822H8745a67363O6245F0396a0188A27788K6554b82979D15607c14322a27498
12811A55862n0221l5095a90574H7464b10544B73801r9765f9186C8094j3458M9136
12800G3772a2732K586a122l53993B27270F4547b0177E7529c20785D0646N32061
12789E72707e2460B34788g7004K9309A54195m3392b59549C6268K31287I8829k3117
12778G5712c23987D1497K2480B0102J01970k2773b6151Q688C15795M8401g0001
12766B77846D4345M3289g1055a0719o0869p3307B17393J61076B8160c9132F07
12754B95679C0729a2782G2461C2795a56406J8759B18465b483B90159k6740F041
$$ y = [235573, -335730, 251241, 222478, 28512, 33352, 203527, -251210, 39954, 40601, 118944, -237102, 88745, -167363, -101118, 60396, -10188, 127788, 154342, -282979, 415607, -314322, -127498, 155862, 105641, 70546, -190574, 87464, -210544, 273801, 174036, -69186, 38094, 24636, 73772, -12732, -10146, -1122, -355115, 227270, 64547, -20177, 57529, -320785, 40646, 572707, -52460, 234788, -77004, -47695, 154195, 110803, -259549, 36268, 267555, 98829, 75712, -323987, 41497, 63977, 20102, 122072, 99299, -26151, -17463, 315795, 364196, -70001, 277846, 44345, 87634, -71055, -10719, -71588, -144895, 217393, 378469, 28160, -39132, 607, 295679, 30729, -12782, 72461, 32795, -156406, -137647, 218465, -2483, 290159, 263419, 6041]
12742C79522D8626a08195B58967r5870A9364b08979a5458k54544a23244C12672
12731C14175F9289M8351C0503a767A88079J48436A27770E1354c33682a52208H6091
12719C6619d0934C0679J5256J17957f024C67809A17189A6810b2052B54745A22469
12707B35690m8807p8337L01351F2647P4322J7991o7259a0006H5577O1972l8493
12696A09056L18881E6375f8985C6040J21L25546G9926J50469a39999H0328e2459
12684b84255E10720a20585C0250f0663B53893e6709B76341K45191d8906q6872
12674a35778d9604E0209k1113L51069j02325a18421C25771f4287A66852i0719
12663a86430P2367C62804F2278a28215B41199a44315C75732A70154g1929o3080
$$ y = [379522, 48626, -108195, 258967, 163097, 19364, -208979, -15458, -270002, -123244, 312672, 314175, 69289, 117640, 30503, -1767, 188079, 336515, 127770, 51354, -333682, -152208, 86091, 36619, -40934, 30679, 45935, 163892, -6024, 367809, 117189, 16810, -22052, 254745, 122469, 235690, 186883, 108546, 409897, 62647, 136969, 154960, 87701, -10006, 85577, 147549, 109056, 427937, 56375, -68985, 36040, 36161, 361707, 79926, 230395, -139999, 80328, -52459, -284255, 510720, -120585, 30250, -60663, 253893, -56709, 276341, 521532, -48906, -135778, -49604, 50209, 29096, 380165, 277840, -118421, 325771, -64287, 166852, -90719, -186430, -114063, 362804, 62278, -128215, 241199, -144315, 375732, 170154, -71929, -135009]
12653a35009A33364J35045j15556n208a25267B21089H9510a95779J8721A55747
12642D13321b05477a02471k65754D5201a8072D02502f6193a8741E4556O0266J94625
12631C09447r3650J07603A27028n4637N4315N45390B39892l9150k9520P3325J02023
12620C46570A15951N8803C4336R3170r412a2087C29811a76640G3857L8169g7717
12608D15086a45790A93813p0571J7549B4037J06404L8668N9163J7131J1037A095
12596e6022p556D48978A57661J83053a56473a2575A50810E6452n147J33628Q3953
12585B68886a96921h7642A13830A5865b10450d4042l33267A82153a06123A55719
12574B47026i4168I1609J29355k2137J3368A6756J78519J01592a29647M6935F8133
$$ y = [-135009, 133364, 268409, 152853, 147645, -125267, 221089, 89510, -195779, -177058, 155747, 413321, -205477, -102471, -368225, 45201, -18072, 402502, -66193, -18741, 54556, 114822, 309447, 215797, 323400, 127028, 72391, 126706, 672096, 239892, 200742, 171222, 244547, 346570, 115951, 174754, 34336, 127506, 118094, -12087, 329811, -176640, 73857, 112026, -77717, 415086, -145790, 193813, 123242, 140791, 24037, 130441, 169109, 228272, 245403, 256440, 1095, -56022, -63578, 448978, 157661, 340714, -156473, -12575, 150810, 56452, 51305, 184933, 268886, -196921, -87642, 113830, 15865, -210450, -44042, -377309, 182153, -106123, 155719, 247026, -94168, 91609, 220964, 198827, 212195, 16756, 195275, 296867, -129647, -82712, 68133]
12562c27578g5508J734B88349F4971e4277C2245J88845c2487I1264e6496j4200
12551g0696B3433a04152j86770d2212j17113A1783a38408A7822K73014i2239j75197
12540b67436g1806j42017f4483A20199E3695c04326A30352b21322j50385a73025
12529a15011e6206A70348L6195b13760B52308Q444o259a38480H0094M2520e7036
12517B2397N22136A77520l2797b66207A06419d310C676K9102L62488A3593a67676
12505A15102c8748A50155c7148A52033c10376f7149G4505c483l366k56650B65245
12493C83074e3453F1015P8601a7856F7787a02845p1187B66908B4245n702K1513
12482D0056J39836b32542d9357k1733c4540j74792B21932f8229B58890a54112
$$ y = [-327578, -75508, -73774, 288349, 64971, -54277, 32245, 221090, -32487, 91264, -56496, -70696, 23433, -104152, -290922, -42212, -159325, 11783, -138408, 17822, 290836, -92239, -267436, -71806, -213823, -64483, 120199, 53695, -304326, 130352, -221322, -371707, -173025, -115011, -56206, 170348, 206543, -213760, 252308, 260752, 254493, -138480, 80094, 122614, -57036, 22397, 544533, 177520, 144723, -266207, 106419, -4310, 3676, 32778, 395266, 13593, -167676, 115102, -38748, 150155, -37148, 152033, -310376, -67149, 74505, -3483, -6849, -263499, 265245, 383074, -53453, 61015, 139616, -17856, 67787, -102845, -174032, 266908, 24245, 18543, 40056, 179892, -232542, -49357, -71090, -34540, -209332, 221932, -68229, 258890, -154112]
12471b42393f1146K3350A24305J86840D5597D468i4301j25092R4004j31140B5105
12459I9851e693B06557b52365G5977N5094f19k11615F9555b64337Q7345d9150
12447e7137F5374j8524G682a3995B65707e5891N508k26103B92115A01480g8290
12435b40487a15772D951a0201A14225c00913a42985B32363N2165a8881A06837
12424E194a9212k83200a05384L6539k9542A79840p6772b1428J121j5323k840k63582
12412c02052a6045A6314C568J30171c71128J52799A70758i7755p8062P2076B6285
12400C9593a96452j005d2944C05943A34486E1488d9310A11469K67662i7396E2481
12388g4441A34230J56400A22469f4160n0219j52124C7723K49120D0266a56387
$$ y = [-242393, -61146, -37796, 124305, 311145, 45597, 4468, -94301, -219393, -125389, -256529, 25105, 99851, -5693, 206557, -252365, 75977, 131071, -619, -212234, 69555, -264337, -176992, -49150, -57137, 65374, 46850, 7682, -13995, 265707, -55891, -50383, -276486, 292115, 101480, -78290, -240487, -115772, 4951, -10201, 114225, -300913, -142985, 232363, 284528, -18881, 106837, 5194, -19212, -302412, -105384, -68845, -98387, 179840, 103068, -21428, -20307, -35630, -38470, -302052, -16045, 16314, 3568, 133739, -371128, -218329, 170758, -97755, -175817, -103741, 26285, 39593, -196452, -197457, -42944, 305943, 134486, 51488, -49310, 111469, 379131, -97396, 52481, -74441, 134230, 290630, 122469, -64160, -114379, -266503, 37723, 286843, 40266, -156387]
12377e6182A67906J12189c8082H7907K71862B6566e9813p8706j20317a6622l18018
12366c34640A3826a83333D204M5287A3115b1570A91239o9455b72200A18691a91699
12354a10011K45C8878f9968G5897a15735c8590A70720a03478E0513g9133D9660
12342I4782k6730I637a12151F3470j4055L1609b43959O19F0583b67409C11966
12330a78131E1572i5353K7766k0488A75725P6940n4755J19235A15475c3035k94185
12319c27220G0853b55121C04242c00393H3548a87000B48594c5968r9429E1966
12308C3256K304E360a30850M842L5051C8451j506R6031K45909A77908a21652j56188
12296b77840g0338L0535m222A47602d1520q6984C86223F4717K37269J3174N0002
$$ y = [-56182, 167906, 280095, -38082, 87907, 359769, 26566, -59813, -138519, -258836, -16622, -334640, 13826, -183333, 4204, 49491, 13115, -21570, 191239, 121784, -272200, 118691, -191699, -110011, -109766, 38878, -69968, 75897, -115735, -38590, 170720, -103478, 50513, -79133, 49660, 94782, 68052, 9637, -112151, 63470, 49415, 81024, -243959, -243340, 60583, -267409, 311966, -178131, 51572, -95353, -67587, -88075, 175725, 252665, 197910, 317145, 115475, -33035, -327220, 70853, -255121, 304242, -300393, 83548, -187000, 248594, -35968, -135397, 51966, 33256, 35560, 5360, -130850, -126008, -90957, 38451, 36945, 132976, 378885, 177908, -121652, -277840, -70338, -39803, -44025, 147602, -41520, -128504, 386223, 64717, 301986, 315160, 365162]
12285C65162B1169Q3421J87244a44225a9542A06318J31353d1887A377J95357j5000
12274A81734b6923I6839D6634c5077A36447J09775o4074a40139j8428G228J01560
12263A08788M1512b8421A42107i3274C5208c2305j01198N1214G6101l262L0507
12252A03346n0447J27264G0704M03619c10314e0493A51168c31922C6157P0859
12242A07016g7428B44769K397G6820d2941p989B04681b19343A66825g8263B64835
12230B72038B8214L90245j18660i2092n3911j25668B36316C0105J77679n5435
12220A52349J65397j47636d0726C01487j17851n0014C9026a20355B52687A16127
12209C13919R5292j79416g8930D8851K2725L2340K96352A30678a23669A4633C469
$$ y = [365162, 21169, 104590, 291834, -144225, -19542, 106318, 237671, -41887, 1377, 196734, 181734, -26923, 96839, 46634, -35077, 136447, 246222, 182148, -140139, -158567, 7228, 108788, 150300, -28421, 142107, -93274, 35208, -32305, -133503, -82289, 76101, 72839, 103346, 52899, 180163, 70704, 474323, -310314, -50493, 151168, -331922, 36157, 107016, -77428, 244769, 247166, 76820, -42941, -50930, 204681, -219343, 166825, -78263, 264835, 272038, 28214, 418459, 299799, -92092, -146003, -271671, 236316, 30105, 207784, 152349, 317746, 170110, -40726, 301487, 183636, 133622, 39026, -120355, 252687, 116127, 313919, 409211, 229795, -78930, 48851, 71576, 103916, 400268, 130678, -123669, 14633, 3469]
12197a7950A08679j5361J76087j22294b5261A49551N3551I4117R4377f8012k21095
12186b89107A57651L59479F4008K39443A16292J07005R5524k0246G2223L60837
12176D33060k08655F5593K22738j41193J69938F7510A1748b24127B89387j25196
12166A64191B120J98349a53083I2446L05272b14878B553O7176J60040J4279j13583
12155A30465J23635j14577e9611A15053b83785A81540l5014a27120A2755b79071
12144b34962M9459i1994B3623f4756A82230a8660k33428C05053h1061H2665R4423
12133A77088b06930k6521A80113o941a92142c9547H798K76207D357a97717B55440
12121e375k73948A05956m5323a59186B82193q2603C170f3342F2680c13329C0306
$$ y = [-17950, 108679, 93318, 269405, 147111, -25261, 149551, 203102, 94117, 188494, -68012, -289107, 157651, 517130, 64008, 303451, 116292, 223297, 318821, 298575, 72223, 433060, 224405, 65593, 288331, 147138, 317076, 67510, 11748, -224127, 289387, 164191, 2120, 200469, -153083, 92446, 397718, -214878, 2553, 69729, 229769, 244048, 130465, 254100, 139523, -59611, 115053, -283785, 181540, 146526, -127120, 12755, -279071, -234962, -185503, -91994, 23623, -64756, 182230, -18660, -252088, 305053, -81061, 82665, 177088, -206930, -233451, 180113, 173172, -192142, -39547, 8798, 285005, 4357, -197717, 255440, -5375, -279323, 105956, 60633, -159186, 282193, 199590, 3170, -63342, 62680, -313329, 30306]
12109I7143J15159c33471C15334f4072B71967a57014K4919B04320a23951j97188
12099c21139A50278p352c01232C89058q6834A12805K96106a95474k5403I1132
12088b82074A48b89553a07928c0621A94741a10316d6721B4303K003J15766C1456
12076G1659l3248j0168b24530A96188e7833G7673J5155a68445A70565J5436L18494
12065E04495J275319G13294k468a70908A98001I7180N8022Q7539l2929N089J28490
12054C43391a38258G272M5322l761K34709D7712d1804j36732e508E0654A4334
12042B21118H6809b50860j55839f5468j45148k30555B33695a22972j0774B41787
12031b1367k63134A9200b83646A13204M6263J02493o0621C7249d8443j2954D6638
$$ y = [97143, 212302, -333471, 315334, -64072, 271967, -157014, -132095, 204320, -123951, -321139, 150278, 142926, -301232, 389058, 302224, 112805, 408911, -195474, -220877, 91132, -282074, 148, -289553, -107928, -30621, 194741, -110316, -46721, 24303, 26306, 142072, 31456, 71659, 38411, 28243, -224530, 196188, -57833, 77673, 92828, -168445, 170565, 186001, 504495, 1779814, 713294, 710826, -170908, 198001, 97180, 155202, 242741, 209812, 214901, 343391, -138258, 7272, 52594, 48833, 283542, 47712, -41804, -178536, -5508, 50654, 14334, 221118, 86809, -250860, -406699, -65468, -210616, -441171, 233695, -122972, -133746, 241787, -21367, -284501, 19200, -283646, 113204, 159467, 261960, 201339, 37249, -48443, -61397, 46638]
12019b53561I3736b9358A5804J54239E9816J05845J40517E8630R4413j5474D8493
12007c95326A34287J83705a04747k70964A2001L4323b00406B46699b3597A48005
11996g6661j53334A59451b18346E79R916a49621Q350G8414Q5035i4108a3760E7512
11983D69700A28866B0592K12696R0910k4153j10913C3171a58535K5359H1320a17500
11971a90464L3757l4294n8278B8353b3826I6299C8449Q545a10316A19773B8790
11959d7423j4912C8540i0295B47712A4275b49313C02077B6111b93954C01873b2217
11947H137d988A91102A7431a31564p2341B65268j18413a12652k28682A16579K4450
11936A41029m379M5213J6023f071A67288J16315a01126j78978B3278N7474a59519
$$ y = [-253561, 93736, -29358, 15804, 170043, 59816, 165661, 306178, 58630, 153043, 137569, 48493, -395326, 134287, 317992, -104747, -375711, 12001, 46324, -200406, 246699, -23597, 148005, -76661, -229995, 159451, -218346, 579, 10495, -149621, -141271, 78414, 163449, -94108, -13760, 57512, 469700, 128866, 20592, 233288, 324198, 300045, 189132, 33171, -158535, -133176, 81320, -117500, -190464, -156707, -191001, -249279, 28353, -23826, 96299, 38449, 46994, -110316, 119773, 28790, -47423, -62335, 38540, -90295, 247712, 14275, -249313, 302077, 26111, -293954, 301873, -22217, 8137, -4988, 191102, 17431, -131564, -203905, 265268, 146855, -112652, -341334, 116579, 141029, 136650, 181863, 197886, -6071, 167288, 283603, -101126, -280104, 23278, 80752, -159519]
11924H367P6208a14956C10309i1178j55888K3690E2429M7481J05199b02800g2512
11912B96266e4485j27709D00610F9261A3114L6455Q7812D1161i0889J892O719
11901h2278L5236G672d2526r0414j22371e9842B09290F8327c56422E2069a68807
11889a23404j76350a24257j5317L5316J3344b4720B155M8667a31199p0588G4878
11877E3456b65703A2191J01415J25885k5903a63451A09070b54286a17841A30381
11866e8995r6013A57382o0424a40741k387c4560j94224r8889J55231A94671a44657
11854A50490o7945I811b23226H1755o330J35181D3911a15776B16732g2709A69245
11842B19903p1489d9321A83404a10147k87680A35254n4808k1378f1803K4690m0466
$$ y = [8367, 84575, -114956, 310309, -91178, -247066, -223376, 52429, 99910, 205109, -202800, -72512, 296266, -54485, -182194, 400610, 69261, 13114, 49569, 137381, 41161, -90889, -88997, -82278, -47042, 7672, -42526, -132940, -255311, -59842, 209290, 68327, -356422, 52069, -168807, -123404, -299754, -124257, -139574, -104258, -90914, -24720, 2155, 50822, -131199, -201787, 74878, 53456, -265703, 12191, 113606, 239491, 213588, -163451, 109070, -254286, -117841, 130381, -58995, -155008, 157382, 96958, -140741, -143128, -34560, -228784, -327673, -172442, 194671, -144657, 150490, 82545, 9811, -223226, 81755, 75425, 210606, 43911, -115776, 216732, -72709, 169245, 219903, 148414, -49321, 183404, -110147, -397827, 135254, 80446, 59068, -61803, -37113, -77579]
11831g7579G6288c52031l7553f4308A62572a65745C4264i8892E1164a82710C27085
11819H2984k8060c41104A16533A2075a4203l53932C68419A51359a76767A94778
11808E590c66527J28872A69151l7168b76278F3957B7592Q2336k3259N3153M6730
11797A86552a76477M5468k05098A86859a11691A83631d09083H6768i7152E5346
11786b61528a9970A96938G1232Q5004a42413C8789g8943j33249e2709K3550k7950
11775e7109B73188b78352K3992e3288j91097B6259a29764p4948A60412b2680m3134
11764f5814h555n2851j8181E09632h0155j30922c8486j7921m684j51560B51715
11752I3738f2851l4094B4024J88670e2236n4472c2258j94146I7192c32549b9898
$$ y = [-77579, 76288, -352031, -389584, -64308, 162572, -165745, 34264, -98892, 51164, -182710, 327085, 82984, 54924, -341104, 116533, 12075, -14203, -368135, 368419, 151359, -176767, 194778, 5590, -366527, -237655, 169151, 131983, -276278, 63957, 27592, 109928, 86669, 139822, 186552, -176477, -131009, -336107, 186859, -111691, 183631, -409083, 86768, -97152, 55346, -261528, -19970, 196938, 71232, 156236, -142413, 38789, -78943, -212192, -52709, -29159, -57109, 273188, -278352, -254360, -53288, -244385, 26259, -129764, -204712, 160412, -22680, -65814, -8555, -61406, -79587, 509632, -80155, -211077, -38486, -56407, -61091, -212651, 251715, 93738, -62851, -96945, 24024, 212694, -52236, -106708, -32258, -226404, 97192, -332549, -29898]
11740D51410b83358a23014E5180J06016E1665N8516K54398I2453B9789R3889L91117
11729E14795A35066e6448l24721B00135D7538a84710A95147o3782N295n6774l0439
11718D9447a24659c4362A85481C4603a07878E0940J84180b58873B77921l6826
11708B41095A9935a44568F6587P3295a53974A61966b78238G8738a45280B03356
11697i9131C2644g482j88497C0350N1661c52880g184k22790H4186J47049r0004
11686A41231E7069J67270a3402A28642L00356B12899J17497A0899J57952a38499
11675E9019a19731B17581H4139J01671A902a4783k47492N648j80647i2331j28856
11664b21187C586M5772J32918a65200B0873J50726D8876l489K5711R2524b07250
$$ y = [451410, -283358, -123014, 55180, 161196, 51665, 110181, 364579, 92453, 29789, 123678, 514795, 135066, -56448, -381169, 200135, 47538, -184710, 195147, 131365, 136660, 79886, 49447, -124659, -34362, 185481, 34603, -107878, 50940, 235120, -258873, 277921, 241095, 19935, -144568, 66587, 139882, -153974, 161966, -278238, 78738, -145280, 203356, -99131, 32644, -7482, -195979, 30350, 82011, -352880, -7184, -229974, 84186, 231235, 141231, 57069, 224339, -13402, 128642, 428998, 212899, 330396, 10899, 168851, -138499, 59019, -119731, 217581, 84139, 185810, 1902, -14783, -262275, -256627, -437274, -92331, -221187, 3586, 49358, 182276, -165200, 20873, 171599, 48876, 45387, 71098, 163622, -207250]
11652A43235a38074B85159b37573A56917a51514A21517i9208o173A66100b78378
11641B46818h0615A80717o6529C3421g7515A12521K70657j61046r5077b91813
11630H1306J39964G082J56568J75701E1073K40410I2986B9120J04258n2523f3531
11618e7077j50974D86898b35719J01985j08221D7645L8297a21600A37311c1880
11607G9657P6583a69266A49493a49378A88204j5420f2449D90245c7036A82703
11596F5204A8762a62784A6885L04143H8324a34101f3436D1840M7607c21260B62285
11584a0422B83164k37a47108p9458g4408A9485b8652B66598A12557D2433O000
11573D8433j9096c6794N486j16812C49739A9222a76142C03042j35722p3885Q374
$$ y = [143235, -138074, 285159, -237573, 156917, -151514, 121517, -99208, -105381, 166100, -278378, 246818, -80615, 180717, 114188, 33421, -77515, 112521, 383178, 222132, 127055, -291813, 81306, 221270, 7082, 163650, 339351, 51073, 291483, 92986, 29120, 133378, 80855, -63531, -57077, -208051, 486898, -235719, -133734, -241955, 47645, 85942, -121600, 137311, -31880, 79657, 156240, -169266, 149493, -149378, 188204, 172784, -62449, 490245, -37036, 182703, 65204, 18762, -162784, 16885, 321028, 88324, -134101, -63436, 41840, 89447, -321260, 262285, -10422, 283164, 282927, -147108, -226566, -74408, 19485, -28652, 266598, 112557, 42433, 48433, 29337, -36794, -31308, -148120, 349739, 19222, -176142, 303042, 167320, 93435, 101809]
11562A01809h7920p1161D12762A00823d70844B48331I1637a40681H5530a72905
11551a93709A1444J09269a04811k36592B4145J3363J06503C3143d5122A20893
11540B8513a0791E643K17212k2800e6266F9364P1343B1151K56343M0788A01994
11528D4538N8531Q2762j93G5337M9389M5152J65542b901B72876H9695b56206A06685
11515A50638b73998C26205E0942b4631C26044J07669j21429F3311Q041J20146
11505A91498K40842A63692L02685c0267A45572K61734A40887B0786M75106A67425
11494B62278c9756A41695k6828K42064j04541J02523A0744J00945J48357C9635
11483C80930j32725r4511L7969J72293a94083E63460j18232A21622D5621R6940
$$ y = [101809, -87920, -159081, 412762, 100823, -470844, 248331, 91637, -140681, 85530, -172905, -193709, 11444, 120713, -104811, -341403, 24145, 37508, 144011, 33143, -45122, 120893, 28513, -10791, 5643, 222855, 200055, -56266, 69364, 140707, 21151, 277494, 318282, 101994, 44538, 103069, 185831, 185638, 75337, 124726, 169878, 335420, -2901, 272876, 89695, -256206, 106685, 150638, -273998, 326205, 50942, -24631, 326044, 433713, 312284, 63311, 71352, 191498, 432340, 163692, 466377, -30267, 145572, 407306, 140887, 20786, 495892, 167425, 262278, -39756, 141695, 114867, 356931, 252390, 354913, 10744, 111689, 260046, 39635, 380930, 248205, 153694, 191663, 363956, -194083, 563460, 445228, 121622, 45621, 142561]
11473A42561C435K38272J24321A1101J69349G813P5718A1484J801J62049C1274
11461D46321k03433J41970A27973A9955N752J73042K51843A58117E0436L21447
11451C71883a27936A06461a37469A63a98910D4991O26409A54925a41509C13903
11440i0334B40054p3069o8685C601J73467c0370j51293k2642M1552L0868I4296
11428A14218k8518B0157J47453J31565a21499H4563a07239M6342A13651e2567
11417c3902C4598j4662J72278C7559J35263b4351m07874a00706B4950N8156a18667
11405G9342b70020a33210C9580d9392k8914p7488A79313J3071i5753K1356o9081
11394a43478A62693e3477A44407b25165J01826C04385a78353A77045L470b22337
$$ y = [142561, 3435, 241707, 366028, 11101, 180450, 7813, 83531, 11484, 13285, 175334, 31274, 446321, 242888, 384858, 127973, 19955, 25707, 198749, 450592, 158117, 50436, 371883, -127936, 106461, -137469, 163, -198910, 44991, 671400, 154925, -141509, 313903, -90334, 240054, 166985, 98300, 3601, 177068, -30370, -181663, -204305, -162753, -131885, 94296, 114218, 85700, 20157, 167610, 299175, -121499, 84563, -107239, -60897, 113651, -52567, -33902, 34598, 19936, 192214, 37559, 172822, -24351, -432225, -100706, 24950, 83106, -118667, 79342, -270020, -133210, 39580, -49392, -78306, -155794, 179313, 192384, -95753, -74397, -143478, 162693, -53477, 144407, -225165, -123339, 304385, -178353, 177045, 180515, -222337]
11383A21799K4525h9701G0621J80267b10132P3125I5141A3237J33176a42971B08493
11371A65184m5620d879A8275a77941A43547a73275A54974a0628m8263C3688J25410
11360A59098J10998r1438i1178A8540f0988n381A05074J63675H1408c16979b2810
11348D9889g7438A50817c4993j59625j04485A5570J0859a01766I6603K58354a85062
11336A17166J55069F9000J40115g4553A82124c11427A13930J40383g6204g381
11325a3006l18301A24618g2523B13800N0279H1514i4672B80898a13900L5247B5033
11313A42028C717b21123A01951K25634j57911a68865f3403j95118a1089I6656
11302a12521C4698a36298e5180A38740a95622Q8539j09941A53651b19099a06610
$$ y = [121799, 146324, -89701, 70621, 250888, -210132, -137007, 95141, 13237, 146413, -142971, 208493, 165184, 119564, -4879, 18275, -177941, 143547, -173275, 154974, -10628, -58891, 33688, 159098, 270096, 178658, -91178, 18540, -60988, -66369, 105074, 268749, 81408, -316979, -22810, 49889, -77438, 150817, -34993, -194618, -299103, 15570, 26429, -101766, 96603, 354957, -185062, 117166, 272235, 69000, 209115, -74553, 182124, -311427, 113930, 254313, -76204, -7381, -13006, -331307, 124618, -72523, 213800, 264079, 81514, -94672, 280898, -113900, -78653, 25033, 142028, 3717, -221123, 101951, 327585, 169674, -168865, -63403, -258521, -11089, 96656, -112521, 34698, -136298, -55180, 138740, -195622, -107083, -217024, 153651, -219099, -106610]
11291a67448m8256O5492F5089d432k93813a18921j23966a14909b8262A83270i1846
11279a83841k1243J8597E2186a08629j07534C11263a76552O7696B52394a51051
11268a22717F9687P389L61585B06918B9694a35929b3645j35091n7353D0322a67259
11256c33210N7960A28094b67064H0148M6828j1368E7629a42862B4708h8508o4196
11245a52704j781N4575A20916k6873i4318R395j55551B3222J64600N2736A19687
11233a23773j54959F4766c2866A44239L7308i961o1482C87885A16982J27495f0178
11221A34622K6566N321b28905j6029J06607b9847k63909F1050c91952i7919j11127
11210b09046B16221a041D9738K6893b22401l76G2845M5345N3393j2344i3241J461
$$ y = [-167448, -215704, -150212, 65089, -4432, -298245, -118921, -242887, -114909, -28262, 183270, -91846, -183841, -205084, -186487, 52186, -108629, -216163, 311263, -176552, -108856, 252394, -151051, -122717, 69687, 77076, 438661, 206918, 29694, -135929, -23645, -158736, -216089, 40322, -167259, -333210, -275250, 128094, -267064, 80148, 126976, 115608, 57629, -142862, 24708, -88508, -152704, -154485, -99910, 120916, 94043, -94318, -84923, -240474, 23222, 187822, 240558, 119687, -123773, -278732, 64766, -32866, 144239, 181547, -9961, -71443, 387885, 116982, 244477, -60178, 134622, 161188, 166509, -228905, -244934, -138327, -29847, -293756, 61050, -391952, -97919, -209046, 216221, -1041, 49738, 76631, -222401, -222777, 72845, 118190, 171583, 159239, -93241, -91780]
11198i1780J4537E6488a45575B27843j13236A6324h6883k41418M4162H9580g3696
11186a20567F6463a62294C03197F1567B7006Q0400m1849g1774p7988A80222b12002
11174a32830A53640o9739f9272j04530Q3641H7743L1082a47030f8367A27640j3401
11163A14239B0409a87447b0214k46513c9066A08235A2125a4356A2122M2954K7233
11152H2309a71759F3098c01400C09396f7162C0064O5521j2796a21682o6324M2064
11141a45942f0222H1198b28845m9222C4010L6882a75945d962j78368H610J13777
11130A22387f7164H4122L32540K2993j54476A13137b0427o5979F9499M2610a15263
11118B62727r1243e933D1414e459k0186B81792D173K93306q6839q9343J41778
$$ y = [-91780, -77243, 56488, -145575, 227843, 114607, 16324, -86883, -328301, -284139, 89580, -73696, -120567, 66463, -162294, 303197, 61567, 27006, 107406, 65557, -71774, -149762, 180222, -212002, -132830, 153640, 83901, -69272, -173802, -90161, 87743, 118825, -147030, -68367, 127640, 114239, 20409, -187447, -20214, -266727, -39066, 108235, 12125, -14356, 12122, 55076, 82309, -171759, 63098, -301400, 309396, -67162, 30064, 95585, 82789, -121682, -188006, -145942, -60222, 81198, -228845, -278067, 34010, 70892, -175945, -4962, -183330, 8610, 122387, -67164, 84122, 416662, 439655, 285179, 113137, -20427, -86406, 69499, 112109, -115263, 262727, 171484, -5933, 41414, -5459, -25645, 281792, 4173, 297479, 210640, 121297, 263075]
11107B63075j19203J28943L9005n9024J18106J37028I3872L79899a23259B86826
11096C52273A27870B4384L52763C0704M10173c9363G439L41258E7031K41940A00328
11084H4637R7018J8660j1526Q3915P3834m7570j8027j11618K5831p028K2157j8201
11072A92082O8102r3423K59702k01018J07935Q8627R1562k28888J09192J93949
11062E87822k75736P3205J59306R8635J81806m12145K29380j25138j64676J10781
11052D63240R5142J07358k91643L37642M9382N2754j45261C26840M55277k68957
11042E13160J30507K9146n7464J63626K0905j90196O4951j58268K28307k2668
11032G22006l23563o960L04561J13651k06961p5445M53510m21024m3050M1721
$$ y = [263075, 143872, 272815, 311820, 252796, 370902, 507930, 93872, 473771, -123259, 286826, 352273, 127870, 24384, 377147, 30704, 440877, -39363, 7439, 348697, 57031, 298971, 100328, 84637, 181655, 200315, 188789, 272704, 346538, 298968, 280941, 169323, 195154, 188126, 210283, 192082, 260184, 166761, 426463, 225445, 333380, 422007, 513569, 284681, 393873, 587822, 312086, 385291, 544597, 643232, 825038, 412893, 642273, 517135, 352459, 463240, 558382, 665740, 374097, 711739, 761121, 813875, 668614, 326840, 782117, 513160, 643667, 672813, 615349, 778975, 799880, 609684, 674635, 516367, 744674, 722006, 398443, 391483, 696044, 809695, 602734, 527289, 980799, 559775, 516725, 558446]
11022E58446m482J05882j77546L41529A22278K27823J96973N4270J59518J15200
11012H76062k08012J81628l71173Q8035J52993P6398J27039k73758j04999n3180
11002D91033L38471j2196L2530D02950K55394K4795K53946l41989J82578q9037
10992F88637j51019K76357C62233O49889j68098O988q1699J27716L9776N7756
10982I94561J32942K42260k90617J98946M22462L50261L7794K24714M61686R5435
10972B870444j39680J89421K5802o08512J944M049n65136m28114K01612K73629
10962A825459m66028k3937K01855m00859O7909J65812j56197j57909K8239n16228
10952E68116M31661C36545K58282B49355I7806R1655J70655j58709K25585A6189
$$ y = [558446, 553964, 659846, 482300, 823829, 122278, 350101, 547074, 601344, 760862, 876062, 668050, 849678, 478505, 566540, 719533, 795931, 922970, 649212, 544213, 491033, 829504, 817308, 849838, 402950, 658344, 683139, 937085, 595096, 777674, 688637, 537618, 813975, 362233, 1012122, 844024, 851012, 769313, 897029, 936805, 994561, 1127503, 1369763, 1079146, 1278092, 1700554, 2050815, 2088609, 2313323, 2775009, 2870444, 2730764, 2920185, 2945987, 2337475, 2339419, 2343468, 1778332, 1350218, 1551830, 1825459, 1359431, 1335494, 1537349, 1136490, 1204399, 1370211, 1214014, 1056105, 1084344, 568116, 999777, 336545, 594827, 249355, 97806, 189461, 360116, 201407, 426992, 16189]
10941C82079A13699K9806k0216R8274n0701e1418A06266d744A56098g4384B27386
10929H3367J30537d9075j15183J2887A27141R637J95011F8287l671J22627r0005
10918I7238m8249a30230j30314O3208A1254h5475C08018B3023J58647a6305n4632
10907g0937A41908a62716j47331h1719K8123G3040J84609a60737A09856i3602
10896A14376K8615P9056n0064a95679i5688r0375C37299a52639E3024a60565A02305
10884h5853I0268h6278L1218A55963J02170b55985I6581J41534a24340r7916n6943
10873b79199A13313n541a22073l98607c5765o5737C14133a524B53277H6296l3814
10862E2482P7450g5318J789j32503K696O3684B2998H212K8214a87658k885A07638
$$ y = [382079, 113699, 143505, 123289, 221563, 170862, -51418, 106266, -4744, 156098, -74384, 227386, 83367, 213904, -49075, -164258, -151371, 127141, 136778, 331789, 68287, 64616, 187243, 97238, 48989, -130230, -260544, -197336, 11254, -85475, 308018, 23023, 181670, -16305, -70937, 141908, -162716, -310047, -81719, -53596, 73040, 257649, -160737, 109856, -93602, 114376, 142991, 222047, 171983, -195679, -95688, -186063, 337299, -152639, 53024, -160565, 102305, -85853, 90268, -86278, -55060, 155963, 258133, -255985, 96581, 238115, -124340, -222256, -279199, 113313, 107772, -122073, -520680, -35765, -101502, 314133, -1524, 253277, 86296, 52482, 129932, -75318, -73529, -206032, -203336, -139652, 22998, 8212, 36426, -187658, -190543, 107638]
10849B63954b3719B33919E2612J26497b44135A25333R1811f8922j79211A91424
10838a20236a7206j0020j6949E773i5073B11345I5599b05626h4768A86802a74215
10826D0493d4925m7885l02825a37101A68526E0615b52455A75476a12363i942j69118
10815a79060E0960j5116O0680d94244E7767b57092C768f734p3879k43421B55668
10803B41401b34576J00217A47577c26959F0949J09199p2709K17375A22046b57538
10792A8712i7599I4783J03212R9951H8640Q5218b71159q2516B3390J82617a74041
10780e5526j55679k38657h9102A22784a40835A68385o9408b32701D4762A67i8520
10768A49895B287J09522m7747c1926F5170a19277d5399I0274G650a61656L1642
$$ y = [263954, -23719, 233919, 52612, 179109, -244135, 125333, 217144, -68922, -248133, 191424, -120236, -17206, -27226, -44175, 5773, -95073, 211345, 95599, -205626, -84768, 186802, -174215, 40493, -44925, -92810, -395635, -137101, 168526, 50615, -252455, 175476, -112363, -9942, -179060, 50960, 35844, 96524, -494244, 57767, -257092, 3768, -6734, -80613, -324034, 255668, 241401, -234576, -134359, 147577, -326959, 60949, 170148, 97439, 314814, 122046, -257538, 18712, -97599, 94783, 197995, 297946, 88640, 173858, -271159, -353675, 23390, 206007, -174041, -55526, -211205, -449862, -89102, 122784, -140835, 168385, 98977, -232701, 44762, 167, -98520, 149895, 2287, 111809, 64062, -31926, 65170, -119277, -45399, 90274, 7650, -161656, -130014]
10757a30014j44713G5417a3269p8261A4898Q469Q211d3669D2494f5976k50555
10746c16531A59427c6675k15888q6569H9281K00519a40668j8210n2754p1427A14995
10734C7023h3260C18325c10532A25662b70910B8906b05553c9677B11710i6855
10723A5910K3165N6858b74864H4325J83140B9824L800e1147m9052m9468I4405
10711A01045A8109g0501A92251e8374A3926c57116A16310A1606a01022D8813a40433
10699B82501c49426A12089e20822H2810g2025j1725k5487K7707p9887j88942A79460
10687a30641A05257e6420m9667A79841M1483K69997C4456K134a2543j19273d5214
10675B59427b21104k4631E2145J74069f1380J1390j64064N0890r5268L8200G0608
$$ y = [-130014, -274727, 75417, -13269, -91530, 14898, 23367, 31578, -43669, 42494, -65976, -316531, 159427, -36675, -252563, -339132, 89281, 289800, -140668, -158878, -211632, -283059, 114995, 37023, -83260, 318325, -310532, 125662, -270910, 28906, -205553, -39677, 211710, -96855, 15910, 39075, 95933, -274864, 84325, 267465, 29824, 33624, -51147, -100199, -149667, 94405, 101045, 18109, -70501, 192251, -58374, 13926, -357116, 116310, 11606, -101022, 48813, -140433, 282501, -349426, 112089, -520822, 82810, -72025, -83750, -109237, -81530, -161417, -350359, 179460, -130641, 105257, -56420, -106087, 179841, 221324, 491321, 34456, 36590, -12543, -131816, -45214, 259427, -221104, -245735, 52145, 226214, -61380, -49990, -214054, -163164, -258432, -220232, 70608]
10663G7163K15322j08017K00798A56766c2034C21349a6825j47699M9804A61184
10652D1716o709a15257l4567P0357j22760a372B50345d085m3132l07190f3100
10640B4332a66188a3889n869H0279K72182c47902J29756J1111A01243K81643i878
10628D3072a80638Q2008D8741b67241a10205j16604E3219a56234j73420J43149
10618a86505a3913j8528A61266d05460A53448p6047h7715G0042K01864i2100A2743
10606I9276a02378j86788R4098m2994a06222C1338J84334E881R1010k1368n936
10595F9587b28920B3732b34867f0898j93745A60765K68666a80075A08723B7104
10584a45691j1984A9056M5384K47429F3659a25734B9885a5981r0445j6515l3290
$$ y = [77163, 292485, 184468, 385266, 156766, -32034, 321349, -16825, -164524, -114720, 161184, 41716, 35007, -115257, -149824, -79467, -202227, -1372, 250345, -4085, -47217, -354407, -63100, 24332, -166188, -13889, -19758, 80279, 352461, -347902, -218146, -207035, 101243, 382886, -9878, 43072, -180638, -98630, 48741, -267241, -110205, -226809, 53219, -156234, -329654, -186505, -13913, -32441, 161266, -405460, 153448, 77401, -87715, 70042, 271906, -92100, 12743, 99276, -102378, -289166, -195068, -238062, -106222, 31338, 215672, 5881, 96891, 75523, 69587, -228920, 23732, -234867, -60898, -254643, 160765, 429431, -180075, 108723, 27104, -145691, -157675, 19056, 64440, 311869, 63659, -125734, 29885, -15981, -106426, -122941, -156231]
10573a56231O9053j09380C6105e0986j30283A39576E159b9301A43422a68654n2546
10562b21200B50536b33221B27814E4809r908a86367m0275i8747J5244d1475A1191
10550c0648j284j09028A09867c26420a7401k98621b3903j40172B2162g5302a9074
10538H3415J14758g3046L3985A34919L8364b60787B87466G4608a77701G6938K66191
10527C43129k4949b44237d3611k30216a36418I2691a90044C6888O2438k1218f8618
10515e7863k93166E5265C862L1022a12469q4163p6775f479n7755B67744A0806
10503F7977J91203H7559a09746B23949j01126N180a42576k47744J12696J01422
10493a76202K6539C02482j12157H8522J09434J1086n724A00116L01628J16987
$$ y = [-156231, -87178, -196558, 36105, -50986, -181269, 139576, 5159, -29301, 143422, -168654, -221200, 250536, -233221, 227814, 54809, 44901, -186367, -226642, -98747, -83503, -41475, 11191, -30648, -31932, -140960, 109867, -326420, -17401, -316022, -23903, -164075, 22162, -75302, -19074, 83415, 198173, -73046, -39061, 134919, 173283, -260787, 287466, 74608, -177701, 76938, 343129, 318180, -244237, -43611, -273827, -136418, 92691, -190044, 36888, 99326, 78108, -68618, -57863, -351029, 55265, 3862, 34884, -112469, -196632, -273407, -6479, -64234, 267744, 10806, 67977, 259180, 87559, -109746, 223949, 122823, 128003, -142576, -390320, -277624, -176202, -149663, 302482, 190325, 88522, 197956, 209042, 203318, 100116, 401744, 518731]
10483E18731j20869L676k6842M6433h4613A66763G5432J26782n9229e8749B66085
10471a10859l5177j41772J34959B2965a18833j89585C5796b07994K4576F5198
10460A23713h9379D19039D6802a63535M2367j13295N6961H0097b4989k92272A72112
10448F3664c03385A37599C3345d5231q242K0420o0324R262C01514g3791G2167
10436g0157c2302l41980A82311p1200c34552A04426a07252k16617A33153O9404
10426B02557J73710j65032n5520a59729F7430c38182A31457b5791p9926o2196
10416a67913A2356b27887F3044f5342j17757d4294r0206G5202a4466r6148E2803
10404D6630M2458b80928a0371k27204A36333D8252K8955R0953a56480C66102j56396
$$ y = [518731, 397862, 401538, 374696, 421129, -84613, 166763, 75432, 202214, 142985, -58749, 266085, -110859, -146036, -287808, -152849, 22965, -118833, -308418, 35796, -207994, -183418, 65198, 123713, -89379, 419039, 46802, -163535, -121168, -234463, -177502, 80097, -24989, -317261, 172112, 63664, -303385, 137599, 33345, -45231, -53473, -33053, -93377, -84115, 301514, -73791, 72167, -70157, -32302, -374282, 182311, 111111, -334552, 104426, -107252, -323869, 133153, 202557, 376267, 211235, 155715, -159729, 67430, -338182, 131457, -25791, -105717, -167913, 12356, -227887, 63044, -65342, -183099, -44294, -134500, 75202, -14466, -110614, 52803, 46630, 89088, -280928, -10371, -237575, 136333, 48252, 77207, 168160, -156480, 366102, 209706]
10393B09706c686A80675f3424k40354H8661g2651A98322a54015B25313l0145o0465
10382A34703b3926D69098i8755A62212P9391j0828H4934M1708L81913D9655K0500
10371G0155K66127o7078K34720C6449M84657n1154j97998K31587k46159J91434
10361D48816J64995B37348A04575J80350J30710A57228a1106F9051L14473j68958
10351B14566K6965L81817k28517A41764B0533P1782K78218q0470D1828P7350J14464
10340B33642I4886d3246B27120p5951J16595K13472F9247K09501h1031a2719B98561
10328A23610k096a71294C36523b01163B63759A3318K39772E4588K58437E5567
10317C36681j19365J36164d1825C1540J59853o2126c07234C1358a37248G4720
$$ y = [209706, -3686, 180675, -63424, -303778, 88661, -72651, 198322, -154015, 225313, 195168, 134703, -23926, 469098, -98755, 162212, 241603, 230775, 84934, 126642, 508555, 49655, 70155, 336282, 269204, 503924, 36449, 521106, 469952, 271954, 503541, 257382, 448816, 613811, 237348, 104575, 284925, 415635, 157228, -11106, 69051, 383524, 214566, 241531, 623348, 394831, 141764, 20533, 92315, 370533, 290063, 41828, 119178, 233642, 94886, -43246, 227120, 151169, 267764, 481236, 69247, 278748, -81031, -12719, 298561, 123610, 121514, -171294, 336523, -201163, 263759, 13318, 253090, 54588, 313025, 55567, 336681, 217316, 353480, -41825, 31540, 191393, 129267, -307234, 31358, -137248, 74720]
10306H6288a03657K1584A0898m589K02371K15545B7980L11357C6169b54587C36125
10294d1989m9996m2992J3153B5772J14190f4944I1369b34315R6425A30233b0944
10282e2839j01770k95852F5358a59675l0083G2865I299g4492H5142a88524h8507
10270C56413q6489A19608d668C1260M8625a56256B06061D2795K54499n8645K73976
10259E12625B37805F6326J15295e4755D0381R9329c8014A53027m6919K0126a45972
10247d9994j14933f0420r2991c0639C75062a24949B90050G9516a95673B97300
10236a98667p4241e3821A36270K18711a62203k98116B71745A32492a78390b801
10225a15462M9098B55451a49914n4035a6779A48759b59045B0980P9659M7549p3111
$$ y = [86288, -103657, -82073, 10898, 6309, 208680, 424225, 27980, 339337, 36169, -254587, 336125, -41989, -91985, -134977, -121824, 25772, 139962, -64944, 91369, -234315, -137890, 130233, -20944, -52839, -154609, -450461, 65358, -159675, -189758, 72865, 9299, -74492, 85142, -188524, -88507, 356413, 269924, 119608, -4668, 31260, 79885, -156256, 206061, 42795, 297294, 238649, 512625, 237805, 66326, 181621, -54755, 40381, 139710, -38014, 153027, 106108, 126234, -145972, -49994, -164927, -60420, -153411, -30639, 375062, -124949, 290050, 79516, -195673, 297300, -198667, -272908, -53821, 136270, 354981, -162203, -460319, 271745, 132492, -178390, -2801, -115462, -66364, 255451, -149914, -203949, -16779, 148759, -259045, 20980, 100639, 148188, 75077]
10214G5077a2841j02558A65361C4058j3010a0447H048M1449a94933A83576m4580
10203A38996e9719A017K13164b10949G0128J30565f7042L1345p5122N2611j15722
10192a73930r7754B289d6672o5949K1809G7116J27243a24682E6951j5185K49682
10181B91448j14016O5399c33464o1056a67479q4159A5254d8326j6082l0649o9078
10170a64135H3913d24290c8170j61379a4603B8828e6634A89394a58763d7015j00035
10159a47050j97014B06206i9345C2093R3443K45808A2699c00296i4130l14568
10149d08698A79308P1801G374c64627H260a86497B90196a35530p505A4711g0838
10137a30224p5063g2186B22385g7549m8790d6658B423e8773C34582q0653b51903
$$ y = [75077, -12841, -115399, 165361, 34058, 21048, -10447, 8048, 49497, -194933, 183576, 138996, -59719, 1017, 214181, -210949, 70128, 200693, -67042, -35697, -110819, -58208, -173930, -271684, 2289, -46672, -112621, -90812, 77116, 204359, -124682, 56951, 41766, 291448, 177432, 242831, -333464, -394520, -167479, -251638, 15254, -48326, -64408, -95057, -164135, 83913, -424290, -38170, -199549, -14603, 28828, -56634, 189394, -158763, -47015, -147050, -344064, 206206, -99345, 32093, 125536, 371344, 12699, -300296, -94130, -408698, 179308, 251109, 7374, -364627, 8260, -186497, 290196, -135530, -143035, 14711, -70838, -130224, -205287, -72186, 222385, -77549, -126339, -46658, 2423, -58773, 334582, 253929, -251903]
10125e521B84157E9600b25864R1637b8671b194A06801a50119k46423J27838Q8093
10114a80611A56148G0071c04288C9508M2758f0359l1365F9225f0230G088P2107
10103G9195b15319D1040A009c93322J33117A06639a94744q230A64463i3697K9289
10092f4408k24497A45038a54559b2041j0960A72080j1895b34940g5382K015a7901
10080d4735A10711a26471j14954H0750a46039j55711M5588Q6488d7857j74075
10070b21932b5767A31512f2180D6999a60635A50983J42723F6587h4277j02793
10060a87070m42956f9446A60869d7323n4892n3762o5088J08166k03628E78K23393
10049B23971d7335j3091A92531d01745J22684f8617A83814a53969n8642i6896
$$ y = [-5521, 284157, 59600, -225864, -134227, -28671, -2194, 106801, -150119, -396542, -268704, -180611, 156148, 70071, -304288, 39508, 82266, -60359, -91724, 69225, -60230, 7088, 79195, -215319, 41040, 1009, -393322, -260205, 106639, -194744, -202974, 164463, -93697, -64408, -288905, 145038, -154559, -22041, -33001, 172080, 160185, -234940, -75382, -73367, -17901, -44735, 110711, -126471, -241425, 80750, -146039, -301750, -256162, -169674, -47857, -221932, -25767, 131512, -62180, 46999, -160635, 150983, 293706, 66587, -84277, -187070, -630026, -69446, 160869, -47323, -102215, -155977, -221065, -112899, -316527, 578, 223971, -47335, -60426, 192531, -401745, -279061, -68617, 183814, -153969, -212611, -96896]
10038B30624b82926j68946A69806K49356d7653k968G8706g5853F2594O8625d8284
10026b6411j41424k8386D3345a39376j0432a7856k5484M28r0481A52679i9A54071
10013a6447k56548a05910M4226E4812N5314a13549o3028G3794a97018O5602A59693
10001B1085b93178i9871M8993r2289j00918a2714n07334A797P575J34225c70476
9989d8924k51m2688M5073k8256k9420B95942b67179a31662e2624F7647c35356
9977b94526A13572n3723f5711b9549k03337A33496j3169a63001E6411J14048b72173
9965C93685c62105B1793q811a95018a035j91438D8022N4888a24335j03864a00386
9953h3899k27606m3488b9551A4308c4244A51778h7126B0940a73650Q3141k82443
$$ y = [230624, -282926, -451872, 169806, 419162, -47653, -50621, 78706, -75853, 62594, 131219, -48284, -26411, -167835, -196221, 43345, -139376, -149808, -17856, -43340, -42912, -133393, 152679, -99, 154071, -16447, -272995, -105910, -61684, 54812, 110126, -113549, -176577, 73794, -197018, -131416, 159693, 21085, -293178, -99871, -50878, -143167, -244085, -12714, -520048, 1797, 9372, 143597, -370476, -48924, -49175, -91863, -46790, -75046, -104466, 295942, -267179, -131662, -52624, 67647, -335356, -294526, 113572, 59849, -65711, -29549, -232886, 133496, 120327, -163001, 56411, 170459, -272173, 393685, -362105, 21793, 12982, -195018, -1035, -192473, 48022, 102910, -124335, -228199, -100386, -83899, -311505, -354993, -29551, 14308, -34244, 151778, -87126, 20940, -173650, -90509, -372952]
9942c72952i6391j33671B01024o0474b73672A25126a82677B22479G4409a95679
9931d3752l18205a59907M603q7205L4879N9618C9862a12894d2650G4625e5389
9919A55809b76129N6607A70584d11876L846j26770E3459b07932A42070F5481a86652
9907a74480p8288J00324C37129E413h647j29234B22734h7479A19460L4858a8630
9895F1949a22199D08440D4983j0475d50534A15795J90977a58083a4221r8526r8133
9884b10880m3611I3028b10170F0229N8889k3524B4893a39554q7934o8754A2153
9872c34130J20635D2504d63498h2115p8016d5379k7651B90137b4972m00865a89567
9860C9533J25659b9132j35335C42450a60366c3873l729l435B10834a13431a7890
$$ y = [-372952, -96391, -230062, 201024, 140550, -273672, 125126, -182677, 222479, 74409, -195679, -43752, -361957, -159907, -155304, -242509, -207630, -148012, 39862, -112894, -42650, 74625, -55389, 155809, -276129, -219522, 170584, -411876, -408030, -534800, 53459, -207932, 142070, 65481, -186652, -174480, -252768, -152444, 337129, 5413, -8647, -137881, 222734, -87479, 119460, 154318, -18630, 61949, -122199, 408440, 44983, 34508, -450534, 115795, 306772, -158083, -14221, -112747, -210880, -254491, 93028, -210170, 60229, 119118, 95594, 24893, -139554, -227488, -296242, 12153, -334130, -213495, 42504, -463498, -82115, -160131, -45379, -73030, 290137, -24972, -425837, -189567, 39533, 165192, -29132, -164467, 342450, -160366, -33873, -37602, -41037, 210834, -113431, -17890]
9848A63397e4941A32940B5489K21264M4215B763a48666B2274d3714k13452e400
9836c7890j93127A66723f0139A44564a79956H824a60313A00778a92724A15217
9825a10688o399f407k10409o5298J39392N7660I9217b13977F5280a12549r9726
9814b12275j01656B4293J15275L3298b77847A03747a43787c4436j24972L7664
9804a21744N2197D4296k0036f0238k8620A48366L7981L7979p1046o1937i1872
9792a35726A44752a61689n5368G4879a56616b9720A54450B3437D185b01315c2184
9780B0458f4511A77671a46892K3669A6013d63643B36202H0296c1857j45772q241
9769a85870J8873j56946l7597B7980b63623B7458a83936j49324N4638G0915j8680
$$ y = [163397, -54941, 132940, 25489, 246753, 290968, 2763, -148666, 22274, -43714, -257166, -5400, -37890, -231017, 166723, -60139, 144564, -179956, 8824, -160313, 100778, -192724, 115217, -110688, -117087, -6407, -216816, -282114, -142722, -85062, 99217, -213977, 65280, -112549, -212275, -313931, 24293, 139568, 172866, -277847, 103747, -143787, -34436, -159408, -121744, -69547, 44296, 24260, -60238, -88858, 148366, 186347, 224326, 153280, 91343, -91872, -135726, 144752, -161689, -217057, 74879, -156616, -29720, 154450, 23437, 4185, -201315, -32184, 20458, -64511, 177671, -146892, -123223, 16013, -463643, 236202, 80296, -31857, -177629, -185870, -166997, -323943, -361540, 27980, -263623, 27458, -183936, -333260, -278622, 70915, 52235]
9758E2235i4489D6801J3486b03155K0667f5041E7981b69849B83740I38d07296
9746f6420k45142J29941j45324G735N3998b255I6145B3087g6623n6792l887A5370
9733H5495a33123k68912H4295B641a26446A98402c9558C06127a32123n1462d8599
9721i3497a536n534H4692d35532A72271c69880i0136j44349k43452e1246k94808
9710c46054F2395e8873j58284j45457J11809L2349D360h3386j34749A68471M3826
9699B12297c04187q4800J84769F7154d5800j91091N8140B03841F1480a93392C67113
9687H2152b43976A50298D0363a69400j19098R3200B39574r2136f7233D570c6834
9675a15230l2344f2492k17559a32732j3880B80199b8914p1109E0810a79885A38168
$$ y = [52235, -94489, 46801, 60287, -203155, -182488, -65041, 57981, -269849, 283740, 938, -407296, -66420, -311562, -181621, -326945, 7735, 61733, -2255, 96145, 23087, -76623, -133415, -137302, 15370, 85495, -133123, -402035, 84295, 2641, -126446, 198402, -39558, 306127, -132123, -183585, -48599, -93497, -1536, -7070, 84692, -435532, 172271, -369880, -90136, -234485, -477937, -51246, -346054, 62395, -58873, -217157, -362614, -250805, -218456, 4360, -83386, -218135, 168471, 212297, -304187, -388987, -204218, 67154, -45800, -236891, -178751, 203841, 61480, -193392, 367113, 82152, -243976, 150298, 40363, -169400, -288498, -195298, 239574, 147438, -67233, 4570, -36834, -115230, -147574, -62492, -280051, -132732, -146612, 280199, -28914, -100023, 50810, -179885, 138168]
9663E7136a8874D15298A59443A8509b9099N338B28974a26234C5894d57151A61509
9651A42961d0235j11962B9928K46637b18765B23825m9989M7334H7173L24549H3665
9639a41794F319J3090O2657a39696A13396b26079H8615L42190c39604F2051L1301
9628I3352d8991A28223J28024o5967a66652A8551h6131A01489k6563b81120E1671
9616a70951H7149Q3616d6636A599a6669j4159k85435G4157c67897d2891A65834
9604C7246K20105E166J38025b6822q6502d252j30520b3379j94220p8884e5328
9592a31571L5036m7702A10121i3834A3151d06157J21354P4944I2150b7941r2681
9581a20622a9164j28430n4095B25107a96878A65162i9360C3593K34035f3110p2328
$$ y = [57136, -18874, 415298, 159443, 18509, -29099, -23761, 228974, -126234, 35894, -457151, 161509, 142961, -40235, -152197, 29928, 276565, -218765, 223825, 173836, 221170, 87173, 411722, 83665, -141794, 6319, 19409, 82066, -139696, 113396, -226079, 88615, 430805, -339604, 62051, 93352, -48991, 128223, 256247, 190280, -166652, 18551, -86131, 101489, 74926, -281120, 51671, -170951, 87149, 170765, -46636, 1599, -16669, -30828, -316263, 74157, -367897, -42891, 165834, 37246, 257351, 5166, 143191, -26822, -113324, -4252, -134772, -23379, -217599, -296483, -55328, -131571, -96535, -144237, 110121, -93834, 13151, -406157, -284803, -209859, 92150, -27941, -120622, -19164, -147594, -201689, 225107, -196878, 165162, -99360, 33593, 267628, -63110, -135438]
9570a35438M8127m51685a71261k67982B4918g9523k03067j9593J3446c6849B54943
9558I8121b1349k12838Q9545A39976n8689b56615R2861I199a18177b9035n5473
9547h4508A41436e34H9973h798A82096A8076N3192a36127d8761k01293F1265R072
9535G0337J79155F887Q5440M7191o2505i6442r0550D1956J58937i7306q5401N5245
9523a27462j51329I499b26577A2922a52136A66531a6776j43314j17763g4555L4595
9512c9960k02250A49877c13352b2653q6194B96424a53560C5081c02708j68950
9502d71658i6466j19856O8440O4234k13388A78859i209r3072A74410F6087J2262
9491G8349b1791k62080Q52j96018A11471J37201h0971B9164e1389O517A15394
$$ y = [-135438, -87311, -538996, -171261, -439243, 24918, -79523, -282590, -302183, -288737, -36849, 254943, 98121, -21349, -234187, -144642, 139976, 81287, -256615, -163754, 9199, -118177, -29035, -84508, 141436, -534, 89973, -8798, 182096, 18076, 71268, -136127, -48761, -250054, 61265, 70337, 249492, 6887, 92327, 139518, 77013, -96442, -186992, 41956, 200893, -97306, -182707, -127462, -278791, 9499, -226577, 12922, -152136, 166531, -16776, -160090, -277853, -74555, -39960, -242210, 149877, -313352, -22653, -108847, 296424, -153560, 35081, -302708, -471658, -96466, -216322, -147882, -83648, -297036, 178859, -9209, -102281, 174410, 66087, 78349, -21791, -283871, -283019, -479037, 111471, 248672, -80971, 29164, -51389, -44872, 115394]
9479A05328a61125i628A40150C7337a07959r7536L4820p4292H9613b12826E2169
9467A6653c25857B12094p2476E2572f8075a9737l0741j86598i1351A63438C9095
9455b2707j06946B89601A6968J0937F454a76760f2893A45337a80595j85116I6447
9443E6039P4504D0584c10034a01490k0855j3680l2815M6541E4096K80652b55547
9431f1461J3813B91143a72680j36901C5193c01000N6718A6948J87069H8797i239
9419b97689J44429l23481a65369A90002a02058K1145j12016K7108B58888f154
9408B35469C1227b92521d8644r1246e4247C16819A40544M7838c789B08345a91162
9396f0926k67633L0233a23601E1905e0181K1689r6509E7505J61261b8096C3428
$$ y = [105328, -161125, -9628, 140150, 37337, -107959, -205495, -170675, -244967, 89613, -212826, 52169, 16653, -325857, 212094, 139618, 52572, -68075, -19737, -50478, -237076, -91351, 163438, 39095, -22707, -129653, 289601, 16968, 27905, 6454, -176760, -62893, 145337, -180595, -365711, 96447, 56039, 130543, 40584, -310034, -101490, -122345, -136025, -168840, -122299, 54096, 334748, -255547, -61461, -47648, 291143, -172680, -309581, 35193, -301000, -244282, 16948, 204017, 88797, -9239, -297689, -153260, -476741, -165369, 190002, -102058, -80913, -192929, -165821, 258888, -6154, 235469, 31227, -292521, -48644, -139890, -54247, 316819, 140544, 188382, -3789, 208345, -191162, -60926, -328559, -298326, -123601, 51905, -50181, -28492, -125001, 57505, 218766, -28096, 33428]
9384A94397c55470a75266j2734b5788n0626G3025K16894c9699A05465c48214i799
9372a31147e972l0802k1146k93109a71626j30291d6066l35694R7277e6397j89645
9361b46042j8549J8495O6704L5501D0861a61862a9482D402c37720B3368b03511
9349g1692A5111a01812c5107l0136k5850j06253A69946c52014f4225A86925a34110
9337h6724H1921b8082l8280j77286B30191A576b70371J30513O2252B59209G2056
9325a99749I6597c29676A69428b33070R2040A71100c73210i6195l40999A47931
9314d3932j15931A70564e7663k05887B4487a12072g395j59410h0710B02410h5454
9302a38614A42892b12210J8528C08096a20742p3939j19784N4587H1406e1516A2071
$$ y = [194397, -355470, -175266, -188000, -25788, -76414, 73025, 289919, -39699, 105465, -348214, -9799, -131147, -5972, -36774, -57920, -351029, -171626, -301917, -46066, -381760, -284483, -56397, -246042, -264591, -246096, -179392, -143891, 40861, -161862, -19482, 4402, -337720, 23368, -203511, -71692, 15111, -101812, -35107, -65243, -91093, -197346, 169946, -352014, -64225, 186925, -134110, -86724, 81921, -28082, -66362, -243648, 230191, 1576, -270371, -139858, -77606, 259209, 72056, -199749, 96597, -329676, 169428, -233070, -141030, 171100, -373210, -96195, -437194, 147931, -43932, -159863, 170564, -57663, -263550, 24487, -112072, -7395, -166805, -80710, 202410, -85454, -138614, 142892, -212210, -193682, 308096, -120742, -194681, -314465, -259878, 81406, -51516, 12071]
9290a51275e9207A7396c97421e2809k18243a0581l80582f6500A07581M3462l1018
9279A20025j9253j2383g5422j59664G2105M7602a79995M4726B29989a01973J7207
9268h4766j47308D9983b18102E9729K88374a30960j58162a79A14753g5303G9276
9256B9039d8543n9922j8069b5664j63937c0953j77710A67846a66192O2636k24233
9245c27789L883B86679b53622E8632j4844J96740b36413A0892b34636C8093c5159
9233B08809n1242a8273l20273B09403b80568B4316a28434A0325J4346L6721o634
9222E4758b92494E8812b04553j92548A53032a14696C1394a18379o7334O9016m500
9211a21197A96494a98548G2886i4812A00179J5435b46768I726K88280a54954f8472
$$ y = [-151275, -59207, 17396, -397421, -52809, -271052, -10581, -391163, -66500, 107581, 151043, 120025, 100772, 88389, -75422, -235086, 72105, 119707, -179995, -135269, 229989, -101973, -84766, -232074, 49983, -218102, 59729, 348103, -130960, -289122, -179, 114753, -75303, 79276, 29039, -48543, -108465, -126534, -25664, -189601, -30953, -208663, 167846, -166192, -103556, -327789, -323906, 286679, -253622, 58632, 43788, 240528, -236413, 10892, -234636, 38093, -35159, 208809, 157567, -18273, -338546, 209403, -280568, 24316, -128434, 10325, 24671, 61392, 54758, -292494, 58812, -204553, -397101, 153032, -114696, 31394, -118379, -185713, -116697, -121197, 196494, -198548, 72886, -94812, 100179, 115614, -246768, 9726, 298006, -154954, -68472]
9199D5030c75727J75848A25003b91730e365k9536C1066a41253D1204F108a59832
9187a27807A09738a5070A70311a97619H1851J1668f863B8521a2191C9532Q1784
9176A21316O4924A6248K22050L01312c16773f5326b2609k89411F4355b5596k1586
9165d7182j76626A13763n918b16860B86320a46381j52975J07511j25054C7075
9154H5450c25105H1965b06615L5415B9386P1176a89883H097J3531l293J85491
9143B03826p0996b0533j05898p2785G1241e73237a36014G2379J13385o7236d6513
9131b37224g9522o0510j94561P0859a08051H9132h3986l54531g5049k65732a14079
9119a87337i1279H4091K2966c64883f7939I2617b34404A7563a89528g1911k36621
$$ y = [45030, -375727, -199879, 125003, -291730, -5365, -34901, 31066, -141253, 41204, 6108, -159832, -127807, 109738, -15070, 170311, -197619, 81851, 93519, -6863, 28521, -12191, 39532, 121316, 186240, 16248, 238298, 539610, -316773, -65326, -22609, -312020, 64355, -25596, -47182, -223808, 113763, 107845, -216860, 286320, -146381, -299356, -191845, -316899, 37075, 85450, -325105, 81965, -206615, -171200, 29386, 100562, -189883, 8097, 21628, 18335, 203826, 132830, -20533, -126431, -199216, 71241, -573237, -136014, 72379, 185764, 118528, -46513, -237224, -79522, -140032, -334593, -263734, -108051, 89132, -83986, -438517, -75049, -340781, -114079, -187337, -91279, 84091, 107057, -364883, -67939, 92617, -234404, 17563, -189528, -71911, -308532]
9108c08532g1666A46362C1615d2358j43773O8626G1828b02718C1727b6879k48476
9097b75355A3902b005D8006L36888c86933P2383K1725h3464C4771a81352B0617
9085C32308a43973r3767j2920A41655a21921n20584d9445J820H4286a17678j03646
9074b21324J3042A80228a8105A01303a28161q4438A58975d1074D5222b81712A87295
9062c522E3613O2947B513b17214D4404J53329B0931P3065e9767b8149k58193e6141
9049C275J60687c32405a6757A30702a62364A58078B053J68873b5979a864j07430
9038a09294k09544a7175A4805e261m05788B6798h4988B37327f4561l748C5501
9026b33399M4371K5832d7069N921k69372a50472B09882b58077l1564M6017j01382
$$ y = [-308532, -71666, 146362, 31615, -42358, -186131, -117505, 71828, -202718, 31727, -26879, -275355, 13902, -2005, 48006, 384894, -386933, -314550, -292825, -83464, 34771, -181352, 20617, 332308, -143973, -237740, -250660, 141655, -121921, -642505, -49445, -47625, 84286, -117678, -221324, -208282, 180228, -18105, 101303, -128161, -212599, 158975, -41074, 45222, -281712, 187295, -3522, 53613, 116560, 2513, -217214, 44404, 197733, 20931, 93996, -59767, -28149, -286342, -56141, 3275, 163962, -332405, -16757, 130702, -162364, 158078, 2053, 170926, -25979, -1864, -109294, -318838, -17175, 14805, -5261, -411049, 26798, -84988, 237327, -64561, -68309, 35501, -233399, -189028, -163196, -47069, -41148, -310520, -150472, 209882, -258077, -289641, -243624, -345006]
9015c45006A2465l530J12352E1009i3772k330c8747l93516d778o523j96107k26001
9003d33409C05499j15124c69038C8503r750a82540g5872f286k0941r760D1554
8991A79722q9595r444i7789j40445c3771J4668j34668K7975N5406D360h5798l5360
8979a21158q9187m1834A07356a99054K597A06487d9971G2403k6444a98892a7947
8967e9753l60496A73941f4809j51472j10103E1933b10582Q335B7240R920j7506
8956A9654c75957A96784a57620P4095l1769A14371b948n6080A15410f8786J2753
8945e6033A33624m1520J72719q4848L00315j20105a37204H0831d4916D38242n3188
8934C85054A43868L68573a18152k13598J03095A5048b1015B21386E3374J170448
$$ y = [-345006, 12465, 8935, 121287, 51009, -93772, -96102, -38747, -432263, -4778, -11301, -207408, -433409, 305499, 190375, -369038, 38503, 28753, -182540, -75872, -6286, -27227, -36987, 41554, 179722, 90127, 80683, -97789, -238234, -33771, -19103, -153771, -125796, -70390, 4360, -85798, -121158, -210345, -252179, 107356, -199054, -196457, 106487, -49971, 72403, 45959, -198892, -17947, -59753, -420249, 173941, -64809, -216281, -326384, 51933, -210582, -202247, 27240, 37160, 19654, -375957, 196784, -157620, -83525, -115294, 114371, -2948, -59028, 115410, -68786, -56033, 133624, 92104, 264823, 179975, 480290, 360185, -137204, 80831, -44916, 438242, 385054, 143868, 512441, -118152, -331750, -228655, 15048, -21015, 221386, 53374, 1223822]
8924A223822J245419P282725K089885E795512B323069H68735k27475j67922E9450
8914g4932B85463b54799c7351k0211K0177F00925B45110f886n4225A53122D9811
8902a37863e8147C4222N0969p657c23555R779J28625b6297j32505Q223A82993
8890c37562A23628d02435k814A13290O2904e4327n0239k0739B9622a6961p7088
8879i4049A55473B3507J02525c47904g6553F6257b58136I9879a0388E8258L8180
8868I6438f4176a1806k3506j18876J3162K4189r4998B01779g3246B3828b33122
$$ y = [1223822, 2469241, 9751966, 11841851, 5795512, 2323069, 868735, 641260, 473338, 59450, -74932, 285463, -254799, -37351, -57562, -37385, 600925, 245110, -6886, -61111, 153122, 49811, -137863, -58147, 34222, 85191, 77534, -323555, -313776, -185151, -26297, -158802, -150579, 182993, -337562, 123628, -402435, -405249, 113290, 176194, -54327, -104566, -125305, 29622, -16961, -94049, 155473, 23507, 126032, -347904, -76553, 66257, -258136, 99879, -10388, 58258, 96438, -64176, -11806, -35312, -154188, -141026, -116837, -211835, 201779, -73246, 23828, -233122]
$$ [...]
##END NTUPLES=NMR SPECTRUM
##END=
