##TITLE=AC1585_DECA0002_8281262_Y2MnwaBRaM
##JCAMPDX= 6.0         $$ Bruker NMR JCAMP-DX V2.0
##DATA TYPE= NMR SPECTRUM
##DATA CLASS= NTUPLES
##ORIGIN= BRUKER
##OWNER= Administrator
$$ 1.72 TOPSPIN		Version 2.1
$$ 2013-10-19 00:40:44.518 -0700  Administrator@X
$$ Compression mode = diff/dup
##.OBSERVE FREQUENCY= 400.02188249412
##.OBSERVE NUCLEUS= ^1H
##.ACQUISITION MODE= SIMULTANEOUS (DQD)
##.ACQUISITION SCHEME= undefined
##.AVERAGES= 64
##.DIGITISER RES= 22
##SPECTROMETER/DATA SYSTEM= spect
##.PULSE SEQUENCE= noesygpps1d.comp
##.SOLVENT NAME= COFFEE_meoh
##.SHIFT REFERENCE= INTERNAL, COFFEE_meoh, 1, 14.96041
##AUDIT TRAIL= $$ (NUMBER, WHEN, WHO, WHERE, PROCESS, VERSION, WHAT)
$$ ##TITLE= Audit trail, TOPSPIN		Version 2.1
$$ ##JCAMPDX= 5.01
$$ ##ORIGIN= Bruker BioSpin GmbH
$$ ##OWNER= Administrator
$$ $$ E:\/data/COFFEE/nmr/AC1585_DECA0002_8281262_Y2MnwaBRaM/12/pdata/1/auditp.txt
$$ ##AUDIT TRAIL=  $$ (NUMBER, WHEN, WHO, WHERE, PROCESS, VERSION, WHAT)
(   1,<2013-10-19 00:40:39.315 -0700>,<Administrator>,<X>,<go>,<TOPSPIN 2.1>,
      <created by zg
	started at 2013-10-19 00:29:09.891 -0700,
	POWCHK enabled, PULCHK disabled,
       configuration hash MD5:
       C8 4E 4E 5D D3 5C D8 9E 9F 52 82 E0 59 8A DE 15
       data hash MD5: 64K
       5C 95 06 FD CC 17 50 D4 7E C3 E7 FA 27 12 A9 41>)
(   2,<2013-10-19 00:40:42.456 -0700>,<Administrator>,<X>,<proc1d>,<TOPSPIN 2.1>,
      <Start of raw data processing
       efp LB = 0.3 FT_mod = 6 PKNL = 1 PHC0 = 0 PHC1 = 0 SI = 128K 
       data hash MD5: 128K
       45 A5 F8 F2 A4 DC B7 3C 63 42 C9 C8 30 D0 10 59>)
(   3,<2013-10-19 00:40:43.503 -0700>,<Administrator>,<X>,<proc1d>,<TOPSPIN 2.1>,
      <pk PHC0 = -83.13354 PHC1 = 0 
       data hash MD5: 128K
       09 96 B3 D2 A2 7A AC 6D DD BD 84 B4 0E 10 EF E3>)
(   4,<2013-10-19 00:40:43.940 -0700>,<Administrator>,<X>,<proc1d>,<TOPSPIN 2.1>,
      <abs ABSG = 1 
       data hash MD5: 128K
       1A 18 EA C3 BD EC D6 5F 9F EF 31 7A 88 BC 06 A0>)
(   5,<2013-10-19 00:40:44.049 -0700>,<Administrator>,<X>,<proc1d>,<TOPSPIN 2.1>,
      <abs ABSG = 2 
       data hash MD5: 128K
       D6 29 AE 03 E0 80 FB 6D 25 8C B9 79 42 1B 08 54>)
(   6,<2013-10-19 00:40:44.143 -0700>,<Administrator>,<X>,<proc1d>,<TOPSPIN 2.1>,
      <abs ABSG = 3 
       data hash MD5: 128K
       0C 9E 48 62 3B 36 77 7C E9 7F CA 46 4E 2A 6D 9D>)
(   7,<2013-10-19 00:40:44.221 -0700>,<Administrator>,<X>,<proc1d>,<TOPSPIN 2.1>,
      <abs ABSG = 4 
       data hash MD5: 128K
       56 88 74 0D 29 C7 3A 6A 6C 83 FF 7D 76 EA C8 6D>)
(   8,<2013-10-19 00:40:44.331 -0700>,<Administrator>,<X>,<proc1d>,<TOPSPIN 2.1>,
      <abs ABSG = 5 
       data hash MD5: 128K
       6D 5C B4 32 02 0E 6B 4A 62 62 08 83 1D 36 81 A9>)
$$ ##END=
$$ 
$$ $$ hash MD5
$$ $$ F6 88 7C 87 D2 44 CD 6C 3B 22 6A 66 9C 6E 74 99
##$RELAX= 
##$RELAX= 
##$RELAX= 
##$RELAX= 
##$RELAX= 
##$RELAX= 
##$RELAX= 
##$RELAX= 
$$ Bruker specific parameters
$$ --------------------------
##$DU= <E:\>
##$EXPNO= 12
$$ [...]
##$TP07= 0
##$TPNAME0= <>
##$TPNAME1= <>
##$TPNAME2= <>
##$TPNAME3= <>
##$TPNAME4= <>
##$TPNAME5= <>
##$TPNAME6= <>
##$TPNAME7= <>
##$TPOAL= (0..7)
0.5 0.5 0.5 0.5 0.5 0.5 0.5 0.5
##$TPOFFS= (0..7)
0 0 0 0 0 0 0 0
##$TUNHIN= 0
##$TUNHOUT= 0
##$TUNXOUT= 0
##$USERA1= <user>
##$USERA2= <user>
##$USERA3= <user>
##$USERA4= <user>
##$USERA5= <user>
##$V9= 5
##$VALIST= <valist>
##$VCLIST= <CCCCCCCCCCCCCCC>
##$VD= 0
##$VDLIST= <DDDDDDDDDDDDDDD>
##$VPLIST= <PPPPPPPPPPPPPPP>
##$VTLIST= <TTTTTTTTTTTTTTT>
##$WBST= 1024
##$WBSW= 4
##$XGAIN= (0..3)
0 0 0 0
##$XL= 0
##$YL= 0
##$YMAX_a= 6160594
##$YMIN_a= -12156802
##$ZGOPTNS= <>
##$ZL1= 120
##$ZL2= 120
##$ZL3= 120
##$ZL4= 120
##$ABSF1= 14.96041
##$ABSF2= -5.597772
##$ABSG= 5
##$ABSL= 3
##$ALPHA= 0
##$AQORDER= 0
##$ASSFAC= 0
##$ASSFACI= 0
##$ASSFACX= 0
##$ASSWID= 0
##$AUNMP= <proc_prof1d_extract.lims>
##$AXLEFT= 0
##$AXNAME= <>
##$AXNUC= <1H>
##$AXRIGHT= 0
##$AXTYPE= 0
##$AXUNIT= <>
##$AZFE= 0.1
##$AZFW= 0.1
##$BCFW= 0
##$BC_mod= 0
##$BYTORDP= 0
##$COROFFS= 0
##$CY= 15
##$DATMOD= 1
##$DC= 0
##$DFILT= <>
##$DTYPP= 0
##$F1P= 0
##$F2P= 0
##$FCOR= 0.5
##$FTSIZE= 131072
##$FT_mod= 6
##$GAMMA= 0
##$GB= 0
##$INTBC= 1
##$INTSCL= 1
##$ISEN= 128
##$LB= 0.3
##$LEV0= 0
##$LPBIN= 0
##$MAXI= 10000
##$MC2= 0
##$MEAN= 0
##$ME_mod= 0
##$MI= 0
##$NCOEF= 0
##$NC_proc= -2
##$NLEV= 6
##$NOISF1= 0
##$NOISF2= 0
##$NSP= 0
##$NTH_PI= 0
##$NZP= 0
##$OFFSET= 14.96041
##$PC= 1
##$PHC0= -83.13354
##$PHC1= 0
##$PH_mod= 1
##$PKNL= yes
##$PPARMOD= 0
##$PPDIAG= 0
##$PPIPTYP= 0
##$PPMPNUM= 2147483647
##$PPRESOL= 1
##$PSCAL= 4
##$PSIGN= 0
##$PYNMP= <proc.py>
##$REVERSE= no
##$SF= 400.020009871525
##$SI= 131072
##$SIGF1= 0
##$SIGF2= 0
##$SINO= 400
##$SIOLD= 131072
##$SPECTYP= <>
##$SREGLST= <1H.CDCl3>
##$SSB= 0
##$STSI= 131072
##$STSR= 0
##$SW_p= 8223.68421052631
##$SYMM= 0
##$S_DEV= 0
##$TDeff= 65536
##$TDoff= 0
##$TI= <>
##$TILT= no
##$TM1= 0
##$TM2= 0
##$TOPLEV= 0
##$USERP1= <user>
##$USERP2= <user>
##$USERP3= <user>
##$USERP4= <user>
##$USERP5= <user>
##$WDW= 1
##$XDIM= 131072
##$YMAX_p= 380920998
##$YMIN_p= -14002
##$CURPLOT= <Network HP LaserJet P1505>
##$CURPRIN= <$Network HP LaserJet P1505>
##$DFORMAT= <normdp>
##$LAYOUT= <+/1D_H.xwp>
##$LFORMAT= <normlp>
##$PFORMAT= <normpl>
##$SURQMSG= 1
$$ End of Bruker specific parameters
$$ ---------------------------------
##NTUPLES= NMR SPECTRUM
##VAR_NAME=  FREQUENCY,     SPECTRUM/REAL,   SPECTRUM/IMAG
##SYMBOL=    X,             R,               I
##VAR_TYPE=  INDEPENDENT,   DEPENDENT,       DEPENDENT
##VAR_FORM=  AFFN,          ASDF,            ASDF
##VAR_DIM=   131072,        131072,          131072
##UNITS=     HZ,            ARBITRARY UNITS, ARBITRARY UNITS
##FACTOR=    0.0627417313425164, 1,          1
##FIRST=     8223.62146879497, -1641,        -64971
##LAST=      0,             319,             -65484
##MIN=       0,             -14002,          0
##MAX=       8223.62146879497, 380920998,    0
$$ Real data points
##PAGE= N=1
##DATA TABLE= (X++(R..R)), XYDATA
$$ [...]
61762D39347j45N46J163J104O27M07N41P80J308K397L422L340K221J315J385J831
61746D61589J844J496J198Q64L18q8L5M26N47L80K18Q9j18k28l8K35K87K84N32
61727D69870Q72J022J274K112L241L694L082K113J681J952K526L111L607L844
61713E04001L538K566J201rp52j366k551m415o163o983o978o812o740o502n986
61698D56049n420m857m154l520l534m334n222n371m647l538k534j813j369j184
61684D04552j307j739k269k505k267j822j527j365j086o85l90k90l03m40o82p24
61668C85151k93L19N19K64J22M31R13J232J446J658J678J358R47Q47J199J805
61652C99596K294K323J954J767K282L266M037M354M442M253L523K687K753L824
$$ y = [439347, 439202, 439748, 440911, 442015, 442642, 443049, 443590, 444370, 445678, 448075, 451497, 454837, 457058, 458373, 459758, 461589, 463433, 464929, 466127, 466991, 467309, 467221, 467256, 467682, 468229, 468609, 468827, 468916, 468798, 468570, 468532, 468767, 469054, 469338, 469870, 470742, 471764, 473038, 475150, 478391, 482085, 485167, 487280, 488961, 490913, 493439, 496550, 500157, 504001, 507539, 510105, 511306, 511297, 510545, 509179, 506628, 502213, 496050, 489067, 482089, 475277, 468537, 462035, 456049, 450629, 445772, 441618, 438098, 434564, 430230, 425008, 419637, 414990, 411452, 408918, 407105, 405736, 404552, 403245, 401506, 399237, 396732, 394465, 392643, 391116, 389751, 388665, 387980, 387590, 387300, 386997, 386557, 385875, 385151, 384858, 385177, 385696, 385960, 386082, 386513, 387426, 388658, 390104, 391762, 393440, 394798, 395745, 396592, 397791, 399596, 401890, 404213, 406167, 407934, 410216, 413482, 417519, 421873, 426315, 430568, 434091, 436778, 439531, 443355]
61638D43355M566L735J722j13j069j449j769k388l619n340o653o655n504m163
61624D14656l165k339j623j333j416j148PJ661K915L279K876K048R81k73j679
61609D15447l064m154m816n251n784o497p159p463p238o569n830n406n278n105
61595C35833m830m837n229n376m733l739l268l393l420l074k812k842k698k142
61581B83440j761k102k826l245l348l541l723l333k283j219p29q16j216j752k135
61566B49411j941j128l12j55n91j004r94o80l37r0qr3r5L30J080J560J400R70
61548B47323Q35R38P88L68K81Q89J715K002J519O58l2j58L84J314K104K451K463
61531B65842K275J768R21J43j86l26q51j854k830l394l580l437k833j913j263
$$ y = [443355, 447921, 451656, 453378, 453265, 452196, 450747, 448978, 446590, 442971, 437631, 430978, 424323, 418819, 414656, 411491, 409152, 407529, 406196, 404780, 403632, 403639, 405300, 408215, 411494, 414370, 416418, 417399, 417126, 415447, 412383, 408229, 403413, 398162, 392378, 385881, 378722, 371259, 364021, 357452, 351622, 346216, 340938, 335833, 331003, 326166, 320937, 315561, 310828, 307089, 303821, 300428, 297008, 293934, 291122, 288280, 285582, 283440, 281679, 279577, 276751, 273506, 270158, 266617, 262894, 259561, 257278, 256059, 255330, 254514, 253298, 251546, 249411, 247470, 246342, 246030, 245875, 245284, 244280, 243286, 242606, 242269, 242179, 242171, 242078, 241983, 242313, 243393, 244953, 246353, 247323, 248158, 249096, 249884, 250252, 250533, 251422, 253137, 255139, 256658, 257316, 257284, 257126, 257510, 258824, 260928, 263379, 265842, 268117, 269885, 270806, 270949, 270763, 270437, 269586, 267732, 264902, 261508, 257928, 254491, 251658, 249745, 248482]
61516B48482j246j493j458j193j149j358j326p76k2N29P86O84k0j200k029j816
61500B35395j054r12j644k190j670n83K7M3J66O13Q02L62k37l90j16J64K58L32
61482B29366N54Q65R88O61P5q8O14J687K131J609P36J50q2j25PK47M07N17P24
61463B41043P63K37m68l96M67Q72J41o43k21Q95J223N38l6M3J42j64l48P0P10
61444B44868J064J245J559J922K172K448K886L339L712M213M952N610N782N336
61430B91108M391L191K100J360P88J60k03J76R61J233Q13O55J462K686L376L423
61414C17680L295L082K513J624P65J03l61n53n78j007k226l677m289l752k786
61399C09833k174k081k378l067l940m352l824k737j969j790j556o59N15J024O18
$$ y = [248482, 247236, 245743, 244285, 243092, 241943, 240585, 239259, 238483, 238461, 238990, 239776, 240460, 240440, 239240, 237211, 235395, 234341, 233429, 231785, 229595, 227925, 227342, 227369, 227412, 227578, 228191, 228993, 229355, 229118, 228728, 228612, 228776, 229034, 229366, 229920, 230785, 231773, 232434, 232509, 232421, 233035, 234722, 236853, 238462, 239198, 239348, 239266, 239141, 239148, 239395, 239802, 240319, 241043, 241806, 242043, 241575, 241179, 241646, 242518, 242659, 242016, 241795, 242690, 243913, 244451, 244415, 244458, 244600, 244436, 244088, 244158, 244868, 245932, 247177, 248736, 250658, 252830, 255278, 258164, 261503, 265215, 269428, 274380, 279990, 285772, 291108, 295499, 298690, 300790, 302150, 302938, 303098, 302895, 303071, 304032, 305265, 306078, 306733, 308195, 310881, 314257, 317680, 320975, 324057, 326570, 328194, 328959, 329062, 328701, 328148, 327570, 326563, 324337, 320660, 316371, 312619, 309833, 307659, 305578, 303200, 300133, 296193, 291841, 288017, 285280, 283311, 281521, 279965, 279306, 279821, 280845, 281463]
61384B81463K2j29o9k41l70J23J066J650J522J122R13R11J141J763K581L085L219
61367B99772L382L444K696J179J98P24K051K901L134L407L745L698L582M257N662
61352C43832O766P108P261P638P933Q104Q773R933J0330R042O993N896O106O553
61338D52268O480O193O040N649M605L261K309J843J337M15p34j813k929m344n859
61323D74721o743o558n732n048m681m148l166k032j068j75O94J162J024Q62J429
61308D40541K556L344L517L888N192O979Q168Q366Q059P609O681M887K590O43
61294E13020n52j376k339l385m028m049l806l789m099m424m449m144l696l327
61280D65557l119k896k295j130K74J281J623J758K371L571M799N499N640N562
$$ y = [281463, 281485, 281356, 281287, 281046, 280676, 280799, 281865, 283515, 285037, 286159, 287072, 287983, 289124, 290887, 293468, 296553, 299772, 303154, 306598, 309294, 310473, 310671, 311395, 313446, 316347, 319481, 322888, 326633, 330331, 333913, 338170, 343832, 350598, 357706, 364967, 372605, 380538, 388642, 397415, 407348, 417678, 426720, 433713, 439609, 445715, 452268, 458748, 464941, 470981, 476630, 481235, 484496, 486805, 488648, 489985, 490400, 489666, 487853, 484924, 480580, 474721, 467978, 461420, 455688, 450640, 445959, 441811, 438645, 436613, 435545, 435370, 436064, 437226, 438250, 439112, 440541, 443097, 446441, 449958, 453846, 459038, 466017, 474185, 482551, 490610, 498219, 504900, 509787, 512377, 513020, 512468, 511092, 508753, 505368, 501340, 497291, 493485, 489696, 485597, 481173, 476724, 472580, 468884, 465557, 462438, 459542, 457247, 456117, 456391, 457672, 459295, 461053, 463424, 466995, 471794, 477293, 482933, 488495]
61266D88495N560N748O106O442O459O160O139P131R113J1098J1970J1509J0443
61253E92373R628R282R011Q410P486O532N700M809L562J815l70k753m973o706
61239F43806p982r140j0306j1045j0909j0165r611r544r371q419o834n316m221
61226E30943l290k198j052k48m4l44p81r26n28L60J427K325K885L229L557L852
61210E39167L827L343K678K178J769J244Q81J263K391L532M261N052O415P938
61196E85939Q881R448J0676J3068J5939J8235J9477J9746J9271J8253J6805J4862
61184G70600J2480J0283R097Q930Q807P896O350M714L037J149o09j743k509l669
61170H34813n297o556o903o870p279q231r330j0449j1655j2702j3228j3472j4132
$$ y = [488495, 494055, 499803, 505909, 512351, 518810, 524970, 531109, 538240, 547353, 558451, 570421, 581930, 592373, 602001, 611283, 620294, 628704, 636190, 642722, 648422, 653231, 656793, 658608, 658238, 655485, 650512, 643806, 635824, 626684, 616378, 605333, 594424, 584259, 574648, 565104, 555733, 547314, 540480, 535164, 530943, 527653, 525455, 524403, 524155, 524111, 523767, 522986, 522060, 521532, 521892, 523319, 525644, 528529, 531758, 535315, 539167, 542994, 546337, 549015, 551193, 552962, 554206, 555087, 556350, 558741, 562273, 566534, 571586, 578001, 585939, 594820, 604268, 614944, 628012, 643951, 662186, 681663, 701409, 720680, 738933, 755738, 770600, 783080, 793363, 802460, 811390, 820197, 828093, 834443, 839157, 842194, 843343, 842734, 840991, 838482, 834813, 829516, 822960, 816057, 809187, 801908, 793677, 784347, 773898, 762243, 749541, 736313, 722841, 708709]
61157G08709j5386j6496j6644j5797j4551j3371j2254j0993r481p789o131m718
61145E65098l674l119l304m395o050p524q373q841r300r584r156p844o077m388
61131D73469k976j750n98M72J430K392L674N502P605R343J0492J1666J3663J6495
61117E50879J9298K1146K1816K1931K2529K4201K6366K7675K7514K6682K6192
61106H16229K5808K4605K2603K0786J9473J7774J5012J1650Q296M691M59l874
61094I83512p504j0547j3702j6978j9623k1357k2762k4334k5736k6332k6061k5467
61082G43109k5080k5007k5003k4745k4016k2689k0814j8811j7352j6646j5929
61071E07017j4245j1756r711q949q991q878q188p008n542m278l792l840l311j790
$$ y = [708709, 693323, 676827, 660183, 644386, 629835, 616464, 604210, 593217, 583736, 575947, 569816, 565098, 561424, 558305, 555001, 550606, 544556, 537032, 528659, 519818, 510518, 500934, 491778, 483934, 477857, 473469, 470493, 468743, 468145, 468617, 470047, 472439, 476113, 481615, 489220, 498563, 509055, 520721, 534384, 550879, 570177, 591323, 613139, 635070, 657599, 681800, 708166, 735841, 763355, 790037, 816229, 842037, 866642, 889245, 910031, 929504, 947278, 962290, 973940, 982236, 986927, 987386, 983512, 976008, 965461, 951759, 934781, 915158, 893801, 871039, 846705, 820969, 794637, 768576, 743109, 718029, 693022, 668019, 643274, 619258, 596569, 575755, 556944, 539592, 522946, 507017, 492772, 481016, 471305, 462356, 453365, 444487, 436299, 429291, 423749, 419471, 415679, 411839, 408528, 406738]
61057D06738l77j81o81o11J94J097K231M213O480P547P215P037Q141R895J1305
61042D70243J2439J3660J4629J5052J5579J6862J8337J8912J8447J7659J6945
61031F48764J6240J5767J5932J6492J6601J5906J5043J4910J5892J7801K0334
61020H29682K3524K7888L4009M1904N1131O1684P4239Q9382J07184J27587J49732
61009A617946J69524J78856J69816J41115J00045N7797K3267R28p625k936J0541
60998B459274K3210K3447M287l1772p4536j13044j41241j58174j64955j62989
60988A663507j54346j41667j26946j11083r4926p9868o6978n6229m7185l9918
60978G44361l4704l1156k8296k5372k2300j9468j7379j6263j5745j5087j3925
$$ y = [406738, 406361, 406180, 405499, 404888, 405082, 406179, 408410, 412623, 419103, 426650, 433865, 440902, 449043, 458938, 470243, 482682, 496342, 510971, 526023, 541602, 558464, 576801, 595713, 614160, 631819, 648764, 665004, 680771, 696703, 713195, 729796, 745702, 760745, 775655, 791547, 809348, 829682, 853206, 881094, 915103, 957007, 1008138, 1069822, 1144061, 1233443, 1340627, 1468214, 1617946, 1787470, 1966326, 2136142, 2277257, 2377302, 2435099, 2458366, 2459294, 2451669, 2448733, 2459274, 2482484, 2505931, 2510218, 2478446, 2403910, 2290866, 2149625, 1991451, 1826496, 1663507, 1509161, 1367494, 1240548, 1129465, 1034539, 954671, 887693, 831464, 784279, 744361, 709657, 678501, 650205, 624833, 602533, 583065, 565686, 549423, 533678, 518591, 504666]
60967E04666j2548j1321j0202r082q169p607p065o164n072m190l511k766k068
60954D14901j754j629j017K72J587K250K297K199K188K285K616L265L933M114
60940D37507L701L100K745K570K097R08r34k899m379n156n491n719n863n694n128
60925D11365m444m037l982l895l310k182j018m03m17n88l79L82J420K234K440
60910C93186K164K042K532L267L439K915K457K635L082L177K950K705K227J176
60896D29954Pm24j81k25r34j587j684j842k730l910m517m542m603m786m628m039
60880C89329l412k871k145j184l27J92L48J33j79J90J678L443M161L809L698M558
60864D01421N587N821N488N425N821O262O493O550O435O211O005N687M897L784
$$ y = [504666, 492118, 480797, 470595, 461513, 453344, 445737, 438672, 432508, 427436, 423246, 419735, 416969, 414901, 413147, 411518, 410501, 410773, 412360, 414610, 416907, 419106, 421294, 423579, 426195, 429460, 433393, 437507, 441208, 444308, 447053, 449623, 451720, 452628, 451694, 448795, 444416, 439260, 433769, 428050, 422187, 416493, 411365, 406921, 402884, 398902, 395007, 391697, 389515, 388497, 388094, 387677, 387089, 386710, 387092, 388512, 390746, 393186, 395350, 397392, 399924, 403191, 406630, 409545, 412002, 414637, 417719, 420896, 423846, 426551, 428778, 429954, 429961, 429537, 429356, 429131, 428197, 426610, 424926, 423084, 420354, 416444, 411927, 407385, 402782, 397996, 393368, 389329, 385917, 383046, 380901, 379717, 379390, 379582, 379930, 380063, 379884, 380074, 381752, 385195, 389356, 393165, 396863, 401421, 407008, 412829, 418317, 423742, 429563, 435825, 442318, 448868, 455303, 461514, 467519, 473206, 478103, 481887]
60850D81887L107L220L546L540L514L898M333M304M061M098M131L543K486J560
60836E31228P11n13j805k331k063j768j577p72O86J668J499J199K228M617P083
60821E40090Q600R233R707J0699J2408J4424J6170J7571J9050K0758K2285K3432
60809G24427K4617K6159K7615K8308K8155K7450K6254K4477K2338K0114J7653
60798I97567J4639J1132P368L204j584o573j0844j4001j6482j8756k0703k1986
60786I22981k2653k2986k2987k2338k0965j9421j8548j8675j9274j9480j8923
60775F96731j7826j6402j4616j2654j1173j0667j0834j0907j0508r847r286q988
60763E53023q900q824q608q509r040j0183j1109j1095j0422r814r268q294p063
$$ y = [481887, 484994, 488214, 491760, 495300, 498814, 502712, 507045, 511349, 515410, 519508, 523639, 527182, 529668, 531228, 531939, 531426, 529621, 527290, 525227, 523459, 521882, 521110, 521796, 523464, 524963, 526162, 528390, 533007, 540090, 548690, 557923, 567630, 578329, 590737, 605161, 621331, 638902, 657952, 678710, 700995, 724427, 749044, 775203, 802818, 831126, 859281, 886731, 912985, 937462, 959800, 979914, 997567, 1012206, 1023338, 1030706, 1033910, 1032326, 1025753, 1014909, 1000908, 984426, 965670, 944967, 922981, 900328, 877342, 854355, 832017, 811052, 791631, 773083, 754408, 735134, 715654, 696731, 678905, 662503, 647887, 635233, 624060, 613393, 602559, 591652, 581144, 571297, 562011, 553023, 544123, 535299, 526691, 518182, 509142, 498959, 487850, 476755, 466333, 456519, 447251, 438957, 431894]
60750D31894o431o546o383n146l420k336k091k008j770j798k400l221l783m067
60736C80494m356m715m934m836m416l746k874j847p92J15P25J040J242J536J918
60721C54554K143J999J588J216R74O38Q4l41k37J26q2j224k650l456l516l376
60705C48440l386l413l380l569m177m961n483n510n078m372l642l020k399j678
60691B94372j108j033j363j624j601j455j160l72Q08J555J307O20M93J064J565
60676B92068J403P30Km86n24N1J067K016K508K548K329J957J442P70k3o65o54
60659C06539K55J612K718L440M187N079N709N858N917O243O569O471O136O106
60645C72839O431O519N846M431K624Q07o68j532j883k185k789l506l819l564l209
$$ y = [431894, 425463, 418917, 412534, 407388, 403968, 401632, 399541, 397533, 395763, 393965, 391565, 388344, 384561, 380494, 376138, 371423, 366489, 361653, 357237, 353491, 350617, 348770, 347978, 348093, 348818, 349858, 351100, 352636, 354554, 356697, 358696, 360284, 361500, 362474, 363112, 363196, 362855, 362618, 362744, 362662, 361438, 358788, 355332, 351816, 348440, 345054, 341641, 338261, 334692, 330515, 325554, 320071, 314561, 309483, 305111, 301469, 298449, 296050, 294372, 293264, 292231, 290868, 289244, 287643, 286188, 285028, 284656, 285464, 287019, 288326, 288946, 289439, 290503, 292068, 293471, 294201, 294203, 293717, 293193, 293244, 294311, 296327, 298835, 301383, 303712, 305669, 307111, 307881, 307858, 307193, 306539, 306794, 308406, 311124, 314564, 318751, 323830, 329539, 335397, 341314, 347557, 354126, 360597, 366733, 372839, 379270, 385789, 391635, 396066, 398690, 399497, 398829, 397297, 395414, 393229, 390440, 386934, 383115, 379551, 376342]
60630C76342l357l973m397m199l775l786m207m394m035l537l328l286l150l021
60616C23897l027k877k237j352p49m83j77K24L13j50q57j344j436j212q95p38
60600C06900p20l92N16J375J195rj068j145p08n47m29L97J752K558K295J662J490
60583C15122J707J761J566J477J648J961K522L632N229O678P398P451P339P355
60569C72846P322O925O088M992L815K537R90q69k732m139m915n271n275m486k569
60554C75259j66J450J812J919K973M867O434P039P208P666Q409Q959R063Q685
60540D51577P645N746L193N99j471k833l630m095m310m149l489k502j608j103
60526D39570r32r14r85j153j320j279p90K47J559K513K657K295K164K574L248
$$ y = [376342, 372985, 369012, 364615, 360416, 356641, 352855, 348648, 344254, 340219, 336682, 333354, 330068, 326918, 323897, 320870, 317993, 315756, 314404, 313655, 313172, 312995, 313219, 313532, 313382, 312525, 311181, 309745, 308533, 307638, 306900, 306180, 305788, 306304, 307679, 308874, 308865, 307797, 306652, 305944, 305397, 304968, 305365, 307117, 309675, 311970, 313632, 315122, 316829, 318590, 320156, 321633, 323281, 325242, 327764, 331396, 336625, 343303, 350701, 358152, 365491, 372846, 380168, 387093, 393181, 398173, 401988, 404525, 405515, 404646, 401914, 397775, 392860, 387589, 382314, 377828, 375259, 375093, 376543, 378355, 380274, 383247, 388114, 394548, 401587, 408795, 416461, 424870, 433829, 442892, 451577, 459222, 464968, 468161, 468760, 467289, 464456, 460826, 456731, 452421, 448272, 444783, 442281, 440673, 439570, 438638, 437724, 436739, 435586, 434266, 432987, 432197, 432444, 434003, 436516, 439173, 441468, 443632, 446206, 449454]
60511D49454M080N446P498R706J1582J3458J5972J9033K1918K4270K6428K8730
60499F37575L0955L2529L2871L1436K7842K2150J4813O349k740j1764j9910k6566
60487G75540l1428l4347l5360l4875l3433l1308k8624k5777k3306k1266j9170
60476D56646j6716j4192j2013j0281q982q144p526o587n167l929l556l791l745
60463C52017l096k461k457k881l065k706k066j483j052p69p45j070j597k020k191
60448C22358k204k174k016j595r81m31j30n2k5R9L16L80np65j378j383r40o02
60430C08472o05p04p17q46j263j660j549q29J56J090J938K637K861K305J271O06
60414C13163Q32J458J528Q15O2j17j8j39k27K93J230J775J721J667J906J880J214
$$ y = [449454, 453534, 458980, 466478, 476184, 487766, 501224, 517196, 536229, 558147, 582417, 608845, 637575, 668530, 701059, 733930, 765366, 793208, 815358, 830171, 836520, 833780, 822016, 802106, 775540, 744112, 709765, 674405, 639530, 606097, 574789, 546165, 520388, 497082, 475816, 456646, 439930, 425738, 413725, 403444, 394462, 386318, 378792, 372205, 367038, 363109, 359553, 355762, 352017, 348921, 346460, 344003, 341122, 338057, 335351, 333285, 331802, 330750, 329981, 329236, 328166, 326569, 324549, 322358, 320154, 317980, 315964, 314369, 313388, 312957, 312827, 312775, 312750, 312849, 313165, 313545, 313540, 312775, 311397, 310014, 309074, 308472, 307867, 307163, 306446, 305600, 304337, 302677, 301128, 300299, 300455, 301545, 303483, 306120, 308981, 311286, 312557, 313163, 313995, 315453, 316981, 317796, 317858, 317741, 317723, 317584, 317357, 317650, 318880, 320655, 322376, 324043, 325949, 327829, 329043]
60397C29043M98M80R18R40K62n42p82j54J315L190M543M560L355J850P98K79J11
60380C50664K55O43J073J474J957K408K384J690Q02L71M66O36O08N83Q59J404
60364C68277J883J930J406O45L96J232K819M101M428M271M525N312N939N952N658
60349D18774N425N018M033K604J199o6j407k790l866m506m929n242n233m792m116
60334D00106l372k492j493o88l53l59l86k87j58j57l81p99j234j538j688j586
60318C83135r00M59J847K491K542K981M247N740O914Q148R924J1785J2888J3182
60304D65383J3253J3131J2053R479N754J691k063n157p520r314j0718j1675j2084
60291D62213j2062j1682j0650q630n935l448j882j396j767k523l063l110l004
$$ y = [329043, 329541, 330021, 330939, 331879, 332141, 331599, 330817, 330663, 331978, 335168, 339711, 344271, 347626, 349476, 350274, 350553, 350664, 350919, 351562, 352635, 354109, 356066, 358474, 360858, 362548, 363350, 363721, 364187, 364823, 365431, 366014, 366873, 368277, 370160, 372090, 373496, 374141, 374537, 375769, 378588, 382689, 387117, 391388, 395913, 401225, 407164, 413116, 418774, 424199, 429217, 433250, 435854, 437053, 436987, 435580, 432790, 428924, 424418, 419489, 414247, 409014, 404222, 400106, 396734, 394242, 392749, 392061, 391708, 391349, 390963, 390676, 390518, 390361, 389980, 389181, 387947, 386409, 384721, 383135, 382235, 382694, 384541, 387032, 389574, 392555, 396802, 402542, 409456, 417604, 427528, 439313, 452201, 465383, 478636, 491767, 503820, 513299, 519053, 520744, 518681, 513524, 506004, 496690, 485972, 474297, 462213, 450151, 438469, 427819, 419189, 413254, 409806, 407924, 406528, 404761, 402238, 399175, 396065, 393061]
60278C93061l117l151k600j748j418j699j727r78m6K70pl80p05j152j671k077
60262C70855k368k510k245j533r10q61j047q00j70J72K0p9K42N96M91O8k07j77
60244C59537M8M69J061J419J098K63l73l98o3K93O99J249J680J756J728J989K366
60227C74821K332J849J445J369J267R23P48J117J690J941J985K322K938L321L304
60212D03372L275L445L521L290L105L434M183M761M749M290L868L806M041M361
60198D57501M750N287N722N609M944M279L894L346K293J209O72L64l71j318j738
60183D96443j770k285l289l699l067k404k592l084l006k651k852l428l497l011
60169D55808k792l048k958j921m62M83O02K26k20m68m11j09K80O35Q90J045J243
$$ y = [393061, 389944, 386793, 384193, 382445, 381027, 379328, 377601, 376623, 376577, 376847, 376840, 376460, 375755, 374603, 372932, 370855, 368487, 365977, 363732, 362199, 361289, 360428, 359381, 358581, 358411, 358583, 358603, 358524, 358766, 359362, 359853, 359921, 359714, 359537, 359585, 360054, 361115, 362534, 363632, 363895, 363522, 363124, 363061, 363354, 364053, 365302, 366982, 368738, 370466, 372455, 374821, 377153, 379002, 380447, 381816, 383083, 384006, 384754, 385871, 387561, 389502, 391487, 393809, 396747, 400068, 403372, 406647, 410092, 413613, 416903, 420008, 423442, 427625, 432386, 437135, 441425, 445293, 449099, 453140, 457501, 462251, 467538, 473260, 478869, 483813, 488092, 491986, 495332, 497625, 498834, 499506, 499870, 499499, 498181, 496443, 494673, 492388, 489099, 485400, 482333, 479929, 477337, 474253, 471247, 468596, 465744, 462316, 458819, 455808, 453016, 449968, 447010, 445089, 444627, 445110, 445712, 445938, 445718, 445250, 444839, 444730, 445010, 445645, 446535, 447580, 448823]
60152D48823J599J810J343L44j10O83J948K411K115K278L374M507M940N152N760
60137D86977O288N924M930M277M170L896L108K364K175K193J793R39J01l55l49
60122E28431J21Q44J228P94j52p31m99O8L45L30L07R9o59j656j998j400o76p06
60104E24090j372j926k023j861j640j481j653k239k621k052p79R1Q4k1N97J586
60088E06780J989J589J000P13P23J019J690K518K992L002K950L014K736J765N54
60073E35034j76m81j097k391l925n177o146p010p564p470o861o272o016n955n830
60058D62663n556n149m666m235l944l642l075k233j380o91j12M55J097K011L281
60043D34824M468M843M284L561L474L976M478M673M648M397L745K712J567N26
$$ y = [448823, 450422, 452232, 453575, 453919, 453809, 454492, 456440, 458851, 460966, 463244, 466618, 471125, 476065, 481217, 486977, 493265, 499189, 504119, 508396, 512566, 516462, 519570, 521934, 524109, 526302, 528095, 529034, 529135, 528780, 528431, 528552, 529396, 530624, 531418, 531266, 530535, 530036, 530104, 530449, 530779, 531086, 531185, 530526, 528870, 526872, 525472, 524796, 524090, 522718, 520792, 518769, 516908, 515268, 513787, 512134, 509895, 507274, 505222, 504443, 504534, 504618, 504597, 505194, 506780, 508769, 510358, 511358, 512071, 512794, 513813, 515503, 518021, 521013, 524015, 526965, 529979, 532715, 534480, 535034, 534858, 534377, 533280, 530889, 526964, 521787, 515641, 508631, 501067, 493597, 486736, 480464, 474448, 468493, 462663, 457107, 451958, 447292, 443057, 439113, 435471, 432396, 430163, 428783, 428092, 427980, 428435, 429532, 431543, 434824, 439292, 444135, 448419, 451980, 455454, 459430, 463908, 468581, 473229, 477626, 481371, 484083, 485650, 486176]
60029D86176l83j172j846k492l223m100n245o781q441r543r694r299q928q423
60015D06606p224n478m119l766m064m246l895k991j728n60Om1j18J52M82M08K
59998C69426l50m98n29l59K08J038J666J779J547J380J537J953K392K681K897
59983C86768L235L736M127L980L052J563K38j89K44O23J75p18j051o17k62n35
59967D04369q14k91P21J095L93o50j128r32n39k58K6M76R73J238J188R79P18K86
59949D07850k68m41J96J194J512P72k24n79l97m57j131k121l056l827m403m694
59933C89926m625m066k930j523n63m46p17p26n16n49p46n34J99Q79J128J236J546
59916C76973J972K398K978L706M139M017L732L809M234M719N240N788N884N036
$$ y = [486176, 485793, 484621, 482775, 480283, 477060, 472960, 467715, 460934, 452493, 442950, 433256, 423957, 415029, 406606, 399382, 393904, 389785, 386019, 381955, 377709, 373814, 370823, 369095, 368535, 368541, 368500, 368382, 368534, 369016, 369424, 369426, 369076, 368578, 368049, 367690, 367898, 368936, 370602, 372381, 373928, 375308, 376845, 378798, 381190, 383871, 386768, 390003, 393739, 397866, 401846, 404898, 406461, 406699, 406510, 406754, 407377, 407552, 406834, 405783, 405166, 404904, 404369, 403555, 403264, 403985, 405080, 405473, 404823, 403695, 402763, 402224, 401966, 401992, 402468, 403441, 404679, 405867, 406846, 407564, 407850, 407582, 407141, 407337, 408531, 410043, 410815, 410591, 410012, 409615, 409158, 408027, 405906, 402850, 399023, 394620, 389926, 385301, 381235, 378305, 376782, 376219, 375773, 375056, 374330, 373814, 373265, 372519, 371985, 372184, 373063, 374191, 375427, 376973, 378945, 381343, 384321, 388027, 392166, 396183, 399915, 403724, 407958, 412677, 417917, 423705, 429589, 434625]
59902D34625L607K593K405K431J915Q77j86r90j555j788j537r33l29J80Q47J767
59886D43929K622L158L630M391N192N384M860M370M611N295N428M401K526O23
59872E00420o30j104j244j724k776l881m353m117l682l502l695m200m748m724
59858D56040l726k283j424j348j230n90j29n30j192j022j48K02n10j460j797j781
59842D37072k084k643k836k462j923j573j399j297j283j251q40K04J632K798L242
59827D25357L140L029L045K689J600K95l52l31n52j487k447k639k328k284k461
59812D24274k110j114l39m29r99j270j000m11K47O84N46q3n43m44l44j035k313
59795D13317l177l200l042l441m181m449l872k894k169j913j865j785j739j851
$$ y = [434625, 438232, 440825, 443230, 445661, 447576, 448453, 448267, 447277, 445722, 443934, 442397, 441464, 441135, 441315, 442162, 443929, 446551, 449709, 453339, 457730, 462922, 468306, 473166, 477536, 482147, 487442, 492870, 497271, 499797, 500420, 499790, 498686, 497442, 495718, 492942, 489061, 484708, 480591, 476909, 473407, 469712, 465512, 460764, 456040, 452314, 450031, 448607, 447259, 446029, 445439, 445310, 444780, 443588, 442566, 442418, 442620, 442110, 440650, 438853, 437072, 434988, 432345, 429509, 427047, 425124, 423551, 422152, 420855, 419572, 418321, 417481, 417685, 419317, 422115, 425357, 428497, 431526, 434571, 437260, 438860, 439155, 438803, 438472, 437920, 436433, 433986, 431347, 429019, 426735, 424274, 422164, 421050, 420711, 420282, 419283, 418013, 417013, 416602, 416849, 417533, 418079, 417996, 417453, 417009, 416665, 415630, 413317, 410140, 406940, 403898, 400457, 396276, 391827, 387955, 385061, 382892, 380979, 379114, 377329, 375590, 373739]
59781C73739j934j715j414j558k026j863n57R93J589J447J804K895L509K883J925
59766C79717J813K251K072J108M52R31K130K998K924K129J406J413J992K309J974
59751D07619J665K136L015L319K936K740L204L777L850L606L438L229K719K149
59737D49402J973K138K149J770J287J076J122J036N03k38m75J67J122J420Q49
59722D65301J04k15k10k24k73k81l73n63n51j84K51N14P60J099J238J014Q49J084
59704D69340J314J038O60R57J730J954J298O38O95J029R09N51O76J184J094r7
59688D84970j601k222j732r72o42m74J01Q47Q43k32j515k045j974k187k978l734
59672D64453l924l728l558l461l343l306l444l524l279k817k472k294j959j251
$$ y = [373739, 371805, 370090, 368676, 367118, 365092, 363229, 362672, 363665, 365254, 366701, 368505, 371400, 374909, 377792, 379717, 381530, 383781, 385853, 386961, 387413, 388344, 390474, 393472, 396396, 398525, 399931, 401344, 403336, 405645, 407619, 409284, 411420, 414435, 417754, 420690, 423430, 426634, 430411, 434261, 437867, 441305, 444534, 447253, 449402, 451375, 453513, 455662, 457432, 458719, 459795, 460917, 461953, 462456, 462218, 461743, 461910, 463032, 464452, 465301, 465405, 465190, 464980, 464756, 464483, 464202, 463829, 463266, 462715, 462531, 462782, 463296, 464056, 465155, 466393, 467407, 468256, 469340, 470654, 471692, 472352, 473309, 475039, 476993, 478291, 478929, 479624, 480653, 481562, 482113, 482789, 483973, 485067, 484970, 483369, 481147, 479415, 478443, 477801, 477327, 477428, 478275, 479118, 478886, 477371, 475326, 473352, 471165, 468187, 464453, 460529, 456801, 453243, 449782, 446439, 443133, 439689, 436165, 432886, 430069, 427597, 425303, 423344, 422093]
59658D22093m06J47L36N63J211K078K584K562K521K846L121K673J608P30L93J17
59642D45177n35j249j560j629j932k390k409j706o47K81R49J352J282N58n98j654
59626D33290k294k633k811k645j939j029o17r48j480j604j366j166j071q96p63
59611D10028r64j289j108k83N98J087J464K066K535K268J336M47R4J50K50K41
59595D18920J48kk30m95o21m26n5n1p74j737j995j356p11r16j774k433k504k287
59577D00701k225k544l194l711l416k251j115q31j041p88j7M12J89P7O74J453
59561C82373J560R65K81j29k34Q6Q45J543J599J269J458K511L703M289M551N284
59545D11954O541P536P852Q139R246J1141J3128J4768J5806J5405J2505P425K260
$$ y = [422093, 421687, 421834, 422170, 422733, 423944, 426022, 428606, 431168, 433689, 436535, 439656, 442329, 443937, 444667, 445060, 445177, 444642, 443393, 441833, 440204, 438272, 435882, 433473, 431767, 431120, 431401, 432350, 433702, 434984, 435542, 434944, 433290, 430996, 428363, 425552, 422907, 420968, 419939, 419322, 418374, 416894, 415290, 413924, 412758, 411687, 410791, 410028, 409064, 407775, 406667, 406384, 406982, 408069, 409533, 411599, 414134, 416402, 417738, 418185, 418279, 418429, 418679, 418920, 419068, 419066, 418836, 418341, 417720, 417294, 417239, 417188, 416414, 414677, 412682, 411326, 410615, 409699, 407925, 405492, 402988, 400701, 398476, 395932, 392738, 389027, 385611, 383360, 382245, 381414, 380373, 379585, 379568, 379980, 380169, 380246, 380920, 382373, 383933, 384898, 385179, 385050, 384816, 384902, 385747, 387290, 388889, 390158, 391616, 394127, 397830, 402119, 406670, 411954, 418495, 426031, 433883, 442022, 451268, 462409, 475537, 490305, 506111, 521516, 534021, 541446, 543706]
59532E43706j069k687l928n099n197l751j723j75J033K485L954M690M578M155
59518E40972L593K488P10j223k802m128n573p116q372r072r323r411r462r322
59504D71959q767p856o920o147n311m189l117k701k912k913k061p64R2L47O06
59489D19346J176J549J324J038J469K423K960K846K985M143N843P060P552P866
59475D69580Q291Q431P847O569M925L336K208J653J221M47l31k64P47J742K050
59460E18452K323L700O225Q751J0197J0440J0032R640R775J0641J1993J3287J4009
59447F39465J3794J2419R980O932L601k18m693r080j2050j3120j3268j3722j4495
59434F05545j4617j3538j1788j0235r165q277p230n900m317k598p98J248L795
$$ y = [543706, 542637, 539950, 536022, 530923, 525726, 521975, 520252, 520077, 521110, 523595, 527549, 532239, 536817, 540972, 544565, 547053, 547763, 546540, 543738, 539610, 534037, 526921, 518549, 509477, 500154, 490743, 481281, 471959, 463192, 455336, 448416, 442269, 436958, 432769, 429652, 426951, 424039, 421126, 419065, 418301, 418393, 418740, 419346, 420522, 422071, 423395, 424433, 425902, 428325, 431285, 434131, 437116, 441259, 447102, 454162, 461714, 469580, 477871, 486302, 494149, 500718, 505643, 508979, 511187, 512840, 514061, 514508, 514177, 513913, 514660, 516402, 518452, 520775, 524475, 530700, 539451, 549648, 560088, 570120, 579760, 589535, 600176, 612169, 625456, 639465, 653259, 665678, 675658, 682590, 686191, 685973, 681280, 672200, 660150, 647030, 633762, 620040, 605545, 590928, 577390, 565602, 555367, 546202, 537925, 530695, 524795, 520478, 517880, 517082, 518330, 522125]
59421E22125O718R461J1713J3882J6419J8943K0725K2019K3938K6504K7598K4689
59409G44734J7340P503k276j0160j5103j6967j6724j5508j3121q477k021L262
59397F72482M194K77o329j3123j8717k2525k4326k4334k3067k0846j7902j4772
59385D91012j2184j0393r135q136p201n999m384k898k243k199j796o94L71Q10
59371D24931J042J632K279K353K006J875K050K066J930K246L220M226M760N218
59357D61834O215P559Q496Q896R488J0847J2644J4203J5364J6350J7129J7484
59345F06509J7596J7926J8373J8218J7123J5718J4626J3417J1096P460L321m99
59333G60884l844o869r593j1939j3801j4974j5351j5261j5199j5168j4740j3794
$$ y = [522125, 528843, 538304, 550017, 563899, 580318, 599261, 619986, 642005, 665943, 692447, 720045, 744734, 762074, 769577, 767301, 757141, 742038, 725071, 708347, 692839, 679718, 671241, 669220, 672482, 676676, 676953, 670624, 657501, 638784, 616259, 591933, 567599, 544532, 523686, 505784, 491012, 478828, 468435, 459300, 451164, 443963, 437964, 433580, 430682, 428439, 426240, 424444, 423750, 424121, 424931, 425973, 427605, 429884, 432237, 434243, 436118, 438168, 440234, 442164, 444410, 447630, 451856, 456616, 461834, 468049, 475608, 484104, 493000, 502488, 513335, 525979, 540182, 555546, 571896, 589025, 606509, 624105, 642031, 660404, 678622, 695745, 711463, 726089, 739506, 750602, 758062, 761383, 760884, 757040, 750171, 740578, 728639, 714838, 699864, 684513, 669252, 654053, 638885, 624145, 610351]
59321F10351j2759j1959j1230j0338r332q302p194o194n731n839n931n574n075
59308E04893m885m868m631m174l732l258k632k072j811j596j108n72l50j82L83
59293D69405R81P53k59r62o92K3M81Q31J471K153K442K591L282M659O166P229
59277E00554P648P548P423P951R268J0634J1350J1675J2200J2578J1835R906P859
59264F28429O373M880K753L92j513l139n094p222q755r451r785j0067j0117r880
59250E67804r606r323q726p779o798n775m271k255l73R62K108L368M278M381M187
59235E32182M536N302N595N088M318L585K422N03j672l391m615n791p098q328
59221E32636r317j0051j0492j0543j0223r688r104q556p983p125n741l966k305
$$ y = [610351, 597592, 585633, 574403, 564065, 554733, 546431, 539237, 533043, 527312, 521473, 515542, 509968, 504893, 500008, 495140, 490509, 486335, 482603, 479345, 476713, 474641, 472830, 471234, 470126, 469554, 469204, 469022, 469405, 470386, 471139, 470880, 469918, 469226, 469249, 469730, 470561, 472032, 474185, 476627, 479218, 482500, 487159, 493325, 500554, 508202, 515750, 523173, 531124, 540392, 551026, 562376, 574051, 586251, 598829, 610664, 620570, 628429, 634802, 639682, 642435, 642827, 641314, 638175, 633081, 625859, 617104, 607653, 597868, 587801, 577684, 567804, 558198, 548875, 540149, 532370, 525572, 519797, 515526, 513271, 512898, 513860, 515968, 519336, 523614, 527995, 532182, 536718, 542020, 547615, 552703, 557021, 560606, 563028, 563531, 561859, 558468, 553853, 548062, 540964, 532636, 523319, 513268, 502776, 492233, 482010, 472322, 463218, 454662, 446679, 439554, 433813, 429847, 427542]
59208D27542j170n25j15K07M94Q36J274J676J913K032K127K175K145K175K356
59193D45142K433K058J341Q89J135J782K121J858J505J793K858M089M836N031
59179D78871N058N180N394N674O069O520O798O737O390N970N767O060O847P669
59165E65004Q018P886P691P591P260O417N157L600J604q32l233n068o373p524
59151E97198q628r459r905j0046r834r134q122p310o976o827o354n435m407l678
59137D91083l404l424l454l267k810k192j597j144p23l9J042K149K590K098J288
59122D78196J211K384M279N842O488O574O854P584Q410R128J0020J1129J1668
59109E69767J0897R365Q433Q512Q598P905P057P087P828Q139P312N608L649J955
$$ y = [427542, 426372, 425847, 425732, 425939, 426433, 427269, 428543, 430219, 432132, 434164, 436291, 438466, 440611, 442786, 445142, 447575, 449633, 450974, 451863, 452998, 454780, 456901, 458759, 460264, 462057, 464915, 469004, 473840, 478871, 483929, 489109, 494503, 500177, 506246, 512766, 519564, 526301, 532691, 538661, 544428, 550488, 557335, 565004, 573022, 580908, 588599, 596190, 603450, 609867, 615024, 618624, 620228, 619396, 616163, 611095, 604722, 597198, 588570, 579111, 569206, 559160, 549326, 540192, 532070, 524760, 517784, 510957, 504603, 499168, 494761, 491083, 487679, 484255, 480801, 477534, 474724, 472532, 470935, 469791, 469068, 469029, 470071, 472220, 474810, 476908, 478196, 479407, 481791, 486070, 491912, 498400, 504974, 511828, 519412, 527822, 536950, 546970, 558099, 569767, 580664, 590029, 598462, 606974, 615572, 623477, 630534, 637621, 645449, 653588, 660900, 666508, 670157, 672112]
59095F72112R17M93L2j016k212k555j774o76j27k59p63j470k431l789n627p714
59079F43141r392j0137j0141r960r775r447r202r423r856r715q809p795p143o587
59065E15759n900n404n282n057m343l471k798k065j157q41j784l226l728l102
59051D67601k562k839l175k612j420o11m73l25L92J313J643J138L16k65n66p08
59035D56847m04O42J895K364K050K144L296M511M656M288M849O482Q084R327J1009
59020E22040J3108J4155J3331J1861J1311J1500J1189J0016Q382O180L098j26
59008F36045k245l265m222n114m580k132O96K310L010L965N131N540N190N225
58994F45554O228P365P519O488M757K798R65m47j444k413l649n005o209p227q091
$$ y = [672112, 673029, 673522, 673554, 672538, 670326, 667771, 665997, 665321, 665194, 664935, 664172, 662702, 660271, 656482, 650855, 643141, 633749, 623612, 613471, 603511, 593736, 584289, 575087, 565664, 555808, 546093, 537284, 529489, 522346, 515759, 509859, 504455, 499173, 494116, 489773, 486302, 483504, 481439, 480282, 479441, 477657, 474431, 470703, 467601, 465039, 462200, 459025, 456413, 454993, 454382, 453909, 453584, 453976, 455289, 456932, 458070, 458386, 458121, 457555, 456847, 456443, 457085, 458980, 461344, 463394, 465538, 468834, 473345, 478001, 482289, 487138, 493620, 501704, 511031, 522040, 535148, 549303, 562634, 574495, 585806, 597306, 608495, 618511, 626893, 633073, 636171, 636045, 633800, 630535, 626313, 621199, 616619, 614487, 615183, 617493, 620503, 624468, 629599, 635139, 640329, 645554, 651782, 659147, 666666, 673154, 677911, 680709, 681674, 681227, 679783, 677370, 673721, 668716, 662507, 655280, 647189]
58979F47189q583q405p518o124m382k427n32R98K132L170M394N822P277Q572R562
58964F51145J0147J0340J0265R948R269Q245P305O871O645N668L364K60k730n369
58950G31373p970j0474j2358j3459j4103j4267j3444j1754j0274r654r131p761
58938E96724o017n130n247n414n252n371o016o437o113n541n172m514l065j558
58924E25877j252k240l326l500k897k145j438n50M24Q29K17p63p21Q63K792L578
58908E15748L432L916N657P559Q579R178J0251J1563J2225J2095J1709J1211J0380
58895F33503R437Q918Q869R055R773J1516J3947J6120J7802J9630K1830K3686
58883H04086K4532K4418K3431K1275J7930J4110J0399O508J942l051p682j1533
$$ y = [647189, 638606, 630201, 622683, 616559, 612177, 609750, 609218, 610216, 612348, 615518, 619912, 625734, 633011, 641583, 651145, 661292, 671632, 681897, 691845, 701114, 709359, 716664, 723535, 730180, 735848, 739212, 739472, 736742, 731373, 723403, 712929, 700571, 687112, 673009, 658742, 645298, 633544, 623270, 613616, 604485, 596724, 590707, 585577, 580330, 574916, 569664, 564293, 558277, 551840, 545727, 540186, 535014, 530500, 527435, 525877, 524625, 522385, 519059, 515559, 512662, 510517, 509079, 508529, 508953, 509782, 509999, 509236, 508515, 509378, 512170, 515748, 519180, 523096, 528753, 536312, 544891, 554069, 564320, 575883, 588108, 600203, 611912, 623123, 633503, 642940, 651858, 660727, 669782, 679555, 691071, 705018, 721138, 738940, 758570, 780400, 804086, 828618, 853036, 876467, 897742, 915672, 929782, 940181, 946689, 948631, 945580, 937898, 926365]
58871I26365j4705j7333j9451k1174k2499k2978k2074j9938j7544j5824j4788
58860G18057j3634j1775r677q477q742r847j0709j0889j0644j0230r613q812p979
58847E87029p125o257n652n571n657n237m294l562l535l917m340m930n816o562
58833E14574o660o225n759n462n170m795m404l969l375k619j773q35J79J055J537
58818D66299J629J627J880K489L187L558L508L444L732M098L948L176K268J620
58804E06463J175Q28O18M87K60mj61m40j219k200k561k198k072k831l765l727
58788D88653k639j360m86J02O76J342K166L122L933M323M352M218L916L371K739
58773E18428K165J456L15j199k717l861m370m179l695l599m023m283l760k756
$$ y = [926365, 911660, 894327, 874876, 853702, 831203, 808225, 786151, 766213, 748669, 732845, 718057, 704423, 692648, 682971, 674494, 665752, 655905, 645196, 634307, 623663, 613433, 603820, 595008, 587029, 579904, 573647, 567995, 562424, 556767, 551530, 547236, 543674, 540139, 536222, 531882, 526952, 521136, 514574, 507914, 501689, 495930, 490468, 485298, 480503, 476099, 472130, 468755, 466136, 464363, 463528, 463707, 464762, 466299, 467928, 469555, 471435, 473924, 477111, 480669, 484177, 487621, 491353, 495451, 499399, 502575, 504843, 506463, 507638, 508466, 509084, 509571, 509831, 509827, 509666, 509226, 508007, 505807, 503246, 501048, 498976, 496145, 492380, 488653, 486014, 484654, 484168, 484270, 484946, 486288, 488454, 491576, 495509, 499832, 504184, 508402, 512318, 515689, 518428, 520593, 522049, 522364, 521165, 518448, 514587, 510217, 506038, 502343, 498744, 494721, 490438, 486678, 483922]
58759D83922k037j899k078k263k199j591m09Q95J926K783L532L708K971J964J730
58744D90955K461L472M183M490M377L940L746M315N255N655N354N108N397N944
58730E54652O523P436Q768R861J0007R209P915O431M891L438K110R34K62N85J797
58715F34819L119M059M959O180P336P792P608P344P132O493N050L009P90j436
58701G04254l790o375r046j1482j3460j5100j6642j7988j8615j8027j6202j3673
58689E43854j1238r566q799q477q047p437o938o594o058n165m295l952m134m323
58675D48831m020l196k223j391n25Q02K562M080M754M790M868N330O102P185Q520
58660D86469R493R244P708N721L946K238L48j406k614l327l725l672l159k760
$$ y = [483922, 481885, 479986, 477908, 475645, 473446, 471855, 471446, 472341, 474267, 477050, 480582, 484290, 487261, 489225, 490955, 493416, 496888, 501071, 505561, 509938, 513878, 517624, 521939, 527194, 532849, 538203, 543311, 548708, 554652, 561175, 568611, 577379, 587240, 597247, 606456, 614371, 620802, 625693, 629131, 631241, 632175, 632437, 633022, 634819, 637938, 641997, 646956, 653136, 660472, 668264, 675872, 683216, 690348, 696841, 701891, 704900, 705690, 704254, 700464, 694089, 685043, 673561, 660101, 645001, 628359, 610371, 591756, 573729, 557527, 543854, 532616, 523050, 514251, 505774, 497727, 490290, 483352, 476758, 470700, 465535, 461240, 457288, 453154, 448831, 444811, 441615, 439392, 438001, 437476, 438278, 440840, 444920, 449674, 454464, 459332, 464662, 470764, 477949, 486469, 495962, 505206, 512914, 518635, 522581, 524819, 525167, 523761, 521147, 517820, 514095, 510423, 507264, 504504]
58646E04504l012l551l531k772j967j762k127k637k877k500j393N8J216J814K116
58631D81579K327K294J929J584J628J913J955J577J065P54P76J187K020L115M155
58616E09858N017N905O963P968Q586Q785Q709Q275P266N762M104K406N22j372
58602E88754k635k937k804l061l841m580m874m912m980n002m695m023l210k404
58588E34796j439p2J624L281M689O057P563Q822R242Q871Q458Q505Q739Q704Q398
58573F26238Q040P600O987O412O198O457P117Q073R076R984J1287J3745J7176
58560G44390K0201K1824K2543K3161K3145K1314J7776J4016J1063Q627O123L588
58548I37771J305o86k351l627m739o060p525q840j0240j2240j4585j6332j7220
$$ y = [504504, 501492, 497941, 494410, 491638, 489671, 487909, 485782, 483145, 480268, 477768, 476375, 476433, 477649, 479463, 481579, 483906, 486200, 488129, 489713, 491341, 493254, 495209, 496786, 497851, 498605, 499381, 500568, 502588, 505703, 509858, 514875, 520780, 527743, 535711, 544297, 553082, 561791, 570066, 577332, 583094, 587198, 589604, 590126, 588754, 586119, 583182, 580378, 577317, 573476, 568896, 564022, 559110, 554130, 549128, 544433, 540410, 537200, 534796, 533357, 533285, 534909, 538190, 542879, 548936, 556499, 565321, 574563, 583434, 591892, 600397, 609136, 617840, 626238, 634278, 641878, 648865, 655277, 661475, 667932, 675049, 683122, 692198, 702182, 713469, 727214, 744390, 764591, 786415, 808958, 832119, 855264, 876578, 894354, 908370, 919433, 928060, 934183, 937771, 939076, 938390, 936039, 932412, 927673, 921613, 914088, 905248, 895008, 882768, 868183, 851851, 834631]
58535H34631j8011j9136j9929j9694j8687j7411j5647j2991r870p216n392m072
58523F66575k936j888p75N68J941K867L118K919K732K855L251L590L658L526L218
58508F95219K423R99n10j420j866k478l202l357k976l066m187n588o281o187n694
58493F51829m850l693k748k411k308j890j251o75J15J479K991L875M199M812O185
58478F55659P939R493J0617J1246J1334J1003J0463R588P898N119J667j510l645
58465G46871m767n548o418p005o750n854n005m295l072j034J241L088M402N192
58451G11046N285M832M481M421L877K112n16l042m957o263o926o879o287n361
58437F95823m143k823j738p85N38K111L001K851K714L709N481O866P550Q156R070
$$ y = [834631, 816620, 797484, 777555, 757861, 739174, 721763, 706116, 693125, 683255, 676039, 670647, 666575, 663639, 661751, 660976, 661544, 663485, 666352, 669470, 672389, 675121, 677976, 681227, 684817, 688475, 692001, 695219, 697642, 698641, 698131, 696711, 694845, 692367, 689165, 685808, 682832, 679766, 675579, 669991, 663710, 657523, 651829, 646979, 643286, 640538, 638127, 635819, 633929, 632678, 632003, 632118, 633597, 636588, 640463, 644662, 649474, 655659, 663598, 673091, 683708, 694954, 706288, 717291, 727754, 737342, 745240, 750359, 752026, 750516, 746871, 742104, 736556, 730138, 723133, 716383, 710529, 705524, 701229, 698157, 697123, 698364, 701452, 705854, 711046, 716331, 721163, 725644, 730065, 733942, 736054, 735538, 732496, 727539, 721276, 714350, 707471, 701184, 695823, 691680, 688857, 687119, 686334, 686872, 688983, 691984, 694835, 697549, 701258, 706739, 713605, 721155, 729311, 738381]
58422G38381J0143J1232J2171J2389J1450R802Q228O712M679K184o5j818l542
58409H21946n495p261q414q989r156q947q487q030p651p158o390n315l956k382
58395G24315p02J071K861M172M353L525K646K282J878P43q15j921k226j993j515
58380G38674j039q16p02r6J226K736L982N084N948N956N128M594N006N497N334
58365G86512N492P114R342J0427J0458J1005J2332J2925J2000J0708J0268J0301
58353I08884R694Q069N866L821K659K619L012K908K322K056K519L467M779O494
58339I69169Q188R276R917J0740J1827J2824J3785J4842J5396J4875J3995J3909
58327A118743J4199J3226J0606P843O288N773N554N275M678L548K387K111K767
$$ y = [738381, 748524, 759756, 771927, 784316, 795766, 805568, 813796, 820508, 825187, 827371, 827306, 825488, 821946, 816451, 809190, 800776, 791787, 782631, 773684, 765197, 757167, 749516, 742358, 735968, 730653, 726697, 724315, 723613, 724684, 727545, 731717, 736070, 739595, 742241, 744523, 746401, 747144, 746329, 744408, 742182, 740189, 738674, 737635, 736819, 736117, 736021, 737247, 739983, 743965, 749049, 754997, 760953, 766081, 770675, 775681, 781178, 786512, 792004, 799118, 808460, 818887, 829345, 840350, 852682, 865607, 877607, 888315, 898583, 908884, 918578, 926647, 932513, 936334, 938993, 941612, 944624, 947532, 949854, 951910, 954429, 957896, 962675, 969169, 977357, 986633, 996550, 1007290, 1019117, 1031941, 1045726, 1060568, 1075964, 1090839, 1104834, 1118743, 1132942, 1146168, 1156774, 1164617, 1170905, 1176678, 1182232, 1187507, 1192185, 1195733, 1198120, 1200231, 1202998]
58314A202998L594M383N687P537R208J0480J1842J3287J4112J4240J4487J5231
58302A327086J6033J6705J7516J8176J8011J7323J7164J7520J7253J6176J5531
58291A514494J5896J6266J5949J5821J6865J8749K0692K2567K4368K5749K6762
58280A734178K8115L0051L1914L3206L4070L4548L4473L4257L4524L4871L4396
58269B098603L3548L3872L5823L8477M1400M4884M8335N0648N2466N5631N9992
58258B593679O3324O4986O6850O9629P1259P0488O9297O9860P1486P2643P3861
58247C357362P6487Q0263Q4295Q8945R4875J01468J07916J14590J21992J29690
58237D357883J37534J46371J56410J66589J76661J88009K01280K15295K29396
$$ y = [1202998, 1206592, 1210975, 1216662, 1224199, 1233407, 1243887, 1255729, 1269016, 1283128, 1297368, 1311855, 1327086, 1343119, 1359824, 1377340, 1395516, 1413527, 1430850, 1448014, 1465534, 1482787, 1498963, 1514494, 1530390, 1546656, 1562605, 1578426, 1595291, 1614040, 1634732, 1657299, 1681667, 1707416, 1734178, 1762293, 1792344, 1824258, 1857464, 1891534, 1926082, 1960555, 1994812, 2029336, 2064207, 2098603, 2132151, 2166023, 2201846, 2240323, 2281723, 2326607, 2374942, 2425590, 2478056, 2533687, 2593679, 2657003, 2721989, 2788839, 2858468, 2929727, 3000215, 3069512, 3139372, 3210858, 3283501, 3357362, 3433849, 3514112, 3598407, 3687352, 3782227, 3883695, 3991611, 4106201, 4228193, 4357883, 4495417, 4641788, 4798198, 4964787, 5141448, 5329457, 5530737, 5746032, 5975428]
58228E975428K44685K61779K79912K99403L22275L49090L77983M08217M41614
58219H960386M79105N19467N63117O13365O72051P37973Q11749Q97851R99497
58210A5254561J116300J249729J406004J590930J807571K062344K367945K737676
58202B9593060L183967L724834M381799N167681O090244P177781Q489510J0088830
58194G7897706J2013443J4274908J6865216J9748001K2859708K6109491K9273646
58187B19042119L1761528L2503030L0284591K4467932J5536614M965265n486397
58180C53074682j4470477k1300578k5812789k8148590k8630632k7694241k5808266
58173A81209109k3393105k0771022j8157630j5682569j3421013j1415632r681702
$$ y = [5975428, 6220113, 6481892, 6761804, 7061207, 7383482, 7732572, 8110555, 8518772, 8960386, 9439491, 9958958, 10522075, 11135440, 11807491, 12545464, 13357213, 14255064, 15254561, 16370861, 17620590, 19026594, 20617524, 22425095, 24487439, 26855384, 29593060, 32777027, 36501861, 40883660, 46051341, 52141585, 59319366, 67808876, 77897706, 89911149, 104186057, 121051273, 140799274, 163658982, 189768473, 219042119, 250803647, 283306677, 313591268, 338059200, 353595814, 358561079, 353074682, 338604205, 317303627, 291490838, 263342248, 234711616, 207017375, 181209109, 157816004, 137044982, 118887352, 103204783, 89783770, 78368138, 68686436]
58166F8686436q208713o970800n938624n082143m369995l774431l276056k860161
58158B8205513k510968k213432j958047j739509j552095j389745j248735j126608
58150A4466374j019615r24079q38983p64446o98840o39744n86353n38645m95385
58141G960284m55188m18277l85147l54773l25985k99391k76021k55385k36561
58132D953556k19803k05381j92243j79511j67920j58084j48869j39282j30397
58123C412066j23449j17472j10864j03986r8159r3261q8353q3597p9571p5647
58113B437707p1051o6636o3603o1379n8689n5895n4213n3334n1861m9707m8113
58102A803226m7609m7616m7692m7611m6691m4618m2366m0752l8749l4992l0346
$$ y = [68686436, 60477723, 53506923, 47568299, 42486156, 38116161, 34341730, 31065674, 28205513, 25694545, 23481113, 21523066, 19783557, 18231462, 16841717, 15592982, 14466374, 13446759, 12522680, 11683697, 10919251, 10220411, 9580667, 8994314, 8455669, 7960284, 7505096, 7086819, 6701672, 6346899, 6020914, 5721523, 5445502, 5190117, 4953556, 4733753, 4528372, 4336129, 4156618, 3988698, 3830614, 3681745, 3542463, 3412066, 3288617, 3171145, 3060281, 2956295, 2858136, 2764875, 2676522, 2592925, 2513354, 2437707, 2366656, 2300020, 2236417, 2175038, 2116349, 2060454, 2006241, 1952907, 1901046, 1851339, 1803226, 1755617, 1708001, 1660309, 1612698, 1566007, 1521389, 1479023, 1438271, 1399522, 1364530, 1334184]
58091A334184k7010k5435k4105k2118k0051j8359j6815j5658j5474j5781j5415
58080A117963j4588j4840j6580j8297j8737j8378j8119j7892j7385j7056j7469
58069I28622j8286j8664j8219j7177j5932j4738j3564j2155j0549r349r036r284
58057G61669r473r584r851r980r524q829q617q881r047r056r267r432q853p608
58043F33667o585o240o245o389o856p449p530o932o158n526m934m582m971o037
58029E47233p069p675q054q284q207q078q321q541p862o452n570n705n868n279
58015D46268m583m600m896m550l629k893k549k230j876j690j504j003m79n57j118
58000D08111j233l61Q92J455R71O8l34J53J183K033K130J349J09p99p67l8M27
$$ y = [1334184, 1307174, 1281739, 1257634, 1235516, 1215465, 1197106, 1180291, 1164633, 1149159, 1133378, 1117963, 1103375, 1088535, 1071955, 1053658, 1034921, 1016543, 998424, 980532, 963147, 946091, 928622, 910336, 891672, 873453, 856276, 840344, 825606, 812042, 799887, 789338, 779989, 770953, 761669, 752196, 742612, 732761, 722781, 713257, 704428, 695811, 686930, 677883, 668827, 659560, 650128, 641275, 633667, 627082, 620842, 614597, 608208, 601352, 593903, 586373, 579441, 573283, 567757, 562823, 558241, 553270, 547233, 540164, 532489, 524435, 516151, 507944, 499866, 491545, 483004, 475142, 468690, 463120, 457415, 451547, 446268, 441685, 437085, 432189, 427639, 424010, 421117, 418568, 416338, 414462, 412772, 411268, 410265, 409786, 409229, 408111, 406878, 406517, 407409, 408864, 409835, 409903, 409569, 409722, 410905, 412938, 415068, 416417, 416526, 415727, 414960, 414922, 415349]
57983D15349M2p08j051j068j468k398l207l352k913k202j571j568k494l660l928
57968C83803l223k579k422j876m47P28L66q83j197n1J307J840J903K058J877P53
57952C81957p63j382o07P95J828K179K077J821J735K189L218M340N097N581O061
57937D16126O300N862N099N094O284P765Q393Q035P136N654L307M96j949l909
57923D79693n908p851q855q653q306q869j0089j0959j1029j0493r506q126o729
57910C64320n718m919l845k553j690j567j717j465o93J71O54O44M06K80L75N30
57894C43213O28P21P79N39j01p27p66j39O63J088R18K13p95j761k419k793l060
57877C36201l239l305l512m216n266n939n772n158m822m865m777m266l603l070
$$ y = [415349, 415391, 414683, 413632, 412564, 411096, 408698, 405491, 402139, 399226, 397024, 395453, 393885, 391391, 387731, 383803, 380580, 378001, 375579, 373703, 373256, 373984, 374350, 373467, 372270, 372219, 373526, 375366, 377269, 379327, 381204, 381957, 381194, 379812, 379205, 380000, 381828, 384007, 386084, 387905, 389640, 391829, 395047, 399387, 404484, 410065, 416126, 422426, 428288, 433387, 438481, 444765, 452530, 460923, 468958, 476094, 481748, 485055, 485551, 483602, 479693, 473785, 465934, 457079, 448426, 440120, 431251, 421162, 410203, 399174, 388681, 379175, 371049, 364320, 358602, 353683, 349838, 347285, 345595, 344028, 342311, 340846, 340153, 340324, 340978, 341622, 342028, 342308, 342683, 343213, 343841, 344562, 345341, 345880, 345779, 345052, 344286, 344147, 344810, 345898, 346816, 347029, 346234, 344473, 342054, 339261, 336201, 332962, 329657, 326145, 321929, 316663, 310724, 304952, 299794, 294972, 290107, 285330, 281064, 277461, 274391]
57863B74391k538j888j372j213j070m51N62J487K257L225M290M756M336L703L551
57848B94026L588L030J721K31j001k009k881l573m092m463m587m384m038l662
57834B67906k985j809n32L52J096K298L812M871N206N246N034M047K416J337J626
57819B99921K566K949K578J999J302J39j333k507l246l970m755n143n029n032
57805B80439n589o189n966m816l526k877k950l286l496l494l274k765k070j582
57791B28559j545j590j109j55N05L94oJ32J027K275L491M583N568O421P082P387
57775B63019P181O608O070N692N116M076K808J584K78j199k422l049l558m725
57761B87479o408p620p780p322o862o474o021n617n388n121m555l861l464l536
$$ y = [274391, 271853, 269965, 268593, 267380, 266310, 265859, 266421, 267908, 270165, 273390, 277680, 282436, 286772, 290475, 294026, 297614, 300644, 302365, 302596, 301595, 299586, 296705, 293132, 289040, 284577, 279990, 275606, 271568, 267906, 264921, 263112, 262580, 262932, 264028, 266326, 270138, 275009, 280215, 285461, 290495, 294542, 296958, 298295, 299921, 302487, 305436, 308014, 310013, 311315, 311454, 310121, 307614, 304368, 300398, 295643, 290500, 285471, 280439, 274850, 268661, 262695, 257879, 254353, 251476, 248526, 245240, 241744, 238250, 234976, 232211, 230141, 228559, 227014, 225424, 224315, 224160, 224665, 225059, 225053, 225185, 226212, 228487, 231978, 236561, 242129, 248550, 255632, 263019, 270200, 276808, 282878, 288570, 293686, 297762, 300570, 302154, 302432, 301233, 298811, 295762, 292204, 287479, 281071, 273451, 265671, 258349, 251487, 245013, 238992, 233375, 227987, 222866, 218311, 214450, 210986, 207450]
57747B07450l800l797l257k309j396q87p56p99j036j685k651l387l343k435j054
57732A74858J98P76N17k47j039j672k200k563k618k483k436k408j928q12M41J111
57716A57495R23J69o45j116j159j059j108j237j136p83m44j43M43J326J928J777
57700A55231J209R19J070J191R15L82o6l28m99o35o59m94k57k38n33p68l49Q54
57682A56945K330L499M270M993O057P722J0052J2836J5754J8833K2554K7263L2726
57669C25834L8384M3594M7208M7237M1783L0607J5576m50j5058k6817l5141m0000
57657D72757m1668m0589l7485l3397k9273k5466k1897j8609j5832j3511j1305
57646A83725r156p487o502n735m670l485k732k471k241j851j661j909k187j920
$$ y = [207450, 203650, 199853, 196596, 194287, 192891, 192004, 191248, 190449, 189413, 187728, 185077, 181690, 178347, 175912, 174858, 175056, 175832, 176349, 176102, 175063, 173391, 171191, 168628, 166010, 163527, 161091, 158683, 156755, 155943, 156384, 157495, 158418, 158587, 157942, 156826, 155667, 154608, 153500, 152263, 151127, 150344, 149900, 149757, 150200, 151526, 153454, 155231, 156440, 157359, 158429, 159620, 160535, 160917, 160851, 160523, 160024, 159389, 158730, 158236, 157979, 157741, 157208, 156440, 156091, 156945, 159275, 162774, 167044, 172037, 178094, 185816, 195868, 208704, 224458, 243291, 265845, 293108, 325834, 364218, 407812, 455020, 502257, 544040, 574647, 590223, 589773, 574715, 547898, 512757, 472757, 431089, 390500, 353015, 319618, 290345, 264879, 242982, 224373, 208541, 195030, 183725, 174569, 167082, 160580, 154845, 150175, 146690, 143958, 141487, 139246, 137395, 135734, 133825, 131638, 129718]
57632A29718j159n12l61m45k74J49L09j97j078j603j476j194j370j830j809j057
57616A15811k34J9M9N75J371J355J59j158j470j090j131j718j815r33k5j38r13
57599A08714j162n61N5nm58o94n68k99pK45J91m12j358j991j720m90J076J974
57581A02530J529P0j272j566q58J24Q20J123J103P64J56n61j226j752k046k015
57565I6923j707j265p83l01O8J97J20K8O6K51N91J093J641K011K076J895J522
57548A04426Q85qq75j248q59P3R16J047L76n90j206j176o00K16Q33P92M7q00j093
57529A01156q70o57n93l87j33m39j381j999j457k40M49J69n02r02p71j0J179J913
57511I4525J336j28r69m36O36J154J200J384J563J115K07k40Q8M44R9p31j386
$$ y = [129718, 128559, 128047, 127686, 127241, 126967, 127116, 127425, 127228, 126150, 124547, 123071, 121877, 120507, 118677, 116868, 115811, 115577, 115596, 115645, 116220, 117591, 118946, 119105, 117947, 116477, 115387, 114256, 112538, 110723, 109790, 109765, 109627, 108714, 107552, 106991, 107046, 107041, 106583, 105889, 105321, 105022, 105015, 105260, 105451, 105039, 103681, 101690, 99970, 99480, 100556, 102530, 104059, 104129, 102857, 101291, 100433, 100557, 101377, 102500, 103603, 104367, 104523, 103962, 102736, 100984, 98938, 96923, 95216, 93951, 93168, 92867, 92935, 93132, 93252, 93280, 93346, 93597, 94188, 95281, 96922, 98933, 101009, 102904, 104426, 105311, 105303, 104428, 103180, 102321, 102394, 103310, 104357, 104733, 104143, 102937, 101761, 101161, 101377, 102210, 103002, 103049, 102249, 101156, 100286, 99629, 99036, 98649, 98516, 98077, 96696, 94697, 93240, 93000, 93449, 93618, 93116, 92214, 91443, 91433, 92612, 94525, 95861, 95733, 94764, 94328, 94964, 96118, 97318, 98702, 100265, 101380, 101587, 101347, 101435, 101879, 101978, 101247, 99861]
57494I9861j663j782j849j749j449j019m95L0K26j87r10j187n84M39J038R17N03
57477I0140K03j07o29j040p92O2Q01Q53K97m88j222j651j590j284j326j800j950
57460G8477j159Q7Q27R07R49J196J173O46J29J09L14K33j36m50o34q04q50n05
57442H0509J77Q26J152J129Q65N71N65R50J296R92L3q44r56m05J39K72J95K92
57424H7758N97Q01O55K36j83l55j83K15N09L59k06p16p45l81o2m8k08l32m09n64
57404H6738q40j043q42j34O27P72K07l63l54o8r4k84J5Q08J328J090M17j99n50
57385H7231m01M20J321J252J89m88K21J542K141J941J776J777J348M84j43l24
57369A00287m85o69m33R8J85k47l45K25O67L84k6J47N56N03J12j03k33n67o68
$$ y = [99861, 98198, 96416, 94567, 92818, 91369, 90350, 89855, 89885, 90111, 89924, 89014, 87827, 87243, 87682, 88720, 89637, 90140, 90343, 90236, 89607, 88567, 87775, 87837, 88638, 89491, 89788, 89300, 88078, 86427, 84837, 83553, 82227, 80427, 78477, 77318, 77405, 78232, 79139, 80088, 81284, 82457, 83103, 83232, 83341, 83655, 83888, 83752, 83302, 82668, 81864, 81014, 80509, 80686, 81512, 82664, 83793, 84658, 85229, 85794, 86744, 88040, 89032, 89065, 88221, 87265, 86860, 86999, 87271, 87466, 87758, 88355, 89156, 89811, 90047, 89864, 89509, 89326, 89541, 90050, 90409, 90203, 89487, 88742, 88361, 88299, 88251, 88043, 87711, 87302, 86738, 85898, 84855, 84013, 83879, 84506, 85278, 85485, 85122, 84768, 84700, 84606, 84322, 84337, 85145, 86473, 87563, 87980, 87781, 87231, 86830, 87250, 88571, 89823, 90012, 89524, 89745, 91287, 93428, 95369, 97145, 98922, 100270, 100754, 100611, 100287, 99802, 99133, 98700, 98798, 98983, 98736, 98391, 98616, 99283, 99667, 99641, 99788, 100344, 100847, 100959, 100856, 100623, 100056, 99388]
57350I9388M3J112J506J174J089J652K042J466K66o43q55o09l18l11p04j168j103
57333A04027l23O12J016P90L43lk39m43n61m91k88k06m79r56j135p34j12J42o5
57314A00895k92k18NJ15J60L73Q17J262J373J067P41R63J749K346K029R08l12
57297A13981j086j203n90M46J076P83K03K65P10M73m33p03K61J338J409R41Q97
57280A18768J113Q86M97P34J421J668J454J571K111K298J987K041K851L640L722
57265A46762L474L403L200K434J484R85Q69P02N70Q89J604K186K312K094J773
57250A74741J582J636J655J154K25k67K18J080J434J339J454J817J851J470J254
57235A92643J467J682J621J572J753J893J823J872K273K634K527K166K068K309
$$ y = [99388, 99431, 100543, 102049, 103223, 104312, 105964, 108006, 109472, 109738, 109095, 108240, 107631, 107313, 107002, 106298, 105130, 104027, 103704, 104316, 105332, 106122, 106465, 106462, 106223, 105780, 105219, 104728, 104440, 104234, 103755, 102799, 101664, 100930, 100818, 100960, 100895, 100603, 100385, 100390, 100505, 100665, 101038, 101855, 103117, 104490, 105557, 106298, 107261, 109010, 111356, 113385, 114293, 113981, 112895, 111692, 111102, 111548, 112624, 113407, 113610, 113875, 114585, 115058, 114625, 113922, 114183, 115521, 116930, 117871, 118768, 119881, 120767, 121264, 121998, 123419, 125087, 126541, 128112, 130223, 132521, 134508, 136549, 139400, 143040, 146762, 150236, 153639, 156839, 159273, 160757, 161742, 162611, 163313, 163883, 164772, 166376, 168562, 170874, 172968, 174741, 176323, 177959, 179614, 180768, 180993, 180726, 180944, 182024, 183458, 184797, 186251, 188068, 189919, 191389, 192643, 194110, 195792, 197413, 198985, 200738, 202631, 204454, 206326, 208599, 211233, 213760, 215926, 217994, 220303]
57221B20303K573K728K903L089L124K998K788K425J898J613J998K748K979K421
57207B56588J883K093K559K251J197N53R56J604J469Q12Q05J894L319M178M375
57192B86536M352M550N308O748Q450R660J0116J0353J0910J1605J1949J1933J1901
57179D04371J1926J1794J1505J1316J1358J1531J1702J1764J1534J0970J0365
57168E30136J0082J0156J0448J1028J2086J3506J4873J5851J6302J6213J5809
57157F76490J5598J5973J6804J7718J8586J9442K0128K0478K0701K1147K1725
57146H84790K2021K1937K1861K2215K3112K4381K5541K6046K5954K6117K7274
57135A151249K9229L1509L4410L8552M3603M8494N2956N7851O3825P0409P6547
$$ y = [220303, 222876, 225604, 228507, 231596, 234720, 237718, 240506, 242931, 244829, 246442, 248440, 251188, 254167, 256588, 258471, 260564, 263123, 265374, 266571, 267124, 268080, 269684, 271153, 271965, 272770, 274664, 277983, 282161, 286536, 290888, 295438, 300746, 307494, 315944, 325604, 335720, 346073, 356983, 368588, 380537, 392470, 404371, 416297, 428091, 439596, 450912, 462270, 473801, 485503, 497267, 508801, 519771, 530136, 540218, 550374, 560822, 571850, 583936, 597442, 612315, 628166, 644468, 660681, 676490, 692088, 708061, 724865, 742583, 761169, 780611, 800739, 821217, 841918, 863065, 884790, 906811, 928748, 950609, 972824, 995936, 1020317, 1045858, 1071904, 1097858, 1123975, 1151249, 1180478, 1211987, 1246397, 1284949, 1328552, 1377046, 1430002, 1487853, 1551678, 1622087, 1698634]
57124A698634Q1211Q3389Q2709Q0550P9665Q1975Q7360R4810J03863J14221J25012
57113B713399J35472J46048J57974J71934J87842K05768K26620K51923K83139
57104D480119L21105L66233M19791M84923N65876O66299P89145R37984J117108
57095A0148583J329912J578048J861724K178785K522693K882831L246934L601446
57087B9350956L930038M216090M447521M612400M683213M609567M338279L847974
57079F4036038L164367K343415J445364N24944l65430j178059j881019k464240
57071F5625380k933294l299005l571784l760204l869840l902904l860466l745782
57063C6682101l566227l333657l063721k773864k480300k195914j930035j688773
$$ y = [1698634, 1779845, 1863234, 1945943, 2026493, 2106158, 2188133, 2275493, 2370303, 2474166, 2588387, 2713399, 2848871, 2994919, 3152893, 3324827, 3512669, 3718437, 3945057, 4196980, 4480119, 4801224, 5167457, 5587248, 6072171, 6638047, 7304346, 8093491, 9031475, 10148583, 11478495, 13056543, 14918267, 17097052, 19619745, 22502576, 25749510, 29350956, 33280994, 37497084, 41944605, 46557005, 51240218, 55849785, 60188064, 64036038, 67200405, 69543820, 70989184, 71514128, 71148698, 69970639, 68089620, 65625380, 62692086, 59393081, 55821297, 52061093, 48191253, 44288349, 40427883, 36682101, 33115874, 29782217, 26718496, 23944632, 21464332, 19268418, 17338383, 15649610]
57055A5649610j474896j288077j126342r87608q69905p70736o86952o15479n54048
57046G275567n01112m55255m14982l79203l47743l20898k98382k78989k61391
57037D017612k44843k28947k13268j97615j82401j68196j55152j43111j32036
57028B352043j21900j12480j03695r5842q9065q2880p6756p0833o5535o0770n6206
57017A416081n2095m8988m6693m4330m1453l8445l5718l3265l1133k9582k8468
57006I85911k7111k5180k3111k1416k0085j9067j8577j8509j8077j6765j5211
56995G62802j4380j4177j3605j2231j0644r365p970n717k661K67K158K847K780
56982F80104K373J521k10k967o258r350j1937j4168j6044j7069j6707j5020j2721
$$ y = [15649610, 14174714, 12886637, 11760295, 10772687, 9902782, 9132046, 8445094, 7829615, 7275567, 6774455, 6319200, 5904218, 5525015, 5177272, 4856374, 4557992, 4279003, 4017612, 3772769, 3543822, 3330554, 3132939, 2950538, 2782342, 2627190, 2484079, 2352043, 2230143, 2117663, 2013968, 1918126, 1829061, 1746181, 1669425, 1598592, 1533057, 1472287, 1416081, 1363986, 1314998, 1268305, 1223975, 1182522, 1144077, 1108359, 1075094, 1043961, 1014379, 985911, 958800, 933620, 910509, 889093, 869008, 849941, 831364, 812855, 794778, 778013, 762802, 748422, 734245, 720640, 708409, 697765, 688400, 680430, 674713, 672052, 672319, 674477, 677324, 680104, 682477, 683998, 683788, 680821, 674563, 665213, 653276, 639108, 623064, 605995, 589288, 574268, 561547]
56969E61547j0627r091p850o342m218j640R66L396N803Q328J0832J3044J4692
56956E78840J5288J4127J0889O123P49m818j0537j5804j9360k0545k0039j8889
56944E16024j7247j4667j1291p929n002k185P57L521N992Q761J2510J7047K1378
56931E27669K4397K5231K3250J8231J0618J445p899j5934k1607k4866k6557k7477
56919E06501k7661k6742k4632k1660j8322j5256j3070j1772j0609q904o853n145
56907C15875m082l489l267l323l121k065m23P60R60Q39J336K561L945N171O411
56892C18088P872R597J1695J4429J7777K1075K3291K3686K2158J8919J4043P620
56880E10250L63o251j0792j2866j3184j2685j1656r753o766l281l52J734M135
$$ y = [561547, 550920, 541829, 533979, 527637, 523419, 521779, 522745, 526141, 531944, 540272, 551104, 564148, 578840, 594128, 608255, 619144, 625267, 626016, 621198, 610661, 594857, 575497, 554952, 534913, 516024, 498777, 484110, 472819, 464890, 459888, 457703, 458460, 461981, 467973, 476734, 489244, 506291, 527669, 552066, 577297, 600547, 618778, 629396, 630841, 622942, 607008, 585401, 560535, 533978, 506501, 478840, 452098, 427466, 405806, 387484, 372228, 359158, 347386, 336777, 327873, 321020, 315875, 311793, 308304, 305037, 301714, 298593, 296528, 296105, 296865, 297825, 298664, 300000, 302561, 306506, 311677, 318088, 325960, 335557, 347252, 361681, 379458, 400533, 423824, 447510, 469668, 488587, 502630, 510250, 510613, 504362, 493570, 480704, 467520, 454835, 443179, 433426, 426660, 423379, 423027, 424761, 428896]
56867D28896Q364J4479K0971K6656L1977L7880M3980M8630N0443M8829M3297L3408
56855H37810J9867M873r146k0799k9525l4871l6575l5058l1247k5950j9661j2773
56843F06945n571J904R815J8351K7672L7820M8487N9014O8717P6878Q2136Q2119
56831A114287P4392N8161L5182R026j6480l8405n5009o5556p0226p0021o6386
56820I08965o0528n3028m4143l4316k4246j4490n169L973J3302K2893L2280M0805
56808G86298M8194N4281N7650N5243M4498K6164M356j6412l3768m7152n6221o0647
56796H62484o0941n8444n4257m8752m2125l4898k7641k0560j3571o627J83O708
56784E01559J2751J8144K2802K6549K8724K8147K3736J5382M347p310j7768k6137
$$ y = [428896, 437260, 451739, 472710, 499366, 531343, 569223, 613203, 661833, 712276, 761105, 804402, 837810, 857677, 862550, 853404, 832605, 803080, 768209, 731634, 696576, 665329, 639379, 619718, 606945, 601374, 603278, 613093, 631444, 659116, 696936, 745423, 804437, 873154, 950032, 1032168, 1114287, 1188679, 1246840, 1282022, 1291048, 1274568, 1236163, 1181154, 1115598, 1045372, 975351, 908965, 848437, 795409, 751266, 716950, 692704, 678214, 673045, 677018, 690320, 713213, 745493, 786298, 834492, 888773, 946423, 1001666, 1046164, 1072328, 1076684, 1060272, 1026504, 979352, 923131, 862484, 801543, 743099, 688842, 640090, 597965, 563067, 535426, 514866, 501295, 494668, 494851, 501559, 514310, 532454, 555256, 581805, 610529, 638676, 662412, 677794, 682141, 674831, 657063, 630926]
56772F30926l2282l6269l8054l7680l5493l2181k8537k5176k2299j9748j7392
56761C05815j5360j3756j2272j0420q166o065m661l965l636l493l643m132m648
56748B11598m653l922k867k162k034k111k108k212k521k553j894j099j154k078
56734A78230k710k193r43R2N84P72P77N79L85M79P91J046J241J573J920J807J034
56717A85464O2m53l60r7j58n50q81q28m37J01O80J160J257Q83M52M66Q78J194
56699A88833J171J004Q21N33J82Nn3l53r25j302j194q81o66m05O5N18P03P60P70
56680A89586M11m39j119q70J5M25j40r65j095m71J52J85j76k66K29Q87J018N06
56662A87873q1k49j27o0M1N66J513K298K333J645Q45N64R40J577K042K266K455
$$ y = [630926, 598644, 562375, 524321, 486641, 451148, 418967, 390430, 365254, 342955, 323207, 305815, 290455, 276699, 264427, 254007, 245841, 239776, 235115, 231150, 227514, 224021, 220378, 216246, 211598, 206945, 203023, 200156, 197994, 195960, 193849, 191741, 189529, 187008, 184455, 182561, 181462, 180308, 178230, 175520, 173327, 172384, 172476, 173060, 173832, 174609, 175188, 175573, 176052, 176843, 177889, 179130, 180703, 182623, 184430, 185464, 185526, 185073, 184713, 184616, 184458, 183908, 183027, 182199, 181762, 181863, 182543, 183703, 184960, 185843, 186295, 186761, 187639, 188833, 190004, 191008, 191829, 192362, 192544, 192549, 192496, 192143, 191218, 189916, 188722, 187841, 187175, 186770, 186835, 187353, 188056, 188816, 189586, 189997, 189558, 188439, 187569, 187584, 188009, 187869, 186904, 185809, 185338, 185490, 185675, 185499, 185233, 185462, 186349, 187367, 187873, 187792, 187543, 187416, 187356, 187397, 187963, 189476, 191774, 194107, 195752, 196597, 197161, 198101, 199678, 201720, 203986, 206441]
56645B06441K715L006L250L266K769J810R96Q00P68J63p88j095n44q4l34o28j66
56628B22345P41J298J423J464J280N06n01r25n88j22q5n07j181j877k330k489
56612B18452k628k848k772k164j516j412j675j754j682j805j927j518o97j14Q5
56597A94025L65Q66J169J075Q23M78k07j097j611j505j122o82n8O39R14O10K54
56580A94936L46P94J239J440J223N85K2J36P86J186J019Q06J038J590K245L086
56564B12477M061M814N324O120P354Q299Q215P182N669L854J893L95j15J39N22
56549B76203P19O99L30m24j231j776k179k538k474j728r32j012j863k360j798
56534B57636p50j99l10m73l24k67q38j856k529k473k197k315k532k051q75m4l52
$$ y = [206441, 209156, 212162, 215412, 218678, 221447, 223257, 224253, 225053, 225821, 225984, 225196, 224101, 223557, 223473, 223139, 222511, 222345, 223086, 224384, 225807, 227271, 228551, 229057, 228556, 227631, 227043, 226921, 226836, 226329, 225148, 223271, 220941, 218452, 215824, 212976, 210204, 208040, 206524, 205112, 203437, 201683, 200001, 198196, 196269, 194751, 194054, 193940, 194025, 194390, 195256, 196425, 197500, 198323, 198801, 198594, 197497, 195886, 194381, 193259, 192577, 192519, 193158, 194072, 194682, 194936, 195282, 196076, 197315, 198755, 199978, 200563, 200585, 200721, 201507, 202693, 203712, 204518, 205556, 207146, 209391, 212477, 216538, 221352, 226676, 232796, 240150, 248449, 256664, 263846, 269515, 273369, 275262, 275657, 275542, 275681, 276203, 276922, 277621, 277951, 277527, 276296, 274520, 272341, 269803, 267329, 265601, 264669, 263657, 261794, 259434, 257636, 256886, 256687, 256377, 255904, 255580, 255313, 254475, 252619, 250090, 247617, 245420, 243105, 240573, 238522, 237647, 237603, 237251]
56517B37251j407k292k633k575k147j305l86O0q7m19n62m84k76J6K45J58l33r24
56499B21900j109o08L24J034J053N34O1N9M58Q49P78L7j066j833j876j572j442
56482B17581j317o81K87P74N40K63M06N63L35J12L49O47L57l21n60p6N95Q99P31
56463B21484K25l54m91J97J332J985J684R01L92L34L18J8l72m03J9N00O71O81
56445B29121Q71J104R11K84j64o6J88Q5k82n19n85o97p93o52l44j40mM15J183
56426B29916J766J417o0j838k522j434M95J618J429J033J477K352K545J879J165
56411B41238R55R86Q62N76K58q6l58k96K35J026J706J981J714R93J11n75q03m67
56393B50056K95J041J376J365J317J208P74K60L17R29J152M65l17j61P56J453
$$ y = [237251, 235844, 233552, 230919, 228344, 226197, 224892, 224506, 224566, 224479, 224060, 223498, 223014, 222738, 222754, 222999, 223157, 222824, 221900, 220791, 220183, 220507, 221541, 222594, 223128, 223189, 223248, 223706, 224555, 225333, 225370, 224304, 222471, 220595, 219023, 217581, 216264, 215583, 215870, 216644, 217184, 217447, 217853, 218416, 218751, 218863, 219212, 219859, 220216, 219895, 219335, 219259, 219854, 220753, 221484, 221709, 221355, 220864, 221061, 222393, 224378, 226062, 226963, 227355, 227689, 228007, 228025, 227653, 227250, 227269, 227769, 228440, 229121, 229992, 231096, 232007, 232291, 232127, 232061, 232249, 232334, 232052, 231533, 230948, 230251, 229458, 228806, 228462, 228322, 228318, 228733, 229916, 231682, 233099, 233039, 231201, 228679, 227245, 227740, 229358, 230787, 231820, 233297, 235649, 238194, 240073, 241238, 242193, 243179, 244041, 244617, 244875, 244789, 244431, 244135, 244370, 245396, 247102, 249083, 250797, 251790, 251901, 251326, 250523, 250056, 250351, 251392, 252768, 254133, 255450, 256658, 257432, 257692, 258009, 258938, 260090, 260555, 260238, 260077, 260833, 262286]
56377B62286J568J476J373J129Q81Q85Q79M51j9K75J207J734J457J161J375J433
56361B79551O53l26l81L85P55J61n93n86j4L46L67N69J082J367J191J161J764
56344B87452K367J967P68O5M62J142J240J061J282J695J632J202J108J456J675
56329C06574J554J514J754J908J808J862K337K768K501J570O49K87L70L20k13
56314C27563r18j154p64k48LK89J063K137K853K871K431K029K180L129M383M875
56298C52722M130K974K463K492K221J602J461K116K865L048K774K323J652R28
56284C85771Q25J712K959L606L499L383L945N042N865N800N157M896N521O537
56270D44518P255P723Q410R264R877J0346J1190J2428J3553J4483J5732J7454
$$ y = [262286, 263854, 265330, 266703, 267832, 268713, 269598, 270477, 270928, 270909, 271184, 272391, 274125, 275582, 276743, 278118, 279551, 280204, 279878, 279497, 279882, 280637, 280798, 280205, 279619, 279605, 279951, 280318, 280887, 281969, 283336, 284527, 285688, 287452, 289819, 291786, 292554, 292619, 293081, 294223, 295463, 296524, 297806, 299501, 301133, 302335, 303443, 304899, 306574, 308128, 309642, 311396, 313304, 315112, 316974, 319311, 322079, 324580, 326150, 326799, 327086, 327456, 327776, 327563, 326645, 325491, 324727, 324479, 324482, 324771, 325834, 327971, 330824, 333695, 336126, 338155, 340335, 343464, 347847, 352722, 356852, 359826, 362289, 364781, 367002, 368604, 370065, 372181, 375046, 378094, 380868, 383191, 384843, 385771, 386596, 388308, 391267, 394873, 398372, 401755, 405700, 410742, 416607, 422407, 427564, 432460, 437981, 444518, 451773, 459496, 467906, 477170, 487047, 497393, 508583, 521011, 534564, 549047, 564779, 582233]
56258E82233J9209K0922K3225K6413K9851L2974L6224M0344M5237N0249N5186
56247I62067O0343O5652P0514P4484P7612Q0012Q1432Q1441P9800P6526P1645
56236A781528O4973N6246M5538L3456K0719P690n409j7989k9231l8829m7177n4630
56224A816885o0904o5375o7779o8495o8251o7620o6634o4905o2221n8913n5427
56213A110361n1821m7988m4215m0917l7988l4952l1774k8955k6681k4505k1965
56202G18600j9111j6209j3436j1050r412q537p920p107o232n764n862o055n567
56189E96338m035k084r96j484k905l949l860k763j197R7L24o02j553j225L33J933
56173E72372K866L415L825L793L360L321M167N281N780N677N680O177O906P489
$$ y = [582233, 601442, 622364, 645589, 672002, 701853, 734827, 771051, 811395, 856632, 906881, 962067, 1022410, 1088062, 1158576, 1233060, 1310672, 1390684, 1472116, 1553557, 1633357, 1709883, 1781528, 1846501, 1902747, 1948285, 1981741, 2002460, 2010150, 2004741, 1986752, 1957521, 1918692, 1871515, 1816885, 1755981, 1690606, 1622827, 1554332, 1486081, 1418461, 1351827, 1286922, 1224701, 1165788, 1110361, 1058540, 1010552, 966337, 925420, 887432, 852480, 820706, 791751, 765070, 740565, 718600, 699489, 683280, 669844, 658794, 649382, 640845, 632925, 625818, 619586, 613822, 607960, 601905, 596338, 592303, 590219, 589223, 587739, 584834, 580885, 577025, 574262, 573065, 573162, 573486, 572884, 571331, 570106, 570439, 572372, 575238, 578653, 582478, 586271, 589631, 592952, 597119, 602400, 608180, 613857, 619537, 625714, 632620, 640109]
56159F40109P891Q434R427J0734J1783J2288J2826J4251J6721J9694K2762K5984
56147H12904K9518L3574L8576M4811N2004N9845O8603P8472Q8471R6987J03147
56136A506912J06662J06500J01259R1276P9213O7969N8823N1817M6634M2386L7449
56125B296900L0512K1508J1321J218p349j3424j7578k1573k6735l3354m1744n2491
56113B147211o5064p7271q6833r2833r5117r3502q8311q0816p2291o3259n4155
56102A277759m5774l8382l1432k4839j9498j5721j2371q587n253l448k458q39
56090A069157J276K533K563K321K431K658K969L728M719N154M925M892N647O854
56076A121827P981Q897R533R732R788J0467J2046J3720J4446J4161J3796J4105
$$ y = [640109, 648000, 656434, 665861, 676595, 688378, 700666, 713492, 727743, 744464, 764158, 786920, 812904, 842422, 875996, 914572, 959383, 1011387, 1071232, 1139835, 1218307, 1306778, 1403765, 1506912, 1613574, 1720074, 1821333, 1912609, 1991822, 2059791, 2118614, 2170431, 2217065, 2259451, 2296900, 2327412, 2348920, 2360241, 2361459, 2354110, 2340686, 2323108, 2301535, 2274800, 2241446, 2199702, 2147211, 2082147, 2004876, 1918043, 1825210, 1730093, 1636591, 1548280, 1467464, 1395173, 1331914, 1277759, 1231985, 1193603, 1162171, 1137332, 1117834, 1102113, 1089742, 1081155, 1075902, 1072454, 1069996, 1069157, 1070433, 1072966, 1075529, 1077850, 1080281, 1082939, 1085908, 1089636, 1094355, 1099509, 1104434, 1109326, 1114973, 1121827, 1129808, 1138705, 1148238, 1157970, 1167758, 1178225, 1190271, 1203991, 1218437, 1232598, 1246394, 1260499]
56064A260499J4897J5555J6082J7087J8717K0214K0914K1085K1221K1118K0511
56053A467900K0051K0514K1431K1708K1364K1251K1293K0647J9704K0126K2505
56042A698494K5551K8081L0246L2243L3531L4084L4848L6091L6772L6338L5706
56031B061985L5616L5638L5606L6416L8293M0002M0845M1930M4186M6817M8996
56020B506330N1447N4866N8337O0887O3205O6269O9645P2578P5443P8661Q1676
56009C239344Q4350Q7751R2171R6135R9031J02752J08818J15785J21660J27048
55999D274845J33669J41355J48924J56610J65318J74878J85072J96892K10690
55990E788253K24874K38489K53203K70665K90023L10385L33140L59282L87190
$$ y = [1260499, 1275396, 1290951, 1307033, 1324120, 1342837, 1363051, 1383965, 1405050, 1426271, 1447389, 1467900, 1487951, 1508465, 1529896, 1551604, 1572968, 1594219, 1615512, 1636159, 1655863, 1675989, 1698494, 1724045, 1752126, 1782372, 1814615, 1848146, 1882230, 1917078, 1953169, 1989941, 2026279, 2061985, 2097601, 2133239, 2168845, 2205261, 2243554, 2283556, 2324401, 2366331, 2410517, 2457334, 2506330, 2557777, 2612643, 2670980, 2731867, 2795072, 2861341, 2930986, 3003564, 3079007, 3157668, 3239344, 3323694, 3411445, 3503616, 3599751, 3698782, 3801534, 3910352, 4026137, 4147797, 4274845, 4408514, 4549869, 4698793, 4855403, 5020721, 5195599, 5380671, 5577563, 5788253, 6013127, 6251616, 6504819, 6775484, 7065507, 7375892, 7709032, 8068314, 8455504]
55981H455504M16054M48713M87661N31110N76759O26696O84527P50513Q23964
55972A3801501R07671J005284J117066J243197J388692J560332J762183J999598
55964B4785524K284431K631194L052787L566501M199642M982921N945202P122905
55956E8571107Q565406J0317761J2402048J4821805J7568248K0606454K3872911
55949A66725740K7289305L0684223L3551234L4854496L3263899K7876478J8912394
55942C73157769P763229l666571j3768321k1628737k6960116k9866232l0679760
55935B54351261k9872645k7965340k5431024k2634950j9823155j7144735j4685725
55928I6793687j2494707j0591535q969425p603865o464602n519973m736664m083967
$$ y = [8455504, 8871558, 9320271, 9807932, 10339042, 10915801, 11542497, 12227024, 12977537, 13801501, 14709172, 15714456, 16831522, 18074719, 19463411, 21023743, 22785926, 24785524, 27069955, 29701149, 32753936, 36320437, 40520079, 45503000, 51448202, 58571107, 67136513, 77454274, 89856322, 104678127, 122246375, 142852829, 166725740, 194015045, 224699268, 258250502, 293104998, 326368897, 354245375, 373157769, 380920998, 377254427, 363486106, 341857369, 314897253, 285031021, 254351261, 224478616, 196513276, 171082252, 148447302, 128624147, 111479412, 96793687, 84298980, 73707445, 64738020, 57134155, 50669553, 45149580, 40412916, 36328949]
55920C6328949l539046l084632k703460k379238k101246j863263j658757j480813
55912A7518494j325345j190299j072468r68348q76911p98081p29398o67334o10844
55903I279466n60507n15439m74051m36703m04264l75038l46448l18898k94732
55894E553386k74050k54751k36288k20014k05940j92285j78514j66039j55568
55885C669937j46098j36995j28830j21816j15215j08642j02392r6411r0413q4924
55875B538201q0801p7827p5170p2766p0863o8724o5555o2146n9844n8214n5631
55864A790660n1924m8580m6455m5044m3998m3577m3464m2739m1189l9298l6968
55853A307424l3708k9953k6836k4609k2756k1547k1858k3323k4297k3963k3150
$$ y = [36328949, 32789903, 29705271, 27001811, 24622573, 22521327, 20658064, 18999307, 17518494, 16193149, 15002850, 13930382, 12962034, 12085123, 11287042, 10557644, 9890310, 9279466, 8718959, 8203520, 7729469, 7292766, 6888502, 6513464, 6167016, 5848118, 5553386, 5279336, 5024585, 4788297, 4568283, 4362343, 4170058, 3991544, 3825505, 3669937, 3523839, 3386844, 3258014, 3136198, 3020983, 2912341, 2809949, 2713538, 2623125, 2538201, 2457400, 2379573, 2304403, 2231637, 2160774, 2092050, 2026495, 1964349, 1904505, 1846291, 1790660, 1738736, 1690156, 1643701, 1598657, 1554659, 1511082, 1467618, 1424879, 1383690, 1344392, 1307424, 1273716, 1243763, 1216927, 1192318, 1169562, 1148015, 1126157, 1102834, 1078537, 1054574, 1031424]
55842A031424k2701k2334k1516k0403j9419j8741j8419j8264j7618j6012j4052
55831H21945j2809j2415j2148j1652j1161j0634r759q814q522r048r922j0887
55819F94174j1951j2832j3150j3044j2771j2122j1035j0247j0227j0080q754o888
55807E61073n927n799n140l628k321j610o44Q51J890J966J933K463K898K504J768
55792E52277J587K035K607L020L113K648J670N02j023l520o887r918j1607j2150
55778E24354j2174j1682j0288p958m940j430K131M745N361L657K13l894p574j0226
55764D70295j1893j2825j3013j2402j1252r816p976n800m110l718m305m818m863
55751C63504m890n164n478n744n996n806m685l090k067j809j586j138j117j870
$$ y = [1031424, 1008723, 986389, 964873, 944470, 925051, 906310, 887891, 869627, 852009, 835997, 821945, 809136, 796721, 784573, 772921, 761760, 751126, 741367, 732553, 724031, 714983, 705061, 694174, 682223, 669391, 656241, 643197, 630426, 618304, 607269, 597022, 586795, 576715, 567961, 561073, 555146, 549347, 544207, 540579, 538258, 536648, 536004, 536855, 538745, 540711, 542644, 545107, 548005, 550509, 552277, 553864, 555899, 558506, 561526, 564639, 567287, 568957, 569459, 568436, 564916, 558029, 548111, 536504, 524354, 512180, 500498, 490210, 482252, 477312, 475882, 478013, 482758, 488119, 491776, 491989, 488095, 480521, 470295, 458402, 445577, 432564, 420162, 408910, 399094, 391118, 385318, 381208, 377490, 373185, 368367, 363504, 358614, 353450, 347972, 342228, 336232, 330426, 325741, 322651, 320584, 318775, 317189, 316051, 314934, 313064]
55737C13064k857l574m114m528m540m200l949l752l204k556k665l518m060l851
55723B61696l716m126m188l136j689r29o87j28P73J443J888K542L198L125K188
55708B58254J152P95J203J727J444n0k007l142l187l209m056n233n843n864n723
55693B26261n298m330l310k949l040k765j987j300r41m86K93J060J486J579J388
55678B05661R96P94J197J908K046J224L1p36j008j328k044k830l047k432j409
55663A99023o28k30K19J055K065K733K705J916P13j26M4R24J500J304Q78Q03Q33
55646B15731N32J05l2j7k32n65o80p15j061j742k585l691m998n734n269m316m244
55629A80487n146n600m631k973j919j716j732j648j712j993k071j565o42P5N8
$$ y = [313064, 310207, 306633, 302519, 297991, 293451, 289251, 285302, 281550, 278346, 275790, 273125, 269607, 265547, 261696, 257980, 253854, 249666, 246530, 244841, 243912, 243225, 243097, 243870, 245313, 247201, 249743, 252941, 256066, 258254, 259406, 260201, 261404, 263131, 264575, 264525, 262518, 259376, 256189, 252980, 248924, 243691, 237848, 231984, 226261, 220963, 216633, 213323, 210374, 207334, 204569, 202582, 201282, 200341, 199855, 200148, 201208, 202694, 204273, 205661, 206657, 207451, 208648, 210556, 212602, 213826, 213857, 213121, 212113, 210785, 208741, 205911, 202864, 200432, 199023, 198395, 198165, 198384, 199439, 201504, 204237, 206942, 208858, 209571, 209445, 209489, 210413, 211913, 213217, 214095, 214898, 215731, 216263, 216368, 216336, 216319, 216087, 215522, 214842, 214127, 213066, 211324, 208739, 205048, 200050, 194316, 189047, 184731, 180487, 175341, 169741, 165110, 162137, 160218, 158502, 156770, 155122, 153410, 151417, 149346, 147781, 147139, 147214, 147272]
55614A47272o35j413j736j642j518j470j260q76p23j045j484j510j075o19n31
55599A29735q38j287j538j361q38l45k22m87r05j255j363j037k01P99J288R10
55583A21055O8m29k43K30M96O55J150K042K849L114K785K081J283P17N58M97N
55566A38913q44j245p12P7P0q19j662j844j780k090k598k586j873j150j203k015
55550A16639k829k910k175j125l69k45o44j066r65k37O57J204J313J163Q07L07
55534A09525O3M72J188J359P97M03R63K004K303J400K7q50j026r66j075j238j090
55517A14259n95k48n19j230j771j895j925k065k015j489p22j70oj48m47n73k19
55500I8222K96J79o66j213p24K8j68j076j302l84N86O59K69L09P49Q79M01l42
$$ y = [147272, 146637, 145224, 143488, 141846, 140328, 138858, 137598, 136722, 135999, 134954, 133470, 131960, 130885, 130266, 129735, 128897, 127610, 126072, 124711, 123873, 123528, 123306, 122819, 121914, 120659, 119296, 118259, 118058, 118857, 120145, 121055, 121123, 120694, 120451, 120681, 121177, 121832, 122982, 125024, 127873, 130987, 133772, 135853, 137136, 137853, 138411, 138908, 138913, 138069, 136824, 136112, 136189, 136259, 135440, 133778, 131934, 130154, 128064, 125466, 122880, 121007, 119857, 118654, 116639, 113810, 110900, 108725, 107600, 107231, 106986, 106342, 105276, 104311, 104074, 104731, 105935, 107248, 108411, 109218, 109525, 109588, 110060, 111248, 112607, 113404, 113807, 114770, 116774, 119077, 120477, 120504, 119654, 118628, 117662, 116587, 115349, 114259, 113664, 113416, 112897, 111667, 109896, 108001, 106076, 104011, 101996, 100507, 99785, 99615, 99609, 99461, 99014, 98441, 98222, 98518, 98697, 98031, 96818, 96094, 96122, 95954, 94878, 93576, 93192, 93778, 94437, 94706, 95015, 95764, 96643, 97044, 96702]
55482I6702q79r63o40l11m12p58o10K73J073Q71k18j342k023k331k222j511n18
55465H4181n0l88q25n51L09Q86O35q4m52k8Q52J411J212O03L10O12J032R81M58
55446I1104o3k67k85l32l88l20j87j47k09k41k08k06k25j33O5J18q2k38l4K84
55426H8006J48m95r44o17J52N78M26J66J80L42M72O90J029J129P25J46j67l90
55408I1576r46j610j678j112o83p22m93N91J862K251J804J405J245O05p89k088
55392I1218k338j524k69Q74J502J301M28m20p49p31p09n85j88J80P7l54n38k56
55374H6919J33K41J11P5M10R91J276Q13j22p12o44n04q08j146q44r7K90N4l22
55355H6114m27l44j50K18N18K98l26n46J15J041J228M54n87j153j139j001j122
$$ y = [96702, 95823, 94860, 94220, 93909, 93497, 92739, 92129, 92402, 93475, 94346, 94128, 92786, 90763, 88432, 86210, 84699, 84181, 84131, 83743, 82918, 82367, 82676, 83562, 84197, 84113, 83661, 83633, 84485, 85896, 87108, 87711, 88021, 88633, 89665, 90646, 91104, 91041, 90774, 90489, 90157, 89769, 89449, 89262, 89115, 88906, 88665, 88457, 88251, 88026, 87893, 87958, 88076, 87994, 87756, 87722, 88006, 88154, 87659, 86715, 86098, 86250, 86828, 87254, 87420, 87600, 87942, 88414, 89104, 90133, 91262, 91987, 92133, 91966, 91576, 90630, 89020, 87342, 86230, 85547, 84825, 84332, 84923, 86785, 89036, 90840, 92245, 93490, 94095, 93306, 91218, 88880, 87356, 87087, 87961, 89463, 90764, 91192, 90772, 90023, 89292, 88583, 87998, 87810, 87990, 88067, 87713, 87175, 86919, 87052, 87293, 87404, 87479, 87889, 88880, 90156, 90969, 90847, 90135, 89491, 88987, 88179, 87033, 86189, 86092, 86382, 86436, 86114, 85687, 85343, 85193, 85411, 85929, 86227, 85901, 85355, 85470, 86511, 87739, 88193, 87606, 86453, 85314, 84313, 83191]
55338H3191j277q00N58K010K380J419J19m17q2M52P24Q19R40R86O97N2o46j066
55320I0059j157j085q51k34P75J700K006J678J111N74J11j91k27j69l30p25j065
55303I1980j152r85n60M9M89N15M57P55J083O59m66j236j037n03m29n96l55J60
55285H8828K84k8j23K99P73P60K68l36o87n93j45K86M70N86Q30Q97M17k99m80
55266I2007P4O98P50K67l22o79o12j21L42J59n76r30k84P44J046M16l89q28j117
55247I0645j492j604j018O7J009J413J340R64L45m11j054j296r81k34M56N60J56
55230H8865%N80J306J242N18K46Q62J389Q67k59r18r50r34q54j74Q05R64N8p20
55211I2893m87L4k44j023j222p79o24j031j128l36P63J396J666K065K413K018
$$ y = [83191, 81914, 81114, 81672, 83682, 86062, 87481, 87600, 87183, 87101, 87553, 88277, 89096, 90036, 91022, 91719, 91771, 91125, 90059, 88902, 87817, 86966, 86732, 87507, 89207, 91213, 92891, 94002, 94576, 94687, 94496, 94269, 94100, 93770, 93045, 91980, 90828, 89843, 89283, 89332, 89821, 90336, 90793, 91548, 92631, 93290, 92824, 91588, 90551, 90048, 89619, 89023, 88668, 88828, 89112, 89084, 88961, 89260, 90033, 90793, 91061, 90725, 90038, 89445, 89300, 89586, 90056, 90642, 91472, 92369, 92786, 92487, 92007, 92081, 92779, 93529, 93796, 93474, 92795, 92183, 92062, 92404, 92563, 91987, 91057, 90773, 91517, 92563, 92979, 92590, 91762, 90645, 89153, 87549, 86531, 86598, 87607, 89020, 90360, 91324, 91669, 91258, 90204, 88908, 87927, 87693, 88149, 88709, 88865, 88865, 89445, 90751, 91993, 92511, 92757, 93619, 95008, 95875, 95616, 94698, 93748, 92814, 91960, 91786, 92591, 93555, 93613, 92893, 92406, 92440, 92196, 91173, 89951, 89172, 88548, 87517, 86389, 86053, 86816, 88212, 89878, 91943, 94356, 96374]
55195I6374Q03l44n37J05O20L41m28r25r51r59j174j191p13j99j81k97K67J434
55177I2045K122J630M77m09p34p54n84k07J68K69J69J35J21j15m27k50O12J498
55159I5766J499N63l93n52j35km37q64q13o06o90p96m51L7l2m47j65J035J958
55140I4475J563M05k06L4L48K12j26l15l76l57j44K30N17N82M41N4m94o65M9J260
55120I7487J861J291J73n06m36J5L97M70K28l6N1M42O56M01q7n17q94j151q99
55101I8946l7P76Q63N28O10J174J367P43m0j90N6j23q37j327j087n68m42n91k94
55082I9527O57J560J616Q03k68j073j428j301p75j32L34N70O02K90l33o84k36
55065I9729N83P86K13k10J35O84P28N35P24J139J169Q30N66K74n05j484j696q79
$$ y = [96374, 97177, 96833, 96296, 96401, 97021, 97362, 96934, 96009, 95058, 94099, 92925, 91734, 91021, 90822, 90641, 90344, 90611, 92045, 94167, 95797, 96274, 95865, 95131, 94377, 93793, 93586, 93754, 94023, 94192, 94327, 94448, 94333, 93906, 93656, 94268, 95766, 97265, 97828, 97435, 96883, 96748, 96746, 96309, 95445, 94632, 94026, 93336, 92540, 92089, 92126, 92094, 91647, 91482, 92517, 94475, 96038, 96443, 96237, 96271, 96619, 96831, 96705, 96390, 96014, 95657, 95513, 95743, 96260, 96842, 97283, 97337, 96843, 96178, 96227, 97487, 99348, 100639, 100812, 100306, 99870, 99885, 100282, 100752, 100980, 100944, 100995, 101437, 102093, 102494, 102407, 101890, 100996, 99845, 98946, 98909, 99685, 100548, 101076, 101686, 102860, 104227, 104970, 104930, 104740, 104796, 104673, 103836, 102509, 101422, 100854, 100412, 99821, 99527, 100184, 101744, 103360, 104163, 103895, 102822, 101394, 100093, 99318, 99186, 99520, 100090, 100692, 100982, 100649, 99965, 99729, 100312, 101098, 101311, 101101, 101236, 101920, 102648, 103183, 103907, 105046, 106215, 107045, 107611, 107885, 107380, 105896, 104200, 103321]
55047A03321J4k1r40j957k322j656q8J565K348K108J521J056N11j68m27L5N39
55030A05439K17p98j492j160pJ151J508Q65n8k28M22P98J12r24j044j58O54O81
55012A05978L13J67K84L86M08M40M96N56O35P14P68P84P12N04M10Q77J761K081
54994A18274J144k91q09k18K26l21j149j173n08j34l73n76k33K99M24J99K27P30
54976A15738J141P86j67p95m91L11P66O38L74K65J29k26o28q15p00l12K56O89
54958A16959O55K39q3j00q3k61l95k23pk46r76j592j446m65P92J590J603J104
54940A17065N98L89N09Q44J114R84N22L04O37R69O19r5k72J57L57R6K37J275K357
54921A28666K501K077K127K774L310L566M116N116N835N590M519L217K060J075
$$ y = [103321, 103335, 103314, 102374, 100417, 98095, 96439, 96351, 97916, 100264, 102372, 103893, 104949, 105460, 105292, 104865, 104900, 105439, 105656, 104858, 103366, 102206, 102199, 103350, 104858, 105723, 105665, 105437, 105859, 106657, 106769, 105845, 104801, 104643, 105297, 105978, 106291, 106458, 106742, 107128, 107536, 107976, 108472, 109028, 109663, 110377, 111145, 111929, 112641, 113145, 113555, 114432, 116193, 118274, 119418, 119127, 118318, 118100, 118326, 118005, 116856, 115683, 115175, 115041, 114668, 114092, 113859, 114158, 114582, 114781, 115008, 115738, 116879, 117665, 117498, 116703, 116212, 116523, 117289, 117927, 118301, 118566, 118695, 118469, 117841, 117026, 116326, 116014, 116270, 116959, 117614, 117853, 117770, 117670, 117587, 117326, 116931, 116708, 116701, 116455, 115479, 113887, 112441, 111976, 112768, 114358, 115961, 117065, 117663, 118052, 118561, 119405, 120519, 121503, 122025, 122329, 122966, 123935, 124554, 124459, 124187, 124344, 124701, 124797, 125034, 126309, 128666, 131167, 133244, 135371, 138145, 141455, 145021, 149137, 154253, 160088, 165678, 170197, 173414, 175474, 176549]
54907A76549M7j342l133m778n578n456m930m363l664k804k110j847j902j989j959
54892A30741j697j134n25l99r74j764j988j305r4R43J405J506J693J966J838J167
54876A31379O55J067K219L284L960M676N654O447O515N717M077J768m84j741k025
54861A73168k504l919n444n777m909l963l599l439l095k837l017l394l444k978
54847A20849k175j367r05j026j538j843j495o59N3J67k30n06pJ204K182K017Q77
54830A15598j71m51l38m83q66r66o17k24j95m75o07j45R38J983K091J170L10O35
54812A17187J861K512J699J16r15r42m91j28O2J03j35o59j131j125n59K67R38
54795A18660J240J251J197J113P67j8r65j501j292n37L10R57J415J783J986J698
$$ y = [176549, 176596, 175254, 172121, 167343, 161765, 156309, 151379, 147016, 143352, 140548, 138438, 136591, 134689, 132700, 130741, 129044, 127910, 127385, 126986, 126012, 124248, 122260, 120955, 120861, 121804, 123209, 124715, 126408, 128374, 130212, 131379, 132034, 133101, 135320, 138604, 142564, 147240, 152894, 159341, 165856, 171573, 175650, 177418, 176934, 175193, 173168, 170664, 166745, 161301, 155524, 150615, 146652, 143053, 139614, 136519, 133682, 130665, 127271, 123827, 120849, 118674, 117307, 116402, 115376, 113838, 111995, 110500, 109841, 109894, 110061, 109831, 109325, 109318, 110522, 112704, 114721, 115598, 115427, 114976, 114638, 114155, 113289, 112323, 111706, 111482, 111287, 110812, 110205, 110060, 110998, 112981, 115072, 116242, 116552, 117187, 119048, 121560, 123259, 123375, 122460, 121518, 121027, 120899, 120961, 121064, 120929, 120270, 119139, 118014, 117455, 117722, 118660, 119900, 121151, 122348, 123461, 124228, 124210, 123245, 121744, 120452, 119915, 120225, 121182, 122597, 124380, 126366, 128064]
54779A28064P14n76j269p69N10J536J724J373J105J211J653K289K880L139L069
54764A46653L118L726M711N400N395M977M648M429L801K414O19q90j934k949m182
54749A79936n159n313m766m055l348k544j978k173k829k873j877p39n17j137j795
54734A38833k055j949j399l75O52J137J241J566K161K464K194J732J549J757K258
54719A51766K863L268L351L417L738L988L697L057K541J845J77k357m554n610
54705A71187n828n604m747l378k472k578k888k482j823j854k202j710n03n4r77
54690A32087k054k016j186o55o41n49j30K42K52m7n03r28j005n83K0L55L95L40
54672A23394R4n59j302j398o20M07J002J104R55N95J01p9L74J003J023M01j19
$$ y = [128064, 128778, 128202, 126933, 126164, 126674, 128210, 129934, 131307, 132412, 133623, 135276, 137565, 140445, 143584, 146653, 149771, 153497, 158208, 163608, 169003, 173980, 178628, 183057, 186858, 189272, 189891, 189001, 187067, 184118, 179936, 174777, 169464, 164698, 160643, 157295, 154751, 152773, 150600, 147771, 144898, 143021, 142282, 141765, 140628, 138833, 136778, 134829, 133430, 133055, 133707, 134844, 136085, 137651, 139812, 142276, 144470, 146202, 147751, 149508, 151766, 154629, 157897, 161248, 164665, 168403, 172391, 176088, 179145, 181686, 183531, 183708, 181351, 176797, 171187, 165359, 159755, 155008, 151630, 149158, 146580, 143692, 141210, 139387, 137533, 135331, 133621, 133118, 133064, 132087, 130033, 128017, 126831, 126176, 125535, 124986, 124856, 125098, 125350, 125303, 124800, 123872, 122867, 122284, 122304, 122659, 123054, 123394, 123488, 122929, 121627, 120229, 119609, 120016, 121018, 122122, 123077, 123672, 123773, 123694, 124068, 125071, 126094, 126495, 126376]
54655A26376j05Q0J5j18o1n5l33n08r5N88P97M83K74K98o4j046j826j594o72J0
54635A22444J93L72Q52J363J572J431R97L06m63r96j157j037p40l33ol2m64j023
54617A23279j318j089l61M89R30P54L32K07N23R80J252J152O34r1n07k67K86M72
54599A27657J01l25l31K3L33L06j00o61r59p21j57K85N05P93J225J421J033K00
54581A30628o52j180j179o11K31Q39R01M70l33j345k061j816n67Q25J437J197
54565A26784O82L73M07O73Q65O41J60Q8P14J344J127K39l97l55j8L30Q95J665
54547A36217J970J299J08o22m63J18M08J37l64n24q2O03R00O25K83M62J162J803
54529A44040J830J183K45n56j131j639k021j880j049j31O6m64r24q20n16m53m12
$$ y = [126376, 126271, 126351, 126366, 126248, 126187, 126132, 125799, 125291, 125196, 125784, 126581, 127064, 127338, 127636, 127572, 126526, 124700, 123106, 122434, 122444, 122637, 123009, 123861, 125224, 126796, 128227, 129224, 129530, 129067, 128071, 126914, 125877, 125137, 124804, 124798, 124766, 124302, 123279, 121961, 120872, 120511, 121000, 121930, 122684, 123016, 123223, 123746, 124726, 125978, 127130, 127764, 127673, 127166, 126899, 127185, 127657, 127758, 127433, 127102, 127125, 127458, 127764, 127664, 127003, 126044, 125323, 125166, 125451, 125956, 126749, 127974, 129395, 130428, 130628, 129976, 128796, 127617, 127006, 127237, 128076, 128977, 129447, 129114, 127769, 125708, 123892, 123325, 124150, 125587, 126784, 127466, 127839, 128246, 128919, 129784, 130425, 130585, 130673, 131387, 132731, 133858, 134097, 133700, 133345, 133327, 133657, 134552, 136217, 138187, 139486, 139594, 138972, 138509, 138627, 139035, 139172, 138808, 138284, 138202, 138805, 139705, 140330, 140613, 141075, 142237, 144040, 145870, 147053, 147298, 146742, 145611, 143972, 141951, 140071, 139022, 138891, 138957, 138493, 137569, 136749, 136233, 135780, 135368]
54512A35368l3L78K11m88j015r72o01j95K69P59R49P34N31P31J098J099O84L64
54494A39871N40J053J426J329P64L4l96k18L72P30L85l72p16j77P60J127N69k23
54476A46858k96M63J288J453J010N07K82K54K54K11J42J50M16R00J147P00k58
54459A55481j026j233j133r28k73J042K332K616J862J011O83M72j70r53j139n60
54443A58084J61K96l93j560k442k396j521o55m26n78n58m10n20p00l38N55J190
54426A47789J080O19L56L23L90O62J070J136O40N4j82l66q96j394j246o63l74
54409A48998m14j59M57P27M27L38J073K111K526K127J299K67q00j346q72K17R18
54392A57894P56J91j55j41J15N16Q49P41J41l83k08N18R47N02l97q55n89k35l93
$$ y = [135368, 135335, 135713, 135924, 135436, 134421, 133449, 132848, 132653, 132922, 133681, 134630, 135364, 135895, 136626, 137724, 138823, 139507, 139871, 140411, 141464, 142890, 144219, 144983, 145017, 144621, 144403, 144775, 145505, 145890, 145518, 144802, 144625, 145385, 146512, 147081, 146858, 146562, 147025, 148313, 149766, 150776, 151283, 151565, 151819, 152073, 152284, 152426, 152576, 152992, 153892, 155039, 155739, 155481, 154455, 153222, 152089, 151161, 150888, 151930, 154262, 156878, 158740, 159751, 160434, 160906, 160736, 159783, 158644, 158084, 158245, 158541, 158148, 156588, 154146, 151750, 150229, 149574, 149148, 148570, 148012, 147602, 147082, 146382, 146044, 146599, 147789, 148869, 149488, 149844, 150167, 150557, 151219, 152289, 153425, 154065, 154119, 153937, 153571, 152675, 151281, 150035, 149372, 148998, 148584, 148425, 148882, 149609, 150036, 150374, 151447, 153558, 156084, 158211, 159510, 159777, 158977, 157631, 156759, 156976, 157894, 158650, 158841, 158686, 158545, 158660, 159176, 160025, 160766, 160907, 160524, 160316, 160834, 161781, 162283, 161886, 161031, 160442, 160207, 159814]
54373A59814p14l68O99J548J450P60K39kl32p24p99n98n77p52n63J44P32P08M68
54354A61133N44P11M70M2N9L98K09p54j622j533p05QK53L80Q22J617K386K570
54336A66988J876P35O3K50P04P07M45O12J241J570J064j0j106j958k452k506k285
54319A65938k173k222k041j501j073j152j411j273p21j90P5J29Lj89o6O14J400
54302A54147J526Q73Q9k74k71j59M3L64O43P20N99L28r7n48p62o55m02j91m3K5
54282A55955k0q9n8m2k69o01o10k48L4NR9P30J511J662J038K84K4J70K14r0m66
54261A59233m94j54J63K18K59O21J122J279R97O34M02J29k26l67j86k6j50l82
54243A63072n32p20r56q87l94k8k85q48j072q90o92n27j92J22k2n06o87l18J66
$$ y = [159814, 159100, 158732, 159431, 160979, 162429, 163189, 163428, 163426, 163094, 162370, 161571, 160973, 160396, 159644, 159081, 159225, 159957, 160665, 161133, 161677, 162388, 162858, 162900, 162959, 163357, 163566, 162812, 161190, 159657, 158952, 158960, 159213, 159593, 160415, 162032, 164418, 166988, 168864, 169599, 169662, 169912, 170616, 171323, 171768, 172380, 173621, 175191, 176255, 176245, 175139, 173181, 170729, 168223, 165938, 163765, 161543, 159502, 158001, 156928, 155776, 154365, 153092, 152371, 152181, 152256, 152385, 152388, 152199, 152133, 152747, 154147, 155673, 156546, 156635, 156361, 156090, 155931, 155974, 156338, 156981, 157701, 158300, 158628, 158531, 157983, 157221, 156566, 156164, 155973, 155930, 155955, 155935, 155846, 155788, 155746, 155477, 154876, 154266, 154018, 154052, 154057, 154156, 154886, 156397, 158059, 159097, 159381, 159405, 159575, 159789, 159699, 159233, 158739, 158585, 158748, 158966, 159225, 159846, 160968, 162247, 163244, 163878, 164280, 164409, 164183, 163816, 163630, 163604, 163454, 163072, 162540, 161820, 160864, 159977, 159583, 159555, 159270, 158422, 157350, 156460, 155768, 155241, 155049, 155171, 155149, 154643, 153956, 153638, 153804]
54224A53804L63L70L67K52o2m16o65q05p47l61J02J07l98p21k63O83J307J261
54206A54178Q91O05M02R4k64l55k8L99M30J4l26j62K69M48K77M5j96o83j360j763
54186A52915j676j437j345j168n98J50N48M32Q8k23m92o71n89k06J85K50K7j76
54168A46014j94j61j54j6K77L63J6k65J76R99J051j0j050r95l10j61o23p59k52
54149A43946J96J41L5K88N65N13M22O22Q64P86N66N76P36P25N64N44P56J040J199
54130A55084J007L18n40q73m59P9J00j86j88P7J09j84l17m8K56J84j46l23k07
54111A53743j9M2R4L82Q36R98N73m1j49L21P08N58J82O0Q1k02q61j536j912j920
54091A51938j591j021m46n9J32J92J90L37Q71J603J951J675J174P78J96q22j655
$$ y = [153804, 154167, 154537, 154904, 155156, 155094, 154678, 154013, 153208, 152461, 152100, 152202, 152309, 151911, 151190, 150927, 151610, 152917, 154178, 155069, 155674, 156076, 156170, 155906, 155551, 155523, 155922, 156352, 156366, 156040, 155878, 156147, 156595, 156872, 156917, 156721, 156038, 154678, 152915, 151239, 149802, 148457, 147289, 146691, 146841, 147389, 147821, 147909, 147686, 147194, 146523, 145934, 145728, 145913, 146163, 146190, 146014, 145820, 145659, 145505, 145489, 145766, 146129, 146145, 145880, 146056, 147055, 148106, 148096, 147046, 146051, 145741, 145580, 144957, 144198, 143946, 144142, 144283, 144318, 144606, 145171, 145684, 146106, 146728, 147592, 148378, 148944, 149520, 150256, 150981, 151545, 152089, 152845, 153885, 155084, 156091, 156409, 155869, 154996, 154537, 154616, 154716, 154530, 154342, 154419, 154528, 154344, 154027, 153979, 154235, 154419, 154273, 153950, 153743, 153724, 153766, 153860, 154242, 155078, 156076, 156649, 156608, 156459, 156780, 157488, 158046, 158228, 158288, 158369, 158167, 157306, 155770, 153858, 151938, 150347, 149326, 148880, 148821, 148953, 149145, 149335, 149672, 150543, 152146, 154097, 155772, 156946, 157724, 157920, 157098, 155443]
54074A55443j432k75P02P48K68J51O74J231R31n04k278l043k175l89J065J608
54058A52725J437Q57J33j95L41J390J944J522P46N04R17J419J576J459J338J280
54042A69393J143R27R69J615K633L304L287L132L520M285M704M628M759N702P239
54027B21240Q724R752J0142R577P706M601R26k487n155p064q295q794q606q189
54013B24078q014p858p026n435l981l431l496l466l242l101k880k212j326p95
53999A67815n43p1M14O8j158k050j623l27P11J066J030P74K35l82o30l65J35N08
53981A65607N43K26k02l58j67qk18o36q76r13r70j026p97k00N00J102J679K220
53963A65506K323J573K03r43j162n35L17Q59Q87M04l26o93k11P91J413J309J057
$$ y = [155443, 154011, 153736, 154438, 155186, 155454, 155605, 156279, 157510, 158441, 157937, 155659, 152616, 150441, 150052, 151117, 152725, 154162, 155019, 155152, 154957, 155298, 156688, 158632, 160154, 160900, 161404, 162321, 163740, 165316, 166775, 168113, 169393, 170536, 171463, 172432, 174047, 176680, 179984, 183271, 186403, 189923, 194208, 198912, 203540, 208299, 214001, 221240, 229964, 239716, 249858, 259435, 267141, 271742, 272668, 270181, 265026, 257962, 249667, 240873, 232267, 224078, 216064, 208206, 201180, 195745, 191764, 188333, 184837, 181371, 178129, 175028, 172148, 169936, 168610, 167815, 167272, 167201, 167615, 167683, 166525, 164475, 162852, 162525, 163236, 164302, 165332, 166106, 166341, 165959, 165329, 164964, 165099, 165607, 166150, 166376, 166174, 165816, 165649, 165641, 165423, 164787, 163911, 162998, 162028, 161002, 160205, 160005, 160505, 161607, 163286, 165506, 167829, 169402, 169605, 168662, 167500, 166965, 167282, 168141, 169028, 169432, 169106, 168413, 168202, 168993, 170406, 171715, 172772]
53946A72772J231J623J802J898K248K694K876K897L050L130K825K487K734L334
53932B07601L378K524J384O08L33N39J035J090O5j425j956j245o17j040j783j734
53916B08757j075p08p52o38k98k33o32j221j807k279k261j515n47r6j69j99p6
53899A94251j82m97m25K25P81N88j43o21l85L81J251K042K913M027N171N901O171
53882B21449O405O790O874O264N416N112N344N403N112N284O680Q959J0964J1760
53868C17816J1036Q815N230O85m062q234j1421j3618j4877j5137j4444j3142j1618
53855B37029j0001q359o962n967m970l458j735p50p99j112j027q94j306j943j955
53840A85791j213m67l70q47j320j209l09R61J831J940J657J372R50J82o53j230
$$ y = [172772, 174003, 175626, 177428, 179326, 181574, 184268, 187144, 190041, 193091, 196221, 199046, 201533, 204267, 207601, 210979, 213503, 214887, 215495, 215828, 216367, 217402, 218492, 218557, 217132, 215176, 213931, 213314, 212274, 210491, 208757, 207682, 206974, 206222, 205584, 205286, 205053, 204421, 203200, 201393, 199114, 196853, 195338, 194791, 194695, 194526, 194327, 194251, 194069, 193572, 193147, 193372, 194153, 194741, 194598, 193977, 193592, 193973, 195224, 197266, 200179, 204206, 209377, 215278, 221449, 227854, 234644, 241518, 247782, 253198, 258310, 263654, 269057, 274169, 279453, 286133, 295092, 306056, 317816, 328852, 337667, 342897, 343582, 339520, 331286, 319865, 306247, 291370, 276233, 261789, 248647, 237029, 227028, 218669, 211707, 205740, 200770, 197312, 195577, 194827, 194028, 192916, 191889, 190995, 189689, 187746, 185791, 184578, 184111, 183741, 182894, 181574, 180365, 180056, 181017, 182848, 184788, 186445, 187817, 188767, 188949, 188296, 187066]
53824A87066j705k192k157j164J61P21M01O3K24N56P25Q32R38R02Q38R57R34K46
53806A88346p19q43J49J188J305P64K76n8l51k81L55R53Q15K30RK54L37Q0J9M47
53786A93275Q75P71L23J12K66L09j71r50j362j085n30k61j87K69J178J800J555
53769A96187P90K15q1m84r99j160q19m40m40o55o58l32R0L29K72J3j93j74q0k31
53749A91150o40r30q58o70o45n35J43J271K044J935J429J445K193K977L082K481
53733B05872J659J038P87Q58J012J002Q21O98P35Q15R06J167J589J889J961K132
53717B24941K618L096L191K984K697K172J264M40L42Q92J507K015K637L157L026
53702B56979K442K370L152L909L876L470L424L507L012K114J667J806J658P15
$$ y = [187066, 185361, 183169, 181012, 179848, 180009, 180730, 181131, 181194, 181418, 181974, 182699, 183531, 184469, 185371, 186209, 187166, 188100, 188346, 187627, 186784, 186933, 188121, 189426, 190190, 190466, 190408, 190057, 189776, 190131, 191084, 191899, 192129, 192138, 192392, 192729, 192809, 192828, 193275, 194150, 194921, 195244, 195356, 195622, 195931, 195760, 194810, 193448, 192363, 191833, 191572, 191385, 191654, 192832, 194632, 196187, 196977, 197192, 197111, 196627, 195628, 194468, 193649, 193209, 192769, 192114, 191456, 191124, 191214, 191543, 191815, 191828, 191635, 191461, 191381, 191150, 190510, 189580, 188722, 188052, 187407, 186872, 187015, 188286, 190330, 192265, 193694, 195139, 197332, 200309, 203391, 205872, 207531, 208569, 209356, 210214, 211226, 212228, 213049, 213747, 214482, 215297, 216203, 217370, 218959, 220848, 222809, 224941, 227559, 230655, 233846, 236830, 239527, 241699, 242963, 243403, 243745, 244637, 246144, 248159, 250796, 253953, 256979, 259421, 261791, 264943, 268852, 272728, 276198, 279622, 283129, 286141, 288255, 289922, 291728, 293386, 294101]
53688B94101l61o51j87K34J79p7j99k94n37o43j87O15R53M09m12o55k90L7O7J47
53668B92249M20M12k58j251j935k052j723j116m42L5K62M14M18r9j075j710j375
53651B81174m83J15K45L36M65L41J03L97J362K243K329J771J210R64R42J004J035
53634B95553R30P75Q92J373J857J979J914K079K496K858L147L664M352M573L922
53619C32364K950K633L239M102M553M656M847N121M971M116K976K284K369K928
53605C84109L409L522L342L021K533J782Q61O5l67m42l33k04j49j73k19k63l81
53588D00113n87p20p02q10j306j825j705r81m38l99j52Q97K098K447K081J960
53572C99971K286K317J692R20K96n84j828k717k734k387k367k503k316j967j936
$$ y = [294101, 293740, 293089, 292902, 293136, 293315, 293238, 293039, 292745, 292208, 291565, 291378, 291993, 292946, 293355, 292943, 292288, 291998, 292035, 292102, 292249, 292669, 293081, 292823, 291572, 289637, 287585, 285862, 284746, 284304, 284339, 284601, 285015, 285433, 285334, 284259, 282549, 281174, 280691, 280806, 281051, 281387, 281852, 282193, 282296, 282693, 284055, 286298, 288627, 290398, 291608, 292572, 293514, 294518, 295553, 296483, 297258, 298150, 299523, 301380, 303359, 305273, 307352, 309848, 312706, 315853, 319517, 323869, 328442, 332364, 335314, 337947, 341186, 345288, 349841, 354497, 359344, 364465, 369436, 373552, 376528, 378812, 381181, 384109, 387518, 391040, 394382, 397403, 399936, 401718, 402579, 402644, 402277, 401835, 401502, 401298, 401149, 400976, 400757, 400494, 400113, 399526, 398806, 398104, 397294, 395988, 394163, 392458, 391477, 391039, 390640, 390488, 391385, 393483, 395930, 398011, 399971, 402257, 404574, 406266, 407186, 407482, 406898, 405070, 402353, 399619, 397232, 394865, 392362, 390046, 388079, 386143]
53557C86143k085j873j264p17l98o8K99M38L89O09J390K486L456M100M504M881
53541D02290N366N870O229O535O986P423P518P577Q515J0513J2414J3133J3078
53528E13447J3310J3823J3831J3425J3625J4672J5658J6193J7227J9482K2066
53517F86759K3560K3840K3899K4331K4879K5271K5615K5980K6256K6494K6881
53506I63765K7333K7482K7168K6648K6284K6258K6503K6671K6272K5167K3868
53495A253419K3037K2751K2541K2075K1396K0604J9706J8916J8645J9033J9747
53484A481870K0325K0475J9982J8694J6806J4826J3021J1111Q791O262L890J557
53472A637610j200m413p504r984j1984j3926j5954j7850j9325k0124k0184j9869
$$ y = [386143, 384058, 382185, 380921, 380204, 379806, 379738, 380037, 380475, 380864, 381473, 382863, 385349, 388805, 392905, 397409, 402290, 407656, 413526, 419755, 426290, 433276, 440699, 448217, 455794, 464309, 474822, 487236, 500369, 513447, 526757, 540580, 554411, 567836, 581461, 596133, 611791, 627984, 645211, 664693, 686759, 710319, 734159, 758058, 782389, 807268, 832539, 858154, 884134, 910390, 936884, 963765, 991098, 1018580, 1045748, 1072396, 1098680, 1124938, 1151441, 1178112, 1204384, 1229551, 1253419, 1276456, 1299207, 1321748, 1343823, 1365219, 1385823, 1405529, 1424445, 1443090, 1462123, 1481870, 1502195, 1522670, 1542652, 1561346, 1578152, 1592978, 1605999, 1617110, 1625901, 1632163, 1636053, 1637610, 1636410, 1631997, 1624493, 1614509, 1602525, 1588599, 1572645, 1554795, 1535470, 1515346, 1495162, 1475293]
53460A475293j9952k0926k2400k3500k3860k3913k4130k4379k4215k3544k2643
53449A221831k1699k0684j9677j8971j8646j8198j6842j4283j1096q292o495n572
53437A041376n024m469l692k416m50J941M061N507O649Q206J0357J2492J3967
53424A088505J4894J5981J7610J9366K0660K1599K2893K4895K7141K9005L0420
53413A332969L1746L3218L4891L6865L9166M1532M3740M5961M8416N0871N2949
53402A792324N4761N6670N8510N9802O0694O1873O3413O4487O4579O4174O3791
53391B465078O3108O1623N9560N7397N5025N2124M8959M6002M3010L9353L5147
53380C026386L1261K8173K5457K2383J8471J3484P461Q09o110j3498k1688l0340
$$ y = [1475293, 1455341, 1434415, 1412015, 1388515, 1364655, 1340742, 1316612, 1292233, 1268018, 1244474, 1221831, 1200132, 1179448, 1159771, 1140800, 1122154, 1103956, 1087114, 1072831, 1061735, 1053443, 1046948, 1041376, 1036352, 1031883, 1028191, 1025775, 1025325, 1027266, 1031327, 1036834, 1043483, 1051689, 1062046, 1074538, 1088505, 1103399, 1119380, 1136990, 1156356, 1177016, 1198615, 1221508, 1246403, 1273544, 1302549, 1332969, 1364715, 1397933, 1432824, 1469689, 1508855, 1550387, 1594127, 1640088, 1688504, 1739375, 1792324, 1847085, 1903755, 1962265, 2022067, 2082761, 2144634, 2208047, 2272534, 2337113, 2401287, 2465078, 2528186, 2589809, 2649369, 2706766, 2761791, 2813915, 2862874, 2908876, 2951886, 2991239, 3026386, 3057647, 3085820, 3111277, 3133660, 3152131, 3165615, 3173076, 3173885, 3167775, 3154277, 3132589, 3102249]
53368C102249l8528m5634n1546n6144n9301o1444o3318o4990o5710o5026o3482
53357B467126o1899o0502n9060n7468n5830n4342n3273n2807n2713n2481n1862
53346A854889n0919m9551m7487m4863m2234l9768l7023l3785l0533k7754k5271
53335A425701k2757k0429j8745j7707j6927j6167j5399j4643j4054j3932j4152
53324A240789j3925j2615j0661r190q675q358p114m753k295r52p45l60J272L567
53310A165985N061N482O117P894J0146J1905J3468J5722J8519K0906K2630K4245
53298A328080K5852K6874K7271K7916K9353L0951L1784L1666L0868K9422K7326
53287A647363K5104K3454K2387K1169J9143J6320J3103R713O061K135j678m891
$$ y = [3102249, 3063721, 3018087, 2966541, 2910397, 2851096, 2789652, 2726334, 2661344, 2595634, 2530608, 2467126, 2405227, 2344725, 2285665, 2228197, 2172367, 2118025, 2064752, 2011945, 1959232, 1906751, 1854889, 1803970, 1754419, 1706932, 1662069, 1619835, 1580067, 1543044, 1509259, 1478726, 1450972, 1425701, 1402944, 1382515, 1363770, 1346063, 1329136, 1312969, 1297570, 1282927, 1268873, 1254941, 1240789, 1226864, 1214249, 1203588, 1194398, 1185723, 1177365, 1170251, 1165498, 1163203, 1162251, 1161506, 1161146, 1162418, 1165985, 1171046, 1176528, 1182645, 1190539, 1200685, 1212590, 1226058, 1241780, 1260299, 1281205, 1303835, 1328080, 1353932, 1380806, 1408077, 1435993, 1465346, 1496297, 1528081, 1559747, 1590615, 1620037, 1647363, 1672467, 1695921, 1718308, 1739477, 1758620, 1774940, 1788043, 1797756, 1803817, 1805952, 1804274, 1799383]
53275A799383p451r799j2245j4681j7044j9724k2981k6196k8401k9534l0577l2286
53263A548464l4325l5910l6772l7118l6967l6097l4522l2734l1378l0793l0746
53252A171102l0671l0238k9722k9551k9623k9441k8918k8486k8292k7757k6374
53241H52029k4453k2680k1271j9962j8530j6856j4760j2385j0498r755r718r366
53229F61795q537q204r029j0427j1448j1952j2343j2585j2326j1759j1586j2001
53217E29598j2348j2065j1439j1058j0910j0493r626q695q061p644p206o807o700
53204D06546o914p153p149o998o982p157p244p034o724o597o479n849m603l363
53190C16300k759k672k566k323k312k577k604k089j464j294j490j571j466j541
$$ y = [1799383, 1791932, 1782133, 1769888, 1755207, 1738163, 1718439, 1695458, 1669262, 1640861, 1611327, 1580750, 1548464, 1514139, 1478229, 1441457, 1404339, 1367372, 1331275, 1296753, 1264019, 1232641, 1201848, 1171102, 1140431, 1110193, 1080471, 1050920, 1021297, 991856, 962938, 934452, 906160, 878403, 852029, 827576, 804896, 783625, 763663, 745133, 728277, 713517, 701132, 690634, 680879, 671161, 661795, 653258, 645054, 636025, 625598, 614150, 602198, 589855, 577270, 564944, 553185, 541599, 529598, 517250, 505185, 493746, 482688, 471778, 461285, 451659, 442964, 434903, 427259, 420053, 413246, 406546, 399632, 392479, 385330, 378332, 371350, 364193, 356949, 349915, 343191, 336594, 330115, 324266, 319663, 316300, 313541, 310869, 308303, 305980, 303668, 301091, 298487, 296398, 294934, 293640, 292150, 290579, 289113, 287572]
53176B87572j861j960j461n84J60N28N70L70m5n65j023j278j213q17l99n02j239
53159B76253j903j639n53K97J68n12q99r17j200j930k464k257j606j138r24o04
53143B58172j04L22O13R53J193Q59l7p06n45m5j66r39j316n42Q70J833J986J768
53125B64169J481R07Jo41m99J1p7j021k019k230j686r57l38J88M84K87l40j014
53107B56706j499j786j713j038J1O26K43p81j574j634j161o11k30M0K75L19q8
53090B46105q41j303r56j60J85k21p03n78Q1Q43J558K076J922R14j74l93P6J56
53072B48587n27j099p50J41O16M62K97O41J308J653J161j25j507k138j835j227
53056B45658r19p97m33J29N03O44Q54J118J018M53r2k55k87n77j009j269j448
$$ y = [287572, 285711, 283751, 282290, 281706, 281866, 282394, 282964, 283334, 283289, 282724, 281701, 280423, 279210, 278393, 277994, 277492, 276253, 274350, 272711, 272158, 272455, 272623, 272111, 271212, 270295, 269095, 267165, 264701, 262444, 260838, 259700, 258776, 258172, 258068, 258390, 259003, 259956, 261149, 262008, 261971, 261265, 260720, 260675, 260509, 259570, 258254, 257712, 258582, 260415, 262401, 264169, 265650, 266557, 266558, 265917, 265418, 265429, 265352, 264331, 262312, 260082, 258396, 257439, 257101, 257289, 257773, 258060, 257720, 256706, 255207, 253421, 251708, 250670, 250681, 251307, 251550, 250769, 249195, 247561, 246400, 245789, 245559, 245599, 245874, 246193, 246105, 245264, 243961, 243005, 242845, 243030, 242809, 242106, 241528, 241609, 242452, 244010, 246086, 248008, 248922, 248748, 248355, 248431, 248587, 248060, 246961, 246211, 246352, 246968, 247430, 247727, 248368, 249676, 251329, 252490, 252365, 250858, 248720, 246885, 245658, 244739, 243942, 243509, 243638, 244141, 244785, 245639, 246757, 247775, 248228, 248136, 247881, 247594, 247017, 246008, 244739, 243291]
53039B43291j820k201k113j574j158j132j071n65J26M97M94L56O5n26j102j072
53023B30495l96K47L53K62N36J022R95K34n09l61N11J048N52m47q77m20K82O05
53005B34132N88M50J27l10l27L60J060R09J53j82J41L06j05m05QO03N85Q5k99
52986B37879n38q83r59k28R07J452J318J427K133K590K133J358J184J498J500
52971B52771J063Q92J401K154K510K348J972J622J240O27k92j245j757j681j482
52956B62143j714k219k229j382l36p5p08j356j255o11k13l99p95r35q25p47q21
52939B45523r00p58k82L37N60m6j086j507q37P2P8p30j184o80R5K84Oj02Q9J73
52919B39105l2k92l88l13o6L29N91L63l04r61j259j245j063p22k15L15O49O16
$$ y = [243291, 241471, 239270, 237157, 235583, 234425, 233293, 232222, 231657, 231783, 232280, 232774, 233130, 233195, 232669, 231567, 230495, 230099, 230346, 230699, 230961, 231497, 232519, 233514, 233748, 233239, 232878, 233389, 234437, 234989, 234542, 233665, 233245, 233527, 234132, 234720, 235170, 235297, 234987, 234660, 235020, 236080, 236989, 237142, 236960, 237101, 237407, 237302, 236897, 236905, 237508, 238093, 238178, 237879, 237341, 236458, 235499, 235271, 236178, 237630, 238948, 240375, 242508, 245098, 247231, 248589, 249773, 251271, 252771, 253834, 254726, 256127, 258281, 260791, 263139, 265111, 266733, 267973, 268600, 268308, 267063, 265306, 263625, 262143, 260429, 258210, 255981, 254599, 254263, 254188, 253480, 252124, 250869, 250258, 250045, 249646, 248851, 247916, 247091, 246344, 245523, 244623, 243865, 243583, 243920, 244480, 244434, 243348, 241841, 241004, 241076, 241154, 240424, 239240, 238560, 238655, 238939, 238945, 238843, 238932, 239105, 239073, 238781, 238393, 238080, 238014, 238343, 238934, 239297, 238993, 238032, 236773, 235528, 234465, 233743, 233528, 233843, 234492, 235108]
52901B35108J32o02j000n77L79R31N81j72n04k15K75N65M60j41r64j161j01J552
52883B34546K267J466K70l3L21J24r31j812j611o68J13M30O62J110J659K136K494
52866B42543K669K546K190J909J896J941J580O07o86j776k397k665k759k659k307
52851B42632j845j540j523j758k130k431k370j862j204p59n51m26m62p87j084
52836B21900p87P9P82P60K66j06j78k32n58j208j904k119j574p99o72j214j403
52819B11033n62O35J150J052J209J876K387K266J776J353J138J211J627K034J833
52804B32018R69O7m43q25j375j826j811j507j349j361j257j035r63j072j048p13
52788B16469l05j52k60k83J24R33J617J501M44q95j610j394o67O3P21J384J766
$$ y = [235108, 235240, 234638, 233638, 233061, 233440, 234371, 234952, 234780, 234276, 234061, 234336, 234901, 235361, 235220, 234256, 233095, 232994, 234546, 236813, 238279, 238549, 238516, 238837, 238961, 238030, 236218, 234607, 233939, 234052, 234482, 235144, 236254, 237913, 240049, 242543, 245212, 247758, 249948, 251857, 253753, 255694, 257274, 257881, 257195, 255419, 253022, 250357, 247598, 244939, 242632, 240787, 239247, 237724, 235966, 233836, 231405, 229035, 227173, 225969, 225210, 224659, 224233, 223771, 222984, 221900, 221113, 221192, 221974, 222734, 223000, 222894, 222716, 222484, 221926, 220718, 218814, 216695, 215121, 214322, 213650, 212436, 211033, 210471, 211106, 212256, 213308, 214517, 216393, 218780, 221046, 222822, 224175, 225313, 226524, 228151, 230185, 232018, 232987, 233054, 232611, 231786, 230411, 228585, 226774, 225267, 223918, 222557, 221300, 220265, 219302, 218230, 217182, 216469, 216164, 216012, 215752, 215469, 215593, 216526, 218143, 219644, 220088, 219193, 217583, 216189, 215522, 215585, 216306, 217690, 219456]
52771B19456J387L13o93r51n79j81k4R2L01M39L96K45m1n75j086r92k49L88L39
52752B17985K9J98P69J050Q39N74M70K47j23q9O70J586J752J017K07L03J461K824
52734B31769L283K511J175J70j49J21P49J192O63r52k484k618j520n89n85q64
52718B31872o36j22%m06j011j564j869j600p48Q4L20J53J86N02N67Q5n08n70k4
52699B24711N47O51N06O89J213J409R21L04J98L79L46L84J106K027J885M79r03
52682B36852j239r42p00l05N22J101O14n41j220r86l03L37O42K93o34j269q81
52665B31341M2M70L83O20J349J806J665J585K019K377J939R03Km72p54j061j356
52648B42858j450j120l38M93Q33O34L42K37J29j43m22n56o08n39q1Q38J907K892
$$ y = [219456, 220843, 221156, 220463, 219512, 218933, 218752, 218728, 218820, 219121, 219560, 219956, 220201, 220160, 219585, 218499, 217507, 217258, 217646, 217985, 218014, 218212, 218981, 220031, 220870, 221444, 221914, 222161, 222038, 221949, 222619, 224205, 225957, 226974, 227181, 227484, 228945, 231769, 235052, 237563, 238738, 238908, 238759, 238880, 239629, 240821, 241484, 240532, 238048, 235430, 233910, 233321, 232736, 231872, 231236, 231114, 231114, 230708, 229697, 228133, 226264, 224664, 223916, 224000, 224320, 224473, 224659, 225161, 225728, 225813, 225305, 224735, 224711, 225258, 225909, 226415, 227104, 228317, 229726, 230647, 230951, 231149, 231528, 231874, 232258, 233364, 235391, 237276, 237755, 236852, 235613, 234671, 233971, 233666, 234188, 235289, 235903, 235362, 234142, 233156, 232853, 233190, 233832, 234125, 233491, 232222, 231341, 231383, 231853, 232236, 232856, 234205, 236011, 237676, 239261, 241280, 243657, 245596, 246499, 246501, 246029, 245275, 244214, 242858, 241408, 240288, 239950, 240443, 241276, 241910, 242252, 242489, 242618, 242475, 242053, 241497, 240889, 240350, 240269, 241107, 243014, 245906]
52630B45906L840M600M665L912L018K637K487J809N74m83r45j243j872k634k961
52615B63310k709k205j733j332j046j037j268j360j014l85J32M49Q08J303J648
52600B53561J548J087N98K82J13j4j02l5L51J006J562J653J330R16M81j44p74
52583B63419q58k90K96M25M45P49Q81K18p87r94k46L00k25j236j551q69J45P82
52565B60604Q13L61k56n89m17l8N4k45n46m59j3M03M32R5k46l26k73l39m56k96
52545B58263J58N01M84L50L73L48r8q74j449j459j031m98j16k9k27m09k23K36
52527B54300L82j67j064j642j659j322p00L09J421J869J287K88k31p6L20O96J135
52510B55146J608K002K464L182L701L234J840O01K55K51l14j378k129k179j869
$$ y = [245906, 249746, 254346, 259011, 262923, 265941, 268578, 271065, 272874, 273448, 272965, 272020, 270777, 268905, 266271, 263310, 260601, 258396, 256663, 255331, 254285, 253248, 251980, 250620, 249606, 249221, 249353, 249802, 250610, 251913, 253561, 255109, 256196, 256794, 257076, 257189, 257175, 257073, 257038, 257389, 258395, 259957, 261610, 262940, 263856, 264337, 264193, 263419, 262561, 262271, 262567, 262992, 263437, 264186, 265067, 265285, 264498, 263504, 263258, 263558, 263333, 262097, 260546, 259677, 259822, 260604, 261417, 261778, 261522, 260933, 260516, 260478, 260532, 260287, 259741, 259282, 259269, 259672, 260104, 260199, 259953, 259627, 259354, 259015, 258559, 258263, 258421, 258922, 259406, 259756, 260129, 260477, 260379, 259505, 258056, 256597, 255566, 255068, 254952, 254923, 254696, 254287, 254064, 254300, 254682, 254515, 253451, 251809, 250150, 248828, 248128, 248437, 249858, 251727, 253014, 253302, 253071, 252995, 253315, 254011, 255146, 256754, 258756, 261220, 264402, 268103, 271337, 273177, 273778, 274033, 274284, 273970, 272592, 270463, 268284, 266415]
52495B66415j589j388j256j309j590j929j995j434k23J015J417Q65J58o3o4k99
52479B56731n09k17L74P09Q28J186J735J975J813J603J437J171J096J718K775
52464B74425L316K981K417K217K124J695J005L62j94p02j064j284j549j812j815
52449B82122j666j839k325k367j478k00N87O77L99o8o96j243j368j092o78k85
52433B68480O4K87K98J54m7k35k24J58P17J021J047J275J882K353K274K037K282
52416B83823L019L883M938O544Q450R794J0166J0103J0126R655P447L199j711
52403C69436n396p159p714p891p773p237o608o141n367l802k035j251j617k019
52389B97426j527l95N78J006J004Q92J078J709K304K339K198K780M043M899M816
$$ y = [266415, 264826, 263438, 262182, 260873, 259283, 257354, 255359, 253925, 253702, 254717, 256134, 256999, 257157, 257094, 257030, 256731, 256222, 256005, 256379, 257088, 257916, 259102, 260837, 262812, 264625, 266228, 267665, 268836, 269932, 271650, 274425, 277741, 280722, 283139, 285356, 287480, 289175, 290180, 290542, 290348, 289646, 288582, 287298, 285749, 283937, 282122, 280456, 278617, 276292, 273925, 272447, 272247, 272834, 273511, 273910, 273842, 273146, 271903, 270535, 269443, 268765, 268480, 268544, 268831, 269129, 269283, 269236, 269001, 268777, 268935, 269652, 270673, 271720, 272995, 274877, 277230, 279504, 281541, 283823, 286842, 290725, 295663, 302207, 310657, 320451, 330617, 340720, 350846, 360501, 367948, 371147, 369436, 364040, 356881, 349167, 341276, 333503, 326266, 319658, 313517, 308150, 304348, 302313, 301062, 299445, 297426, 295899, 295504, 296082, 297088, 298092, 298984, 300062, 301771, 304075, 306414, 308612, 311392, 315435, 320334, 325150]
52374C25150M502M566M551M018L620M133N184N814N753N229M176K573J149O61
52360C81079Q43R47R97J505K317K815L114L882N054N804N918O156P020Q118R037
52345D44606R967J1074J2046J2726J3574J5004J6718J8089J8877J9255J9449J9681
52333F31066K0148K0839K1465K1762K1671K1256K0640K0081J9797J9733J9626
52322H58084J9211J8227J6461J4072J1553R083O255K952J6j650k304k920l773
52309I45267m436m951n912p216p851p277o136n187m371l438k715k534k485j908
52295H78850p63N18J768L071M297N178N760O416P453Q868J0399J1684J2589J3416
52281I69504J4485J5460J5555J4579J3310J2578J2365J2055J1200R709P659N290
$$ y = [325150, 329652, 334218, 338769, 342787, 346407, 350540, 355724, 361538, 367291, 372520, 376696, 379269, 380418, 381079, 381922, 382869, 383866, 385371, 387688, 390503, 393617, 397499, 402553, 408357, 414275, 420431, 427451, 435569, 444606, 454573, 465647, 477693, 490419, 503993, 518997, 535715, 553804, 572681, 591936, 611385, 631066, 651214, 672053, 693518, 715280, 736951, 758207, 778847, 798928, 818725, 838458, 858084, 877295, 895522, 911983, 926055, 937608, 946691, 952946, 955898, 955914, 954264, 951960, 949040, 945267, 940831, 935880, 929968, 922752, 914901, 907624, 901488, 896301, 891930, 888492, 885777, 883243, 880758, 878850, 878087, 878605, 880373, 883444, 887741, 892919, 898679, 905095, 912548, 921416, 931815, 943499, 956088, 969504, 983989, 999449, 1015004, 1029583, 1042893, 1055471, 1067836, 1079891, 1091091, 1100800, 1108459, 1113749]
52269A113749L020J074o62k332l910n486p350r460j1184j1892j1683j1240j1102
52256A031542j1249j1194j0445r112q068q113q861r025p945o353n339n229n770
52243I24839o735p723p900o739m796l143k174j463n46O76K085L307L708L063K180
52228H98639K145K988L693L574L044K848L185L855M731N726O562P043P276P438
52214I62747P451P191O802O515O243N635M552L316K429K187K530L069L188K405
52200A026260Q91m32o70L9O19L39k86k54N17J117R19K95j08k34l74n38n70o38
52182A026892j072j836k637l413m265m944m958m340l777l678l526k524p39Q91
52168I86074J690J923K241K749L101L254L640M472N317N681N648N643N829O129
$$ y = [1113749, 1116769, 1117843, 1117181, 1114849, 1110939, 1105453, 1098103, 1088643, 1077459, 1065567, 1053884, 1042644, 1031542, 1020293, 1009099, 998654, 989542, 981474, 973361, 964500, 955475, 947530, 941177, 935838, 930609, 924839, 918104, 910381, 902481, 895742, 890946, 887803, 885629, 884166, 883620, 884296, 886381, 889688, 893396, 896459, 898639, 900784, 903772, 907465, 911039, 914083, 916931, 920116, 923971, 928702, 934428, 940990, 948033, 955309, 962747, 970198, 977389, 984191, 990706, 996949, 1002584, 1007136, 1010452, 1012881, 1015068, 1017598, 1020667, 1023855, 1026260, 1027151, 1026719, 1026049, 1026088, 1026707, 1027046, 1026760, 1026506, 1027023, 1028140, 1029059, 1029354, 1029246, 1029012, 1028638, 1028100, 1027530, 1026892, 1025820, 1023984, 1021347, 1017934, 1013669, 1008725, 1003767, 999427, 995650, 991972, 988446, 985922, 985183, 986074, 987764, 989687, 991928, 994677, 997778, 1001032, 1004672, 1009144, 1014461, 1020142, 1025790, 1031433, 1037262, 1043391]
52154A043391O616P312P750P358O361N771O307P708R290J0646J1696J2469J3139
52141A155814J3883J4569J4876J4909J5155J5687J5968J5733J5417J5329J5085
52130A322425J4430J4034J4656J5917J6759J6882J6881J7041J6875J5908J4257
52119A496065J2247R999P654N436L343J125j327l867o414q889j0870j1877j2130
52106A480495j2485j3359j4157j4026j2751j0624p931m949k116K51K238M008N406
52093A400000O279O965Q047R577J0862J1168J0464R498R238J0130J1758J3163
52081A517149J3739J3792J4096J4911J5637J5443J4095J2015R731P522N524L788
52069A657442K085k4k562m842o318p584r860j3313j6619j8579j9591k0836k2519
$$ y = [1043391, 1050007, 1057319, 1065069, 1072427, 1078788, 1084559, 1090866, 1098574, 1107864, 1118510, 1130206, 1142675, 1155814, 1169697, 1184266, 1199142, 1214051, 1229206, 1244893, 1260861, 1276594, 1292011, 1307340, 1322425, 1336855, 1350889, 1365545, 1381462, 1398221, 1415103, 1431984, 1449025, 1465900, 1481808, 1496065, 1508312, 1518311, 1525965, 1531401, 1534744, 1535869, 1534542, 1530675, 1524261, 1515372, 1504502, 1492625, 1480495, 1468010, 1454651, 1440494, 1426468, 1413717, 1403093, 1395162, 1390213, 1388097, 1388348, 1390586, 1394594, 1400000, 1406279, 1413244, 1421291, 1430868, 1441730, 1452898, 1463362, 1472860, 1482098, 1492228, 1503986, 1517149, 1530888, 1544680, 1558776, 1573687, 1589324, 1604767, 1618862, 1630877, 1640608, 1648130, 1653654, 1657442, 1659527, 1659503, 1656941, 1652099, 1645781, 1638197, 1628337, 1615024, 1598405, 1579826, 1560235, 1539399, 1516880]
52056A516880k3805k4261k4302k4190k3587k2525k1863k2149k2575k1895k0077
52045A265651j8213j7008j6096j4945j3644j2486j1299r674p678n808m428l466
52033A130906k698j994j295o13j41k17r83k236l667n196o901q769j0601j2158
52019A073437j3232j3664j3524j3198j3156j3505j3933j4131j4123j4090j4114
52008I22767j4140j4128j4094j4111j4217j4295j4026j3209j2133j1394j1214
51997G75806j1176j0749r914q991q091p022n756m711m428m909n449n279m453l848
51983F81030m081m739n102n315o148p647q876r275r435j0044j0766j0826j0144
51970E78632r151p847n960l744j822k53J450L286M528M746M434M383M830N389
$$ y = [1516880, 1493075, 1468814, 1444512, 1420322, 1396735, 1374210, 1352347, 1330198, 1307623, 1285728, 1265651, 1247438, 1230430, 1214334, 1199389, 1185745, 1173259, 1161960, 1152286, 1144608, 1138800, 1134372, 1130906, 1128208, 1126214, 1124919, 1124306, 1124165, 1123948, 1122965, 1120729, 1117062, 1111866, 1104965, 1096196, 1085595, 1073437, 1060205, 1046541, 1033017, 1019819, 1006663, 993158, 979225, 965094, 950971, 936881, 922767, 908627, 894499, 880405, 866294, 852077, 837782, 823756, 810547, 798414, 787020, 775806, 764630, 753881, 743967, 734976, 726885, 719863, 714107, 709396, 704968, 700059, 694610, 689331, 684878, 681030, 676949, 672210, 667108, 661793, 655645, 647998, 639122, 629847, 620412, 610368, 599602, 588776, 578632, 569481, 561634, 555674, 551930, 550108, 549855, 551305, 554591, 559119, 563865, 568299, 572682, 577512, 582901]
51956E82901N445M483K473J7k134l773n098o066o364o038n502m849l675j774N28
51941E50574K880N182P231Q618R275R553R551Q872P349N414L391R64k150n420
51927F21284p958r458j0277j0833j1385j2154j3086j3706j3539j2648j1472j0306
51915D84462r218q250p348o285n008l854l115k510j512j2J661L275M865O449P942
51900D61542R349J0783J2142J2979J2735J1193Q787O448M859L866K906J997J823
51887E61409K733M242N768P182Q266Q260O660M015J278j214l497n098n384m603
51873E90017l712l181k722k166j751j530j330j521k930n620q450j0320j1216j1571
51859E21997j1265r922p843n887m513l426k170o99O50J512J783J612J120K45r99
$$ y = [582901, 588346, 592829, 595302, 595319, 593185, 589412, 584314, 578248, 571884, 565846, 560344, 555495, 551820, 550046, 550574, 553454, 558636, 565867, 574485, 583760, 593313, 602864, 611736, 619085, 624499, 627890, 628854, 626704, 621284, 613326, 603868, 593591, 582758, 571373, 559219, 546133, 532427, 518888, 506240, 494768, 484462, 475244, 466994, 459646, 453361, 448353, 444499, 441384, 438874, 437362, 437350, 439011, 442286, 447151, 453600, 461542, 470891, 481674, 493816, 506795, 519530, 530723, 539510, 545958, 550817, 554683, 557589, 559586, 561409, 564142, 568384, 574152, 581334, 589600, 597860, 604520, 608535, 609813, 608599, 605102, 600004, 594620, 590017, 586305, 583124, 580402, 578236, 576485, 574955, 573625, 572104, 569174, 563554, 555104, 544784, 533568, 521997, 510732, 500810, 492967, 487080, 482567, 479141, 476971, 476272, 476922, 478434, 480217, 481829, 482949, 483194, 482195]
51844D82195k137k625k630k962l992n092n455n065m436l796k964j895q38pN52
51829D38853Q15P86N98L32j26q00j361j507j504j924k813l503l380k565j704j274
51813D18923j195r82k06J064K262K855K855K629K266J399k11k117l453l762l445
51798D18882l313l706m175m091l488l026l100l272k864j929j153q38m41N92J899
51783C85977K579K405K088K160K076R85q27k011j783q82m33m20L6J204K439L395
51767C98988M496N924O994P229P356Q334R686R799P829M526J093k004m789p093
51753D58368q620r354r465r055q312p597p062o414n348m007k650j141P73K814
51739C82930M319N116N745O692P712Q195P971P396O837O303N667M942M219L441
$$ y = [482195, 480058, 477433, 474803, 471841, 467849, 462757, 457302, 452237, 447801, 444005, 441041, 439146, 438308, 438301, 438853, 439668, 440454, 441052, 441384, 441258, 440458, 439097, 437590, 436086, 434162, 431349, 427846, 424466, 421901, 420197, 418923, 417728, 416746, 416540, 417604, 419866, 422721, 425576, 428205, 430471, 431870, 431659, 429542, 426089, 422327, 418882, 415569, 411863, 407688, 403597, 400109, 397083, 393983, 390711, 387847, 385918, 384765, 383927, 383486, 384078, 385977, 388556, 390961, 393049, 395209, 397285, 398270, 397443, 395432, 393649, 392767, 392334, 391914, 391950, 393154, 395593, 398988, 403484, 409408, 416402, 423631, 430987, 439321, 449007, 458806, 466635, 471161, 472254, 470250, 465461, 458368, 449748, 440394, 430929, 421874, 413562, 405965, 398903, 392489, 387141, 383134, 380484, 379343, 380116, 382930, 387249, 392365, 398110, 404802, 412514, 420709, 428680, 436076, 442913, 449216, 454883, 459825, 464044, 467485]
51725D67485K419J051n64k245l869n338o492p081o893n921m516l320k817k815
51711D19084k604j808q80l50J79J732M426O897P607O494M869L914L732L714L351
51696D60357K577J772J620K573M193N220M583K315n76l070m816o070p154q099
51682D55425q672q686q159p212n916m357k728j138N10K277L850M784N020M825
51668D29823M241L075J593O25O59J182J419J392J754K750L975N061N934O301N564
51653D75348L582J063j148k787l904m399m283m060m210m537m630m754n541o799
51639D28941p471p047o260n895n622m637k996j541q16p92j401k454l128k592j301
51624C74988o40r30q15P13K615L245K763K807L928M703L763J570l99j454k039
$$ y = [467485, 469904, 470955, 470391, 468146, 464277, 458939, 452447, 445366, 438473, 432552, 428036, 424716, 421899, 419084, 416480, 414672, 413792, 413442, 413621, 415353, 419779, 426676, 434283, 440777, 445646, 449560, 453292, 457006, 460357, 462934, 464706, 466326, 468899, 473092, 478312, 482895, 485210, 484634, 481564, 476748, 470678, 463524, 455425, 446753, 438067, 429908, 422696, 416780, 412423, 409695, 408557, 409067, 411344, 415194, 419978, 424998, 429823, 434064, 437139, 438732, 439357, 440016, 441198, 442617, 444009, 445763, 448513, 452488, 457549, 463483, 469784, 475348, 478930, 479993, 478845, 476058, 472154, 467755, 463472, 459412, 455202, 450665, 446035, 441281, 435740, 428941, 421470, 414423, 408163, 402268, 396646, 392009, 389013, 387472, 386656, 385864, 384463, 382009, 378881, 376289, 374988, 374348, 373418, 372603, 373316, 375931, 379176, 381939, 384746, 388674, 393377, 397140, 398710, 398311, 396857, 394818]
51609C94818k698l359l556k921j557L4J499L105N278P662R197R308Q423P045N035
51594D37313K268o11k759m032m674m538l424j835n56M56J904L872N605O662P588
51579D43239R115J1314J3806J6233J8230J9485K0168K0899K1928K2779K2917K2365
51567F62478K1367J9954J8373J7513J8330K0956K4854K9612L5114M0924M5898
51556I55373M8501M7504M2569L4513K4866J4846M816n258j5088k4061l1712l7891
51544A058978m2585m5822m7661m8059m6962m4650m1716l8493l4870l0955k7442
51533F09763k4768k2330j9253j5756j2952j1337j0246r019p839p077o428n315
51521D57443l839k747k575l183m010m549m597m357m173m041l512k319r31j79m03
$$ y = [394818, 392120, 388761, 385205, 382284, 380727, 380761, 382260, 385365, 390643, 398305, 407502, 416810, 425233, 432278, 437313, 439581, 438970, 436211, 432179, 427505, 422967, 419543, 417708, 417152, 417608, 419512, 423384, 428989, 435651, 443239, 452354, 463668, 477474, 493707, 511937, 531422, 551590, 572489, 594417, 617196, 640113, 662478, 683845, 703799, 722172, 739685, 758015, 778971, 803825, 833437, 868551, 909475, 955373, 1003874, 1051378, 1093947, 1128460, 1153326, 1168172, 1172988, 1167730, 1152642, 1128581, 1096869, 1058978, 1016393, 970571, 922910, 874851, 827889, 783239, 741523, 703030, 668160, 637205, 609763, 584995, 562665, 543412, 527656, 514704, 503367, 493121, 484102, 476263, 469186, 462758, 457443, 453604, 450857, 448282, 445099, 441089, 436540, 431943, 427586, 423413, 419372, 415860, 413541, 412610, 412431, 412028]
51506D12028j189j954k496k846k865k301j242l03o7m20o18j76N90J060J159J262
51490C99622J440J317Q03M15N32P58N86L19P20J714K206J400j64j333j695j746
51474D06894j969k343k787l426m192m641m575m432m585m578l680k095q71n21m92
51459C61707k25L7N3M20J677L016L008J672P13J399L005L958L932M066N445Q101
51443D01984J1296J4145J5804J5707J4007J1605R394P562N765L896K436J810J522
51430E16933L06k561o233r009j0037r939r671r348q550p295o083n151m312l515
51416D25535l014k845k660k274j992k054k159j897j426j226j353j327q12K5R08
51401D01429J863K979M020M569M482M044L759M098N279P061Q781R905J0610J1669
$$ y = [412028, 410839, 408885, 406389, 403543, 400678, 398377, 397135, 396832, 396765, 396345, 395727, 395551, 396141, 397201, 398360, 399622, 401062, 402379, 403182, 403597, 404129, 404887, 405473, 405792, 406512, 408226, 410432, 411832, 411668, 410335, 408640, 406894, 404925, 402582, 399795, 396369, 392177, 387536, 382961, 378529, 373944, 369366, 365686, 363591, 362720, 362199, 361707, 361482, 361519, 361572, 361992, 363669, 366685, 369693, 371365, 372078, 373477, 376482, 380440, 384372, 388438, 393883, 401984, 413280, 427425, 443229, 458936, 472943, 484548, 493942, 501504, 507269, 511165, 513601, 515411, 516933, 517239, 514678, 508445, 499436, 489399, 479460, 469789, 460441, 451891, 444596, 438513, 433362, 429050, 425535, 422521, 419676, 417016, 414742, 412750, 410696, 408537, 406640, 405214, 403988, 402635, 401308, 400496, 400521, 401429, 403292, 406271, 410291, 414860, 419342, 423386, 427145, 431243, 436522, 443583, 452364, 462269, 472879, 484548]
51387D84548J3754J7044K1389K6603L2401L8391M4277M9963N5284N9847O3237
51376I06738O5124O4993O2141N6392M8540L9612K9828J8845O885n068j6361k7180
51364A250489l7609m6819n3784n8445o1481o3156o3048o0821n6728n1256m4858
51353F52484l8225l2291k7602k3915k0642j7497j4583j2107j0216q957q116p265
51341D31068o169n033m230l834l637l462l238k910k489k158k039j903j393o40
51327C87933k95p78j694k216j919j082l21j48p30j753k538k602k165j829j788
51312C66075j713j498j577k121k394j572k2R61Q22M41Q56J852K363J904R99L03
51296C65679q1l47n64p30r02j022q39j80Q13J888K973M102N163N885O079N833
$$ y = [484548, 498302, 515346, 536735, 563338, 595739, 634130, 678407, 728370, 783654, 843501, 906738, 971862, 1036855, 1098996, 1155388, 1203928, 1243540, 1273368, 1292213, 1299098, 1294030, 1277669, 1250489, 1212880, 1166061, 1112277, 1053832, 992351, 929195, 866147, 805326, 748598, 697342, 652484, 614259, 581968, 554366, 530451, 509809, 492312, 477729, 465622, 455406, 446449, 438333, 431068, 424899, 419866, 415636, 411802, 408165, 404703, 401465, 398555, 396066, 393908, 391869, 389966, 388573, 387933, 387638, 386860, 385166, 382950, 381031, 379949, 379628, 379480, 378750, 376997, 374459, 371857, 369692, 367863, 366075, 364362, 362864, 361287, 359166, 356772, 355200, 355178, 356139, 356961, 357402, 358258, 360110, 362473, 364377, 365376, 365679, 365598, 365251, 364687, 363957, 363055, 362033, 361194, 361014, 361827, 363715, 366688, 370790, 375953, 381838, 387917, 393750]
51280C93750N435N072M529L297J184j194k820l234k892k476k247k122k030j794
51266C92458j046K99J504J597N24p50j378j451j504j702j891k133k599l096l185
51251C75647k826k468k379k227j510k13J216K285K674K212J068r0m96n2M48J43
51235C73432r50j945k064j364m80J19M54P21R61J099J110J086J196J591K191K613
51219C79770K488J911J357J074Q66N70L97N14O56M95J64m9k65p35j150r19j87
51202C86957J78k26p78p92m19j21J24N19Q35P33M53N07Q47J030J088J532K424
51185C94891L104K966K131J171O09O66J107J250N80n80j462j921k506l389l924
51170C94693l601k786k060j381m35N54J064J049R58J008J026R03P52N92K66j86
$$ y = [393750, 399185, 404257, 408786, 412083, 413267, 412073, 409253, 406019, 403127, 400651, 398404, 396282, 394252, 392458, 391412, 391711, 393215, 394812, 395336, 394586, 393208, 391757, 390253, 388551, 386660, 384527, 381928, 378832, 375647, 372821, 370353, 367974, 365747, 364237, 364024, 365240, 367525, 370199, 372411, 373479, 373389, 372893, 372841, 373289, 373432, 372482, 370537, 368473, 367109, 366629, 366748, 367202, 367923, 368884, 369983, 371093, 372179, 373375, 374966, 377157, 379770, 382258, 384169, 385526, 386600, 387466, 388036, 388433, 388947, 389603, 390098, 390262, 390213, 389948, 389213, 388063, 387144, 386957, 387135, 386909, 386131, 385339, 384920, 384799, 384923, 385442, 386277, 387010, 387463, 387970, 388817, 389847, 390935, 392467, 394891, 397995, 400961, 403092, 404263, 404872, 405538, 406645, 407895, 408475, 407895, 406433, 404512, 402006, 398617, 394693, 391092, 388306, 386246, 384865, 384430, 384984, 386048, 387097, 388055, 389063, 390089, 390992, 391744, 392336, 392602, 392416]
51154C92416m58l64j21o2k46m21l38o6P5p4k97l26k61l43m37k89k36r58k236k809
51134C82149j959n86N0QK70J112J924K431K911L237K857K028J867K686L290K629
51118D06904J356P50Q38O30j33o10k95K26K79Q9K61P69J024Q12N93Q72J508J934
51100D17807J896J723J810K066K168K139K347K838L169L000K555K218K012J773
51086D49521J496J211P45N9m17k67K04J90n86j560k107k182k037j686r45J86J458
51069D43283K576L369L872M402N372O898Q649J0143J1128J1526J1196R998Q128
51056E40540O304N454O134Q105J0516J2524J3829J4583J4935J4757J3773J1777
51044F73231Q832N345K006n63k101k691k696k882m330p659j2245j6590j9553k0902
$$ y = [392416, 391958, 391594, 391473, 391411, 391165, 390744, 390406, 390340, 390415, 390341, 390044, 389718, 389457, 389114, 388677, 388388, 388152, 387194, 384958, 382149, 380190, 379604, 379654, 379662, 379932, 381044, 382968, 385399, 388310, 391547, 394404, 396432, 398299, 400985, 404275, 406904, 408260, 409010, 409848, 410478, 410345, 409735, 409440, 409666, 409945, 410034, 410295, 411064, 412088, 412900, 413493, 414365, 415873, 417807, 419703, 421426, 423236, 425302, 427470, 429609, 431956, 434794, 437963, 440963, 443518, 445736, 447748, 449521, 451017, 452228, 452973, 453032, 452615, 452348, 452552, 452742, 452156, 450596, 448489, 446307, 444270, 442584, 441639, 441825, 443283, 445859, 449228, 453100, 457502, 462874, 469772, 478421, 488564, 499692, 511218, 522414, 532412, 540540, 546844, 552298, 558432, 566537, 577053, 589577, 603406, 617989, 632924, 647681, 661454, 673231, 682063, 687408, 689414, 688851, 686750, 684059, 681363, 678481, 674151, 666492, 654247, 637657, 618104, 597202]
51030E97202k0729j9020j6124j3043j0649q858p129n417m067k976j666j48J065
51017D88441J865K754L864M594M720N026O245P852Q805R020R255R773J0122J0211
51003E82547J0526J1091J1329J1292J2104J4437J7386J9590K0839K1649K1907
50992G54697K1129J9686J8577J7904J6750J4729J2587J0892R140O707L819J021
50980I07638j516l412l655j738J312M083O634J0198J5188K0633K5720L0757L6204
50967A048046M1621M6174M9751N3020N6574O0395O3889O6297O7257O7147O6592
50956A686763O5561O3277N9168N3562M7313M1080L5121K9455K4027J8888J4339
50945B138554J0516O842K391l053q743j3870j8161k1443k3412k4245k4777k5532
$$ y = [597202, 576473, 557453, 541329, 528286, 517637, 508779, 501650, 496233, 492166, 489190, 487524, 487376, 488441, 490306, 493060, 496924, 501518, 506238, 511264, 517509, 525361, 534166, 543186, 552441, 562214, 572336, 582547, 593073, 604164, 615493, 626785, 638889, 653326, 670712, 690302, 711141, 732790, 754697, 775826, 795512, 814089, 831993, 848743, 863472, 876059, 886951, 896091, 902798, 906617, 907638, 906122, 902710, 899055, 897317, 898629, 902712, 909346, 919544, 934732, 955365, 981085, 1011842, 1048046, 1089667, 1135841, 1185592, 1238612, 1295186, 1355581, 1419470, 1485767, 1553024, 1620171, 1686763, 1752324, 1815601, 1874769, 1928331, 1975644, 2016724, 2051845, 2081300, 2105327, 2124215, 2138554, 2149070, 2155912, 2158303, 2155250, 2146507, 2132637, 2114476, 2093033, 2069621, 2045376, 2020599, 1995067]
50933A995067k6159k6391k6925k8525l0835l2994l5037l7707m1053m4259m6846
50922A618336m9026n0801n1648n1351n0286m8656m6246m3223m0328l7842l5185
50911A113744l1906k8410k5222k2292j9545j7277j5443j3356j0978r651j0358
50900I09306j1874j1902r857p278n559m569l772l376l660m101l973l276k454j647
50886H32008p82j2N90J400K715M069M737M852N303O490P703Q095P815P837Q829
50871I01649J0613J2690J4828J6993J8942K0382K1520K3056K5428K8269L0960
50860A125330L3523L6627M0760M5797N1450N7833O5289P3887Q3146R2329J01054
50849A807025J09702J18898J28407J36861J43061J47366J51015J54229J55674
$$ y = [1995067, 1968908, 1942517, 1915592, 1887067, 1856232, 1823238, 1788201, 1750494, 1709441, 1665182, 1618336, 1569310, 1518509, 1466861, 1415510, 1365224, 1316568, 1270322, 1227099, 1186771, 1148929, 1113744, 1081838, 1053428, 1028206, 1005914, 986369, 969092, 953649, 940293, 929315, 919664, 909306, 897432, 885530, 875673, 868395, 862836, 858267, 854495, 851119, 847459, 843358, 839385, 836109, 833655, 832008, 831226, 831214, 831804, 833204, 835919, 839988, 844725, 849577, 854880, 861370, 869073, 877168, 884983, 892820, 901649, 912262, 924952, 939780, 956773, 975715, 996097, 1017617, 1040673, 1066101, 1094370, 1125330, 1158853, 1195480, 1236240, 1282037, 1333487, 1391320, 1456609, 1530496, 1613642, 1705971, 1807025, 1916727, 2035625, 2164032, 2300893, 2443954, 2591320, 2742335, 2896564, 3052238]
50840C052238J53956J48716J39939J27225J10607R1445P1575N1873L2457J3916
50830C993947k697j6999k9295l9316m5853m8098m6639m2714l7128l0379k3416
50819C631413j7555j3853j2933j5145k0450k8274l7865m8763o0701p3238q5700
50808C216936r7342j07332j14882j19633j21804j21645j19049j13998j07080r9049
50798B095122r0031p9731o8397n7095m6863l7923k9825k2070j4551p721k352J112
50786A639675L025M089M462L738J811o85k972m796o319p808r604j1981j4690j7018
50772A580927j8682k0315k2680k5636k8357l0322l1626l2474l2971l3318l3655
50761A270891l3586l2392k9904k6736k3536k0450j7465j4757j2338r735o483k712
$$ y = [3052238, 3206194, 3354910, 3494849, 3622074, 3732681, 3824126, 3895701, 3947574, 3980031, 3993947, 3991250, 3974251, 3944956, 3905640, 3859787, 3811689, 3765050, 3722336, 3685208, 3654829, 3631413, 3613858, 3600005, 3587072, 3571927, 3551477, 3523203, 3485338, 3436575, 3375874, 3302636, 3216936, 3119594, 3012262, 2897380, 2777747, 2655943, 2534298, 2415249, 2301251, 2194171, 2095122, 2005091, 1925360, 1856963, 1799868, 1753005, 1715082, 1685257, 1663187, 1648636, 1640915, 1638563, 1639675, 1642700, 1646789, 1651251, 1654989, 1656800, 1656115, 1653143, 1648347, 1642028, 1634220, 1624616, 1612635, 1597945, 1580927, 1562245, 1541930, 1519250, 1493614, 1465257, 1434935, 1403309, 1370835, 1337864, 1304546, 1270891, 1237305, 1204913, 1175009, 1148273, 1124737, 1104287, 1086822, 1072065, 1059727, 1049992, 1043509, 1040797]
50749A040797J055M527P680J0405J2593J4631J7303K1004K5268K9334L3029L6874
50737A254500M1428M6710N2313N7872O3265O8413P3153P7383Q1183Q4546Q7084
50726A987850Q8196Q7628Q5673Q2746P8837P3345O5501N4977M2212K8066J3185
50715B688216k007j6620k9045l7954m3328m5979m6244m3808l8841l2420k5652
50704B326318j9042j2998q163m831k732k008l616q090j4531k1733k9667l8751
50692B160156m8032n5434n9831o1739o1860o0182n6783n2301m6972m0149l1490
50681A585383k1936j2765m249M141J2704K1379L0121L8603M5871N1049N4245N6131
50669A860677N6814N5759N2761M8327M3107L7462L1720K6362K1836J8300J5561
$$ y = [1040797, 1041852, 1046379, 1054059, 1064464, 1077057, 1091688, 1108991, 1129995, 1155263, 1184597, 1217626, 1254500, 1295928, 1342638, 1394951, 1452823, 1516088, 1584501, 1657654, 1735037, 1816220, 1900766, 1987850, 2076046, 2163674, 2249347, 2332093, 2410930, 2484275, 2549776, 2604753, 2646965, 2675031, 2688216, 2686209, 2669589, 2640544, 2602590, 2559262, 2513283, 2467039, 2423231, 2384390, 2351970, 2326318, 2307276, 2294278, 2286115, 2281284, 2278552, 2276544, 2272928, 2264838, 2250307, 2228574, 2198907, 2160156, 2112124, 2056690, 1996859, 1935120, 1873260, 1813078, 1756295, 1703994, 1657022, 1616873, 1585383, 1563447, 1550682, 1546433, 1550574, 1563278, 1584657, 1614778, 1653381, 1699252, 1750301, 1804546, 1860677, 1917491, 1973250, 2026011, 2074338, 2117445, 2154907, 2186627, 2212989, 2234825, 2253125, 2268686]
50658B268686J3127J0494P637N001K841Q41j269l148m282m618m265k952m03L072
50644B290762P166J2390J9296K6928L3149L6902L9301M2003M5214M7864M9183
50633B650158M9419M9324M9573N0295N0301M6641L5796J6347r197l5403n7144
50622B896110p2194q0943q4266q2396p5915o6708n6858m6925l6237k4774j3815
50611B255079m678K237O842Q770P932M921K33o376j5100k5161l5306m4835n3455
50598B101103o0512o5308o8067o9709p0579p0078o7738o3992n9646n5025n0088
50587A400361m4987m0101l5598l1263k6798k2186j7800j4113j1274q904o441l679
50575A137217r24J303K737L586M330N191N835N860N651O326Q571J1875J5265J8490
$$ y = [2268686, 2281813, 2292307, 2299944, 2304945, 2307786, 2308627, 2307358, 2304210, 2299928, 2295310, 2291045, 2288093, 2287690, 2290762, 2297928, 2310318, 2329614, 2356542, 2389691, 2426593, 2465894, 2507897, 2553111, 2600975, 2650158, 2699577, 2748901, 2798474, 2848769, 2899070, 2945711, 2981507, 2997854, 2988657, 2953254, 2896110, 2823916, 2742973, 2658707, 2576311, 2500396, 2433688, 2376830, 2329905, 2293668, 2268894, 2255079, 2250401, 2252638, 2259480, 2268250, 2276182, 2281103, 2281336, 2274960, 2259860, 2234699, 2199393, 2154558, 2101103, 2040591, 1975283, 1907216, 1837507, 1766928, 1696850, 1629112, 1565120, 1505474, 1450449, 1400361, 1355374, 1315273, 1279675, 1248412, 1221614, 1199428, 1181628, 1167515, 1156241, 1147337, 1140896, 1137217, 1136293, 1137596, 1140333, 1143919, 1148249, 1153440, 1159275, 1165135, 1170786, 1177112, 1185683, 1197558, 1212823, 1231313]
50561A231313K2014K6031L0091L3799L7301M0937M4714M8246N0976N2306N1945
50550A669673N0249M8011M5674M3040L9935L6938L5080L4906L6105L8086M0643
50539B118340M3906M7799N1853N5660N9423O3860O9525P6279Q3440R0312R6633
50528B857030J02693J08996J15483J21085J24382J24901J23305J20115J14750
50519C912740J06309R4790Q0826O4544M5651K4597K744j8877m0164o0930q0092
50508D132138r6421j09525j19344j25163j25979j21739j13476j02175q8100p1386
50498C058830n2715l3198j3928M066J9796L2508M1767M7082M7589M2369L1164
50487C225330J4745n370k7435m9827p0975q9289j03476j13117j18852j21762j22569
$$ y = [1231313, 1253327, 1279358, 1309449, 1343248, 1380549, 1421486, 1466200, 1514446, 1565422, 1617728, 1669673, 1719922, 1767933, 1813607, 1856647, 1896582, 1933520, 1968600, 2003506, 2039611, 2077697, 2118340, 2162246, 2210045, 2261898, 2317558, 2376981, 2440841, 2510366, 2586645, 2670085, 2760397, 2857030, 2959723, 3068719, 3184202, 3305287, 3429669, 3554570, 3677875, 3797990, 3912740, 4019049, 4113839, 4194665, 4259209, 4304860, 4329457, 4332201, 4313324, 4273160, 4212230, 4132138, 4035717, 3926192, 3806848, 3681685, 3555706, 3433967, 3320491, 3218316, 3130216, 3058830, 3006115, 2972917, 2958989, 2963055, 2982851, 3015359, 3057126, 3104208, 3151797, 3194166, 3225330, 3240075, 3234705, 3207270, 3157443, 3086468, 2997179, 2893703, 2780586, 2661734, 2539972, 2417403]
50476B417403j21447j18396j13560j07240r9884r2156q4726p7950p1766o5938
50466A464340o0234n4430m8476m2671l7423l2709k8113k3479j9236j5840j3128
50455A088601j0554p905n415l322j616k59P41J510K310L243M131M748N033N076
50441A086322N158N729P034Q689J0000J0863J1896J3421J4788J5204J4929J5020
50429A219053J5916J6951J7373J7308J7455J8258J9758K1918K4712K8019L1796
50418A448517L6217M1406M7052N2598N7796O2787O7635P2001P5386P7470P8175
50407B117040P7501P5400P1830O6848O0643N3390M5051L5416K4380J2124j048
50396B638575j4799k8635m1904n4111o4991p3971p9958q2214q1358p8799p5029
$$ y = [2417403, 2295956, 2177560, 2064000, 1956760, 1856876, 1764720, 1679994, 1602044, 1530278, 1464340, 1404106, 1349676, 1301200, 1258529, 1221106, 1188397, 1160284, 1136805, 1117569, 1101729, 1088601, 1078047, 1070142, 1064727, 1061405, 1059789, 1059530, 1060271, 1061781, 1064091, 1067334, 1071465, 1076213, 1081246, 1086322, 1091480, 1097209, 1104243, 1112932, 1122932, 1133795, 1145691, 1159112, 1173900, 1189104, 1204033, 1219053, 1234969, 1251920, 1269293, 1286601, 1304056, 1322314, 1342072, 1363990, 1388702, 1416721, 1448517, 1484734, 1526140, 1573192, 1625790, 1683586, 1746373, 1814008, 1886009, 1961395, 2038865, 2117040, 2194541, 2269941, 2341771, 2408619, 2469262, 2522652, 2567703, 2603119, 2627499, 2639623, 2638575, 2623776, 2595141, 2553237, 2499126, 2434135, 2360164, 2280206, 2197992, 2116634, 2037835, 1962806]
50385A962806o9131o0390m9786l9240k9617k0221j0218J4R186J6224K0744K2717
50373A753088K2086J8770J2830M558n450j6299k6924l6339m3864m9294n2845n4872
50361A525445n5628n5350n4401n3075n1268m8646m5270m1805l8833l6212l3304
50350A011653k9761k5821k2018j8869j6655j5096j3297j0577p468n337m804m922
50338H37028m298k726j255p85j120j346p87N23J939K688K502J913J846K807M509
50323H43438O231P413Q048Q612R668J1292J3028J4506J5963J7825J9805K0850
50311I96679K0043J7292J3164Q415L829J07k432l866m344l904k781j520n82N1
50297A040151O84J453K199K641K492J644L42r87k178l413m733n807o340o501o542
$$ y = [1962806, 1893675, 1833285, 1783499, 1744259, 1714642, 1694421, 1684203, 1684217, 1693403, 1709627, 1730371, 1753088, 1775174, 1793944, 1806774, 1811332, 1805882, 1789583, 1762659, 1726320, 1682456, 1633162, 1580317, 1525445, 1469817, 1414467, 1360066, 1306991, 1255723, 1207077, 1161807, 1120002, 1081169, 1044957, 1011653, 981892, 956071, 934053, 915184, 898529, 883433, 870136, 859559, 852091, 846754, 841950, 837028, 832730, 830004, 828749, 827964, 826844, 825498, 824711, 825234, 827173, 829861, 832363, 834276, 836122, 838929, 843438, 849669, 857082, 865130, 873742, 883410, 894702, 907730, 922236, 938199, 956024, 975829, 996679, 1016722, 1034014, 1047178, 1055593, 1059422, 1059529, 1057097, 1053231, 1048887, 1044983, 1042202, 1040682, 1040100, 1040151, 1040835, 1042288, 1044487, 1047128, 1049620, 1051264, 1051606, 1050619, 1048441, 1045028, 1040295, 1034488, 1028148, 1021647, 1015105]
50282A015105o229n019k798l06J244R35j237m335p191r248j0642j1536j1689j0844
50268I36210r202p275n487m005k603o77K177N297P310P690P442P749Q511Q820
50254I61957Q452P981P642O960N574L704J776J27r20j331j657k464l473l906l659
50239I86763l378l300k846j592J62K124M639Q066J2119J6278K0479K4965K9856
50226A094335L5076M0276M4556M6854M7036M6154M5168M3900M1721L8790L6009
50215A559875L4069L2993L2374L1420K8973K4045J6381O265n878j9214l2224m3329
50203A665750n1847n7963o1905o3581o2894o0007n5300m9338m2767l6058k9575
50192A094515k4172k1176k1275k3611k6534k9095l1213l2754l3146l2051k9736
$$ y = [1015105, 1008876, 1003857, 1001059, 1000753, 1001997, 1002932, 1001695, 997360, 990169, 980921, 970279, 958743, 947054, 936210, 927008, 919733, 914246, 910241, 907638, 906961, 909138, 914435, 921745, 929435, 936877, 944626, 953137, 961957, 970409, 978390, 986032, 992992, 998566, 1002270, 1004046, 1004173, 1003253, 1001922, 1000265, 997801, 994328, 990422, 986763, 983385, 980085, 977239, 975647, 975809, 977933, 982572, 990638, 1002757, 1019035, 1039514, 1064479, 1094335, 1129411, 1169687, 1214243, 1261097, 1308133, 1354287, 1399455, 1443355, 1485076, 1523866, 1559875, 1593944, 1626937, 1659311, 1690731, 1719704, 1743749, 1760130, 1766395, 1760517, 1741303, 1709079, 1665750, 1613903, 1555940, 1494035, 1430454, 1367560, 1307553, 1252253, 1202915, 1160148, 1124090, 1094515, 1070343, 1049167, 1027892, 1004281, 977747, 948652, 917439, 884685, 851539, 819488, 789752]
50181G89752k6727k3489k0500j8043j5881j3546j1040q786o896n045l107j449
50169F35243l56L45R83J697K534L512M461N221O030P302Q920J0261J1029J1617
50155G08799J2370J2955J2806J1888J0714R793R221Q582P188M851K384R07M81
50142H12939P1r31j753j369M7J521K734M306O582Q974J0655J1446J1737J1897
50128H78856J1953J1761J1333J1108J1745J3410J5384J6823J7878J9630K2717
50117A042598K6590L0492L4759M0461M7873N6082O4220P2401Q0898Q9021R5493
50106A680888R9745J02051J02552J01076R8096R4954R2648R1056Q9710Q8515Q6936
50095B728227Q3241P5619O3705M8203K9462P669j5824l8741n9678p8521r4873
$$ y = [789752, 763025, 739536, 719036, 700993, 685112, 671566, 660526, 651740, 644844, 639799, 636692, 635243, 634887, 635232, 636215, 637912, 640446, 643958, 648419, 653640, 659670, 666972, 675892, 686153, 697182, 708799, 721169, 734124, 746930, 758818, 769532, 779325, 788546, 797128, 804316, 809167, 811551, 812458, 812939, 813010, 812079, 810326, 808957, 809004, 810525, 813259, 817565, 824147, 833121, 843776, 855222, 866959, 878856, 890809, 902570, 913903, 925011, 936756, 950166, 965550, 982373, 1000251, 1019881, 1042598, 1069188, 1099680, 1134439, 1174900, 1222773, 1278855, 1343075, 1415476, 1496374, 1585395, 1680888, 1780633, 1882684, 1985236, 2086312, 2184408, 2279362, 2372010, 2463066, 2552776, 2641291, 2728227, 2811468, 2887087, 2950792, 2998995, 3028457, 3036126, 3020302, 2981561, 2921883, 2843362, 2748489]
50084B748489j07443j15536j20032j22035j21573j18405j13240j07019r9671r0692
50074A632843q0644p0987o2582n5300m8985m3845l9770l6158l2606k9184k5943
50063A106839k2700j9434j6332j3384j0382p447n053l436k418j829j722k115k846
50050I97741l701m370m483m057l737m052m650m836m670m772n170n253m951n032
50036I34007n877o748o702n672m178k552r22M67J374J840K045K168K441K951L320
50021I17962L059K260J449P03k72j199j406j203j886l727n174m987m116m146m737
50006H92580m215k216n0J580L555O666J0370J3870J7366K1436K5940L0266L4185
49993A051333L7886M1539M5289M9251N3181N6495N8846O0122N9764N6837N1387
$$ y = [2748489, 2641046, 2525510, 2405478, 2283443, 2161870, 2043465, 1930225, 1823206, 1723535, 1632843, 1552199, 1481212, 1418630, 1363330, 1314345, 1270500, 1230730, 1194572, 1161966, 1132782, 1106839, 1084139, 1064705, 1048373, 1034989, 1024607, 1017160, 1012107, 1008671, 1006253, 1004424, 1002702, 1000587, 997741, 994040, 989670, 985187, 981130, 977393, 973341, 968691, 963855, 959185, 954413, 949243, 943990, 939039, 934007, 928130, 921382, 914680, 909008, 904830, 902278, 901356, 901823, 903197, 905037, 907082, 909250, 911691, 914642, 917962, 921021, 923281, 924730, 925433, 925161, 923962, 922556, 921353, 919467, 915740, 910566, 905579, 901463, 897317, 892580, 888365, 886149, 886099, 887679, 891234, 897900, 908270, 922140, 939506, 960942, 986882, 1017148, 1051333, 1089219, 1130758, 1176047, 1225298, 1278479, 1334974, 1393820, 1453942, 1513706, 1570543, 1621930]
49982A621930M4935L9031L3884K9202K5620K4161K4439K4491K2523J7961J0720
49971A918897N02j2564k7259m1896n5320o6849p5632q0755q2097q0539p7128p2329
49959A247031o6191n9006n1424m3979l6796k9889k3433j7606j2318p516l601j115
49947H94157M7O40J105J040k4j708l123l976m787o106p954j0116j2513j5143j7933
49932H13606k0736k3154k4366k3636k1213j8312j5934j3997j1945r743p776o006
49920F16788l953j616K63J105J295J609K223K723L005L555M649N780O271O213
49906F49910O375P210Q392R441J0375J1554J3056J4557J5605J5837J5012J3143
49894G90467J0593P840N157K694O59r18k561n005q286j1536j3928j5551j7017
$$ y = [1621930, 1666865, 1705896, 1739780, 1768982, 1794602, 1818763, 1843202, 1867693, 1890216, 1908177, 1918897, 1919399, 1906835, 1879576, 1837680, 1782360, 1715511, 1639879, 1559124, 1477027, 1396488, 1319360, 1247031, 1180840, 1121834, 1070410, 1026431, 989635, 959746, 936313, 918707, 906389, 898873, 895272, 894157, 894204, 894844, 895949, 896989, 896965, 895257, 892134, 888158, 883371, 877265, 869311, 859195, 846682, 831539, 813606, 792870, 769716, 745350, 721714, 700501, 682189, 666255, 652258, 640313, 630570, 622794, 616788, 612835, 611219, 611482, 612587, 613882, 615491, 617714, 620437, 623442, 626997, 631646, 637426, 643697, 649910, 656285, 663495, 671887, 681328, 691703, 703257, 716313, 730870, 746475, 762312, 777324, 790467, 801060, 808900, 814057, 816751, 817410, 816492, 813931, 808926, 800640, 789104, 775176, 759625, 742608]
49881G42608j8494j9493j9639j9179j8600j8013j7106j5604j3530j1118q601o159
49869E57072l913j959l86O95J286J654K221L156M185M984N721O938Q784J0703
49855F01141J2097J3091J4238J5545J6245J5677J4039J2057J0174Q334O458M682
49843G43778L109J617k1j926m146o686r347j1565j2706j2563j1549j0279r045
$$ y = [742608, 724114, 704621, 684982, 665803, 647203, 629190, 612084, 596480, 582950, 571832, 563231, 557072, 553159, 551200, 550814, 551509, 552795, 554449, 556670, 559826, 564011, 568995, 574716, 581654, 590438, 601141, 613238, 626329, 640567, 656112, 672357, 688034, 702073, 714130, 724304, 732638, 739096, 743778, 746887, 748504, 748483, 746557, 742411, 735725, 726378, 714813, 702107, 689544, 677995, 667716, 658671]
$$ [...]
##END NTUPLES=NMR SPECTRUM
##END=
