##TITLE=AC1586_HPIAH_8317172_wSR4BCHP7P
##JCAMPDX= 6.0         $$ Bruker NMR JCAMP-DX V2.0
##DATA TYPE= NMR SPECTRUM
##DATA CLASS= NTUPLES
##ORIGIN= BRUKER
##OWNER= Administrator
$$ 1.72 TOPSPIN		Version 2.1
$$ 2013-11-10 00:09:52.389 -0800  Administrator@X
$$ Compression mode = diff/dup
##.OBSERVE FREQUENCY= 400.02188249412
##.OBSERVE NUCLEUS= ^1H
##.ACQUISITION MODE= SIMULTANEOUS (DQD)
##.ACQUISITION SCHEME= undefined
##.AVERAGES= 8
##.DIGITISER RES= 22
##SPECTROMETER/DATA SYSTEM= spect
##.PULSE SEQUENCE= zg30
##.SOLVENT NAME= COFFEE_meoh
##.SHIFT REFERENCE= INTERNAL, COFFEE_meoh, 1, 14.98509
##AUDIT TRAIL= $$ (NUMBER, WHEN, WHO, WHERE, PROCESS, VERSION, WHAT)
$$ ##TITLE= Audit trail, TOPSPIN		Version 2.1
$$ ##JCAMPDX= 5.01
$$ ##ORIGIN= Bruker BioSpin GmbH
$$ ##OWNER= Administrator
$$ $$ E:\/data/COFFEE/nmr/AC1586_HPIAH_8317172_wSR4BCHP7P/10/pdata/1/auditp.txt
$$ ##AUDIT TRAIL=  $$ (NUMBER, WHEN, WHO, WHERE, PROCESS, VERSION, WHAT)
(   1,<2013-11-10 00:09:45.748 -0800>,<Administrator>,<X>,<go>,<TOPSPIN 2.1>,
      <created by zg
	started at 2013-11-10 00:08:40.107 -0800,
	POWCHK enabled, PULCHK disabled,
       configuration hash MD5:
       C8 4E 4E 5D D3 5C D8 9E 9F 52 82 E0 59 8A DE 15
       data hash MD5: 64K
       25 31 4A 82 8F 11 74 61 DF CF CD 50 A0 D2 0B 58>)
(   2,<2013-11-10 00:09:48.639 -0800>,<Administrator>,<X>,<proc1d>,<TOPSPIN 2.1>,
      <Start of raw data processing
       efp LB = 0 FT_mod = 6 PKNL = 1 PHC0 = 0 PHC1 = 0 SI = 32K 
       data hash MD5: 32K
       79 97 32 1B 03 9A E1 08 09 AC 25 DD 7D F8 0C F9>)
(   3,<2013-11-10 00:09:48.951 -0800>,<Administrator>,<X>,<proc1d>,<TOPSPIN 2.1>,
      <pk PHC0 = 90.34607 PHC1 = 0 
       data hash MD5: 32K
       DD E0 A7 E5 D5 9F C5 46 94 03 C1 54 04 4A 47 DB>)
(   4,<2013-11-10 00:09:49.045 -0800>,<Administrator>,<X>,<proc1d>,<TOPSPIN 2.1>,
      <abs ABSG = 1 
       data hash MD5: 32K
       CC 9A 6B 8E F2 69 69 00 9C 5B 5F 20 A2 F2 8B 26>)
(   5,<2013-11-10 00:09:49.154 -0800>,<Administrator>,<X>,<proc1d>,<TOPSPIN 2.1>,
      <abs ABSG = 2 
       data hash MD5: 32K
       DE 4F 4D E6 CA 0A 8B 31 01 BA 8A 2D 6D C4 69 C2>)
(   6,<2013-11-10 00:09:49.217 -0800>,<Administrator>,<X>,<proc1d>,<TOPSPIN 2.1>,
      <abs ABSG = 3 
       data hash MD5: 32K
       8E E3 98 B1 04 B5 09 CA DB 52 59 61 59 10 33 18>)
(   7,<2013-11-10 00:09:49.279 -0800>,<Administrator>,<X>,<proc1d>,<TOPSPIN 2.1>,
      <abs ABSG = 4 
       data hash MD5: 32K
       69 56 F0 8B 9E 95 9C 61 86 AE E8 1B 6D 13 B6 BC>)
(   8,<2013-11-10 00:09:49.342 -0800>,<Administrator>,<X>,<proc1d>,<TOPSPIN 2.1>,
      <abs ABSG = 5 
       data hash MD5: 32K
       1B 34 B7 75 AC 98 EF A8 23 2F 2C 0F 64 00 D4 1F>)
$$ ##END=
$$ 
$$ $$ hash MD5
$$ $$ 5A 3A 3A 70 8E 4B A9 1A E8 DB 72 01 2A DB 13 18
##$RELAX= 
##$RELAX= 
##$RELAX= 
##$RELAX= 
##$RELAX= 
##$RELAX= 
##$RELAX= 
$$ Bruker specific parameters
$$ --------------------------
##$DU= <E:\>
##$EXPNO= 10
##$NAME= <AC1586_HPIAH_8317172_wSR4BCHP7P>
##$PROCNO= 1
$$ [...]
##$TP= (0..7)
150 150 150 150 150 150 150 150
##$TP07= 0
##$TPNAME0= <>
##$TPNAME1= <>
##$TPNAME2= <>
##$TPNAME3= <>
##$TPNAME4= <>
##$TPNAME5= <>
##$TPNAME6= <>
##$TPNAME7= <>
##$TPOAL= (0..7)
0.5 0.5 0.5 0.5 0.5 0.5 0.5 0.5
##$TPOFFS= (0..7)
0 0 0 0 0 0 0 0
##$TUNHIN= 0
##$TUNHOUT= 0
##$TUNXOUT= 0
##$USERA1= <user>
##$USERA2= <user>
##$USERA3= <user>
##$USERA4= <user>
##$USERA5= <user>
##$V9= 5
##$VALIST= <valist>
##$VCLIST= <CCCCCCCCCCCCCCC>
##$VD= 0
##$VDLIST= <DDDDDDDDDDDDDDD>
##$VPLIST= <PPPPPPPPPPPPPPP>
##$VTLIST= <TTTTTTTTTTTTTTT>
##$WBST= 1024
##$WBSW= 4
##$XGAIN= (0..3)
0 0 0 0
##$XL= 0
##$YL= 0
##$YMAX_a= 601667
##$YMIN_a= -521730
##$ZGOPTNS= <>
##$ZL1= 120
##$ZL2= 120
##$ZL3= 120
##$ZL4= 120
##$ABSF1= 14.98509
##$ABSF2= -5.573092
##$ABSG= 5
##$ABSL= 3
##$ALPHA= 0
##$AQORDER= 0
##$ASSFAC= 0
##$ASSFACI= 0
##$ASSFACX= 0
##$ASSWID= 0
##$AUNMP= <proc_prof1d_extract_pilot.lims>
##$AXLEFT= 0
##$AXNAME= <>
##$AXNUC= <1H>
##$AXRIGHT= 0
##$AXTYPE= 0
##$AXUNIT= <>
##$AZFE= 0.1
##$AZFW= 0.1
##$BCFW= 0
##$BC_mod= 0
##$BYTORDP= 0
##$COROFFS= 0
##$CY= 15
##$DATMOD= 1
##$DC= 0
##$DFILT= <>
##$DTYPP= 0
##$F1P= 0
##$F2P= 0
##$FCOR= 0.5
##$FTSIZE= 32768
##$FT_mod= 6
##$GAMMA= 0
##$GB= 0
##$INTBC= 1
##$INTSCL= 1
##$ISEN= 128
##$LB= 0
##$LEV0= 0
##$LPBIN= 0
##$MAXI= 10000
##$MC2= 0
##$MEAN= 0
##$ME_mod= 0
##$MI= 0
##$NCOEF= 0
##$NC_proc= -8
##$NLEV= 6
##$NOISF1= 0
##$NOISF2= 0
##$NSP= 0
##$NTH_PI= 0
##$NZP= 0
##$OFFSET= 14.98509
##$PC= 1
##$PHC0= 90.34607
##$PHC1= 0
##$PH_mod= 1
##$PKNL= yes
##$PPARMOD= 0
##$PPDIAG= 0
##$PPIPTYP= 0
##$PPMPNUM= 2147483647
##$PPRESOL= 1
##$PSCAL= 4
##$PSIGN= 0
##$PYNMP= <proc.py>
##$REVERSE= no
##$SF= 400.02
##$SI= 32768
##$SIGF1= 0
##$SIGF2= 0
##$SINO= 400
##$SIOLD= 32768
##$SPECTYP= <>
##$SREGLST= <1H.CDCl3>
##$SSB= 0
##$STSI= 32768
##$STSR= 0
##$SW_p= 8223.68421052631
##$SYMM= 0
##$S_DEV= 0
##$TDeff= 65536
##$TDoff= 0
##$TI= <>
##$TILT= no
##$TM1= 0
##$TM2= 0
##$TOPLEV= 0
##$USERP1= <user>
##$USERP2= <user>
##$USERP3= <user>
##$USERP4= <user>
##$USERP5= <user>
##$WDW= 1
##$XDIM= 32768
##$YMAX_p= 467907867
##$YMIN_p= -824220
##$CURPLOT= <Network HP LaserJet P1505>
##$CURPRIN= <$Network HP LaserJet P1505>
##$DFORMAT= <normdp>
##$LAYOUT= <+/1D_H.xwp>
##$LFORMAT= <normlp>
##$PFORMAT= <normpl>
##$SURQMSG= 1
$$ End of Bruker specific parameters
$$ ---------------------------------
##NTUPLES= NMR SPECTRUM
##VAR_NAME=  FREQUENCY,     SPECTRUM/REAL,   SPECTRUM/IMAG
##SYMBOL=    X,             R,               I
##VAR_TYPE=  INDEPENDENT,   DEPENDENT,       DEPENDENT
##VAR_FORM=  AFFN,          ASDF,            ASDF
##VAR_DIM=   32768,         32768,           32768
##UNITS=     HZ,            ARBITRARY UNITS, ARBITRARY UNITS
##FACTOR=    0.250966925370066, 1,           1
##FIRST=     8223.43324360094, -239523,      16941
##LAST=      0,             -23075,          50119
##MIN=       0,             -824220,         0
##MAX=       8223.43324360094, 467907867,    0
$$ Real data points
##PAGE= N=1
##DATA TABLE= (X++(R..R)), XYDATA
$$ [...]
19547A4977J6385a94129b6675k15529G8354b180I5216e4403k87268c032k98210
$$ 14977 31362 -194129 -26675 -242204 78354 -2180 95216 -54403 -341671 -3032 -301242
19536c01242N8369h4957A24675b81567e1670k27969H5966k7302i9756H5461Q1380
$$ -301242 -242873 -84957 124675 -281567 -51670 -279639 85966 58664 -99756 85461 166841
19525A66841p5694d83883K40055a13027d4344r2058A6976b4839k7281j92095J4234
$$ 166841 91147 -483883 -243828 -113027 -44344 -136402 16976 -24839 -52120 -244215 -229981
19514b29981i0660c4989p4286b6566k51567h8962c9329j56530K7554H668J60263
$$ -229981 -90660 -34989 -109275 -26566 -278133 -88962 -39329 -195859 -168305 8668 168931
19503A68931E2442a02043A66580L856C5574c23252a24442A19217a42092l56920
$$ 168931 52442 -102043 166580 170436 35574 -323252 -124442 119217 -142092 -499012
19493d99012c7049l26942h0210m40856a26868k09060F1809A2551j213J98433o5761
$$ -499012 -37049 -363991 -80210 -521066 -126868 -335928 61809 12551 11338 209771 144010
19482A44010A4574a17375j0807B34127A00043f2826O770D2025a4515p2060B04204
$$ 144010 14574 -117375 -128182 234127 100043 -62826 -56056 42025 -14515 -86575 204204
19470c10280a38009j2822n151l77166B6983f4912r9402A93851A3972a49156j12325
$$ -310280 -138009 -150831 -155982 -533148 26983 -64912 -164314 193851 13972 -149156 -261481
19459b61481a2090l2960k34367h5782C5620b33555E0725f4047j62863a1732H3387
$$ -261481 -12090 -45050 -279417 -85782 35620 -233555 50725 -64047 -226910 -11732 83387
19447A05287b08999d6020A90866a99755q2986A08352a2168k67584j15021J82701
$$ 105287 -208999 -46020 190866 -199755 -282741 108352 -12168 -279752 -394773 -212072
19437b12072B80435h2426I0793e4906A12560a05874r6052B91098a13513j553b3743
$$ -212072 280435 -82426 90793 -54906 112560 -105874 -201926 291098 -113513 -115066 -23743
19425d0565n5877j69786b3990B12046b89502a05637F5759g43k06778A17102D9062
$$ -40565 -96442 -266228 -23990 212046 -289502 -105637 65759 -743 -207521 117102 49062
19413a97922f6770r8142E2175J02341c52638A48489c2926F2904k2989a78966M7102
$$ -197922 -66770 -164912 52175 154516 -352638 148489 -32926 62904 39915 -178966 -131864
19402a31864R790A19492J90741C7431i9766p0519N4848a1753j26465I7457B3582
$$ -131864 -122074 119492 310233 37431 -99766 -170285 -115437 -11753 -138218 97457 23582
19390F6109K5543e8522k48034j03436C5483b24852A16743L20256b94797a05447
$$ 66109 91652 -58522 -306556 -409992 35483 -224852 116743 436999 -294797 -105447
19379b42820C1244O702a14916G0213a24563e1830j200E7466e1907o8350e1658
$$ -242820 31244 37946 -114916 70213 -124563 -51830 -53030 57466 -51907 -120257 -51658
19367b36188L5488E2318J1240b67114a10551n9897j2344M9169H305c62683h9027
$$ -236188 -200700 52318 63558 -267114 -110551 -170448 -182792 -133623 8305 -362683 -89027
19355h4485A1783m115b75251B435e6990j99325l55024b61680a16657J6241l19181
$$ -84485 11783 7668 -275251 2435 -56990 -256315 -611339 -261680 -116657 -100416 -419597
19344d19597a85543C85296b5163j87748j5637Q8549j35457H4626b24745k40747
$$ -419597 -185543 385296 -25163 -212911 -228548 -139999 -275456 84626 -224745 -465492
19334d65492D0386a50983h289k09194c6234j22062D1024g4501A5232N875g4277
$$ -465492 40386 -150983 -8289 -217483 -36234 -158296 41024 -74501 15232 21107 -74277
19322G0784e07490C191f1730H6023b85923E3533K8131N2370b6141G5154P481K3054
$$ 70784 -507490 3191 -61730 86023 -285923 53533 81664 134034 -26141 75154 82635 105689
19310A05689l901M1045a45179D3080g9115A74172A3328O1776J85484a684D9768
$$ 105689 101788 142833 -145179 43080 -79115 174172 13328 75104 260588 -1684 49768
19298g2139d341B00584a88515b363E097L774b5026k1194l8637B54915D2909e811
$$ -72139 -4341 200584 -188515 -2363 5097 8871 -25026 -46220 -84857 254915 42909 -5811
19285a50660L7748K0423k7921B0041b82589A38342E4347b77221E691b09886A00454
$$ -150660 -112912 -92489 -120410 20041 -282589 138342 54347 -277221 5691 -209886 100454
19273a4565C86398a94233D4443a22940a7712j33592C12928e5977c090D138a69362
$$ -14565 386398 -194233 44443 -122940 -17712 -151304 312928 -55977 -3090 4138 -169362
19261C2819a29388a9614l9747A79657E256a8458j92377j2154d3581j61446B19203
$$ 32819 -129388 -19614 -59361 179657 5256 -18458 -210835 -222989 -43581 -205027 219203
19249c79274B91819b43208M4580k2390F3908a74443A5389b03878M7192C915A620
$$ -379274 291819 -243208 -198628 -221018 63908 -174443 15389 -203878 -156686 3915 1620
19237B0733c21142a01032c1399j11815F9275a026A16964d6558j47523A99601a29588
$$ 20733 -321142 -101032 -31399 -143214 69275 -1026 116964 -46558 -194081 199601 -129588
19225f5390K69A976a40686D41418j96669c20533A48283b8855j32999d2445j76703
$$ -65390 -65121 1976 -140686 441418 244749 -320533 148283 -28855 -161854 -42445 -219148
19214b19148F9610D549a47240a0248m5045b5297A22217a79342A94971I4648j7803
$$ -219148 69610 4549 -147240 -10248 -55293 -25297 122217 -179342 194971 94648 76845
19203G6845a111D1292M2599m1456d67695b21043h2658j35893m2415E0883J62018
$$ 76845 -1111 41292 83891 42435 -467695 -221043 -82658 -218551 -260966 50883 212901
19192B12901c98431b4879N517e507G4997A6255e38031C1593b19226C8248R4000
$$ 212901 -398431 -24879 -19362 -5507 74997 16255 -538031 31593 -219226 38248 132248
19181A32248a19357c9195k43582D7580c26162c552j06013A28329d07338A87195
$$ 132248 -119357 -39195 -282777 47580 -326162 -3552 -109565 128329 -407338 187195
19170A14532a04259j09266A1216c61043J23027B47323a12851f937j61730O6706
$$ 114532 -104259 -213525 11216 -361043 -238016 247323 -112851 -6937 -168667 -101961
19160a01961j3647E930d72186H4886a3368C3718f3110k80594B38412c8025G157
$$ -101961 -115608 5930 -472186 84886 -13368 33718 -63110 -343704 238412 -38025 7157
19148B42673b18690i971k1006B4070R0981P9462b3324m754j03892l09738h9217
$$ 242673 -218690 -9971 -30977 24070 115051 194513 -23324 -28078 -131970 -441708 -89217
19136B8105O0683a85451d5813k24444A72287b43172F3680a83745A16641d5807
$$ 28105 88788 -185451 -45813 -270257 172287 -243172 63680 -183745 116641 -45807
19125a32o1262K9721j03453O3248K6427p0108j56938B79017b50016I1640a1296
$$ -132 -61394 -31673 -135126 -71878 -45451 -115559 -272497 279017 -250016 91640 -11296
19113A79089A7377J90459a6762B48236a62109I3333a98625M1308l1038h0335J2045
$$ 179089 17377 207836 -16762 248236 -162109 93333 -198625 -157317 -188355 -80335 -68290
19102f8290J7526k8877a3313j78422B21107a2734k13167m458i7771j8716J4930
$$ -68290 -50764 -79641 -13313 -191735 221107 -12734 -225901 -230359 -97771 -116487 -101557
19091a01557r0156c1718A19252M2192d5500A04749b67780a0657l12790K9615i0185
$$ -101557 -191713 -31718 119252 161444 -45500 104749 -267780 -10657 -323447 -293832 -90185
19079b01250A38032a67189A47219R3871A03086P4004n9083a3367H6570O4075b16451
$$ -201250 138032 -167189 147219 241090 103086 177090 118007 -13367 86570 150645 -216451
19067a15704A1552a26122G5101a3750A8825f5422G1472c6904E9657b99237F19641
$$ -115704 11552 -126122 75101 -13750 18825 -65422 71472 -36904 59657 -299237 619641
19055C2824a48492l6562G3835a34444k2702A32880d82269b47F2189P5372E041
$$ 32824 -148492 -185054 73835 -134444 -157146 132880 -482269 -247 62189 137561 5041
19043a22604F9176a2547F1387b78845c4075k91956A63053O4937f121C6906f6960
$$ -122604 69176 -12547 61387 -278845 -34075 -326031 163053 227990 -6121 36906 -66960
19031d3460I8890a96578a6556E6794M148a79873M9145f4399L495j35869A39242
$$ -43460 98890 -196578 -16556 56794 60942 -179873 -130728 -64399 -60904 -196773 139242
19019B49584J17781J03678B9833d0318A42570b54000J00585g6470k80951B211
$$ 249584 367365 471043 29833 -40318 142570 -254000 -153415 -76470 -357421 2211
19008C2413P5412h00A74383C7867M4239l5191a44107j77982J24153C44863c9722
$$ 32413 107825 -800 174383 37867 82106 46915 -144107 -322089 -197936 344863 -39722
18996B7724g6289q2764a1764j22806E4246J15355P2075b83736J25166L0740k07006
$$ 27724 -76289 -159053 -11764 -134570 54246 169601 241676 -283736 -158570 -127830 -334836
18985c34836m016i1324K6945j15322j90980D7210a08934J7224b8213k26257o0813
$$ -334836 -338852 -91324 -64379 -179701 -370681 47210 -108934 -91710 -28213 -254470 -315283
18974c15283h8496F3493k1357K23366a16752l0482l88907E7059j6470L58072g5119
$$ -315283 -88496 63493 42136 265502 -116752 -147234 -536141 57059 40589 398661 -75119
18962G045b63531a3957j38919n5537A2428g5933m5393M0723D7808a10749l9815
$$ 7045 -263531 -13957 -152876 -208413 12428 -75933 -121326 -80603 47808 -110749 -150564
18951a50564G9879g1887o67414I057N633a74118l4172A53123a91302B6860J6145
$$ -150564 79879 -71887 -739301 9057 14690 -174118 -208290 153123 -191302 26860 43005
18940D3005a59916b2237B67357E4899f0676j61603L522k09205m2756B19998a57835
$$ 43005 -159916 -22237 267357 54899 -60676 -222279 -218757 -427962 -470718 219998 -157835
18928g435n1703p6428f087p3920A59680a7103B72657r2040F4362d06311A94834
$$ -7435 -59138 -135566 -6087 -80007 159680 -17103 272657 180617 64362 -406311 194834
18916I0727a24994j11179Q3061r8118A53125c27132A61866B0229J22203a58214
$$ 90727 -124994 -236173 -153112 -251230 153125 -327132 161866 20229 142432 -158214
18905a01167A27797B2361c8967k3266l9882b3232A80432k9305c70534A67352a99797
$$ -101167 127797 22361 -38967 -62233 -102115 -23232 180432 151127 -370534 167352 -199797
18893b59139E0509D057h4808j6834n1510A17913l1286a44245L0309B92655A9093
$$ -259139 50509 4057 -84808 -101642 -153152 117913 86627 -144245 -113936 292655 19093
18881d7376m94502A34058M7730o9921c22114B2743a31910d0639F502f5703A08118
$$ -47376 -541878 134058 181788 111867 -322114 22743 -131910 -40639 6502 -65703 108118
18869f8911k66667m8764I7843a15556E9801H207R4590R6702a37334I7879h1178
$$ -68911 -335578 -384342 97843 -115556 59801 8207 102797 199499 -137334 97879 -81178
18857B85044a98681a8827j02341k05222C250Q9753e3643B3166K21891c1962k1010
$$ 285044 -198681 -18827 -121168 -326390 3250 93003 -53643 23166 245057 -31962 -52972
18846e2972C33536E7987r135c68197a50538J2962B7520a02428A17867b70497R9959
$$ -52972 333536 57987 48852 -368197 -150538 -137576 27520 -102428 117867 -270497 -170538
18835a70538f8514K7882B40635o7184J97463o1710a34478a5200n1181r1556J3223
$$ -170538 -68514 -40632 240635 173451 370914 309204 -134478 -15200 -66381 -157937 -144714
18824a44714o3014b3195k74168a20777B9654J05412o1757K01910A0005J02855
$$ -144714 -207728 -23195 -297363 -120777 29654 135066 73309 275219 10005 112860
18814A12860C7626b9711B51550G2583B3841M16003d0421B32423n5382R7735C333
$$ 112860 37626 -29711 251550 72583 23841 439844 -40421 232423 177041 274776 3333
18802H3567a87692P5618k16538i2069l62340E037a11935k99c1619D15513b6308
$$ 83567 -187692 -112074 -328612 -92069 -454409 5037 -111935 -112234 -31619 415513 -26308
18790B1533O3518K91086p3562G2876b8525j71985M2796A5467J499M0613J21546
$$ 21533 85051 376137 302575 72876 -28525 -200510 -157714 15467 16966 57579 179125
18779A79125b60931f735B6796d6230F0424b19844H4278d8996j95311a11708H0557
$$ 179125 -260931 -6735 26796 -46230 60424 -219844 84278 -48996 -244307 -111708 80557
18767a20259j43482I2593J20578a37937D8232L12726c07532h7249c7194j14279
$$ -120259 -263741 92593 213171 -137937 48232 360958 -307532 -87249 -37194 -151473
18757a51473M8866P701c4402A09724h7391i884j17022A05950C8379R2075g3897
$$ -151473 -102607 -94906 -34402 109724 -87391 -9884 -126906 105950 38379 130454 -73897
18745b50902A27270b17574f8621r8856d4603A75058a17956k09659d7576A34432
$$ -250902 127270 -217574 -68621 -167477 -44603 175058 -117956 -327615 -47576 134432
18734A04986a54223A6419R9521D301a03528j25414o1296B4649a95182O3847E5276
$$ 104986 -154223 16419 115940 4301 -103528 -228942 -290238 24649 -195182 -131335 55276
18722e4917j7955B16300a14291o7147R588A40949a13598m785c007n2632G6287
$$ -54917 -72872 216300 -114291 -181438 -171850 140949 -113598 -118383 -3007 -55639 76287
18710c9886F4497A1699a5238C34063a40324l4086i768E8672J87978a20844A2992
$$ -39886 64497 11699 -15238 334063 -140324 -174410 -9768 58672 246650 -120844 12992
18698d28961P7124J4768H0459l304k861h5404A24447l8435J93615h6337c8096
$$ -428961 -351837 -337069 80459 77155 74294 -85404 124447 86012 279627 -86337 -38096
18686b15845J07332A75916C6056a35545l9615A46292l768a11102B598J22041m5502
$$ -215845 -108513 175916 36056 -135545 -175160 146292 142524 -111102 2598 124639 79137
18675G9137a40352r55d1536j23902A40883a20694k46028M0563A87739e9551b5908
$$ 79137 -140352 -141307 -41536 -165438 140883 -120694 -366722 -326159 187739 -59551 -25908
18663a00312J0544G6993a84215k37331q5555a55727Q181F5594i2996B02536A2020
$$ -100312 -89768 76993 -184215 -421546 -507101 -155727 -147546 65594 -92996 202536 12020
18651a70749B44821g25563a23992o09b2101j65704e6541K6361j32495K0481b9931
$$ -170749 244821 -725563 -123992 -124601 -22101 -187805 -56541 -30180 -162675 -142194 -29931
18639e43831A79233D0020b59636O8407A84439f8406E3768h3242j2395A31d3250
$$ -543831 179233 40020 -259636 -191229 184439 -68406 53768 -83242 -95637 131 -43250
18627b67264a1691j48634D0902J32501a38801I9053c22442J26436e4144j25800
$$ -267264 -11691 -160325 40902 173403 -138801 99053 -322442 -196006 -54144 -179944
18617a79944P6220k9170C9199a69686l940H4749a74217g9357j08259k593j75788
$$ -179944 -103724 -132894 39199 -169686 -173626 84749 -174217 -79357 -187616 -190209 -365997
18606c65997a5798j09680l7683I9432b0746B17173e8979b7016H595c20850B46810
$$ -365997 -15798 -125478 -163161 99432 -20746 217173 -58979 -27016 8595 -320850 246810
18594C41094H7563N158b35054B1770b9938l32053j61481J70482c6166A85238q270
$$ 341094 87563 92721 -235054 21770 -29938 -361991 -523472 -352990 -36166 185238 176968
18583A76968c9766k03221B33523o36m2906q8317d6268C85805A0530R7650l5157
$$ 176968 -39766 -242987 233523 232887 189981 101664 -46268 385805 10530 108180 73023
18572G3023J28128j2973a04222C25575c80438J28274d7061C63306F8165J21183
$$ 73023 201151 188178 -104222 325575 -380438 -252164 -47061 363306 68165 189348
18562A89348o5001a46708l6467P0943Q914k39282D6332a41213j93D4947D464c20901
$$ 189348 124347 -146708 -183175 -112232 -103318 -342600 46332 -141213 -141406 44947 4464 -320901
18549B66749g6842k9485A61119m3101R3826H8625b1383m0628q0245j3776A66441
$$ 266749 -76842 -106327 161119 118018 211844 88625 -21383 -62011 -142256 -156032 166441
18537a33060A8174K88607B7962J37995d1497k52432m3773B15094b66245a25743
$$ -133060 18174 306781 27962 165957 -41497 -293929 -337702 215094 -266245 -125743
18526A07405C2848a02779G8312b8641j53086N8539D13790b14746D6427J6814a18734
$$ 107405 32848 -102779 78312 -28641 -181727 -123188 413790 -214746 46427 63241 -118734
18514a557A33490d4058A3792d0355B35263c30775D8709b87606B01439b61570a7800
$$ -1557 133490 -44058 13792 -40355 235263 -330775 48709 -287606 201439 -261570 -17800
18502c4264j04680D5184R7059c27172e4491H7839O9896K5806a50538A9426b05597
$$ -34264 -138944 45184 142243 -327172 -54491 87839 157735 183541 -150538 19426 -205597
18490a58397l69398I808b29681B41540a73398A22141a99125l1679F5823i1609
$$ -158397 -527795 9808 -229681 241540 -173398 122141 -199125 -230804 65823 -91609
18479B1114b88044a14300k0810j04401G7256e6063A69920p8857L7818j4107f3086
$$ 21114 -288044 -114300 -135110 -239511 77256 -56063 169920 91063 128881 114774 -63086
18467a11669F4239A2220c31828H4065J25923i8954o3330A39958l9044b02717g9609
$$ -111669 64239 12220 -331828 84065 209988 -98954 -162284 139958 100914 -202717 -79609
18455a97631l4668a01445j35346P4062n4157B19725b697k21853A18856d9169j65457
$$ -197631 -232299 -101445 -236791 -162729 -216886 219725 -2697 -224550 118856 -49169 -214626
18444b14626B42870j4377b85700D1764a05202k18395e6355k06597R9874N6721
$$ -214626 242870 228493 -285700 41764 -105202 -323597 -56355 -262952 -163078 -106357
18434a06357b6268B04805b28062k2354d0324A09276k3234a64459O4242d1083n2115
$$ -106357 -26268 204805 -228062 -250416 -40324 109276 86042 -164459 -100217 -41083 -93198
18423i3198A96238J16322c20919e4941A59366a98753k4688L3941L4278b4644k95943
$$ -93198 196238 312560 -320919 -54941 159366 -198753 -223441 -189500 -155222 -24644 -320587
18412c20587Q0673k9134B74135a17153q954o1602A68300b69908E6585p988a4063
$$ -320587 -239914 -269048 274135 -117153 -126107 -187709 168300 -269908 56585 48597 -14063
18400a31939A21295j8871a26146n8112q9807B86942a43455e3302n3119b9935A5942
$$ -131939 121295 102424 -126146 -184258 -274065 286942 -143455 -53302 -106421 -29935 15942
18388c70639A88774a96198g0528E8930R35d6260m85969h5428C3351a73823l8294
$$ -370639 188774 -196198 -70528 58930 59865 -46260 -532229 -85428 33351 -173823 -212117
18377b12117B89984i4364H0849b13411n0083f4745n733j77498J02580k25917E53735
$$ -212117 289984 -94364 80849 -213411 -263494 -64745 -70478 -247976 -145396 -371313 553735
18365B95449H6439l0476b23764Q7021n7451C10020D9625c8167B24707H8713N6692
$$ 295449 86439 55963 -223764 -136743 -194194 310020 49625 -38167 224707 88713 145405
18354A45405E364a96430L5620A49178p4232b7579j84612A22296a69820B62159
$$ 145405 5364 -196430 -160810 149178 74946 -27579 -212191 122296 -169820 262159
18343B51957b51875O1079d7990a0869I8004a29490f765o3195p7410N6774L2431
$$ 251957 -251875 -190796 -47990 -10869 98004 -129490 -6765 -69960 -147370 -90596 -58165
18332e8165B89650e6896r5491A52151k4699d38217a01691j91204f2568j87041
$$ -58165 289650 -56896 -152387 152151 127452 -438217 -101691 -292895 -62568 -249609
18322b49609N540G2697a116D1969K41058f2774l42935A59685G9623a56540r3698
$$ -249609 -244069 72697 -1116 41969 283027 -62774 -405709 159685 79623 -156540 -250238
18311b50238c7067A9024b69693A97473C623K16872a01689j98215J42927a0639
$$ -250238 -37067 19024 -269693 197473 3623 220495 -101689 -299904 -156977 -10639
18300g2531k4895q1434B70974a67921m5186A25610O7061g4283o3486f0992A17386
$$ -72531 -97426 -178860 270974 -167921 -213107 125610 192671 -74283 -137769 -60992 117386
18288A38133c30775f4060I6973h9711A72557B9963e8009j2322k24080B87947b07537
$$ 138133 -330775 -64060 96973 -89711 172557 29963 -58009 -70331 -294411 287947 -207537
18276C27043b65631j8756a06178A96802m9379g6557j3464n6031N3076d4272p79948
$$ 327043 -265631 -284387 -106178 196802 147423 -76557 -90021 -146052 -92976 -44272 -824220
18265h24220a74179p305h0888k06022A68282b697k0269F1116J67261b2039B47802
$$ -824220 -174179 -181484 -80888 -286910 168282 -2697 -22966 61116 228377 -22039 247802
18253c2891k04872B63911i0224c672m9784B78333a69461A21965n3753a21900j7204
$$ -32891 -237763 263911 -90224 -3672 -53456 278333 -169461 121965 68212 -121900 -139104
18242a39104H703c69697h2515I8246c32903I8418b79245n0144A45562a86129d9016
$$ -139104 8703 -369697 -82515 98246 -332903 98418 -279245 -329389 145562 -186129 -49016
18230B3408A1118a17798B00496a05393A76456a53119f4532J8501C67230H6639
$$ 23408 11118 -117798 200496 -105393 176456 -153119 -64532 -46031 367230 86639
18219a11j64697I0Q6849L0923a64179r3195K0218B08793a25254m2155d6533m3743
$$ -111 -164808 90 86939 117862 -164179 -257374 -237156 208793 -125254 -167409 -46533 -90276
18207i0276k23985J51161N0731j09734P8183A29922g3461o1005I2861P8700b55693
$$ -90276 -314261 -163100 -112369 -222103 -143920 129922 -73461 -134466 92861 171561 -255693
18195B24226b02634g6397q6179e1754j8285D1465r164a51128j998a1052A83795
$$ 224226 -202634 -76397 -162576 -51754 -70039 41465 32301 -151128 -153126 -11052 183795
18183B42664b49346a5722F5745d318A05378A6493J45733a38287a6311n62843J71056
$$ 242664 -249346 -15722 65745 -4318 105378 16493 162226 -138287 -16311 -579154 -408098
18172d08098A18845J17972M7679C5264L54353b59026g7743B30176c82394a84166
$$ -408098 118845 236817 284496 35264 389617 -259026 -77743 230176 -382394 -184166
18161b09127k0555J4144e6558k29213A00645e6132C63011j81443c07487P8218
$$ -209127 -229682 -215538 -56558 -285771 100645 -56132 363011 181568 -307487 -229269
18151b29269g8063G352J91764N8363f0399B8797J78402M7007f4805m7000E0971
$$ -229269 -78063 7352 199116 257479 -60399 28797 207199 254206 -64805 -111805 50971
18139A74729c264B7178N5499a24708c9452B97260h9944N859f438k62813A7450
$$ 174729 -3264 27178 82677 -124708 -39452 297260 -89944 -84085 -6438 -269251 17450
18127b02033A97692p67b31452c1641H377a40307F5028N884B3687a85084J0431
$$ -202033 197692 196925 -231452 -31641 8377 -140307 65028 70912 23687 -185084 -174653
18116a74653a9028A12500a69540H4452B5538a87913f3507C3971g3154B16591a21770
$$ -174653 -19028 112500 -169540 84452 25538 -187913 -63507 33971 -73154 216591 -121770
18104A29130A4058Q4742a12218J4187b4966K236B0144a7860q4172k32910J21339
$$ 129130 14058 98800 -112218 -98031 -24966 -22730 20144 -17860 -102032 -334942 -213603
18093b13603G1362g5855B51987a28604P465N0243j30141b3677m42132a81023f1716
$$ -213603 71362 -75855 251987 -128604 -121139 -70896 -201037 -23677 -465809 -181023 -61716
18081A32795a13811k3117L6191B88819A41396h9067m056j2335m28162A2529N243
$$ 132795 -113811 -136928 -100737 288819 141396 -89067 -93123 -105458 -533620 12529 17772
18070A7772J86338a97858b8126q8899l3372g0951J0270j8986k46086a464E0128
$$ 17772 204110 -197858 -28126 -117025 -150397 -70951 -60681 -79667 -325753 -1464 50128
18058b6379l20620a5579q8906D4925K28166A18602a43685F6833k8677b99614a44670
$$ -26379 -346999 -15579 -104485 44925 273091 118602 -143685 66833 38156 -299614 -144670
18046b22117F2569f6647A26913B7955d30544D8892g3476p1759f8767k6193C2678
$$ -222117 62569 -66647 126913 27955 -430544 48892 -73476 -145235 -68767 -94960 32678
18034e2381B26703b7739k25972K1223a1105j96945q8546B9080J33695a23844j28841
$$ -52381 226703 -27739 -253711 -232488 -11105 -208050 -296596 29080 162775 -123844 -252685
18023b52685b1996A33919R1389D7903K18950a44207k2495f5109B73229b64072
$$ -252685 -21996 133919 225308 47903 266853 -144207 -166702 -65109 273229 -264072
18012g5441A56104F5725c05258a52067c4307G15097g6062H0594J18130c8193q529
$$ -75441 156104 65725 -305258 -152067 -34307 715097 -76062 80594 198724 -38193 -46722
18001d6722A32875k5920D9505g2542K4879D60295j91063a60564c9515F1218i795
$$ -46722 132875 106955 49505 -72542 -47663 460295 269232 -160564 -39515 61218 -9795
17989D2488i3745k96183h0703k83450J40643a00217j09047A04387n0392J11970
$$ 42488 -93745 -389928 -80703 -364153 -223510 -100217 -209264 104387 53995 165965
17979A65965o787o7765c03904A11522a7684l2432A72710c15286h9058K3658l13474
$$ 165965 159178 91413 -303904 111522 -17684 -50116 172710 -315286 -89058 -65400 -378874
17968c78874A62262f7022C5402d1216A20730b25715c7902E7972M8737a44069B19966
$$ -378874 162262 -67022 35402 -41216 120730 -225715 -37902 57972 106709 -144069 219966
17956c30982e1391C1621a73600h5149l06267J53725N3198o0306o4575A98231b30671
$$ -330982 -51391 31621 -173600 -85149 -391416 -237691 -184493 -244799 -309374 198231 -230671
17944b25502d5246j38035C7923f5063l5060H0419d8534B95571A09913e7681k45894
$$ -225502 -45246 -183281 37923 -65063 -100123 80419 -48534 295571 109913 -57681 -303575
17933c03575H6988e5703j6456A45497a69999e5030a4691C3036i2501j08204i5748
$$ -303575 86988 -55703 -72159 145497 -169999 -55030 -14691 33036 -92501 -200705 -95748
17921G1285N1885i0379B2852a39420B60734a52457k2162C3841f7211B29156Q3501
$$ 71285 123170 -90379 22852 -139420 260734 -152457 -174619 33841 -67211 229156 312657
17910C12657A24162J55349e11339a29892o8495A46716o4876K868b30231l28581
$$ 312657 124162 279511 -511339 -129892 -198387 146716 81840 84708 -230231 -558812
17900e58812a49096N5884G4092K31551a49246g3084B18787J42232F922M3715d6356
$$ -558812 -149096 -93212 74092 305643 -149246 -73084 218787 361019 6922 50637 -46356
17888I7489e1974k28127F4588J11749k0241g2458B5630Q9551P3910a30069j10045
$$ 97489 -51974 -280101 64588 176337 156096 -72458 25630 115181 189091 -130069 -240114
17877b40114L7192q1723B52984f69B15372H6227f4591E8689j2403a63641f3196
$$ -240114 -202922 -284645 252984 -669 215372 86227 -64591 58689 46286 -163641 -63196
17865B9253j3653K24380j00306a30123N4541B21051D9055i6943B82432a809j06993
$$ 29253 15600 239980 139674 -130123 -75582 221051 49055 -96943 282432 -1809 -108802
17854a08802n79668a20306A30559J28662r6028a06582D52854b58310C97975b34857
$$ -108802 -688470 -120306 130559 259221 163193 -106582 452854 -258310 397975 -234857
17843e99282D1767a74806M8144m3981L2337B38270a25474C7928g8593A82287D962
$$ -599282 41767 -174806 -126662 -170643 -138306 238270 -125474 37928 -78593 182287 4962
17831g3722n6769A33391a13015K2158C35391j60205c40685H76L87610b11838g1170
$$ -73722 -130491 133391 -113015 -90857 335391 175186 -340685 876 388486 -211838 -71170
17819A77064a97100B14068g221l864A1631e9576C09737a89347B62758F4368b21306
$$ 177064 -197100 214068 -7221 -11085 11631 -59576 309737 -189347 262758 64368 -221306
17807b32230A66798G3556a8346A54218d2157B89938a11106G724K83296b21527
$$ -232230 166798 73556 -18346 154218 -42157 289938 -111106 7724 291020 -221527
17796A36583o6638b61354H7491a08347G372i2180Q725A32412E0815b71487i6986
$$ 136583 69945 -261354 87491 -108347 7372 -92180 -83455 132412 50815 -271487 -96986
17784A51253g8735l58054A22326M2076c00864d4399k96078A15949j4266B1690
$$ 151253 -78735 -436789 122326 164402 -300864 -44399 -340477 115949 101683 21690
17773C33071a93269K4810e3200B09094a48781q1301A16746f2402A64738c0974
$$ 333071 -193269 -168459 -53200 209094 -148781 -230082 116746 -62402 164738 -30974
17762h8432E8304i5197j17752A74384M3794a06964A85608a45751M2009B99586
$$ -88432 58304 -95197 -212949 174384 218178 -106964 185608 -145751 -103742 299586
17751B00079f6277A10320a44675j95313c2891k9864D3183a7158E4659N1333a57427
$$ 200079 -66277 110320 -144675 -339988 -32891 -62755 43183 -17158 54659 105992 -157427
17739A56303c3808A04708i3182B5563b29069a08306P414c8250B76901l8771a02496
$$ 156303 -33808 104708 -93182 25563 -229069 -108306 -100892 -38250 276901 238130 -102496
17727a26144H6846K3191a64737F1180O5744a4119F3866J80381m8993n025m582
$$ -126144 86846 110037 -164737 61180 126924 -14119 63866 244247 195254 190229 185647
17716A85647b57584f5212k3640C6672b30241N1044g5837k5160j12064B36378E0879
$$ 185647 -257584 -65212 -88852 36672 -230241 -179197 -75837 -100997 -213061 236378 50879
17704a15659A3964i3042F2708a07342p3948E2327a37518a7457q2547F525J84410
$$ -115659 13964 -93042 62708 -107342 -181290 52327 -137518 -17457 -100004 6525 190935
17693A90935K25789o8816A37646b5297j4090F5945g8882A37506e05611C3235J8279
$$ 190935 416724 347908 137646 -25297 -39387 65945 -78882 137506 -505611 33235 51514
17682E1514d73650B93032j00365a64587P3233B04236D38K44787d6537j24672d0191
$$ 51514 -473650 293032 192667 -164587 -91354 204236 438 245225 -46537 -171209 -40191
17670C32438a27769M2215F2262k3240L4476a40768a5644q8756b4741A98680b9188
$$ 332438 -127769 -85554 62262 39022 73498 -140768 -15644 -104400 -24741 198680 -29188
17658b50612a7122j61559P4971D09653A1746J45869k2985g2788k20816a8373m6174
$$ -250612 -17122 -178681 -103710 409653 11746 157615 134630 -72788 -293604 -18373 -64547
17647f4547j16340Q2072C18997b157B35530A2474N37709a8571I0458J71538K63996
$$ -64547 -180887 -98815 318997 -2157 235530 12474 550183 -18571 90458 261996 525992
17636E25992g9870j10651A0814J60265k9393J308c7607e608k162j18163E603J39719
$$ 525992 -79870 -190521 10814 171079 141686 142994 -37607 -5608 -7770 -125933 5603 145322
17624A45322c71400Q9743e3971l6775A19892a2777j21675A11156a76680B06421
$$ 145322 -371400 -281657 -53971 -90746 119892 -12777 -134452 111156 -176680 206421
17613C8814a22469A28668l149j6141a10518F8166A8384b7161A75270k6792B7017
$$ 38814 -122469 128668 125519 109378 -110518 68166 18384 -27161 175270 148478 27017
17601F4405j033k1157K48778q8613H2476J11103l7105b82453A74476l2698a55484
$$ 64405 63372 42215 290993 202380 82476 193579 156474 -282453 174476 141778 -155484
17589c96607B86186a70486q6e8212p7403j1835j25936D39126k2091a76791B97314
$$ -396607 286186 -170486 -170572 -58212 -135615 -147450 -273386 439126 417035 -176791 297314
17577A684K17988P172d7848k0767m7214K7684A38989D8423J20256K79555G7988
$$ 1684 219672 226844 -47848 -68615 -115829 -88145 138989 48423 168679 448234 77988
17565C40273D2745J12841B1159d5300F8034K2143J52110a11858j52188C67879
$$ 340273 42745 155586 21159 -45300 68034 90177 242287 -111858 -264046 367879
17554b98538i0943L8328H0461K95785e6582K2506C0154K91185d5256I1353a84680
$$ -298538 -90943 -52615 80461 376246 -56582 -34076 30154 321339 -45256 91353 -184680
17542a43962q241B69279c25469h3630I7982f7945j9388n8774N6766J6821H633
$$ -143962 -152203 269279 -325469 -83630 97982 -67945 -87333 -146107 -89341 -72520 8633
17530G0543J9635l1766N6240K87775A63330a83728c7290A51887q093a23004m2300
$$ 70543 90178 58412 114652 402427 163330 -183728 -37290 151887 143794 -123004 -165304
17519a65304B87260E8761N6889a54115c2384A56610M7626M1019D7796Q1310b96730
$$ -165304 287260 58761 115650 -154115 -32384 156610 204236 245255 47796 129106 -296730
17507b4419E0023R9021N8095B3806c95037I8406C4875P5135P0252E4388b05273
$$ -24419 50023 149044 207139 23806 -395037 98406 34875 110010 180262 54388 -205273
17495B46506E3934L22336g6966B00381K1653o8762J53197C8339a13799B14389
$$ 246506 53934 376270 -76966 200381 222034 153272 306469 38339 -113799 214389
17484A12538a64506A28560N6193c19786B48121I5348a38924I8311J90313B3843
$$ 112538 -164506 128560 184753 -319786 248121 95348 -138924 98311 288624 23843
17473B3557a00096H1248K55033D399J61880p7043J88282J62036c45275P1155A95558
$$ 23557 -100096 81248 336281 4399 166279 89236 277518 439554 -345275 -274120 195558
17461B23280o3806F3145h3486D38448a7200C78671j10203f5547l48647C44474
$$ 223280 159474 63145 -83486 438448 -17200 378671 268468 -65547 -414194 344474
17450D75479A43224b9708C60017f6336B43787a05879B8925K64546j32968r568
$$ 475479 143224 -29708 360017 -66336 243787 -105879 28925 293471 160503 150935
17440A50935K38028f4988B06807P6665H0349a21432K8474A03614L68283B9697
$$ 150935 388963 -64988 206807 283472 80349 -121432 -92958 103614 471897 29697
17429F44158A84270k5231N9683l2988J86274A40689F2500K23715J04204p7812
$$ 644158 184270 159039 218722 185734 372008 140689 62500 286215 390419 312607
17419C12607r6789o848N4116J6306L30649H0147L1548J16853N9547M0657I1101
$$ 312607 215818 208970 263086 279392 610041 80147 111695 228548 288095 328752 91101
17407d4728A95368Q840G4855K10125G249B108J03545R3308I73a1979B8150a11867
$$ -44728 195368 204208 74855 284980 7249 2108 105653 198961 973 -11979 28150 -111867
17394D27990b8717E6550L15622A80247g9166p8827b8868A8731L905J5031a23643
$$ 427990 -28717 56550 372172 180247 -79166 -157993 -28868 18731 22636 37667 -123643
17382B51553C707K12686a5754D58875A84030C6697J85914i8217A74693C0100M60720
$$ 251553 3707 216393 -15754 458875 184030 36697 222611 -98217 174693 30100 490820
17371D90820B0502L39182C2489a47179H4829N3968O6060n6174R3492L7062B3001
$$ 490820 20502 359684 32489 -147179 84829 138797 204857 148683 242175 279237 23001
17359a04778A57194C4921O0102J14904L5462a51000a7484d461p0591B37668H6717
$$ -104778 157194 34921 95023 209927 245389 -151000 -17484 -4461 -75052 237668 86717
17347a0735j55523G9079L39243j83212p1255k9054m1749K96043r5852A14311k1628
$$ -10735 -166258 79079 418322 235110 163855 134801 93052 389095 293243 114311 92683
17336I2683f8770B50222o7780D171O9014L29982N803K0652A51459l6511b6996
$$ 92683 -68770 250222 182442 4171 73185 403167 408970 429622 151459 114948 -26996
17324E0360J52871f3560B88529M3865q1601K0343q5203n8604L14202g3269a0055
$$ 50360 203231 -63560 288529 332394 250793 271136 185933 127329 441531 -73269 -10055
17312B41132J12504C8608K02434b31742A44799b22315G2926a22649M111o9994
$$ 241132 353636 38608 241042 -231742 144799 -222315 72926 -122649 -118538 -188532
17302a88532B97684c67845A26367R460g7821F0276K3127P3663B5610e1541K3793
$$ -188532 297684 -367845 126367 135827 -77821 60276 83403 157066 25610 -51541 -27748
17291b7748A27144J48205N2859J0489i9654p6240A18271a20193A34930L14019
$$ -27748 127144 275349 328208 338697 -99654 -175894 118271 -120193 134930 448949
17281D48949F0782j3077J9892O3451K74915J14675A7331L6081d00061A86354m9292
$$ 448949 60782 47705 67597 131048 405963 520638 17331 53412 -400061 186354 137062
17270A37062n6468L71909j04791n7208q9232B1764d2670A46577P8754O8106D9088
$$ 137062 80594 452503 347712 290504 201272 21764 -42670 146577 225331 293437 49088
17258C61717q1564b38963C25934A23745r321O0067n9211K8928J1246f9241B14478
$$ 361717 280153 -238963 325934 123745 114424 174491 115280 144208 155454 -69241 214478
17246B88650A31317a67288B18598a4011C19219D0539Q7550J66038A00599K72431
$$ 288650 131317 -167288 218598 -14011 319219 40539 128089 294127 100599 373030
17236C73030l2225b0901B46571l4712J70783a46724B26227J50066n1683C9053
$$ 373030 340805 -20901 246571 211859 382642 -146724 226227 376293 324610 39053
17225A959J1087N845J57051J51892E8084J40803N4569D1071N0867M1079M76514
$$ 1959 13046 18891 175942 327834 58084 198887 253456 41071 91938 133017 609531
17214F09531k69010a86810A24285K27972J3769D5083N2328R4539I4203k6609K57619
$$ 609531 340521 -186810 124285 352257 366026 45083 97411 191950 94203 67594 325213
17203C25213j01916a80730A42631L05129j45465p6671P5224J11433a41656E0804
$$ 325213 223297 -180730 142631 447760 302295 225624 300848 412281 -141656 50804
17192C78102p7692J31610p531L9648B1050a40039A93254N916n7979J10178I1371
$$ 378102 300410 432020 424489 464137 21050 -140039 193254 199170 141191 251369 91371
17180E46495I8805J44386b8183B04858N394P4922r2553K45611E588J26414F0664
$$ 546495 98805 243191 -28183 204858 210252 285174 192621 438232 5588 132002 60664
17168F0267m761J71496A9002J62011I0351L71439B0378M12717A1848M39120G9108
$$ 60267 55506 227002 19002 181013 90351 461790 20378 433095 11848 450968 79108
17156D11925b4403A73229L8089J9112R0875A22703N9412L3309O0803L76282A60043
$$ 411925 -24403 173229 211318 230430 321305 122703 182115 215424 276227 652509 160043
17144B74414L6642j20053r2341J21229J36251j61223J87754l3775P661a66946
$$ 274414 311056 191003 98662 219891 356142 194919 382673 348898 356559 -166946
17133F06845B13779P8851k1982L61101B52099B6081J18808K64297A44608L94761
$$ 606845 213779 292630 270648 631749 252099 26081 144889 409186 144608 539369
17123E39369r3090A95881J32319A61467M19129A64072p958N0265j00615J00487
$$ 539369 446279 195881 328200 161467 580596 164072 156114 206379 105764 206251
17113B06251q5316L27204m8103q7549A28662L98857A20281M27038o0938j74856
$$ 206251 120935 448139 400036 312487 128662 527519 120281 547319 486381 311525
17103C11525A52546j8271M86691A00640L74658r5361j09793K51954j5902j73616
$$ 311525 152546 134275 620966 100640 475298 379937 270144 522098 506196 332580
17093C32580q4738k6959j9693K18942O0711A97514L2373K60160j81306K82558
$$ 332580 247842 220883 201190 420132 480843 197514 229887 490047 308741 591299
17083E91299j58359K8977A00362M17689o1364L2740n6675I3226L47566K32066
$$ 591299 432940 461917 100362 518051 456687 489427 432752 93226 440792 672858
17073F72858k7063B37394Q6286P3233R1249j86426p4221J69864O4810O6025I5913
$$ 672858 645795 237394 323680 396913 488162 301736 227515 397379 462189 528214 95913
17061C52846J85769J38465C14973o6897J92358j68046J42276K23375C03311J59488
$$ 352846 538615 677080 314973 248076 440434 272388 414664 638039 303311 462799
17051D62799K77395I7039N93561L60941A97827K33899K9848R0932j25504j12518
$$ 462799 740194 97039 690600 1051541 197827 431726 461574 552506 427002 314484
17041C14484L12696k68924k3666J73713j19686J7048j20825N17330B96397L35536
$$ 314484 627180 358256 334590 508303 388617 405665 284840 802170 296397 631933
17031F31933k30229P7691B02021K53289R4733Q111j75891M2091K19652n3669j05370
$$ 631933 401704 479395 202021 455310 550043 558154 382263 424354 644006 590337 484967
17020D84967B38932O03509j61518j96445j27640p3103K66484r7116K61647k31457
$$ 484967 238932 842441 680923 484478 356838 283735 550219 453103 714750 483293
17010D83293J5059j10449M10132j59977P9194l25154N15812l87789r7261L31629
$$ 483293 498352 387903 798035 638058 717252 392098 907910 520121 422860 754489
17000G54489j51200J15008j75358J62035m672k27446J46784n760r6954n6710Q0549
$$ 754489 603289 718297 542939 704974 700302 472856 619640 613880 516926 460216 540765
16989E40765L31515l04523L37440l00693K02372J07390k46920m8227B70037L59539
$$ 540765 872280 567757 905197 604504 806876 914266 667346 619119 270037 629576
16979F29576k82228O24258k76609K95625J15152j5723k94474J29583k82403L1440
$$ 629576 347348 971606 694997 990622 1105774 1090051 795577 925160 642757 674197
16969F74197j0116N7076M4566M6643j01037J2078k73198L69847J32661O0155k880
$$ 674197 664081 721157 765723 812366 711329 723407 450209 820056 952717 1012872 1009992
16958A009992k67392K9673n9445K64737J30443l95091L09378l42025P9741J68993
$$ 1009992 742600 772273 712828 977565 1108008 712917 1022295 680270 760011 929004
16948I29004O3636J9893P9708j70740Q5227J0541j36206J92704K92611k34415
$$ 929004 992640 1012533 1092241 921501 1006728 1017269 881063 1073767 1366378 1131963
16938A131963R6910J8194j80042P0384J39740l72249K34585L1955L71236l57874
$$ 1131963 1228873 1247067 1067025 1137409 1277149 904900 1139485 1171440 1542676 1184802
16928A184802K4971n7K7511j62300J07101J1753M7630r617M0752q7628J27107
$$ 1184802 1209773 1209716 1237227 1074927 1182028 1193781 1241411 1231794 1272546 1184918 1312025
16917A312025J34539K1077j53376J34248k39961O9634M62867l43054J96271k52220
$$ 1312025 1446564 1467641 1314265 1448513 1208552 1278186 1741053 1397999 1594270 1342050
16907A342050k4887P1197J5647O8055p6977L12337l96603K63434j63521N36582
$$ 1342050 1317163 1388360 1404007 1472062 1395085 1707422 1310819 1574253 1410732 1947314
16897A947314m41367L66082J69976l89255J6901J21146j73295J0151K85504k13142
$$ 1947314 1505947 1872029 2042005 1652750 1669651 1790797 1617502 1627653 1913157 1700015
16887A700015J02445J08468j23286n5809J40421Q966l5700l7614K65167j07470
$$ 1700015 1802460 1910928 1787642 1731833 1872254 1881220 1845520 1807906 2073073 1965603
16877A965603L56493L0340l21691K74863j16735J39981j84385k05773J97846j28021
$$ 1965603 2322096 2352436 2030745 2305608 2188873 2328854 2144469 1938696 2136542 2008521
16867B008521L81461j27409K2609K4549K67928j38943j79121L48528J09027r5728
$$ 2008521 2389982 2262573 2285182 2309731 2577659 2438716 2259595 2608123 2717150 2621422
16857B621422M6331j34329L5271J64717p999J19623J52047k89459J28292j0162
$$ 2621422 2667753 2533424 2568695 2733412 2725413 2845036 2997083 2707624 2835916 2825754
16847B825754Q5785J44536k8830L83052l20379J06837j8150l7659L32427m3329
$$ 2825754 2911539 3056075 3027245 3410297 3089918 3196755 3178605 3140946 3473373 3430044
16837C430044P6511N7598k254j46224O55466k67056P4741O3776J72208k58810
$$ 3430044 3506555 3564153 3561899 3415675 4071141 3804085 3878826 3942602 4114810 3856000
16827C856000L96690j37468n4016K31907p5408L65225j48569j27676M36059K8298
$$ 3856000 4252690 4115222 4061206 4293113 4217705 4582930 4434361 4306685 4742744 4771042
16817D771042l63012Q43254l87339K72881k73258P14899l37165L13119j40575
$$ 4771042 4408030 5251284 4863945 5136826 4863568 5578467 5241302 5554421 5413846
16808E413846M41698K96089p3072K43944J51557L05862l82101K58637L79447j55430
$$ 5413846 5855544 6151633 6078561 6322505 6474062 6779924 6397823 6656460 7035907 6880477
16798F880477J45198K72356K87966L54647j99325L31228O0287K90201M40453M41945
$$ 6880477 7025675 7298031 7585997 7940644 7741319 8072547 8132834 8423035 8863488 9305433
16788I305433j46222L80437k29452N64842N76668m0496N34904M0784N23135K16198
$$ 9305433 9159211 9539648 9310196 9875038 10451706 10411210 10946114 10986898 11510033 11726231
16778A1726231N94913L2678N55692L64073M09965M01941K81047P84291N13889
$$ 11726231 12321144 12353822 12909514 13273587 13683552 14085493 14366540 15150831 15664720
16769A5664720J14244R91913P7783J038817N20518Q14410J018723N99094Q67074
$$ 15664720 15778964 16770877 16848660 17887477 18407995 19222405 20241128 20840222 21707296
16760B1707296Q01401P07589J224283R33624R82102J176534J132865J489316J088508
$$ 21707296 22508697 23216286 24440569 25374193 26356295 27532829 28665694 30155010 31243518
16751C1243518J362603J808043J159545K145842J840476K280089J869698K159542
$$ 31243518 32606121 34414164 35573709 37719551 39560027 41840116 43709814 45869356
16743D5869356K961235K648182K591776K983676L021041L638443M002863M301263
$$ 45869356 48830591 51478773 54070549 57054225 60075266 63713709 67716572 72017835
16735G2017835L802135N325946M974906N136920N637957O261507O367526O535336
$$ 72017835 75819970 81145916 86120822 91257742 96895699 103157206 109524732 116060068
16727A16060068P008435P575529P381881P592585P510454P359076O854685O670151
$$ 116060068 123068503 130644032 138025913 145618498 153128952 160488028 167342713 174012864
16719A74012864N487851M961271L840968K185523J236887j93520j907673k598775
$$ 174012864 179500715 184461986 188302954 190488477 191725364 191531844 189624171 187025396
16711A87025396m642938n323580n801989o928688p349993p455361p804636p738943
$$ 187025396 182382458 177058878 171256889 164328201 156978208 149522847 141718211 133979268
16703A33979268p633623p345794p182710o821801n924900o437029n564863m950086
$$ 133979268 126345645 118999851 111817141 104995340 99070440 92633411 87068548 82118462
16695H2118462n357890m582258m277905l899499l606731l437152l032375l270860
$$ 82118462 76760572 72178314 67900409 64000910 60394179 56957027 53924652 50653792
16687E0653792k647918k443419k450489k300046k027444j791698j892446j569444
$$ 50653792 48005874 45562455 43111966 40811920 38784476 36992778 35100332 33530888
16679C3530888j883910j396374j208542j326510j500583n67203j784878k88055
$$ 33530888 31646978 30250604 29042062 27715552 26214969 25647766 23862888 23574833
16671B3574833j374220o88751p50635r33651m80737j084943p48360m81936o37123
$$ 23574833 22200613 21511862 20761227 19827576 19346839 18261896 17513536 17031600 16394477
16662A6394477m60718n81829q45900r9248o09876m10561o78397l54839k00501
$$ 16394477 15933759 15351930 14506030 14406782 13796906 13386345 12707948 12353109 12152608
16653A2152608j81331p34570j37323j43851n84592m80876q1470k65656k90502
$$ 12152608 11971277 11236707 11099384 10955533 10370941 9890065 9808595 9542939 9252437
16644I252437j69966n10304k71917n3863q7359j94017k52262k42385j02668o9367
$$ 9252437 9082471 8572167 8300250 8246387 8159028 7965011 7712749 7470364 7367696 7298329
16634G298329m43113K6149m80862o6086J50226l20543m36424L93749p82715J86541
$$ 7298329 6855216 6881365 6400503 6334417 6484643 6164100 5727676 6121425 5338710 5525251
16624E525251o3466k39696L7210J00237l73754R8681n43323R9229k34435j39939
$$ 5525251 5461785 5222089 5259299 5359536 4985782 5084463 4541140 4640369 4405934 4265995
16614D265995k9017k82320K59720J21415l51209J17766j23222m88553M94613k80387
$$ 4265995 4236978 3954658 4214378 4335793 3984584 4102350 3979128 3490575 3985188 3704801
16604C704801m69056M48100J9159j61932j06920j42280j38522k61377L22848j93654
$$ 3704801 3235745 3683845 3703004 3541072 3434152 3291872 3153350 2891973 3214821 3021167
16594C021167p9067m9801K85556n95697L65690r1152J09105l90655J08395n4338
$$ 3021167 2942100 2892299 3177855 2582158 2947848 2856696 2965801 2575146 2683541 2629203
16584B629203j01495n2913K96312j4358n53134J61144j60902l3667J43863j18001
$$ 2629203 2527708 2474795 2771107 2756749 2203615 2364759 2203857 2170190 2314053 2196052
16574B196052n0186R0695n3447k69251J30661j49888J80193l18788J35448p824
$$ 2196052 2145866 2236561 2183114 1913863 2044524 1894636 2074829 1756041 1891489 1883665
16564A883665R2008K3259N0868r3873j20608j57485J00914j95065N2879J47060
$$ 1883665 1975673 1998932 2049800 1955927 1835319 1677834 1778748 1583683 1636562 1783622
16554A783622j54292J35682n30998L81272J06003R9947m06004m8244j11341L19644
$$ 1783622 1629330 1765012 1234014 1615286 1721289 1821236 1415232 1366988 1255647 1575291
16544A575291p9695K81202m02729j02796k07777L15249j99521j2318L48060l78669
$$ 1575291 1495596 1776798 1374069 1271273 1063496 1378745 1179224 1166906 1514966 1136297
16534A136297l39009L43351M77369j05035j79295k67313K41114l80712K68509
$$ 1136297 797288 1140639 1618008 1512973 1333678 1066365 1307479 926767 1195276
16525A195276Q0803j25267K02741j06538j09733O8988m72934M52812k6915k4586
$$ 1195276 1276079 1150812 1353553 1247015 1137282 1206270 733336 1186148 1159233 1134647
16515A134647k61472M35669F17535K43250R3608p4659J58345k92824j35738M34183
$$ 1134647 873175 1308844 617535 860785 954393 879734 1038079 745255 609517 1043700
16505A043700n0078m44519O29622m58221L70415l36422O114J50978O3495m344
$$ 1043700 993622 549103 1178725 720504 1090919 754497 760611 911589 975084 970740
16495I70740P0496k88677L01829l26417K98548D07613M30951l8588l67213L79034
$$ 970740 1041236 752559 1054388 727971 1026519 407613 838564 799976 432763 811797
16485H11797k77761J35169J3947p4004r8430J00185J29099n5536K18554j9730
$$ 811797 534036 669205 683152 609148 510718 610903 740002 684466 903020 883290
16475H83290k69015l1168j22892J81708l0627j28021N39096D48142j7282K07308
$$ 883290 614275 583107 460215 641923 611296 483275 1022371 448142 430860 638168
16465F38168m8472o1632J93160l50407L31542k21245q9892M50886o398k11597
$$ 638168 589696 528064 721224 370817 702359 481114 391222 842108 835710 624113
16455F24113o8896L58930m19053K59644j5001l56365J505J6813j74253K49567
$$ 624113 555217 914147 495094 754738 739737 383372 384877 401690 227437 477004
16445D77004B16182O13487B57185P5543L14125R1325j09363K59393D04341L9042
$$ 477004 216182 829669 257185 332728 646853 738178 628815 888208 404341 443383
16435D43383r2355J14015R5060n4234k386j78981K21583j85020O438k6043J35684
$$ 443383 351028 465043 560103 505869 503483 324502 546085 361065 367503 341460 477144
16424D77144N5484j10779k7628L1103L903J39381k33228j27764K84714j88588
$$ 477144 532628 421849 394221 425324 429227 568608 335380 207616 492330 303742
16414C03742J46466j11478j06192K6946N13085l47941J1890p4511R5020J32901
$$ 303742 450208 338730 232538 259484 772569 424628 436518 362007 457027 589928
16404E89928k62386J11759P451j43203K39480k24534j54122K60409Q295j58822
$$ 589928 327542 439301 446752 303549 543029 318495 164373 424782 433077 274255
16394B74255J1371o8888l7447K82375k0969o2397J57149k43746k0864n0499B5264
$$ 274255 285626 216738 179291 461666 440697 378300 535449 291703 270839 220340 25264
16382B24397J16300M4275b19074C84191r3120K00031C3782M33467j35864j17284
$$ 224397 340697 384972 -219074 384191 291071 491102 33782 467249 331385 214101
16372B14101K89206A65009L15624A23492M21753A65476O2321J77723A69478K08389
$$ 214101 503307 165009 480633 123492 545245 165476 227797 405520 169478 377867
16362C77867n648m1238q0406k8785C6558L72523F9448k7277K55127N603H1935
$$ 377867 372219 330981 250575 221790 36558 409081 69448 42171 297298 302901 81935
16350H1173L06822j31907j14151g5700C05398g0989A96862O4588P2699R5842j95119
$$ 81173 387995 256088 141937 -75700 305398 -70989 196862 261450 334149 429991 234872
16339B34872a04871B64484J72101B17114D9927K81396m3586j33868K84218o3624
$$ 234872 -104871 264484 436585 217114 49927 331323 287737 153869 438087 374463
16329C74463H3288J00350f5294E45916M6994A68855J30319j25134A2823N66787
$$ 374463 83288 183638 -65294 545916 592910 168855 299174 174040 12823 579610
16319E79610A58402m0935a29913A99712c06727C85733r6024H6025l4032L07319
$$ 579610 158402 117467 -129913 199712 -306727 385733 289709 86025 51993 359312
16309C59312f8621b4998n9766H7763Q1459L86600A14781K28743r0037K40307k37007
$$ 359312 -68621 -24998 -84764 87763 169222 555822 114781 343524 253487 493794 256787
16298B56787A5813a31548B37559o4020o8499N8767J90588A19746J29701M6362
$$ 256787 15813 -131548 237559 173539 105040 163807 354395 119746 249447 295809
16288B95809a24320G5381K42J9001A0419K37310R359J81946C3757K7578J06917
$$ 295809 -124320 75381 75623 94624 10419 247729 257088 439034 33757 61335 168252
16277A68252n7895Q9164b4205A81870K8494I966B527Q5193c69781B91994J51557
$$ 168252 110357 199521 -24205 181870 210364 9966 2527 87720 -369781 291994 443551
16266D43551B00845p0183g4437B11240J74823b288A82674B0405a01227M6101m4511
$$ 443551 200845 130662 -74437 211240 386063 -2288 182674 20405 -101227 -55126 -99637
16255i9637A11534j2318a27052j22179A81230E9401a59637G0096M4935K8844J34344
$$ -99637 111534 99216 -127052 -249231 181230 59401 -159637 70096 115031 143875 278219
16244B78219c57720C5955c8659A06267K4333l203a03136c1443k3838A72880J51427
$$ 278219 -357720 35955 -38659 106267 130600 127397 -103136 -31443 -55281 172880 324307
16233C24307j33312I2471K15200H9049C2341J02259a2003o1481A64151K09869
$$ 324307 190995 92471 307671 89049 32341 134600 -12003 -73484 164151 374020
16223C74020a71346C445J48758P4402k1153N0138H8645J51211g382H5964k1520
$$ 374020 -171346 3445 152203 226605 205452 255590 88645 239856 -7382 85964 64444
16212F4444a69829m6760k416B83451a40553f7489B11376F2452d829A77712a33066
$$ 64444 -169829 -216589 -219005 283451 -140553 -67489 211376 62452 -4829 177712 -133066
16200a27923D99961a9607B20267J23284r5102F6504K84651A07537J81230A18293
$$ -127923 499961 -19607 220267 343551 248449 66504 351155 107537 288767 118293
16189F1243a0437C41292A1292K06962c8951j32606m9631b7355B64625d8880E0837
$$ 61243 -10437 341292 11292 218254 -38951 -171557 -221188 -27355 264625 -48880 50837
16177b10409j722f8209a732A3840J25173G870a12550c6911C81349A25478L65063
$$ -210409 -212131 -68209 -1732 13840 139013 7870 -112550 -36911 381349 125478 490541
16166D90541A39751a4060l29003D5182d60180g2790A39426E3745a85144K3755
$$ 490541 139751 -14060 -343063 45182 -460180 -72790 139426 53745 -185144 -161389
16156a61389E9097h5867A17259f9526I3503a03455n1883N6633n6844A77664q0383
$$ -161389 59097 -85867 117259 -69526 93503 -103455 -155338 -98705 -155549 177664 97281
16145I7281P9232J27939d7243m0387a180o849B84142A4768L95713c61998e7020
$$ 97281 176513 304452 -47243 -87630 -1180 -8029 284142 14768 410481 -361998 -57020
16133B09204j458E8194b78827e6913B46049a7073H1190O4898f6253j21587k02512
$$ 209204 207746 58194 -278827 -56913 246049 -17073 81190 146088 -66253 -187840 -390352
16122c90352e238A94131D1656O7554a44549A50270J5999A0612J21111A1249g4182
$$ -390352 -5238 194131 41656 109210 -144549 150270 166269 10612 131723 11249 -74182
16110I1856b0562A76885p9403a02881E4606K73560a07122A42208h0723j17480
$$ 91856 -20562 176885 97482 -102881 54606 328166 -107122 142208 -80723 -198203
16100a98203B36768p7426G5658F181e5450j93846a22476k37530B47863a8043E3665
$$ -198203 236768 159342 75658 6181 -55450 -249296 -122476 -360006 247863 -18043 53665
16088B60271K0996c20416A2746J4229g9199A87877a0696j41778A04492k5307a78052
$$ 260271 281267 -320416 12746 26975 -79199 187877 -10696 -152474 104492 79185 -178052
16076B1987J3932P2452a55083P1688C17700b63475O3492G4030A1704J23733j5801
$$ 21987 35919 108371 -155083 -83395 317700 -263475 -199983 74030 11704 135437 119636
16065A19636a8967k2544A32335b41760j38178J64711M7936d5260j3863p6951A66805
$$ 119636 -18967 -41511 132335 -241760 -379938 -215227 -167291 -45260 -59123 -136074 166805
16053a89979n2055J03792k16549a59214A47884D5563e7822A51800b20821A10054
$$ -189979 -242034 -138242 -354791 -159214 147884 45563 -57822 151800 -220821 110054
16042c85410a43894F1084M0885j8536g3751p0621c7003F4990a29035A27834c54740
$$ -385410 -143894 61084 101969 83433 -73751 -144372 -37003 64990 -129035 127834 -354740
16030a41091F9582J43892A7748b25555r2349A78272a61011A34422j1326b57400
$$ -141091 69582 213474 17748 -225555 -317904 178272 -161011 134422 123096 -257400
16019a38374k06396A64211B4691K35468e118A94497g6431A17211a48933o3520
$$ -138374 -344770 164211 24691 260159 -5118 194497 -76431 117211 -148933 -212453
16009b12453D5080g0331r178I1660b34638g5516B3246c2264B0081J42879c0896
$$ -212453 45080 -70331 -79509 91660 -234638 -75516 23246 -32264 20081 162960 -30896
15997a00416C42798e5255G4232a55642A42008c62274e0342C20991a6463C48193
$$ -100416 342798 -55255 74232 -155642 142008 -362274 -50342 320991 -16463 348193
15986d3091B00171K3559a50712B69429i2746D11958j13098j38565K2510n0845
$$ -43091 200171 223730 -150712 269429 -92746 411958 298860 160295 182805 131960
15976A31960r321k9775q558a77035H337J31681b30824R4856A90473c02576Q1505
$$ 131960 122639 92864 84306 -177035 8337 140018 -230824 -135968 190473 -302576 -221071
15965b21071B20730a63293j33039e9100n998C25595i8223m04868d2007k6801B5703
$$ -221071 220730 -163293 -296332 -59100 -65098 325595 -98223 -503091 -42007 -68808 25703
15953b31260A53736i1235B81477A29496A2002M8999c09601E1370c86341N7549
$$ -231260 153736 -91235 281477 129496 12002 61001 -309601 51370 -386341 -328792
15943c28792R5092a4301j17111k65474C043R0185a2552j29511k75620J8031G3226
$$ -328792 -233700 -14301 -131412 -396886 3043 93228 -12552 -142063 -417683 -399652 73226
15931A04325d62350a41462I741O1795O8733i2984A9083h5786H6329l721a33964
$$ 104325 -462350 -141462 9741 71536 140269 -92984 19083 -85786 86329 82608 -133964
15919b89478K8259I0634K5567Q0557c84370J16345j0071A98209I6360a31935D1600
$$ -289478 -261219 90634 116201 196758 -384370 -268025 -278096 198209 96360 -131935 41600
15907a26287B57851b06778H0300C6053a4507p4280A29220a2862H4860a7697k90225
$$ -126287 257851 -206778 80300 36053 -14507 -88787 129220 -12862 84860 -17697 -307922
15896c07922B83535E8490i1101a7835l61079M7590a46249n0469C6541b33447C9289
$$ -307922 283535 58490 -91101 -17835 -378914 -331324 -146249 -196718 36541 -233447 39289
15884I0107a08871k3289J9340q9554j4690N3653H3161O1099K4935i0495A1198
$$ 90107 -108871 -132160 -112820 -202374 -217064 -163411 83161 144260 169195 -90495 11198
15872c4958r9406A76342J2788c5655a3316l23951a8883k10019b7128E6065a06526
$$ -34958 -134364 176342 189130 -35655 -13316 -337267 -18883 -228902 -27128 56065 -106526
15860c43267B4356a05252B5709a73540B59265M750C0232K3756R690i5692j09360
$$ -343267 24356 -105252 25709 -173540 259265 264015 30232 53988 63678 -95692 -205052
15849b05052E6255a09027C09779B1436e6736j7419A05366c33209A70076E6415
$$ -205052 56255 -109027 309779 21436 -56736 -74155 105366 -333209 170076 56415
15838A01970d0j20194A12136b56749b4008C36490d0231G3372m355d29500a63899
$$ 101970 -40 -120234 112136 -256749 -24008 336490 -40231 73372 69017 -429500 -163899
15826F7253c40431J42525O8698j07122j9782A21091J44959b81383B05237i5643
$$ 67253 -340431 -197906 -129208 -236330 -256112 121091 266050 -281383 205237 -95643
15815a14174F6807J55425N4636N6987A45590b33783K841B89458m9410@a58549
$$ -114174 66807 222232 276868 333855 145590 -233783 -230942 289458 240048 0 -158549
15803C0343a37620L3967l2628L6777I7765B8419a53218l07451J65498K0087A06818
$$ 30343 -137620 -103653 -136281 -99504 97765 28419 -153218 -460669 -295171 -275084 106818
15791E1781L89061G5619C4300b87756B97478g3461j43735p5312k20258a33656
$$ 51781 440842 75619 34300 -287756 297478 -73461 -217196 -292508 -512766 -133656
15780H9263A0173h4958j68444j20240B9402b31137G9326i7917A59075J76494b0260
$$ 89263 10173 -84958 -253402 -373642 29402 -231137 79326 -97917 159075 335569 -20260
15768F3350J9565g4068A9258b52768J01608g4512A69991R6190a97752l0338A51234
$$ 63350 82915 -74068 19258 -252768 -151160 -74512 169991 266181 -197752 -228090 151234
15756b87462a31082m8277M9373F4579a3571G6843a82490B45529o6244b01553g304
$$ -287462 -131082 -179359 -129986 64579 -13571 76843 -182490 245529 179285 -201553 -7304
15744f1829n3884A0140a26290j63316A53731J27687b27621a8311E0558J42841
$$ -61829 -115713 10140 -126290 -289606 153731 281418 -227621 -18311 50558 193399
15734A93399A3286a07898A68247h7414H1547N4982h3797j04358a0519C54780o1485
$$ 193399 13286 -107898 168247 -87414 81547 136529 -83797 -188155 -10519 354780 293295
15723B93295a88491J6112b5116k23607A08301J38011a78665h5058B87895c6552
$$ 293295 -188491 -172379 -25116 -248723 108301 246312 -178665 -85058 287895 -36552
15712a25696j81233F5087c10657k00137h6830q3340A22059k7685D4411b62k04064
$$ -125696 -306929 65087 -310657 -510794 -86830 -170170 122059 94374 44411 -262 -204326
15701b04326C03691j09974h2983j18531j41912c2076l26873A78645E2623a8639
$$ -204326 303691 193717 -82983 -201514 -343426 -32076 -358949 178645 52623 -18639
15690H1914J55891b84B32621c32438A71411n997a92082h846E6673f6389B38916
$$ 81914 237805 -284 232621 -332438 171411 165414 -192082 -8846 56673 -66389 238916
15678a0210A74194q0006a09938A61495P2927a92399B18944p9522m624c2446k8537
$$ -10210 174194 94188 -109938 161495 234422 -192399 218944 139422 134798 -32446 -60983
15667f0983D7420K15551D8955b11873f0284b375G3446n79K9024b84606L8211J15098
$$ -60983 47420 262971 48955 -211873 -60284 -2375 73446 72867 101891 -284606 -246395 -131297
15655a31297J7665J4236j14708O1421O8367G9903b3522A5948a78635A98815f9413
$$ -131297 -113632 -99396 -214104 -152683 -84316 79903 -23522 15948 -178635 198815 -69413
15643b49521p0143A02936k9815a33719N3906J113C155L3958a64148B89454b20612
$$ -249521 -319664 102936 73121 -133719 -79813 -78700 3155 37113 -164148 289454 -220612
15631D6957b6115B46932j7824a46632B48847b11367O0708A21961r069l7480a806
$$ 46957 -26115 246932 229108 -146632 248847 -211367 -150659 121961 112892 75412 -1806
15619G5577J02511b24943E5298R718a46005C22315g1939j93431h6003a159F3454
$$ 75577 178088 -224943 55298 65016 -146005 322315 -71939 -265370 -86003 -1159 63454
15607f5888A06596a9220j15855k7664O5891A27801o511a17624p7352M2565C4468
$$ -65888 106596 -19220 -135075 -162739 -96848 127801 121290 -117624 -194976 -152411 34468
15595D33073a20172j7168C6445a91417M834j46099H0031c5034C89408A05666c61766
$$ 433073 -120172 -137340 36445 -191417 -186583 -332682 80031 -35034 389408 105666 -361766
15583a60458o1146e3523F7645L5409l0757d7320k6174D805K14480A0060a61555
$$ -160458 -221604 -53523 67645 103054 72297 -47320 -73494 4805 219285 10060 -161555
15571G5222a39279B2448g9246j05911M3255C2502A6109K44871D9157a93126A79199
$$ 75222 -139279 22448 -79246 -185157 -141902 32502 16109 260980 49157 -193126 179199
15559C90808C8504a22546I8362B0510b4838m1728j37715j37166E169d9096k7316
$$ 390808 38504 -122546 98362 20510 -24838 -66566 -204281 -341447 5169 -49096 -76412
15548g6412k2760r8897a0688A63201b2507I780a68462m3738C71649c3312C13212
$$ -76412 -99172 -198069 -10688 163201 -22507 9780 -168462 -212200 371649 -33312 313212
15536F2456a76729o7731R2426L2205L5329c3965B407g9980B53876g7677A1074
$$ 62456 -176729 -244460 -152034 -119829 -84500 -33965 2407 -79980 253876 -77677 11074
15524a17062B17751h9751B33895b13738P8018B88167b64183k58760H7692K2748
$$ -117062 217751 -89751 233895 -213738 -135720 288167 -264183 -522943 87692 110440
15514A10440c6401B31930a10064l0595m5764m1649B26521r1645J51823E1091r952
$$ 110440 -36401 231930 -110064 -140659 -186423 -228072 226521 134876 286699 51091 41139
15503D1139b08365k0822n1447J22423B5925N8277a53583A27497b10647B45945
$$ 41139 -208365 -229187 -280634 -158211 25925 84202 -153583 127497 -210647 245945
15492b015F056b40063J13187j0144l3495e7238j21405c4981A41893a56645J0666
$$ -2015 6056 -240063 -126876 -137020 -170515 -57238 -178643 -34981 141893 -156645 -145979
15481a45979C5233J13242g435m0891p3411E7041Q607b4958I0637b23272N8069
$$ -145979 35233 148475 -7435 -48326 -121737 57041 65648 -24958 90637 -223272 -165203
15470a65203C4006i7288a3950C34499c24763f2420k25971B33852b24655C16703
$$ -165203 34006 -97288 -13950 334499 -324763 -62420 -288391 233852 -224655 316703
15459c1570b778n4935E4749a61513A92124c6874B8795b72125J03439A91471m5083
$$ -31570 -2778 -57713 54749 -161513 192124 -36874 28795 -272125 -168686 191471 146388
15448A46388k3272b13241e2589B81556a20508Q725j3403B86493c77637J56350
$$ 146388 123116 -213241 -52589 281556 -120508 -111783 -125186 286493 -377637 -221287
15438b21287r4980b5337F2871h7782n8221c429n03333A81213m9948a79913d7369
$$ -221287 -316267 -25337 62871 -87782 -146003 -3429 -506762 181213 131265 -179913 -47369
15426a21102L201k43736d4118k19244A80461E0214f1667J1470j53025R5387A00374
$$ -121102 -117901 -361637 -44118 -263362 180461 50214 -61667 -50197 -203222 -107835 100374
15414b81938J05493B30875b35496a07147A06047d1766A52715a10673A8979J0553
$$ -281938 -176445 230875 -235496 -107147 106047 -41766 152715 -110673 18979 29532
15404B9532M1508Q4439K4252k5283a72556f0807D76J37398b04621E4476a05194
$$ 29532 71040 155479 179731 154448 -172556 -60807 476 137874 -204621 54476 -105194
15392c6620J1378j72296A08140a5591p7775B7005J1936c2456p0347G5279b96351
$$ -36620 -25242 -197538 108140 -15591 -93366 27005 38941 -32456 -102803 75279 -296351
15380c30379J27585A4008J5126M5556L8779i8560k41774J57015A78398b00380
$$ -330379 -202794 14008 29134 74690 113469 -98560 -340334 -183319 178398 -200380
15369A18162k8843a70631D1531K06035d7266g503k3048A34516B3566d17552I7468
$$ 118162 89319 -170631 41531 247566 -47266 -7503 -30551 134516 23566 -417552 97468
15357a836j26627B18299l5724A6085d0944j3802B25209A11055b01624i3062M2452
$$ -1836 -128463 218299 182575 16085 -40944 -54746 225209 111055 -201624 -93062 -50610
15346e0610A32792m4833N4021K21496a72521K7616B67822A1566M7038j0812K11077
$$ -50610 132792 87959 141980 363476 -172521 -144905 267822 11566 58604 47792 258869
15335B58869G2465b0019D67632j34400c1170A24824m6801a3344A5826A980K73515
$$ 258869 72465 -20019 467632 333232 -31170 124824 78023 -13344 15826 1980 275495
15324B75495A20259N5879B2179a69029k46839a15431k19628A3754h342k07084
$$ 275495 120259 176138 22179 -169029 -415868 -115431 -335059 13754 -8342 -215426
15314b15426B43480P7360F0630k5733K15368a57485J0985C4920e7021j8341D4137
$$ -215426 243480 320840 60630 34897 250265 -157485 -146500 34920 -57021 -75362 44137
15302A18631J94705r0742a74817E5752A1949J89357a28155o5404A35603b574A3296
$$ 118631 313336 222594 -174817 55752 11949 201306 -128155 -193559 135603 -2574 13296
15290A63411F9544K37684L1840m1540J12531B3497J0741N9525d2228B7741J63230
$$ 163411 69544 307228 339068 297528 410059 23497 34238 93763 -42228 27741 190971
15279A90971k2334a66601E4982i7449k24620O7995B68480Q5746b5447j03597j0951
$$ 190971 168637 -166601 54982 -97449 -322069 -254074 268480 354226 -25447 -129044 -139995
15268a39995A21728a04895j11439j9762H8057b3668I0711M7103J34334C584K3837
$$ -139995 121728 -104895 -216334 -236096 88057 -23668 90711 137814 272148 3584 27421
15257B7421f6256H4662C0923a75495c485I2888g8105C00252Q8328Q43833l9948
$$ 27421 -66256 84662 30923 -175495 -3485 92888 -78105 300252 388580 1232413 1192465
15246A192465l9686K63138m40497I4770K92981c8939C06032m649a0071j36794
$$ 1192465 1152779 1415917 975420 94770 387751 -38939 306032 301383 -10071 -146865
15236a46865K9879k26674B01093B2141K59210A22705N4934k4950J84332a70180
$$ -146865 -116986 -343660 201093 22141 281351 122705 177639 152689 337021 -170180
15225a87264B21698N2001d73513h6647j6114C81811I7369d9460A87247g2316n5858
$$ -187264 221698 273699 -473513 -86647 -102761 381811 97369 -49460 187247 -72316 -128174
15214a28174A19049A6834J15234C5547a29116a5432A19637m7249j1822B6831a47517
$$ -128174 119049 16834 132068 35547 -129116 -15432 119637 72388 60566 26831 -147517
15202a75448A35357a0238j86083F33075A45134C3597M0927J47627F0149i9915
$$ -175448 135357 -10238 -196321 633075 145134 33597 74524 222151 60149 -99915
15191F3536J29670G0436j9647O5142h1790B16854p0630a3200C05569A32960J16697
$$ 63536 193206 70436 50789 115931 -81790 216854 146224 -13200 305569 132960 249657
15180B49657a31527O192A4478N9427a87179k04017i5494H9619K07223b4483F8384
$$ 249657 -131527 -125335 14478 73905 -187179 -391196 -95494 89619 296842 -24483 68384
15168B15730j7845h9471D7998b03363A61105B3146Q7272d7195E6112a1959A84458
$$ 215730 197885 -89471 47998 -203363 161105 23146 110418 -47195 56112 -11959 184458
15156d8826I233a9038B44806K13257G5101L4916O7004a7115j42209K7028O0319
$$ -48826 9233 -19038 244806 458063 75101 110017 177021 -17115 -159324 -132296 -71977
15145g1977o3324D5596a07854E6832k2321O8199O2177m1042D6819M2544a22698
$$ -71977 -135301 45596 -107854 56832 34511 102710 164887 123845 46819 89363 -122698
15133I0430i8610D8519K11231J09933A27091c9063B06801B920h7126A81508m0964
$$ 90430 -98610 48519 259750 369683 127091 -39063 206801 2920 -87126 181508 140544
15122A40544R6774a81551G6735K85381d5275b352B26912F8702A7385J50970E9849
$$ 140544 237318 -181551 76735 362116 -45275 -2352 226912 68702 17385 168355 59849
15110B71744c598A29154K2277p3382J77556J99637p6876H0401J38554e5570A99688
$$ 271744 -3598 129154 151431 78049 255605 455242 378366 80401 218955 -55570 199688
15098d5575D7299J20474L5388F0850K68647f5744A29088E1058e2491A03115K98655
$$ -45575 47299 167773 203161 60850 329497 -65744 129088 51058 -52491 103115 401770
15087D01770D428J49045N06239A36069J618D092O6581a00247A61697p1126J13560
$$ 401770 4428 153473 659712 136069 137687 4092 70673 -100247 161697 90571 204131
15076B04131O0990J17062I4823J65533F2820L93325A72443L5934K22293E5825
$$ 204131 265121 382183 94823 260356 62820 456145 172443 208377 430670 55825
15065B83103G62N4540b36391A90389F7879B2181Q5178O94k2429N1865K29793c13667
$$ 283103 762 55302 -236391 190389 67879 22181 107359 108053 85624 137489 367282 -313667
15052a63152A23235J57543K09357j31614I2899c2753H2634K57600q3135K54476
$$ -163152 123235 280778 490135 358521 92899 -32753 82634 340234 257099 511575
15042E11575k13133f8647j62762C90466j75927G8224C5950O7155K9593a44248
$$ 511575 298442 -68647 -231409 390466 214539 78224 35950 103105 132698 -144248
15031H8562b16801H0788C936b7271B34723B8369J03603m1814P2260B0160L4834
$$ 88562 -216801 80788 3936 -27271 234723 28369 131972 90158 162418 20160 54994
15020E4994L12755o767o3996H4350K22416A13880J69986k8593A05952b01810I9093
$$ 54994 367749 360982 296986 84350 306766 113880 283866 255273 105952 -201810 99093
15008e0335a5484B57576j9073j10266a49405A15318a4084A00102J46410J2535
$$ -50335 -15484 257576 238503 128237 -149405 115318 -14084 100102 246512 259047
14998B59047G7719b6465B20693J05499L1727A15043P2994D0745K29025K927A00213
$$ 259047 77719 -26465 220693 326192 357919 115043 188037 40745 269770 272697 100213
14986H1552H078P5338J1713A5944L36648A59505J60163A27696L28075b39834b3773
$$ 81552 8078 83416 95129 15944 352592 159505 319668 127696 455771 -239834 -23773
14974F5663J74506I3654R3766E2950L3782O4163M030J08662E3530J74697E2034
$$ 65663 240169 93654 187420 52950 86732 150895 154925 263587 53530 228227 52034
14962b12308A35453N3118J48684D8333J14871L64283k21922M8498A27720N2096
$$ -212308 135453 188571 337255 48333 163204 527487 305565 354063 127720 179816
14952A79816J67299A60778J00062m1066A04873L03027F4398L68476A33717k1716
$$ 179816 347115 160778 260840 219774 104873 407900 64398 432874 133717 112001
14942A12001k5995J35401K46405m8671l6945j73165N4164J57976o2410L8623m9520
$$ 112001 86006 221407 467812 419141 382196 209031 263195 421171 358761 397384 347864
14931C47864J15658M2446k7548F2812J61947O2760O4565j23139o4531J2650J16082
$$ 347864 463522 505968 478420 62812 224759 287519 352084 228945 164414 177064 293146
14920B93146E7318N15836B46598C0580L19752A26891J30777j0621K91841B47649
$$ 293146 57318 573154 246598 30580 350332 126891 257668 247047 538888 247649
14909G5559L31298A05245J02241L84799B58615j16872m4963J37006J42889m6992
$$ 75559 406857 105245 207486 592285 258615 141743 96780 233786 376675 329683
14899C29683A34794M31958j97355j70580G5014K43642K27166A29617a4600D66070
$$ 329683 134794 566752 369397 198817 75014 318656 545822 129617 -14600 466070
14888C74481J61922j32632j59189j03759K07118A63991N17058k36416j53921J47145
$$ 374481 536403 403771 244582 140823 347941 163991 681049 444633 290712 437857
14878D37857j35177J20106j78045M6218j08016L73610j39534K00808K084k18877
$$ 437857 302680 422786 244741 290959 182943 556553 417019 617827 619911 401034
14868D01034q3045D1334Q9009K62141J1040j41737J96712j65247K2026p7948k649
$$ 401034 317989 41334 130343 392484 403524 261787 458499 293252 315278 237330 234681
14857B34681O12562j70551A56016K66621A20071L49947j65170P7562K688k0740
$$ 234681 847243 676692 156016 422637 120071 470018 304848 382410 385098 364358
14847C64358J3897L2306j10690K84470k43718k7376L26466k52274A51271L32896
$$ 364358 378255 410561 299871 584341 340623 313247 639713 387439 151271 484167
14837D84167k25190J97360K27636B26667j5721L32339q0425j43970K13737J0184
$$ 484167 258977 456337 683973 226667 210946 543285 462860 318890 532627 542811
14827E42811j33788J99988C02639J91926j12919Q1739j26002Q4549k08141L14259
$$ 542811 409023 609011 302639 494565 381646 463385 337383 421932 213791 528050
14817E28050R6947j06228A72845M38169R3398k99388A91723K18682c5671C72878
$$ 528050 624997 518769 172845 611014 704412 405024 191723 410405 -35671 372878
14806E49331P1391k43812q5922K28210j44418K68954B71086L11710j32424L31933
$$ 549331 620722 376910 290988 519198 374780 643734 271086 582796 450372 782305
14796G82305k57854j63441l3262J56991r8044K64611k3643j50170p7367J7048
$$ 782305 524451 361010 327748 484739 386695 651306 627663 477493 400126 417174
14786D17174J57113K5892j18900p728J00709r8062J29615o6307L3757M5095N8755
$$ 417174 574287 600179 481279 473551 574260 476198 605813 539506 573263 618358 677113
14775F77113j34479l3605B33860L99561N4280J25265p3246l35523J82222j4236
$$ 677113 542634 509029 233860 633421 687701 812966 739720 404197 586419 572183
14765E72183j00362j76605L34971l14063L06994B41763M64044M6576B67648r4383
$$ 572183 471821 295216 630187 316124 623118 241763 705807 752383 267648 173265
14755A73265K43408j63920L34576J9712O1719B46450L73864l0202J86899C75470
$$ 173265 416673 252753 587329 607041 668760 246450 620314 590112 777011 375470
14744G71003C64868L3827N018L3058Q4689J65063k72698K1795L67371P5419l56842
$$ 771003 364868 398695 403713 436771 521460 686523 413825 435620 802991 878410 521568
14733E21568j73434L12855L30762C62960K13258J55388L6809j46212j9469j9019
$$ 521568 348134 660989 991751 362960 576218 731606 768415 622203 602734 583715
14723E83715K44712l54720J41061q760L07032j95543O3690o2731l44870J27978
$$ 583715 828427 473707 614768 606008 913040 717497 781187 718456 373586 501564
14713E01564j07413L7843K39914J01507A44254Q17392M0592m75349Q2612J63180
$$ 501564 394151 431994 671908 773415 144254 961646 1002238 526889 609501 772681
14703G72681J83167l88125J05396L21815l34464k1768K90987l85507j41764N17627
$$ 772681 955848 567723 673119 994934 660470 638702 929689 544182 402418 920045
14693I20045j83678j14232M04118k01383J19814j77068K33276k11749K25972M1057
$$ 920045 736367 622135 1026253 824870 944684 767616 1000892 789143 1015115 1056172
14683A056172j35149J05717N7783D39380L94847O990j66304L48405n745k3953
$$ 1056172 921023 1026740 1084523 439380 834227 841217 674913 1023318 1017573 993620
14673I93620Q7788M0288j610k07460k16883N81685m48188K94721r5749J35431
$$ 993620 1081408 1121696 1120086 912626 695743 1277428 829240 1123961 1028212 1163643
14663A163643O9507k86526j93824k0989L31319J30253K42190G00587P00464m93767
$$ 1163643 1233150 946624 752800 731811 1063130 1193383 1435573 700587 1401051 907284
14653I07284K59649j52126q5394J51766j6342p3944K84524k00593k08683M6143
$$ 907284 1166933 1014807 929413 1081179 1064837 990893 1275417 1074824 866141 912284
14643I12284J6918L16460k2466j22312K00549R9386j57233m94715M05204j54528
$$ 912284 929202 1245662 1223196 1100884 1301433 1400819 1243586 748871 1154075 999547
14633I99547J14243Q8418K0985j04155K50537n00691N46989l83091L72088k63592
$$ 999547 1113790 1202208 1223193 1119038 1369575 868884 1415873 1032782 1404870 1141278
14623A141278K60662k93512J36956K5120K029K76772k27518r6947r5748M50206
$$ 1141278 1401940 1108428 1245384 1270504 1272533 1549305 1321787 1224840 1129092 1579298
14613A579298l04164J98142l86694M12788n4170j69411r7060J7196K75268j16640
$$ 1579298 1275134 1473276 1086582 1499370 1445200 1275789 1178729 1195925 1471193 1354553
14603A354553P5272R0575o86J45933j84453J2586l0238l354J13429m1076j5777
$$ 1354553 1429825 1520400 1519714 1665647 1481194 1493780 1463542 1460188 1573617 1532541 1516764
14592A516764l3541J17486O892K58099j84782m6599L51870m086k92880N6491M2696
$$ 1516764 1483223 1600709 1607601 1865700 1680918 1634319 1986189 1982103 1689223 1745714 1788410
14581A788410j5748m23207M32169m3658K14626p0195k07806o594K17686J01723
$$ 1788410 1772662 1349455 1781624 1737966 1952592 1882397 1674591 1667997 1885683 1987406
14571A987406J38749J2106J3459l01804J84113J27968j01304K28274N6345j29815
$$ 1987406 2126155 2138261 2151720 1849916 2034029 2161997 2060693 2288967 2345312 2215497
14561B215497K71874p5725Q2685k0197K87521J32620J76836r1031M72189J97851
$$ 2215497 2487371 2411646 2494331 2474134 2761655 2894275 3071111 2980080 3452269 3650120
14551C650120M33517J058983J679880L427112R951313J9194975K954678k0050982
$$ 3650120 4083637 5142620 6822500 10249612 20200925 39395900 42350578 22299596
14543B2299596A0136238D453504j217138q91227o43379J54957q1059P8234k11866
$$ 22299596 10136238 4453504 3236366 2345139 1701760 1856717 1775658 1853892 1642026
14534A642026j9605J22674L32955R7803k68016J5308L54475j30038R8125r946
$$ 1642026 1622421 1745095 2078050 2175853 1907837 1923145 2277620 2147582 2245707 2235761
14524B235761j66041m3080J58540j28034k16824N51146q1103j35234J39150P2801
$$ 2235761 2069720 2026640 2185180 2057146 1840322 2391468 2310365 2175131 2314281 2387082
14514B387082K19747j43746j75921R6888K05713j40190L94219m85821N17066l50578
$$ 2387082 2606829 2463083 2287162 2384050 2589763 2449573 2843792 2357971 2875037 2524459
14504B524459K58276q8111q3323K36768M9678j23705j00725L2928l552N83855
$$ 2524459 2782735 2694624 2611301 2848069 2897747 2774042 2673317 2706245 2702693 3286548
14494C286548J16074j06480l40066K08638l82811N03964k77620L46546L8669k13707
$$ 3286548 3402622 3296142 2956076 3164714 2781903 3285867 3008247 3354793 3393462 3179755
14484C179755k42782L72580K6575J9431L35030j43702L8697k9123K50960j38871
$$ 3179755 2936973 3309553 3336128 3355559 3690589 3546887 3585584 3556461 3807421 3668550
14474C668550L39885l44817L05013j6455p6809K9542M6773L44939l63547O54575
$$ 3668550 4008435 3663618 3968631 3952176 3875367 3904909 3951682 4296621 3933074 4587649
14464D587649m26657j51549K92069J08655K5073o1462L091N3667l31761L72226
$$ 4587649 4160992 4009443 4301512 4410167 4435240 4373778 4376869 4430536 4098775 4471001
14454D471001K66435j69159J23416M455L65709q376K38899N8216k32638j3978
$$ 4471001 4737436 4568277 4691693 4696148 5061857 5053481 5292380 5350596 5117958 5103980
14444E103980L27666J59658J34666l97246K34429L55260j78437J28714K36261
$$ 5103980 5431646 5591304 5725970 5328724 5563153 5918413 5739976 5868690 6104951
14435F104951l0297j4279L29808n5652J40784K04336n72665M03203Q273J44027
$$ 6104951 6074654 6060375 6390183 6334531 6475315 6679651 6106986 6510189 6518462 6662489
14425F662489p9211J04841J91164J44460m8924L66941J2062L59118k63394M33882
$$ 6662489 6583278 6688119 6879283 7023743 6974819 7341760 7353822 7712940 7449546 7883428
14415G883428L373p1382K17203K6627R5789K51018O2103J68813j26476K54338
$$ 7883428 7886801 7815419 8032622 8059249 8155038 8406056 8468159 8636972 8510496 8764834
14405H764834L22734o4881J47536l7162M48112j53855L78731J42265J93670J99143
$$ 8764834 9087568 9022687 9170223 9133061 9581173 9427318 9806049 9948314 10141984 10341127
14395A0341127M1312L53498J62073J19070K22875K81706K05111q1230K75389N1001
$$ 10341127 10382439 10735937 10898010 11017080 11239955 11521661 11726772 11645542 11920931 11971932
14385A1971932L66578O71749l43349L29932j8734N20194J14754K79040K99607
$$ 11971932 12338510 13010259 12666910 12996842 12978108 13498302 13613056 13892096 14191703
14376A4191703K50638P10021j03360L49029M50585K72435K92039N7025M77295
$$ 14191703 14442341 15152362 15049002 15398031 15848616 16121051 16413090 16470115 16947410
14367A6947410O14850J97455O63757J25475O65430k65005J161278J45274L78987
$$ 16947410 17562260 17759715 18423472 18548947 19214377 18949372 20110650 20255924 20634911
14358B0634911O79936M98102L55252M28770Q33690K71284O10381M77272N13821
$$ 20634911 21314847 21812949 22168201 22596971 23430661 23701945 24312326 24789598 25303419
14349B5303419O94005O32863P36381R17181M68699Q88096N03962J017013R23382
$$ 25303419 25997424 26630287 27366668 28283849 28752548 29640644 30144606 31161619 32085001
14340C2085001M82898R88368J342236O53478J309491J242213O05745J422168J378216
$$ 32085001 32567899 33556267 34898503 35551981 36861472 38103685 38709430 40131598 41509814
14331D1509814J131405J328601J405177J198021J973904J575328J367529K097832
$$ 41509814 42641219 43969820 45374997 46573018 48546922 50122250 51489779 53587611
14323E3587611J515764K227766K002149K406567K157298K536491K353496K739483
$$ 53587611 55103375 57331141 59333290 61739857 63897155 66433646 68787142 71526625
14315G1526625L095514K535514L129177L880778L309841L355962M177834M463912
$$ 71526625 74622139 77157653 80286830 84167608 87477449 90833411 95011245 99475157
14307I9475157M195453M829511N124359N351655N280183O139249O741230O739772
$$ 99475157 103670610 108500121 113624480 118976135 124256318 130395567 137136797 143876569
14299A43876569O987605Q192617P885463R140037R152571R684295J0888254J0721619
$$ 143876569 150864174 159056791 166942254 176082291 185234862 194919157 205807411 216529030
14291B16529030J1701561J2499710J2769741J3650563J3996847J4933454J5369762
$$ 216529030 228230591 240730301 253500042 267150605 281147452 296080906 311450668
14284C11450668J5620799J6250591J6030903J6140292J5674627J5193553J4182312
$$ 311450668 327071467 343322058 359352961 375493253 391167880 406361433 420543745
14277D20543745J2830209J1434189R565085P493889M949769J090981k788567m997126
$$ 420543745 433373954 444808143 454373228 461867117 466816886 467907867 465119300 460122174
14269D60122174l968727m442340n793649r899324j1596854j2430640j3895564
$$ 460122174 456153447 451711107 445917458 436018134 424421280 411990640 398095076
14262C98095076j5138446j6192278j6705477j6626031j6258842j6172788j5745455
$$ 398095076 382956630 366764352 350058875 333432844 317174002 301001214 285255759
14255B85255759j4429576j3645835j2914532j3094260j2061935j1538419j0913305
$$ 285255759 270826183 257180348 244265816 231171556 219109621 207571202 196657897
14248A96657897j0075612r462712q908569p990240q068638o943836p483017o636295
$$ 196657897 186582285 177119573 168211004 160220764 152152126 145208290 137725273 131088978
14240A31088978n846180n689695n174343n091830m735330m816238m240349m187714
$$ 131088978 125242798 119553103 114378760 109286930 104551600 99735362 95495013 91307299
14232I1307299l096915k990142l733772l605256k886036l104918k613497k500102
$$ 91307299 88210384 85220242 81486470 77881214 74995178 71890260 69276763 66776661
14224F6776661k536263k215657k211210k062288j984900j916297j716907j682941
$$ 66776661 64240398 62024741 59813531 57751243 55766343 53850046 52133139 50450198
14216E0450198j683397j472936j168019j736545j597112r08572j042722j508777
$$ 50450198 48766801 47293865 46125846 44389301 42792189 41883617 40840895 39332118
14208C9332118j038974n10343r87633j055318j408322j027266n74309j103415
$$ 39332118 38293144 37782801 36795168 35739850 34331528 33304262 32729953 31626538
14200C1626538n41676p49060j315605n87667p01868q07086n44057n29723p32324
$$ 31626538 31084862 30335802 29020197 28432530 27730662 26923576 26379519 25849796 25117472
14191B5117472p91917m78807o97838k51334p49635p56900m0205m36661l61230
$$ 25117472 24325555 23846748 23148910 22897576 22147941 21391041 21350836 20914175 20552945
14182B0552945o38918m14660n81375k06839k88100m78262l49931m07487l45906
$$ 20552945 19914027 19499367 18917992 18711153 18423053 17944791 17594860 17187373 16841467
14173A6841467k79135l0320o96595k64525R3637p45022j38636j92355k25722m98133
$$ 16841467 16562332 16532012 15835417 15570892 15664529 14919507 14780871 14588516 14362794 13864661
14163A3864661j60179l63360k9970k5955n58261q7707k30239m16668K1038j64423
$$ 13864661 13704482 13341122 13311152 13285197 12726936 12639229 12408990 11992322 12013360 11848937
14153A1848937k78029l56569L16320m51847n88850j52758L47251m05579M9566
$$ 11848937 11570908 11214339 11530659 11078812 10489962 10337204 10684455 10278876 10328442
14144A0328442l09072n09279J98931n16913j74096J23932l3970j53751k64845
$$ 10328442 10019370 9510091 9709022 9192109 9018013 9141945 9107975 8954224 8689379
14135H689379L53546o21991l625j49370O465j37037k03023j22065k28723J65571
$$ 8689379 9042925 8420934 8417309 8267939 8274404 8137367 7934344 7812279 7583556 7749127
14125G749127l93619M2640j48928j38080m4112k4500l69452j79055P90150p50034
$$ 7749127 7355508 7398148 7249220 7111140 7067028 7042528 6673076 6494021 7284171 6534137
14115F534137l6035K38168k65960r1775n6101m02266J9569J32257K06686o49238
$$ 6534137 6498102 6736270 6470310 6378535 6322434 5920168 5939737 6071994 6278680 5629442
14105E629442J97399j65015k00548K01058k84920j78573p2008L388k6024q5821
$$ 5629442 5826841 5661826 5461278 5662336 5377416 5198843 5126835 5130223 5104199 5018378
14095E018378K10275j44571K4605k82169j6046K06318o0233j61108j89696L69719
$$ 5018378 5228653 5084082 5108687 4826518 4810472 5016790 4956557 4795449 4605753 4975472
14085D975472j37389k71935m683m2706o194j59191j76842K09147k40865K2479
$$ 4975472 4838083 4566148 4561465 4518759 4512565 4353374 4176532 4385679 4144814 4167293
14075D167293k04431K94344k69282m1459k92304M67526k07193J51098r0203k75536
$$ 4167293 3962862 4257206 3987924 3946465 3654161 4121687 3914494 4065592 3975389 3699853
14065C699853L04687k62509o2185j22217J25798L8267k09321P0455K20366o1304
$$ 3699853 4004540 3742031 3679846 3557629 3683427 3721694 3512373 3582828 3803194 3741890
14055C741890k92758j47629Q9783K34644k64696j50092K1543j4435k15003O2091
$$ 3741890 3449132 3301503 3391286 3625930 3361234 3211142 3232685 3218250 3003247 3065338
14045C065338k51840N91518l44650l75174N41355m25170K22862j51751n1699n7926
$$ 3065338 2813498 3405016 3060366 2685192 3226547 2801377 3024239 2872488 2820789 2762863
14035B762863O0915r2733J28183l8505k61583P6783K44887J19474m81080J57795
$$ 2762863 2823778 2731045 2859228 2820723 2559140 2635923 2880810 3000284 2519204 2676999
14025B676999l5318k05074K44915k86052J02284j32904K86905k74184j49163N22128
$$ 2676999 2641681 2436607 2681522 2395470 2497754 2364850 2651755 2377571 2228408 2750536
14015B750536n89039K581J47847k71434K65988k88655L64288n35761K54151K70823
$$ 2750536 2161497 2164078 2311925 2040491 2306479 2017824 2382112 1846351 2100502 2371325
14005B371325k12598j56986R5574j47556k40763L51216J0695m20717L64770j1659
$$ 2371325 2158727 2001741 2097315 1949759 1708996 2060212 2070907 1650190 2014960 2003301
13995B003301J25420m85838N96359l02198P411O33013N56848K248060P335270
$$ 2003301 2128721 1642883 2239242 1937044 1944455 2577468 3134316 5382376 12717646
13986A2717646K0113894J0273467j7181847A2714855n004076k041122j403070
$$ 12717646 32831540 43105007 25923160 12714855 7710779 5669657 4266587
13979D266587o75488k34430j38152j82629j93774O2229l18102j83014N3919j26874
$$ 4266587 3591099 3356669 3218517 3035888 2842114 2904343 2586241 2403227 2457146 2330272
13969B330272o8605l23248K45101R0900J26859m80405j7896j37360P3685K07931
$$ 2330272 2261667 1938419 2183520 2274420 2401279 1920874 1902978 1765618 1839303 2047234
13959B047234l98431K0262R6839j07509K11869P6197j09687m203j27772O7358
$$ 2047234 1648803 1669065 1765904 1658395 1870264 1946461 1836774 1832571 1704799 1772157
13949A772157j7731k60796L76356j17337r6341r6140J76847k38765K98752k65128
$$ 1772157 1754426 1493630 1869986 1752649 1656308 1560168 1737015 1498250 1797002 1531874
13939A531874J27807q8421L15011m85818K40221r2671k14781K68882j58655K34373
$$ 1531874 1659681 1571260 1886271 1400453 1640674 1548003 1333222 1602104 1443449 1677822
13929A677822J34498r3010j78290P6296O9108l30056J49592M8324k51720R0618
$$ 1677822 1812320 1719310 1541020 1617316 1686424 1356368 1505960 1554284 1302564 1393182
13919A393182l15201M36142m08759N99741l98416R5090J13619k49825P9421p2973
$$ 1393182 1077981 1514123 1105364 1705105 1306689 1401779 1515398 1265573 1344994 1272021
13909A272021R6987j80685k12734K40243o5347j91632N05227j23539o8899l13421
$$ 1272021 1369008 1188323 975589 1215832 1150485 958853 1464080 1340541 1271642 958221
13899I58221P9857J00414K83042l63566N07052m21771j0689p7491J29123J59487
$$ 958221 1038078 1138492 1421534 1057968 1565020 1143249 1132560 1055069 1184192 1343679
13889A343679r3884K32828m81977L49376L3148o2913k80277L04199k15151j95675
$$ 1343679 1249795 1482623 1000646 1350022 1383170 1320257 1039980 1344179 1129028 933353
13879I33353J97234j23846K8982J4148j41883p6662M06876l81695L47632p9283
$$ 933353 1130587 1006741 1035723 1049871 907988 831326 1238202 856507 1204139 1124856
13869A124856J42091k01929k47785Q3610P4561M964K06635j90660J34451j78184
$$ 1124856 1266947 1065018 817233 900843 975404 980368 1187003 996343 1130794 952610
13859I52610n7616K38527l26314J204L12276J7796l31284J36027m00326N43978
$$ 952610 894994 1133521 807207 808411 1120687 1138483 807199 943226 542900 1086878
13849A086878l03945J86585J07838k47878K1523p5489P6200j15944N77113m92956
$$ 1086878 782933 969518 1077356 829478 851001 775512 851712 735768 1312881 819925
13839H19925k24692L28137K31655m2750k90793M1048j07012j43252L36702k86092
$$ 819925 595233 923370 1155025 1112275 821482 862530 755518 612266 948968 662876
13829F62876L29622D81910M63412j65952J65014k37513J10242J20457K45776l32273
$$ 662876 992498 481910 945322 779370 944384 706871 817113 937570 1183346 851073
13819H51073j19317K24771j84735N2103J84000m24786p0649M82513R725j68553
$$ 851073 731756 956527 771792 823895 1007895 583109 512460 994973 1004698 836145
13809H36145j5154O2269O2919k59705L4641N4361J53550k33362J21877O1861j17995
$$ 836145 820991 883260 946179 686474 721115 775476 929026 695664 817541 879402 761407
13798G61407o3487J67031J39196k21134j55891K03170j62012K86662D13249J73236
$$ 761407 697920 864951 1004147 783013 627122 830292 668280 954942 413249 586485
13788E86485j21360m4128R6100k4423n309N20156k05486l1442k88434K52943K1076
$$ 586485 465125 420997 517097 492674 487365 1007521 802035 770593 482159 735102 756178
13777G56178K74816j78636n4721j13145P1539k14449J28927j26463J50870l32931
$$ 756178 1030994 852358 797637 684492 756031 541582 670509 544046 694916 361985
13767C61985Q8754K40996k07039K79151k57318Q6922k12025J37793J64706m1965
$$ 361985 450739 691735 484696 763847 506529 593451 381426 519219 683925 641960
13757F41960k60773K20078J73769k07767J90098C67201L52426k54708L82755l18837
$$ 641960 381187 601265 775034 567267 757365 367201 719627 464919 847674 528837
13747E28837J60309J10228k28653J55664l34718A81200M77753k91232L04907A32210
$$ 528837 689146 799374 570721 726385 391667 181200 658953 367721 672628 132210
13736F95129j05444o6325Q1479j7404j66635K91868p1363l1765k24617K22164
$$ 695129 589685 523360 604839 587435 420800 712668 641305 609540 384923 607087
13726F07087B43243J81403r5047O7726Q2587o2318J71440k0978j64302L52784
$$ 607087 243243 424646 329599 397325 479912 417594 589034 568056 403754 756538
13716G56538C45545K8540l8925l239Q8804M42712l76472M7033J3804o8645J33788
$$ 756538 345545 374085 335160 331921 420725 863437 486965 533998 547802 479157 612945
13705F12945q8300o9677O4623p9587o5780L37994C36788K39038R4256j94779J26931
$$ 612945 524645 454968 519591 440004 374224 712218 336788 575826 670082 475303 602234
13694F02234B96440r7931J06744K50218k45012J09239J15024j0428Q4999j01430
$$ 602234 296440 198509 305253 555471 310459 419698 534722 524294 609293 507863
13684E07863B42118q6213L49461n4337P1949B13331M17552k23226J04189o4488
$$ 507863 242118 155905 505366 451029 522978 213331 630883 407657 511846 447358
13674D47358k3456q1273q8920P3289A34243M08237k55448L3594M324L41726j70936
$$ 447358 423902 342629 253709 326998 134243 542480 287032 320626 324950 666676 495740
13663D95740j35008K451j979M9655F0338L11863J59311p7656J00479J2031A66775
$$ 495740 360732 363183 361204 410859 60338 372201 531512 453856 554335 566366 166775
13651D44158J47412B66779J69084m2850q134N8441P0809l854J42148B67144K18822
$$ 444158 591570 266779 435863 393013 384879 443320 514129 510275 652423 267144 485966
13640D85966j14983j43736J91589A17857M15397k25785j03066J95692A08736M34788
$$ 485966 370983 227247 418836 117857 533254 307469 204403 400095 108736 543524
13630E43524l6357k37307N42341C57312a0539F74495A79370J20075j8391J74795
$$ 543524 507167 269860 812201 357312 -10539 674495 179370 299445 281054 455849
13620D55849p7914j50928M11511B19213J27810K00990B44567e1213D77368J62528
$$ 455849 377935 227007 638518 219213 347023 548013 244567 -51213 477368 639896
13610F39896B69480Q9451p0188p2829L11085B55777Q4551j48943k2929K93555
$$ 639896 269480 358931 288743 215914 526999 255777 340328 191385 168456 462011
13600D62011j49222o6659A22845L50450j77793J95127k37116D7568L33219h5980
$$ 462011 312789 246130 122845 473295 295502 490629 253513 47568 380787 -85980
13589C41450K7884j13929J47934j81544J76683o7684N5850M081J02749j90201
$$ 341450 369334 255405 403339 221795 398478 330794 386644 390725 493474 303273
13579C03273A24109J54865J6407N09984C13808D5350M67474H8451J39946J99906
$$ 303273 124109 278974 295381 805365 313808 45350 512824 88451 228397 428303
13569D28303K9113O9638f7466C05265M24316c974C74135K33108A58156J86983
$$ 428303 457416 527054 -67466 305265 729581 -3974 374135 607243 158156 345139
13559C45139q3719o2808M19734j72070j32081J00292K2531A90893O5845D3332
$$ 345139 261420 198612 618346 446276 314195 414487 437018 190893 256738 43332
13548A98435F7297L70442L2223j00869l3918A08597M08372A9391K92256J76731
$$ 198435 67297 437739 469962 369093 335175 108597 516969 19391 311647 488378
13538D88378j47168j49825l2419O3515J3598a4450C66342c173A93422R1356n425
$$ 488378 341210 191385 158966 222481 236079 -14450 366342 -3173 193422 284778 279353
13527B79353A37072J40063L5124A39256M52676g9952D09458j92928O0542o6945
$$ 279353 137072 277135 312259 139256 591932 -79952 409458 216530 277072 210127
13517B10127N967P8466a01797A97005K40657A97085J02161M3579L3483A14694
$$ 210127 216094 294560 -101797 197005 437662 197085 299246 342825 376308 114694
13506A04723K09115K11082A99305I8563L07536L6538F4694J63389k5804J80990
$$ 104723 313838 524920 199305 98563 406099 442637 64694 228083 202279 383269
13496C83269K3996L9358j29563J09559j44521A04357k5708L66983r6032A22998
$$ 383269 407265 446623 317060 426619 282098 104357 78649 445632 349600 122998
13485A96773G6141Q2038l0866R9819K46545A70078k522o2744K41355j57677j3348
$$ 196773 76141 158179 127313 227132 473677 170078 167556 104812 346167 188490 175142
13474A75142J93547A02895K27243n5505j6055L5537Q2333r140I4737a93211c5082
$$ 175142 368689 102895 330138 274633 258578 294115 376448 367308 94737 -193211 -35082
13462D78840D4098J54937J88818D6581K51542j20444a05850B80587j11596J66806
$$ 478840 44098 199035 387853 46581 298123 177679 -105850 280587 168991 335797
13452C35797J2504j41611K56701A2772J02243A9225R6432n0967J2084L07567l1019
$$ 335797 348301 206690 463391 12772 115015 19225 115657 64690 76774 384341 353322
13441C53322j48346f8621G2544R7679b44865C10992H8585N8108b03509C42747
$$ 353322 204976 -68621 72544 170223 -244865 310992 88585 146693 -203509 342747
13430A26079a18953A77157D9461R8890J77247j45284J68691j68695a54018C78354
$$ 126079 -118953 177157 49461 148351 325598 180314 349005 180310 -154018 378354
13419H4204b54005B57891m4725F8335a72577B21107r4103d9634B37018j17424
$$ 84204 -254005 257891 213166 68335 -172577 221107 127004 -49634 237018 119594
13409A19594m8427g6975E58388B44326E4904L32652A07201J94762A40049K12845
$$ 119594 71167 -76975 558388 244326 54904 387556 107201 301963 140049 352894
13399C52894p4898A23502j4189l4394a69392A77061J7727A8783e598l22911b6577
$$ 352894 277996 123502 109313 74919 -169392 177061 194788 18783 -5598 -328509 -26577
13387E3179c0547C8889M82031j57684h9602c0181E9689N2827n0722K52301B918
$$ 53179 -30547 38889 520920 363236 -89602 -30181 59689 112516 61794 314095 2918
13375B24868a8102r9023B42907q2720J95949G3545L59372a8327B93957k3632j3872
$$ 224868 -18102 -117125 242907 160187 356136 73545 432917 -18327 293957 270325 256453
13364B56453n0553K08981A0516J42521R9706l9938A4454a15115C09277A1197K48270
$$ 256453 205900 414881 10516 153037 252743 212805 14454 -115115 309277 11197 259467
13353B59467J76056j64647n0022l9116J04908L9572j13093M44446A15563K38885
$$ 259467 435523 270876 220854 181738 286646 326218 213125 657571 115563 354448
13343C54448j23932J19023J05861A76718J67943J9732J37598k36908D0378A501
$$ 354448 230516 349539 455400 176718 344661 364393 501991 265083 40378 1501
13332A03094A6169N38483A52303c6238F3308L3658e1288A09335J1434J86394J3773
$$ 103094 16169 554652 152303 -36238 63308 96966 -51288 109335 120769 307163 320936
13321C20936A33571E6684J94487k6641m4012J40196j22889o232M72843e4372A46942
$$ 320936 133571 56684 251171 224530 180518 320714 197825 191593 664436 -54372 146942
13309b0445C08080J5076A59031o7688a54762B45614L4335D8112r364Q4413J89527
$$ -20445 308080 323156 159031 91343 -154762 245614 279949 48112 38748 123161 312688
13298C12688j14660d859B1365J97604Q7693j35822P6259A16313l2543a9053j05051
$$ 312688 198028 -4859 21365 218969 306662 170840 247099 116313 83770 -19053 -124104
13287a24104C06654F9880P618N9859c04075A48664a37366G4563l910L82797M8096
$$ -124104 306654 69880 77498 137357 -304075 148664 -137366 74563 70653 453450 501546
13276E01546a85592a318k31428G8407Q421k5241J41289p2363K5486K00921n4308
$$ 501546 -185592 -1318 -232746 78407 86828 61587 202876 130513 155999 356920 302612
13265C02612N0716j36429C3685K11555j10865D8176K14528b16605H8853J57734
$$ 302612 353328 216899 33685 245240 134375 48176 262704 -216605 88853 246587
13255B46587e6917A13438o09J06465j2988g073D08923A50028a1878D9250J89618
$$ 246587 -56917 113438 112829 219294 206306 -7073 408923 150028 -11878 49250 238868
13244B38868G5108P2083A7502M8005h8093m2360A76571B5840J66480D5024J07448
$$ 238868 75108 147191 17502 65507 -88093 -130453 176571 25840 192320 45024 152472
13233A52472b09846J080B93952k4913C7726c3760j19555f2997B28573e0848C18524
$$ 152472 -209846 -208766 293952 269039 37726 -33760 -153315 -62997 228573 -50848 318524
13221e7751r9338A68581A2409N1308J29866e7166J8075C28496M6574A57744j6479
$$ -57751 -157089 168581 12409 63717 193583 -57166 -39091 328496 375070 157744 141265
13210A41265J48539b9484B50593g9904k28236B58331Q857a05210I3803b15735
$$ 141265 289804 -29484 250593 -79904 -308140 258331 267188 -105210 93803 -215735
13199A86725J00471a84480A82429J7720F6334J55202f1599A02094D9846k671a13429
$$ 186725 287196 -184480 182429 200149 66334 221536 -61599 102094 49846 47175 -113429
13187a20063r1022d2077B31844A0214K74859a7037D21218A59086h0628A77801
$$ -120063 -211085 -42077 231844 10214 285073 -17037 421218 159086 -80628 177801
13176B58118I2217D5902c7998C21924J4747b0405A21150a53898A48157L50718
$$ 258118 92217 45902 -37998 321924 336671 -20405 121150 -153898 148157 498875
13166D98875j21742A68040a744m2363G3263j496J56755a27249E9063J71334f6355
$$ 498875 377133 168040 -1744 -44107 73263 71767 228522 -127249 59063 230397 -66355
13154B6838b01218k6358B65409K00655A77939O1933J33147b9898L772A11164O2169
$$ 26838 -201218 -227576 265409 466064 177939 239872 373019 -29898 -26126 111164 173333
13143A73333m9143J41732G9839a27797j13957C34800j5027A55266A5771K63597
$$ 173333 124190 265922 79839 -127797 -241754 334800 319773 155266 15771 279368
13133B79368n3279a1180l4769C16829g3928H8421k8979a82737A10455J35555b67794
$$ 279368 226089 -11180 -45949 316829 -73928 88421 59442 -182737 110455 246010 -267794
13121B98021A09111a55363N5169A50223k4457d10F8141K9077J16047b300k51059
$$ 298021 109111 -155363 -100194 150223 125766 -410 68141 97218 213265 -2300 -253359
13110b53359B0978M3144P4896j5678K3447O1190a66756b5066q4583K4632c3058
$$ -253359 20978 64122 139018 123340 146787 207977 -166756 -25066 -109649 -85017 -33058
13098a3576C1834R3177b5880j12750D5502O720j0435b94256A76019o6463a09444
$$ -13576 31834 125011 -25880 -138630 45502 52222 41787 -294256 176019 109556 -109444
13086b03374D32217E4693P2316c9299B02995C5776a07410k67747a53183q6999
$$ -203374 432217 54693 127009 -39299 202995 35776 -107410 -375157 -153183 -240182
13076b40182H0687a12643J9591B10012M3589a0996A94229K0325l3822b951B78686
$$ -240182 80687 -112643 -93052 210012 253601 -10996 194229 214554 180732 -2951 278686
13064I8224L5498a45082i090b326C54600a28560A65393b56358i5712B02985i1259
$$ 98224 133722 -145082 -9090 -2326 354600 -128560 165393 -256358 -95712 202985 -91259
13052f490k7460E4677A3338L15548J72071I6485g357C04676h1039j40557R8926
$$ -6490 -33950 54677 13338 328886 500957 96485 -7357 304676 -81039 -221596 -122670
13041a22670B11490b15339D2808a81515A17844b40622e5055A22914J55630E3057
$$ -122670 211490 -215339 42808 -181515 117844 -240622 -55055 122914 278544 53057
13030a18550A26130L56008A00784J51331A18726K3059k5948J02367c22271B9408
$$ -118550 126130 482138 100784 252115 118726 141785 115837 218204 -322271 29408
13019D995K25435h1922A28488K07742g394A72694R3688b6049E24239o5628j86890
$$ 4995 230430 -81922 128488 336230 -7394 172694 266382 -26049 524239 458611 271721
13008B71721j32014B3502J02809a14567B43034b51194B3016O0348N7988C6452
$$ 271721 139707 23502 126311 -114567 243034 -251194 23016 83364 141352 36452
12997C98711h5820A06971j3553k1313a54804j02201D5464O5938J23064j14716
$$ 398711 -85820 106971 93418 72105 -154804 -257005 45464 111402 234466 119750
12987A19750D7394e23876b01776d308A74130J07933b8902Q089l242H7901l0486
$$ 119750 47394 -523876 -201776 -4308 174130 282063 -28902 -20813 -24055 87901 57415
12976E7415B3759a8362j2598m3761G2591R1627O6818b39735R3923A09853b8552
$$ 57415 23759 -18362 -30960 -74721 72591 164218 231036 -239735 -145812 109853 -28552
12964i9798B68450a09962C9851c89830A82542K1058A5702J57575J00388a53040
$$ -99798 268450 -109962 39851 -389830 182542 203600 15702 173277 273665 -153040
12953D6828a51891L8385G3356B3819d2569H7117j379A0704J34641a98789B80212
$$ 46828 -151891 -113506 73356 23819 -42569 87117 85738 10704 145345 -198789 280212
12941e5514l24750D85653i4719K9420r5806C89165A90626H5008f8856A28491J93236
$$ -55514 -380264 485653 -94719 -65299 -161105 389165 190626 85008 -68856 128491 321727
12930C21727j25199A8380e6524A20133n5871a4440A13742J12899a87682f0522
$$ 321727 196528 18380 -56524 120133 64262 -14440 113742 226641 -187682 -60522
12919B36096m8698c7756m2297C51475l164E9054O3496M392C2913O3810c5252D8722
$$ 236096 187398 -37756 -80053 351475 348311 59054 122550 126942 32913 96723 -35252 48722
12906b836j35089P321B79622A05140a70895K9474D33542j28036j03071n5859R7327
$$ -2836 -137925 -130604 279622 105140 -170895 -141421 433542 305506 202435 146576 243903
12895B43903j7987A0847Q0852J03628e1610C02556a74004R947M6902e1790A13944
$$ 243903 225916 10847 91699 195327 -51610 302556 -174004 -164057 -117155 -51790 113944
12883H6944J34062D9973B1662L51878c6805n645A63664m7663J26264a21441C3260
$$ 86944 221006 49973 21662 373540 -36805 -42450 163664 116001 242265 -121441 33260
12871a84955j50794B27491H0390L9048n3008e1121B08909c56683a14686j1119
$$ -184955 -335749 227491 80390 119438 66430 -51121 208909 -356683 -114686 -125805
12861a25805B6215N4403L9084d4917j88080A67257k3986a19936M561r5028C12528
$$ -125805 26215 80618 119702 -44917 -232997 167257 143271 -119936 -115375 -210403 312528
12849A52919a27652A0915h080o9840A3456J76597D7345E739b52941F5885J69942
$$ 152919 -127652 10915 -8080 -77920 13456 190053 47345 5739 -252941 65885 235827
12838B35827p7139o7241h3836j88392A0757J40477a35936H980K56059d9655l00396
$$ 235827 158688 91447 -83836 -272228 10757 151234 -135936 8980 265039 -49655 -350051
12827c50051Q2407A17978J6335b5664A92269i8367D553b7721j30547l9281C97925
$$ -350051 -267644 117978 134313 -25664 192269 -98367 4553 -27721 -158268 -197549 397925
12815A02781J8621n0903M7433g3661j14051M7231E7707b31955a01042K855A07240
$$ 102781 121402 70499 117932 -73661 -187712 -140481 57707 -231955 -101042 -98187 107240
12803a2323B16720I1196L00848j11480A08772D429a13285p691A14105c13846A08087
$$ -12323 216720 91196 392044 280564 108772 4429 -113285 -120976 114105 -313846 108087
12791F8834J0209L775J09837g7591o1309B92713c83277A08688c02651J27312g3365
$$ 68834 79043 82818 192655 -77591 -138900 292713 -383277 108688 -302651 -175339 -73365
12779A75350J36255a9949B2980a81881r1348c4257A88990c14161A19384Q3232
$$ 175350 311605 -19949 22980 -181881 -273229 -34257 188990 -314161 119384 202616
12769B02616C1330K66358c63093F0119g459A05396a75077b3334B12814A01182
$$ 202616 31330 297688 -363093 60119 -7459 105396 -175077 -23334 212814 101182
12758a44396B10550a80944M1136B31011B7566P1597d1871j5075B80498a64418
$$ -144396 210550 -180944 -139808 231011 27566 99163 -41871 -56946 280498 -164418
12747a86973B37417a07282C8308L5472c6618B1604c1843B08040a61043B9572J17988
$$ -186973 237417 -107282 38308 73780 -36618 21604 -31843 208040 -161043 29572 147560
12736A47560a59433a7265A12656h7489b1711o8233I7049Q246M19499k04577A25830
$$ 147560 -159433 -17265 112656 -87489 -21711 -89944 97049 105295 524794 320217 125830
12724b5528J501k6328j10147J4377G2383b81831k2507a07277j2308d6303p3646
$$ -25528 -24027 -50355 -160502 -146125 72383 -281831 -304338 -107277 -119585 -46303 -119949
12713a19949B78454R6362E2772E427L22158A41312k2908E4577K24395A30212K7030
$$ -119949 278454 374816 52772 5427 327585 141312 118404 54577 278972 130212 157242
12702A57242K03714C5331P9681m4991J2099J06003i8013p3326d1377o061A39514
$$ 157242 360956 35331 115012 70021 82120 188123 -98013 -171339 -41377 -47438 139514
12690G8603m799i9837D8097c38712C5498h6613B10152a17133A03480Q0671d4873
$$ 78603 73804 -99837 48097 -338712 35498 -86613 210152 -117133 103480 184151 -44873
12678C808L19042j39131M182c1720B991J15949a86400Q0314C83774A30387B1871
$$ 3808 322850 183719 187901 -31720 2991 118940 -186400 -106086 383774 130387 21871
12666E9084b44369A61554F0947O9239M2366j7492B3604b20314D07708c5646o8568
$$ 59084 -244369 161554 60947 130186 172552 155060 23604 -220314 407708 -35646 -104214
12655a04214l0376N0008C01632O2874j09007p6281J5656c08596g8168B19398k6350
$$ -104214 -134590 -84582 301632 364506 255499 179218 194874 -308596 -78168 219398 193048
12644A93048j5302e855E804J6465a02907D0001b37364J9899B56142J19871I0437
$$ 193048 177746 -5855 5804 22269 -102907 40001 -237364 -217465 256142 376013 90437
12632A43158C0089J60207F3067J61436a99089a6751B51192a3823j37337A70991
$$ 143158 30089 190296 63067 224503 -199089 -16751 251192 -13823 -151160 170991
12621B96596c7225q1827F3160i1886C7598K71970b13861A33236f4695A49591E5961
$$ 296596 -37225 -119052 63160 -91886 37598 309568 -213861 133236 -64695 149591 55961
12609a36648b6178B1952J51095a57543N8978J4438A36095J30613F4902J61208
$$ -136648 -26178 21952 173047 -157543 -98565 -84127 136095 266708 64902 226110
12599B26110p31B6917K90069o1599b27087f5663A3766K28303P6638d5028E9527
$$ 226110 225379 26917 316986 255387 -227087 -65663 13766 242069 318707 -45028 59527
12587i924r7800G6642J19115g006k79088d2989h455j93347A28498R2638a18219
$$ -9924 -107724 76642 195757 -7006 -286094 -42989 -8455 -201802 128498 221136 -118219
12575b06290A42104n0514e9048A20958J21861j11993a57847b9505j85812r227
$$ -206290 142104 91590 -59048 120958 242819 130826 -157847 -29505 -215317 -224544
12565b24544C40766e4902A82987E0295B0672L63392C6984R2640K33284A38318
$$ -224544 340766 -54902 182987 50295 20672 384064 36984 129624 362908 138318
12554A88787R813K5317c9713E307J9625J54279p5316b6460f112B81475b8248j5213
$$ 188787 198600 223917 -39713 5307 24932 179211 103895 -26460 -6112 281475 -28248 -43461
12542d3461E7306b46180A73536a39984A71166a7696H8514b95591A93579b51205
$$ -43461 57306 -246180 173536 -139984 171166 -17696 88514 -295591 193579 -251205
12531c0845A29513J0509c3825j5051A05810e5546j0799A50865e8025k2209A59853
$$ -30845 129513 140022 -33825 -48876 105810 -55546 -66345 150865 -58025 -80234 159853
12519C9228O9813n0602a31142B04358a5106q704j21616j9322N1661A56637P1977
$$ 39228 109041 58439 -131142 204358 -15106 -23810 -145426 -164748 -113087 156637 228614
12508B28614D4380a57323B83458c07871Q4705B6592e5297B84565b54809i7020
$$ 228614 44380 -157323 283458 -307871 -223166 26592 -55297 284565 -254809 -97020
12497a80710N8211B43075K39946a31424A55507l6274a34046c8768o8039B74466
$$ -180710 -122499 243075 483021 -131424 155507 119233 -134046 -38768 -106807 274466
12486b20952g9739C84773j86870H3371j765b30959D4727K11610A05055J42436
$$ -220952 -79739 384773 197903 83371 81606 -230959 44727 256337 105055 247491
12476B47491d6989A87018m7553C5461e706A91343o4601L9055b32387Q400h5902
$$ 247491 -46989 187018 139465 35461 -5706 191343 126742 165797 -232387 -223987 -85902
12464a87086d0555p1528C0530a10022K8617k7613j98998A47378f1042k54840A60213
$$ -187086 -40555 -112083 30530 -110022 -81405 -109018 -308016 147378 -61042 -315882 160213
12452a06664j51532H260R6836a19851c6843n03j15111G0564M72419H2511B2508
$$ -106664 -258196 8260 105096 -119851 -36843 -37346 -152457 70564 542983 82511 22508
12440B1924N7857k6401a33557j9118M3044B5923a01438D6172K24451j12519a40534
$$ 21924 79781 53380 -133557 -152675 -109631 25923 -101438 46172 270623 158104 -140534
12428A40327m2393J40756B2904J61948I1292h1626a3470H0723a72597A41030L2314
$$ 140327 97934 238690 22904 184852 91292 -81626 -13470 80723 -172597 141030 173344
12417A73344a9179j76016C08996q6065E6959c9677l38590B55346F3827L36251
$$ 173344 -19179 -195195 308996 222931 56959 -39677 -378267 255346 63827 400078
12407D00078A00736g5456A11146D5113J94729b22928I6839b14018h3442A68313
$$ 400078 100736 -75456 111146 45113 239842 -222928 96839 -214018 -83442 168313
12396b08144E6873f6660j091l390n6572B63K76265a79493A00475M0300B8606j2882
$$ -208144 56873 -66660 -67751 -71141 -127713 263 276528 -179493 100475 140775 28606 15724
12384A5724J45032d4505l15186D7565K7232I304J998a0750A29397b24292F3869
$$ 15724 160756 -44505 -359691 47565 74797 9304 11302 -10750 129397 -224292 63869
12372a97351I084a0196j06676b2612B06658a07172I9852K2909d861E9321g2394
$$ -197351 9084 -10196 -116872 -22612 206658 -107172 99852 122761 -4861 59321 -72394
12360A42514E6475a92207P0119k9576A14740C9398J82401a4256A45249E1725K09176
$$ 142514 56475 -192207 -122088 -151664 114740 39398 221799 -14256 145249 51725 260901
12349B60901j05574K835B7858Q2386m9567L1807d38251H8734J72130e8986k04670
$$ 260901 155327 158162 27858 110244 60677 92484 -438251 88734 260864 -58986 -263656
12338b63656J09311A89409o3056b7032C58266a59148A13089k8926j037c08924
$$ -263656 -154345 189409 126353 -27032 358266 -159148 113089 84163 83126 -308924
12327A10538M5343a11878n5446q5641b896A2564K25070c62683C32096A30030M6576
$$ 110538 155881 -111878 -167324 -252965 -2896 12564 237634 -362683 332096 130030 176606
12316A76606a57325c8522l5251E4409M1378i0177B03656Q9377g2231C5785f4516
$$ 176606 -157325 -38522 -73773 54409 95787 -90177 203656 293033 -72231 35785 -64516
12304b48631C73812i4802C8926Q3087G210h286o0367j4954A56736R4975B4845
$$ -248631 373812 -94802 38926 122013 7210 -8286 -68653 -83607 156736 251711 24845
12292C10991H2052l6381a39375b843C8913J6555L9037K18613o1868H9899c01624
$$ 310991 82052 45671 -139375 -2843 38913 55468 94505 313118 251250 89899 -301624
12280C7441Q9523m0400a42699A48278l2092K35110a14915A82710J37384d7394
$$ 37441 126964 86564 -142699 148278 116186 351296 -114915 182710 320094 -47394
12269d9622H6847N4333L39510g5160A15926a6385A68296h0789m1288j76663A33107
$$ -49622 86847 141180 480690 -75160 115926 -16385 168296 -80789 -122077 -298740 133107
12257C2565L58300A70111J02023r0047d5515I0097c3501A34922L8576j9101J60228
$$ 32565 390865 170111 272134 182087 -45515 90097 -33501 134922 173498 154397 314625
12246C14625j32293L9954m0373a854D66888A80244p1197a72642B73453E8642g7723
$$ 314625 182332 222286 181913 -1854 466888 180244 109047 -172642 273453 58642 -77723
12234E6175L2244N591i340C22388j38272G0033F794K13394a5860A20418J72425
$$ 56175 88419 94010 -9340 322388 184116 70033 6794 220188 -15860 120418 292843
12223B92843a4173B57739N3822E0018K16138q8065K6108J20583G1990q006a14780
$$ 292843 -14173 257739 311561 50018 266156 178091 204199 324782 71990 63984 -114780
12211D57027j44871o7441J06411A61374K90787A3996M1595K71640i794j37886
$$ 457027 312156 244715 351126 161374 452161 13996 55591 327231 -9794 -147680
12201a47680I2556Q4150L8302A1213J90985a46024A71137N7643A05908O4139L15242
$$ -147680 92556 176706 215008 11213 202198 -146024 171137 228780 105908 170047 485289
12190D85289a69344C56016D4411H155f7623B25987D1460c9439c511G368J25357
$$ 485289 -169344 356016 44411 8155 -67623 225987 41460 -39439 -3511 7368 132725
12179A32725J22694J26188j69833a02855C03378f0968A67558g542q0667j47350
$$ 132725 255419 381607 211774 -102855 303378 -60968 167558 -7542 -88209 -235559
12169b35559c0848A73903q435J4246F3273L07384A3839J54106p3471c18359A01304
$$ -235559 -30848 173903 165468 179714 63273 370657 13839 167945 94474 -318359 101304
12157a77369B47869a9854A04155J40088h6517B0200K744J76790H6923h0496c6821
$$ -177369 247869 -19854 104155 244243 -86517 20200 22944 199734 86923 -80496 -36821
12145f8207B48856a44691j87614C5036j1889b18961A086c26731h8800A750c8032
$$ -68207 248856 -144691 -332305 35036 23147 -218961 1086 -326731 -88800 1750 -38032
12133C3729e0390o676J4515A99778i4395j47429B30517a30499H9768c95C1880
$$ 33729 -50390 -57066 -42551 199778 -94395 -241824 230517 -130499 89768 -395 31880
12121D21674E6767J43193I8154N9982i9976j00547C34125C1144b63133B78710
$$ 421674 56767 199960 98154 158136 -99976 -200523 334125 31144 -263133 278710
12110f2861j19823b6548j8447l7058C40627a58745B33078a74182A01777b4835
$$ -62861 -182684 -26548 -44995 -82053 340627 -158745 233078 -174182 101777 -24835
12099A90268l6931C1130J46896b71593i632j28559A24516K64135a66632d214A1663
$$ 190268 153337 31130 178026 -271593 -9632 -138191 124516 388651 -166632 -4214 11663
12087f3273D2791i9974A5193h4365B5982P7834f5493A24314Q3110c82669h6117
$$ -63273 42791 -99974 15193 -84365 25982 103816 -65493 124314 207424 -382669 -86117
12075E6097K57893J44696N63494O06423o87983B75550H8951B4126M20964d991
$$ 56097 313990 458686 1022180 1628603 940620 275550 88951 24126 445090 -4991
12064A68845O3087f045l79937a02759A00401J82118i3756H7499b88967J31699
$$ 168845 231932 -6045 -385982 -102759 100401 282519 -93756 87499 -288967 -157268
12054a57268G5952a00435c603n9929A43103a19421N2459B2899i1126k65432J59833
$$ -157268 75952 -100435 -3603 -63532 143103 -119421 -66962 22899 -91126 -356558 -196725
12043a96725m3956Q4977B55689C7002J74881b50672j95976A13354a34069e2955
$$ -196725 -240681 -155704 255689 37002 211883 -250672 -446648 113354 -134069 -52955
12032g1694B0547J6251H42J2885b52826J06573A52378b80164j47858a07006B92139
$$ -71694 20547 36798 842 13727 -252826 -146253 152378 -280164 -428022 -107006 292139
12020C61538A17263B5910Q7850m9410J89517r9935f1223A33005d8007E9534b94711
$$ 361538 117263 25910 113760 64350 253867 153932 -61223 133005 -48007 59534 -294711
12008B31761g0435k7932A43400h441r336j52383E3816M9583a41999l4918a9318
$$ 231761 -70435 -98367 143400 -8441 -17777 -170160 53816 103399 -141999 -176917 -19318
11996b88633A07255M0266o545kJ7856D6104a02481j65136H9477d7079A87188a58262
$$ -288633 107255 147521 140976 140974 158830 46104 -102481 -267617 89477 -47079 187188 -158262
11983F0733K8021a60852a1082j85539A26197c61857a44766A47964N3321m6721
$$ 60733 88754 -160852 -11082 -196621 126197 -361857 -144766 147964 201285 154564
11973A54564l897d30l3462a0936m36081c3952F4795b14724D5188b2203k4883A95273
$$ 154564 150667 -430 -33892 -10936 -447017 -33952 64795 -214724 45188 -22203 -47086 195273
11960e3121J9247A52709E2987K87584a10723A42159b82436B4008g0062a6761F4492
$$ -53121 -33874 152709 52987 340571 -110723 142159 -282436 24008 -70062 -16761 64492
11948E5127a21550r021c8370A49999b78586A31442h280k75274m0429a46028j2634
$$ 55127 -121550 -130571 -38370 149999 -278586 131442 -8280 -283554 -323983 -146028 -158662
11937a58662B54735n0482a09162E2751a58210J1376k53977i401D0054K07345a64921
$$ -158662 254735 204253 -109162 52751 -158210 -146834 -400811 -9401 40054 247399 -164921
11925a70202n2076M3216B554a08678d8027J0763k3591j07015d5831j24123c5840
$$ -170202 -222278 -179062 2554 -108678 -48027 -37264 -60855 -167870 -45831 -169954 -35840
11913e8396F3020j2804g0687n7607A28731e8769j06366j32636J25064A29689M1840
$$ -58396 63020 50216 -70687 -128294 128731 -58769 -165135 -297771 -172707 129689 171529
11902A71529L10093B16714a12913j279D7287O8632f2939E7027h7096c9908k8207
$$ 171529 481622 216714 -112913 -114192 47287 115919 -62939 57027 -87096 -39908 -68115
11891f8115B0921h1040k15390C5163M6530g2476E7243b3657A18575a82167G1479
$$ -68115 20921 -81040 -296430 35163 81693 -72476 57243 -23657 118575 -182167 71479
11879g9346j05854L0509b3401o0362k09157B1949J12617J1541a57140B17421A7127
$$ -79346 -185200 -154691 -23401 -83763 -292920 21949 134566 146107 -157140 217421 17127
11867a0125A7228R5243a71845f0032j77872B10874b36642J03530d140j56743J3755
$$ -10125 17228 112471 -171845 -60032 -237904 210874 -236642 -133112 -4140 -160883 -147128
11856a47128C87398j91619E8556g5108B3382K21048h4306A6943L45838B6006c25584
$$ -147128 387398 195779 58556 -75108 23382 244430 -84306 16943 362781 26006 -325584
11844c14110A88160A1621a21500A8310h7912j99975e2034k9936d907H8296J4975
$$ -314110 188160 11621 -121500 18310 -87912 -287887 -52034 -81970 -4907 88296 103271
11833A03271g6925j37223l7455i6933I0222h2046j14806P7100F3209N9564l354
$$ 103271 -76925 -214148 -251603 -96933 90222 -82046 -196852 -119752 63209 122773 119419
11822A19419L5735c30822J18287K1279j98714B83724A18583B5053c04200I2357
$$ 119419 155154 -330822 -212535 -191256 -389970 283724 118583 25053 -304200 92357
11811b25973d1740k9613a2541D17665b80592G0276a60149A54419C0993N0637A4191
$$ -225973 -41740 -71353 -12541 417665 -280592 70276 -160149 154419 30993 81630 14191
11799a10248A7604h2159L7802K835B13257r5102l3529k8039Q5953b67890F9211
$$ -110248 17604 -82159 -44357 -41522 213257 118155 84626 56587 142540 -267890 69211
11787e8707b6655p345j37444P9354r814L6586p9861A16714b8428m6490j7133m9361
$$ -58707 -26655 -34000 -171444 -92090 -101904 -65318 -145179 116714 -28428 -74918 -92051 -141412
11775a41412B61872P2649b15795f4936B95456H6966b7675A44875a49596A65670
$$ -141412 261872 334521 -215795 -64936 295456 86966 -27675 144875 -149596 165670
11764b32546a15063n2914m4810K282l22296A69951P5035d9699B46775a59872O5151
$$ -232546 -115063 -167977 -212787 -210505 -532801 169951 244986 -49699 246775 -159872 -94721
11753i4721C6135g2821b2273n4784j523D9698b17333M6225j02844J20827f7086
$$ -94721 36135 -72821 -22273 -77057 -78580 49698 -217333 -171108 -273952 -153125 -67086
11741A02204b15044A06793C1523Q6171d3701p4605R986m1811A7453c6305k36187
$$ 102204 -215044 106793 31523 117694 -43701 -118306 -108320 -150131 17453 -36305 -272492
11730b72492c2542p412c741p0940p1979E3428Q2065d6245A1481L9046R5816c04460
$$ -272492 -32542 -39954 -3741 -74681 -146660 53428 135493 -46245 11481 50527 146343 -304460
11717a50843g0535k4934B01251O4482O4004p8462D3164L39212A74710a26385m2160
$$ -150843 -70535 -95469 201251 265733 329737 251275 43164 382376 174710 -126385 -168545
11706a68545O8637g932B97912f5681D637a7960j38319C1585K27208g6426b8704
$$ -168545 -99908 -7932 297912 -65681 4637 -17960 -156279 31585 258793 -76426 -28704
11694b42543A08107L33576F1273c1450j34933A06468j2204f9910B65941h6938
$$ -242543 108107 441683 61273 -31450 -166383 106468 94264 -69910 265941 -86938
11683B13221i2758A54703a61400C22512a70773k296N3870D7046h8205C13864e2257
$$ 213221 -92758 154703 -161400 322512 -170773 -173069 -119199 47046 -88205 313864 -52257
11671c10539K55b2820A77061a80382A71125a51892A07861b80347d6546j9789B15134
$$ -310539 -310284 -22820 177061 -180382 171125 -151892 107861 -280347 -46546 -66335 215134
11659B7400J90126L9203a65785a1113l1657m7383p2537n4750D35012j62599J8951
$$ 27400 217526 256729 -165785 -11113 -42770 -90153 -162690 -217440 435012 272413 291364
11648B91364a5142k39859d684C04572A03855d825C9521a57608P6749H5121a56939
$$ 291364 -15142 -255001 -4684 304572 103855 -4825 39521 -157608 -80859 85121 -156939
11636A08850L2139c5225B19225J8236j12420g3598k54G0360l720b51655B0757
$$ 108850 140989 -35225 219225 237461 125041 -73598 -73852 70360 66640 -251655 20757
11624B00186I9655f5477A00111b12597A45427N4509n0269a58188j1039d908q182
$$ 200186 99655 -65477 100111 -212597 145427 199936 149667 -158188 -169227 -4908 -13090
11613a3090A34728e4657K4223m9029D25760B3043f8595j5694B21652M6446R2401
$$ -13090 134728 -54657 -30434 -79463 425760 23043 -68595 -84289 221652 268098 360499
11602C60499a41174H9743Q9219c13546c4077B47292a5639k77614j3243A16900
$$ 360499 -141174 89743 178962 -313546 -34077 247292 -15639 -293253 -306496 116900
11591a44453E8648J17347c9469q8881B67054j597a4883B32938F5088M1248Q8592
$$ -144453 58648 175995 -39469 -128350 267054 265457 -14883 232938 65088 106336 194928
11580A94928m9218C6228c9374D5627l921a41421C0319J01649F0807J70554k9036
$$ 194928 145710 36228 -39374 45627 41706 -141421 30319 131968 60807 231361 202325
11569B02325b0996A84971F6367d3250G3866K01884J7556C8083J25770m9977b73972
$$ 202325 -20996 184971 66367 -43250 73866 275750 293306 38083 163853 113876 -273972
11557c19359A86812B2051h2884m4466H6728B1924L219J59757I738b44849i2353
$$ -319359 186812 22051 -82884 -127350 86728 21924 25143 184900 9738 -244849 -92353
11545a61011D90713c27786A70449n9231Q5354F6647L00926a61379d1482C36731
$$ -161011 490713 -327786 170449 111218 196572 66647 367573 -161379 -41482 336731
11534B4400P0005K02369Q2341j76081J75057g9067L2758G2058L27604d2014B45475
$$ 24400 94405 296774 379115 203034 378091 -79067 -46309 72058 399662 -42014 245475
11522A8466J43360o1609L4620a34450I1903e172G1831e0208C504a57296D8173
$$ 18466 161826 100217 134837 -134450 91903 -5172 71831 -50208 3504 -157296 48173
11510a30148B51595c0352E43754a75822b3510G4409b0540E4884d7381B13024P5896
$$ -130148 251595 -30352 543754 -175822 -23510 74409 -20540 54884 -47381 213024 288920
11499B88920j12314p7286P9273J84975j15829A8222O4739J46814a48035A4390
$$ 288920 176606 99320 178593 363568 247739 18222 82961 229775 -148035 14390
11488B61354C5639M9488a63954F692K30212b7668A36966k7834e1748A65422J34433
$$ 261354 35639 85127 -163954 6692 236904 -27668 136966 109132 -51748 165422 299855
11477B99855k1572p892A18738L417J76521p4294a90018L1962A21378m1061a57950
$$ 299855 278283 270391 118738 122155 298676 224382 -190018 -158056 121378 80317 -157950
11465A01109A4420a74143A73756J64522a1741j7447l33620A36234N8226G0562
$$ 101109 14420 -174143 173756 338278 -11741 -29188 -362808 136234 194460 70562
11454A4403K25956p2262n0308b74316D4122J3032e9716F7930i9458A3350J78772
$$ 14403 240359 168097 117789 -274316 44122 57154 -59716 67930 -99458 13350 192122
11443A92122o8145n4238J43312a42993C48396j47192q4662a29464f2186G9760
$$ 192122 123977 69739 213051 -142993 348396 201204 116542 -129464 -62186 79760
11432G3331d2594k07148a12103E0884k893b47376P4200f7462A45595a53332O9062
$$ 73331 -42594 -249742 -112103 50884 47991 -247376 -173176 -67462 145595 -153332 -84270
11421h4270k56216A04155J37987D8855D78K2778R9980A3788b57303e5981l11652
$$ -84270 -340486 104155 242142 48855 478 23256 123236 13788 -257303 -55981 -367633
11410c67633h7033B12867K2929e3865e151q7208A32307J94356A27478a07299k07249
$$ -367633 -87033 212867 235796 -53865 -5151 -92359 132307 326663 127478 -107299 -314548
11399c14548J26190g3354a4497f420n0081a1185k07034B69759j6084I081a99823
$$ -314548 -188358 -73354 -14497 -6420 -56501 -11185 -218219 269759 253675 9081 -199823
11387a39138C1657K19825c26873A88863d1162A52604m7283h4389j55770G529c2938
$$ -139138 31657 251482 -326873 188863 -41162 152604 105321 -84389 -240159 7529 -32938
11375f09B98116a7030A8638f8345B69658g8559A90221a29049a6825j08174C8582
$$ -609 298116 -17030 18638 -68345 269658 -78559 190221 -129049 -16825 -124999 38582
11363E6050J06012a00351H6253a66296c3554k5666J8435B74098m7587q5197b90180
$$ 56050 162062 -100351 86253 -166296 -33554 -59220 -40785 274098 226511 141314 -290180
11351b55323A94064D7047J6697n458L0938J9154C8698J97423G9983b2897j33304
$$ -255323 194064 47047 63744 58286 89224 108378 38698 236121 79983 -22897 -156201
11340a56201E1709h2426C1666P509f5507k59906a52880C2183c5426j55630A61215
$$ -156201 51709 -82426 31666 39175 -65507 -325413 -152880 32183 -35426 -191056 161215
11328a06262A049a32038A49694M9966a29311k7186A35989b19755C07392a7727
$$ -106262 1049 -132038 149694 199660 -129311 -156497 135989 -219755 307392 -17727
11317a62062lF9060N580R0664j4883B5769L42295E4220i642d635j03643a2580
$$ -162062 -162065 69060 74640 165304 150421 25769 368064 54220 -9642 -4635 -108278 -12580
11304a71669I9180D1329O4368c31467A49039O1072b54888B34062j9365I3254a09608
$$ -171669 99180 41329 105697 -331467 149039 210111 -254888 234062 214697 93254 -109608
11292a17862b2290A43867B2008a8845r3227N0080I4981L3176a58009M4787q7793
$$ -117862 -22290 143867 22008 -18845 -112072 -61992 94981 128157 -158009 -113222 -201015
11281b01015a6827j09785N2514B67689b13330b6807p0780M3394E6125i2661B01027
$$ -201015 -16827 -126612 -74098 267689 -213330 -26807 -97587 -54193 56125 -92661 201027
11269A84181j0669B5787J0156d42353a36356L464b4481k1282A27510g2102k37148
$$ 184181 173512 25787 35943 -442353 -136356 -132892 -24481 -45763 127510 -72102 -309250
11258c09250J04321p4051G5315d2950A36059P6833c87520A31644c28614c8384
$$ -309250 -204929 -278980 75315 -42950 136059 212892 -387520 131644 -328614 -38384
11247A28689m6893a43047m0982P4765L4403n4403N7164q0798q0118B8655A1224
$$ 128689 81796 -143047 -184029 -109264 -74861 -129264 -72100 -152898 -233016 28655 11224
11235A82455h2925B49431a31668A04950h8072B52164b02783G1782d7963G0183
$$ 182455 -82925 249431 -131668 104950 -88072 252164 -202783 71782 -47963 70183
11224b70523Q8872N7694O056n5855B6201b5073A49241F4965g5138M09A08631d4467
$$ -270523 -181651 -123957 -117901 -173756 26201 -25073 149241 64965 -75138 -74729 108631 -44467
11211B3692b67788J18238B9051g0333o1694k01404J55346A26102e1387q9239c7034
$$ 23692 -267788 -149550 29051 -70333 -132027 -333431 -178085 126102 -51387 -140626 -37034
11199f4751B36840A09936b0441A16082E1100K80161j4774b75321J04597P6871
$$ -64751 236840 109936 -20441 116082 51100 331261 316487 -275321 -170724 -93853
11189i3853q8183G9871R719j8138L29629c4555A73918B4895f3956B31588d4629
$$ -93853 -182036 79871 89590 71452 401081 -34555 173918 24895 -63956 231588 -44629
11177a51305j6673r7047b3209p744A59357a55613G10i7872M1581G4335C1461j1976
$$ -151305 -167978 -265025 -23209 -30953 159357 -155613 710 -97872 -56291 74335 31461 19485
11165A9485K2181a14741N4420B97133a45193F8935g5236c6743j83535R9297n1720
$$ 19485 41666 -114741 -60321 297133 -145193 68935 -75236 -36743 -220278 -120981 -172701
11154a72701D8700b74206B7631i9219A4540b14877A03110B5433a14047j82328
$$ -172701 48700 -274206 27631 -99219 14540 -214877 103110 25433 -114047 -296375
11144b96375l7464d095m20866a24918A26564a60737A04439a418G3508c91763a57275
$$ -296375 -333839 -4095 -424961 -124918 126564 -160737 104439 -1418 73508 -391763 -157275
11132A43868k1825J21286l071E1446O9486E78L07770a76520C54181A40225A7583
$$ 143868 122043 243329 240258 51446 120932 578 308348 -176520 354181 140225 17583
11120b84033A2404h6341k67326I5851L826F699J13127j8969b41055B01116K83806
$$ -284033 12404 -86341 -353667 95851 99677 6699 119826 100857 -241055 201116 484922
11109D84922A25002K5117a90168c8044A55402A1737J47351C9046Q9578K2690c4645
$$ 484922 125002 150119 -190168 -38044 155402 11737 159088 39046 128624 151314 -34645
11097B9257K12562m6300g2794B82937p4335D7560M03643p2939i803H1117h38j30786
$$ 29257 241819 195519 -72794 282937 208602 47560 451203 378264 -9803 81117 -838 -131624
11085a31624E60169b9732B7168J08309J22549n8699K6530F3937J27403r2547K16786
$$ -131624 560169 -29732 27168 135477 258026 199327 225857 63937 191340 98793 315579
11074C15579j28504L45073k43502g2675C64560n366a0238C10077J63742L7384
$$ 315579 187075 532148 288646 -72675 364560 359194 -10238 310077 473819 511203
11064E11203J39083B26348M1293q1172R2808J55969k9988K56153j94843J47948
$$ 511203 650286 226348 267641 186469 279277 435246 405258 661411 466568 614516
11054F14516K27659k32878j12016J80403k12013L9590L2112J59460k79708N83075
$$ 614516 842175 609297 497281 677684 465671 505261 537373 696833 417125 1000200
11044A000200k46652p9273j99889J56697Q0890J76420l88217j55331L50891k57039
$$ 1000200 753548 674275 474386 631083 711973 888393 500176 344845 695736 438697
11034D38697N33259D33608K96988m8420p9261j12423K13061k73805L00688K50501
$$ 438697 971956 433608 730596 682176 602915 490492 703553 429748 730436 980937
11024I80937m38655N2161J21728k58919j69683L49336k54089L77055k54364m8676
$$ 980937 542282 594443 716171 457252 287569 636905 382816 759871 505507 456831
11014D56831J75120k17988L26906j36243N3138m9036l2965j55435A29672L64009
$$ 456831 631951 413963 740869 604626 657764 608728 575763 420328 129672 493681
11004D93681l0437A98227N58178A42083L40596j71552J65975n4991J25638j48328
$$ 493681 463244 198227 756405 142083 482679 311127 477102 422111 547749 399421
10994C99421K61001j61731J39673C02770L57302R179R3573r7965j06742M16683
$$ 399421 660422 498691 638364 302770 660072 669251 762824 664859 558117 974800
10984I74800k79254j01027L07359J09704k39389J31538K93081J90278K34672r500
$$ 974800 695546 594519 901878 1011582 772193 903731 1196812 1387090 1621762 1612262
10974A612262L61829J0254M42875N1221k58637O9718j53859o9734J2220l24870
$$ 1612262 1974091 1984345 2427220 2478441 2219804 2289522 2135663 2065929 2078149 1753279
10964A753279j64224M2965j29556j45816L50683k66937J92795j6791k92490J94977
$$ 1753279 1589055 1632020 1502464 1356648 1707331 1440394 1633189 1616398 1323908 1518885
10954A518885q7773j50898l95687J07357l0569j64244k63703K244l9406A93384
$$ 1518885 1431112 1280214 884527 991884 961315 797071 533368 535612 496206 193384
10943B20003E4385R6869J67479j10944J5650O6778j23a1563B20965G4278a09790
$$ 220003 54385 151254 318733 207789 223439 290217 290094 -11563 220965 74278 -109790
10931E07853A15288D0865K76466p7108k4499a30707l5444D5714Q5073K55798b93071
$$ 507853 115288 40865 317331 240223 215724 -130707 -166151 45714 130787 386585 -293071
10919a47987H6349c4733m9119c8321k12811B76667c5981l10107A46570l3287i7474
$$ -147987 86349 -34733 -83852 -38321 -251132 276667 -35981 -346088 146570 113283 -97474
10907a62690I9168a88390A56784J99025c39155A49063i0119B9970K25075r2105
$$ -162690 99168 -188390 156784 355809 -339155 149063 -90119 29970 255045 162940
10897A62940a8757q5490I4809P4176G533O0986a50450I9259a70887c9429G724
$$ 162940 -18757 -104247 94809 168985 7533 68519 -150450 99259 -170887 -39429 7724
10885A19164i31A32215e4264J7504A43402D5155b50160B72258p4656C0776b5044
$$ 119164 -931 132215 -54264 -36760 143402 45155 -250160 272258 197602 30776 -25044
10873A56129a84270o183g0736B55129f9949j60377H2096J97243d0991k8874Q938
$$ 156129 -184270 -190453 -70736 255129 -69949 -230326 82096 279339 -40991 -69865 -60927
10862f0927A56825j2621O329C526a02247B6269P7373F393b254m6023C02224j46717
$$ -60927 156825 144204 150533 3526 -102247 26269 103642 6393 -2254 -48277 302224 155507
10850A55507M2769a95559C48363A37253E0113a22634A44406b805I2098i1334a5056
$$ 155507 198276 -195559 348363 137253 50113 -122634 144406 -2805 92098 -91334 -15056
10838F0024K84739A61661O3252G4806b23450J02718B39776B1736i3867r742A38152
$$ 60024 344763 161661 224913 74806 -223450 -120732 239776 21736 -93867 -103609 138152
10826e8917B25272a33665B15084d2360j62723A1740h245B19168a69003A12274
$$ -58917 225272 -133665 215084 -42360 -205083 11740 -8245 219168 -169003 112274
10815b33883K8314G424J27600L8993c50555g3765l19132a93466a0596A0747b72412
$$ -233883 -205569 7424 135024 174017 -350555 -73765 -392897 -193466 -10596 10747 -272412
10803a52131I2410a82605r569P2045e0843B23225b8660n2352B44382a35949o8239
$$ -152131 92410 -182605 -192174 -120129 -50843 223225 -28660 -81012 244382 -135949 -204188
10792b04188b2733A5017i4622B79047b8815C88783a12027l3894e7351k13684a24898
$$ -204188 -22733 15017 -94622 279047 -28815 388783 -112027 -145921 -57351 -271035 -124898
10780C6346d5419p7735j22976m6183A52550r306b19840J3927N3472g1691j68496
$$ 36346 -45419 -123154 -246130 -292313 152550 143244 -219840 -205913 -152441 -71691 -240187
10769b40187J15724B12056N7745a01442C92771B220J11012a83364q8702B2855
$$ -240187 -124463 212056 269801 -101442 392771 2220 113232 -183364 -272066 22855
10758d66546e1308B8395b72010E9726H51M7637d9771m0640A41391J8995A6393
$$ -466546 -51308 28395 -272010 59726 851 48488 -49771 -90411 141391 160386 16393
10746D55543i086G1754J2151d46935a3466A80955a89498b1443J830C10264a84407
$$ 455543 -9086 71754 83905 -446935 -13466 180955 -189498 -21443 -19613 310264 -184407
10734b8391A25963b71075F5100N5592f9739p0365H474c1334k1073l1761E2357
$$ -28391 125963 -271075 65100 120692 -69739 -140104 8474 -31334 -52407 -84168 52357
10722A53995b71898N8891J04824e581B44785d4484I8789e08750a50113A48275
$$ 153995 -271898 -213007 -108183 -5581 244785 -44484 98789 -508750 -150113 148275
10711A24748E8891K0136a9664B37552r3095d64603c5590a4274q4941Q062E1978
$$ 124748 58891 79027 -19664 237552 144457 -464603 -35590 -14274 -99215 -91153 51978
10699a55597J1915f7668G3479i8305B99928j05600a42584D0644d02813J11324
$$ -155597 -143682 -67668 73479 -98305 299928 194328 -142584 40644 -402813 -291489
10689b91489g2039k04153f7697B08123R0629F5155b18978G6116j4912M3297a24812
$$ -291489 -72039 -276192 -67697 208123 298752 65155 -218978 76116 61204 104501 -124812
10677a62584P5136j12192p0983e2687j26331A29794J09052C2929b22830J00371
$$ -162584 -87448 -199640 -270623 -52687 -179018 129794 238846 32929 -222830 -122459
10667a22459d3798j68594A23907a04617A30014P7693D6433b7457k26894A84569
$$ -122459 -43798 -212392 123907 -104617 130014 207707 46433 -27457 -254351 184569
10656c8812A61373O9162I0953a13868N1370q0197c4764C2887k820j3049b4275
$$ -38812 161373 230535 90953 -113868 -62498 -142695 -34764 32887 30067 17018 -24275
10644c13848A03292B8865b98445Q4368j584b5694k10338k04570E2558a48789h121
$$ -313848 103292 28865 -298445 -214077 -215661 -25694 -236032 -440602 52558 -148789 -8121
10632e8190a0170A7082a34771j26009A01933a69117I2965d6663H1138e07963a14881
$$ -58190 -10170 17082 -134771 -260780 101933 -169117 92965 -46663 81138 -507963 -114881
10620c9808q481A39374B6917O6629J02777b58084a15528A42124E8297c86060h7744
$$ -39808 -48289 139374 26917 93546 196323 -258084 -115528 142124 58297 -386060 -87744
10608b40102q4990O7725A16275a3658m16965J48910B07128h6415k899N763j86673
$$ -240102 -325092 -257367 116275 -13658 -430623 -281713 207128 -86415 -89314 -83551 -270224
10597b70224A63090b28846J12057B37848D5855c41886I0569r423J09136o3100
$$ -270224 163090 -228846 -116789 237848 45855 -341886 90569 81146 190282 127182
10587A27182b02856A60819a88553B4903d9268k781D15199D0896L30681A0841h2707
$$ 127182 -202856 160819 -188553 24903 -49268 -52049 415199 40896 371577 10841 -82707
10575f7916A27841c22942J18212B87325r8608D2293A4587g2123I305c03945L5689
$$ -67916 127841 -322942 -204730 287325 188717 42293 14587 -72123 9305 -303945 -268256
10564b68256J04522M5014A97669g0155j43501B01220E5907D980b59989C46374
$$ -268256 -163734 -118720 197669 -70155 -213656 201220 55907 4980 -259989 346374
10553c19971b1170n809j2538j19920A31302a44836d6449j34069K8269A50795E7279
$$ -319971 -21170 -26979 -39517 -159437 131302 -144836 -46449 -180518 -152249 150795 57279
10541d3939k7844j17569B00706a19256E5579O2314J2819P642f2819I1801d6108
$$ -43939 -71783 -189352 200706 -119256 55579 117893 130712 138354 -62819 91801 -46108
10529b48675O5913A29876C955J29617a71036h3285F568i9883A83055d3321q6153
$$ -248675 -182762 129876 3955 133572 -171036 -83285 6568 -99883 183055 -43321 -129474
10518a29474l33A75527H1040J2174N0464c59825H340a25662A02143J22113b4709
$$ -129474 -129807 175527 81040 93214 143678 -359825 8340 -125662 102143 224256 -24709
10506C0935L327a93823P9364H2814H768J68374n1652L24389b88531b8891r2913
$$ 30935 34262 -193823 -114459 82814 8768 177142 125490 449879 -288531 -28891 -121804
10495a21804l2215M6002b1705C0740a99879J2089a1711k19365j12078P3938B01576
$$ -121804 -154019 -108017 -21705 30740 -199879 -187790 -11711 -231076 -343154 -269216 201576
10483A88196F0205K88282F9344M05093k7175p1985j05474G5972a57118o8918a09405
$$ 188196 60205 348487 69344 474437 447262 375277 269803 75972 -157118 -226036 -109405
10471E5073K15434a10535c0746j0681C4891J07369M7849a12521B27849a17374
$$ 55073 270507 -110535 -30746 -41427 34891 142260 190109 -112521 227849 -117374
10460A85468a55152A60233F4041J88700a94764C1190K23676q962q9350D7628f2006
$$ 185468 -155152 160233 64041 252741 -194764 31190 254866 245904 156554 47628 -62006
10448a23298B02314A3585h9870j24766L0751P9217j24681B59379a99132I0936
$$ -123298 202314 13585 -89870 -214636 -183885 -104668 -229349 259379 -199132 90936
10437A50469a16368D2721b16884f1215A09487J64097B3835b2063B6650O6675K09370
$$ 150469 -116368 42721 -216884 -61215 109487 273584 23835 -22063 26650 93325 302695
10426C02695j22657f6465l5385K8631n1965k09153P070C36810D4872L4411p650
$$ 302695 180038 -66465 -101850 -73219 -125184 -334337 -327267 336810 44872 79283 71633
10415G1633K4509a19185K7704F011a49323A84733D2527b11376A39105E8156d9110
$$ 71633 96142 -119185 -91481 6011 -149323 184733 42527 -211376 139105 58156 -49110
10403c98083B4519d98884b2383k02714J08344L7258C12656a87886A08481J79663
$$ -398083 24519 -498884 -22383 -225097 -116753 -79495 312656 -187886 108481 288144
10393B88144q9C6575O9116D7538A4657R0849a18766r8990A5667J8435J2164J76760
$$ 288144 288055 36575 105691 47538 14657 105506 -118766 -217756 15667 34102 46266 223026
10381B23026J37941A48418b11604A64588N5626J16181m8813m8738G1268N4649
$$ 223026 360967 148418 -211604 164588 220214 336395 287582 238844 71268 125917
10371A25917E5021O0258J11873I5526L73770O856l6425r5083B4242K07895A2536
$$ 125917 55021 115279 227152 95526 469296 476152 439727 344644 24242 232137 12536
10359E01302A70117g8577A24992M0356K11424A45460J46072k0045J51601j43007
$$ 501302 170117 -78577 124992 165348 376772 145460 291532 271487 423088 280081
10349B80081A09749K91381l1989r2245J4386i645A71734L73334k19929o4536e127
$$ 280081 109749 401130 369141 276896 291282 -9645 171734 545068 325139 260603 -5127
10337D05773d6858A0498K5179K18353b8975j4505A55619n7775L3444a03483A49763
$$ 405773 -46858 10498 35677 254030 -28975 -43480 155619 97844 131288 -103483 149763
10325G5233K24795F0313L3581K77898Q0940j96230k3166H7286K10196j36093h6438
$$ 75233 300028 60313 93894 371792 452732 256502 233336 87286 297482 161389 -86438
10313G12K91787a05052b4319k22115M6056R8247a0327j14629q2726l7437B53450
$$ 712 292499 -105052 -24319 -246434 -200378 -102131 -10327 -124956 -207682 -245119 253450
10301H9428b69397Q8047A27097n1157a35322b8484D7157j3746a31608H8995K09997
$$ 89428 -269397 -181350 127097 75940 -135322 -28484 47157 33411 -131608 88995 298992
10290B98992b39314C8312K9772O1012a50980A92137g3083o8048A96425k4159J1354
$$ 298992 -239314 38312 68084 129096 -150980 192137 -73083 -141131 196425 172266 183620
10279A83620B5592e4228A45277m1842b20734A42655a18265B18494e0810D0191
$$ 183620 25592 -54228 145277 103435 -220734 142655 -118265 218494 -50810 40191
10268A19799l1233i4918I5803o269Q4818B1133J05996N0046N1080J82901k7547
$$ 119799 88566 -94918 95803 89534 174352 21133 127129 177175 228255 411156 383609
10257C83609F4291J20949j4454M9872p3353C6164a29452C60349a15805I1344Q4707
$$ 383609 64291 185240 170786 220658 147305 36164 -129452 360349 -115805 91344 176051
10246A76051d3723A85674a63953g1188A18358f6558k68133C96096a26186I6738
$$ 176051 -43723 185674 -163953 -71188 118358 -66558 -334691 396096 -126186 96738
10235a58051k9674j57000l1502A2394i6626J2572L969m4144d5B85265p7161A0389
$$ -158051 -187725 -344725 -376227 12394 -96626 -84054 -80085 -124229 -45 285265 208104 10389
10222b37135c3829j3128C20169b72048G0262k7477b05246A04773c2211j19183
$$ -237135 -33829 -46957 320169 -272048 70262 42785 -205246 104773 -32211 -151394
10212a51394A61713I539e74E8986g6273p1108o2875c6774E2199c651j58749n4467
$$ -151394 161713 9539 -574 58986 -76273 -147381 -210256 -36774 52199 -3651 -162400 -216867
10200b16867j6966i2479B0915J8695a08818G1392R4659k1002d9543k8678q8639
$$ -216867 -233833 -92479 20915 39610 -108818 71392 166051 145049 -49543 -78221 -166860
10189a66860c0350I749b7997P852A80066F821R5429b84962A6185h3283k1950p3679
$$ -166860 -30350 9749 -27997 -20145 180066 6821 102250 -284962 16185 -83283 -105233 -178912
10177a78912A85574B239e26745C3156J06005A2388P5324a7943q4827B25000c05459
$$ -178912 185574 2239 -526745 33156 139161 12388 87712 -17943 -102770 225000 -305459
10165c5191k31992A00252C206a17821j9172A61607O9400i2857b1972j92478q1327
$$ -35191 -267183 100252 3206 -117821 -136993 161607 231007 -92857 -21972 -214450 -295777
10154b95777J17970M6978A30428M6790c0221k68447p1994a41064C56722A09614
$$ -295777 -177807 -130829 130428 177218 -30221 -298668 -370662 -141064 356722 109614
10143b80923b949B53411a73085n2422B71694f8467o5206k65784A25309a98745
$$ -280923 -2949 253411 -173085 -225507 271694 -68467 -133673 -399457 125309 -198745
10132a76261q5945O0324O8880A95582h1273A83174J04505e0861B42131e2195D4052
$$ -176261 -262206 -201882 -133002 195582 -81273 183174 287679 -50861 242131 -52195 44052
10120A07790b70389f3225m10432J81545g4160l01328D92283a26471O2517p0869
$$ 107790 -270389 -63225 -473657 -292112 -74160 -375488 492283 -126471 -63954 -134823
10110a34823a9567B18985e04404d3072j75164d7955B01965i9248F2354A5287J91043
$$ -134823 -19567 218985 -504404 -43072 -218236 -47955 201965 -99248 62354 15287 206330
10099B06330G8033b57728J2249A10694B4974f8195L0319B46310H3391b25262r4099
$$ 206330 78033 -257728 -245479 110694 24974 -68195 -37876 246310 83391 -225262 -319361
10088c19361a17336A26320b4522F5266k9524b06377d9535D7130a76367F9348J2804
$$ -319361 -117336 126320 -24522 65266 35742 -206377 -49535 47130 -176367 69348 82152
10077H2152P2023J10342i1657A40908a2462d682j9804n6889p3615j3809K5292
$$ 82152 154175 264517 -91657 140908 -12462 -4682 -24486 -81375 -154990 -168799 -143507
10066a43507k08532A21380f1381F7832j2815a19676D011J43876a40392J9451d3352
$$ -143507 -352039 121380 -61381 67832 55017 -119676 4011 147887 -140392 -120941 -43352
10054a74806D2324a12164A6330a77289A92791D0771a84337k07063B93413D0010
$$ -174806 42324 -112164 16330 -177289 192791 40771 -184337 -391400 293413 40010
10043A32085a28072a5673E1603c6992k87599A48773c32535F4699d56434D8457
$$ 132085 -128072 -15673 51603 -36992 -324591 148773 -332535 64699 -456434 48457
10032c95411a9559B8674g5165J9862j96439J11600f7260G4939b25907f4518A88478
$$ -395411 -19559 28674 -75165 -55303 -251742 -140142 -67260 74939 -225907 -64518 188478
10020c03940b5321A89761m8903B369c71483a42778j04005n4474D4323g2299D9315
$$ -303940 -25321 189761 140858 2369 -371483 -142778 -246783 -301257 44323 -72299 49315
10008E9328A2483Q5635c807A05488M5994A0362b72203O4623I5360K2538a17654
$$ 59328 12483 98118 -3807 105488 151482 10362 -272203 -207580 95360 117898 -117654
9996A82374b58903n2395A84442c5859l911j57285i4707j29506B23106a89384A22239
$$ 182374 -258903 -311298 184442 -35859 -39770 -197055 -94707 -224213 223106 -189384 122239
9984a53845D0542b85177K7324l2985B29854i5354b2952j71792j59398k9946A6413
$$ -153845 40542 -285177 -257853 -290838 229854 -95354 -22952 -194744 -354142 -384088 16413
9972b50237J1283r3977J34781j54848h4581k0848c6453B88243b97545B76962j35925
$$ -250237 -238954 -332931 -198150 -352998 -84581 -105429 -36453 288243 -297545 276962 141037
9961A41037b09804M8338D6878c29751h9364k1558r3185m1455m930L5280d9703
$$ 141037 -209804 -161466 46878 -329751 -89364 -110922 -204107 -245562 -250492 -215212 -49703
9949D1421a09138B3025a87882q2757g1425b3581C35045a97159j52186P0185R9725
$$ 41421 -109138 23025 -187882 -270639 -71425 -23581 335045 -197159 -349345 -279160 -179435
9938a79435B1989M6301P647b90970h3274C9305a41725E9315d34135b1170H5220
$$ -179435 21989 68290 75937 -290970 -83274 39305 -141725 59315 -434135 -21170 85220
9926i5611D182b0522I5235d12142a19524A38113b79648A9963b19684C0257c9593
$$ -95611 4182 -20522 95235 -412142 -119524 138113 -279648 19963 -219684 30257 -39593
9914h0907r7540B48413a75345j9588h0029B21629r2556c23600G2463b97046c6485
$$ -80907 -178447 248413 -175345 -194933 -80029 221629 129073 -323600 72463 -297046 -36485
9902h4304m1129A45028b13382f5916A56900c51217E3963a5533k99698J41588O8114
$$ -84304 -125433 145028 -213382 -65916 156900 -351217 53963 -15533 -315231 -173643 -105529
9891a05529q2919A28216b48066f2163p0396d5968E5186J5971c83572c048n2728
$$ -105529 -188448 128216 -248066 -62163 -132559 -45968 55186 71157 -383572 -3048 -55776
9880e5776l117J0901I9438j9793k6393b14173I2248D453J18726b2164j23890B60989
$$ -55776 -58893 -47992 99438 79645 53252 -214173 92248 4453 123179 -22164 -146054 260989
9867b0620n5401m4564F2929a8444j32472I8335f8839N269A1891J62887k2231c0331
$$ -20620 -76021 -120585 62929 -18444 -150916 98335 -68839 -63570 11891 174778 152547 -30331
9854A56926a44504O159p9139P1330C4034c30590d3793j16911b1480l28923a9145
$$ 156926 -144504 -138345 -217484 -146154 34034 -330590 -43793 -160704 -21480 -350403 -19145
9842a5674j48606c6391q1533B39900a58658A2557J63903a05649j23977J6560i3256
$$ -15674 -164280 -36391 -117924 239900 -158658 12557 176460 -105649 -229626 -213066 -93256
9830B44546F0838b06603j9016O8593A27303g8298j80622P6690j28392A37330a9903
$$ 244546 60838 -206603 -225619 -157026 127303 -78298 -258920 -182230 -310622 137330 -19903
9818i3038j23892P8225o9092N9157a5551j01145J3301A5243b5705k19802R5464
$$ -93038 -216930 -138705 -207797 -148640 -15551 -116696 -103395 15243 -25705 -245507 -150043
9807a50043e041j36743n0309D1146c0414l557j3492l0865r9526P6939j9733j5242
$$ -150043 -5041 -141784 -192093 41146 -30414 -33971 -47463 -78328 -177854 -100915 -120648 -135890
9795a35890f7400j03871d2102A84856a78278H564J04650a31210G8496j4277a85419
$$ -135890 -67400 -171271 -42102 184856 -178278 8564 113214 -131210 78496 64219 -185419
9783H8752L9634b87169G4618a06034G0582l4641b3144A24608K05925i2040H4452
$$ 88752 128386 -287169 74618 -106034 70582 35941 -23144 124608 330533 -92040 84452
9771a19429o410l36637D2135A2277b8267B35346I7675N7997b35592J09753k62602
$$ -119429 -125839 -462476 42135 12277 -28267 235346 97675 155672 -235592 -125839 -388441
9760c88441a46788j54327f9659j19822o678K4225K154a2582q8213k78086C787
$$ -388441 -146788 -301115 -69659 -189481 -196159 -171934 -169780 -12582 -100795 -378881 3787
9748b04566C5835K751J3229c30107d4950A61034g2692B58440c72616d4899j25220
$$ -204566 35835 38586 51815 -330107 -44950 161034 -72692 258440 -372616 -44899 -170119
9737a70119N1956A12093b3633D0391a13759k46857A32208d70045C8771g7907j49202
$$ -170119 -118163 112093 -23633 40391 -113759 -360616 132208 -470045 38771 -77907 -227109
9726b27109J04846e8372A44159c70927B3657a12256r7164B3214e9109j84542h9631
$$ -227109 -122263 -58372 144159 -370927 23657 -112256 -209420 23214 -59109 -243651 -89631
9714c3360j75662A78040d3987l984k71236a216A50797b40148J18553B7990b39367
$$ -33360 -209022 178040 -43987 -47971 -319207 -1216 150797 -240148 -121595 27990 -239367
9702b83791a15244Q810K5995a3358A13825g6123k71993a54603l4810L8078F460
$$ -283791 -115244 -106434 -80439 -13358 113825 -76123 -348116 -154603 -189413 -151335 6460
9690H0772c4793A38781a84937A05475i5068k85235B24946c69565a56067E1452
$$ 80772 -34793 138781 -184937 105475 -95068 -380303 224946 -369565 -156067 51452
9679c6146G0627j3642a13755d8735B1731R0241e128j45270O934o1964I7259c9167
$$ -36146 70627 56985 -113755 -48735 21731 111972 -5128 -150398 -143464 -205428 97259 -39167
9666h8369k7120D41574A1506f6419j99847J25414k92880e0060k4297j62342K9580
$$ -88369 -115489 441574 11506 -66419 -266266 -140852 -433732 -50060 -74357 -236699 -207119
9655b07119l1828C161d3189n0329F8486J37399f9378D3355O5721B9834b6190l07540
$$ -207119 -238947 3161 -43189 -93518 68486 205885 -69378 43355 109076 29834 -26190 -333730
9643c33730a39850m25224A75370c30552A98445b34615i639l53179J3199G4430
$$ -333730 -139850 -565074 175370 -330552 198445 -234615 -9639 -362818 -349619 74430
9632A67849b6411j76683h0343a0142l57270f1134k59030g2320A63038g121l3790
$$ 167849 -26411 -203094 -80343 -10142 -367412 -61134 -320164 -72320 163038 -7121 -40911
9621d0911j21726f9030K3437A2625J17556b9688B6605h7509h827A18327b59705
$$ -40911 -162637 -69030 -45593 12625 130181 -29688 26605 -87509 -8827 118327 -259705
9609a66118A44329M943F1747B7885R0044c53455K5489A20392N8259a33088C20803
$$ -166118 144329 149272 61747 27885 117929 -353455 -327966 120392 178651 -133088 320803
9597b62013o5115K9903a22639A99105G3249c47000C75025j59882d47638G2190
$$ -262013 -327128 -297225 -122639 199105 73249 -347000 375025 215143 -447638 72190
9586a2979m7719D1264K9181K2980b20470f3358p7459M5558j07537N0063j19515
$$ -12979 -60698 41264 70445 93425 -220470 -63358 -140817 -95259 -202796 -152733 -272248
9575b72248C1263b58855c5137A46460c29793A64817b0025j21797k79943h4024
$$ -272248 31263 -258855 -35137 146460 -329793 164817 -20025 -141822 -421765 -84024
9564a73579B24664b29379j8248I2473b94125F1173c46667a47249G5858l3652a64960
$$ -173579 224664 -229379 -247627 92473 -294125 61173 -346667 -147249 75858 42206 -164960
9552C55719A21305L6705G2005B5027J3574a15388B24636B3078K28308g5674j77932
$$ 355719 121305 158010 72005 25027 38601 -115388 224636 23078 251386 -75674 -253606
9541b53606P3862j3604B80845j8472L04C6459K99355a53016A7273c9696E1581
$$ -253606 -179744 -193348 280845 262373 262677 36459 335814 -153016 17273 -39696 51581
9529A43066D7078J29043a12681k0878B83164d8744l61949A14213a66898B38740
$$ 143066 47078 176121 -112681 -133559 283164 -48744 -410693 114213 -166898 238740
9518c94035C1987b75821g5804j26266G2803b33688i9523L9582j46994A18037h0990
$$ -394035 31987 -275821 -75804 -202070 72803 -233688 -99523 -59941 -206935 118037 -80990
9506a28283A1300J6062L27057H0405a29775q4992J06107j49697B9723A3735b93181
$$ -128283 11300 27362 354419 80405 -129775 -214767 -108660 -258357 29723 13735 -293181
9494a16158D9919g930l2830H1786c64576C9568a62128d3835l34416a34382a6523
$$ -116158 49919 -7930 -40760 81786 -364576 39568 -162128 -43835 -378251 -134382 -16523
9482F2596J0425f0497a6759j95930D2340b73344g0898k4121l5147L9561b3002
$$ 62596 73021 -60497 -16759 -212689 42340 -273344 -70898 -95019 -130166 -90605 -23002
9470a79219B06441b70107i8698j82164E717J75379a87634P1441A89907a86276
$$ -179219 206441 -270107 -98698 -280862 5717 181096 -187634 -116193 189907 -186276
9459c13474C622N808J41457K37721b84769i5785j22859a5430A09102d4916j72933
$$ -313474 3622 9430 150887 388608 -284769 -95785 -218644 -15430 109102 -44916 -217849
9448b17849j56716q2657C3043a45915A4620e2699q6666j30702B54408a57731q1984
$$ -217849 -374565 -457222 33043 -145915 14620 -52699 -139365 -270067 254408 -157731 -239715
9437b39715B53468g4741c008j28505j47039a05875p5782L7365H4197B1096b58977
$$ -239715 253468 -74741 -3008 -131513 -278552 -105875 -181657 -144292 84197 21096 -258977
9425A65316b80539j39710a69313B87713a8128k56351Q4777a1323k68704l1742
$$ 165316 -280539 -420249 -169313 287713 -18128 -274479 -189702 -11323 -280027 -311769
9415c11769A607a05745C3073b70403A14162b06426C57577a20674l438B73389b91008
$$ -311769 1607 -105745 33073 -270403 114162 -206426 357577 -120674 -124112 273389 -291008
9403b84340j39725f9327j16189A53293a16305k6470B82101a70288B61787a46222
$$ -284340 -424065 -69327 -185516 153293 -116305 -142775 282101 -170288 261787 -146222
9392e7930J3601j96547b8348k25504D7541p183a38482A32690a81661N4732E9325
$$ -57930 -44329 -240876 -28348 -253852 47541 40358 -138482 132690 -181661 -126929 59325
9380A30129a22698l8929B83700j13337b74961d2656B66167a15119J6264M5954
$$ 130129 -122698 -161627 283700 170363 -274961 -42656 266167 -115119 -98855 -52901
9370e2901B94956A3809g7222B9698b87311n2273b7758B45916i1964j10915l0898
$$ -52901 294956 13809 -77222 29698 -287311 -339584 -27758 245916 -91964 -202879 -233777
9359b33777C01856G9843b03818D1046i3030E3302f2290A8M6359L7941g4406A32630
$$ -233777 301856 79843 -203818 41046 -93030 53302 -62290 18 46377 84318 -74406 132630
9346a90499C6254b52394a13614B09266a12847E219a04431m3532B33782c1275r1841
$$ -190499 36254 -252394 -113614 209266 -112847 5219 -104431 -147963 233782 -31275 -123116
9335a23116A36574B3469c07695D5444J43886b42017C3841b21990C6112c52370
$$ -123116 136574 23469 -307695 45444 189330 -242017 33841 -221990 36112 -352370
9324a86500e9673k41279M2629N7631D50194a81409D2507g1378b4931B427a30822
$$ -186500 -59673 -300952 -258323 -200692 450194 -181409 42507 -71378 -24931 2427 -130822
9312b08186I8967O110O166a63988M7991A21554b64927c4111C000c51905F6336
$$ -208186 98967 105077 111243 -163988 -115997 121554 -264927 -34111 3000 -351905 66336
9300A01284k209l951Q4354b85617c970F4699a1126r7003B82370j08380a93114
$$ 101284 99075 95124 179478 -285617 -3970 64699 -11126 -108129 282370 173990 -193114
9288H0466J592b49657n2317A81090a13770D74818b07352K7441c8367p6631J058
$$ 80466 82058 -249657 -301974 181090 -113770 474818 -207352 -179911 -38367 -114998 -113940
9277a13940M5199k24843H5863P235f2588q1282f6080C0547b20392K5052R843Q8484
$$ -113940 -68741 -293584 85863 93098 -62588 -143870 -66080 30547 -220392 -195340 -185497 -97013
9265i7013l113b2813q1444k7569M9250a2598j49947A27413J20634a13198l3210
$$ -97013 -100126 -22813 -104257 -131826 -82576 -12598 -162545 127413 248047 -113198 -146408
9254a46408r7163N5239D4663a60557J6355H8998e7252k5432k6867a2763A23675
$$ -146408 -243571 -188332 44663 -160557 -144202 88998 -57252 -82684 -109551 -12763 123675
9242b2547k59856d602p1143D59427A83307b90211R6467L9184e8839B5544b6260
$$ -22547 -282403 -4602 -75745 459427 183307 -290211 -193744 -154560 -58839 25544 -26260
9230A01034a17657A1325J65516J7771K7752e5893F5842J99387f73581g1830l68243
$$ 101034 -117657 11325 176841 194612 222364 -55893 65842 265229 -673581 -71830 -440073
9219d40073G06C34J21098K3673b55433j377e1162B99647a43107A69149e3609C50095
$$ -440073 706 334 121432 145105 -255433 -256810 -51162 299647 -143107 169149 -53609 350095
9206d41039a00342A83448a14231j3538B67087j11989d9239C6639d0403A28390
$$ -441039 -100342 183448 -114231 -127769 267087 155098 -49239 36639 -40403 128390
9195G9334e5452A492M7878a33785k44530I4904b32892a5775m2153j90244i8431
$$ 79334 -55452 1492 49370 -133785 -378315 94904 -232892 -15775 -57928 -248172 -98431
9183h8179A32127J9856J43725f2737Q622a7365H4698J85901D9856a60950M4333
$$ -88179 132127 151983 295708 -62737 -54115 -17365 84698 270599 49856 -160950 -116617
9172a16617B0320J20969b43364n1501H8142c0032j3205A6408a40742E0262c0321
$$ -116617 20320 141289 -243364 -294865 88142 -30032 -43237 16408 -140742 50262 -30321
9160A22879a1603j64432D9271k963A1696O7578a44744E397J01328b33387j93430
$$ 122879 -11603 -176035 49271 46308 11696 79274 -144744 5397 106725 -233387 -426817
9149d26817A25250b2889j81315D2716J66125c33189a11144k06537A63197a44624
$$ -426817 125250 -22889 -204204 42716 208841 -333189 -111144 -317681 163197 -144624
9138A45072a37667o3048B79223b5393j45068h2130j75052P7318r416A4020c2677
$$ 145072 -137667 -200715 279223 -25393 -170461 -82130 -257182 -179864 -189280 14020 -32677
9126a51531P872A32258E134a10759k04638J11212h8597o1259A14664g8277m5001
$$ -151531 -143659 132258 5134 -110759 -315397 -204185 -88597 -149856 114664 -78277 -123278
9115a23278l34650a03081b4097A30863d3240M1n2925J5885q943j08635k11933
$$ -123278 -457928 -103081 -24097 130863 -43240 -43199 -96124 -80239 -89182 -197817 -409750
9104d09750a27241A50416f9127A74984b52970Q1701c3066l4172m05973a41186
$$ -409750 -127241 150416 -69127 174984 -252970 -171269 -33066 -67238 -473211 -141186
9093F9566h6661a6290G8091a39721E6260a51991f611l0805k25513I1922b83543
$$ 69566 -86661 -16290 78091 -139721 56260 -151991 -6611 -37416 -262929 91922 -283543
9081c35650B5596e5055k3915H3846f1386j64041A16050B9337a60239A94632g2112
$$ -335650 25596 -55055 -78970 83846 -61386 -225427 116050 29337 -160239 194632 -72112
9069d5263p1102B76706A38028j6874a87979K1896j37655l4715R5181J18743j40012
$$ -45263 -116365 276706 138028 121154 -187979 -166083 -303738 -338453 -243272 -124529 -264541
9058b64541n2710g7862B2924J45215b56793A20567b2350k1087l48321a0935D9893
$$ -264541 -317251 -77862 22924 168139 -256793 120567 -22350 -43437 -391758 -10935 49893
9046C8729e8488a2520j04805n5738M0849n2258F0327a41767B34016r9921d56196
$$ 38729 -58488 -12520 -117325 -173063 -132214 -184472 60327 -141767 234016 134095 -456196
9034h1259C3039b30702j41032a39082A47054f9594A43553H47b70006j15557A0911
$$ -81259 33039 -230702 -371734 -139082 147054 -69594 143553 847 -270006 -385563 10911
9022H2578d75284a17750k62021a5579D34733h0920j55272A10719O3563q0473g5004
$$ 82578 -475284 -117750 -379771 -15579 434733 -80920 -236192 110719 174282 93809 -75004
9010H2225b18969h6862D2072c8690l55682j6667a82157A67955a88601C77K78448
$$ 82225 -218969 -86862 42072 -38690 -394372 -411039 -182157 167955 -188601 377 278825
8999B78825b46095e6572J1413q3236k4635N0922n7502f5016A60784b46873n8121
$$ 278825 -246095 -56572 -45159 -128395 -153030 -102108 -159610 -65016 160784 -246873 -304994
8988c04994m5282R6052A70731i410m58065a07900b3495l7168j67046A76071J67643
$$ -304994 -350276 -254224 170731 -9410 -467475 -107900 -23495 -60663 -227709 176071 343714
8977C43714D5634J07786a15509j15121d1131l6292o5620A12105k8851J17249H7562
$$ 343714 45634 153420 -115509 -230630 -41131 -77423 -143043 112105 83254 200503 87562
8965b02899G0960q765c8619j14518A17611a17455j35735c7727B79194a5180j78742
$$ -202899 70960 62195 -38619 -153137 117611 -117455 -253190 -37727 279194 -15180 -193922
8954a93922M723P6991k3189j3305A6757f7695j37181L3323A18925k755Q3322d7431
$$ -193922 -189199 -112208 -135397 -148702 16757 -67695 -204876 -171553 118925 116170 199492 -47431
8941A61934c30973A35008G527b49310A80181b6529A04322J82636C5912a30575
$$ 161934 -330973 135008 7527 -249310 180181 -26529 104322 286958 35912 -130575
8930c5110k49392G4567a62827c3193B61737r2190J25656J421365N682420M370302
$$ -35110 -284502 74567 -162827 -33193 261737 169547 295203 1716568 7398988 11769290
8920A1769290D253468G86578k64889B37772K77860a71603N7519C6260R9641D8912
$$ 11769290 4253468 786578 521689 237772 515632 -171603 -114084 36260 135901 48912
8909C07944b58470E7992J59749d6300A5099a20539B6220J58166e3632C5739c21325
$$ 307944 -258470 57992 217741 -46300 15099 -120539 26220 184386 -53632 35739 -321325
8897B65307b76847C1378K72149r7781G0461a41875O9719j06028E0524P0424f22377
$$ 265307 -276847 31378 303527 205746 70461 -141875 -72156 -178184 50524 120948 -622377
8885a93713E3582J0191J40396O0256i1138E6793a77615C57821I0655N1584a53659
$$ -193713 53582 63773 204169 264425 -91138 56793 -177615 357821 90655 142239 -153659
8873A65822G2365b0756A2491b29315D2810c11360J31328j54273A44327a77508
$$ 165822 72365 -20756 12491 -229315 42810 -311360 -180032 -334305 144327 -177508
8862H0049a59185P3717C14905H9460c2804k18164E4173a54980A13062k3988b16416
$$ 80049 -159185 -85468 314905 89460 -32804 -250968 54173 -154980 113062 89074 -216416
$$ [...]
##END NTUPLES=NMR SPECTRUM
##END=
