##TITLE=AC1586_HPIAH_8317172_wSR4BCHP7P
##JCAMPDX= 6.0         $$ Bruker NMR JCAMP-DX V2.0
##DATA TYPE= NMR SPECTRUM
##DATA CLASS= NTUPLES
##ORIGIN= BRUKER
##OWNER= Administrator
$$ 1.72 TOPSPIN		Version 2.1
$$ 2013-11-10 00:22:51.794 -0800  Administrator@X
$$ Compression mode = diff/dup
##.OBSERVE FREQUENCY= 400.02188249412
##.OBSERVE NUCLEUS= ^1H
##.ACQUISITION MODE= SIMULTANEOUS (DQD)
##.ACQUISITION SCHEME= undefined
##.AVERAGES= 64
##.DIGITISER RES= 22
##SPECTROMETER/DATA SYSTEM= spect
##.PULSE SEQUENCE= noesygpps1d.comp
##.SOLVENT NAME= COFFEE_meoh
##.SHIFT REFERENCE= INTERNAL, COFFEE_meoh, 1, 14.96106
##AUDIT TRAIL= $$ (NUMBER, WHEN, WHO, WHERE, PROCESS, VERSION, WHAT)
$$ ##TITLE= Audit trail, TOPSPIN		Version 2.1
$$ ##JCAMPDX= 5.01
$$ ##ORIGIN= Bruker BioSpin GmbH
$$ ##OWNER= Administrator
$$ $$ E:\/data/COFFEE/nmr/AC1586_HPIAH_8317172_wSR4BCHP7P/12/pdata/1/auditp.txt
$$ ##AUDIT TRAIL=  $$ (NUMBER, WHEN, WHO, WHERE, PROCESS, VERSION, WHAT)
(   1,<2013-11-10 00:22:46.406 -0800>,<Administrator>,<X>,<go>,<TOPSPIN 2.1>,
      <created by zg
	started at 2013-11-10 00:11:16.595 -0800,
	POWCHK enabled, PULCHK disabled,
       configuration hash MD5:
       C8 4E 4E 5D D3 5C D8 9E 9F 52 82 E0 59 8A DE 15
       data hash MD5: 64K
       F0 5B 1E 94 D7 50 CD 19 C9 A4 C9 91 60 B6 E6 77>)
(   2,<2013-11-10 00:22:49.536 -0800>,<Administrator>,<X>,<proc1d>,<TOPSPIN 2.1>,
      <Start of raw data processing
       efp LB = 0.3 FT_mod = 6 PKNL = 1 PHC0 = 0 PHC1 = 0 SI = 128K 
       data hash MD5: 128K
       16 2D 25 CA 8F F3 A3 A4 FF 4A BD 90 E6 0C 49 5E>)
(   3,<2013-11-10 00:22:50.615 -0800>,<Administrator>,<X>,<proc1d>,<TOPSPIN 2.1>,
      <pk PHC0 = -87.22595 PHC1 = 0 
       data hash MD5: 128K
       6A 4B EF B6 00 FA 80 FB 6E B9 07 64 13 01 D6 D0>)
(   4,<2013-11-10 00:22:51.103 -0800>,<Administrator>,<X>,<proc1d>,<TOPSPIN 2.1>,
      <abs ABSG = 1 
       data hash MD5: 128K
       49 36 AB 70 73 82 C0 C3 E8 2A 77 AA 8B 73 D9 FC>)
(   5,<2013-11-10 00:22:51.255 -0800>,<Administrator>,<X>,<proc1d>,<TOPSPIN 2.1>,
      <abs ABSG = 2 
       data hash MD5: 128K
       49 76 F9 39 E9 02 5D 54 BD 1A CD FB 01 DF 1E C4>)
(   6,<2013-11-10 00:22:51.356 -0800>,<Administrator>,<X>,<proc1d>,<TOPSPIN 2.1>,
      <abs ABSG = 3 
       data hash MD5: 128K
       A7 FA 05 1A EF E0 20 45 80 B6 D7 88 1B 35 B1 0F>)
(   7,<2013-11-10 00:22:51.474 -0800>,<Administrator>,<X>,<proc1d>,<TOPSPIN 2.1>,
      <abs ABSG = 4 
       data hash MD5: 128K
       FA DF E9 58 3D 7D 22 70 DF BD 83 BA 63 CB AC F0>)
(   8,<2013-11-10 00:22:51.558 -0800>,<Administrator>,<X>,<proc1d>,<TOPSPIN 2.1>,
      <abs ABSG = 5 
       data hash MD5: 128K
       6A D0 29 65 03 E5 0C 00 BC 07 BE 4F BF 8A 08 73>)
$$ ##END=
$$ 
$$ $$ hash MD5
$$ $$ 2C 93 07 3B E3 BB 9E B6 49 71 9F 3C 0F 5E F9 97
##$RELAX= 
##$RELAX= 
##$RELAX= 
##$RELAX= 
##$RELAX= 
##$RELAX= 
##$RELAX= 
##$RELAX= 
$$ Bruker specific parameters
$$ --------------------------
##$DU= <E:\>
##$EXPNO= 12
$$ [...]
##$TP07= 0
##$TPNAME0= <>
##$TPNAME1= <>
##$TPNAME2= <>
##$TPNAME3= <>
##$TPNAME4= <>
##$TPNAME5= <>
##$TPNAME6= <>
##$TPNAME7= <>
##$TPOAL= (0..7)
0.5 0.5 0.5 0.5 0.5 0.5 0.5 0.5
##$TPOFFS= (0..7)
0 0 0 0 0 0 0 0
##$TUNHIN= 0
##$TUNHOUT= 0
##$TUNXOUT= 0
##$USERA1= <user>
##$USERA2= <user>
##$USERA3= <user>
##$USERA4= <user>
##$USERA5= <user>
##$V9= 5
##$VALIST= <valist>
##$VCLIST= <CCCCCCCCCCCCCCC>
##$VD= 0
##$VDLIST= <DDDDDDDDDDDDDDD>
##$VPLIST= <PPPPPPPPPPPPPPP>
##$VTLIST= <TTTTTTTTTTTTTTT>
##$WBST= 1024
##$WBSW= 4
##$XGAIN= (0..3)
0 0 0 0
##$XL= 0
##$YL= 0
##$YMAX_a= 5556669
##$YMIN_a= -11344373
##$ZGOPTNS= <>
##$ZL1= 120
##$ZL2= 120
##$ZL3= 120
##$ZL4= 120
##$ABSF1= 14.96106
##$ABSF2= -5.597122
##$ABSG= 5
##$ABSL= 3
##$ALPHA= 0
##$AQORDER= 0
##$ASSFAC= 0
##$ASSFACI= 0
##$ASSFACX= 0
##$ASSWID= 0
##$AUNMP= <proc_prof1d_extract.lims>
##$AXLEFT= 0
##$AXNAME= <>
##$AXNUC= <1H>
##$AXRIGHT= 0
##$AXTYPE= 0
##$AXUNIT= <>
##$AZFE= 0.1
##$AZFW= 0.1
##$BCFW= 0
##$BC_mod= 0
##$BYTORDP= 0
##$COROFFS= 0
##$CY= 15
##$DATMOD= 1
##$DC= 0
##$DFILT= <>
##$DTYPP= 0
##$F1P= 0
##$F2P= 0
##$FCOR= 0.5
##$FTSIZE= 131072
##$FT_mod= 6
##$GAMMA= 0
##$GB= 0
##$INTBC= 1
##$INTSCL= 1
##$ISEN= 128
##$LB= 0.3
##$LEV0= 0
##$LPBIN= 0
##$MAXI= 10000
##$MC2= 0
##$MEAN= 0
##$ME_mod= 0
##$MI= 0
##$NCOEF= 0
##$NC_proc= -2
##$NLEV= 6
##$NOISF1= 0
##$NOISF2= 0
##$NSP= 0
##$NTH_PI= 0
##$NZP= 0
##$OFFSET= 14.96106
##$PC= 1
##$PHC0= -87.22595
##$PHC1= 0
##$PH_mod= 1
##$PKNL= yes
##$PPARMOD= 0
##$PPDIAG= 0
##$PPIPTYP= 0
##$PPMPNUM= 2147483647
##$PPRESOL= 1
##$PSCAL= 4
##$PSIGN= 0
##$PYNMP= <proc.py>
##$REVERSE= no
##$SF= 400.020009612225
##$SI= 131072
##$SIGF1= 0
##$SIGF2= 0
##$SINO= 400
##$SIOLD= 131072
##$SPECTYP= <>
##$SREGLST= <1H.CDCl3>
##$SSB= 0
##$STSI= 131072
##$STSR= 0
##$SW_p= 8223.68421052631
##$SYMM= 0
##$S_DEV= 0
##$TDeff= 65536
##$TDoff= 0
##$TI= <>
##$TILT= no
##$TM1= 0
##$TM2= 0
##$TOPLEV= 0
##$USERP1= <user>
##$USERP2= <user>
##$USERP3= <user>
##$USERP4= <user>
##$USERP5= <user>
##$WDW= 1
##$XDIM= 131072
##$YMAX_p= 412319966
##$YMIN_p= -12817
##$CURPLOT= <Network HP LaserJet P1505>
##$CURPRIN= <$Network HP LaserJet P1505>
##$DFORMAT= <normdp>
##$LAYOUT= <+/1D_H.xwp>
##$LFORMAT= <normlp>
##$PFORMAT= <normpl>
##$SURQMSG= 1
$$ End of Bruker specific parameters
$$ ---------------------------------
##NTUPLES= NMR SPECTRUM
##VAR_NAME=  FREQUENCY,     SPECTRUM/REAL,   SPECTRUM/IMAG
##SYMBOL=    X,             R,               I
##VAR_TYPE=  INDEPENDENT,   DEPENDENT,       DEPENDENT
##VAR_FORM=  AFFN,          ASDF,            ASDF
##VAR_DIM=   131072,        131072,          131072
##UNITS=     HZ,            ARBITRARY UNITS, ARBITRARY UNITS
##FACTOR=    0.0627417313425164, 1,          1
##FIRST=     8223.62146879497, -3044,        -55252
##LAST=      0,             -603,            -55930
##MIN=       0,             -12817,          0
##MAX=       8223.62146879497, 412319966,    0
$$ Real data points
##PAGE= N=1
##DATA TABLE= (X++(R..R)), XYDATA
$$ [...]
61709D62375J134J074L27o81j087r77j230k086k892l218l377l644l690l186k419
61694D36423k001k220k909l651l968l571k698k019k098k900l835m165l539k385
61680C94464j638j840k526k816k461j958j687j489j157q14n92m07l50q05j782
61665C72142k497k172j063j47J12J47M10O61M46j00l58J8P36J268J391J290J222
61648C73506J197R93N21J08K50J056K024K500K275J700J286J300J638J925J756
61633C94035J000j08j192k040k645l043l243l247l049k641k158j903k049k406
61619C65311k648k738k837k839k389j424m30K4j99q78j689k240k180j625j274
61604C39945j743k827l713l884l522l134l059l317l666l738l349k692k114j757
$$ y = [462375, 463509, 464583, 464910, 464229, 463142, 462165, 460935, 458849, 455957, 452739, 449362, 445718, 442028, 438842, 436423, 434422, 432202, 429293, 425642, 421674, 418103, 415405, 413386, 411288, 408388, 404553, 400388, 396849, 394464, 392826, 390986, 388460, 385644, 383183, 381225, 379538, 378049, 376892, 376078, 375486, 375079, 374729, 373924, 372142, 369645, 367473, 366410, 366263, 366375, 366522, 366932, 367593, 368039, 367939, 367581, 367599, 368335, 369603, 370994, 372284, 373506, 374703, 375696, 376217, 376325, 376575, 377631, 379655, 382155, 384430, 386130, 387416, 388716, 390354, 392279, 394035, 395035, 394927, 393735, 391695, 389050, 386007, 382764, 379517, 376468, 373827, 371669, 369766, 367717, 365311, 362663, 359925, 357088, 354249, 351860, 350436, 350006, 350030, 349831, 348953, 347264, 345024, 342844, 341219, 339945, 338202, 335375, 331662, 327778, 324256, 321122, 318063, 314746, 311080, 307342, 303993, 301301, 299187, 297430]
61590B97430j606j744k228k769k889k441j756j186q03n93o38r37j257j330j089
61575B74164o31j24J82L5o09j461k032j876r08L52J021O73j29m92k43J19L91R17
61557B69349J704K076J618Q53M54K79j08m03J27J353K182J952J225Q56Q09M34
61541B84760l58p39P9J766L029K849J500J85k89j35J25M58R96J353R80J05m57
61524B96207m59m68q27j025o44j84l44r06j070p03n20r79j654j814j271m32R0
61507B82997p1o83r96n59P7rp95j275r17l90l57l45L59J203R29m83j516j096J13
61488B76186Q63R60J031J233J123O47L64O13J103J476J686J712J394Q24M70N77
61472B92262Q64J058J303J682J739R73l65j466j775j313l43O95J153O59k95p56
$$ y = [297430, 295824, 294080, 291852, 289083, 286194, 283753, 281997, 280811, 280008, 279415, 278777, 277840, 276583, 275253, 274164, 273533, 273409, 273591, 273626, 273017, 271556, 269524, 267648, 266740, 267092, 268113, 268786, 268657, 268165, 267922, 268041, 268432, 269349, 271053, 273129, 274747, 275600, 276054, 276333, 276225, 275822, 275949, 277302, 279484, 281436, 282661, 283517, 284326, 284760, 284402, 283663, 283742, 285508, 288537, 291386, 292886, 293071, 292782, 292647, 292772, 293230, 294226, 295579, 296559, 296664, 296207, 295748, 295280, 294453, 293428, 292784, 292600, 292256, 291350, 290280, 289577, 289057, 288078, 286424, 284610, 283339, 282907, 282997, 282926, 282243, 281247, 280688, 280765, 280756, 279961, 278686, 277769, 277379, 277022, 276677, 277036, 278239, 279168, 278685, 277169, 276073, 276186, 277049, 278009, 279040, 280273, 281396, 282043, 282407, 283020, 284123, 285599, 287285, 288997, 290391, 291215, 291685, 292262, 293126, 294184, 295487, 297169, 298908, 299881, 299516, 298050, 296275, 294962, 294619, 295314, 296467, 297126, 296831, 296075]
61456B96075m06J89M66M47L45J86J31N31J304J734J416R22R29J155Q96K76J14
61439C06710N98R94Q15N06O40J145J674K178K666K816K378J610J007Q21J125J916
61423C29599K757K782J698M18N6O05J232J637K185K768K563J312Ll06K11N44J71
61406C50235o42j493k217k699k854k843k882k838k399j655j145j151j322j135
61392C22960n03K77R11J191R27J53o21p66k30L74N30M01L71L77J72Q9Q27K285
61374C29725L262K809J467N68O42J160J603K003K349K262J619Q94N49N21O66J180
61358C53279K110K932L184L198L533L951L743L031K871L821N100N632N433N282
61344D07100N330M834L422J948J560K222K768K485K015K413L615M479M182L088
$$ y = [296075, 295669, 295858, 296324, 296771, 297116, 297302, 297433, 297964, 299268, 301002, 302418, 303340, 304269, 305424, 306320, 306596, 306710, 307308, 308302, 309117, 309623, 310263, 311408, 313082, 315260, 317926, 320742, 323120, 324730, 325737, 326558, 327683, 329599, 332356, 335138, 336836, 337254, 337310, 337915, 339147, 340784, 342969, 345737, 348300, 349612, 349615, 349309, 349520, 350064, 350235, 349593, 348100, 345883, 343184, 340330, 337487, 334605, 331767, 329368, 327713, 326568, 325417, 324095, 322960, 322457, 322734, 323645, 324836, 325763, 325916, 325295, 324529, 324299, 324673, 325203, 325604, 325975, 326352, 326524, 326613, 327440, 329725, 332987, 335796, 337263, 337831, 338473, 339633, 341236, 343239, 345588, 347850, 349469, 350363, 350912, 351433, 352099, 353279, 355389, 358321, 361505, 364703, 368236, 372187, 375930, 378961, 381832, 385653, 390753, 396385, 401818, 407100, 412430, 417264, 420686, 422634, 424194, 426416, 429184, 431669, 433684, 436097, 439712, 444191, 448373, 451461]
61330D51461K128J758J738J601J046J22p65j186j160j083j095q24l8R17J603K122
61314D58345K746L258L278L182L944N895Q176R772J0650J1512J2669J3659J3954
61301E61040J3616J3064J2399J1219R139O391L751J900Q56K7j308l404n753p416
61287F15521p933p855q123q881r430r369r206r484r838r493q365p043n859m620
61273E00022l206j870q59j86J82L77P74J615K435K513J975J808K580L762M646
61258E16568N303O114O816O754N824M615L673L091K745K511K225J795J355J105
61244E70494J005Q95P52N08k09j605l058l468k549j277p45r72j230j162r73o88
61228E55718P3J378K670L542M362N673P183Q011P909P710Q286R512J0547J0886
$$ y = [451461, 453589, 455347, 457085, 458686, 459732, 459854, 459089, 457903, 456743, 455660, 454565, 453741, 453703, 454620, 456223, 458345, 461091, 464349, 467627, 470809, 474753, 480648, 488824, 498596, 509246, 520758, 533427, 547086, 561040, 574656, 587720, 600119, 611338, 620477, 626868, 630619, 632519, 633375, 633402, 632094, 628690, 622937, 615521, 607588, 599733, 591610, 582729, 573299, 563930, 554724, 545240, 535402, 525909, 517544, 510501, 504642, 500022, 496816, 494946, 494087, 493901, 494083, 494460, 495234, 496849, 499284, 501797, 503772, 505580, 508160, 511922, 516568, 521871, 527985, 534801, 541555, 547379, 551994, 555667, 558758, 561503, 564014, 566239, 568034, 569389, 570494, 571499, 572394, 573146, 573654, 573445, 571840, 568782, 565314, 562765, 561488, 560743, 559771, 558541, 557379, 556406, 555718, 555791, 557169, 559839, 563381, 567743, 573416, 580599, 588610, 596519, 604229, 612515, 622027, 632574, 643460]
61214F43460J0723J0409R961R165P995O718N661M881M097L035J879J241J565K637
61200G23427L797M572N093N898P369R270J0938J2014J2909J4139J5315J5218J3187
61187H53146R937O719M086J892J60p76r11q21j110j926l097m423n789p159q500
61172H41428r581j0013r732r239r110r404r848j0346j0906j1262j1202j1121j1624
61159G08040j2577j3188j3080j2651j2203j1429j0043q357o817n437m049k653
61147E95556j260J45J088O68j273l511m673m818n077n919o609o463n792n223m734
61132E42105l874k577j147L44K134M158N855O823P444Q502J0276J2236J3715J4702
61118F20696J5825J7627J9970K2179K3732K4752K5735K6863K7711K7783K7161
$$ y = [643460, 654183, 664592, 674553, 683718, 691713, 698431, 704092, 708973, 713070, 716105, 717984, 719225, 720790, 723427, 727224, 731796, 736889, 742787, 750156, 759426, 770364, 782378, 795287, 809426, 824741, 839959, 853146, 863083, 869802, 873888, 875780, 875940, 875164, 874253, 873432, 872322, 870396, 867299, 862876, 857087, 849928, 841428, 831847, 821834, 812102, 802863, 793753, 784349, 774501, 764155, 753249, 741987, 730785, 719664, 708040, 695463, 682275, 669195, 656544, 644341, 632912, 622869, 614512, 607695, 602258, 598209, 595556, 594296, 594441, 595529, 596197, 594924, 591413, 586740, 581922, 576845, 570926, 564317, 557854, 552062, 546839, 542105, 538231, 535654, 534507, 534851, 536985, 541143, 546998, 553821, 561265, 569767, 580043, 592279, 605994, 620696, 636521, 654148, 674118, 696297, 720029, 744781, 770516, 797379, 825090, 852873, 880034]
61107H80034K6365K5648K4804K3627K2155K0310J7804J4634J1287Q085M670N71
61095A079994l974q238j1782j4632j6917j8817k0648k2461k3733k4016k3713k3647
61083H67416k3947k4009k3437k2389k1051j9473j7946j6792j5723j4143j2163
61072F56343j0535r487q434p127o102n521m559k607l75R93J374J521J916K532
61058F09932L334M289N118N705O530Q002R594J0396J0364J0378J1081J2387J4119
61045G21229J6328J8805K0889K2118K2745K3328K4158K5286K6740K8443L0106
61034I80175L1425L2387L3177L3963L4914L6354L8627M1646M4669M6710M7265
61023A401312M6685M5813M5418M5979M7789N1056N5947O2535P0550P9229Q7874
$$ y = [880034, 906399, 932047, 956851, 980478, 1002633, 1022943, 1040747, 1055381, 1066668, 1074753, 1079423, 1079994, 1076020, 1067782, 1056000, 1041368, 1024451, 1005634, 984986, 962525, 938792, 914776, 891063, 867416, 843469, 819460, 796023, 773634, 752583, 733110, 715164, 698372, 682649, 668506, 656343, 645808, 636321, 627887, 620760, 614658, 609137, 604578, 601971, 601596, 602589, 603963, 605484, 607400, 609932, 613266, 617555, 622673, 628378, 634908, 642910, 652504, 662900, 673264, 683642, 694723, 707110, 721229, 737557, 756362, 777251, 799369, 822114, 845442, 869600, 894886, 921626, 950069, 980175, 1011600, 1043987, 1077164, 1111127, 1146041, 1182395, 1221022, 1262668, 1307337, 1354047, 1401312, 1447997, 1493810, 1539228, 1585207, 1632996, 1684052, 1739999, 1802534, 1873084, 1952313, 2040187]
61012B040187R6628J06269J17189J29563J45012J66966J98392K40150K92966L59951
61002C893273M45554N53387O88249Q59377J076544J339806J633726J928687K178120
60993A4596723K310175K237810J906840J354785P20295J78805j46670k27740j10330
60984B2820693J20845L53790M55707L13841r8891o93518j308836j797255k084339
60975A8082037k169861k094759j912131j673768j422782j187536r81056q06427
60967E833717o62240n44845m49654l72840l11747k63824k26240j96691j73523
60958B632113j55017j39514j26157j14533j03653r2434q1158p1243o3345n6780
60948A628279n0986m6502m3978m3193m3426m3997m4143m3134m1009l8577l6469
$$ y = [2040187, 2136815, 2243084, 2360273, 2489836, 2634848, 2801814, 3000206, 3240356, 3533322, 3893273, 4338827, 4892214, 5580463, 6439840, 7516384, 8856190, 10489916, 12418603, 14596723, 16906898, 19144708, 21051548, 22406333, 23126628, 23305433, 23158763, 22931023, 22820693, 22941538, 23295328, 23751035, 24064876, 23965985, 23272467, 21963631, 20166376, 18082037, 15912176, 13817417, 11905286, 10231518, 8808736, 7621200, 6640144, 5833717, 5171477, 4626632, 4176978, 3804138, 3492391, 3228567, 3002327, 2805636, 2632113, 2477096, 2337582, 2211425, 2096892, 1993239, 1900805, 1819647, 1748404, 1685059, 1628279, 1577293, 1530791, 1486813, 1443620, 1400194, 1356197, 1312054, 1268920, 1227911, 1189334, 1152865]
60937A152865l4740l3412l2600l1949l0785k9133k7716k6770k5725k4328k3156
60926H32551k2517k1714k0028j7755j5723j4335j3548j3160j2702j1673j0315
60915F59081r531r606r654q884p649o644n748m511l216k499k212j602n33L00M23
60900E87515J77J04K70M11M02K94P4m72j484k694l475l463k985k679k770l053
60884E66172l449m070m768n160n223n378n801o158o258o447p036p673p636o566
60870D84549m832l273k557k615k761k593k408k436k102q72O28J332J323J628K457
60855D65468K875K374J510O99l21j373j478l44R13J304J170J091O64o13k133l044
60839D68762l535m283n175n656n735n636n042l820k837k881l248k643j159m0K49
$$ y = [1152865, 1118125, 1084713, 1052113, 1020164, 989379, 960246, 932530, 905760, 880035, 855707, 832551, 810034, 788320, 768292, 750537, 734814, 720479, 706931, 693771, 681069, 669396, 659081, 649550, 639944, 630290, 621406, 613757, 607113, 601365, 596854, 593638, 591139, 588927, 587325, 586792, 587092, 587515, 587692, 587796, 588066, 588477, 588879, 589173, 589247, 588775, 587291, 584597, 581122, 577659, 574674, 571995, 569225, 566172, 562723, 558653, 553885, 548725, 543502, 538124, 532323, 526165, 519907, 513460, 506424, 498751, 491115, 484549, 479717, 476444, 473887, 471272, 468511, 465918, 463510, 461074, 458972, 458100, 458728, 460060, 461383, 463011, 465468, 468343, 470717, 472227, 472926, 472605, 471232, 469754, 469410, 470323, 471627, 472797, 473888, 474552, 473939, 471806, 468762, 465227, 460944, 455769, 450113, 444378, 438742, 433700, 429880, 427043, 424162, 420914, 418271, 417112, 417072, 417321]
60824D17321L99P91R51O09J61j46n27j003j323j620k235k867k812k191j911k233
60808D01364k394j932j413j384j518j354j177j495k182k677k695k326j785j338
60794C75694j264j548j874k021k088k234k564l133l679l560k510j347j166j853
60780C44853k217j635o81Q1Q62J665J562m9k082k637j127J189K794L321L337L326
60764C52562L300L110K831K632K456K034J358R25J217K046K714K748K152J084
60750C83169k17j235j407p85j6M40P10R95J120P90m5j250k670m012m916n322n482
60733C59867n558n433n040m577m252m079l919l508k556j230l71o19j393j469o77
60718C15186j05m24r80j012q58j107j361q45J37M75j09o62l73N28J382J940K249
$$ y = [417321, 417720, 418511, 419462, 420071, 420232, 420086, 419559, 418556, 417233, 415613, 413378, 410511, 407699, 405508, 403597, 401364, 398970, 397038, 395625, 394241, 392723, 391369, 390192, 388697, 386515, 383838, 381143, 378817, 377032, 375694, 374430, 372882, 371008, 368987, 366899, 364665, 362101, 358968, 355289, 351729, 349219, 347872, 346706, 344853, 342636, 341001, 340320, 340401, 341263, 342928, 344490, 344441, 342359, 339722, 338595, 339784, 342578, 345899, 349236, 352562, 355862, 358972, 361803, 364435, 366891, 368925, 370283, 371208, 372425, 374471, 377185, 379933, 382085, 383169, 382952, 381717, 380310, 379525, 379509, 379949, 380659, 381654, 382774, 383564, 383519, 382269, 379599, 375587, 370671, 365349, 359867, 354309, 348876, 343836, 339259, 335007, 330928, 327009, 323501, 320945, 319715, 319344, 318725, 317332, 315863, 315186, 315081, 314657, 313677, 312665, 311807, 310700, 309339, 308494, 308631, 309106, 308997, 308335, 307962, 308490, 309872, 311812, 314061]
60701C14061K294K101J872J687J355Q25M15M26P27J019J256J530J716J633J468
60686C34385J670K344L070L434L509L574L629L450L080K818K836L001L176L251
60672C77227K959K065R83O63J408K217J840K85j337k291k850l474m021m146l926
60657C67602l675l402k826j822o31L11P06O36N49Q61J595K471L201L488K994J688
60641C73746P9j342k676m108n023m570l065j972k075k565k379j639j067p07j49
60626C40488M62N97L17J86K92J28m52r29r30p01n98o11o07n23j83N82J425J608
60608C40551R81L62N17J161J413R28J06n62q54o18J78J154J655J421Q52M50L49
60591C50044M32O34Q57Q97P88R49J583K058J442k54j764j853n91Q78J575J373
$$ y = [314061, 316355, 318456, 320328, 322015, 323370, 324195, 324610, 325036, 325763, 326782, 328038, 329568, 331284, 332917, 334385, 336055, 338399, 341469, 344903, 348412, 351986, 355615, 359065, 362145, 364963, 367799, 370800, 373976, 377227, 380186, 382251, 383234, 383897, 385305, 387522, 389362, 389647, 388310, 386019, 383169, 379695, 375674, 371528, 367602, 363927, 360525, 357699, 355877, 355246, 355557, 356263, 356899, 357448, 358309, 359904, 362375, 365576, 369064, 372058, 373746, 373825, 372483, 369807, 365699, 360676, 356106, 353041, 351069, 348994, 346429, 344050, 342411, 341344, 340637, 340488, 340950, 341547, 341864, 342050, 342342, 342470, 342018, 341089, 340159, 339458, 338860, 338249, 337642, 337119, 336936, 337518, 338943, 340551, 341532, 341894, 342411, 343572, 344985, 345913, 346019, 345457, 344603, 343985, 344163, 345317, 346972, 348393, 349245, 349695, 350044, 350476, 351110, 351967, 352864, 353652, 354601, 356184, 358242, 359684, 359430, 357666, 355813, 355222, 356100, 357675, 359048]
60575C59048O89J5k64M7Q40J911L270N053P073Q831J0067J1056J2083J2928J3092
60560D45739J2408J1091R298O984M221J390j144l346n331o930p673p250n860m050
60546D49547k305q67K22J098K028L110M046M544N004O419R297J2962J6192J8320
60532E29617J9365J9315J7935J5321J2059Q628M977R83k992o270q437r493r561
60519E91447q783p505o273n508n212n087m864m459l801k792j559n98l18m28j90
60504E34070P03J903L305N549R119J3429J7529K1438K5937L1067L5802L9431M2493
60491G81775M5781M9037N1154N1218M8833M3891L6663K8021J8824R068j843j3846
60479A148576k5635l5608m3059m8248n1529n2829n2022m9536m6151m2299l7935
$$ y = [359048, 359737, 359752, 359488, 359535, 360375, 362286, 365556, 370609, 377682, 386513, 396580, 407636, 419719, 432647, 445739, 458147, 469238, 478536, 485520, 489741, 491131, 489987, 486641, 481310, 474380, 466707, 459457, 453597, 449547, 447242, 446375, 446597, 447695, 449723, 452833, 456879, 461423, 466427, 472846, 482143, 495105, 511297, 529617, 548982, 568297, 586232, 601553, 613612, 622240, 627217, 628200, 625208, 618938, 610501, 601008, 591447, 582664, 575159, 568886, 563378, 558166, 553079, 548215, 543756, 539955, 537163, 535604, 535006, 534688, 534260, 534070, 534773, 536676, 539981, 545530, 554649, 568078, 585607, 607045, 632982, 664049, 699851, 739282, 781775, 827556, 876593, 927747, 978965, 1027798, 1071689, 1108352, 1136373, 1155197, 1164265, 1162422, 1148576, 1122941, 1087333, 1044274, 996026, 944497, 891668, 839646, 790110, 743959, 701660, 663725]
60468F63725l3253k9099k6153k4024k1695j8831j6076j4044j2603j1325j0057
60457D46565q768p359n995n205n248n690n903n664m976l799k412j591j862k823
60443C79270l614l781l234j860O3J452J370K55n44n32m54q36j132p37m0J58k38
60426C65566p32j048j263j334j096o49k69j8K22M31N25O44R60J290J339J282J590
60409C67440K214K440J863J044Q25J281J727J652J213Q41P50R84J542K245K652
60394C90713K422J769J392J874L060M112M204L335K387K204K643K773K090J198
60380D26176J080J849K641K671K143J931K522L457L806L136K000J386J701K404
60366D58903K651K161J375R43J210J983K608K482J661R19R09J495K118K637L405
$$ y = [663725, 630472, 601373, 575220, 551196, 529501, 510670, 494594, 480550, 467947, 456622, 446565, 437797, 430438, 424443, 419238, 413990, 408300, 402397, 396733, 391757, 387958, 385546, 383955, 382093, 379270, 375656, 371875, 368641, 366781, 366844, 368296, 369666, 369921, 369377, 368845, 368391, 367555, 366423, 365686, 365646, 365804, 365566, 364834, 363786, 362523, 361189, 360093, 359444, 359175, 359157, 359379, 359810, 360335, 360979, 361939, 363229, 364568, 365850, 367440, 369654, 372094, 373957, 375001, 375826, 377107, 378834, 380486, 381699, 382540, 383290, 384274, 385816, 388061, 390713, 393135, 394904, 396296, 398170, 401230, 405342, 409546, 412881, 415268, 417472, 420115, 422888, 424978, 426176, 427256, 429105, 431746, 434417, 436560, 438491, 441013, 444470, 448276, 451412, 453412, 454798, 456499, 458903, 461554, 463715, 465090, 466033, 467243, 469226, 471834, 474316, 475977, 476896, 477805, 479300, 481418, 484055, 487460]
60351D87460M620O102P689R461J1361J2946J3630J3037J1154Q396N502K892K07
60338E94457l127o812r676j0912j0876j0458j0091r676q995p893o418n085m599
60325D89839m995n453n349n010m903m620l488j888j029j344j910j706p47L66J431
60310D49194K669M128N633P197R081J1473J4350J7594K0984K3998K5829K5766
60298F17896K3559J9490J4162Q186J949m443j0963j7260k2450k5458k5784k3989
60286E54895k1200j8119j4731j0966p338m608l052k350k094k056k069k056k224
60273D62032k785l467l645l194k758k913l361l416l011k707k798k913k682k294
60259D20088k124k179k144j787j049qR33J132M31l28q0J207K521L078L028K787
$$ y = [487460, 492080, 498182, 505871, 515332, 526693, 539639, 553269, 566306, 577460, 585856, 591358, 594250, 594457, 591330, 584518, 574842, 563930, 553054, 542596, 532505, 522829, 513834, 505941, 499523, 494438, 489839, 484844, 479391, 474042, 469032, 464129, 459509, 456021, 454133, 453104, 451760, 449850, 448144, 447397, 447763, 449194, 451863, 455991, 461624, 468821, 477902, 489375, 503725, 521319, 542303, 566301, 592130, 617896, 641455, 660945, 675107, 683293, 685242, 680799, 669836, 652576, 630126, 604668, 578884, 554895, 533695, 515576, 500845, 489879, 482541, 477933, 474881, 472531, 470437, 468381, 466312, 464256, 462032, 459247, 455780, 452135, 448941, 446183, 443270, 439909, 436493, 433482, 430775, 427977, 425064, 422382, 420088, 417964, 415785, 413641, 411854, 410805, 410797, 411730, 412862, 413293, 412965, 412885, 414092, 416613, 419691, 422719, 425506]
60243D25506K333J560Q22N55O21N16J6p68j719k536k472j012J167K526K257J105
60227D30477M60R50K080K883K668J499K66N9J170K762L688L611L211L350M187
60212D63321N176N818O223O777P442P825P940Q303Q931Q868P399N344M359M982
60198E58708O152O670O404N842N271M717M212L621K573R52p95k062k651k794k855
60183E93965l123l598l966l994l978m403n175n661n545n139m830m646m505m314
60169E31088l839k989k337k601l452l633k597j317r86j546k046j909j299o49l63
60154D99525n72q42n05M28J208J455J641K028K011J197L45L63R48J188J090J403
60138E12911K260L039L507M094M989N822O379O787O938O418N299M279L761L294
$$ y = [425506, 427839, 429399, 430221, 430776, 431397, 431913, 431929, 431161, 429442, 426906, 424434, 423422, 424589, 427115, 429372, 430477, 430937, 431887, 433967, 436850, 439518, 441017, 441283, 441342, 442512, 445274, 448962, 452573, 455784, 459134, 463321, 468497, 474315, 480538, 487315, 494757, 502582, 510522, 518825, 527756, 536624, 544023, 549367, 553726, 558708, 564860, 571530, 577934, 583776, 589047, 593764, 597976, 601597, 604170, 605122, 604327, 602265, 599614, 596820, 593965, 590842, 587244, 583278, 579284, 575306, 570903, 565728, 560067, 554522, 549383, 544553, 539907, 535402, 531088, 527249, 524260, 521923, 519322, 515870, 512237, 509640, 508323, 507337, 505791, 503745, 501836, 500537, 499888, 499525, 498953, 498111, 497606, 498034, 499242, 500697, 502338, 504366, 506377, 507574, 507919, 508282, 509230, 510418, 511508, 512911, 515171, 518210, 521717, 525811, 530800, 536622, 543001, 549788, 556726, 563144, 568443, 572722, 576483, 579777]
60124E79777K301R76J16K51J119J983K420K749L516M571N067M566L629K975K608
60109F18624K206J882J886J906J343J41j244k549l759m673n005m805m408m120
60095E97425m225m829n369m904l494k532k824l118j752P81K316J949R47O46Q53
60080E71870P22N9p76j417j502q89k14m03j419k331k844l771n542p287q033p923
60064E28300p549o849n573m284l863m299m655m247l313k546k337k517k641k504
60050D71123k299k114j566l90Q48J353J307J667K704L714M358N193O399P046O425
60035E05768N292M837M976M652L484K122J091J32j118k426l286l609l891m702
60021E13322o013p097p339o992o798o887o683n996n433n415n494n119m524m268
$$ y = [579777, 582078, 583054, 583170, 583421, 584540, 586523, 588943, 591692, 595208, 599779, 604846, 609412, 613041, 616016, 618624, 620830, 622712, 624598, 626504, 627847, 627988, 626744, 624195, 620436, 615763, 610758, 605953, 601545, 597425, 593200, 588371, 583002, 578098, 574604, 572072, 569248, 566130, 564378, 565159, 567475, 569424, 570371, 571017, 571870, 572592, 572651, 571875, 570458, 568956, 568067, 567853, 567450, 566031, 563700, 560856, 557085, 551543, 544256, 536223, 528300, 520751, 513902, 508329, 504045, 500182, 495883, 491228, 486981, 483668, 481122, 478785, 476268, 473627, 471123, 468824, 466710, 465144, 464754, 465602, 466955, 468262, 469929, 472633, 476347, 480705, 485898, 492297, 499343, 505768, 511060, 515897, 520873, 525525, 529009, 531131, 532222, 532354, 531236, 528810, 525524, 521915, 518024, 513322, 507309, 500212, 492873, 485881, 479083, 472196, 465513, 459517, 454084, 448669, 443175, 438056, 433532, 429264]
60007D29264m356m397m216l777k849j488m46m59j197j575j087k14L59M39K50J01
59991D04352K91R01J629K116K405K878L705M617N169N109M531L767L085K360J205
59976D48120m67k250l679m596m993m802m159l545l288l145k673j863j097n95k18
59961D06750K50Q73J565K155K478K484K251J828J214M79k02o42o10J11J313K231
59945D24528K277J797J546J530J055Jq30r34q88j354j998j998j304o62o08r46
59929D21212j096o69K47J207J915K582L481M269M314L837L889M974O307O863O503
59914D69835N664M633L619K915K454J756Q65O18J360K121J884J069P63R90Q12
59899E01358p6r37j159r12n52j50K29L86L12K82O05J495K965M473N099M534L592
$$ y = [429264, 424908, 420511, 416295, 412518, 409669, 408181, 407735, 407276, 406079, 404504, 403417, 403203, 403562, 404001, 404251, 404352, 404643, 405544, 407173, 409289, 411694, 414572, 418277, 422894, 428063, 433172, 437703, 441470, 444555, 446915, 448120, 447653, 445403, 441724, 437128, 432135, 427333, 423174, 419629, 416341, 413196, 410523, 408660, 407563, 406968, 406750, 407000, 407873, 409438, 411593, 414071, 416555, 418806, 420634, 421848, 422327, 422125, 421483, 420873, 420984, 422297, 424528, 426805, 428602, 430148, 431678, 432733, 432734, 431904, 430970, 430082, 428728, 426730, 424732, 423428, 422766, 422158, 421212, 420116, 419447, 419694, 420901, 422816, 425398, 428879, 433148, 437462, 441299, 445188, 450162, 456469, 463332, 469835, 475499, 480132, 483751, 486666, 489120, 490876, 491741, 492359, 493719, 495840, 497724, 498793, 499556, 500546, 501358, 501282, 500345, 499186, 498274, 497722, 497572, 497801, 498187, 498499, 498781, 499386, 500881, 503846, 508319, 513418, 517952, 521544]
59882E21544L157L119K961K914L541M569N135N063M903M782M233L183K153J305
59868E72562K23j182k436l388m458n672o335o050n348m843m419l683k632j456
59854E20883k09Q83J344J184J245K350M386O615Q494R795J0263R692Q138N869
59840E90932L232P00j262k541l212l008j552O56K107J647m10k865m870o118o458
59825E66978o030n493n348n194m373l174k656l153l789l696l104k758k803k782
59811E12625k460k076j871j817j901k266k906l472l539k970j971r61m10n39j050
59796D82416j390j431j619k232k795k703k208k188k947l812m041l622k929k110
59782D46389j256p45r22j521j912j804j484j269j080n18P00K354L690M011L407
$$ y = [521544, 524701, 527820, 530781, 533695, 537236, 541805, 546940, 552003, 556906, 561688, 565921, 569104, 571257, 572562, 572785, 571603, 569167, 565779, 561321, 555649, 549314, 543264, 537916, 533073, 528654, 524971, 522339, 520883, 520674, 521557, 522901, 524085, 525330, 527680, 532066, 538681, 547175, 556970, 567233, 576925, 585063, 590932, 594164, 594864, 593602, 591061, 587849, 584841, 583289, 583945, 586052, 587699, 587289, 584424, 579554, 573436, 566978, 560948, 555455, 550107, 544913, 540540, 537366, 534710, 531557, 527768, 524072, 520968, 518210, 515407, 512625, 510165, 508089, 506218, 504401, 502500, 500234, 497328, 493856, 490317, 487347, 485376, 484415, 484005, 483466, 482416, 481026, 479595, 477976, 475744, 472949, 470246, 468038, 465850, 462903, 459091, 455050, 451428, 448499, 446389, 445133, 444388, 443466, 441945, 440033, 438229, 436745, 435476, 434396, 433878, 434578, 436932, 440622, 444633, 448040]
59767D48040K661K367K388K373K375K594K861K840K668K845L579M550N378N926
59753D93445O143N910N275M651M607N327O347O915O691O005N205M158K692J313
59739E64684P86J032J159P47L30L25K88k61r67j271j282j385j398r03r0M56N95
59722E62845O26O76P03Q29J079J005K70o47r98q29q19j151j366j262j188j318
59706E58455j299q11J0Q26J377J522J303J025R16R20J009J413K183K886L272L710
59690E78717M428M792M156K878J688N06j017k207k039r24m92j390k631l319l725
59675E79421m230m515m464m726n598o272o072n549n533n770n489m798m453m519
59661E07433m156k803q19J024K217K672K603K438K485K764L151L606M076M397
$$ y = [448040, 450701, 453068, 455456, 457829, 460204, 462798, 465659, 468499, 471167, 474012, 477591, 482141, 487519, 493445, 499588, 505498, 510773, 515424, 520031, 525358, 531705, 538620, 545311, 551316, 556521, 560679, 563371, 564684, 565470, 566502, 567661, 568408, 568738, 569063, 569351, 569090, 568123, 566852, 565570, 564185, 562787, 561884, 561794, 562250, 562845, 563471, 564147, 564850, 565679, 566758, 567763, 568033, 567386, 566388, 565559, 564740, 563589, 562223, 560961, 559773, 558455, 557156, 556345, 556355, 557181, 558558, 560080, 561383, 562408, 563324, 564244, 565253, 566666, 568849, 571735, 575007, 578717, 583145, 587937, 592093, 594971, 596659, 597165, 596148, 593941, 591902, 590978, 590486, 589096, 586465, 583146, 579421, 575191, 570676, 566212, 561486, 555888, 549616, 543544, 537995, 532462, 526692, 521203, 516405, 511952, 507433, 503277, 500474, 499655, 500679, 502896, 505568, 508171, 510609, 513094, 515858, 519009, 522615, 526691, 531088]
59647E31088M425M158L557K514J135k38j410k520l705m770n411n594n540n374
59633E12315m939l938k434j104p25j218j680j600j544k166l061l345k955k499
59619D79107k128j565j078j326k163k690k608k510k627k354j403m35j6J71N62
59604D56937R65J147J377J778J899J500J117J174J186N92k47n80m09k77k86r7
59588D67776L27N81M33K0m22p15p66p13q88j408k006k408k542k330j691r34n99
59571D51715p47q65o51l33p6K30M17O6n93o67R9P90N60k80r44j201j145p31j53
59552D45491J2k90k39O08J490J585J224J155J343J524K164L727N550O686P485
59537D79515R201J2215J5721J8846K0841K0453J6519R566J821m589q780j0573
$$ y = [531088, 535513, 539671, 543228, 545742, 546877, 546639, 545229, 542709, 539004, 534234, 528823, 523229, 517689, 512315, 507376, 503438, 501004, 499900, 499175, 497957, 496277, 494677, 493133, 490967, 487906, 484561, 481606, 479107, 476979, 475414, 474336, 473010, 470847, 468157, 465549, 463039, 460412, 458058, 456655, 456220, 456204, 456375, 456937, 457902, 459049, 460426, 462204, 464103, 465603, 466720, 467894, 469080, 469672, 469425, 468845, 468436, 468159, 467873, 467776, 468103, 468684, 469117, 469137, 468715, 468000, 467234, 466521, 465633, 464225, 462219, 459811, 457269, 454939, 453248, 452314, 451715, 450968, 450103, 449452, 449119, 449043, 449273, 449690, 449756, 449163, 448496, 448595, 449385, 449945, 449665, 448721, 447520, 446375, 445644, 445491, 445503, 445213, 444974, 445582, 447072, 448657, 449881, 451036, 452379, 453903, 456067, 459794, 465344, 472030, 479515, 488716, 500931, 516652, 535498, 556339, 576792, 593311, 602877, 604698, 600109, 591329, 580756]
59525E80756j0010p711m839k288l95O65Q84Q61J230J621R71q89k912m317n497
59510E48130o922q071q149p298o384n932n804n689n433m999m547m356m402m214
59496D65930l445k406j716j533j448j069m54O8K76J69j00k37J34J135K321K948
59480D60573K834K688L300M599N918P010Q132R147R361Q508P191N938M586K973
59466E42758J645J055P37K9q10j090q52o28j51J439L991N989O340N778N882P152
59450E79264Q656R461R700J0010J0348R912Q343O365M754K995j52m707q963j1252
59436F34734j1523j0759r626q356p297o711o302n678n000m637m441l981l116j792
59422E45515K17K775N124O893Q799J1513J4367J6331J7702J9543K1800K3448K4385
$$ y = [580756, 570746, 563035, 558196, 555908, 555513, 556178, 557062, 557923, 559153, 560774, 561745, 560856, 557944, 553627, 548130, 541208, 533137, 524988, 517690, 511306, 505374, 499570, 493881, 488448, 483449, 478902, 474546, 470144, 465930, 462485, 460079, 458363, 456830, 455382, 454313, 453859, 453927, 454203, 454372, 454272, 454035, 454169, 455304, 457625, 460573, 463407, 466095, 469395, 473994, 479912, 486922, 495054, 504201, 513562, 522070, 529261, 535199, 539785, 542758, 544403, 545458, 546195, 546224, 545414, 544324, 543472, 542844, 542693, 544132, 548123, 554112, 560452, 566230, 572112, 579264, 587920, 597381, 607081, 617091, 627439, 637351, 645694, 652059, 656813, 659808, 659656, 654949, 645986, 634734, 623211, 612452, 602826, 594470, 587173, 580462, 574160, 568482, 563482, 558845, 554404, 550423, 547307, 545515, 545732, 548507, 553631, 560524, 569323, 580836, 595203, 611534, 629236, 648779, 670579, 694027, 718412]
59409G18412K5400K5928K3482J6337N741n296j4370k0172k1769j8981j3203o643
59397G14866n86M889R372J1116Q170N21r273j7760k2973k5092k5021k3107j9548
59384F05574j5331j1751r092o668m142k002o31K65R82J341J281J309J893K829
59370E65857L571L844L707L384L296L822M703N125M702L953L594L710M024M433
59356F21725M940N365N630O035O853P859Q722R605J0926J2564J3856J4392J4416
59343G42888J4288J3970J3283J2406J1731J1177J0054P834M855J919o64l257o077
59330H34407q733j0817j2471j4014j5316j6060j6292j6247j5795j4628j2884j1147
59318F70003r771q632p517o444n561n031m932n016m760m026l443l658m291m259
$$ y = [718412, 743812, 769740, 793222, 809559, 815300, 810004, 795634, 775462, 753693, 734712, 721509, 714866, 714280, 719169, 728541, 739657, 747827, 748348, 739075, 721315, 698342, 673250, 648229, 625122, 605574, 590243, 578492, 569400, 562732, 558590, 556588, 555957, 556222, 557204, 558545, 559826, 561135, 563028, 565857, 569428, 573272, 576979, 580363, 583659, 587481, 592184, 597309, 602011, 605964, 609558, 613268, 617292, 621725, 626665, 632030, 637660, 643695, 650548, 658407, 667129, 676734, 687660, 700224, 714080, 728472, 742888, 757176, 771146, 784429, 796835, 808566, 819743, 829797, 837631, 842486, 844405, 843741, 840484, 834407, 825674, 814857, 802386, 788372, 773056, 756996, 740704, 724457, 708662, 694034, 681150, 670003, 660232, 651600, 644083, 637639, 632078, 627047, 622115, 617099, 612339, 608313, 604870, 601212, 596921, 592662]
59304E92662l095j437r5R37K323M622P770J1075J3666J5033J5083J3553R736L324
59290F85157m593j1855j6652j8522j8100j6380j4140j1721r195o774m847l462
59278E48916k112l70J538L115M309N549P280R683J2424J4525J5045J4238J3365
59265F47505J3011J2339J0528Q051N746L501R04j649l613n418p605r483j0067
59252F63750r825r905j0056r107p356o458o762o678n204l294k025j009L96J797
59238E88264K678L383M289M963N111N296N789N761M685L515L323L540K859J241
59224F44697k23j088j957l218m482n306n724n938o083o271o497o537o249n753
59210E79371n146m392l733l621l946l931l183k292j889j799j642j611j931k117
$$ y = [592662, 589567, 588130, 588035, 588972, 591295, 595917, 603687, 614762, 628428, 643461, 658544, 672097, 681833, 685157, 680564, 668709, 652057, 633535, 615435, 599055, 584915, 573194, 563999, 557225, 552378, 548916, 546804, 546434, 547972, 551087, 555396, 560945, 568225, 577908, 590332, 604857, 619902, 634140, 647505, 660516, 672855, 683383, 691434, 697180, 700681, 701585, 699936, 696323, 690905, 683300, 673817, 663750, 653925, 644020, 633964, 624857, 617501, 611043, 604281, 597603, 592399, 589105, 587080, 586071, 586467, 588264, 590942, 594325, 598614, 603577, 608688, 613984, 619773, 625534, 630219, 633734, 637057, 640597, 643456, 644697, 644474, 643386, 641429, 638211, 633729, 628423, 622699, 616761, 610678, 604407, 597910, 591373, 585124, 579371, 574225, 569833, 566100, 562479, 558533, 554602, 551419, 549127, 547238, 545439, 543797, 542186, 540255, 538138]
59196E38138j637q42m99o21n71l3P53J580K381K927K941K498J867J153N08L84
59180E50927J141K503L866M834N240M934M087L322L162L533M237N380O886Q026
59166F12078Q168P740P691Q146Q247P364N827M371L228K012K62k043m398o239
59152F62454p475q421r280r963j0388j0636j0718j0607j0488j0544j0432r572
59140E43930q043o670o045n982n990n737m930l547k283k018k573k862k500k204
59126D82546k265j757k5K112L553M386N276O110O433O641P533R001J0141J0548
59112E50233J0573J0435R952R135Q326P726P209O584N677M351K864J782J269Q54
59098F36970K69p5L4j4p75j807k345k370k294k149j746j271q94l52L64N08m39
$$ y = [538138, 536501, 535659, 535160, 534539, 533968, 533935, 534688, 536268, 538649, 541576, 544517, 547015, 548882, 550035, 550543, 550927, 552068, 554571, 558437, 563271, 568511, 573445, 577532, 580854, 584016, 587549, 591786, 597166, 604052, 612078, 620246, 627986, 635677, 643823, 652070, 659434, 665261, 669632, 672860, 674872, 675134, 673091, 668693, 662454, 654979, 646558, 637278, 627315, 616927, 606291, 595573, 584966, 574478, 563934, 553502, 543930, 535887, 529217, 523172, 517190, 511200, 505463, 500533, 496986, 494703, 492685, 490112, 487250, 484750, 482546, 480281, 478524, 478499, 480611, 484164, 488550, 493826, 499936, 506369, 513010, 520543, 529544, 539685, 550233, 560806, 571241, 581193, 590328, 598654, 606380, 613589, 620173, 625850, 630201, 633065, 634847, 636116, 636970, 637239, 637164, 637198, 637184, 636409, 634602, 632257, 629887, 627593, 625444, 623698, 622427, 621533, 621181, 621545, 622053, 621614]
59081F21614j836k873l769n110o541p345p704q186q398p555o063n138m920m447
59067E41729l443k769k876l208l404l826m469m544l710k732k309k126j640j007
59053D99666o28m30k00k3OQ9K92L09Kk53j47J21K38J59r5n89j174j484j460j373
59033D93026j217o35L31R92R94R34J563K829M175N424O781Q194R305R969J0338
59018E53003J0469J0209R572Q827Q066O893M903K430L96p23j462k517l642l999
59004F02425l480k886k556j693L50K838M464N049N515O372P053O918O128N325
58990F41822M818M417L763K718J502M48l78j221k137k729k614j918j088l65L45
58975F47383J322K902N198P760R859J1267J2369J3382J4058J4342J4665J5261
$$ y = [621614, 619778, 616905, 613136, 608026, 601485, 594140, 586436, 578250, 569852, 562297, 556234, 551096, 546176, 541729, 538286, 535517, 532641, 529433, 526029, 522203, 517734, 513190, 509480, 506748, 504439, 502313, 500673, 499666, 499038, 498608, 498408, 498385, 498391, 498480, 498772, 499081, 499083, 498830, 498683, 498804, 499042, 499201, 499106, 498517, 497343, 495859, 494399, 493026, 491809, 491174, 491505, 492497, 493491, 494425, 495988, 498817, 502992, 508416, 515197, 523391, 532696, 542665, 553003, 563472, 573681, 583253, 592080, 600146, 607039, 611942, 614372, 614768, 614045, 612583, 610066, 606424, 602425, 598945, 596059, 593503, 591810, 592160, 594998, 599462, 604511, 610026, 616398, 623451, 630369, 636497, 641822, 646640, 651057, 654820, 657538, 659040, 659488, 659110, 657889, 655752, 653023, 650409, 648491, 647403, 647038, 647383, 648705, 651607, 656805, 664565, 674424, 685691, 698060, 711442, 725500, 739842, 754507, 769768]
58963G69768J5791J6052J6280J6335J5356J2936R902P230M804J953j406m981q742
58950H71278j2447j5242j6647j7417j8375j9031j8509j7169j5999j4888j3031
58939F92523j0746r282q819q200o855n561m915m332l141j656n61J7K78K89J77
58924F29216J91K87J33k93n86m89j21L33O52N44N6j55L17Q63P25L08O67J927L259
58905F37834M234N062N695N916O313P860J0399J2675J4115J5251J6310J6617J5932
58892G74213J5088J4750J4639J4512J4875J6151J8000K0009K2026K3360K2765
58881I70388J9964J6336J3237J0479P208L521J73k743n802r167j2346j4956j7045
58868I79247j8609j9239j8481j6420j3871j1864j0770j0069r194q284p799p738
$$ y = [769768, 785559, 801611, 817891, 834226, 849582, 862518, 872420, 879650, 884454, 886407, 885001, 880020, 871278, 858831, 843589, 826942, 809525, 791150, 772119, 753610, 736441, 720442, 705554, 692523, 681777, 672495, 663676, 655476, 648621, 643060, 638145, 633813, 630672, 629016, 628455, 628472, 628750, 629039, 629216, 629407, 629694, 629827, 629534, 628948, 628459, 628338, 628671, 629323, 629867, 629923, 629768, 630085, 630948, 631673, 631981, 632648, 634575, 637834, 642068, 647130, 652825, 658741, 665054, 672914, 683313, 695988, 710103, 725354, 741664, 758281, 774213, 789301, 804051, 818690, 833202, 848077, 864228, 882228, 902237, 924263, 947623, 970388, 990352, 1006688, 1019925, 1030404, 1037612, 1041133, 1041306, 1038563, 1032761, 1023594, 1011248, 996292, 979247, 960638, 941399, 922918, 906498, 892627, 880763, 869993, 859924, 850730, 842446, 834647, 826909]
58856H26909p919q599j0017j1529j2111j1652j0892j0210r429q740q674r071r105
58843F98961q537q017p920p951p999q343q741q446p466o738o678o555n742m623
58829E95205l745l029k331j907j769j433o87J18Q71J906L121L874M190M942O401
58814F05727P596P710P076O307N447M607M262M236L478J680P6l03k12j005k707
58799F53975m352n504o321o660o340n855n920o440o809o895o991p073o747n843
58785E66225m454k693q54N15J144J326J408J461J726K659M012M590L593J616k45
58770E82029j719l127m424n297n836o354o746o607n938n160m628m365m160l726
58756E13942k953k127j525r30m2P83R19N85O80J427K106K336K579L150L711M053
$$ y = [826909, 818990, 810391, 800374, 788845, 776734, 765082, 754190, 743980, 734551, 725811, 717137, 708066, 698961, 690424, 682407, 674487, 666536, 658537, 650194, 641453, 633007, 625541, 618803, 612125, 605570, 599828, 595205, 591460, 588431, 586100, 584193, 582424, 580991, 580304, 580422, 581293, 583199, 586320, 590194, 594384, 599326, 605727, 613323, 621033, 628109, 634416, 639863, 644470, 648732, 652968, 656446, 658126, 658202, 657899, 657687, 656682, 653975, 649623, 644119, 637798, 631138, 624798, 618943, 613023, 606583, 599774, 592879, 585888, 578815, 572068, 566225, 561771, 559078, 558224, 558739, 559883, 561209, 562617, 564078, 565804, 568463, 572475, 577065, 580658, 582274, 582029, 580310, 577183, 572759, 567462, 561626, 555272, 548526, 541919, 535981, 530821, 526193, 521828, 517668, 513942, 510989, 508862, 507337, 506407, 506365, 507148, 508067, 508652, 509332, 510759, 512865, 515201, 517780, 520930, 524641, 528694]
58740E28694M441M839M852M736N323O513P076O536N964O244O774O717O356O162
58726F11227N652M315K788J990J750J413J134J523K499L453M132M685N192N827
58712F57580O849P947Q192P235N834M639L366J693pj542l498o125q590j0199j1520
58697F61854j3335j5340j6765j7471j7537j6698j5065j3547j2594j1443r483p459
58685D95117o250n477m451l534l341l412k950k199j892j991k038k070k143j757
58671D51612p59L8K12P75K683N268P331Q862J0315J1266J1307J1215J1509J0757
58657E42391P265J895k649n021n974o465o730p038p591p743o819n495m999n163
58643D79864m803l737k882k527k117j583j345j068J02J972L357L750L624L220
$$ y = [528694, 533135, 537974, 542826, 547562, 552885, 559398, 566474, 573010, 578974, 585218, 591992, 598709, 605065, 611227, 616879, 621194, 623982, 625972, 627722, 629135, 630269, 631792, 634291, 637744, 641876, 646561, 651753, 657580, 664429, 672376, 680568, 687803, 693637, 698276, 701642, 703335, 703328, 701786, 698288, 692163, 683573, 673374, 661854, 648519, 633179, 616414, 598943, 581406, 564708, 549643, 536096, 523502, 512059, 502576, 495117, 488867, 483390, 478939, 475405, 472064, 468652, 465702, 463503, 461611, 459620, 457582, 455512, 453369, 451612, 450853, 450891, 451103, 451878, 454561, 459829, 467160, 476022, 486337, 497603, 508910, 520125, 531634, 542391, 549656, 551551, 548902, 543881, 537907, 531442, 524712, 517674, 510083, 502340, 495521, 490026, 485027, 479864, 475061, 471324, 468442, 465915, 463798, 462215, 460870, 459802, 459904, 461876, 465233, 468983, 472607, 475827]
58629D75827K319J224O41N49L66Q7J31K83P2q6N49J601K055K009K477L617M635
58612D98356N286N990O567O344N538M970M519L355J726Q69R80Q94K4r06j348j755
58596E41409k455l045l212l102k597j399n0M47K19N57K101M131N885P430Q931
58581E55250J0188J1140J1813J1693J0238Q140O835O556O095M792L581L615M917
58568F54853O849R046J1345J3475J5255J6790J8384K0425K3048K5478K6403K5478
58556H66829K3695K1547J7969J2296O139J642j278m086o732p744o931n854n476
58543I12016n221m670m492n332p166r932j3529j7113j9690k1327k2489k2557k0625
58530G37873j7505j5138j3981j2747j0695q483o646m944l397k386j677p88k30
$$ y = [475827, 478146, 479370, 480011, 480560, 480926, 481013, 481144, 481427, 481499, 481413, 481962, 483563, 485618, 487627, 490104, 493721, 498356, 503642, 509632, 516199, 522543, 528081, 533051, 537570, 540925, 542651, 543520, 544500, 545394, 545418, 544512, 543164, 541409, 538954, 535909, 532697, 529595, 526998, 525599, 525549, 525996, 526215, 526772, 528873, 533004, 538889, 546319, 555250, 565438, 576578, 588391, 600084, 610322, 618462, 625297, 631853, 637948, 642740, 646321, 649936, 654853, 661702, 670748, 682093, 695568, 710823, 727613, 745997, 766422, 789470, 814948, 841351, 866829, 890524, 912071, 930040, 942336, 948475, 950117, 948839, 944753, 938021, 930277, 923346, 917492, 912016, 906795, 902125, 897633, 892301, 885135, 875203, 861674, 844561, 824871, 803544, 781055, 758498, 737873, 720368, 705230, 691249, 678502, 667807, 659324, 652678, 647734, 644337, 641951, 640274, 639486, 639256]
58517F39256p45j593j447p76j253k900l970l736l223k932k132p96n2j81k19K4
58501F13325m23j510j801r02k51p79j702k192k378k140r43O09J156J007J940M015
58485F07031N085M360L913N429P792R410J0715J2756J5109J6846J7962J8451J7428
58472G52287J4605J1203Q105M563p9m829q360j0571j1659j1188r239p068n511
58459G22259l949j851J17J578L486O505R713J1986J3358J3982J3195J0756P631
58446H08766M528Q98l573p844j0873j2838j4067j4099j2711j0596q228n440k719
58433G11204j329j310j009N62K483L737M549N209N469N906P849J0997J3059J2770
58419G80146J1208R311O373K268j272l198m735o828q195p705o669o821p688p945
$$ y = [639256, 638511, 636918, 635471, 634695, 633442, 630542, 626572, 622836, 619613, 616681, 614549, 613753, 613701, 613520, 613301, 613325, 612902, 611392, 609591, 608689, 608438, 607659, 605957, 603765, 601387, 599247, 598304, 598913, 600069, 601076, 603016, 607031, 612116, 616476, 620389, 625818, 633610, 643020, 653735, 666491, 681600, 698446, 716408, 734859, 752287, 766892, 778095, 786200, 790763, 790684, 785855, 777495, 766924, 755265, 744077, 734838, 727770, 722259, 718310, 716459, 716576, 718154, 721640, 728145, 737858, 749844, 763202, 777184, 790379, 801135, 808766, 813294, 814192, 810619, 802775, 791902, 779064, 764997, 750898, 738187, 727591, 719363, 713923, 711204, 709875, 708565, 707556, 708118, 710601, 714338, 718887, 724096, 729565, 735471, 743320, 754317, 767376, 780146, 791354, 800665, 807038, 809306, 808034, 804836, 800101, 793273, 785078, 777373, 770704, 763883, 756195, 748250]
58405G48250p728p777p687o841n774n039m025k298o82K28J115K323K928K702L015
58390G12710M515N767N665N115M920M206K646J882K870L922L472K649K992L718
58376G67049L580L397M311N288M909M017M209N180N792O357P536Q483Q327Q122
58362H46557R150J0658J1400J1878J2929J3586J2667J1013R906Q668O141L133
58350I67686J186J52q56j377n73Q83J878K514L227L695M128N731Q322R703R126
58335A015425Q980J1002J3423J4142J4109J4919J5687J5217J4789J5647J6011
58324A169351J3871J0593Q572P284N075K781K161K491K147J828K884M228M269
58311A237535M218N977Q431R328R221J0087J1576J2126J2279J3487J5052J5592
$$ y = [748250, 740522, 732745, 725058, 718217, 712443, 707404, 703379, 701081, 700399, 700627, 701742, 704065, 706993, 709695, 712710, 717225, 722992, 728657, 733772, 738692, 742898, 745544, 747426, 750296, 754218, 757690, 760339, 763331, 767049, 770629, 774026, 778337, 783625, 788534, 792551, 796760, 801940, 807732, 814089, 821625, 830108, 838435, 846557, 855707, 866365, 877765, 889643, 902572, 916158, 928825, 939838, 949744, 958412, 964553, 967686, 968872, 969024, 968168, 966791, 966218, 967101, 968979, 971493, 974720, 978415, 982543, 988274, 996596, 1006299, 1015425, 1024405, 1035407, 1048830, 1062972, 1077081, 1092000, 1107687, 1122904, 1137693, 1153340, 1169351, 1183222, 1193815, 1202387, 1209671, 1214746, 1217527, 1219688, 1222179, 1224326, 1226154, 1229038, 1233266, 1237535, 1241753, 1247730, 1256161, 1265489, 1274710, 1284797, 1296373, 1308499, 1320778, 1334265, 1349317, 1364909]
58299A364909J5951J7431J8841J8526J7560J7618J7763J6662J5855J7171J9151
58288A557438J9739K0185K2345K4538K4382K3391K4349K6306K6743K6515K7973
58277A823904L0186L0801L0678L2090L4209L5072L5833L8356M0874M1007M0691
58266B213701M2926M6141M7191M7463N0143N3958N5582N6054N8466O1585O2126
58255B795336O1264O2342O4243O3775O2525O4342O7988O9511P0023P3759Q0175
58244C535283Q5366Q9597R5943J03297J08452J13192J21512J31702J39339J45933
58234D669616J56064J68180J77298J84765J96089K10988K25037K39039K57050
58225F484126K77443K96038L15506L41083L69976L96372M23710M59729N02773
$$ y = [1364909, 1380860, 1398291, 1417132, 1435658, 1453218, 1470836, 1488599, 1505261, 1521116, 1538287, 1557438, 1577177, 1597362, 1619707, 1644245, 1668627, 1692018, 1716367, 1742673, 1769416, 1795931, 1823904, 1854090, 1884891, 1915569, 1947659, 1981868, 2016940, 2052773, 2091129, 2132003, 2173010, 2213701, 2256627, 2302768, 2349959, 2397422, 2447565, 2501523, 2557105, 2613159, 2671625, 2733210, 2795336, 2856600, 2918942, 2983185, 3046960, 3109485, 3173827, 3241815, 3311326, 3381349, 3455108, 3535283, 3620649, 3710246, 3806189, 3909486, 4017938, 4131130, 4252642, 4384344, 4523683, 4669616, 4825680, 4993860, 5171158, 5355923, 5552012, 5763000, 5988037, 6227076, 6484126, 6761569, 7057607, 7373113, 7714196, 8084172, 8480544, 8904254, 9363983, 9866756]
58216I866756N46165N92564O49707P15619P83613Q58483R51115J060620J179732
58207A7204374J314369J478510J673581J894299K151467K466269K846775L296875
58199C4326519L845678M541354N422708O530524P941357R753633J2051833J4930306
58191I9343912J8523401K2905122K7907387L3062839L7670908M0752153M0926633
58184C21092355L6695285K7352004J3875939j161732j4782514k4929746l0997054
58177C27144537l3497978l3439568l1833801k9432245k6663041k3737510k0800123
58170A27740271j7982259j5373015j3014563j0937417r166091p690956o469523
58163D7106447n461438m639767l971477l416004k947625k557809k233707j954365
$$ y = [9866756, 10412921, 11005485, 11655192, 12370811, 13154424, 14012907, 14964022, 16024642, 17204374, 18518743, 19997253, 21670834, 23565133, 25716600, 28182869, 31029644, 34326519, 38172197, 42713551, 48136259, 54666783, 62608140, 72361773, 84413606, 99343912, 117867313, 140772435, 168679822, 201742661, 239413569, 280165722, 321092355, 357787640, 385139644, 399015583, 397853851, 383071337, 358141591, 327144537, 293646559, 260206991, 228373190, 198940945, 172277904, 148540394, 127740271, 109758012, 94384997, 81370434, 70433017, 61266926, 53575970, 47106447, 41645009, 37005242, 33033765, 29617761, 26670136, 24112327, 21878620, 19924255]
58155A9924255j709461j502116j330328j182479j052875r45126q57700p80875
58147A0563295p10061o48403n94554n41180m87426m40161m00946l63642l26497
58138F050425k95023k70958k49455k29271k15071k07430k00370j91087j82885
58129D008875j76540j67928j56229j45872j38227j29641j19460j11840j07539
58120B755599j02004r3742q7009q3829q0683p5410p0557o7488o3697n8437n4794
58109A917949n3866n2609m9622m7472m7243m6245m3255m0787m0187l9326l7094
58098A420243l5453l5311l4774l3004l1566l0647k8324k4611k1992k0981j9510
58087A104070j7361j6667j7327j6705j4786j4716j7125j8790j8138j7397j7909
$$ y = [19924255, 18214794, 16712678, 15382350, 14199871, 13146996, 12201870, 11344170, 10563295, 9853234, 9204831, 8610277, 8069097, 7581671, 7141510, 6740564, 6376922, 6050425, 5755402, 5484444, 5234989, 5005718, 4790647, 4583217, 4382847, 4191760, 4008875, 3832335, 3664407, 3508178, 3362306, 3224079, 3094438, 2974978, 2863138, 2755599, 2653595, 2559853, 2472844, 2389015, 2308332, 2232922, 2162365, 2094877, 2031180, 1972743, 1917949, 1864083, 1811474, 1761852, 1714380, 1667137, 1620892, 1577637, 1536850, 1496663, 1457337, 1420243, 1384790, 1349479, 1314705, 1281701, 1250135, 1219488, 1191164, 1166553, 1144561, 1123580, 1104070, 1086709, 1070042, 1052715, 1036010, 1021224, 1006508, 989383, 970593, 952455, 935058, 917149]
58076I17149j7989j6998j6946j8387j8950j7557j6138j5680j4654j2686j1703
58065G39461j2019j1322q971p308p315p024n656n182o244o673n803o097q593j0710
58051F30544j0628r993j0157r543p122m995m932n512n015m314m574m907m406l993
58037E40453m307m347l805m098n537o268n577n303o412p265p056p673j0039j1720
58023D51046j0623q287p065o575n492m406m408m753m356l855m125m444m013l503
58009C75141l460l000j779j162j862k411j612m69L5P75K338L268K514J576K075
57994C71967L017K569R23o39j959l356m254m275m330n015n427m965m619m990m843
57979C29804l360j919j857k187j514n05m61j001j123j087j359j128J56J189P34
$$ y = [917149, 899160, 882162, 865216, 846829, 827879, 810322, 794184, 778504, 763850, 751164, 739461, 727442, 716120, 707149, 699841, 692526, 685502, 679846, 674664, 668420, 661747, 655944, 649847, 641254, 630544, 619916, 609923, 599766, 590223, 583101, 578106, 573174, 567662, 562647, 558333, 553759, 548852, 544446, 540453, 536146, 531799, 527994, 523896, 518359, 512091, 506514, 501211, 494799, 487534, 480478, 472805, 462766, 451046, 440423, 432136, 425071, 418496, 413004, 408598, 404190, 399437, 395081, 391226, 387101, 382657, 378644, 375141, 371681, 368681, 366902, 365740, 363878, 361467, 359855, 359386, 359421, 360196, 362534, 365802, 368316, 369892, 371967, 374984, 377553, 378476, 377837, 375878, 372522, 368268, 363993, 359663, 354648, 349221, 344256, 339637, 334647, 329804, 326444, 324525, 322668, 320481, 318967, 318462, 318001, 317000, 315877, 314790, 313431, 312303, 312459, 313648, 314382]
57964C14382k07o8P39Q88N24N53P11K65k81r0K64k68j391k133k544l074l298k686
57946C02286j826j393r07J18R46R66J055K072L204L435L486M516O006O775P072
57931C37811P804Q564Q237O890N349L574J166j192k463k943l708m911n925o547
57917C51706o788o182m605l063k464k308j730r55n49k59K09L48K0K55J526K457
57901C27618J820N09j44o55k048l460l313k034j401j771k028j795j699j762j426
57886C06411q63o20l60M56J102N50o37j086q56j119k032k722l032l487l789l164
57870B84752j990j389j370r99k03K98N31J094J626J305O49R78K159K764K529K745
57854B95479M005N335N952O171O176N466M085K961K462J814M53j090k145k794
$$ y = [314382, 314175, 314107, 314846, 315734, 316258, 316811, 317522, 317787, 317506, 317416, 317680, 317412, 316021, 313888, 311344, 308270, 304972, 302286, 300460, 299067, 298160, 298278, 299224, 300190, 301245, 303317, 306521, 309956, 313442, 317958, 323964, 330739, 337811, 345615, 354179, 362416, 369306, 374655, 378229, 379395, 378203, 375740, 372797, 369089, 364178, 358253, 351706, 344918, 338736, 334131, 331068, 328604, 326296, 324566, 323611, 323062, 322803, 323012, 323360, 323380, 323635, 325161, 327618, 329438, 329947, 329803, 329148, 327100, 323640, 320327, 318293, 316892, 315121, 313093, 311298, 309599, 307837, 306411, 305548, 304928, 304568, 305024, 306126, 306676, 306039, 304953, 304097, 302978, 300946, 298224, 295192, 291705, 287916, 284752, 282762, 281373, 280003, 279004, 278801, 279099, 279630, 280724, 282350, 283655, 284304, 285282, 287441, 290205, 292734, 295479, 299484, 304819, 310771, 316942, 323118, 328584, 332669, 335630, 338092, 339906, 340359, 339269, 337124, 334330]
57840C34330l412m080m728n188n127m539m108m310m573m228l741l820l933l075
57826B75468j616p91o50j74O88Q82J99l05o3M00Q58J807L080L584K938K081J684
57809B90070J120m09k764n347p664r090r046p825o392n204m076l159k882k819
57795B24513j933k38R98J074O88O30Q42J163J835K744L210L100L148L768M475
57780B50017M889N277N675N531M783M297M632N233N445N379N215M487K765M18
57766C14043j859l646m617m528l853l605m050m337l915l425l572l914l636k864
57752B62222k387k461k583k300j596o96P6M18L57L16O35J272K046K781L153K864
57736B64117K149J669J680J715J376J026J359K454L561L787K950J771J124J094
$$ y = [334330, 330918, 326838, 322110, 316922, 311795, 307256, 303148, 298838, 294265, 290037, 286296, 282476, 278543, 275468, 273852, 273061, 272411, 272237, 272925, 273807, 274006, 273701, 273638, 274038, 274896, 276703, 279783, 283367, 286305, 288386, 290070, 291190, 290781, 288017, 282670, 275006, 265916, 256870, 249045, 242653, 237449, 233373, 230214, 227332, 224513, 222580, 222342, 223340, 224414, 225102, 225732, 226574, 227737, 229572, 232316, 235526, 238626, 241774, 245542, 250017, 254906, 260183, 265858, 271389, 276172, 280469, 285101, 290334, 295779, 301158, 306373, 310860, 313625, 314043, 312184, 308538, 303921, 299393, 295540, 291935, 287885, 283548, 279633, 276208, 272636, 268722, 265086, 262222, 259835, 257374, 254791, 252491, 250895, 250199, 250275, 250693, 251050, 251366, 252001, 253273, 255319, 258100, 261253, 264117, 266266, 267935, 269615, 271330, 272706, 273732, 275091, 277545, 281106, 284893, 287843, 289614, 290738, 291832]
57722B91832J029O02K34K35J78l61j085j621k226l074l520l095k571k907l670
57707B69980l769l311l251l590l484l007l066l467k845r41O75Q87M73N83R81Q05
57691B43653lr20j737k476l015l369l734l908l515k932k971l245k176P41L916
57676B14309N829P136R558J3533J8216K3206K9086L6302M4473N2742O0182O5658
57664E80230O7431O3014N0063K8568K386k2444m1510n3838o0214o1279n7858n1707
57652D42842m4573l7190k9930k3711j9211j5898j2799r814p479n896m779m061
57640B27501l639k991j868r34q44j134r28l38j56m02k76M77J068P45l57j552k226
57623B12146k078j259m66m22j116j820j843j183m49l73j190k376l129l233l156
$$ y = [291832, 292861, 293463, 293697, 293932, 294110, 293749, 292664, 291043, 288817, 285743, 282223, 279128, 276557, 273650, 269980, 266211, 262900, 259649, 256059, 252575, 249568, 246502, 243035, 240190, 239249, 239924, 240811, 241284, 241867, 242848, 243653, 243650, 242730, 240993, 238517, 235502, 232133, 228399, 224491, 220976, 218044, 215073, 211828, 209652, 210393, 214309, 220138, 227274, 236832, 250365, 268581, 291787, 320873, 357175, 401648, 454390, 514572, 580230, 647661, 710675, 760738, 789306, 791692, 769248, 727738, 673900, 613686, 552407, 494549, 442842, 398269, 361079, 331149, 307438, 288227, 272329, 259530, 249716, 242237, 236341, 231562, 227501, 223862, 220871, 219003, 218069, 217225, 216091, 215163, 214825, 214669, 214267, 213991, 214468, 215536, 216281, 215924, 214372, 212146, 210068, 208809, 208343, 207921, 206805, 204985, 203142, 201959, 201510, 201137, 199947, 197571, 194442, 191209, 188053]
57608A88053l216l085k380j315m14P1K42K79L43M47L39j52o61o88m26n53j135
57591A75749j607j865k414l123l044k073j596k522l673l305j589k59k63q92j191
57576A46333j072r27r82j233j515j572j379j308j559j780j581j137q45p77r02
57561A27764j329j865j889j272q57j245j735j350l21M67J007J884K773K660J568
57546A26260P82R67J324J023M38K89L98J16m96o93p8R62J773J996J651R35L8r32
57528A36753j796k216j925j041J2Q75J390J477J101L87k99m14M33J984L219L194
57512A43134K139J198R48Q15K07m45m63q7m6l78n26m06m64p75r14q26j027j671
57494A40413k147k003j704k013k891l501l191k133r70p4O16J139J222P53K22K14
$$ y = [188053, 184837, 181752, 179372, 178057, 177643, 177714, 177956, 178235, 178578, 179025, 179364, 179212, 178551, 177863, 177437, 176884, 175749, 174142, 172277, 169863, 166740, 163696, 161623, 160027, 157505, 153832, 150527, 148938, 148679, 148416, 147524, 146333, 145261, 144334, 143352, 142119, 140604, 139032, 137653, 136345, 134786, 133006, 131425, 130288, 129443, 128666, 127764, 126435, 124570, 122681, 121409, 120552, 119307, 117572, 116222, 115901, 116368, 117375, 119259, 122032, 124692, 126260, 127042, 128009, 129333, 130356, 130794, 131083, 131481, 131597, 131101, 130408, 130330, 131292, 133065, 135061, 136712, 137647, 137685, 136753, 134957, 132741, 130816, 129775, 129787, 130662, 132052, 133529, 134630, 135017, 134718, 134304, 134737, 136721, 139940, 143134, 145273, 146471, 147419, 148234, 148441, 147996, 147533, 147446, 147400, 147022, 146496, 146090, 145626, 144851, 143937, 143111, 142084, 140413, 138266, 136263, 134559, 132546, 129655, 126154, 122963, 120830, 119860, 119786, 120402, 121541, 122763, 123516, 123738, 123952]
57478A23952N65N67O3l49l26l30p80j398j829k211k639k689k175j722j787j745
57462A05167q72L01O91L57L10P86R25K61o10j131j483j756j429k93Q32J045N73
57445A03674L42O07P41L22j38J63J212K085K006J215N38K48j32q73j529j604j195
57428A07682n52L73J423J846J178J51n3P24J580J759J168n2j633k873l066k316
57412A07339j406q47n72m27k38M05J681K887L045K169J113K71o88j773k321k015
57396A08623j321o89p9M31M65J33J76Q30J341J108O09N75R37J274J774K845M093
57379A23125M479L507J801M28n2M4q4q32j627j599q01k84p22j550j835j495j120
57362A21383j001q87n12J13Q20J310J252O67J1l77o49r35q90k06O46R35P59R40
$$ y = [123952, 124517, 125084, 125147, 124798, 124472, 124142, 123362, 121964, 120135, 117924, 115285, 112596, 110421, 108699, 106912, 105167, 104295, 104596, 105287, 105644, 105954, 106740, 107665, 107926, 107316, 106185, 104702, 102946, 101517, 101224, 102056, 103101, 103674, 104016, 104623, 105364, 105686, 105548, 105711, 106923, 109008, 111014, 112229, 112767, 113015, 112883, 112010, 110481, 108877, 107682, 107130, 107503, 108926, 110772, 111950, 112101, 112048, 112772, 114352, 116111, 117279, 117227, 115594, 112721, 109655, 107339, 105933, 105086, 104514, 104087, 103849, 104254, 105935, 108822, 111867, 114036, 115149, 115420, 114732, 112959, 110638, 108623, 107302, 106613, 106534, 106965, 107430, 107563, 107739, 108569, 109910, 111018, 111627, 112202, 113139, 114413, 116187, 119032, 123125, 127604, 131111, 132912, 133340, 133288, 133332, 133248, 132416, 130789, 129190, 128389, 128105, 127383, 125833, 123998, 122503, 121383, 120382, 119495, 118983, 119096, 119916, 121226, 122478, 123145, 123156, 122779, 122130, 121195, 120305, 120099, 120745, 121680, 122439, 123379]
57344A23379J734K327J908P26l77j069j597j902j485k98P41O81l10j152j151n36
57328A21619J58O94R13O25k9n12n53m59m61k84J53K57l95j177j231p61o43r53
57310A16961r70n08j73j66J29R70J652J536R00L63L4j91j71J36L49K32J75N94
57292A21852J251J636J705J768J906J990J987J956J884J886K217K742K805K031
57278A49616J003N90Q61J140J085J096J623K475L064L123K964L007L200L052K332
57263A80231J488J101J066P73Q9l94k17K83N01L57K44M25Q31J278J649J859J841
57246A93405J545R65K98n0J15M16K99k28o04m54O0O29J076J308J350J495J895
57229B03520K079J449L09k53L23J434K148K033J080m19j609j485m2J592K541L033
$$ y = [123379, 125113, 127440, 129348, 130074, 129697, 128628, 127031, 125129, 123644, 123346, 124087, 124768, 124458, 123306, 122155, 121619, 121777, 122471, 123384, 124009, 123980, 123468, 122915, 122456, 121995, 121711, 121864, 122121, 121726, 120549, 119318, 118557, 117914, 116961, 115991, 115483, 115310, 115144, 115273, 116243, 117895, 119431, 120331, 120694, 120728, 120537, 120366, 120502, 120851, 121083, 121258, 121852, 123103, 124739, 126444, 128212, 130118, 132108, 134095, 136051, 137935, 139821, 142038, 144780, 147585, 149616, 150619, 151209, 152070, 153210, 154295, 155391, 157014, 159489, 162553, 165676, 168640, 171647, 174847, 177899, 180231, 181719, 182820, 183886, 184659, 184748, 184354, 184137, 184420, 184921, 185278, 185522, 185947, 186778, 188056, 189705, 191564, 193405, 194950, 195915, 196213, 196163, 196278, 196694, 196993, 196765, 196161, 195707, 195767, 196396, 197472, 198780, 200130, 201625, 203520, 205599, 207048, 207357, 207104, 207427, 208861, 211009, 213042, 214122, 213703, 212094, 210609, 210567, 212159, 214700, 217733]
57213B17733L458L462K704J918K230L774N608O881P433P565P770Q480R552J0267
57199B98835J0336J0482J1452J2784J3407J3172J3024J3637J4725J5790J6850
57188D44494J8155J9763K1629K3707K5762K7421K8638K9745L0909L1820L2250
57177G34293L2657L3803L5739L7588L8488L8484L8056L6987L4401L0193K5677
57166A116366K2283K0151J8699J8058J8840K0756K2646K3995K5321K6855K8098
57155A362068K9008L0467L2818L5033L6052L6170L6243L6415L6442L6525L6856
57144A744097L6938L6374L5794L6142L7496L9378M1624M4040M5841M6553M7000
57133B191277M8282N0214N1873N3299N5472N8869O3134O7985P3337P8767Q3954
$$ y = [217733, 221191, 224653, 227357, 229275, 231505, 235279, 240887, 247768, 255201, 262766, 270536, 279016, 288568, 298835, 309171, 319653, 331105, 343889, 357296, 370468, 383492, 397129, 411854, 427644, 444494, 462649, 482412, 504041, 527748, 553510, 580931, 609569, 639314, 670223, 702043, 734293, 766950, 800753, 836492, 874080, 912568, 951052, 989108, 1026095, 1060496, 1090689, 1116366, 1138649, 1158800, 1177499, 1195557, 1214397, 1235153, 1257799, 1281794, 1307115, 1333970, 1362068, 1391076, 1421543, 1454361, 1489394, 1525446, 1561616, 1597859, 1634274, 1670716, 1707241, 1744097, 1781035, 1817409, 1853203, 1889345, 1926841, 1966219, 2007843, 2051883, 2097724, 2144277, 2191277, 2239559, 2289773, 2341646, 2394945, 2450417, 2509286, 2572420, 2640405, 2713742, 2792509, 2876463]
57122B876463Q9392R5586J01966J07810J13862J21503J30516J39273J47195J55468
57112D079034J65211J76517J89567K05099K23377K44299K68950K99472L36915
57103F188441L80882M32067M93661N69761O64247P82234R30908J117742J349429
57094A2909372J633138J976026K380611K840994L344056L871730M399852M897359
57086C8253138N330725N670254N893028N985258N945039N773870N449933M907220
57078H3208465M059585K869521J404883j73600j686177l005667m077288m894032
57070G7705690n466091n807401n935776n875777n659690n325867m914099m460150
57062C4260839l992948l534866l102391k706110k351301k039544j769788j538526
$$ y = [2876463, 2965855, 3061441, 3163407, 3271217, 3385079, 3506582, 3637098, 3776371, 3923566, 4079034, 4244245, 4420762, 4610329, 4815428, 5038805, 5283104, 5552054, 5851526, 6188441, 6569323, 7001390, 7495051, 8064812, 8729059, 9511293, 10442201, 11559943, 12909372, 14542510, 16518536, 18899147, 21740141, 25084197, 28955927, 33355779, 38253138, 43583863, 49254117, 55147145, 61132403, 67077442, 72851312, 78301245, 83208465, 87268050, 90137571, 91542454, 91368854, 89682677, 86677010, 82599722, 77705690, 72239599, 66432198, 60496422, 54620645, 48960955, 43635088, 38720989, 34260839, 30267891, 26733025, 23630634, 20924524, 18573223, 16533679, 14763891, 13225365]
57054A3225365j340637j171259j026818r04270q00071p10456o32301n63289n01619
57045E574645m46080l96276l52247l13723k79877k49732k22674j98572j77357
57036B938107j58525j41236j25111j10565r7915q6444p4916o2760m9967l5925
57026A994743j9500n74J9323L8031N2869N9096N0211K2639j9293o4303j00873
57015B032369j23172j31567j29428j20428j07710r3866q0827o9676o0554n2925
57005A062216m6208m0306l5399l1436k8117k5277k2958k1144j9687j8458j7361
56994G55865j6256j5087j3908j2592j0818q571o324m313k028J050M505P252Q522
56981F87297P987N287K28o527j3561j9540k3612k5359k5017k3474k1492j9100
$$ y = [13225365, 11884728, 10713469, 9686651, 8782381, 7982310, 7271854, 6639553, 6076264, 5574645, 5128565, 4732289, 4380042, 4066319, 3786442, 3536710, 3314036, 3115464, 2938107, 2779582, 2638346, 2513235, 2402670, 2304755, 2218311, 2143395, 2080635, 2030668, 1994743, 1975243, 1974669, 1993992, 2032023, 2084892, 2143988, 2194199, 2216838, 2197545, 2133242, 2032369, 1909197, 1777630, 1648202, 1527774, 1420064, 1326198, 1245371, 1175695, 1115141, 1062216, 1016008, 975702, 940303, 908867, 880750, 855473, 832515, 811371, 791684, 773226, 755865, 739609, 724522, 710614, 698022, 687204, 678633, 672309, 667996, 665968, 667018, 671523, 678775, 687297, 695284, 700571, 700799, 694272, 680711, 661171, 637559, 612200, 587183, 563709, 542217, 523117]
56969E23117j6279j3739j2044j0415p572l625Q3L046O190J0167J4379J8145K1514
56956E32967K4166K4550K1042J3542L443p313j6734k3286k6773k8217k8400k7072
56944D61915k4008j9940j5753j1576p419l928j503P50M154Q911J4259J9728K5258
56931D50848L0326L3820L4593L1518K3524J0778m285j8157k8598l5177l7985l7157
56919D54048l3783k9870k6694k3892k0657j7092j3871j1316r404q177p437o456
56907B45399m764k966k106k266k411j727m71O23J291J746K195K790L858N645P834
56892B54670R817J1510J3439J5886J8408K0532K2403K4125K4789K2864J7585R554
56880D65582J33r061j6272k0164k0803j9557j7673j5335j2253q568m750r77K935
$$ y = [523117, 506838, 493099, 481055, 470640, 463068, 459443, 459526, 462572, 468762, 478929, 493308, 511453, 532967, 557133, 581683, 602725, 616267, 619710, 612397, 595663, 572377, 545604, 517387, 488987, 461915, 437907, 417967, 402214, 390638, 383219, 379291, 377788, 378538, 382692, 391603, 405862, 425590, 450848, 481174, 514994, 549587, 581105, 604629, 615407, 611122, 592965, 564367, 529190, 491205, 454048, 420265, 390395, 363701, 339809, 319152, 302060, 288189, 276873, 267469, 259292, 251855, 245399, 240635, 237669, 235563, 233297, 230886, 229159, 228688, 229311, 230602, 232348, 234543, 237333, 241191, 246836, 254670, 264487, 275997, 289436, 305322, 323730, 344262, 366665, 390790, 415579, 438443, 456028, 465582, 465715, 456654, 440382, 420218, 399415, 379858, 362185, 346850, 334597, 326029, 321279, 320302, 323237]
56867C23237P244J2177J7806K3850K9948L6263M3243N0498N6327N8598N5662M6381
56855G61234L0516R978j0978k7966l9046m4683m5875m3271l7844l1151k4337j7425
56843D79152r839j374P527J6155K4282L2706M2875N5417O9157Q1861R1560R6450
56831I85929R3835Q0538N5473K1684j4501m6468o9911q3460q7867q4947p6999
56820G73306o6402n5092m4009l3297k3050j3626n110L088J1746K1223L1544M2558
56808F42879N3515O2645O7711O6783N8334M1387J6806j1510l7705n7058o8096
56797H35691p1978p0561o5293n7335m8055l8988l1268k4936j9087j2892o418k03
56785C88677N704J1836J8480K5217L1160L5196L5970L2219K3502J0673m330j8969
$$ y = [323237, 330481, 342658, 360464, 384314, 414262, 450525, 493768, 544266, 600593, 659191, 714853, 761234, 791750, 801728, 790750, 762784, 723738, 679055, 633180, 589909, 552065, 520914, 496577, 479152, 469313, 467939, 475466, 491621, 515903, 548609, 591484, 646901, 716058, 797919, 889479, 985929, 1079764, 1160302, 1215775, 1237459, 1222958, 1176490, 1106579, 1023119, 935252, 850305, 773306, 706904, 651812, 607803, 574506, 551456, 537830, 532720, 535808, 547554, 568777, 600321, 642879, 696394, 759039, 826750, 893533, 951867, 993254, 1010060, 998550, 960845, 903787, 835691, 763713, 693152, 627859, 570524, 522469, 483481, 452213, 427277, 408190, 395298, 388880, 388677, 394381, 406217, 424697, 449914, 481074, 516270, 552240, 584459, 607961, 618634, 614304, 595335]
56773E95335l0815l8459m2014m2515m0780l7179l2297k7204k2811j9295j6415
56762B45551j4051j2189j0626r080p560o447o041o096n877m879l495k749l127
56749A53334l906l911k868j621j071j273j677j895j918j740j177k27O10P03J25
56734A31488k75J08P93Q58K53j58R5M72L62k4q9K57P29J177J489J346P15K16M44
56715A40256J048J138M72k97n40k25L94J084J571J603J303J114J272J542J535
56700A53270J115M56j36m93p06r07r72o57j11J76M0j13M7K98K96R3q4j40L2N94
56680A52098J271J431R13L28J11k4k50k9R05J720J552Q05M35M68L11O4L18Q52
56662A63279Q40K86J05O32J120R82N50L98O61J231J869K066J514Q05Q46J503J719
$$ y = [595335, 564520, 526061, 484047, 441532, 400752, 363573, 331276, 304072, 281261, 261966, 245551, 231500, 219311, 208685, 199605, 192045, 185598, 179557, 173461, 167584, 162705, 159210, 156461, 153334, 149428, 145517, 142649, 141028, 139957, 138684, 137007, 135112, 133194, 131454, 130277, 130050, 130660, 131363, 131488, 131213, 131321, 132114, 132972, 133225, 133067, 133162, 133634, 133996, 133972, 133883, 134140, 134869, 136046, 137535, 138881, 139596, 139812, 140256, 141304, 142442, 142914, 142617, 142077, 141852, 142246, 143330, 144901, 146504, 147807, 148921, 150193, 151735, 153270, 154385, 154841, 154705, 154212, 153506, 152599, 151627, 150970, 150859, 151035, 151075, 150962, 151009, 151307, 151603, 151696, 151612, 151472, 151504, 152098, 153369, 154800, 155713, 156041, 156152, 156128, 155878, 155849, 156754, 158474, 160026, 160831, 161266, 161734, 162045, 162109, 162427, 163279, 164119, 164405, 164510, 165142, 166262, 167244, 167794, 168192, 168853, 170084, 171953, 174019, 175533, 176338, 177184, 178687, 180406]
56645A80406J050J91k03k65k59n1L49N25K74j39n71j169j702j586q41k90m28q06
56627A74485q73o92n09k60J0n6n06q49q54j007j691k517k860k590j921j021j78
56610A56111J96R3j4O4p3o07j006p66j94Q5j3j13l4P7M8j71m86n37N9J199K244
56589A56162K672K491K018J544J256J138R55O11L84M23L02l12q64n32N01J321
56573A70070J657J963K234J847Q57K97Q51K098L366M458N243N525N665O431P863
56558B20425R212J0192J1201J1999J1431R096O083L413Q69j738l387l118j710
56545B83968q63j181j908k301k364k475k862l366l422k684j783j716k371k630
56531B52042k203k068k701l193k903k670l240l730k984j483n86o45j093j693k392
$$ y = [180406, 181456, 181647, 181444, 181179, 180920, 180869, 181218, 181743, 182017, 181878, 181307, 180138, 178436, 176850, 176009, 175719, 175291, 174485, 173612, 172920, 172411, 172151, 172161, 172105, 171599, 170750, 169896, 168889, 167198, 164681, 161821, 159231, 157310, 156289, 156111, 156307, 156400, 156386, 156450, 156377, 155770, 154764, 153998, 153804, 153889, 153876, 153763, 153729, 153806, 153854, 153683, 153197, 152660, 152719, 153918, 156162, 158834, 161325, 163343, 164887, 166143, 167281, 168236, 168847, 169231, 169654, 169956, 169644, 168780, 168248, 168749, 170070, 171727, 173690, 175924, 177771, 178628, 178925, 179776, 181874, 185240, 189698, 194941, 200466, 206131, 212562, 220425, 229637, 239829, 251030, 263029, 274460, 283556, 289639, 293052, 293921, 292183, 288796, 285678, 283968, 283105, 281924, 280016, 277715, 275351, 272876, 270014, 266648, 263226, 260542, 258759, 257043, 254672, 252042, 249839, 247771, 245070, 241877, 238974, 236304, 233064, 229334, 226350, 224867, 224281, 223636, 222543, 220850, 218458]
56516B18458k590j903j146j231j597j086M7M24m17j615k417k780k681k052j370
56501A96044j194j166n59L42N60M1k87q8l3m73q13o01k15r5p0J43L63K87m6l76
56481A91764m97l31k9J09P0J95N07M41k53q12l86P93J813K248K218J730Q83L07
56463B00770N00R95J021P16P75J197J357J048N59n3p90j119n76K57M15N1J57R02
56445B08182J474J475J404J547J515J083N68K25n2k32j99k27n92r01o34k90q38
56428B13508k036k497j540K7J216J857K045J655Q37K01M7R1J41M12R47J419J707
56411B20037J991K116J619N48m34r19j086j070p38j97J66K85M30N48K91k88o64
56394B22635n20M0Q25J516J589J018P63J571K665K655J572O94N18L71R7N69J979
$$ y = [218458, 215868, 213965, 212819, 211588, 209991, 208905, 208952, 209376, 208959, 207344, 204927, 202147, 199466, 197414, 196044, 194850, 193684, 193125, 193467, 194027, 194068, 193781, 193693, 193660, 193187, 192374, 191773, 191558, 191463, 191393, 191536, 191899, 192186, 192140, 191764, 191267, 190936, 190907, 191016, 191086, 191281, 191788, 192229, 191976, 191164, 190778, 191571, 193384, 195632, 197850, 199580, 200463, 200770, 201270, 202265, 203286, 204002, 204777, 205974, 207331, 208379, 208938, 208885, 208095, 206976, 206400, 206657, 207072, 207123, 207280, 208182, 209656, 211131, 212535, 214082, 215597, 216680, 217248, 217473, 217421, 217189, 216990, 216763, 216171, 215270, 214636, 214346, 213508, 211472, 208975, 207435, 207462, 208678, 210535, 212580, 214235, 215072, 215273, 215320, 215411, 215552, 215964, 216911, 218330, 220037, 222028, 224144, 225763, 226311, 225877, 224958, 223872, 222802, 222064, 221867, 222033, 222318, 222748, 223296, 223587, 223299, 222635, 222115, 222155, 222980, 224496, 226085, 227103, 227866, 229437, 232102, 234757, 236329, 237023, 237541, 237912, 238009, 238578, 240557]
56377B40557L038K597J118j60o20l01N76J407J335K41q68r97k14P62J409J489
56361B51369R22N0m31j39N92J169J309J160J158J635K217J959O82l89j41P80R64
56344B64866M01K66Q26J171J109J673L204M508M594M009L660L422K795K059J874
56329C00437K272K735K907K734K369K183K514L137L523L521L271K609J437M76
56315C36125N81J344J476O91K6J31N01P02J118J984K788L142L349L679L970M314
56299C65921N168O444P356P458O965N993M532L292L325M485N456N601N568N771
56285D43335N660N007M652N345O877Q756J0649J1882J1826J1112J1187J2242J3013
56272E61543J3000J3244J4447J5919J7164J8822K1154K3228K4586K6225K8907
$$ y = [240557, 243595, 246192, 247310, 247150, 246530, 246229, 246805, 248212, 249547, 249788, 248920, 247923, 247709, 248471, 249880, 251369, 252291, 252341, 251910, 251771, 252363, 253532, 254841, 256001, 257159, 258794, 261011, 262970, 263652, 263263, 263122, 263902, 264866, 265267, 265533, 266359, 267530, 268639, 270312, 273516, 278024, 282618, 286627, 290287, 293709, 296504, 298563, 300437, 302709, 305444, 308351, 311085, 313454, 315637, 318151, 321288, 324811, 328332, 331603, 334212, 335649, 336125, 336706, 338050, 339526, 340217, 340243, 340374, 340875, 341577, 342695, 344679, 347467, 350609, 353958, 357637, 361607, 365921, 371089, 377533, 384889, 392347, 399312, 405305, 409837, 413129, 416454, 420939, 426395, 431996, 437564, 443335, 448995, 454002, 458654, 463999, 470876, 479632, 490281, 502163, 513989, 525101, 536288, 548530, 561543, 574543, 587787, 602234, 618153, 635317, 654139, 675293, 698521, 723107, 749332, 778239]
56261G78239L1928L4650L7764M1865M6250N0463N5639O2969P1941Q1521R1915
56250A385144J03721J16372J28976J41833J55651J69891J83192J94813K04435
56241B784028K11243K14326K13455K08391J98162J82009J60327J33783J02526
56232D408250O7285L0270o283m1635p5392j05888j31202j51167j66930j78981
56222C648327j86862j90446j90318j87092j81329j73765j64891j54769j43874
56213B074981j33404j24028j15101j05924r6899q8688q1163p4077o7822o2458
56203A125417n7059n1022m5161m0440l6555l2823k9444k6781k4335k1685j9503
56192G40609j8359j7442j5711j3512j1773j0464r114q014p535p058n950m887m805
$$ y = [778239, 810167, 844817, 882581, 924446, 970696, 1021159, 1076798, 1139767, 1211708, 1293229, 1385144, 1488865, 1605237, 1734213, 1876046, 2031697, 2201588, 2384780, 2579593, 2784028, 2995271, 3209597, 3423052, 3631443, 3829605, 4011614, 4171941, 4305724, 4408250, 4475535, 4505805, 4499522, 4457887, 4382495, 4276607, 4145405, 3994238, 3827308, 3648327, 3461465, 3271019, 3080701, 2893609, 2712280, 2538515, 2373624, 2218855, 2074981, 1941577, 1817549, 1702448, 1596524, 1499625, 1410937, 1329774, 1255697, 1187875, 1125417, 1068358, 1017336, 972175, 931735, 895180, 862357, 832913, 806132, 781797, 760112, 740609, 722250, 704808, 689097, 675585, 663812, 653348, 644234, 636220, 628685, 621627, 615677, 610790, 605985]
56179F05985n209m874l686k508j764j276r73o89M5J086J371N46q2O46J960K527
56163E93105K551L118M226N013N343N770O458P247Q272R488J0247J0330J0618
56150F81786J1846J3589J5303J7331J9970K2754K5711L0056L6478M4039N1745
56139I70608N9778O8025P5082P9991Q3267Q4854Q2909P6457O7474N8652N0757
56128A757854M3962L9643L8360L7771L4968K9677K3002J4885N365l319q921j2549
56116B000698j7130k3633l1294m0364n1581o3592p3715q0763q4828q5225q1192
56105A367381p3968o5680n6935m7649l9117l2662k7379k1782j6611j3342j1161
56094I61095q358n513m215l703k062J51R53Q08J984M532O248O433O419O669O463
$$ y = [605985, 600776, 595902, 592216, 589708, 587944, 586668, 585695, 585006, 585051, 586137, 587508, 588054, 587972, 588618, 590578, 593105, 595656, 598774, 603000, 608013, 613356, 619126, 625584, 632831, 641103, 650591, 660838, 671168, 681786, 693632, 707221, 722524, 739855, 759825, 782579, 808290, 838346, 874824, 918863, 970608, 1030386, 1098411, 1173493, 1253484, 1336751, 1421605, 1504514, 1580971, 1648445, 1707097, 1757854, 1801816, 1841459, 1879819, 1917590, 1952558, 1982235, 2005237, 2020122, 2025487, 2022168, 2013247, 2000698, 1983568, 1959935, 1928641, 1888277, 1836696, 1773104, 1699389, 1618626, 1533798, 1448573, 1367381, 1293413, 1227733, 1170798, 1123149, 1084032, 1051370, 1023991, 1002209, 985598, 972256, 961095, 952737, 947224, 943009, 939306, 937244, 937395, 938348, 939156, 941140, 945672, 951920, 958353, 964772, 971441, 977904]
56079I77904O242P183Q657R009Q531Q845R873J0321J0515J1698J3171J3306J2712
56066A107967J3244J4607J5194J5428J6803J8552J8878J8602J9706K1226K0678
56055A300885J8790J8456J9544J9225J7138J5743J5708J5397J4843J5805J7844
56044A489378J8766J8947K0730K3665K4928K4492K5100K7126K8233K8305K9669
56033A759339L2209L3364L3346L5152L8886M1304M1654M2610M4699M5264M3973
56022B191800M3961M6200M7934M7969M8555N0874N3452N5962N9704O3739O5728
56011B775878O6884P0683P6384P9859Q0990Q3831Q9073R3176R5646J00100J07117
56000C719621J13255J18249J25798J36055J44822J51496J60043J70897J80000
$$ y = [977904, 984146, 991329, 999986, 1008995, 1017526, 1026371, 1036244, 1046565, 1057080, 1068778, 1081949, 1095255, 1107967, 1121211, 1135818, 1151012, 1166440, 1183243, 1201795, 1220673, 1239275, 1258981, 1280207, 1300885, 1319675, 1338131, 1357675, 1376900, 1394038, 1409781, 1425489, 1440886, 1455729, 1471534, 1489378, 1508144, 1527091, 1547821, 1571486, 1596414, 1620906, 1646006, 1673132, 1701365, 1729670, 1759339, 1791548, 1824912, 1858258, 1893410, 1932296, 1973600, 2015254, 2057864, 2102563, 2147827, 2191800, 2235761, 2281961, 2329895, 2377864, 2426419, 2477293, 2530745, 2586707, 2646411, 2710150, 2775878, 2842762, 2913445, 2989829, 3069688, 3150678, 3234509, 3323582, 3416758, 3512404, 3612504, 3719621, 3832876, 3951125, 4076923, 4212978, 4357800, 4509296, 4669339, 4840236, 5020236]
55991E020236J87285J97607K11762K25311K37800K53938K74040K93172L11495
55982G212646L35149L64826L94446M23377M58403N00992N44984N89905O43643
55973A1468371P08562P78509Q53327R41959J047392J164053J294421J451604J641000
55964B1349198J857871K108587K414705K791045L242869L792509M485599N365683
55956D7408066O472221P872125R661716J1933677J4785525J8356547K2759402
55949A39249279K7894876L3342104L8404473M2108526M3077880L9681494L0838441
55942C94597073J7054064O68829j5110837k7652189l5714036l9336361l9309860
55935B55196683l6731516l2717764k8189314k3759340j9763028j6345232j3520000
$$ y = [5020236, 5207521, 5405128, 5616890, 5842201, 6080001, 6333939, 6607979, 6901151, 7212646, 7547795, 7912621, 8307067, 8730444, 9188847, 9689839, 10234823, 10824728, 11468371, 12176933, 12955442, 13808769, 14750728, 15798120, 16962173, 18256594, 19708198, 21349198, 23207069, 25315656, 27730361, 30521406, 33764275, 37556784, 42042383, 47408066, 53880287, 61752412, 71414128, 83347805, 98133330, 116489877, 139249279, 167144155, 200486259, 238890732, 280999258, 324077138, 363758632, 394597073, 411651137, 412319966, 397209129, 369556940, 333842904, 294506543, 255196683, 218465167, 185747403, 157558089, 133798749, 114035721, 97690489, 84170489]
55928H4170489j1217791r347605p836134o619160n628947m810193m132508l574096
55920C1004055l107125k708559k369762k084227j837920j619975j430496j269316
55912A4576675j128187j001248q91904q01919p24015o52207n89499n38482m93732
55903G755482m50322m11207l79426l51010l22080k95522k74484k56022k36958
55894D778451k19564k05981j93191j78711j65427j55809j47008j36422j26592
55885C249746j19894j13594j04805r5421q7788q0330p1861o5616o4578o6712o8732
55874B310415p0654p2981p3600p1292o8585o7548o6268o2844n9121n7077n5057
55863A585388n1047m6419m3134m0235l6371l2895l1513l1326l0807l0131k9453
$$ y = [84170489, 72952698, 63605093, 55768959, 49149799, 43520852, 38710659, 34578151, 31004055, 27896930, 25188371, 22818609, 20734382, 18896462, 17276487, 15845991, 14576675, 13448488, 12447240, 11555336, 10753417, 10029402, 9377195, 8787696, 8249214, 7755482, 7305160, 6893953, 6514527, 6163517, 5841437, 5545915, 5271431, 5015409, 4778451, 4558887, 4352906, 4159715, 3981004, 3815577, 3659768, 3512760, 3376338, 3249746, 3129852, 3016258, 2911453, 2816032, 2728244, 2647914, 2576053, 2510437, 2445859, 2379147, 2310415, 2239761, 2166780, 2093180, 2021888, 1953303, 1885755, 1819487, 1756643, 1697522, 1640445, 1585388, 1534341, 1487922, 1444788, 1404553, 1368182, 1335287, 1303774, 1272448, 1241641, 1211510, 1182057]
55852A182057k7607k4633k2670k2529k2327k1181k0907k2304k3306k2765k2428
55841I29400k3130k2734k0171j7797j7336j7083j5626j4607j5097j4939j2626
55830G38254j0415j0391j0817r513p759p515p699o712n999p556j0139j1308j1281
55817F21150j1558j1765j0846r701r580r553q278o690o258o183m877k750j100
55804E22011K19J753K768K849L473N714P987Q275O961N361L385P74j192j633k040
55789E66665l936o228p083o812o602o131m775l593l793m724n537p097r983j2298
55775D78073j1992r728p118l826R94O069R613J2131J4755J6048J3405O861j068
55762E24217q502j4705j8496j8943j7227j5493j4207j2590j0854r975r948j0239
$$ y = [1182057, 1154450, 1129817, 1107147, 1084618, 1062291, 1041110, 1020203, 997899, 974593, 951828, 929400, 906270, 883536, 863365, 845568, 828232, 811149, 795523, 780916, 765819, 750880, 738254, 727839, 717448, 706631, 697118, 689359, 681844, 674145, 667433, 661434, 653878, 643739, 632431, 621150, 609592, 597827, 586981, 577280, 567700, 558147, 549869, 543179, 536921, 530738, 525861, 523111, 522011, 522230, 523983, 526751, 529600, 533073, 538787, 546774, 555049, 562010, 567371, 570756, 571530, 570338, 568705, 566665, 562729, 556501, 549418, 542606, 536004, 529873, 525098, 521505, 517712, 512988, 507451, 500354, 490371, 478073, 466081, 456353, 449235, 445409, 446403, 452472, 462085, 474216, 488971, 505019, 518424, 525285, 524217, 515715, 501010, 482514, 463571, 446344, 430851, 416644, 404054, 393200, 383225, 373277, 363038]
55750C63038j1122j2649j3305j1741r028p129o122m944l831l715m029l442k096
55737B69885j058k75Q98J839J487K93n90j315k582l790m066m164n129o007n323
55722B40103l921l830m870n034l829k700k281j700n07Q57K428M535O431P141P297
55707B40120Q030Q514O997L942J658P76m08k928n823q074r629j0193r130p098
55693B16754n786n585n246m156l104k507j751p80m81r21r14J07J350K279L414
55678A92673M937O016O144N818N331M175K240M14o19j111j435j496j363j517k058
55663B18149k468k327j583k37J389K338J997J177J084J503J306N13L61J321K418
55648B26941K675J980N55j168k149j689p66j084k688l971m150m212n050o119o498
$$ y = [363038, 351916, 339267, 325962, 314221, 305193, 298064, 291942, 286998, 283167, 279452, 275423, 271981, 269885, 268827, 268552, 269450, 271289, 272776, 273069, 272479, 271164, 268582, 264792, 260726, 256562, 251433, 245426, 240103, 236182, 232352, 227482, 222448, 218619, 215919, 213638, 211938, 211431, 212288, 214716, 219251, 225682, 232823, 240120, 248150, 256664, 263661, 267603, 269261, 270037, 269629, 266701, 260878, 252804, 243175, 232982, 223852, 216754, 210968, 205383, 200137, 195981, 192877, 190370, 188619, 187839, 187358, 186437, 185523, 185630, 186980, 189259, 192673, 197610, 203626, 209770, 215588, 220919, 225094, 227334, 227748, 227129, 226018, 224583, 223087, 221724, 220207, 218149, 215681, 213354, 211771, 211534, 212923, 215261, 217258, 218435, 219519, 221022, 222328, 222841, 223202, 224523, 226941, 229616, 231596, 232151, 230983, 228834, 227145, 226379, 225295, 222607, 218636, 214486, 210274, 205224, 199105, 192607]
55633A92607o127n463m786m243l870l394k702k284k393k244j101K26L46o19j329
55618A52624j349j420j810k063k288l011l748l403k183j379j225p53L6j8r59j284
55602A25767n19j52j113k211k164j531j363j415j041o17p79j187j226j065j014
55587A08370o30M59J565J807J369J083J191J376J457J476J489J700K366L243L764
55572A32085L950M351M974N253N301N921P031P342O271M816L791K488J80k217
55558A91537l321l335l607m640n716o144n851m954l704k745k627l088l337k952
55544A35516k153j376r70j029j217j010l43L42P55J042J260J198Q81O42N27K97
55528A34362O4K10N13K61n92j344j834k680l831m149l151j955j666j884j807j760
$$ y = [192607, 186480, 181017, 176231, 171988, 168118, 164724, 162022, 159738, 157345, 155101, 154000, 154226, 154572, 153953, 152624, 151275, 149855, 148045, 145982, 143694, 140683, 136935, 133532, 131349, 129970, 128745, 127992, 128028, 128010, 127051, 125767, 125248, 125096, 123983, 121772, 119608, 118077, 116714, 115299, 114258, 113641, 112862, 111675, 110449, 109384, 108370, 107740, 108199, 109764, 111571, 112940, 114023, 115214, 116590, 118047, 119523, 121012, 122712, 125078, 128321, 132085, 136035, 140386, 145360, 150613, 155914, 161835, 168866, 176208, 182479, 187295, 191086, 193574, 193754, 191537, 188216, 184881, 181274, 176634, 170918, 164774, 158923, 153969, 150265, 147520, 144893, 141805, 138468, 135516, 133363, 131987, 131017, 129988, 128771, 127761, 127418, 127760, 128515, 129557, 130817, 132015, 132896, 133538, 134065, 134362, 134426, 134636, 135149, 135410, 134818, 133474, 131640, 128960, 125129, 120980, 117829, 115874, 114208, 112324, 110517, 108757]
55512A08757k373l074k807j777j121j152j122o88l67m69n55k16L33O68N56q1j113
55495I3399j988k072j348m64o6l07q46j051m47O55J180M50q49j359o26N18J137
55478H5916J197J216J369J321Q40K06j24j15j21k99l30nL27K90J72M69R11O68
55460I3908m19j487j780j465j051o03J1N55O14J81l30n09k61Q4j6o75j163o48
55442H4946N74J227N96n85j113o77O5L88J48k28j77L55O96K95l17q3R82J601R62
55423H9655j88o22j86L87O44P04P19P53R89J540K093K211J891J438R82M64l1l28
55405A03115n03q44j436k025k347k415k433k445k190j463n99l03p60j246j011
55390H1095k90J12K2J9M28Q59R06O96N34N33P25J094J412J417J208R97N81l40
$$ y = [108757, 106384, 103310, 100503, 98726, 97605, 96453, 95331, 94643, 94276, 93807, 93252, 93036, 93369, 94037, 94593, 94512, 93399, 91411, 89339, 87991, 87527, 87461, 87154, 86308, 85257, 84810, 85465, 86645, 87095, 86246, 84887, 84261, 84779, 85916, 87113, 88329, 89698, 91019, 91859, 92065, 91941, 91826, 91705, 91406, 91076, 91071, 91398, 91688, 91860, 92329, 93240, 93908, 93489, 92002, 90222, 88757, 87706, 87103, 87114, 87669, 88283, 88464, 88134, 87625, 87364, 87448, 87432, 86757, 85594, 84946, 85520, 86747, 87343, 86758, 85645, 84968, 85033, 85421, 85569, 85341, 85164, 85519, 86215, 86510, 86193, 86110, 87092, 88693, 89655, 89467, 88845, 88659, 89046, 89690, 90394, 91113, 91866, 92855, 94395, 96488, 98699, 100590, 102028, 103010, 103474, 103443, 103115, 102612, 101768, 100332, 98307, 95960, 93545, 91112, 88667, 86477, 85014, 84415, 84112, 83352, 82106, 81095, 80805, 80917, 80939, 80958, 81386, 82245, 83151, 83847, 84381, 84914, 85639, 86733, 88145, 89562, 90770, 91767, 92348, 92008]
55372I2008j389j764j371q91o10q1P76J146M95m88q12n26m61r73j539j518q19
55355H1183J51Q85J131R97O96L04j34m46n64o55o78k54N15O94k66j345j182j32
55337H0900J87o00j124n42K54L59L58J094K084K237J482N67j51p66j120r49m87
55320H3783j96j53k10l86n73k90O69J711K113J819J093j3j246j763j000L26R20
55303H6604M64j67j32M92J055J112Q05O57R19J166Q52K33O7L85L21m67j095p35
55285I2536J22M19l0o25j006j248j322j078o58k96P7O63J319J660J439O46m53
55268I2165j295j451j221j226j356r38j15L2p61j218m01P45P91K9o0R37J902J882
55250H8441J097K01n20r99j122q22j71O37J155Q99j4q33j067j012j033r64o86
$$ y = [92008, 90619, 88855, 87484, 86593, 85983, 85902, 86678, 87824, 88319, 87831, 87019, 86493, 86032, 85059, 83520, 82002, 81183, 81334, 82219, 83350, 84347, 85043, 85347, 85213, 84767, 84203, 83548, 82870, 82616, 83131, 83825, 83559, 82214, 81032, 80900, 81087, 80487, 79363, 78821, 79075, 79434, 79792, 80886, 82970, 85207, 86689, 87256, 87105, 86339, 85219, 84270, 83783, 83587, 83434, 83224, 82838, 82265, 81975, 82644, 84355, 86468, 88287, 89380, 89367, 88121, 86358, 85358, 85684, 86604, 87068, 86901, 86769, 87261, 88316, 89428, 90233, 90890, 91809, 92975, 93827, 94060, 94127, 94512, 94833, 94366, 93271, 92536, 92658, 93077, 93047, 92422, 91416, 90168, 88846, 87768, 87110, 86814, 86891, 87554, 88873, 90533, 91972, 92618, 92165, 90870, 89419, 88198, 86972, 85616, 84678, 84563, 84595, 83834, 82616, 82215, 82960, 83751, 83780, 83720, 84657, 86559, 88441, 89538, 89739, 89219, 88220, 87098, 86276, 86105, 86742, 87897, 88796, 88782, 87949, 86882, 85870, 84837, 83873, 83187]
55233H3187n96q06o01N16J735J876J014K31J28L96N98M90j40j099j480o38P44
55216H5555J431J274J145J355J240M20m93p72m80q6K05M34N68N60M77M49M85M28
55198I4195J27k61k24M20R63N73m54r91p55o22r70r03J54J272J339O71J90p6m68
55179I4180n18L38J431J638J060N68J37q83k080k165r42L21O42K83j78n18n09
55162I2805QN53M62J7M2M47L70j99k58M89J046O60k30r57j456j698j363n65O1
55143I0234L22O40R12M14p23j148j67J087J251N39J5j08l64q46j164j264j309
55126H8321j024m8J225J919J745J138M40l24q48n06P52J979K182J443P26N67M65
55109A00152k61j299j582o76O12J197R09L96K36N78J262J853J789R57k9m98l84
$$ y = [83187, 82591, 81785, 81184, 81700, 83435, 85311, 86325, 86556, 86684, 87080, 87678, 88168, 88028, 86929, 85449, 84811, 85555, 86986, 88260, 89405, 90760, 92000, 92420, 91927, 91155, 90675, 90589, 90794, 91228, 91796, 92356, 92833, 93282, 93767, 94195, 94322, 94061, 93837, 94257, 95220, 95793, 95339, 94348, 93593, 92971, 92001, 91098, 91252, 92524, 93863, 94534, 94724, 94648, 94180, 93662, 94000, 95431, 97069, 98129, 98697, 98834, 97951, 95871, 93706, 92764, 93085, 93727, 94010, 93832, 93314, 92805, 92813, 93366, 93828, 93845, 93887, 94334, 94704, 94505, 94247, 94736, 95782, 96442, 96212, 95255, 93799, 92101, 90738, 90173, 90234, 90556, 91196, 92108, 92522, 91799, 90651, 90484, 91571, 92822, 93361, 93376, 93268, 92904, 92058, 90894, 89630, 88321, 87297, 87249, 88474, 90393, 92138, 93276, 93716, 93392, 92544, 92038, 92790, 94769, 96951, 98394, 99120, 99687, 100152, 99891, 98592, 97010, 96334, 96946, 98143, 99052, 99448, 99684, 100262, 101524, 103377, 105166, 106123, 106094, 105596, 105212]
55092A05212M3O08J018P89qm32J25R16Q77J66k53j79k28n31n92l12j49k29k94
55073A06547m44q99j112l53R12J423J059J012J769K299J744O05l15r96j547j513
55057A10191p67j89n21j257j449j104r32j161j331j049l32N46J213J373J141Q57
55041A05229N55op24j138j128j047j027q18m14j27O0M75R69R63M63Q3o0m93j198
55022A00617j375p66j17J29L99P96N81l29o89K27J264J074K20J16O57N01o01j335
55004A01369p51N87J640K088K122J840J288O41R6k22j92J93O55Q09N39J04j05
54987A12701J12N14N63J04k70lM39J11r58j713j521q01k9Q06J477J349M63k09
54969A13135k00j46m71n48j8K83k38o68m9Q73P92L8M0R88J636J330P84O73P15
$$ y = [105212, 105255, 105863, 106881, 107670, 107662, 107230, 107355, 108271, 109148, 109314, 109061, 108882, 108654, 108123, 107531, 107219, 107070, 106841, 106547, 106103, 105204, 104092, 103739, 104651, 106074, 107133, 108145, 109914, 112213, 113957, 114562, 114247, 113251, 111704, 110191, 109424, 109235, 108714, 107457, 106008, 104904, 103972, 102811, 101480, 100431, 100099, 100645, 101858, 103231, 104372, 105229, 105784, 105778, 105054, 103916, 102788, 101741, 100714, 99896, 99482, 99355, 99415, 99890, 100859, 101822, 102285, 102368, 102308, 101815, 100617, 99242, 98476, 98359, 98488, 98887, 99683, 100264, 99935, 99246, 99473, 100737, 101811, 102031, 102147, 102804, 103305, 102704, 101369, 100618, 101205, 102845, 104933, 107055, 108895, 110183, 110824, 110920, 110698, 110506, 110699, 111354, 112163, 112702, 112806, 112701, 112813, 113327, 113890, 113994, 113724, 113721, 114160, 114271, 113313, 111600, 110079, 109278, 109249, 110055, 111532, 112881, 113344, 113135, 112935, 112789, 112318, 111770, 111752, 112035, 111797, 111129, 111080, 111953, 112745, 112783, 112823, 113811, 115447, 116777, 117561, 118234, 118949]
54950A18949M02l01j218k078k330j607m56R1k29p50r47q75o22j10M34N22J08k71
54932A08712j63M31J277K027K238J820J318J251J407J341J303J868K944L900M573
54917A36247N346O374P419Q357R028Q769O920L857O42k200m765o742p440o967
54903A64845o308n942n413m511l892l963m088l565k608j786j103l44J90O8m80
54888A21100p71m97J27P94J236J179O19M0k8M97J434K756M348N677O235O262O449
54871A57457O911O998O261N106M084L035J389q49l005m602n769o648o945o453
54857A56970n513m507l337k029j342j911k990l119k167j528k005k632k281j402
54843A20207j158j578j724j286q64q15q65r06j224j762j891j252k89L39M77M17
$$ y = [118949, 119351, 119050, 117832, 115754, 113424, 111817, 111361, 111452, 111223, 110473, 109526, 108651, 108029, 107919, 108353, 108875, 108983, 108712, 108549, 108980, 110257, 112284, 114522, 116342, 117660, 118911, 120318, 121659, 122962, 124830, 127774, 131674, 136247, 141593, 147967, 155386, 163743, 172771, 181540, 188460, 192317, 192959, 190759, 185994, 179252, 171812, 164845, 158537, 152595, 147182, 142671, 138779, 134816, 130728, 127163, 124555, 122769, 121666, 121322, 121512, 121580, 121100, 120329, 119832, 119959, 120753, 121989, 123168, 123787, 123827, 123799, 124296, 125730, 128486, 132834, 138511, 144746, 151008, 157457, 164368, 171366, 177627, 182733, 186817, 189852, 191241, 190392, 187387, 182785, 177016, 170368, 163423, 156970, 151457, 146950, 143613, 141584, 140242, 138331, 135341, 132222, 130055, 128527, 126522, 123890, 121609, 120207, 119049, 117471, 115747, 114461, 113597, 112782, 111917, 111011, 109787, 108025, 106134, 104882, 104593, 104932, 105409, 105826]
54827A05826M36N69O63O13O46J169K091K605K040P79j50k59Q9L51K81j76r02j438
54809A15233j287n03K82N27K55n3N9N74R09N21k87n51J02R37J163R47Q23O45k4
54790A20272r04j205p64k27q7k32l91m09j05N88J298J548J409J323J462J631J699
54773A26906J621J236O10L41R57K185L359M320N290O168O728P248Q084Q796Q479
54758A92328P029N217L571J908rk112m298o325p539p497o785o369o224n574m394
54743A52927l591l508l437k875k238j880j410n56J73K42j41n01o81n04L58J719
54727A34097K642K491J700J121J089J530K410L599M740N621O274O500N850M338
54713A84002K579R89n49j993k971l562m420n585o113n410m232l560l269k731k097
$$ y = [105826, 106262, 106831, 107494, 108107, 108753, 109922, 112013, 114618, 116658, 117437, 117287, 117028, 117117, 117468, 117749, 117573, 116671, 115233, 113946, 113443, 113725, 114252, 114507, 114454, 114513, 115087, 115996, 116517, 116230, 115679, 115781, 116718, 117881, 118828, 119651, 120296, 120272, 119368, 118163, 117399, 117172, 117085, 116853, 116462, 116053, 115948, 116536, 117834, 119382, 120791, 122114, 123576, 125207, 126906, 128527, 129763, 130373, 130714, 131671, 133856, 137215, 141535, 146825, 152993, 159721, 166969, 175053, 183849, 192328, 199357, 204574, 208145, 210053, 210044, 207932, 203634, 197309, 189770, 182273, 175488, 169119, 162895, 157321, 152927, 149336, 145828, 142391, 139516, 137278, 135398, 133988, 133432, 133605, 133847, 133706, 133205, 132524, 132020, 132378, 134097, 136739, 139230, 140930, 142051, 143140, 144670, 147080, 150679, 155419, 161040, 167314, 173814, 179664, 184002, 186581, 187570, 187021, 185028, 182057, 178495, 174075, 168490, 162377, 156967, 152735, 149175, 145906, 143175, 141078]
54698A41078j975k260k249j760j276j104j023q58p41q15j093j515j909j977j639
54683A18884j161p32k10M52Q75P87M87L34J84k27o51o43k47Q4Q7j98o63j040q61
54664A15541k9Q00R08M15O0J92M73M99K45j20m97q05r64r06o25k23P8K19N13J204
54644A16978J790J417J05j051j202o33j5N32J049J171P27L02L57K55p61k025k085
54627A16911q23K70K17k06J12R06J089M65j02n2J50j27p37j025p51k84J7K20M98
54608A16748P20O48L21l3l18n21m72r2K80K54lk5K07L38M51R67J654J586M63p81
54588A22392j176q56m75j62K70O20N99M71O39Q43M89l80j049r63j86Q07J355R16
54570A24154k89j249j233o86m90p01p14l56m7PK0J06K19M97R61J042K56p36p51
$$ y = [141078, 139103, 136843, 134594, 132834, 131558, 130454, 129431, 128573, 127832, 127017, 125924, 124409, 122500, 120523, 118884, 117723, 116991, 116781, 117233, 118108, 118895, 119382, 119716, 119900, 119673, 119022, 118379, 118132, 118216, 118303, 118105, 117442, 116402, 115541, 115512, 116312, 117220, 117635, 117695, 117887, 118360, 118859, 119104, 118984, 118487, 117682, 116718, 115812, 115187, 114964, 115042, 115261, 115774, 116978, 118768, 120185, 120290, 119239, 118037, 117404, 117389, 117921, 118970, 120141, 120868, 121170, 121527, 121782, 121021, 118996, 116911, 116088, 116358, 116575, 116369, 116481, 117387, 118476, 118941, 118839, 118787, 118937, 118810, 118073, 117048, 116297, 116013, 116030, 116250, 116748, 117468, 118116, 118437, 118404, 118086, 117565, 117093, 117001, 117281, 117535, 117532, 117507, 117714, 118052, 118503, 119470, 121124, 122710, 123173, 122392, 121216, 120360, 119885, 119723, 119993, 120613, 121212, 121683, 122322, 123165, 123654, 123274, 122225, 121262, 121076, 121883, 123238, 124154, 123865, 122616, 121383, 120697, 120207, 119506, 118792, 118436, 118389, 118396, 118416, 118522, 118741, 119238, 120199, 121241, 121497, 120761, 120010]
54551A20010J33N01l61j393j287k61N43P58R95J608K158K138J625J084R10J197
54535A30358J646J697J091L69L28R36J184L13j140j989j817j252q71n27k0K30
54519A30536j89q53j025q16r38j371j197p4J040J144N51K79N82Q12N27Qk72j70
54501A28574J42L83L39J05k5m9l62j084j647j465p16p2J39R3nj8J90N51O72L46
54481A26091q9l11n86j163j486q06O12J641J688J241J063J426K135K690K456J266
54465A37868j10p54p00n99m40L31J405J503K14j189j432q97p34r88p31K47R91
54448A33985P26j75q28q87n47n3M70Q36Q21M23n8k16J31P17R62M76m95j171r99
54429A34118k41K78R0m14n44j47L49O12P05P29O14M54N61R85J271J081O54L41
$$ y = [120010, 120143, 120644, 120283, 118890, 117603, 117342, 117885, 118643, 119638, 121246, 123404, 125542, 127167, 128251, 129161, 130358, 132004, 133701, 134792, 135161, 135489, 136425, 137609, 137922, 136782, 134793, 132976, 131724, 130853, 130326, 130306, 130536, 130347, 129494, 128469, 127653, 126715, 125344, 124147, 124073, 125113, 126257, 126808, 127087, 127669, 128481, 129008, 129016, 128744, 128574, 128716, 129099, 129438, 129543, 129518, 129469, 129107, 128023, 126376, 124911, 124195, 124123, 124262, 124355, 124350, 124332, 124522, 125073, 125745, 126091, 126002, 125691, 125105, 123942, 122456, 121650, 122262, 123903, 125591, 126832, 127895, 129321, 131456, 134146, 136602, 137868, 137758, 137004, 136304, 135705, 135265, 135596, 137001, 138504, 138718, 137529, 136097, 135200, 134466, 133478, 132747, 132994, 133985, 134711, 134536, 133708, 132821, 132274, 132221, 132691, 133527, 134348, 134771, 134713, 134497, 134628, 135345, 136307, 136783, 136288, 135117, 134118, 133877, 134155, 134245, 133831, 133287, 133140, 133489, 134101, 134806, 135535, 136149, 136603, 137164, 138149, 139420, 140501, 141155, 141496]
54411A41496M5m61r51j023q07p50q59o78p3N28P94R43J332J920K263J968J052
54394A46739M6l85p9N50J136J771K459K612J719K33q53j182j170j109q60n30n54
54377A50543r50j078n20L24P96P29L98J25J84O77J312J600J500J445J669J879
54361A60633J828J804K216K989L708M085M177M192M217M047L394K364J518J095
54347B02267N23p43k267l205l683m521n654n939m888l489k739k376j757j100r29
54332A59500r98p78m84o22q99o57j56k66r46j162n09J60J12j99l7L77K66m35r93
54313A51274q93m59k67m21n64m66l68o80j361j812j497n69L08P09P30N79K34k72
54295A44205o27n55k79l13p55j109q82j84M69Q24J121J604J964J574K80j168j678
$$ y = [141496, 141541, 141080, 140129, 139106, 138299, 137549, 136690, 136012, 135939, 136467, 137261, 138204, 139536, 141456, 143719, 145687, 146739, 146785, 146400, 146321, 146871, 148007, 149778, 152237, 154849, 156568, 156801, 155948, 154766, 153596, 152487, 151627, 151097, 150543, 149593, 148515, 147995, 148319, 149115, 149844, 150242, 150367, 150551, 151228, 152540, 154140, 155640, 157085, 158754, 160633, 162461, 164265, 166481, 169470, 173178, 177263, 181440, 185632, 189849, 193896, 197290, 199654, 201172, 202267, 202790, 202047, 199780, 196575, 192892, 188371, 182717, 176778, 171890, 168401, 165662, 163286, 161529, 160429, 159500, 158502, 157724, 157240, 156618, 155719, 155062, 154906, 154640, 153694, 152532, 152023, 152183, 152295, 152096, 152059, 152436, 152702, 152267, 151274, 150381, 149922, 149655, 149234, 148670, 148204, 147836, 147156, 145795, 143983, 142486, 141917, 142225, 142934, 143664, 144243, 144477, 144205, 143578, 143023, 142744, 142431, 141676, 140567, 139685, 139501, 139970, 140794, 141915, 143519, 145483, 147057, 147337, 146169, 144491]
54278A44491q39O46J655J703J252R36P87M23j60m54k08J20m7o15r98q86n02j73
54260A47131QP1R6K33N49Q75J060J326J953K631K565J458J00l81K82J218J302
54243A62477K19j277k070j727q14j98j60l48m71p03j298k073k388j716k37J119
54227A48335J473R45N26Q66J544J821J680J563J473J082N37L62N30M14j95p57
54211A62199r06r87j341j698j719j553j421j153o39k81l96o02m16j23l13p96p90
54194A47065k13O1n06j198r76J38J121J294J000Q36P50L93J2L08J282J917J388
54177A54672J97m58j15O64J244J445J246O30q7m29m30o30j214j704j698j430j310
54160A50593j254r16k45L94N44O9n85o83q1M57L32J65Q98K084K231J018j62k36
$$ y = [144491, 143652, 144298, 145953, 147656, 148908, 149844, 150631, 151054, 150894, 150440, 150232, 150352, 150305, 149690, 148692, 147806, 147304, 147131, 147139, 147210, 147306, 147539, 148088, 148963, 150023, 151349, 153302, 155933, 158498, 159956, 160056, 159675, 159957, 161175, 162477, 162696, 161419, 159349, 157622, 156808, 156610, 156450, 156102, 155631, 154928, 153630, 151557, 149169, 147453, 147216, 148335, 149808, 150753, 151279, 152145, 153689, 155510, 157190, 158753, 160226, 161308, 161845, 162207, 162737, 163151, 162956, 162199, 161293, 160306, 158965, 157267, 155548, 153995, 152574, 151421, 150782, 150501, 150105, 149503, 149087, 148964, 148651, 147855, 147065, 146852, 146913, 146407, 145209, 144233, 144371, 145492, 146786, 147786, 148622, 149372, 149765, 149777, 150085, 151367, 153284, 154672, 154869, 154411, 154296, 154960, 156204, 157649, 158895, 159525, 159438, 159009, 158579, 157949, 156735, 155031, 153333, 151903, 150593, 149339, 148423, 148178, 148572, 149116, 149185, 148600, 147917, 147836, 148293, 148625, 148790, 149688, 151772, 154003, 155021, 154859, 154623]
54142A54623J85J92N1K97L80m37j485j373k0J242J480J023N20J85O0J41R2m21
54124A56735j013r40k46K31J35J20P47J584J765J035p1p98o77J71J063J340J036
54107A62217P05N97M35k5n59p88o00j77J32J5m30o40j28Q75J731K099J974J315
54089A68748J75q23r43k88L07M81Q20J874L337M521N158N361N282N115N165N351
54073B09641M993L508J248q04k129l097m181n104n082l916k500j944k334k724
54059A85575k350j442o97m07m31o19p93n96J27R51J343J348J362J463J492J613
54043A87939K191L141L985M510M832M922M703M566N096O160O956P103P077P358
54029B60539P792Q028Q082Q023P617O639N287M038L283L151L421L535L071K190
$$ y = [154623, 154808, 155000, 155051, 155348, 155728, 155291, 153806, 152433, 152413, 153655, 155135, 156158, 156678, 156863, 156923, 157064, 157156, 156735, 155722, 154782, 154536, 154767, 154902, 155022, 155769, 157353, 159118, 160153, 160082, 159284, 158607, 158778, 159841, 161181, 162217, 162922, 163519, 163954, 163929, 163370, 162582, 161982, 161805, 161937, 161952, 161522, 160882, 160754, 161629, 163360, 165459, 167433, 168748, 168923, 168100, 167157, 166869, 167176, 167657, 168477, 170351, 173688, 178209, 183367, 188728, 194010, 199125, 204290, 209641, 214634, 218142, 219390, 218586, 216457, 213360, 209179, 204075, 198993, 195077, 192577, 190633, 188299, 185575, 183225, 181783, 181086, 180679, 180248, 179629, 178836, 178240, 178367, 179318, 180661, 182009, 183371, 184834, 186326, 187939, 190130, 193271, 197256, 201766, 206598, 211520, 216223, 220789, 225885, 232045, 239001, 246104, 253181, 260539, 268331, 276359, 284441, 292464, 300081, 306720, 312007, 316045, 319328, 322479, 325900, 329435, 332506, 334696]
54015C34696J348N90l70j555k743l976n381o608p151p278p714q356q279p239o171
54000B63813n805n735n384m952m687m139k941j664j062j043j188j614k457k992
53986B18150k457j328q10j228j813k034k158k495k892l079k833j835r2J537J970
53971A96603J145Rp46j196j400r93L1Q68Q32K97K46J021J907J941J006M4J15J227
53953B02957K308K499K045J664J520J405J466J965K603K943L331M473O103P062
53939B44344O881O413O584P441Q736J0501J2410J3440J2950J1466R694P369M033
53926C62262M32j944k708k926l538m157l805k212k7J913L179L843M257M745N394
53911C64708O115O834P456P762P561O923O061M968L429J509k16j124j206j092
$$ y = [334696, 336044, 336634, 336264, 334709, 331966, 327990, 322609, 316001, 308850, 301572, 293858, 285502, 277223, 269984, 263813, 258008, 252273, 246889, 241937, 237250, 233111, 230170, 228506, 227444, 226401, 225213, 223599, 221142, 218150, 215693, 214365, 213555, 212327, 210514, 208480, 206322, 203827, 200935, 197856, 195023, 193188, 193096, 194633, 196603, 197748, 197757, 197011, 195815, 194415, 193422, 193453, 194321, 195153, 195450, 195696, 196717, 198624, 200565, 201571, 201615, 201730, 202957, 205265, 207764, 209809, 211473, 212993, 214398, 215864, 217829, 220432, 223375, 226706, 231179, 237282, 244344, 251225, 257638, 264222, 271663, 280399, 290900, 303310, 316750, 329700, 341166, 350860, 358229, 362262, 362694, 360750, 358042, 355116, 351578, 347421, 343616, 341404, 341377, 343290, 346469, 350312, 354569, 359314, 364708, 370823, 377657, 385113, 392875, 400436, 407359, 413420, 418388, 421817, 423326, 423110, 421986, 420780, 419688]
53897D19688j394k149k969l623m204m776n170n373n764o597p498p894p869q073
53883C46335q742r371r416q863p944o818n754n088m695m043l119k757l464m465
53869B61796m563l672k772k509k576k426k022j746j971k768l671l863l042j919
53855B22276j424j563j614j258q90q23r21j059j257j278p95p9K37J71L49P19L51
53838B11142r83k063j835r62q08j436j728j167l20L09Q75J420J528J054N18L83
53822B05927M62M01K24R6Kl3J82O92J183J408J493J589J588J471J610K327L347
53805B23969M087M331M336M354M413M516M666M769M718M663M838N131N075M431
53791B88297L602L174L225L298L084K857K986L217K848J713N72J65J28o40k486
$$ y = [419688, 418294, 416145, 413176, 409553, 405349, 400573, 395403, 390030, 384266, 377669, 370171, 362277, 354408, 346335, 337593, 328222, 318806, 309943, 301999, 295181, 289427, 284339, 279644, 275601, 272482, 269725, 266261, 261796, 257233, 253561, 250789, 248280, 245704, 243278, 241256, 239510, 237539, 234771, 231100, 227237, 224195, 222276, 220852, 219289, 217675, 216417, 215527, 214704, 213783, 212724, 211467, 210189, 209394, 209315, 209552, 209723, 210072, 210791, 211142, 210159, 208096, 206261, 205299, 204491, 203055, 201327, 200160, 199840, 200149, 201024, 202444, 203972, 205026, 205544, 205927, 206389, 206790, 207014, 207110, 207112, 207079, 207261, 207953, 209136, 210544, 212037, 213626, 215214, 216685, 218295, 220622, 223969, 228056, 232387, 236723, 241077, 245490, 250006, 254672, 259441, 264159, 268822, 273660, 278791, 283866, 288297, 291899, 295073, 298298, 301596, 304680, 307537, 310523, 313740, 316588, 318301, 318873, 319038, 319166, 318526, 316040]
53776C16040m433n350n269n114n374n592n205m397l836l812m001m011l910m064
53762B51672m633n328n616n134l995k769k034j859j806j605j555j980k480k213
53748B08665j071pM4p36j401j348p33pM61M70J06k28k59k28m97q36o31K19J061
53729B03044J238P51J11j92L9O16J103J244J251J411J601J571J530J827K137J671
53713B20953M71l02K25J504K300K204J848J898K299K540K285J762J561J954K527
53698B46029K772K879L390M117M174L316K441K298K441K083J340R03R10J011J134
53683B81238J363J272L18j122j961j734j049o19n09m56l96l64k95j02K18O05P46
53666B77153J28j283k574k725j898j199j162j194o70R9M11J30k86m23k33jq1m80
$$ y = [316040, 311607, 306257, 300988, 295874, 290500, 284908, 279703, 275306, 271470, 267658, 263657, 259646, 255736, 251672, 247039, 241711, 236095, 230961, 226966, 224197, 222163, 220304, 218498, 216893, 215338, 213358, 210878, 208665, 207594, 207587, 207631, 206895, 205494, 204146, 203413, 203406, 203867, 204337, 204443, 204215, 203956, 203728, 203231, 202395, 201764, 201983, 203044, 204282, 205033, 205144, 204952, 204991, 205607, 206710, 207954, 209205, 210616, 212217, 213788, 215318, 217145, 219282, 220953, 221424, 221122, 221347, 222851, 225151, 227355, 229203, 231101, 233400, 235940, 238225, 239987, 241548, 243502, 246029, 248801, 251680, 255070, 259187, 263361, 266677, 269118, 271416, 273857, 275940, 277280, 278183, 279093, 280104, 281238, 282601, 283873, 284191, 283069, 281108, 279374, 278325, 277706, 277197, 276741, 276345, 275981, 275686, 275584, 275802, 276407, 277153, 277281, 275998, 273424, 270699, 268801, 267602, 266440, 265246, 264576, 264675, 265086, 265216, 264930, 264507, 264274, 264273, 264192, 263712]
53648B63712o87l15J73j6p13q21J49J308J663J437J436J707J638J134Q06J046
53632B73657J646K309K914L164K625J471N91O15J168J492J521J839K649L354L351
53617C04366K872K702L202L984M552M851N092N346N565N789O025O043N621M882
53603C70892M129L422K613J770J192R64P87M40Q0o3l9r0l20o63j048j478j936
53586C80652k303k390k135j794j757k027k119j705j132r39j058j039r29j235j928
53571C56162k182j529o31m21q77j204j065q75r75j077p35L8Q15J196J021M05k57
53554C47809m63n9N64R12J008J316J938K222J504J78m57L90K037L092K973K372
53538C67336K299L005L864M078L418K517K385L508N369O978P773P957Q012Q240
$$ y = [263712, 263025, 262710, 262883, 262867, 262154, 261333, 261482, 262790, 264453, 265890, 267326, 269033, 270671, 271805, 272611, 273657, 275303, 277612, 280526, 283690, 286315, 287786, 288377, 288992, 290160, 291652, 293173, 295012, 297661, 301015, 304366, 307238, 309940, 313142, 317126, 321678, 326529, 331621, 336967, 342532, 348321, 354346, 360389, 366010, 370892, 375021, 378443, 381056, 382826, 384018, 384982, 385769, 386209, 386289, 386226, 386187, 386097, 385777, 385114, 384066, 382588, 380652, 378349, 375959, 373824, 372030, 370273, 368246, 366127, 364422, 363290, 362351, 361293, 360254, 359325, 358090, 356162, 353980, 352451, 351820, 351399, 350522, 349318, 348253, 347378, 346403, 345326, 344591, 344629, 345444, 346640, 347661, 348066, 347809, 347346, 347287, 347851, 348763, 349771, 351087, 353025, 355247, 356751, 356929, 356472, 356862, 358899, 361991, 364964, 367336, 369635, 372640, 376504, 380582, 384000, 386517, 388902, 392410, 397779, 404757, 412530, 420487, 428499, 436739]
53524D36739Q723R418J0229J1055J1757J2090J1836J1229J1020J1819J3434J5141
53512E74490J6450J7345J7919J8221J8483J9105K0267K1743K3082K3848K3839
53501G94792K3344K2955K2881K2611K1649K0274J9170J8451J7648J6542J5466
53490A015783J4825J4798J5444J6540J7435J7606J7361J7376J7699J7816J7652
53479A200335J7655J7879J7736J6885J5563J3936J1856R492P384N595L587J237
53467A339140q38k390m079o419q846j0564j1649j2683j3746j4390j4293j3544
53455A225699j2705j2753j4331j6716j8284j8397j8026j8061j8049j7380j6651
53444A044346j6740j7257j7150j6306j5341j4276j2679j0822r406q244o492m234
$$ y = [436739, 445462, 454880, 465109, 476164, 487921, 500011, 511847, 523076, 534096, 545915, 559349, 574490, 590940, 608285, 626204, 644425, 662908, 682013, 702280, 724023, 747105, 770953, 794792, 818136, 841091, 863972, 886583, 908232, 928506, 947676, 966127, 983775, 1000317, 1015783, 1030608, 1045406, 1060850, 1077390, 1094825, 1112431, 1129792, 1147168, 1164867, 1182683, 1200335, 1217990, 1235869, 1253605, 1270490, 1286053, 1299989, 1311845, 1321337, 1328721, 1334316, 1337903, 1339140, 1338302, 1335912, 1331833, 1325414, 1316568, 1306004, 1294355, 1281672, 1267926, 1253536, 1239243, 1225699, 1212994, 1200241, 1185910, 1169194, 1150910, 1132513, 1114487, 1096426, 1078377, 1060997, 1044346, 1027606, 1010349, 993199, 976893, 961552, 947276, 934597, 923775, 914369, 906125, 899633, 895399]
53432H95399k617k156k018j305j15J023J919K518K702K701L166M402O051P766
53418I19436R662J1804J3821J5328J6327J6999J7538J8320J9789K1860K3894K5533
53406A130311K7031K8661L0225L1486L2659L4085L5765L7449L9018M0487M1940
53395A509117M3599M5694M7968M9632N0101M9666M9268M9607N0574N1402N1355
53384B047983N0369M9016M7798M6555M4779M2346L9651L7096L4686L2043K8657
53373B500979K4279J9329J4641J0545O445J714l413q413j3540j9482k6072l2213
53361B474799l7119m0918m3848m5763m6694m7221m7814m8242m8031m7121m5767
53350A976261m4198m2658m1404m0363l9146l7676l6479l6107l6548l7344l7978
$$ y = [895399, 892782, 890626, 888608, 887303, 887188, 888211, 890130, 892648, 895350, 898051, 901217, 905619, 911670, 919436, 929098, 940902, 954723, 970051, 986378, 1003377, 1020915, 1039235, 1059024, 1080884, 1104778, 1130311, 1157342, 1186003, 1216228, 1247714, 1280373, 1314458, 1350223, 1387672, 1426690, 1467177, 1509117, 1552716, 1598410, 1646378, 1696010, 1746111, 1795777, 1845045, 1894652, 1945226, 1996628, 2047983, 2098352, 2147368, 2195166, 2241721, 2286500, 2328846, 2368497, 2405593, 2440279, 2472322, 2500979, 2525258, 2544587, 2559228, 2569773, 2576218, 2577932, 2574519, 2566106, 2552566, 2533084, 2507012, 2474799, 2437680, 2396762, 2352914, 2307151, 2260457, 2213236, 2165422, 2117180, 2069149, 2022028, 1976261, 1932063, 1889405, 1848001, 1807638, 1768492, 1730816, 1694337, 1658230, 1621682, 1584338, 1546360]
53339A546360l7934l6793l4670l2275l0286k8737k7158k5152k2716k0247j8279
53328A232113j7017j6087j4985j3719j2738j2325j2510j3390j4872j6091j5881
53317A072498j4129j2024j0642r894r124q135p050n741m023k195o84O13K144L883
53303I95497N229N780N878O329P722R982J2462J4488J5925J7163J8551K0068K1546
53290A156620K2942K4223K5218K5738K5715K5186K4264K3145K1977K0680J9126
53279A414834J7336J5306J2863R997P164M703K260o40l603n795p301r099j1578
53266A446447j4041j5909j7507j9167k0508k1260k1841k2605k3245k3729k4791
53255A221844k6593k7717k6870k4987k4190k4890k5387k4490k3081k2587k3029
$$ y = [1546360, 1508426, 1471633, 1436963, 1404688, 1374402, 1345665, 1318507, 1293355, 1270639, 1250392, 1232113, 1215096, 1199009, 1184024, 1170305, 1157567, 1145242, 1132732, 1119342, 1104470, 1088379, 1072498, 1058369, 1046345, 1035703, 1025809, 1016685, 1008550, 1001500, 995759, 991736, 989541, 988857, 989470, 991614, 995497, 1000726, 1006506, 1012384, 1018713, 1026435, 1036417, 1048879, 1063367, 1079292, 1096455, 1115006, 1135074, 1156620, 1179562, 1203785, 1229003, 1254741, 1280456, 1305642, 1329906, 1353051, 1375028, 1395708, 1414834, 1432170, 1447476, 1460339, 1470336, 1477500, 1482203, 1484463, 1483823, 1480220, 1474425, 1467124, 1458025, 1446447, 1432406, 1416497, 1398990, 1379823, 1359315, 1338055, 1316214, 1293609, 1270364, 1246635, 1221844, 1195251, 1167534, 1140664, 1115677, 1091487, 1066597, 1041210, 1016720, 993639, 971052, 948023]
53244I48023k3362k3004k2275k1738k1680k2004k2253k1966k1267k0758k0584
53233G07132k0005j8280j5705j3326j1771j0787r828q719p644o876o657p133q188
53220E62213r355j0186j0675j1163j1777j2235j2362j2468j2824j2988j2216j0570
53208D23394r064q466q455q229p463o352n120m084l830m717o145o947o538n446
53194C32538m644m645n216n655n373m419l462l054l049k960k704k559k545k390
53180B79863k101k088k517k924k750j989j098n32m57p59j083j161j199j706k687
53165B54812l283k683j193KJ62m24j192j990k679k682j694m68m5k87j16O81R79
53148B37900J76o37k73O14N20n40j121o70k21m55n44L31J479J626O74l88q28o53
$$ y = [948023, 924661, 901657, 879382, 857644, 835964, 813960, 791707, 769741, 748474, 727716, 707132, 687127, 668847, 653142, 639816, 628045, 617258, 607430, 598711, 591067, 584191, 577534, 570401, 562213, 552858, 542672, 531997, 520834, 509057, 496822, 484460, 471992, 459168, 446180, 433964, 423394, 414330, 405864, 397409, 389180, 381717, 375365, 370245, 366161, 362331, 357614, 351469, 344522, 337984, 332538, 327894, 323249, 318033, 312378, 307005, 302586, 299124, 296070, 293021, 290061, 287357, 284798, 282253, 279863, 277762, 275674, 273157, 270233, 267483, 265494, 264396, 263864, 263407, 262648, 261565, 260404, 259205, 257499, 254812, 251529, 248846, 247653, 247655, 247817, 247393, 246201, 244211, 241532, 238850, 237156, 236688, 236643, 236356, 236240, 236921, 237900, 238076, 237439, 237166, 237780, 238300, 237760, 236639, 235969, 235748, 235293, 234749, 235080, 236559, 238185, 238859, 238471, 237643, 236990]
53130B36990j73K29K02j60k93L3L34K78L29Q67J312R27R8j39M52J182J557J625
53112B45650J382P68K16L32R04J034L69n25j139j551j882j954j777j703j775j581
53096B36768j007n24l79j90K90O30M51J55K46M08k3r09j414j217r01r59j011m72
53078B29942M60J015R32P64R33R79L03o67p61K71J170O89p92j786j535o19Q0K17
53060B31595k32j234k350k781k181j120l74j02j4K0K8L26J289K632L387K822J268
53043B32979j76o81l30K15M79M93L86l1r76k119k579j820m23L24k01j219j434
53026B22887n90L07M50K90O63J340J312L92m26l86J65O61J207J917K216J583N26
53009B34514pJ22L00J84p5k89k54L99J568K229J517R5n47k9O36O82M27K83L2m51
$$ y = [236990, 236817, 237046, 237248, 237088, 236795, 236828, 237162, 237440, 237769, 238636, 239948, 240875, 240973, 240834, 241286, 242468, 244025, 245650, 247032, 247800, 248016, 248348, 249252, 250286, 250655, 250130, 248991, 247440, 245558, 243604, 241827, 240124, 238349, 236768, 235761, 235237, 234858, 234668, 234958, 235588, 236039, 236194, 236440, 236848, 236825, 235916, 234502, 233285, 232384, 231425, 230414, 229942, 230402, 231417, 232349, 233113, 234046, 235025, 235328, 234661, 233900, 234171, 235341, 236030, 235238, 233452, 231917, 231298, 231378, 231595, 231363, 230129, 227779, 224998, 222817, 221697, 221323, 221221, 221207, 221227, 221255, 221581, 222870, 225502, 228889, 231711, 232979, 232803, 232122, 231792, 232007, 232486, 232979, 233365, 233334, 232358, 230239, 227660, 225840, 225417, 225741, 225540, 224321, 222887, 222297, 222604, 223054, 223344, 224007, 225347, 226659, 227051, 226625, 226239, 226404, 227065, 228272, 230189, 232405, 233988, 234514, 234507, 234629, 234929, 235113, 235038, 234749, 234495, 234894, 236462, 238691, 240208, 240303, 239756, 239727, 240363, 241045, 241472, 241755, 241787, 241336]
52989B41336o89l30K22M40L76L62M86P42J174J617J751J637J651J737J430P66
52973B54708M37O72Q04M47K49Q27J715K139K147K099J637K61j375j921j050J39
52957B63935N83L23J0q1k00p57j874l052l397k591j463j082j416j505r50m13n17
52940B45553r43r95n30O9M18K82m44j423j871j348l69J02k60q98j136q53l87p3
52922B34894O2K58O95J101Q40k82j478j623n73O60J127R21O80O22N83N60N98L59
52904B40004m35j278j343p61m99p62n61O12J664J383K30m60n06q25j514j528m70
52887B32951N46N14m2j3O19R43N55k2k31j32o0j38k56l01k83l01l13k6Q35K062
52867B36907L020L255K855K170J492R97P42N81L13rj86k41l54m42k85j06m94j497
$$ y = [241336, 240647, 240317, 240539, 240979, 241355, 241717, 242203, 242945, 244119, 245736, 247487, 249124, 250775, 252512, 253942, 254708, 255145, 255817, 256621, 257068, 257317, 258144, 259859, 261998, 264145, 266244, 267881, 268142, 266767, 264846, 263796, 263935, 264518, 264841, 264851, 264770, 264570, 263813, 261939, 258887, 255490, 252899, 251436, 250354, 248938, 247433, 246483, 246070, 245553, 244610, 243615, 243085, 243154, 243572, 243854, 243410, 241987, 240116, 238768, 238399, 238501, 238241, 237343, 236207, 235354, 234967, 234894, 234956, 235214, 235909, 237010, 237850, 237568, 236090, 234467, 233894, 234554, 235681, 236602, 237282, 237904, 238487, 239047, 239645, 240004, 239569, 238291, 236948, 236187, 235688, 234926, 234365, 234977, 236641, 238024, 238254, 237794, 237288, 236463, 234949, 233421, 232951, 233497, 234011, 233969, 233956, 234575, 235518, 236073, 236051, 235820, 235688, 235628, 235490, 235234, 234933, 234650, 234349, 234036, 234010, 234845, 236907, 239927, 243182, 246037, 248207, 249699, 250696, 251438, 252019, 252332, 252323, 252137, 251896, 251542, 251100, 250815, 250709, 250215, 248718]
52849B48718k375k509k168j984k091k190k192k262k348k100j300k41M32K37o38
52834B24989j453j668j467j268r74k57O00R38P83R07J576J963J240l24j748k320
52818B21517j914q63J53O10P68J257J863J648M99l82k27K36K31M14J576K774K308
52801B32468K60j539k044k061k533l081k839j762m88M41P50M03k03n22n53q49
52785B15848j514j824j187J5R24J175J047R41J023J209J254R87N34R8l88j057
52769B19085j568j322l47N46O78K30j96l78m73n54n04k79qJ67K53M33Q83J480
52751B18126J841J782J539J275P34j31n75J58J544K206J801J517K231L039K488
52736B39575P18o23n02L74P74N08L28P36J448J952K073J865J362P15L29L91L52
$$ y = [248718, 246343, 243834, 241666, 239682, 237591, 235401, 233209, 230947, 228599, 226499, 225199, 224958, 225390, 225627, 224989, 223536, 221868, 220401, 219133, 218159, 217902, 218502, 219440, 220223, 221130, 222706, 224669, 225909, 225585, 223837, 221517, 219603, 218740, 218893, 219503, 220271, 221528, 223391, 225039, 225538, 225156, 224929, 225165, 225396, 225810, 227386, 230160, 232468, 232728, 231189, 229145, 227084, 224551, 221470, 218631, 216869, 216381, 216822, 217572, 217975, 217772, 217250, 216697, 215848, 214334, 212510, 211323, 211338, 212262, 213437, 214484, 215425, 216448, 217657, 218911, 219898, 220432, 220530, 220142, 219085, 217517, 216195, 215848, 216394, 217072, 217302, 217106, 216728, 216255, 215701, 215197, 214918, 214910, 215077, 215330, 215763, 216646, 218126, 219967, 221749, 223288, 224563, 225297, 225166, 224591, 224749, 226293, 228499, 230300, 231817, 234048, 237087, 239575, 240293, 239670, 239168, 239542, 240316, 240824, 241152, 241888, 243336, 245288, 247361, 249226, 250588, 251303, 251632, 252023, 252375]
52719B52375n15j935k622j846n26j05p18j214r00l49l46p86j067r35n15R0P14
52702B38800R40M85l47r60j063p87l40R1K57N2j49K20J198K078K065J104o6o16
52684B42962l55K40N83M57O2k74l60k91l60p35j117r86l52Q3k14q69j116q24n26
52665B36008n29n75m55l72m85n78m15m4M69J265K258K852K509J570J081J729L062
52648B49350L857L265J569j46j111j498j858k238k250j844j407j072n26K10N02
52633B44803On97m35K82N84K25P5P98J830K166J745J430J689J915J245l14j908
52616B55539k718k573j826j043p17r54j256r90j74M66L94r0l10r0J73J26j64l60
52598B43433j90K79N53J85n37p06K6Q19P13m7m02n2J79l17j039j112l78O58J598
$$ y = [252375, 251860, 249925, 247303, 245457, 244931, 244826, 244108, 242894, 241994, 241645, 241299, 240513, 239446, 238511, 237996, 238086, 238800, 239740, 240225, 239878, 238918, 237855, 237068, 236728, 236819, 237076, 237128, 236979, 237199, 238397, 240475, 242540, 243644, 243578, 242962, 242607, 242847, 243430, 243887, 243949, 243675, 243315, 243024, 242664, 241929, 240812, 239826, 239474, 239557, 239343, 238474, 237358, 236534, 236008, 235479, 234904, 234449, 234077, 233592, 233014, 232599, 232555, 233024, 234289, 236547, 239399, 241908, 243478, 244559, 246288, 249350, 253207, 256472, 258041, 257895, 256784, 255286, 253428, 251190, 248940, 247096, 245689, 244617, 244091, 244301, 244803, 244809, 244212, 243777, 244059, 244643, 244868, 244943, 245741, 247571, 249737, 251482, 252912, 254601, 256516, 257761, 257447, 255539, 252821, 250248, 248422, 247379, 246662, 245708, 244452, 243462, 243288, 243754, 244148, 244058, 243748, 243658, 243831, 243957, 243793, 243433, 243243, 243522, 244075, 244260, 243723, 243017, 243043, 243862, 244575, 244528, 244126, 244074, 244253, 243936, 242897, 241785, 241407, 242065, 243663]
52579B43663K376K897K897K224J126J82j46Q1L94N39P46J121J116J38j441k459
52563B55454k216j115K6P26Q47L72m45j111j332j288j282j380j436j254o62K54
52547B44158J004J117P34M40N06O85P17N24l6r71j676j369k14O77O13M3l73n92
52529B45987p04m09L26Q13O25M61J126K113K188J200K54P2J91L5j02L04J014J355
52511B56849J316J632K708L879M086L158K080J831K194K079R19p04j869k302k401
52496B75455k626l106l555l363k140m44M83rj241k113k314k207j919j225k04O07
52480B50079Q46P54P87J108J471J487J045N45N25R55J228J001O86P79J184J589
52464B66069K086K869L590L680L205K714K318J577L77p16j178j196j311j750k293
$$ y = [243663, 246039, 248936, 251833, 254057, 255183, 255365, 255219, 255300, 255694, 256233, 256979, 258100, 259216, 259354, 257913, 255454, 253238, 252123, 252149, 252875, 253722, 254094, 253649, 252538, 251206, 249918, 248636, 247256, 245820, 244566, 243904, 244158, 245162, 246279, 247013, 247453, 247959, 248644, 249361, 249885, 249849, 248878, 247202, 245833, 245619, 246296, 246909, 246952, 246579, 245987, 245283, 244874, 245200, 246013, 246638, 247099, 248225, 250338, 252526, 253726, 253980, 254052, 254243, 254278, 254176, 254480, 255494, 256849, 258165, 259797, 262505, 266384, 270470, 273628, 275708, 277539, 279733, 281812, 282731, 282027, 280158, 277856, 275455, 272829, 269723, 266168, 262805, 260665, 260221, 260704, 260695, 259454, 257341, 255027, 252820, 250901, 249676, 249472, 250079, 250925, 251679, 252466, 253574, 255045, 256532, 257577, 258122, 258647, 259602, 260830, 261831, 262517, 263296, 264480, 266069, 268155, 271024, 274614, 278294, 281499, 284213, 286531, 288108, 288485, 287769, 286591, 285395, 284084, 282334, 280041]
52449B80041k643k703k561k351k144j986k002k269k524k353j763j255j146j187
52435B51154j077r24q25m54M03J272J525J193P25K43l05n18M2J002J421J010L05
52418B56192k61p62j125r22q1Q75J549K080K630L039L310L800M665N596O432P491
52402B94508Q936J0247J0701J0008Q161N203J489k161n061p086q225q212p091
52389C11417n693m874m441l517j895m20Q2k01m49k38J08J57K7K12Q61J558K005
52372B94699K509L410M338M646M530M838N659N890M690K694J185N51K34k02p33
52357C38938j347k051k360j661k09Q90R58N11M25Q22J176J169J028J108J524K121
52341C43042K559K508J987J477J467J965K687L560M675N769O268O164O341P630
$$ y = [280041, 277398, 274695, 272134, 269783, 267639, 265653, 263651, 261382, 258858, 256505, 254742, 253487, 252341, 251154, 250077, 249153, 248328, 247874, 248277, 249549, 251074, 252267, 252992, 253235, 252930, 252412, 252454, 253456, 254877, 255887, 256192, 255931, 255169, 254044, 253122, 253041, 253916, 255465, 257545, 260175, 263214, 266524, 270324, 274989, 280585, 287017, 294508, 303444, 313691, 324392, 334400, 342561, 347764, 349253, 347092, 342031, 334945, 326720, 318508, 311417, 305724, 300850, 296409, 292892, 290997, 290577, 290659, 290458, 290009, 289771, 289879, 290036, 290063, 290275, 291136, 292694, 294699, 297208, 300618, 304956, 309602, 314132, 318970, 324629, 330519, 335209, 337903, 339088, 339639, 339873, 339671, 338938, 337591, 335540, 333180, 331519, 331310, 332200, 333158, 333669, 334094, 334916, 336092, 337261, 338289, 339397, 340921, 343042, 345601, 348109, 350096, 351573, 353040, 355005, 357692, 361252, 365927, 371696, 377964, 384128, 390469, 398099]
52327C98099R693J1426J2287J2704J3223J3896J4643J5567J6483J6795J6246J5417
52315E66479J4910J4498J3729J2946J2955J3774J4576J4883J5024J5344J5648
52304G24766J5694J5566J5326J4817J4068J3364J2724J1872J0909J0328J0011
52293H69445Q977O636L707J240p48k985n579p713q577q086o770n472m933n213
52279H33929n583n369m669l886k902j310Q11L008N121P140Q555Q727Q036P770
52265H59378Q601R797J0310J0080R817R944J0259J0423J0392J0428J0897J1926
52253I82252J3169J4096J4570J4789J4665J3700J1711R216O745M172J222j674
52241A098633l661m563n072n784o471o621o293o104o465p169p701p736p278o501
$$ y = [398099, 407792, 419218, 431505, 444209, 457432, 471328, 485971, 501538, 518021, 534816, 551062, 566479, 581389, 595887, 609616, 622562, 635517, 649291, 663867, 678750, 693774, 709118, 724766, 740460, 756026, 771352, 786169, 800237, 813601, 826325, 838197, 849106, 859434, 869445, 878422, 885058, 888765, 890005, 889257, 886272, 880693, 872980, 864403, 856317, 849547, 844075, 839142, 833929, 828346, 822977, 818308, 814422, 811520, 810210, 811021, 814029, 819150, 826290, 834845, 843572, 851608, 859378, 867979, 877776, 888086, 898166, 907983, 917927, 928186, 938609, 949001, 959429, 970326, 982252, 995421, 1009517, 1024087, 1038876, 1053541, 1067241, 1078952, 1088168, 1094913, 1099085, 1100307, 1098633, 1094972, 1090409, 1085337, 1079553, 1073082, 1066461, 1060168, 1054064, 1047599, 1040430, 1032729, 1024993, 1017715, 1011214]
52227A011214n619m869m452m434m686m949m911m320l132j663m21K96O22R31J490
52212I71097K336L407M615N812O791P338P318O810O171N804N740N572M989M267
52198A048067L945M132M402M447M552N196O333P348P688P380O823O163N167L769
52184A125412K453J727J265M7k423n386p629q750r272r774j0294j0526j0149r029
52170A047672p478o212n685n438m600l037j542p67n16k28L74J385K904M611N552
52155A026995M946L025P39j136k236k339j541n38j37l78o46n86l17J90J142K163
52139A029346K251J003p02j777k225k684l068k538q56J078K347L100M150N880
52125A035305Q049J0363J2750J5131J7357J9427K1475K3408K4858K5559K5588
$$ y = [1011214, 1005595, 1000726, 996274, 991840, 987154, 982205, 977294, 972974, 969842, 968179, 967758, 968054, 968676, 969607, 971097, 973433, 976840, 981455, 987267, 994058, 1001396, 1008714, 1015524, 1021695, 1027499, 1033239, 1038811, 1043800, 1048067, 1052012, 1056144, 1060546, 1064993, 1069545, 1074741, 1081074, 1088422, 1096110, 1103490, 1110313, 1116476, 1121643, 1125412, 1127865, 1129592, 1130857, 1130904, 1128481, 1123095, 1115466, 1106716, 1097444, 1087670, 1077376, 1066850, 1056701, 1047672, 1040194, 1033982, 1028297, 1022859, 1018259, 1015222, 1013680, 1012913, 1012397, 1012169, 1012543, 1013928, 1016832, 1021443, 1026995, 1031941, 1034966, 1035705, 1034569, 1032333, 1029994, 1028453, 1027915, 1027778, 1027400, 1026754, 1026168, 1025851, 1026041, 1027183, 1029346, 1031597, 1032600, 1031898, 1030121, 1027896, 1025212, 1022144, 1019606, 1018750, 1019828, 1022175, 1025275, 1029425, 1035305, 1043354, 1053717, 1066467, 1081598, 1098955, 1118382, 1139857, 1163265, 1188123, 1213682, 1239270]
52114A239270K5102K4077K2474K0504J8563J6925J5704J4879J4172J3073J1306
52103A436049R288P786P125P027P230P705Q067P424N399K932J286L39j318m475
52089A501864q233j1289j3512j5617j7698j9013j9073j8164j6624j4367j1440
52078A336834q496o248m745l518k226p35J076L170N129O521P522Q657R992J0978
52064A363911J1283J1312J1639J2163J2322J1967J1617J1692J1790J1060R227
52053A489983P015N416M677M165L178J642j18k019m323p088r898j2250j4087j5768
52039A450525j7518j9063j9841j9534j8370j6843j5278j3725j2315j1374j0961
52028A275703j0546r539q150p302p547q444r192r544r750r898r751r256q736q489
$$ y = [1239270, 1264372, 1288449, 1310923, 1331427, 1349990, 1366915, 1382619, 1397498, 1411670, 1424743, 1436049, 1445337, 1453123, 1460248, 1467275, 1474505, 1482210, 1490277, 1497701, 1503100, 1506032, 1507318, 1507657, 1506339, 1501864, 1493631, 1482342, 1468830, 1453213, 1435515, 1416502, 1397429, 1379265, 1362641, 1348274, 1336834, 1328338, 1322090, 1317345, 1313827, 1311601, 1310866, 1311942, 1315112, 1320241, 1326762, 1334284, 1342941, 1352933, 1363911, 1375194, 1386506, 1398145, 1410308, 1422630, 1434597, 1446214, 1457906, 1469696, 1480756, 1489983, 1496998, 1502414, 1507091, 1511256, 1514434, 1516076, 1515958, 1513939, 1509616, 1502528, 1492630, 1480380, 1466293, 1450525, 1433007, 1413944, 1394103, 1374569, 1356199, 1339356, 1324078, 1310353, 1298038, 1286664, 1275703, 1265157, 1255618, 1247468, 1240166, 1232619, 1224175, 1214983, 1205439, 1195689, 1185791, 1176040, 1166784, 1158048, 1149559]
52014A149559q450q339p998p425o750o244o267p013q394j0202j2291j4488j6460
52001A029238j7908j8910j9883k1106k2267k2600k1578j9483j7192j5300j3615
51990H19396j1713r881r087r908j1695j3130j3489j3097j2639j2396j2247j2083
51978F78031j1978j2013j2190j2508j2953j3378j3486j3039j2076j0838r462p795
51966E36315n572k758L14L182N546P326Q537R218R375Q874P471N177K494K2k183
51951E93338m514o959q739r095q180o811n478m001k090K15K714N273P632R352
51937E62657J0262J0808J1695J3103J4367J4501J3083J0669Q241O124L657J90
51925F79357l800p073r025j0097j0681j0413r024p207n888m916l461j534l35q64
$$ y = [1149559, 1141109, 1132770, 1124772, 1117347, 1110597, 1104353, 1098086, 1091073, 1082679, 1072477, 1060186, 1045698, 1029238, 1011330, 992420, 972537, 951431, 929164, 906564, 884986, 865503, 848311, 833011, 819396, 807683, 797802, 788715, 778807, 767112, 753982, 740493, 727396, 714757, 702361, 690114, 678031, 666053, 654040, 641850, 629342, 616389, 603011, 589525, 576486, 564410, 553572, 544110, 536315, 530743, 527985, 528299, 531481, 537027, 544353, 552890, 562108, 571483, 580357, 587828, 593005, 595499, 595521, 593338, 588824, 581865, 573126, 564031, 555851, 549040, 543562, 539561, 537471, 537686, 540400, 545673, 553305, 562657, 572919, 583727, 595422, 608525, 622892, 637393, 650476, 661145, 669386, 675510, 679167, 679357, 675557, 668484, 659459, 649362, 638681, 628268, 619244, 612037, 606149, 601233, 597772, 596238, 595903, 595039]
51911E95039k916n654q538j1206j3010j3290j2021r801p322m993k905q76J236
51898E03743L134M147M029L300K452J073j636n507r202j1528j2448j2571j2116
51885D56870j0888q971o921n118l411j484N90K447L929N241O600P920Q982R727
51871D65513J0221J0358R847Q569O785M776K474k77l151n377o483o806p037p325
51857D82087p134n920l808j503L07J434K158K777L190K974J898K82j284k475l353
51842D71630m077m778n617o586p275p228o606o033n630m810l260j553k64Q36K058
51827D10807K808K412J537J516K230K004J9k387l526l444l239l235k892k071j195
51812D01344l58O60J615J964J826J879K207K123J285K06o02j235j844k142j916
$$ y = [595039, 592123, 586469, 577931, 566725, 553715, 540425, 528404, 518603, 511281, 506288, 503383, 502507, 503743, 506877, 511024, 515053, 518353, 520805, 521878, 520242, 514735, 505533, 494005, 481557, 468986, 456870, 445982, 437011, 430090, 424972, 421561, 420077, 420667, 423114, 427043, 432284, 438884, 446804, 455786, 465513, 475734, 486092, 495939, 504508, 511293, 516069, 518543, 518266, 515115, 509738, 503255, 496449, 489412, 482087, 474953, 469033, 465225, 463722, 464029, 465463, 467621, 470398, 473588, 476562, 478460, 478742, 477458, 474983, 471630, 467553, 462775, 457158, 450572, 443297, 436069, 429463, 423430, 417800, 412990, 409730, 408177, 407913, 408749, 410807, 413615, 416027, 417564, 419080, 421310, 423314, 423333, 420946, 417420, 413976, 410737, 407502, 404610, 402539, 401344, 400986, 401646, 403261, 405225, 407051, 408930, 411137, 413260, 414545, 414751, 414149, 412914, 411070, 408928, 407012]
51797D07012j447j086q04n31m52o41p82o58n68q78j427j771j738j446j026n71
51781C91186k20o3j33n35j240j738j362k63N63N98O27J737L900O126P747Q881
51765D15811R801J0532J1082J1477J1476J0633Q791O221L230L1l060n625p464
51752D82936q634r186r155q798q513q408q247p888p454o894n797l925j755q0Q68
51737C89070J591K637M004N338O456P415Q172Q438P937O640M720K525P02j3N72
51722D56204J759K553K485J683L63j316l029m402n330n873n822m893l412k274
51708D28696k027k379k825l243l629l682l039j715K1J895L468M072L320J646L9
51693D20618p53o55j09L52N04N48O85P15L27l28q78j475k616m050m706m093k983
$$ y = [407012, 405565, 404479, 403675, 403144, 402692, 402051, 401269, 400611, 400043, 399165, 397738, 395967, 394229, 392783, 391757, 391186, 390966, 390903, 390770, 390235, 388995, 387257, 385895, 385632, 386195, 386793, 387420, 389157, 393057, 399183, 406930, 415811, 425612, 436144, 447226, 458703, 470179, 480812, 489603, 495824, 499054, 499085, 496025, 490400, 482936, 474302, 465116, 455961, 447163, 438650, 430242, 421995, 414107, 406653, 399759, 393962, 390037, 388282, 388202, 389070, 390661, 393298, 397302, 402640, 409096, 416511, 424683, 433121, 441058, 447698, 452418, 454943, 455645, 455632, 456204, 457963, 460516, 463001, 464684, 465047, 463731, 460702, 456300, 450970, 445097, 439275, 434382, 430970, 428696, 426669, 424290, 421465, 418222, 414593, 410911, 407872, 406157, 406178, 408073, 411541, 415613, 418933, 420579, 420618, 419865, 419210, 419101, 419453, 419957, 420505, 421190, 421905, 422232, 421904, 421026, 419551, 416935, 412885, 408179, 404086, 401103]
51676D01103k188j400k1J519K228J999J682J838K267K725L341M266N521P159R027
51661D41066J0376J0387R084P132M744J534k385n829p490p056n138k434O91L956
51647D58638O841Q543Q334O038K150k522p131j0822j2950j3567j3323j2610j1259
51634D06360r276p307n846m631l386k487k141j549K5J839K514K045J726K139K507
51619C82532K158J383N62l63j194j304p55n94j429k531k876k394j650j040q28
51604C69677j253j974k056j103J55Q43Q98P49P59J480L533O573R166J0461J1125
51589D09033J1805J1550R001M508j57l814o383p758p568o160m607l376j946R3
51575D04221K421M739P253J0008J2418J3985J4916J5704J6503J7262J8049J8838
$$ y = [401103, 398915, 397515, 397494, 399013, 401241, 403240, 404922, 406760, 409027, 411752, 415093, 419359, 424880, 432039, 441066, 451442, 461829, 470913, 478045, 482789, 484323, 481938, 476109, 468619, 461563, 456425, 453991, 454682, 458638, 465479, 474022, 482356, 488394, 490544, 488022, 480891, 470069, 457119, 443552, 430229, 417619, 406360, 397084, 389777, 383931, 379300, 375914, 373427, 371286, 369737, 369762, 371601, 374115, 376160, 377886, 380025, 382532, 384690, 386073, 386635, 386272, 385078, 383774, 383019, 382425, 380996, 378465, 375589, 373195, 371545, 370505, 369677, 368424, 366450, 364394, 363291, 363446, 364289, 365187, 365936, 366695, 368175, 371708, 378281, 387447, 397908, 409033, 420838, 432388, 441389, 445897, 445740, 441926, 435543, 427785, 420217, 414057, 409450, 406074, 404128, 404221, 406642, 411381, 418634, 428642, 441060, 455045, 469961, 485665, 502168, 519430, 537479, 556317]
51563E56317J9331J9302J9038J9166K0192K2351K5635K9774L4223L8243M0935
51552H44507M1267L8451L2381K3682J3417K796p103j5787k3484l0445l6157l9721
51540H43804m0991m0847m0139l8847l6481l2987k8835k4448j9992j5705j2099
51529E12433r656q449q137q175p989p117n500l653k292j667j360r42n00l10j96
51514D46490J96O02K04j316l245m616n079m883m401l997l927m036l871l396l201
51499D01524l654m210l996k856j427l83Pj33l33r5M78O53J2q57j079n75J2J91
51481C83279j14q42j763k370k370k119k039j985j719j628k134k747k664k191k389
51466C54205l248l462k367j027o73j015r69l87r3l85n35J70J490K584K944K803
$$ y = [556317, 575648, 594950, 613988, 633154, 653346, 675697, 701332, 731106, 765329, 803572, 844507, 885774, 924225, 956606, 980288, 993705, 996501, 989398, 973611, 950127, 919682, 883525, 843804, 802813, 761966, 721827, 682980, 646499, 613512, 584677, 560229, 540237, 524532, 512433, 502777, 494328, 486191, 478016, 470027, 462910, 457410, 453757, 451465, 449798, 448438, 447496, 446996, 446686, 446490, 446686, 447288, 447492, 446176, 442931, 438315, 433236, 428353, 423952, 419955, 416028, 411992, 408121, 404725, 401524, 397870, 393660, 389664, 386808, 385381, 384998, 385005, 384872, 384539, 384444, 384922, 385575, 385587, 384730, 383651, 383076, 383088, 383279, 383165, 382323, 380560, 378190, 375820, 373701, 371662, 369677, 367958, 366330, 364196, 361449, 358785, 356594, 354205, 350957, 347495, 345128, 344101, 343428, 342413, 341444, 341057, 340964, 340579, 340044, 340214, 341704, 344288, 347232, 350035]
51450C50035K748L077L498L458K766J812J202J349K376M213O652R363J1883J3535
51436D17967J3563J1630Q259M529J363q31j999k358k378k560l120m088n500p130
51422D27347q213q004o604m872l487k515j820j352r58m00K68P17Q34Q34Q63Q76
51406C93514R62J280J610J517J043P43R16J343J873K554L034K585J180m9O1J485
51390D15651L343M956O141O884P340P972R289J1494J4592J8479K2780K7019L1273
51377E87213L6142M1721M7148N1604N5245N8374O0143N8753N2953M2846K9609
51366A121751J4997Q71j1631k2543l2265m0466m6385m9993n2049n2946n2238m9564
51354G27539m5459m0926l6606l2668k9088k5656k2013j8043j4196j1234r564q902
$$ y = [350035, 352783, 355860, 359358, 362816, 365582, 367394, 368596, 369945, 372321, 376534, 383186, 392549, 404432, 417967, 431530, 443160, 451419, 455948, 457311, 456480, 454481, 452123, 449745, 447185, 444065, 439977, 434477, 427347, 419134, 411130, 404526, 399654, 396167, 393652, 391832, 390480, 389522, 389122, 389390, 390107, 390941, 391775, 392638, 393514, 394476, 395756, 397366, 398883, 399926, 400669, 401585, 402928, 404801, 407355, 410389, 412974, 414154, 414105, 414166, 415651, 418994, 423950, 430091, 436975, 444315, 452287, 461576, 473070, 487662, 506141, 528921, 555940, 587213, 623355, 665076, 712224, 763828, 819073, 877447, 937590, 996343, 1049296, 1092142, 1121751, 1136748, 1137619, 1125988, 1103445, 1071180, 1030714, 984329, 934336, 882287, 829341, 777103, 727539, 682080, 641154, 604548, 571880, 542792, 517136, 495123, 477080, 462884, 451650, 442086, 433184]
51342D33184q465p624o501n844o087o631o409n123l584k716k603k713k682k584
51328C63618k562k524k302j902j498j155p41j51M14N86K75j30j12N81J849L270
51312C57516M174M065L236K683L037L828M086L411K122N79j048k421l080l052
51298C79136k950l276l871m251m183l828l505l495l833m177m018l135j746k22
51284C32646J136K047K348K312K605L640N093O219O586O316N722M918L840K510
51270C87938J201K93o2o0J6J54N49J237J952K367K304J675M92q85j774j794j420
51253C94183j529k239k603j803m70j86j627l677m693m264l221k329j638j086q65
51238C61953j011j175j205j416j917k176j768j189j230j822k107j585o65k4O2
$$ y = [433184, 424719, 417095, 410594, 404750, 398663, 392032, 385623, 380500, 376916, 374200, 371597, 368884, 366202, 363618, 361056, 358532, 356230, 354328, 352830, 351675, 350934, 350783, 351197, 351783, 352058, 351928, 351816, 352397, 354246, 357516, 361690, 365755, 368991, 371674, 374711, 378539, 382625, 386036, 388158, 388737, 387689, 385268, 382188, 379136, 376186, 372910, 369039, 364788, 360605, 356777, 353272, 349777, 345944, 341767, 337749, 334614, 332868, 332646, 333782, 335829, 338177, 340489, 343094, 346734, 351827, 358046, 364632, 370948, 376670, 381588, 385428, 387938, 389139, 389432, 389370, 389310, 389326, 389480, 390029, 391266, 393218, 395585, 397889, 399564, 400056, 399171, 397397, 395603, 394183, 392654, 390415, 387812, 386009, 385539, 385353, 383726, 380049, 375356, 371092, 367871, 365542, 363904, 362818, 361953, 360942, 359767, 358562, 357146, 355229, 353053, 351285, 350096, 348866, 347044, 344937, 343352, 342687, 342663, 342725]
51223C42725k13m37k15M57J102J359J540K140K885K951K229J666K071L092L721
51208C67073L435K477J405P79R94J936K873L100K615J905J248N13l19r76j294
51193C87764j460j667j760j506j062q94j124j302r55k25L26M03J69j96o48r09
51177C74954m85O11J557J654J255J247J751J986J409L71m86j011j423j812j984
51162C79594j672p71M58J510K201K950M098N094M987L695K140R75qj045j736j789
51146D00681j710k137k864l239l182l180l511l983m293m190l494k398j517j142
51132C59841q29j76L65J98k71j04O50R94N59J96O36J502K127K600L387M411N160
51115C81246N344M987M164L178K607K708K941K591J681Q23L93L05M30O94Q35N91
$$ y = [342725, 342512, 342075, 341860, 342317, 343419, 344778, 346318, 348458, 351343, 354294, 356523, 358189, 360260, 363352, 367073, 370508, 372985, 374390, 375169, 376163, 378099, 380972, 384072, 386687, 388592, 389840, 390353, 390034, 389058, 387764, 386304, 384637, 382877, 381371, 380309, 379415, 378291, 376989, 376034, 375809, 376135, 376538, 376707, 376511, 375863, 374954, 374469, 375080, 376637, 378291, 379546, 380793, 382544, 384530, 385939, 386310, 385824, 384813, 383390, 381578, 379594, 377922, 377151, 377609, 379119, 381320, 384270, 388368, 393462, 398449, 402144, 404284, 405259, 405251, 404206, 402470, 400681, 398971, 396834, 393970, 390731, 387549, 384369, 380858, 376875, 372582, 368392, 364898, 362500, 360983, 359841, 359012, 358836, 359201, 359399, 359128, 359024, 359674, 360668, 361227, 361423, 362059, 363561, 365688, 368288, 371675, 376086, 381246, 386590, 391577, 395741, 398919, 401526, 404234, 407175, 409766, 411447, 412270, 412663, 412968, 413398, 414092, 414927, 415518]
51099D15518J44p4m9j48l82k34N19J229J036j31j504k297k254j589o88K7K63O
51081D09392m60q19r27p80l57L39J088J453J199O52M58Q85J547J899J920K112
51065D19601K893M160N456O440P192Q127R627J1726J4150J6513J8272J8653J7117
51052E59927J4228J1632J0837J2022J4292J6710J8632J9339J8226J5538J2278
51041G23661R092N570J052m320r558j3611j5767j5741j3890j1361r575r373j0719
51028F25460j2964j5221j6645j6820j5888j4153j1658q388m830j889o9J003K125
51015E10063L621N034N704N541N181N233N532N441M926M854N958P872R605J0670
51001E95235J1265J1591J1595J1396J1266J1094J0385R066P779P080O636N652
$$ y = [415518, 415662, 415588, 415539, 415391, 415009, 414775, 415294, 416523, 417559, 417428, 415924, 413627, 411373, 409784, 409096, 409123, 409386, 409392, 408932, 408113, 407186, 406406, 406049, 406388, 407476, 408929, 410128, 410780, 411238, 412123, 413670, 415569, 417489, 419601, 422494, 426654, 432110, 438550, 445742, 453869, 463496, 475222, 489372, 505885, 524157, 542810, 559927, 574155, 585787, 596624, 608646, 622938, 639648, 658280, 677619, 695845, 711383, 723661, 732753, 738323, 739375, 735055, 725497, 711886, 696119, 680378, 666488, 655127, 645552, 636179, 625460, 612496, 597275, 580630, 563810, 547922, 533769, 522111, 513723, 508893, 507004, 506935, 507938, 510063, 513684, 518718, 524422, 529963, 535144, 540377, 545909, 551350, 556276, 561130, 567088, 574960, 584565, 595235, 606500, 618091, 629686, 641082, 652348, 663442, 673827, 682893, 690672, 697752, 704388, 710040]
50989G10040L839J760K06n89j125k083l461m363l870j982N82L353O255Q876J0392
50974G27830J0547J0152J0124J0581J1311J2523J4557J7264K0387K4191K8906
50963H98373L3786L7684M0620M3818M7924N1964N4588N5661N5994N6050N5563
50952A432025N4201N1848M8380M3810L8781L4323L0846K7791K4580K1592J9785
50941A827962J9572K0467K1793K3106K3847K3037J9938J4959R541M969J409j875
50929B008725n573r725j3952j8104k2511k7522l2997l8482m3883m9445n4948n9444
50917A632139o2178o3335o3356o1981n8835n4652n0813m7589m3913l9241l4585
50906A051661l1044k8298k5395k2365j9944j8249j6732j5258j4251j3786j3381
$$ y = [710040, 713879, 715639, 715845, 715256, 714131, 712048, 708587, 704224, 700354, 698372, 698954, 702307, 708562, 717438, 727830, 738377, 748529, 758653, 769234, 780545, 793068, 807625, 824889, 845276, 869467, 898373, 932159, 969843, 1010463, 1054281, 1102205, 1154169, 1208757, 1264418, 1320412, 1376462, 1432025, 1486226, 1538074, 1586454, 1630264, 1669045, 1703368, 1734214, 1762005, 1786585, 1808177, 1827962, 1847534, 1868001, 1889794, 1912900, 1936747, 1959784, 1979722, 1994681, 2004222, 2009191, 2010600, 2008725, 2003152, 1993427, 1979475, 1961371, 1938860, 1911338, 1878341, 1839859, 1795976, 1746531, 1691583, 1632139, 1569961, 1506626, 1443270, 1381289, 1322454, 1267802, 1216989, 1169400, 1125487, 1086246, 1051661, 1020617, 992319, 966924, 944559, 924615, 906366, 889634, 874376, 860125, 846339, 832958]
50895H32958j2683j1714j0424q772p143o011n156m028k774k061j815j146K65J544
50881G61040J851J435J097J253J905K836L469L272K798L506N953Q827J0516J0951
50867H20709J1170J1699J2397J3360J4828J6374J7294J7890J9317K1991K5137
50856A002166K8160L1526L5715M0141M4007M7725N2617N9198O6502P3351P9751
50845A560859Q6637R4433J02368J09327J14960J19673J23717J26769J28309J27837
50835B694889J24614J17782J07246R4104P9786O5041N0208L6068K3748J3808O106
50824C413400O00k225j859J705P956J6021K4697L2732L9115M2859M2646L7314
50812C654961K6849J2394m810k4013m4434o4932q4623j03242j20371j34786j45221
$$ y = [832958, 820275, 808561, 798137, 789365, 782222, 776211, 771055, 767027, 764253, 762192, 760377, 759231, 759496, 761040, 762891, 764326, 765423, 766676, 768581, 771417, 774886, 778158, 780956, 784462, 790415, 799242, 809758, 820709, 831879, 843578, 855975, 869335, 884163, 900537, 917831, 935721, 955038, 977029, 1002166, 1030326, 1061852, 1097567, 1137708, 1181715, 1229440, 1282057, 1341255, 1407757, 1481108, 1560859, 1647496, 1741929, 1844297, 1953624, 2068584, 2188257, 2311974, 2438743, 2567052, 2694889, 2819503, 2937285, 3044531, 3138635, 3218421, 3283462, 3333670, 3369738, 3393486, 3407294, 3413400, 3414000, 3411775, 3409916, 3411621, 3419577, 3435598, 3460295, 3493027, 3532142, 3575001, 3617647, 3654961, 3681810, 3694204, 3689394, 3665381, 3620947, 3556015, 3471392, 3368150, 3247779, 3112993, 2967772]
50801B967772j51492j54234j53690j49523j41887j31989j21241j10214r8798q7131
50791A667573p5923o5856n6932m8615m0580l3077k6495k0773j5637j1351q656
50780A263678p703p445o681n486m978n659o766p427p775q389r181r589r672j0158
50766A156769j1307j2447j2952j3150j3736j4687j5339j5339j4981j4550j3856
50755A004425j2574j0773q874p288o126n089l596j268J608M347O670Q908J1389
50742I81759J4043J6859K0302K4783K9881L4656L8755M2792M7465N2601N7198
50731A361094O0298O1733O2124O2274O2456O2315O1449N9929N8166N6394N4552
50720B022784N2549N0342M7689M4011L8662L1329K2240J2101J786p988j6626k3340
$$ y = [2967772, 2816280, 2662046, 2508356, 2358833, 2216946, 2084957, 1963716, 1853502, 1754704, 1667573, 1591650, 1525794, 1468862, 1420247, 1379667, 1346590, 1320095, 1299322, 1283685, 1272334, 1263678, 1255975, 1248530, 1241849, 1236363, 1231385, 1225726, 1218960, 1211533, 1203758, 1195369, 1186188, 1176599, 1166927, 1156769, 1145462, 1133015, 1120063, 1106913, 1093177, 1078490, 1063151, 1047812, 1032831, 1018281, 1004425, 991851, 981078, 972204, 964916, 958790, 953701, 950105, 948837, 950445, 954792, 961462, 970370, 981759, 995802, 1012661, 1032963, 1057746, 1087627, 1122283, 1161038, 1203830, 1251295, 1303896, 1361094, 1421392, 1483125, 1545249, 1607523, 1669979, 1732294, 1793743, 1853672, 1911838, 1968232, 2022784, 2075333, 2125675, 2173364, 2217375, 2256037, 2287366, 2309606, 2321707, 2323493, 2315505, 2298879, 2275539]
50708B275539k7211k7819k5611k1283j5121p256J539R897J6704K1538K4324K5000
50696B250240K3632K0247J4402N319p153k1993l7601n2631o6072p6958q4519q8498
50684A878415q9001q6281q0934p4119o7056o0225n3240m5577l7245k8870k1278
50673A234589j4919r439l915K172Q232J3053J6027J7627J8610J9081J8568J6910
50661A336596J4729J2915J1787J1002J0241R757R979J0851J1848J2643J3331J4006
50649A479685J4603J5350J6883J9446K2363K4809K6942K9641L3205L6948M0161
50638A760036M2893M5485M7768M9206M9565M9031M7767M5845M3623M1937M1629
50627B264785M2919M5234M7486M8414M6687M0911K9962J3838n538k4485l9059
$$ y = [2275539, 2248328, 2220509, 2194898, 2173615, 2158494, 2151238, 2152777, 2162674, 2179378, 2200916, 2225240, 2250240, 2273872, 2294119, 2308521, 2313840, 2306687, 2284694, 2247093, 2194462, 2128390, 2051432, 1966913, 1878415, 1789414, 1703133, 1622199, 1548080, 1481024, 1420799, 1367559, 1321982, 1284737, 1255867, 1234589, 1219670, 1210231, 1206316, 1208488, 1216720, 1229773, 1245800, 1263427, 1282037, 1301118, 1319686, 1336596, 1351325, 1364240, 1376027, 1387029, 1397270, 1407027, 1417006, 1427857, 1439705, 1452348, 1465679, 1479685, 1494288, 1509638, 1526521, 1545967, 1568330, 1593139, 1620081, 1649722, 1682927, 1719875, 1760036, 1802929, 1848414, 1896182, 1945388, 1994953, 2043984, 2091751, 2137596, 2181219, 2223156, 2264785, 2307704, 2352938, 2400424, 2448838, 2495525, 2536436, 2566398, 2580236, 2574698, 2550213, 2511154]
50616B511154m6916m8131m4477l8010l0162k1784j3694o892k193L18J253J159
50604B261625j46l361q846j6216k4800l4155m3810n2867o0314o5825o9693p1961
50592A809631p2093o9855o6016o1689n7274n2574m7732m3394l9867l6700l3383
50581A229054l0064k7298k5316k3749k1952j9513j6607j3803j1379q902n805k291
50569A022375Q61L358N663Q098J0269J1707J2554J3253J4071J5329J7495K0497
50557A155530K3320K5006K5767K6486K7333K7623K6943K5647K4203K2659K0937
50546A431454J9135J7443J6035J5111J4693J4544J4665J5788J8720K3251K8333
50535A629172L3383L8744M4792N1219N7516O3539O9356P5037Q0872Q7283R4073
$$ y = [2511154, 2464238, 2416107, 2371630, 2333620, 2303458, 2281674, 2267980, 2261088, 2258895, 2259213, 2260466, 2261625, 2261479, 2258118, 2249272, 2233056, 2208256, 2174101, 2130291, 2077424, 2017110, 1951285, 1881592, 1809631, 1737538, 1667683, 1601667, 1539978, 1482704, 1430130, 1382398, 1339004, 1299137, 1262437, 1229054, 1198990, 1171692, 1146376, 1122627, 1100675, 1081162, 1064555, 1050752, 1039373, 1030471, 1024666, 1022375, 1023236, 1026594, 1032257, 1040355, 1050624, 1062331, 1074885, 1088138, 1102209, 1117538, 1135033, 1155530, 1178850, 1203856, 1229623, 1256109, 1283442, 1311065, 1338008, 1363655, 1387858, 1410517, 1431454, 1450589, 1468032, 1484067, 1499178, 1513871, 1528415, 1543080, 1558868, 1577588, 1600839, 1629172, 1662555, 1701299, 1746091, 1797310, 1854826, 1918365, 1987721, 2062758, 2143630, 2230913, 2324986]
50524B324986J00225J04829J07888J09913J10988J10653J08360J03771R6778Q7533
50514C365924P6319O3266M8456L2305J5426j927j9712l7232n3068o6288p7083
50503C346386q5789r1819r4180r2568q7371p8924o7525n3907l9021k3356p085
50492B624841R137K3961L5920M4072M8163M8413M4784L6326K1846J642k1896m5925
50480B871284o8729q9192j05619j16443j21782j23106j21468j17050j10325j02446
50470A795124r4233q5800p7303o9131o1120n2741m4412l7479l2361k7757k2435
50459A190352j6897j2391r096o277l844k481k339k387j330J239M606P675R905
50446A156735J1692J3667J5742J7352J8609K0305K2445K3690K2955K0855J8649
$$ y = [2324986, 2425211, 2530040, 2637928, 2747841, 2858829, 2969482, 3077842, 3181613, 3278391, 3365924, 3442243, 3505509, 3553965, 3586270, 3601696, 3599769, 3580057, 3542825, 3489757, 3423469, 3346386, 3260597, 3168778, 3074598, 2982030, 2894659, 2815735, 2748210, 2694303, 2655282, 2631926, 2624841, 2633978, 2657939, 2693859, 2737931, 2786094, 2834507, 2879291, 2915617, 2937463, 2939105, 2917209, 2871284, 2802555, 2713363, 2607744, 2491301, 2369519, 2246413, 2124945, 2007895, 1897570, 1795124, 1700891, 1615091, 1537788, 1468657, 1407537, 1354796, 1310384, 1272905, 1240544, 1212787, 1190352, 1173455, 1161064, 1151968, 1145691, 1141847, 1139366, 1137027, 1134640, 1133310, 1134549, 1139155, 1146830, 1156735, 1168427, 1182094, 1197836, 1215188, 1233797, 1254102, 1276547, 1300237, 1323192, 1344047, 1362696]
50435A362696J6371J3075Q712M639K114J171J101J376J759K043K107J972J783
50422A420919J747K128K961L963M937O169Q094J0837J4375J8842K4198K9838L5039
50409A584047L9678M3970M7712N0419N2100N3105N3303N2105M9436M5969M2106
50398B113950L7346L1084K3561J5596P571r45j0667k1820l3685m4843n3998o0747
50386B002403o5399o8120o8549o6284o1452n4655m6578l7648k8041j7975q042
50375A479660R98Q820J5534K0862K3875K3952K1562J7361J0998J777r625k1166
50363A594608l1279l9768m6695n1474n3650n3762n2706n0698m7536m3529l9526
50352A083985l6121l3299l0739k8149k5355k2272j8817j4838j0355n807j674K131
$$ y = [1362696, 1379067, 1392142, 1400854, 1405493, 1407607, 1408778, 1409879, 1411255, 1413014, 1415057, 1417164, 1419136, 1420919, 1422666, 1424794, 1427755, 1431718, 1436655, 1442824, 1450918, 1461755, 1476130, 1494972, 1519170, 1549008, 1584047, 1623725, 1667695, 1715407, 1765826, 1817926, 1871031, 1924334, 1976439, 2025875, 2071844, 2113950, 2151296, 2182380, 2205941, 2221537, 2229108, 2228163, 2217496, 2195676, 2161991, 2117148, 2063150, 2002403, 1937004, 1868884, 1800335, 1734051, 1672599, 1617944, 1571366, 1533718, 1505677, 1487702, 1479660, 1480658, 1489478, 1505012, 1525874, 1549749, 1573701, 1595263, 1612624, 1623622, 1625399, 1615774, 1594608, 1563329, 1523561, 1476866, 1425392, 1371742, 1317980, 1265274, 1214576, 1167040, 1123511, 1083985, 1047864, 1014565, 983826, 955677, 930322, 908050, 889233, 874395, 864040, 858233, 856559, 858690]
50340H58690O106J0277J3938J6256J6692J4880J0799N373K44l402n445o212n919
50327I32277m910l719k412n82J709L716N122O580Q446R785R569Q229P027O261
50313I87098N141L289J335j00j181k395l832n029n337m389k552p36N34J553K670
50298I76069L544L743L621L981N123O830Q920J1086J2686J3545J4728J7536K1814
50285A103226K5979K8512K8486K4944J7231O326n117j4575k0977k4186k4261k1731
50273A123857j7763j3479r449o060l756k575k061j941k311l037l673m199n108
50260A048445o323o931o401n293m246l063j509j97K57M80J706M214P197R911J2135
50245A050382J3649J4274J4419J4884J5920J7056J7898J8440J8607J8139J7211
$$ y = [858690, 864796, 875073, 889011, 905267, 921959, 936839, 947638, 953011, 953255, 949853, 944408, 938196, 932277, 927367, 923648, 921236, 920654, 922363, 926079, 931201, 937781, 946227, 956012, 965581, 973810, 980837, 987098, 992239, 995528, 996863, 996763, 995582, 993187, 989355, 984326, 978989, 974600, 972048, 971312, 971846, 973399, 976069, 979613, 983356, 986977, 990958, 996081, 1002911, 1011831, 1022917, 1035603, 1049148, 1063876, 1081412, 1103226, 1129205, 1157717, 1186203, 1211147, 1228378, 1234704, 1229587, 1215012, 1194035, 1169849, 1145588, 1123857, 1106094, 1092615, 1083166, 1077106, 1073350, 1070775, 1068714, 1066773, 1064462, 1061425, 1057752, 1053553, 1048445, 1042122, 1035191, 1028790, 1023497, 1019251, 1016188, 1014679, 1014482, 1014739, 1015219, 1016925, 1021139, 1028336, 1038247, 1050382, 1064031, 1078305, 1092724, 1107608, 1123528, 1140584, 1158482, 1176922, 1195529, 1213668, 1230879]
50234A230879J6414J5817J4470J1388O690J349l999r468j5039j9823k2639k3233
50222A202806k2448k1134j9268j6492j3204j0620r823j1154j4416j9040k3943
50211A021264k7793k9778k9925k8611k6313k3792k1763k0071j7789j4618j1525
50200G69286r548q550p765o972o377n793m871l931l607l769l677l222l128l801
50186F94275m734n316n506n460n146m697m594n009n425n266m667m205m164m287
50172F25799m151l518k519j652j337j381j094j33J135K210L010L600L780L381
50158F27130K762K594L216M407N715O763P369P631P871Q223Q399Q094P432O753
50144G14359O040M937L408J977J227J264J874K975M717P182J0252J3749J7607
$$ y = [1230879, 1247293, 1263110, 1277580, 1288968, 1295658, 1297007, 1293008, 1283540, 1268501, 1248678, 1226039, 1202806, 1180358, 1159224, 1139956, 1123464, 1110260, 1099640, 1089817, 1078663, 1064247, 1045207, 1021264, 993471, 963693, 933768, 905157, 878844, 855052, 833289, 813218, 795429, 780811, 769286, 759738, 751188, 743423, 736451, 730074, 724281, 719410, 715479, 711872, 708103, 704426, 701204, 698076, 694275, 689541, 684225, 678719, 673259, 668113, 663416, 658822, 653813, 648388, 643122, 638455, 634250, 630086, 625799, 621648, 618130, 615611, 613959, 612622, 611241, 610147, 610014, 611149, 613359, 616369, 619969, 623749, 627130, 629892, 632486, 635702, 640109, 645824, 652587, 659956, 667587, 675458, 683681, 692080, 700174, 707606, 714359, 720399, 725336, 728744, 730721, 731948, 733212, 735086, 738061, 742778, 749960, 760212, 773961, 791568]
50131G91568K1766K5935K9532L1995L3161L3380L3210L3008L2774L2402L1986
50120A130717L1914L2527L3599L4114L2752K8854K2868J5814Q326M54p770j5759
50108A348410k2662k7964l1617l3700l4254l3522l2101l0616k9277k7720k5342
50097A019635k1978j8445j6172j5861j6577j6758j6065j5505j5534j4993j2672
50086H39075r112n838l273o99J958L819M736N849P769R415R568Q684Q054P915
50072H87920P504O538N428M256K722J098J13k77r91k436l816m301m097l988m304
50057H91369m815n214n326n198n193n615o089n804m575l178k327j783q62O55K451
50042H38496M197N668O717P485Q392R577J0592J1065J1320J1950J2927J3665J3826
$$ y = [791568, 813334, 839269, 868801, 900796, 933957, 967337, 1000547, 1033555, 1066329, 1098731, 1130717, 1162631, 1195158, 1228757, 1262871, 1295623, 1324477, 1347345, 1363159, 1371485, 1371939, 1364169, 1348410, 1325748, 1297784, 1266167, 1232467, 1198213, 1164691, 1132590, 1101974, 1072697, 1044977, 1019635, 997657, 979212, 963040, 947179, 930602, 913844, 897779, 882274, 866740, 851747, 839075, 829963, 824125, 820852, 820153, 822111, 825930, 830666, 836515, 844284, 853699, 863267, 871951, 880005, 887920, 895424, 901962, 907390, 911646, 914368, 915466, 915579, 915302, 914311, 911875, 908059, 903758, 899661, 895673, 891369, 886554, 881340, 876014, 870816, 865623, 860008, 853919, 848115, 843540, 840362, 838035, 836252, 835390, 836045, 838496, 842693, 848361, 855078, 862563, 870955, 880532, 891124, 902189, 913509, 925459, 938386, 952051, 965877]
50029I65877J3590J3195J2574J1537J0011Q019N588K852J80j798k515k045j266
50016A035799j051j263j053j84O02Q15J137K446M442N942O274N693M721L830L710
50001A071860M947P277R769J1917J3957J5937J7080J6399J3442Q250J160o885
49989A185110j4356k0113k4158k7086k9068k9866k9612k8921k8240k7571k6911
49978H99208k6460k6114k5205k3170k0341j7687j5817j4473j3094j1544j0100
49967F95203q949p964o969n960n017m224l724l629l742l580k861j836r43k46N73
49952F36132J800L525N731Q225J0463J1860J2287J2095J1534J0485Q866P003N404
49939G45410M312L535K658J360k72j807l029m463o948j0588j4386j7110j8187
$$ y = [965877, 979467, 992662, 1005236, 1016773, 1026784, 1034803, 1040391, 1043243, 1043423, 1041625, 1039110, 1037065, 1035799, 1034748, 1033485, 1032432, 1032248, 1032850, 1033665, 1034802, 1037248, 1041690, 1047632, 1053906, 1059599, 1064320, 1068150, 1071860, 1076807, 1084084, 1093853, 1105770, 1119727, 1135664, 1152744, 1169143, 1182585, 1190835, 1191995, 1185110, 1170754, 1150641, 1126483, 1099397, 1070329, 1040463, 1010851, 981930, 953690, 926119, 899208, 872748, 846634, 821429, 798259, 777918, 760231, 744414, 729941, 716847, 705303, 695203, 686254, 678290, 671321, 665361, 660344, 656120, 652396, 648767, 645025, 641445, 638584, 636748, 635805, 635559, 636132, 637932, 641457, 647188, 655413, 665876, 677736, 690023, 702118, 713652, 724137, 733003, 740006, 745410, 749722, 753257, 755915, 757275, 757003, 755196, 752167, 747704, 740756, 730168, 715782, 698672, 680485]
49926F80485j7744j6220j4310j2792j1856j0789q839o244l970k489j364k5J563
49913E75406L071M192M682M446L815L388L374L476L601M178N447O844P695Q238
49899F41853R341J1259J3228J4326J4304J3454J2118J0534Q816O869M506J850
49887G62458o86k932n169p568r755j1270j2206j3024j3854j4448j4713j4840j4825
49874F27168j4234j2689j0398q030o239n303m951m445l216j549l58k0J69J066
49860E56971K490L569M099M926O757R150J1009J1761J1762J1745J2153J2838J3173
$$ y = [680485, 662741, 646521, 632211, 619419, 607563, 596774, 587935, 581691, 577721, 575232, 573868, 573843, 575406, 578477, 582669, 587351, 591797, 595612, 599000, 602374, 605850, 609451, 613629, 619076, 625920, 633615, 641853, 651194, 662453, 675681, 690007, 704311, 717765, 729883, 740417, 749233, 756102, 760608, 762458, 761772, 758840, 753671, 746103, 736348, 725078, 712872, 699848, 685994, 671546, 656833, 641993, 627168, 612934, 600245, 589847, 581817, 575578, 570275, 565324, 560879, 557663, 556114, 555756, 555736, 555905, 556971, 559461, 563030, 567129, 572055, 578812, 587962, 598971, 610732, 622494, 634239, 646392, 659230, 672403]
$$ [...]
##END NTUPLES=NMR SPECTRUM
##END=
