##TITLE=AC1587_HBRAH13317_8313784_dZurNqBdZx
##JCAMPDX= 6.0         $$ Bruker NMR JCAMP-DX V2.0
##DATA TYPE= NMR SPECTRUM
##DATA CLASS= NTUPLES
##ORIGIN= BRUKER
##OWNER= Administrator
$$ 1.72 TOPSPIN		Version 2.1
$$ 2013-11-09 16:06:13.339 -0800  Administrator@X
$$ Compression mode = diff/dup
##.OBSERVE FREQUENCY= 400.02188249412
##.OBSERVE NUCLEUS= ^1H
##.ACQUISITION MODE= SIMULTANEOUS (DQD)
##.ACQUISITION SCHEME= undefined
##.AVERAGES= 8
##.DIGITISER RES= 22
##SPECTROMETER/DATA SYSTEM= spect
##.PULSE SEQUENCE= zg30
##.SOLVENT NAME= COFFEE_meoh
##.SHIFT REFERENCE= INTERNAL, COFFEE_meoh, 1, 14.98509
##AUDIT TRAIL= $$ (NUMBER, WHEN, WHO, WHERE, PROCESS, VERSION, WHAT)
$$ ##TITLE= Audit trail, TOPSPIN		Version 2.1
$$ ##JCAMPDX= 5.01
$$ ##ORIGIN= Bruker BioSpin GmbH
$$ ##OWNER= Administrator
$$ $$ E:\/data/COFFEE/nmr/AC1587_HBRAH13317_8313784_dZurNqBdZx/10/pdata/1/auditp.txt
$$ ##AUDIT TRAIL=  $$ (NUMBER, WHEN, WHO, WHERE, PROCESS, VERSION, WHAT)
(   1,<2013-11-09 16:06:05.639 -0800>,<Administrator>,<X>,<go>,<TOPSPIN 2.1>,
      <created by zg
	started at 2013-11-09 16:04:58.707 -0800,
	POWCHK enabled, PULCHK disabled,
       configuration hash MD5:
       C8 4E 4E 5D D3 5C D8 9E 9F 52 82 E0 59 8A DE 15
       data hash MD5: 64K
       32 66 6D 85 D7 C3 0D A3 CC E8 31 9F 73 D8 AA 6C>)
(   2,<2013-11-09 16:06:08.922 -0800>,<Administrator>,<X>,<proc1d>,<TOPSPIN 2.1>,
      <Start of raw data processing
       efp LB = 0 FT_mod = 6 PKNL = 1 PHC0 = 0 PHC1 = 0 SI = 32K 
       data hash MD5: 32K
       A6 48 6F 65 D4 8E 5C C1 CC 01 C1 17 47 9D 69 D1>)
(   3,<2013-11-09 16:06:09.266 -0800>,<Administrator>,<X>,<proc1d>,<TOPSPIN 2.1>,
      <pk PHC0 = 90.22522 PHC1 = 0 
       data hash MD5: 32K
       5D 5F 60 88 ED 59 38 E9 7E 1F C1 4E F0 CC 07 D5>)
(   4,<2013-11-09 16:06:09.369 -0800>,<Administrator>,<X>,<proc1d>,<TOPSPIN 2.1>,
      <abs ABSG = 1 
       data hash MD5: 32K
       1B 63 FA 71 E4 30 B4 5E 58 7F CC CE 6C 44 73 AC>)
(   5,<2013-11-09 16:06:09.420 -0800>,<Administrator>,<X>,<proc1d>,<TOPSPIN 2.1>,
      <abs ABSG = 2 
       data hash MD5: 32K
       45 4E 61 3D 6F 35 FE B8 C9 6E AA 59 37 57 F2 EA>)
(   6,<2013-11-09 16:06:09.489 -0800>,<Administrator>,<X>,<proc1d>,<TOPSPIN 2.1>,
      <abs ABSG = 3 
       data hash MD5: 32K
       93 55 22 62 17 A3 52 A5 8A 5C F6 71 EE CB 54 6A>)
(   7,<2013-11-09 16:06:09.541 -0800>,<Administrator>,<X>,<proc1d>,<TOPSPIN 2.1>,
      <abs ABSG = 4 
       data hash MD5: 32K
       B6 17 DB 5B E1 E9 D2 91 DB 68 16 14 6F 27 7A 85>)
(   8,<2013-11-09 16:06:09.592 -0800>,<Administrator>,<X>,<proc1d>,<TOPSPIN 2.1>,
      <abs ABSG = 5 
       data hash MD5: 32K
       4B 24 9C 7A A4 A2 C8 48 1B 72 29 52 48 D1 F2 5E>)
$$ ##END=
$$ 
$$ $$ hash MD5
$$ $$ 8A 34 B8 A6 4D 1C 16 ED 57 D3 6F 0C E9 E7 B1 C0
##$RELAX= 
##$RELAX= 
##$RELAX= 
##$RELAX= 
##$RELAX= 
##$RELAX= 
##$RELAX= 
$$ Bruker specific parameters
$$ --------------------------
##$DU= <E:\>
##$EXPNO= 10
##$NAME= <AC1587_HBRAH13317_8313784_dZurNqBdZx>
$$ [...]
150 150 150 150 150 150 150 150
##$TP07= 0
##$TPNAME0= <>
##$TPNAME1= <>
##$TPNAME2= <>
##$TPNAME3= <>
##$TPNAME4= <>
##$TPNAME5= <>
##$TPNAME6= <>
##$TPNAME7= <>
##$TPOAL= (0..7)
0.5 0.5 0.5 0.5 0.5 0.5 0.5 0.5
##$TPOFFS= (0..7)
0 0 0 0 0 0 0 0
##$TUNHIN= 0
##$TUNHOUT= 0
##$TUNXOUT= 0
##$USERA1= <user>
##$USERA2= <user>
##$USERA3= <user>
##$USERA4= <user>
##$USERA5= <user>
##$V9= 5
##$VALIST= <valist>
##$VCLIST= <CCCCCCCCCCCCCCC>
##$VD= 0
##$VDLIST= <DDDDDDDDDDDDDDD>
##$VPLIST= <PPPPPPPPPPPPPPP>
##$VTLIST= <TTTTTTTTTTTTTTT>
##$WBST= 1024
##$WBSW= 4
##$XGAIN= (0..3)
0 0 0 0
##$XL= 0
##$YL= 0
##$YMAX_a= 622719
##$YMIN_a= -538037
##$ZGOPTNS= <>
##$ZL1= 120
##$ZL2= 120
##$ZL3= 120
##$ZL4= 120
##$ABSF1= 14.98509
##$ABSF2= -5.573092
##$ABSG= 5
##$ABSL= 3
##$ALPHA= 0
##$AQORDER= 0
##$ASSFAC= 0
##$ASSFACI= 0
##$ASSFACX= 0
##$ASSWID= 0
##$AUNMP= <proc_prof1d_extract_pilot.lims>
##$AXLEFT= 0
##$AXNAME= <>
##$AXNUC= <1H>
##$AXRIGHT= 0
##$AXTYPE= 0
##$AXUNIT= <>
##$AZFE= 0.1
##$AZFW= 0.1
##$BCFW= 0
##$BC_mod= 0
##$BYTORDP= 0
##$COROFFS= 0
##$CY= 15
##$DATMOD= 1
##$DC= 0
##$DFILT= <>
##$DTYPP= 0
##$F1P= 0
##$F2P= 0
##$FCOR= 0.5
##$FTSIZE= 32768
##$FT_mod= 6
##$GAMMA= 0
##$GB= 0
##$INTBC= 1
##$INTSCL= 1
##$ISEN= 128
##$LB= 0
##$LEV0= 0
##$LPBIN= 0
##$MAXI= 10000
##$MC2= 0
##$MEAN= 0
##$ME_mod= 0
##$MI= 0
##$NCOEF= 0
##$NC_proc= -8
##$NLEV= 6
##$NOISF1= 0
##$NOISF2= 0
##$NSP= 0
##$NTH_PI= 0
##$NZP= 0
##$OFFSET= 14.98509
##$PC= 1
##$PHC0= 90.22522
##$PHC1= 0
##$PH_mod= 1
##$PKNL= yes
##$PPARMOD= 0
##$PPDIAG= 0
##$PPIPTYP= 0
##$PPMPNUM= 2147483647
##$PPRESOL= 1
##$PSCAL= 4
##$PSIGN= 0
##$PYNMP= <proc.py>
##$REVERSE= no
##$SF= 400.02
##$SI= 32768
##$SIGF1= 0
##$SIGF2= 0
##$SINO= 400
##$SIOLD= 32768
##$SPECTYP= <>
##$SREGLST= <1H.CDCl3>
##$SSB= 0
##$STSI= 32768
##$STSR= 0
##$SW_p= 8223.68421052631
##$SYMM= 0
##$S_DEV= 0
##$TDeff= 65536
##$TDoff= 0
##$TI= <>
##$TILT= no
##$TM1= 0
##$TM2= 0
##$TOPLEV= 0
##$USERP1= <user>
##$USERP2= <user>
##$USERP3= <user>
##$USERP4= <user>
##$USERP5= <user>
##$WDW= 1
##$XDIM= 32768
##$YMAX_p= 459653820
##$YMIN_p= -767606
##$CURPLOT= <Network HP LaserJet P1505>
##$CURPRIN= <$Network HP LaserJet P1505>
##$DFORMAT= <normdp>
##$LAYOUT= <+/1D_H.xwp>
##$LFORMAT= <normlp>
##$PFORMAT= <normpl>
##$SURQMSG= 1
$$ End of Bruker specific parameters
$$ ---------------------------------
##NTUPLES= NMR SPECTRUM
##VAR_NAME=  FREQUENCY,     SPECTRUM/REAL,   SPECTRUM/IMAG
##SYMBOL=    X,             R,               I
##VAR_TYPE=  INDEPENDENT,   DEPENDENT,       DEPENDENT
##VAR_FORM=  AFFN,          ASDF,            ASDF
##VAR_DIM=   32768,         32768,           32768
##UNITS=     HZ,            ARBITRARY UNITS, ARBITRARY UNITS
##FACTOR=    0.250966925370066, 1,           1
##FIRST=     8223.43324360094, -64688,       -186175
##LAST=      0,             69703,           -282269
##MIN=       0,             -767606,         0
##MAX=       8223.43324360094, 459653820,    0
$$ Real data points
##PAGE= N=1
##DATA TABLE= (X++(R..R)), XYDATA
$$ [...]
$$ plain form
19575 -5605 -61947 -88808 39521 19174 36894 -264815 -113721 -229009 -19802 -154242 -309243
19564 -309243 -143010 -188090 116701 29628 -173028 80465 31468 106796 -117446 -202915 -139687
19553 -139687 86460 -97365 -64402 -54045 -47554 -106700 -27555 -131889 -112400 -165923 73235
19541 -232039 -140525 -110061 125560 -29013 11046 -173802 -180253 -209086 -242526 128947 -461197
19529 -146369 365284 174358 -101998 68100 111434 -205499 44447 -246566 -267614 -313791
19519 -313791 146949 -97384 -127974 -284925 -81415 31853 40817 119630 -220469 -244277 64233
19507 6030 -20874 -166670 -73369 -53001 -401098 -72896 -36727 -26381 -196533 -172910 -148322
19496 -148322 -111179 178680 -49900 -186012 56103 7108 135870 232323 379539 -10849 105347
$$ packed form
19575e605n6342k6861C9521A9174J7720b64815a13721j15288a9802j34440j55001
19564c09243a43010m5080A16701B9628a73028H0465C1468P5328a17446q5469O3228
19553a39687H6460i7365L2963J0357O491n9146b7555j04334J9489n3523G3235
19541b32039R1514L0464A25560b9013A1046a73802o451k8833l3440A28947d61197
19529a46369C65284A74358a01998F8100M3334b05499D4447b46566k1048m6177
19519c13791A46949i7384l0590j56951h1415C1853Q964P8813b20469k3808F4233
19507F030b0874j45796g3369K0368l48097g2896L6169J0346j70152K3623K4588
19496a48322L7143A78680d9900j36112E6103G108J28762R6453J47216a0849A05347
$$ plain form
19484 7553 -226453 28005 -152805 -1071 -116477 -109915 190921 83425 -365394 -161290 2241
19472 33745 114152 -191780 -49322 -190845 -426354 -269807 -40947 -50460 -323906 -31287 -168
19460 -227897 -39288 -270385 2470 -34291 77180 -62867 -355166 71581 9714 -114537 -173879
19449 -173879 -30543 -154001 -116749 24919 243461 241382 -16667 -60214 -245973 156349 -281909
19437 170031 -245775 -18960 -174982 -289328 -167574 -209633 17055 -161872 62112 62315 -233105
19425 132528 -316196 -169102 237396 24509 21012 -68246 -136388 -111615 83787 -88453 -112044
19414 -112044 -30987 102543 156885 -179138 -11417 -79364 -45217 -10285 -442187 120966 -46560
19402 272512 -121983 -80743 -416316 268504 -96473 -269519 144395 82756 158733 -182557
$$ packed form
19484G553b26453B8005a52805a071j15406O562A90921H3425c65394a61290B241
19472C3745Q0407a91780d9322j41523k35509J56547d0947r513k73446c1287a68
19460b27897c9288k31097B470c4291G7180f2867k92299G1581I714a14537n9342
19449a73879c0543j23458L7252B4919K18542k079a6667m3547j85759A56349b81909
19437A70031b45775a8960j56022j14346J21754m2059A7055a61872F2112K03b33105
19425A32528c16196J47094B37396B4509l497f8246o8142K4773H3787h8453k3591
19414a12044c0987A02543N4342a79138a1417o7947L4147a0285m31902A20966d6560
19402B72512a21983M1240l35573B68504i6473j73046A44395o1639P5977a82557
$$ plain form
19391 -131345 -41269 90670 82339 -31694 4767 121288 -171667 6143 -50854 -90663 -178995 -143992
19379 -143992 -10099 172603 -296371 161372 -147003 -250979 62703 -225666 -110008 -214141
19369 -214141 213315 -226653 148600 -127953 -96736 -161386 65536 -60203 7833 -176863 -187441
19358 -187441 88802 82945 70216 -113746 7033 -206852 -121048 -102619 15906 -155256 122027
19346 -233967 19473 63791 -317568 144479 -88929 -33590 201551 -131925 85616 -168863
19335 151513 -220313 -283596 33999 -20885 -9649 172734 449588 133723 -146031 -168942 295956
19323 124783 -25032 -215797 -214383 -242173 -363979 -182945 -122704 110713 -106646 160762
19312 15640 -12066 105261 -410634 -193476 -57257 -157940 103439 -118381 -343055 -95332
$$ packed form
19391a31345d1269I0670q331c1694D767J16521a71667F143e0854l9809q8332L5003
19379a43992a0099A72603b96371A61372a47003j03976F2703b25666a10008j04133
19369b14141B13315b26653A48600a27953L1217o4650F5536f0203G833a76863j0578
19358a87441H8802n857j2729a13746G033b06852Q5804J8429A5906a55256A22027
19346b33967A9473M4318c17568A44479h8929c3590B01551a31925H5616a68863
19335A51513b20313o3283C3999b0885i649A72734K76854A33723a46031k2911B95956
19323A24783b5032j90765J414k7790j21806J81034O0241A10713a06646A60762
19312A5640a2066A05261d10634a93476e7257j00683A03439a18381k24674i5332
$$ plain form
19301 -138750 -27231 -145600 -582767 61544 198345 162374 -50718 311368 162346 43347
19290 -129326 -96432 29925 58707 797 146431 11983 -35544 -270155 239872 -85449 -208372
19279 -208372 41730 -200510 -116134 -392111 -40735 -186909 -173751 -219408 14096 -254027 88919
19267 -387833 -42518 -151216 -260328 200036 -99868 -68696 -92072 -227032 -250198 753 -92283
19255 35623 -313859 -146114 -67361 162636 -98533 7207 217 -131223 -215674 -50503 162720
19243 28659 -186550 -274776 -91370 -316658 179496 -126043 -79369 6441 57620 -85182 -168723
19232 -168723 249325 36652 -126893 122197 -49726 -364253 -159510 111828 -57187 115317
19221 71789 -76463 -32948 27346 -149124 40130 -301871 157335 -443403 -101565 -198308 -193712
$$ packed form
19301a38750b7231j18369m37167F1544J36801l5971e0718C11368j49022D3347
19290a29326L2894B9925K8782G97J45634A1983c5544k34611B39872h5449j22923
19279b08372D1730b00510Q4376k75977d0735j46174J3158m5657A4096b54027H8919
19267c87833d2518j08698j09112B00036i9868L1172k3376j34960k3166G53i2283
19255C5623c13859a46114f7361A62636i8533G207B17a31223q4451e0503A62720
19243B8659a86550q8226i1370k25288A79496a26043M6674F441N1179h5182q3541
19232a68723B49325C6652a26893A22197d9726l14527a59510A11828e7187A15317
19221G1789g6463c2948B7346a49124D0130c01871A57335d43403a01565r6743M596
$$ plain form
19210 -193712 64975 -48616 209585 -88558 11624 -303236 258464 -93513 -62207 -94341 -6438
19198 -160804 -221139 1532 -88161 110934 -46832 -24171 90101 -103505 27540 -139948 87769
19186 -94728 48639 -251136 164824 103515 -33830 -161648 -57280 88379 -54358 -60781 265720
19174 -43907 -107271 -123207 1635 -47851 141713 94456 -234460 -17536 -307396 -236555 76034
19162 -2475 48104 -167982 1500 39905 -294586 91718 74773 -47841 -230912 -211588 -151397
19151 -151397 4704 -135258 -242110 -43774 16574 -373068 149029 -354333 155153 3325 -9737
19139 -82537 141572 7182 -191536 -220156 -263200 -139635 396045 142447 192883 -50617 -1389
19127 14052 -216279 -66336 -376970 -156551 206147 116825 -80412 -89997 123616 241920 10859
$$ packed form
19210a93712F4975d8616B09585h8558A1624c03236B58464i3513L1306l2134f438
19198a60804o0335A532h8161A10934d6832K2661I0101a03505B7540a39948H7769
19186i4728D8639b51136A64824o1309c3830j27818e7280H8379e4358o423B65720
19174d3907o3364j5936A635d7851A41713m7257b34460a7536k89860P0841G6034
19162b475D8104a67982A500L8405b94586I1718j6945d7841j83071J9324O0191
19151a51397D704a35258j06852d3774A6574c73068A49029c54333A55153C325i737
19139h2537A41572G182a91536k8620m3044J23565C96045A42447N0436e0617a389
19127A4052b16279f6336l10634a56551B06147q9322h0412r585A23616J18304A0859
$$ plain form
19115 14661 -198330 128597 -168736 -271115 -231924 168173 -342646 2220 -45954 256352
19104 -240294 -137411 -94085 81661 -354680 -204041 113505 -257151 77402 -115535 144956
19093 39507 60326 -200271 169146 310219 -56373 -42671 -52187 -58507 -194210 -141684 102912
19081 -61221 38999 104620 -352718 361943 23532 -20834 -109105 74979 947 90785 70024 -150206
19068 -46468 171267 -99691 97650 -116031 -20756 -268789 -238626 -28460 -240152 174909 -48230
19056 -272961 -212106 -84166 113675 -55615 169499 189718 -48812 -84755 -150633 37862 336467
19045 336467 -189672 -9440 -109195 272536 -479214 -147931 98305 169770 273828 -166239
19034 -47176 117571 94809 105445 31568 -241697 -183674 362201 58050 166609 31779 -63316
$$ packed form
19115A4661a98330A28597a68736j02379L9191A68173c42646B220d5954B56352
19104b40294J02883M3326H1661c54680J50639A13505b57151G7402a15535A44956
19093C9507K0819b00271A69146J41073e6373J3702r516o320j35703N2526A02912
19081f1221C8999O5621c52718C61943B3532b0834q8271G4979I47Q9838k0761a50206
19068d6468A71267i9691I7650a16031b0756k48033L0163b8460k11692A74909d8230
19056b72961O0855h4166A13675e5615A69499K0219d8812l5943o5878C7862K98605
19045C36467a89672i440r9755B72536d79214a47931I8305P1465J04058a66239
19034d7176A17571k2762J0636C1568b41697N8023C62201E8050J08559C1779f3316
$$ plain form
19022 303469 205767 -134188 -46526 116341 164348 -64186 -211976 125439 272460 -111984
19011 129952 -88950 -216331 -174841 -91545 -79281 -38755 131012 -33460 -431196 -42539 158323
18999 140034 -279559 98688 50998 42516 268546 -212277 -93324 -212268 94618 268221 -32926
18987 108050 -122693 -149623 54336 118925 -50718 134406 -265479 -60420 323042 -69238 56153
18975 -2595 -120593 -79008 -87593 -136348 -96726 -68 -80276 -201933 152010 -315603 73681 -106624
18962 95695 268977 -105611 -61401 267171 133615 -130211 -115785 144167 -468370 -41881
18951 56607 255807 -170594 116914 -276178 -63495 -215587 -224263 291922 -168813 23009
18940 -218152 383885 34296 -2386 -64562 49906 127598 -95151 78848 -39493 -8582 157942
$$ packed form
19022C03469r7702a34188d6526A16341M8007f4186j47790A25439J47021a11984
19011A29952h8950j27381M1490Q3296J2264c8755A31012c3460l97736d2539A58323
18999A40034b79559I8688m7690q482K26030b12277i3324j18944I4618J73603c2926
18987A08050a22693k6930E4336O4589e0718A34406b65479f0420C23042f9238E6153
18975b595j17998M1585q585m8755L9622f8q0208j21657A52010c15603G3681a06624
18962I5695J73282a05611M4210B67171j33556a30211J4426A44167d68370d1881
18951E6607J99200a70594A16914b76178f3495j52092q676B91922a68813B3009
18940b18152C83885C4296b386o2176D9906P7692i5151G8848c9493h582A57942
$$ plain form
18928 -70996 -28852 -97038 61939 49654 -19242 56562 -189766 -351146 -75225 -235164 -214432
18917 -214432 -19444 -109553 -294001 -203973 97813 -137025 51966 7167 -304952 -148127 -204175
18906 -204175 -11229 -77842 91632 144675 203176 -387867 83200 -5894 -58584 197480 249917
18895 249917 -252092 377637 134444 279851 -177569 -357439 165772 156194 -141122 -38889
18884 46101 201259 -439640 -207913 -44452 -39998 -168339 49574 107707 -30717 401063 -121517
18872 -249640 160309 -249599 139075 -330587 -37303 -226529 -30957 -26669 92938 -287886
18861 -46815 -140089 149395 155849 -362266 40409 -130321 -3896 -107710 -173185 8973 -129692
18849 333774 264280 202713 129274 80476 21793 -92565 273723 -194472 119649 -33753 -148870
$$ packed form
18928g0996b8852o8186F1939j2285a9242E6562a89766j61380g5225j59939K0732
18917b14432a9444r0109j84448R0028I7813a37025E1966G167c04952a48127n6048
18906b04175a1229o6613I1632N3043N8501c87867H3200e894n2690A97480N2437
18895B49917b52092C77637A34444J45407a77569j79870A65772r578a41122c8889
18884D6101J55158d39640b07913d4452M454j28341D9574N8133c0717D01063a21517
18872b49640A60309b49599A39075c30587c7303j89226c0957M288I2938b87886
18861d6815r3274A49395O454c62266D0409a30321c896j03814o5475H973a29692
18849C33774o9494o1567p3439m8798B1793i2565B73723a94472A19649c3753j15117
$$ plain form
18838 -148870 -220611 37786 66225 36076 -157313 4086 -160541 22448 89943 -32080 19108
18826 22826 -84374 104693 -235726 171256 409747 -362421 -264760 129293 -276561 237977
18815 91143 41245 252483 55635 145093 103376 236080 20805 155110 -20254 -207925 -135870
18804 -135870 -204923 -92503 178299 -348315 52626 131810 -235739 -316925 -309884 17101 -64798
18792 -12575 94891 113932 -82046 59243 -15299 -213281 -90821 -198723 -184658 87170 147526
18781 147526 -64781 91758 -174855 -207428 419494 203509 19112 -130304 -315361 31478
18770 -190528 11861 106942 -154094 -527287 110881 -249173 -293180 99266 -173286 71767
18759 -110633 -115465 -1917 299873 55201 93877 -76930 -56175 -245662 100958 290916 180018
$$ packed form
18838a48870p1741C7786K8439l0149a57313D086a60541B2448O7495c2080A9108
18826B2826h4374A04693b35726A71256K38491c62421R7661A29293b76561B37977
18815I1143D1245K11238E5635Q9458m1717J32704B0805J34305b0254j87671P2055
18804a35870o9053i2503A78299c48315E2626P9184b35739q1186P041A7101f4798
18792a2575I4891J9041h2046E9243a5299j97982i0821j07902J4065H7170O0356
18781A47526f4781I1758a74855l2573D19494B03509A9112a30304j85057C1478
18770a90528A1861R5081a54094l73193A10881b49173m4007I9266a73286G1767
18759a10633m832a917B99873E5201L8676g6930K0755j89487A00958J89958j10898
$$ plain form
18748 180018 -7208 -237142 215349 307836 -51768 164036 -223061 -93879 -272051 206814
18737 -223007 -105781 -122872 -77939 -69984 -189471 -43613 -155131 -131252 32476 -110966 -40780
18725 -86628 133180 -76157 -311981 55328 -50739 42155 54510 121883 -308415 -19361 203779
18713 -104764 -158584 -61028 -235010 -33712 -48660 -123511 23708 160060 58815 -191973 21285
18701 -477028 133286 -96631 -103356 -261819 -395238 229595 -77821 -158164 -177860 -19910 532709
18689 98552 -153334 -374616 -33629 295122 -111503 -234983 -190988 -230247 -65804 -2271 -546470
18678 -546470 107066 -11005 88505 -5842 35811 -405163 282360 -28520 -98936 -315938 291698
18666 -36956 -120697 86471 -76176 -89454 -36606 172546 -34678 -38339 126668 -37470 26425
$$ packed form
18748A80018g208k29934B15349R2487e1768A64036b23061i3879j78172B06814
18737b23007a05781j7091M4933P955j19487d3613j11518K3879C2476a10966d0780
18725h6628A33180g6157k35824E5328e0739D2155J2355O7373c08415a9361B03779
18713a04764n3820f1028j73982c3712j4948p4851B3708J36352E8815a91973B1285
18701d77028A33286i6631o725j58463j33419B29595g7821q0343j9696a9910E32709
18689I8552a53334k21282c3629B95122a11503j23480M3995l9259f5804b271n44199
18678e46470A07066a1005H8505e842C5811d05163B82360b8520p0416k17002B91698
18666c6956q3741H6471g6176j3278c6606A72546c4678l661A26668c7470B6425
$$ plain form
18654 76246 -100477 86485 -217654 130447 -63208 -7878 -164595 343677 -73931 -74528 155338
18642 -173818 -39949 160951 -139635 -238178 -140746 -495464 26761 -243490 -48485 -68479 12540
18630 -156968 -258489 120836 -132053 235588 1692 20328 -86569 205806 -5459 158552 159630
18619 159630 103561 -198711 -142455 11944 -350037 70576 -231606 -489 907 28741 -188769
18607 -133575 -78851 -164195 -46095 -172011 -99863 -24203 -248627 46315 -66218 -216122 -286452
18596 -286452 -10096 230046 160870 11473 -142362 177593 -715 163805 -13709 130167 77206
18585 77206 -250982 -277846 -45098 84719 -299037 96365 -3031 36012 -260958 8164 34476
18574 34476 71930 -135283 -76669 -301230 -88832 -28401 -117441 -98084 -196796 233184 -170366
$$ packed form
18654G6246a00477H6485b17654A30447f3208g878j56717C43677g3931n97A55338
18642a73818c9949A60951a39635r8543R7432l54718B6761b43490d8485j9994A2540
18630a56968j01521A20836a32053B35588A692J8636h6569B05806e459A58552J078
18619A59630n6069a98711N6256A1944c50037G0576b31606d89I07K7834a88769
18607a33575N4724q5344d6095j25916P2148b4203k24424D6315f6218j49904p0330
18596b86452a0096B30046o9176A1473a42362A77593g15A63805a3709A30167n2961
18585G7206b50982k6864d5098H4719b99037I6365c031C6012b60958H164K6312
18574C4476L7454a35283N8614k24561h8832b8401q9040J9357r8712B33184a70366
$$ plain form
18562 27348 96825 -202993 158733 -94778 -106639 -31079 -37151 -90943 315457 159554 -68393
18550 -37273 -68954 95581 -62096 16150 -117083 -211125 -156706 -60703 -38347 145566 -146870
18538 20999 -117882 -364919 109983 -310993 -243928 -143432 -139931 -147343 -90665 -227857 -35043
18526 37045 73747 295622 -119422 -105488 218035 -346803 -234944 -53797 191 183435 -21599
18514 -3129 14998 -211150 174201 34481 -71335 112894 -244061 -147806 17899 -80157 -11613
18502 -69627 3953 211146 106 4624 -181872 -22383 -94313 129021 24066 -454109 -177443
18490 88745 -90995 101480 1170 -178687 -538249 362015 157466 20433 -52949 -325472 91514
18478 -365654 -22554 -289540 21872 164577 124315 -571253 -19129 215025 -60235 91840 110405
$$ packed form
18562B7348O9477b02993A58733i4778j1861c1079o072n3792C15457j55903f8393
18550c7273l1681I5581f2096A6150a17083r4042N4419f0703K2356A45566a46870
18538B0999a17882k47037A09983c10993O7065J00496L501p412N6678j37192c5043
18526C7045L6702K21875a19422J3934B18035c46803J11859e3797A91J83244b1599
18514c129A4998b11150A74201C4481g1335A12894b44061R6255A7899h0157a1613
18502f9627C953K07193A06M518a81872b2383p1930A29021B4066d54109a77443
18490H8745i0995A01480A170a78687l59562C62015A57466B0433e2949k72523I1514
18478c65654b2554k66986B1872J42705m0262e71253a9129B15025f0235I1840J8565
$$ plain form
18467 110405 -292318 40691 -161609 -102266 86794 -157915 148288 -2531 -158363 283642
18456 134870 205414 -145713 181569 -43959 -118925 168934 -8965 -48776 122315 -151408 213218
18444 -271577 304255 -49876 167954 51422 -29585 -216622 64032 -113726 -292494 -80636
18433 -72343 112705 -102956 -214366 -90971 -53475 -60622 164951 29561 -43349 -250435 -300846
18422 -300846 61906 -118729 3006 -136159 -63725 -121514 155698 -184245 275583 37473 164877
18411 164877 -50683 -31199 210549 -40147 63698 454190 86385 235624 -98937 339049 71294
18399 -113416 61429 109804 -234573 -90717 286599 -38702 -339326 -243035 -136180 38844 175226
18388 175226 -149509 -189408 -88314 350365 -64627 17501 -31144 -200017 130141 -94413 -143148
$$ packed form
18467A10405b92318D0691a61609N9343H6794a57915A48288b531j55832B83642
18456A34870P0544a45713A81569d3959p4966A68934h965l9811A22315a51408B13218
18444b71577C04255d9876A67954E1422b9585j87037F4032a13726j78768h0636
18433g2343A12705a02956j11410i0971L7496p147A64951B9561d3349k07086n0411
18422c00846F1906a18729C006a36159f3725n7789A55698a84245B75583C7473J27404
18411A64877e0683J9484B10549d0147F3698L90492H6385J49239i8937C39049G1294
18399a13416F1429M8375b34573i0717B86599c8702l00624R6291J06855C8844J36382
18388A75226a49509l9899h8314C50365f4627A7501c1144j68873A30141i4413m8735
$$ plain form
18377 -143148 90605 80041 -152752 -95655 -64565 61848 14092 160647 -147116 -451660 -154183
18365 970 67613 -42079 -136498 -209475 144421 -265463 18530 150903 -204887 -107967 -158097
18354 -158097 75936 60939 148797 79199 20494 -255207 -127174 -88638 24973 -341868 -103782
18342 -297717 -73734 -187120 -160120 183949 89148 -165731 -185014 793 -243176 -176311 55318
18330 -95583 208788 -169878 -64354 -219657 270828 -94373 103009 -22927 -274888 113255
18319 232248 -249891 96130 -261953 -144870 -189765 112759 35426 10233 238386 -94827
18308 156591 -86225 -280741 -7918 -133798 -185281 -268625 139261 -151292 138450 -68109 -989
18296 -119240 382370 51056 38097 -183373 -77886 71049 39525 -16428 -126865 99221 -141175
$$ packed form
18377a43148I0605j0564a52752N7097L1090F1848A4092J46555a47116l04544a54183
18365I70O6643d2079r4419p2977A44421b65463A8530J32373b04887R6920n0130
18354a58097G5936j4997Q7858o9598B0494b55207a27174L8536B4973c41868a03782
18342b97717g3734j13386K7000A83949H9148a65731j9283G93b43176O6865E5318
18330i5583B08788a69878f4354j55303B70828i4373A03009b2927k51961A13255
18319B32248b49891I6130b61953J17083m4895A12759C5426A0233K28153i4827
18308A56591h6225j94516g918j25880n1483q3344A39261a51292A38450f8109i89
18296a19240C82370E1056j2959a83373g7886G1049l1524a6428j10437I9221a41175
$$ plain form
18284 109550 143004 125001 -215157 32011 -277924 -219314 -183837 178652 -159734 -319511
18274 -319511 3836 21954 -279220 141516 125969 65814 115445 290617 92473 -172052 145084
18262 87249 63712 -228878 108609 -28492 -170849 47046 -138319 48783 -70492 -47300 -232611
18251 -232611 -483791 -218115 -32511 -21782 -272306 185630 -156611 7473 151009 316513
18241 316513 -233020 -15484 -216397 253310 -296959 70907 122777 179520 3966 -130785 108246
18229 -124834 -46748 141119 2202 24696 -18951 -85264 12363 -334189 47571 -5135 -133741
18218 -133741 121834 174383 -44142 14753 189205 -15674 -264198 -350609 2293 109781 -104996
18206 -239142 48210 49166 -216420 134569 -102004 -221999 -54074 -256980 102666 56551 -74316
$$ packed form
18284A09550L3454j8003b15157C2011b77924N8610L5477A78652a59734j59777
18274c19511C836J8118b79220A41516j5547o0155M9631J75172I2473a72052A45084
18262H7249k3537b28878A08609b8492j42357D7046a38319D8783g0492K3192j85311
18251b32611k51180b18115c2511J0729k50524A85630a56611G473J43536J65504
18241C16513b33020a5484k00913B53310b96959G0907N1870N6743C966a30785A08246
18229a24834d6748A41119B202K2494a8951o6313A2363c34189D7571e135j28606
18218a33741A21834N2549d4142A4753J74452a5674k48524q6411B293J07488a04996
18206b39142D8210R56b16420A34569a02004j19995e4074k02906A02666m6115g4316
$$ plain form
18194 -19863 193895 156785 60610 284140 -235102 -45017 66145 -143967 44812 -57479 -135493
18183 -135493 398467 -35442 140169 -57451 172772 -216732 55079 -180671 274793 55350
18172 -145447 -57483 11621 64108 -12595 -53976 -13049 -139702 -1381 -20334 -243087 38404
18160 -18339 -173295 100401 -5231 -29650 91289 106110 -109560 4631 -46331 117567 171110
18149 171110 170511 -210494 166305 163152 -279694 242927 -111697 -31155 222119 -10491 -126873
18138 -126873 -98375 -60012 134747 -63984 194460 -106468 -23707 80420 196531 64473 -62231
18126 -129274 -224 10085 57159 -212164 159533 -120974 -98626 -97958 -85643 825 -19163 -28235
18114 -28235 -258921 -135848 -85666 24695 -92152 -243606 -210202 147495 -148317 12438 13246
$$ packed form
18194a9863A93895l7110F0610K23530b35102d5017F6145a43967D4812e7479p8014
18183a35493C98467c5442A40169e7451A72772b16732E5079a80671B74793E5350
18172a45447e7483A1621N2487a2595m1381a3049j26653a381j8953k22753C8404
18160a8339j54956A00401e231k4419I1289J4821a09560D631d6331A17567N3543
18149A71110n99b10494A66305l153b79694B42927a11697c1155B22119a0491j16382
18138a26873K8498L8363A34747f3984A94460a06468b3707H0420J16111F4473f2231
18126a29274b24A0085M7074b12164A59533a20974K2348O68J2315H25a9163r072
18114b8235k30686J23073N0182B4695i2152j51454L3404A47495a48317A2438Q08
$$ plain form
18103 13246 28174 -105127 -233427 -121208 272653 -251714 -231911 -20386 -577251 -120151
18092 -345205 -155182 -37484 -149621 -116003 302573 114846 -33760 99757 -65886 121357
18081 -265825 -73536 30300 3917 156769 -24663 370256 61543 -98802 -115087 130259 63084
18069 -53660 71758 -38104 7932 -219889 -118774 -134947 -241289 18384 -276375 -298629 -259564
18058 -259564 -262836 -178127 -104335 -194690 144833 205772 -70086 -324193 -7418 -29291 143962
18046 72805 -112023 -57640 -41757 -509860 85229 46083 -124188 140781 -150532 -132387 116677
18034 -271257 -70894 -33491 -29754 202332 145003 190151 -123491 -184535 -17640 -343213 332064
18022 -43824 364088 206687 -337206 62891 -8655 -43620 -105975 -25175 -159264 -56856 -334534
$$ packed form
18103A3246J4928a05127j28300J12219B72653b51714J9803b0386n56865a20151
18092c45205a55182c7484j12137L3618C02573A14846c3760I9757f5886A21357
18081b65825g3536C0300C917J52852b4663C70256F1543i8802j6285A30259F3084
18069e3660G1758c8104G932b19889J01115j6173j06342A8384b76375k2254L9065
18058b59564l272Q4709P3792r0355A44833O0939g0086k54107g418k1873A43962
18046G2805a12023N4383J5883m68103H5229l9146a24188A40781a50532J8145A16677
18034b71257g0894c3491L737B02332n7329M5148a23491o1044a7640l25573C32064
18022d3824C64088j57401c37206F2891h655l4965o2355b5175j34089e6856k77678
$$ plain form
18011 -334534 266790 -108712 -6219 -183631 -80194 190491 107367 72587 51944 185504 -68589
17999 -45789 -55976 47940 -360978 -37334 -90409 -261002 -189808 35501 53122 -153775 -12542
17987 70594 176891 -74946 -88533 650256 141717 -2358 206167 -131362 -84695 -112999 270041
17975 164335 -353360 -12237 4799 -34264 -116326 -39251 79599 238184 207741 -59502 204326
17963 205409 47375 -12630 -319674 -206944 -190361 113234 113558 -232911 -292359 -87341 264764
17951 160623 37178 223524 208355 168978 -55235 -181810 124061 266923 -71293 191890
17940 -100209 -60000 49801 -278432 -116410 121598 -83746 -294728 207515 252249 129916
17930 129916 130862 254671 -99542 76946 11414 -249729 35651 -179120 -229915 -558823 20539
$$ packed form
18011c34534B66790a08712f219j77412h0194A90491q3124l4780k0643J33560f8589
17999d5789j0187D7940c60978c7334n3075j70593P1194C5501J7621a53775a2542
17987G0594J06297g4946j3587F50256A41717b358B06167a31362M6667k8304B70041
17975A64335c53360a2237D799c4264q2062c9251G9599J58585l0443e9502B04326
17963B05409D7375a2630l07044J12730J6583A13234L24b32911n9448h7341B64764
17951A60623C7178J86346j5169l9377e5235j26575A24061J42862g1293A91890
17940a00209M0209D9801b78432a16410A21598h3746k10982B07515M4734j22333
17930A29916R46J23809i9542G6946A1414b49729C5651a79120n0795l28908B0539
$$ plain form
17918 -121492 77951 66897 257164 102298 -204713 -272707 71658 -148855 -134634 173557
17907 -129452 -188083 1187 -110774 -98940 188199 177261 -59189 100397 -157579 -286010 -104249
17895 182499 110947 -115078 -446 164439 -30572 9797 -171719 147873 194831 72459 257160
17884 257160 4369 137789 -226441 -9056 -137418 -133446 -364029 -7466 24666 -71918 36765
17872 264211 -74262 -98284 89630 183938 191845 292201 4288 -446389 -60575 -36480 -229199
17861 -229199 -119361 38491 205709 253521 78399 124687 67059 -121701 209011 257239 -67177
17849 -67496 207030 107348 -78376 -168779 -101367 -60743 16035 -120268 -109018 -26637 -518 172880
17836 -238884 -104547 -171120 26301 86303 143008 -114989 -28599 68803 119387 -360034 16120
$$ packed form
17918a21492G7951j1054J90267A02298b04713o7994G1658a48855J4221A73557
17907a29452n8631A187a10774J1834A88199j0938e9189A00397a57579j28431a04249
17895A82499p1552a15078d46A64439c0572I797a71719A47873M6958G2459J84701
17884B57160D369J33420b26441i056j28362L972k30583g466B4666g1918C6765
17872B64211g4262k4022H9630R4308P907J00356D288d46389f0575K4095j92719
17861b29199J09838C8491J67218M7812G8399M6288n7628a21701B09011M8228f7177
17849f7496B07030r9682g8376r0403O7412M0624A6035a20268J1250b6637e18A72880
17836b38884a04547o6573B6301O0002N6705a14989b8599F8803N0584c60034A6120
$$ plain form
17824 -80327 -363764 -129240 68466 -18772 -86016 -184775 172216 -48133 -6799 21052 -271367
17812 152480 -181406 -20495 131442 -128451 -373812 25462 157237 -134434 274325 75291
17801 -169268 112157 -89847 -48169 -74455 -205574 11702 238250 -221450 -4811 226206 -212893
17789 -32683 27839 -22189 151258 -16915 36457 65615 277024 -187407 96003 -221084 372702
17777 138336 -110614 -175310 -92387 10388 196171 193507 137641 204381 -186312 82347 172172
17766 172172 -336277 69746 -158606 177444 -30063 155033 -102490 59324 54784 -136436
17755 -90942 -42967 -16713 -67261 5511 -215551 207878 169362 93880 -11360 2325 -68993 4353
17742 86841 30508 -21340 33644 -210803 -105872 -211217 -228394 60991 81080 -44542 207773
$$ packed form
17824h0327k83437a29240F8466a8772o7244r8759A72216d8133f799B1052b71367
17812A52480a81406b0495A31442a28451k45361B5462J31775a34434B74325G5291
17801a69268A12157h9847M1678k6286j31119A1702K26548b21450d811B26206b12893
17789c2683B7839b2189A51258a6915C6457K9158K11409a87407I6003b21084C72702
17777A38336a10614o4696Q2923A0388J85783k664n5866O6740a86312H2347Q9825
17766A72172c36277F9746a58606A77444c0063A55033a02490E9324m540a36436
17755i0942d2967a6713n0548E511b15551B07878l8516p5482a1360B325f8993D353
17742H6841C0508b1340C3644b10803J04931j05345j7177F0991K0089d4542B07773
$$ plain form
17730 111018 34541 -51295 5988 -202287 198880 -57080 2835 118251 -8305 -9351 350752
17718 -175602 14055 190935 127412 172822 -279147 150755 -116912 -89737 196298 -360774
17707 -94858 54090 128843 57756 -87118 161425 259116 -184066 376112 -555659 -21545 -59783
17696 -59783 -206 -73566 -72758 140758 -32577 5613 89349 -183286 215269 84541 -116949 -2478
17683 36936 247279 66201 113321 -242577 157605 -109117 60069 20454 79284 21197 53012
17672 53012 -81413 -115298 -4676 -177876 18489 80999 -23277 153465 22699 69789 -38585
17660 224245 -50171 191697 292891 214271 -206912 -264962 235922 -19710 234723 6188 249562
17649 249562 462472 -53993 220754 224078 149076 82321 -23072 315049 192908 -317560 -129243
$$ packed form
17730A11018C4541e1295E988b02287A98880e7080B835J15416h305j046C50752
17718a75602A4055J76880o3523M5410b79147A50755a16912K7175A96298c60774
17707i4858E4090P4753E7756h7118A61425R7691a84066C76112e55659b1545l8238
17696e9783b06p3360Q08A40758c2577E613Q3736a83286B15269H4541a16949b478
17683C6936K10343F6201M7120b42577A57605a09117F0069B0454N8830B1197L1815
17672E3012h1413l3885d676j73200A8489O2510b3277A53465B2699M7090c8585
17660B24245e0171A91697J01194p8620b06912n8050B35922a9710B34723F188K43374
17649B49562K12910e3993B20754L324p5002o6755b3072C15049j22141c17560a29243
$$ plain form
17637 -230369 181112 20046 -36091 117895 -141000 101656 202440 90329 242203 -60156
17626 -120327 68985 195409 99242 105302 -85562 339305 350316 -170106 81345 125979 75627
17615 75627 -242644 237190 14098 75842 -11307 -119765 143522 51941 -368801 129983
17604 -58503 -14601 -117027 -66691 352594 -134577 49706 305709 -299626 75668 106140 143930
17593 143930 10596 17695 -262827 138649 -80704 -263013 260234 141449 140404 -7392 346530
17581 240133 -292132 -142549 12348 -145770 51806 -79616 -150489 -28291 52118 33900 236404
17570 236404 140247 90406 -251384 23349 -196094 50479 285116 106160 441141 -176582
17559 -279769 151576 -305173 131747 28466 -32648 -39368 419361 -83998 -147688 287878 137379
$$ packed form
17637b30369A81112B0046c6091A17895a41000A01656J00784I0329J51874f0156
17626a20327F8985J26424r6167O060h5562C39305J1011a70106H1345M4634n0352
17615G5627b42644B37190A4098O1744a1307j08458A43522E1941c68801A29983
17604e8503a4601j02426N0336C52594a34577D9706K56003b99626G5668L0472L7790
17593A43930A0596P099b62827A38649h0704j82309B60234j18785j045g392C46530
17581B40133b92132a42549A2348a45770E1806g9616p0873b8291E2118j8218K02504
17570B36404r6157m9841b51384B3349a96094E0479K34637A06160L34981a76582
17559b79769A51576c05173A31747B8466c2648o720D19361h3998o3690B87878A37379
$$ plain form
17547 20055 146341 130993 -207552 61046 219355 -89327 -38091 -19184 53821 -67212 265181
17535 -82439 238945 95118 78067 231910 -59764 -104959 67765 -248576 4162 127129 17320
17523 387974 86440 132483 -136560 81954 304617 -6682 398249 -99928 15436 183222 69129
17511 235512 121984 244980 204812 104437 443240 -441483 -18197 235237 97923 40045
17500 251420 64834 12070 -74600 185922 19556 88620 388200 -128223 -224490 -42880 -2684
17488 -17484 -138658 508181 52678 252625 138936 -35532 150654 -61947 271663 333341
17478 333341 230457 151539 151298 205718 339083 -74349 -354487 202835 305233 213446 412773
17467 412773 305893 -97508 66527 47961 224005 212307 447368 281821 143209 157451
$$ packed form
17547B0055J26286j5348b07552F1046J58309h9327c8091J8907E3821f7212B65181
17535h2439B38945I5118j7051J53843e9764m5195F7765b48576D162J22967A7320
17523C87974H6440M6043a36560H1954K22663f682C98249i9928A5436J67786F9129
17511B35512j13528J22996m0168j00375L38803d41483a8197B35237I7923D0045
17500B51420F4834A2070g4600A85922A9556O9064K99580a28223r6267d2880b684
17488a7484j21174E08181E2678J99947j13689c5532A50654f1947B71663O1678
17478C33341j02884p8918k41N4420J33365g4349k80138B02835J02398r1787J99327
17467D12773j06880i7508F6527j8566J76044j1698K35061j65547j38612J4242
$$ plain form
17457 157451 -25136 128399 143015 -133103 -37001 146939 10336 296188 338625 582870
17447 582870 154515 -262431 -14117 287550 4856 182120 175314 58564 -51934 285150 -99680
17435 174492 165859 -244543 428505 105536 147289 325166 242607 136538 -22842 268339
17424 419538 993 220422 207096 350969 -154464 16495 444238 243473 333129 331539 552839
17413 552839 198395 7106 248476 81440 116238 220363 353873 241479 10954 201405
17403 201405 211976 -174879 -171351 35461 97169 343280 -63023 57415 336343 216721 247497
17392 247497 -153565 -40000 95943 404888 21527 215359 185252 42772 77153 27377 40342
17381 40342 251340 130672 80734 165783 33231 147691 19781 329019 4305 -154691 56511
$$ packed form
17457A57451b5136A28399J4616a33103c7001A46939A0336K85852M2437K44245
17447E82870A54515b62431a4117B87550D856J77264o806E8564e1934B85150i9680
17435A74492q633b44543D28505A05536M1753J77877q2559j06069b2842B68339
17424D19538I93K19429j3326J43873a54464A6495M27743k00765Q9656j590K21300
17413E52839A98395G106K41370H1440L4798J04125J33510j12394A0954J90451
17403B01405J0571a74879L528C5461O1708K46111f3023E7415K78928j19622L0776
17392B47497a53565d0000I5943L08945B1527J93832l0107D2772L4381B7377J2965
17381D0342K10998j20668m9938Q5049C3231J14460A9781L09238D305a54691E6511
$$ plain form
17369 448203 -193088 330469 -137330 308919 94616 290958 -81988 -36768 152808 154404
17359 154404 -19425 35759 16824 34936 196646 212700 -138342 129168 273219 144582
17349 144582 381042 -11070 -229904 186833 202401 40520 62912 403874 -66923 158357
17338 46619 643463 82872 175961 240785 442672 257672 -46612 169988 303105 156245
17328 156245 201314 197107 102818 166954 14818 147842 -118436 -29843 82683 208678 294759
17317 294759 500709 452753 217650 -158542 26872 -54448 178926 189867 184607 -139674 98790
17305 49807 196075 46752 -179238 -55832 -47824 161255 182521 -90599 322608 -262676 154127
17293 135030 214101 250810 -25536 292498 127951 145436 254947 219611 375934 -117398
$$ packed form
17369D48203a93088C30469a37330C08919I4616J96342h1988c6768A52808J596
17359A54404a9425C5759A6824J8112J61710J6054a38342A29168J44051j28637
17349A44582K36460a1070k18834A86833J5568D0520K2392L40962f6923A58357
17338D6619N96844H2872R3089O4824K01887j85000d6612A69988J33117j46860
17328A56245M5069m207r4289O4136A4818J33024a18436b9843H2683J25995Q6081
17317B94759K05950m7956B17650a58542B6872e4448A78926J0941n260a39674I8790
17305D9807J46268D6752a79238e5832Q008A61255K1266i0599C22608b62676A54127
17293A35030P9071L6709b5536B92498A27951J7485J09511l5336J56323a17398
$$ plain form
17282 29301 102462 294297 200985 342174 96598 80057 274061 419604 239844 133009
17272 133009 349501 190494 302755 -93170 -121205 -22327 335200 331982 344977 91999 472984
17261 472984 187501 108668 216594 161304 161474 248755 176319 124875 259862 159216 81347
17250 81347 254262 -48660 91274 305258 23749 437496 -34860 19009 -141031 221423 227720
17239 227720 -26625 171938 185196 172479 -60141 340433 491257 231648 -58013 309235
17228 15089 -39262 279298 435402 278637 353314 231685 182316 239033 -243446 -93425 369873
17216 65724 238531 -119939 193145 157405 407339 365757 454368 228385 213984 -776 284829
17204 71174 7041 65185 371421 254601 37412 362405 366989 535486 141505 19526 -153981
$$ packed form
17282B9301P3161J91835r3312J41189I6598j6541J94004J45543j79760j06835
17272A33009K16492j59007J12261i3170k8035b2327C35200l218J2995I1999L80985
17261D72984A87501p8833J07926n5290J70Q7281p2436n1444J34987j00646p7869
17250H1347J72915d8660I1274K13984B3749M13747c4860A9009a41031B21423O297
17239B27720b6625A71938J3258j2717f0141C40433J50824B31648e8013C09235
17228A5089c9262B79298J56104j56765P4677j21629m9369N6717b43446i3425C69873
17216F5724J72807a19939A93145l5740K49934m1582Q8611k25983j4401g76B84829
17204G1174G041N8144L06236j16820C7412L24993M584J68497A41505A9526a53981
$$ plain form
17192 39883 556567 719132 237036 461876 153809 165690 384638 87616 529638 396618
17182 396618 619971 191419 81072 319536 131566 9074 224767 95975 386606 286422
17172 286422 128603 281328 124851 91824 413411 182652 313912 603456 370823 660881
17162 660881 166241 114303 222412 487669 134976 242389 392284 90319 -20680 523800
17151 112103 139900 -41835 140986 350503 360431 280981 80324 349157 180404 172222 442929
17140 442929 178883 411570 65406 572021 313519 417501 325545 498624 185884 415561
17130 415561 318284 447117 449769 248389 449822 476546 424586 248701 -73409 604673 63859
17118 372758 194196 462711 339904 450269 -15795 213874 81425 455938 204151 480497
$$ packed form
17192C9883N16684J62565B37036K24840A53809J1881K18948H7616M42022j33020
17182C96618K23353A91419H1072K38464A31566I074K15693I5975K90631j00184
17172B86422A28603J52725A24851l3027L21587A82652J31260K89544k32633K90058
17162F60881A66241n1938J08109K65257A34976J07413J49895I0319b0680E23800
17151A12103K7797d1835A40986K09517R928p9450H0324K68833j68753q182K70707
17140D42929A78883K32687F5406N06615k58502J03982r1956J73079A85884K29677
17130D15561r7277J28833K652k01380K01433K6724n1960j75885g3409F04673F3859
17118C72758j78562K68515j22807J10365a5795B13874H1425L74513B04151K76346
$$ plain form
17108 480497 431805 410280 339651 150075 138009 288979 541594 468301 257417 359198
17098 359198 187820 310470 251055 362185 237887 338214 284453 87734 650240 524954
17088 524954 521803 392249 630507 364724 496746 335296 259552 284046 719879 414136
17078 414136 495275 304179 291771 307147 466797 522671 518187 540545 633730 449531 307333
17067 307333 465610 416641 653076 372298 278460 683773 309021 395201 734899 392791
17057 392791 701858 627153 388517 652171 676556 641315 470197 358878 743764 517156
17047 517156 550952 233464 343481 381466 455106 610311 555074 472660 290353 578455
17037 578455 371668 623986 636182 361739 368247 720178 313119 468957 435853 516131
$$ packed form
17108D80497m8692k1525p0629A50075j2066J50970K52615p3293k10884J01781
17098C59198j71378J22650n9415J11130j24298J00327n3761H7734N62506j25286
17088E24954l151j29554K38258k65783J32022j61450p5744K4494M35833l05743
17078D14136Q1139j91096j2408J5376J59650N5874m484K2358R3185j84199j42198
17067C07333J58277m8969K36435k80778r3838M05313C09021Q6180L39698l42108
17057C92791L09067p4705k38636K63654K4385l5241j71118j11319L84886k26608
17047E17156L3796B33464J10017L7985P3640J55205n5237q2414j82307K88102
17037E78455k06787K52318J2196k74443O508L51931C13119J55838l3104Q0278
$$ plain form
17027 516131 371596 405445 438467 742883 605154 483336 587057 539235 584981 579693 548382
17016 548382 896317 308732 212776 800670 664774 1112980 560785 607067 800171 589707
17006 589707 629536 710682 963684 682911 902254 568022 676836 286879 807338 756269
16996 756269 752888 880545 559916 715146 796879 661280 498980 902411 800594 889495
16986 889495 626645 1048496 607701 854741 459348 728890 784516 901412 1076318 913618
16976 913618 887128 603298 1033504 728869 745965 922987 963988 553912 772878 1068121
16966 1068121 1218547 757801 1262280 941433 869738 988750 581668 895724 619869 859971
16956 859971 1044051 924721 1072384 1202102 1087320 892233 855484 846744 1366398 767907
$$ packed form
17027E16131j44535L3849L3022L04416j37729j21818J03721m7822M5746n288l1311
17016E48382L47935C08732r5956N87894j35896M48206n52195M6282J93104k10464
17006E89707L9829Q1146K53002k80773K19343l34232J08814B86879N20459n1069
16996G56269l381J27657l20629J55230Q1733j35599j62300M03431j01817Q8901
16986H89495k62850M21851m40795K47040l95393K69542N5626J16896J74906j62700
16976I13618k6490k83830M30206l04635J7096J77022M1001m10076K18966K95243
16966A068121J50426m60746N04479l20847p1695J19012m07082L14056k75855K40102
16956H59971J84080j19330J47663J29718j14782j95087l6749q740N19654n98491
$$ plain form
16946 767907 1083314 898833 1006369 1057139 900643 1138775 968874 1402801 967097 1021184
16936 1021184 1043780 1259025 1192024 1079519 1259496 1150815 1250317 1091770 1648459 1279547
16926 1279547 1152541 956655 1401865 1182370 1239636 1125601 1321110 1472321 1107664 1347437
16916 1347437 1134728 1632403 1455616 1153253 1439774 1372602 1071220 1618238 1277369 1694047
16906 1694047 1679935 1478216 982430 1403462 1587497 1775873 1543916 1645322 1866316 1287755
16896 1287755 1972906 1534242 2158909 1839234 2008717 2035015 1813150 1755136 1574622 1674715
16886 1674715 1705517 1631798 1689894 2014997 1983480 1797393 2147667 2002288 1878459 2030585
16876 2030585 1975414 2090967 2076616 2244530 2318649 2256791 2342334 2451433 2080181 2718052
$$ packed form
16946G67907L15407j84481J07536N0770j56496K38132j69901M33927m35704N4087
16936A021184K2596K15245o7001j12505J79977j08681R9502j58547N56689l68912
16926A279547j27006j95886M45210k19495N7266j14035J95509J51211l64657K39773
16916A347437k12709M97675j76787l02363K86521o7172l01382N47018l40869M16678
16906A694047j4112k01719m95786M21032J84035J88376k31957J01406K20994n78561
16896A287755O85151m38664O24667l19675J69483K6298k21865n8014j80514J00093
16886A674715L0802p3719N8096L25103l1517j86087L50274j45379j23829J52126
16876B030585n5171J15553j4351J67914P4119o1858Q5543J09099l71252O37871
$$ plain form
16866 2718052 2295742 2502068 2187059 2517284 2429926 2593864 2685558 2633630 2774967 2622173
16856 2622173 2901733 2414280 2866616 2711192 2707011 3106315 2601514 3176763 3087688 3127762
16846 3127762 3132472 3091236 3104771 3450180 3382415 3401182 3276128 3800340 3539467 3583077 3717295
16835 3717295 3594277 3873418 3460845 3765407 3992881 3746573 4364048 4124336 4347751
16826 4347751 4210885 4473359 4449171 4657653 4341366 4734070 4671275 5006897 4827116 5151712
16816 5151712 5392861 5274745 5497002 5596873 5365933 5671036 6132615 6019854 6210841 6468836
16806 6468836 6201123 6191989 6389830 6251300 7061485 6918126 7249881 7108862 7300111 7688579
16796 7688579 7698029 7991283 8095867 8266516 8876141 8960162 9056493 9416351 9779689 9736687
$$ packed form
16866B718052m22310K06326l15009L30225q7358J63938R1694n1928J41337j52794
16856B622173K79560m87453M52336j55424m181L99304n04801N75249q9075M0074
16846C127762M710m1236J3535L45409o7765J8767j25054N24212k60873M3610J34218
16835C717295j23018K79141m12573L04562K27474k46308O17475k39712K23415
16826D347751j36866K62474k4188K08482l16287L92704o2795L35622j79781L24596
16816E151712K41149j18116K22257R9871k30940L05103M61579j12761J90987K57995
16806F468836k67713r134J97841j38530Q10185j43359L31755j41019J91249L88468
16796G688579R450K93254J04584J70649O09625Q4021R6331L59858L63338m3002
$$ plain form
16786 9736687 10092371 10154759 10717005 10735260 11241456 11767597 12030743 12210727 12541375 12817315
16776 12817315 13306719 13904312 14015367 14763919 15187373 15826631 16120223 16810005 17425643
16767 17425643 17735886 18615667 19132107 19971065 20684760 21460461 22311971 22965696 23952084
16758 23952084 24776469 25719913 26770394 27921653 29368677 30534404 32120354 33376821
16750 33376821 35154301 36788178 38743881 40182680 42212535 44450032 46850287 49317618
16742 49317618 52023166 54759927 57717693 61301012 65008604 68675057 72885303 76865353
16734 76865353 81451406 86769098 92290084 97946118 104317382 110555652 117360332 124635208
16726 124635208 131812092 139307346 147130089 154758542 162134030 169606134 176317953 182368328
$$ packed form
16786I736687L55684O2388N62246J8255N06196N26141K63146J79984L30648K75940
16776A2817315M89404N97593J11055P48552M23454O39258K93592O89782O15638
16767A7425643L10243Q79781N16440Q38958P13695P75701Q51510O53725R86388
16758B3952084Q24385R43444J050481J151259J447024J165727J585950J256467
16750C3376821J777480J633877J955703J438799K029855K237497K400255K467331
16742D9317618K705548K736761K957766L583319L707592L666453M210246L980050
16734G6865353M586053N317692N520986N656034O371264O238270O804680P274876
16726A24635208P176884P495254P822743P628453P375488P472104O711819O050375
$$ plain form
16718 182368328 187236371 191576426 194593850 196155405 196281884 194634080 192317909 188611715
16710 188611715 183851721 177933739 171192245 164199668 156794530 148920072 141056238 133404408
16702 133404408 125789869 118374775 111494752 104777371 98690624 92489471 86665618 81726378
16694 81726378 76755755 72658978 68162678 64095715 60728538 57207812 54081073 51040126
16686 51040126 48616652 46038661 43440539 41378524 39254008 37326140 35773576 33840996
16678 33840996 32228975 30963924 29386444 28202812 27187529 25841588 24925155 23786320
16670 23786320 22857908 21862002 21034423 20047179 19301282 18873678 18027377 17687016 16975495
16661 16975495 16241487 15778721 15064333 14840165 14205763 13503694 13167372 12806967 12504297
$$ packed form
16718A82368328M868043M340055L017424J561555J26479j647804k316171l706194
16710A88611715m759994n917982o741494o992577p405138p874458p863834p651830
16702A33404408p614539p415094o880023o717381o086747o201153n823853m939240
16694H1726378m970623m096777m496300m066963l367177l520726l126739l040947
16686E1040126k423474k577991k598122k062015k124516j927868j552564j932580
16678C3840996j612021j265051j577480j183632j015283j345941r16433j138835
16670B3786320r28412r95906q27579r87244p45897m27604q46301l40361p11521
16661A6975495p34008m62766p14388k24168o34402p02069l36322l60405l02670
$$ plain form
16652 12504297 11944015 11528372 11217816 10624678 10861771 10211196 9693089 9923075 9666740
16643 9666740 9165159 9034399 8559616 8765853 8376966 8129792 7902001 7114224 7559404
16634 7559404 7509767 7104071 6834491 6779874 6596576 6224464 6296513 6230593 6063271 5945159
16624 5945159 6068426 5747761 5546853 5423092 5099066 5096485 4843358 4973165 4976789 4524695
16614 4524695 4812079 4667465 4070976 4247932 4455426 4537811 3921624 4066730 4231757 4034643
16604 4034643 4125036 3664799 3698393 3745801 3642254 3691763 3056185 3296502 3450210 3449139
16594 3449139 3176929 3164099 3256415 3209326 3215223 3168454 2970345 2581390 3052715 2438514
16584 2438514 2426769 2753475 2799921 2716683 2538503 2498573 2157419 2471965 2319533 2320893
$$ packed form
16652A2504297n60282m15643l10556n93138K37093o50575n18107K29986k56335
16643I666740n01581j30760m74783K06237l88887k47174k27791p87777M45180
16634G559404m9637m05696k69580n4617j83298l72112P2049o5920j67322j18112
16624E945159J23267l20665k00908j23761l24026k581k53127J29807L624m52094
16614D524695K87384j44614n96489J76956K07494Q2385o16187J45106J65027j97114
16604D034643R0393m60237L3594M7408j03547M9509o35578K40317J53708j071
16594C449139k72210j2830R2316m7089N897m6769j98109l88955M71325o14201
16584B438514j1745L26706M6446q3238j78180l9930l41154L14546j52432J360
$$ plain form
16574 2320893 1946905 1965242 2303483 2398768 1969739 2129693 2223777 2225844 2144196 2268245
16564 2268245 1675616 1984263 1895611 1685780 1937038 1948819 1812441 1586802 1781253 1532897
16554 1532897 1585151 1830893 1589244 1798994 1959544 1351622 1304544 1295292 1431089 1753254
16544 1753254 1385706 1404507 1514678 1340831 1297545 1277090 1538612 1268352 1319541 1719903
16534 1719903 1506108 1121557 1070058 1206131 1187517 1204864 1003019 1452654 1182374 1200109
16524 1200109 1080463 903469 1078579 944798 1115481 1015589 1043344 1233756 1253857 1002288
16514 1002288 1263752 970136 1003567 741041 1056919 1043803 1072427 1057981 999250 763907
16504 763907 726772 921533 1138379 1054339 724934 1151667 1136616 950325 708737 773022
$$ packed form
16574B320893l73988J8337L38241R5285m29029J59954R4084K067q1648J24049
16564B268245n92629L08647q8652k09831K51258J1781j36378k25639J94451k48356
16554A532897N2254K45742k41649K09750J60550o07922m7078r252J35797L22165
16544A753254l67548J8801J10171j73847m3286k0455K61522k70260N1189M00362
16534A719903k13795l84551n1499J36073j8614J7347k01845M49635k70280J7735
16524A200109j19646j76994J75110j33781J70683r9892K7755J90412K0101k51569
16514A002288K61464k93616L3431k62526L15878j3116K8624j4446n8731k35343
16504G63907l7135J94761K16846q4040l29405M26733j5051j86291k41588O4285
$$ plain form
16494 773022 1010635 1015143 732956 650046 551700 836801 759974 747662 839931 899310 789805
16483 789805 610936 931260 874715 570103 615565 671551 603164 620418 762597 921652
16473 921652 397304 771816 678183 655229 816567 827209 680518 569787 744988 1041044
16463 1041044 390145 637186 405562 645477 486845 565033 651212 684450 282922 455437
16453 455437 460822 373454 641626 348363 711980 299056 384951 927932 545931 744388
16443 744388 433258 408573 564711 325528 314401 483965 751060 314817 397305 480872
16433 480872 621505 700269 368582 635579 743251 446571 17971 203574 451099 493056
16423 493056 367313 112305 368595 517720 398406 447202 523438 102873 334725 623304
$$ packed form
16494G73022K37613M508k82187q2910r8346K85101p6827j2312R2269N9379j09505
16483G89805j78869L20324n6545l04612M5462N5986o8387J7254J42179J59055
16473I21652C97304L74512r3633k2954J61338J0642j46691j10731J75201K96056
16463A041044C90145K47041k31624K39915j58632P8188Q6179L3238B82922J72515
16453D55437N385q7368K68172k93263L63617B99056Q5895N42981l82001J98457
16443G44388l11130k4685J56138k39183j1127J69564K67095C14817Q2488Q3567
16433D80872J40633P8764l31687K66997J07672k96680A7971J85603K47525M1957
16423D93056j25743A12305K56290J49125j19314M8796P6236A02873K31852K88579
$$ plain form
16413 623304 749174 389091 352728 578398 466153 332557 248635 393156 640442 307595
16402 756892 295529 388048 242079 576488 522358 331549 400389 511497 260681 175117
16392 175117 477675 58529 338052 125470 164390 411660 462047 338653 166010 265209
16382 265209 315309 136822 122569 606448 608053 347583 471411 566372 105175 -13659 295536
16370 400667 375151 212140 162082 156807 262319 238684 229068 331133 201352 303263 69672
16358 123554 599445 -30603 -42251 441467 -171028 273957 276735 65140 536717 -148197
16347 153180 298964 555135 -9793 503397 219884 125031 388202 291934 122319 102260
16337 102260 369521 205385 183345 -219518 -228618 49365 162131 102866 234931 122897
$$ packed form
16413F23304J25870l60083l6363K25670j12245j33596q3922J44521K47286C07595
16402G56892B95529R2519j45969L34409n4130j90809O8840J11108k50816q5564
16392A75117L02558E8529K79523A25470L8920K47270N0387j23394A66010R9199
16382B65209N0100A36822j4253M83879J605k60470J23828R4961A05175a3659B95536
16370D00667k5516j63011n0058n275J05512k3635r616J02065j29781J01911F9672
16358A23554M75891c0603j1648D41467a71028B73957K778F5140M71577a48197
16347A53180J45784K56171i793E03397B19884r4853K63171r6268A22319k0059
16337A02260K67261j64136k2040b19518r100D9365J12766n9265J32065j12034
$$ plain form
16327 122897 250202 -35137 146837 208716 337671 285752 151602 428622 18958 348899
16317 348899 -104792 92857 -79873 108126 349113 241237 303094 136489 164252 -113073
16306 156575 209512 -124467 185662 140176 -6274 256512 -92448 102893 287799 -16499 292386
16294 92913 380378 536271 49239 129777 46755 202360 -5283 50158 370445 129987 355877
16283 355877 81517 276347 88311 168392 142866 285098 62385 387852 68704 184781 379528
16272 379528 60209 181021 166984 62830 98591 286185 204996 -36724 312302 134921 233791
16261 233791 42197 284288 147276 -154296 30569 95417 -43661 274933 237945 95224 183138
16250 183138 173353 478652 -29473 -116068 21673 97275 145586 -7247 90305 295108 -174717
$$ packed form
16327A22897J27305c5137A46837O1879J28955n1919j34150K77020A8958L29941
16317C48899a04792I2857g9873A08126K40987j07876O1857A36489K7763a13073
16306A56575N2937a24467A85662m5486f274B56512i2448A02893J84906a6499B92386
16294I2913K87465J55893D9239Q0538D6755J55605e283E0158L20287A29987K25890
16283C55877H1517J94830H8311Q0081k5526J42232F2385L25467F8704J16077J94747
16272C79528F0209J20812j4037F2830L5761J87594q1189c6724C12302A34921R8870
16261B33791D2197K42091j37012a54296C0569O4848d3661B74933l6988I5224Q7914
16250A83138r785L05299b9473q6595B1673P5602M8311g247I0305K04803a74717
$$ plain form
16238 -191052 16450 100153 22950 126063 283845 84791 114902 -117407 158068 175342 53295
16226 239152 25612 140521 182585 92580 -63761 -39578 153163 290441 360825 -47190 -40350
16215 -40350 292950 120576 132796 340308 148052 245932 67963 181847 161899 -106299
16204 277192 3368 190560 -171808 296036 -21463 39917 179509 -236486 361146 260396
16194 260396 123722 208852 18178 -294644 271247 -263677 43220 210580 188486 152158
16184 152158 -13667 -60111 1972 -28947 237583 -35448 -200667 317140 160742 3678 -241542
16172 -72435 196366 312918 195979 139897 129958 -358725 33403 14769 -20973 74411 38353
16161 38353 302646 -44441 107533 110770 228304 -65605 -226515 -128331 43648 -57597 301403
$$ packed form
16238a91052A6450Q3703B2950J03113J57782H4791L0111a17407A58068J7274E3295
16226B39152B5612J14909M2064r0005f3761K4183A53163J37278P0384d7190O840
16215d0350B92950A20576J2220K07512A48052R7880F7963J13884j9948a06299
16204B77192C368J87192a71808B96036b1463C9917J39592b36486C61146j00750
16194B60396A23722Q5130A8178b94644B71247b63677D3220J67360k2094l6328
16184A52158a3667m6444A972b8947B37583c5448j65219C17140j56398C678b41542
16172g2435A96366J16552j16939n6082r939c58725C3403A4769b0973G4411l6058
16161C8353K64293d4441A07533L237J17534f5605j60910R8184D3648e7597C01403
$$ plain form
16149 126640 48949 60324 47401 -251814 144344 39091 50637 221647 36396 142506 -218509
16137 -312880 -272169 70029 -92568 5473 -86317 211776 -81349 321785 -293614 -50711 -31724
16126 -31724 -35903 -21119 229258 109044 15522 -172636 289616 127511 -115773 208128
16115 -275022 180518 270262 -388971 44245 150822 -120670 -119450 -53806 -480414 78661 -103687
16103 -84520 -40824 -198288 -62321 -116776 -153902 85615 31044 -15724 17011 -227732 362342
16091 -12269 32885 58567 -122041 -19187 -135632 136555 163144 47347 -147670 -150164 -41524
16079 -130200 46506 137612 -153438 379229 -179435 -236468 93687 -56038 177189 -114364
16068 -187446 -129899 -420190 -159903 -240770 -41986 -132257 -70387 111255 273674 -248773
$$ packed form
16149A26640D8949J1375j2923b51814A44344C9091J1546J71010C6396J06110b18509
16137c12880M0711G0029i2568E473h6317B11776h1349C21785b93614e0711J8987
16126c1724m179J4784B29258A09044A5522a72636B89616A27511a15773B08128
16115b75022A80518Q9744c88971D4245J06577a20670J220e3806m26608G8661a03687
16103h4520d0824j57464f2321n4455l7126H5615C1044a5724A7011b27732C62342
16091a2269C2885K5682a22041a9187j16445A36555K6589D7347a47670k494d1524
16079a30200D6506R1106a53438C79229a79435n7033I3687e6038A77189a14364
16068a87446N7547k90291a59903q0867d1986r0271O1870A11255J62419b48773
$$ plain form
16057 -165056 25138 287344 11007 66330 -430817 -263538 -433868 -34516 -139135 -87487
16047 -87487 -43060 34856 -200951 364460 -44527 -191856 -226322 -93493 -485195 -36539 -180278
16036 -180278 221037 -291389 -8084 29513 125962 63817 -455715 -141846 -369803 65198 -127249
16024 302121 -79330 -82942 -4197 -144459 127235 32288 -235091 -54824 -141152 221398 115711
16013 115711 -145576 -29584 -17562 44539 189830 -65389 -299702 51230 -150434 371986
16002 102751 -70047 68511 -422831 -199925 130350 142568 -85545 226923 100567 -99396
15991 18750 53020 -45682 -106801 223415 197743 -118097 -9341 330483 364997 11247 -102500
15979 434728 223521 386010 22674 -788 189651 -240658 244778 21330 -10316 -166579 -16680
$$ packed form
16057a65056B5138K62206A1007N5323d30817J67279j70330c4516j04619N1648
16047h7487d3060C4856b00951C64460d4527j47329l4466i3493l91702c6539j43739
16036a80278B21037b91389h084B9513R6449o2145d55715a41846k27957F5198a27249
16024C02121g9330l612d197j40262A27235C2288b35091e4824q6328B21398j05687
16013A15711a45576b9584J2022D4539J45291f5389k34313E1230a50434C71986
16002A02751g0047F8511d22831a99925A30350J2218h5545B26923A00567i9396
15991A8750L4270d5682o1119B23415k5672a18097i341C30483L4514A1247a02500
15979D34728k11207J62489B2674g88A89651b40658B44778B1330a0316j56263a6680
$$ plain form
15967 -85173 -61997 352535 -183515 -105737 -112395 -54709 11733 -7245 -5733 -54030 162213 139374
15955 139374 -77813 -115863 -271417 -325268 99285 17643 -166458 -223646 277468 -167452 -340563
15944 -340563 182792 57939 -194296 135479 105984 -267836 -138261 110827 -180095 -260665
15934 -260665 -28316 174210 -379285 -142348 -176720 -421551 -132811 178740 -125276 -65946
15924 -65946 16918 230031 226262 -198147 48506 27822 -61293 11675 -244197 -224896 -295189
15913 -295189 -235595 -17787 200367 203793 14871 -107843 -119865 -49914 12237 25736 65517
15902 65517 -115564 227789 -217097 -30259 85335 15714 134959 246599 52878 -138646
15891 -1716 -273353 -77630 25637 -92603 -132393 45581 217987 243189 82094 172131 -371032
$$ packed form
15967h5173K3176C52535a83515P7778o658e4709A1733g245J512m8297A62213k2839
15955A39374g7813l8050j55554n3851I9285A7643a66458n7188B77468a67452j73111
15944c40563A82792E7939a94296A35479k9495b67836J29575A10827a80095q0570
15934b60665b8316A74210c79285a42348l4372k44831a32811A78740a25276N9330
15924f5946A6918K13113l769a98147D8506k0684f1293A1675b44197J9301p0293
15913b95189N9594a7787B00367L426A4871a07843j2022d9914A2237J3499L9781
15902F5517a15564B27789b17097c0259H5335A5714J19245J11640E2878a38646
15891a716k71637g7630B5637i2603l9790D5581J72406K5202H2094R0037c71032
$$ plain form
15879 10414 249068 -11864 -8777 104783 -207004 -83531 -443353 46937 -16819 118135 -51587
15867 307287 464030 -84545 99618 126531 2967 -93236 -398407 -51966 -97398 -164463 232591
15855 -130667 8173 -36663 -308552 51723 -58462 36650 -185953 -33317 -216567 91643 45108
15843 53545 -225757 -194439 214702 231155 -212419 254297 -288381 -257273 139470 17982
15832 72773 -150003 -200218 124707 -211537 -208624 143223 -198595 -228847 -79009 -14622 85887
15820 112757 -68208 -151003 80663 -157059 88977 -137776 -52293 -9904 128499 -27182 -242481
15809 -242481 -129206 -74935 158550 -176733 84740 166777 146821 314023 -35193 -13183 -4775
15797 -301252 -296541 -327618 -17503 289334 74218 61478 177529 -30686 -114115 165501 12887
$$ packed form
15879A0414K38654a1864L087A04783b07004h3531l59822D6937a6819A18135e1587
15867C07287J56743h4545I9618K6913B967i3236l05171e1966m5432o7065B32591
15855a30667H173c6663k71889E1723e8462C6650a85953c3317j83250I1643D5108
15843E3545b25757L1318B14702J6453b12419B54297b88381L1108A39470A7982
15832G2773a50003n0215A24707b11537K913A43223a98595l0252g9009a4622H5887
15820A12757f8208q2795H0663a57059H8977a37776e2293i904A28499b7182k15299
15809b42481J13275N4271A58550a76733H4740Q2037j9956J67202c5193a3183d775
15797c01252M711l1077a7503B89334G4218j2740J16051c0686q3429A65501A2887
$$ plain form
15785 -254048 99954 -115786 118031 -44245 -174515 173364 -145042 -103481 -146445 -764 -441103
15774 -441103 266345 302239 -89692 246678 -47416 -31297 68561 54825 89589 233200 236280
15763 236280 34442 -421622 -35183 -1014 416280 54949 120040 206955 362367 -143245 71665
15751 -24554 -175740 22219 -227569 -297708 -11972 -13998 34242 -129531 33768 78189 -4021
15739 -239580 -45853 -120852 -276571 -7108 -178195 -86155 -370164 -32462 -252767 38412 -59394
15727 -236220 18028 -14889 -268120 2651 -94303 -157536 -253527 -21947 533022 -137875 -49350
15715 106842 -101699 -234054 31556 -402084 -227158 -61570 207900 251628 198321 65738
15704 -112844 -140459 143996 231461 135197 183607 -133260 87968 -29363 6016 -89536 24546
$$ packed form
15785b54048I9954a15786A18031d4245j30270A73364a45042M1561m2964g64m40339
15774d41103B66345L5894h9692B46678d7416J6119F8561j3736L4764J43611L080
15763B36280C4442d21622c5183a014D16280E4949O5091Q6915J55412a43245G1665
15751b4554j51186B2219b27569p0139a1972k026C4242a29531C3768M4421d021
15739b39580d5853p4999j55719g108j71087h6155k84009c2462k20305C8412e9394
15727b36220A8028a4889k53231B651i4303o3233r5991b1947E33022a37875d9350
15715A06842a01699j32355C1556d02084J74926f1570B07900M3728n3307F5738
15704a12844k7615A43996Q7465r6264M8410a33260H7968b9363F016h9536B4546
$$ plain form
15692 91375 287818 -9328 312031 103694 103285 -86686 -123408 -55655 -445094 393939 -224608
15680 -292052 -37965 -108240 234240 -70752 -293961 -115991 -256523 -10584 20164 91300 255358
15669 255358 -347505 -215430 237878 -100394 -10063 82769 2906 -46220 51978 -242032 237811
15657 220482 58233 -117912 -356570 -269806 -168073 236371 166835 55016 153097 175617 104274
15646 104274 -317760 -16195 110964 60287 -93083 84607 26903 -287395 -196396 -16518 223952
15634 -217905 154541 -171276 146943 -217587 -543971 -99463 235301 -217749 235409 140129
15624 140129 70281 -223839 -13217 -81144 326532 -288898 69628 -235377 172703 -6552 -281685
15613 -281685 -285089 216949 -100031 -214467 -249584 42126 -104981 -195438 -134280 83473 61371
$$ packed form
15692I1375J96443i328C12031A03694m09h6686l6722e5655l89439C93939b24608
15680b92052c7965p0275B34240g0752k23209a15991j40532a0584B0164P1136J64058
15669B55358c47505J32075B37878a00394a0063H2769B906d6220E1978b42032B37811
15657B20482E8233a17912k38658Q6764J01733B36371o9536E5016R8081K2520p1343
15646A04274c17760a6195A10964n0677i3083H4607B6903b87395R0999a6518B23952
15634b17905A54541a71276A46943b17587l26384i9463B35301b17749B35409r5280
15624A40129o9848b23839a3217o7927C26532b88898F9628b35377A72703f552k75133
15613b81685l404B16949a00031j14436l5117D2126a04981r0457O1158H3473k2102
$$ plain form
15602 61371 -215022 98319 314412 -65960 -5583 -51994 279288 -240765 -349217 -26682 54073
15590 96245 -63994 -104970 -187291 -112947 118971 67126 -185590 82188 84210 19168 24596 9064
15577 -87081 -41196 -139447 -1854 -159326 50564 -121030 5319 54875 -33255 83759 131524 -252769
15564 -179013 -203290 92877 24422 -69873 107420 181356 -3791 -288886 -270993 -118624 124953
15552 -45594 -55623 -47296 157684 -268570 -32983 71503 4562 46110 -62359 -2824 116487 -51847
15539 -217718 -102630 -115559 76188 -41532 -126950 78294 -213657 63944 -168916 231755 -255463
15527 -47064 -175450 -52163 -144571 30293 51079 -223084 86736 -350906 26496 47627 -254803
15515 -153666 151632 134489 26103 -190273 179651 -60199 -79232 -153916 53678 196726 44456
$$ packed form
15602F1371b15022I8319K16093f5960e583m6411B79288b40765j08452b6682E4073
15590I6245f3994m0976q2321P4344A18971n1845a85590H2188K022A9168N428I064
15577h7081d1196r8251a854j57472E0564a21030E319M9556c3255H3759M7765b52769
15564a79013k4277I2877B4422f9873A07420P3936c791k85095J7893a18624A24953
15552d5594j0029Q327A57684b68570c2983G1503D562M1548f2359b824A16487e1847
15539b17718a02630j2929G6188d1532q5418G8294b13657F3944a68916B31755b55463
15527d7064j28386e2163r2408C0293K0786b23084H6736c50906B6496K1131b54803
15515a53666A51632j7143B6103a90273A79651f0199j9033p4684E3678J43048D4456
$$ plain form
15503 -47362 -59219 -15991 -9453 -5172 -222473 -117403 -121426 -9296 -183017 20520 -189460 178661
15490 -15982 -1935 -126136 -339703 188795 295079 315620 -294940 -23429 59854 -191401 25731
15478 -79829 86068 188624 -268351 97768 -263519 -72997 151576 23972 -113975 -119077 29449
15466 276622 122906 -129268 151381 -108834 133595 -336950 184771 23321 165211 -141032
15455 27362 -13192 96639 508661 -13347 8873 -208524 8150 -41930 -5330 294674 -59229 -44395
15443 -44395 145091 312116 223248 231005 -2455 -75249 -64539 -243806 -100872 -160630 73463
15431 -11187 -119011 -60407 -355592 -36483 -44576 -76675 -304182 181534 -111422 -110 173410
15419 123006 -156633 -131926 -244579 54805 237164 -299293 147671 181941 -5743 -36762 -108423
$$ packed form
15503d7362j1857a5991O538M281k17301J05070m023i296j73721B0520a89460A78661
15490a5982a935j24201k13567A88795J06284K0541b94940b3429E9854a91401B5731
15478g9829H6068J02556b68351I7768b63519g2997A51576B3972a13975n102B9449
15466B76622A22906a29268A51381a08834A33595c36950A84771B3321J41890a41032
15455B7362a3192I6639M12022a3347H873b08524H150d1930e330B94674e9229J4834
15443d4395A45091J67025q8868P757b455p2794J0710j79267a00872n9758G3463
15431a1187j07824N8604k95185c6483q093l2099k27507A81534a11422a10A73410
15419A23006a56633K4707j12653E4805J82359b99293A47671L4270e743l1019p1661
$$ plain form
15408 -108423 -36951 140776 -172138 383557 -7881 83076 -174938 219284 102258 242783
15398 242783 140211 -115757 165322 -309074 175 198445 -59464 216057 -33548 297212
15387 125405 136618 223308 -189452 16958 104676 -71404 -237981 -8774 218559 -106346 7133
15375 233491 271213 94665 -84942 -76837 -22315 -147254 -152375 178239 123041 -29252 -96291
15364 -96291 14213 -152391 83209 60546 -111928 -73205 -234536 169546 -169298 52901 46565
15353 46565 9446 135267 -283748 171278 -324552 130063 -161152 -217258 144651 109244
15343 109244 -295412 57406 159916 -72513 223274 -68141 79815 40451 -54589 -122684 -68868
15332 -68868 -236705 192372 319405 65998 113088 26585 -182296 501662 -5254 234166 -39119
$$ packed form
15408a08423c6951A40776a72138C83557g881H3076a74938B19284A02258J40525
15398B42783j02572a15757A65322c09074A75J98270e9464B16057c3548B97212
15387A25405J1213Q6690a89452A6958Q7718g1404j66577h774B18559a06346G133
15375B33491L7722I4665h4942Q105b2315j24939n121A78239n5198b9252o7039
15364i6291A4213a52391H3209k2663a11928L8723j61331A69546a69298E2901o336
15353D6565I446J25821b83748A71278c24552A30063a61152n6106A44651l5407
15343A09244b95412E7406J02510g2513B23274f8141G9815l9364e4589o8095N3816
15332f8868j67837A92372J27033F5998M7090B6585a82296E01662e254B34166c9119
$$ plain form
15320 -221109 41055 -196659 85815 6084 -224791 -80065 221062 -96804 -108024 -113527 -170658
15309 -170658 -141990 128240 -53287 184501 -32022 -51427 296148 52517 -190385 42930 -80566
15297 -84139 227925 -25753 -305003 164987 184611 335025 -23112 71117 14271 -56904 -147382
15286 -147382 -34251 88401 -76906 7864 52127 -72007 -292630 23734 295667 -78097 168734
15274 50166 272004 218733 41172 123798 237154 54807 -180265 304019 6434 189890 576944
15263 576944 -17523 -212753 -152418 199529 -39666 119378 306583 138850 -95840 -184918
15253 -184918 83713 -221546 514764 285304 529844 1167002 1436816 1094630 1667613 683279
15242 344896 290715 -17182 -14530 214214 -102366 152859 151401 -122080 -6324 -13288 70353
$$ packed form
15320b21109D1055a96659H5815F084b24791h0065B21062i6804j1220n503n7131
15309a70658K8668A28240e3287A84501c2022j9405B96148E2517a90385D2930h0566
15297h4139B27925b5753k79250A64987J9624J50414b3112G1117A4271e6904r0478
15286a47382c4251H8401g6906G864M4263g2007k20623B3734K71933g8097A68734
15274E0166K21838n3271D1172Q2626J13356E4807a80265C04019F434J83456L87054
15263E76944a7523j95230O0335A99529c9666A19378J87205A38850i5840q9078
15253a84918H3713b21546E14764k29460K44540O37158K69814l42186N72983F83279
15242C44896n4181a7182K652B14214a02366A52859j458a22080f324o964G0353
$$ plain form
15230 220632 162087 153180 -64397 -31205 146520 136448 -13053 -300681 257852 -271947 -201848
15219 -201848 -2822 570050 85203 208116 215970 -30654 -9958 166594 348833 330862 142352
15207 53586 91810 222328 51787 275000 22294 -48191 -253492 -108450 122177 46597 578424
15196 578424 -213101 15739 -24429 -377761 125928 87799 341940 -11402 276271 218579
15186 218579 79041 -8318 141276 -262484 466152 -279959 84075 -37564 393381 -72103 1149
15174 -350240 150168 78804 47110 294527 52386 120185 -2259 107745 70909 223551 53609
15162 -128614 142185 143509 234521 6375 127469 70576 52412 932 8395 -113905 147112 230412
15150 230412 -389312 30460 -67144 -93403 24393 11211 444716 61752 407175 -77824 280317
$$ packed form
15230B20632n8545q907f4397c1205A46520j0072a3053k87628B57852b71947P0099
15219b01848b822E70050H5203J22913P854c0654i958A66594J82239j7971A42352
15207E3586L8224J30518E1787K23213B2294d8191k05301a08450A22177D6597N31827
15196E78424b13101A5739b4429l53332A25928l8129K54141a1402B76271n7692
15186B18579G9041h318A41276b62484D66152b79959H4075c7564C93381g2103A149
15174c50240A50168p1364l1694K47417E2386O7799b259A07745l6836J52642E3609
15162a28614A42185J324R1012F375J21094n6893j8164I32P463a13905A47112Q3300
15150B30412c89312C0460f7144k6259B4393A1211M33505F1752L45423g7824B80317
$$ plain form
15138 198873 45554 -151718 -21313 -173246 146499 116287 -167264 299906 164873 -53078
15127 164739 310612 -57761 154026 87405 102355 353777 -156118 195833 67345 72906 260701
15116 260701 -60946 -50142 32127 59040 362826 -63601 -137792 -80971 180969 151769 175966
15105 175966 26413 -100710 174227 96192 -116531 86736 17295 243946 377756 21661
15094 -47095 119166 176432 110199 158085 72935 285950 403508 -51418 213294 191172 262309
15083 262309 189004 -213647 -84647 294279 209883 196675 176662 405536 197281 223146 245284
15072 245284 107692 82405 580368 422782 327467 84461 202945 93155 363085 68421
15061 -124190 -40532 69498 67748 80903 272859 66904 304727 103527 -5541 45427 191348
$$ packed form
15138A98873D5554a51718b1313j51933A46499l0212a67264B99906j35033e3078
15127A64739J45873e7761A54026o6621J4950K51422a56118A95833F7345N561J87795
15116B60701f0946J0804C2127K6913L03786f3601p4191N6821A80969k9200K4197
15105A75966B6413a00710A74227p8035a16531H6736A7295K26651J33810B1661
15094d7095A19166N7266o6233M7886G2935K13015J17558e1418B13294k2122P1137
15083B62309p3305b13647h4647B94279q4396j3208k0013K28874A97281K5865K2138
15072B45284A07692k5287M97963j57586r5315H4461J18484I3155K69930F8421
15061a24190d0532F9498j750J3155J91956F6904K37823A03527e541D5427J45921
$$ plain form
15050 191348 250621 -26047 -38414 339861 63084 574066 -34740 -158917 442573 -45806 195473
15038 -178324 48571 165525 173217 -161508 33818 -26017 174439 285315 148361 191659 94020
15026 320095 -158868 -5158 332367 35012 197680 188628 -12112 36159 277206 241323 36759
15014 124842 208522 132727 313476 66902 462631 -71012 445613 352387 281722 52587 522188
15003 522188 573920 233501 373391 135387 280852 431731 333150 571217 160500 48756
14992 300463 386112 -16284 40076 116336 285625 142413 234153 777943 -323766 150647
14981 377507 135575 313486 202312 228565 187914 157625 292584 384584 232305 19357
14970 37592 462141 449528 163709 -18465 187694 375846 353026 338568 57658 585743 449508
$$ packed form
15050A91348N9273b6047j2367C39861F3084N10982c4740j24177D42573d5806A95473
15038a78324D8571J16954P692a61508C3818b6017A74439J10876j36954M3298I4020
15026C20095a58868e158C32367C5012J62668r052a2112C6159K41047l5883C6759
15014A24842Q3680p5795J80749F6902L95729g1012D45613r3226p0665E2587M69601
15003E22188N1732B33501J39890A35387J45465J50879r8581K38067A60500D8756
14992C00463Q5649a6284D0076P6260J69289A42413R1740N43790c23766A50647
14981C77507A35575J77911j11174K6253m0651l0289J34959R2000j52279A9357
14970C7592M24549j2613A63709a8465A87694J88152k2820j4458E7658N28085j36235
$$ plain form
14959 449508 369289 403610 373592 315414 273528 409825 236231 390349 211162 298621 356039
14948 356039 190772 15002 247617 397306 218398 76195 300479 12733 90374 148519
14938 148519 279079 -97741 250565 297456 215101 492898 481979 343680 729199 246377
14927 484423 71788 229973 208199 44359 480488 21016 261504 184749 217668 -45299 233592
14915 362011 478781 -127445 261380 250879 461587 109146 157655 75094 462080 372417
14905 372417 328383 291287 239058 245106 467451 370956 668365 498090 271736 3003 377798
14894 377798 366541 191305 288763 207799 368734 461284 329321 123695 431579 463406
14884 463406 412490 341002 337817 153497 231794 213800 312038 788282 31700 485454 437248
$$ packed form
14959D49508q0219L4321l0018n8178m1886J36297j73594J54118j79187Q7459N7418
14948C56039j65267A5002K32615J49689j78908G6195K24284A2733P7641N8145
14938A48519J30560i7741B50565M6891q2355K77797j0919j38299L85519B46377
14927D84423G1788J58185k1774D4359M36129B1016K40488p6755L2919d5299B33592
14915C62011J16770a27445B61380j0501K10708A09146M8509G5094L86986q9663
14905C72417m4034l7096n2229O048K22345r6495K97409j70275k26354C003L74795
14894C77798j1257j75236R7458q0964J60935R2550j31963A23695L07884L1827
14884D63406n0916p1488l185A53497P8297j7994R8238M76244C1700M53754m8206
$$ plain form
14873 437248 407115 466998 532593 487141 489315 560684 466020 498002 129560 305442 538925
14862 538925 311811 403109 81582 496946 229780 659550 358715 290256 367102 726721
14852 726721 341429 429881 382939 528418 -7410 94531 101975 78805 416346 162222 441474
14841 441474 374359 432960 707758 227084 304242 513618 286721 464945 339985 584087
14831 584087 109289 386719 342297 429155 394487 185055 328355 337705 285959 833189 583040
14820 583040 551076 312423 276639 510914 405892 379211 397421 440917 189972 569650
14810 569650 978970 386786 349135 652885 559090 529437 666757 506857 487946 572129
14800 572129 278829 492633 291589 323987 736202 515808 347792 508710 517019 439491
$$ packed form
14873D37248l0133N9883O5595m5452K174P1369r4664L1982A29560J75882K33483
14862E38925k27114R1298H1582M15364B29780M29770l00835o8459P6846L59619
14852G26721C41429Q8452m6942J45479g410I4531P444k3170L37541A62222K79252
14841D41474o7115N8601K74798B27084P7158K09376k26897J78224j24960K44102
14831E84087A09289K77430m4422Q6858l4668A85055J43300R350n1746N47230k50149
14820E83040l1964k38653l5784K34275j05022k6681J8210M3496A89972L79678
14810E69650M09320C86786l7651L03750r3795k9653J37320j59900j8911Q4183
14800E72129B78829K13804k01044L2398M12215k20394j68016J60918Q309p7528
$$ plain form
14790 439491 745215 275143 442342 625807 417540 484671 447681 731966 554046 376945
14780 376945 274126 688833 492235 253199 531821 578651 692123 736743 491247 440686
14770 440686 332985 310581 877792 626215 880953 492160 774109 390688 877203 621180
14760 621180 896647 516662 482162 625877 569751 581197 690870 790876 189991 518774
14750 518774 656098 713864 539010 671656 786428 695185 1013905 656095 938859 996452
14740 996452 896571 896132 728028 945236 637690 935315 737832 697124 893979 798860 1052802
14729 1052802 729416 635091 958044 946536 567270 517266 800894 706043 852907 696607
14719 696607 751749 1004616 717833 1232927 1028996 1083464 833982 820509 611521 855118
$$ packed form
14790D39491L05724B75143J67199J83465k08267O7131l6990K84285j77920j77101
14780C76945j02819M14707j96598k39036K78622M6830J13472M4620k45496n0561
14770D40686j07701k2404N67211k51577K54738l88793K81949l83421M86515k56023
14760F21180K75467l79985l4500J43715n6126J1446J09673J00006A89991L28783
14750E18774J37324N7766j74854J32646J14772r1243L18720l57810K82764N7593
14740I96452r9881m39j68104K17208l07546K97625j97483m0708J96855r5119K53942
14729A052802l23386r4325L22953j1508l79266n0004K83628r4851J46864j56300
14719F96607N5142K52867k86783N15094k03931N4468k49482j3473k08988K43597
$$ plain form
14709 855118 872279 685344 1065589 895544 1040630 884044 1025206 908376 1062027 910051
14699 910051 872928 989202 902066 887780 848581 1039514 895200 965538 886206 862458 1205099
14688 1205099 1014756 1032877 1129579 1018788 729312 941912 736607 1386412 919062 624544
14678 624544 746752 718426 1264423 1238698 702603 624685 1304252 795513 1085237 741157
14668 741157 1098264 773985 1014577 1231606 795146 791507 983454 767562 1159364 1008253
14658 1008253 1040312 946632 1211948 1023613 1259467 1332102 1172307 1342970 1127565 914765
14648 914765 1058311 1256554 1128832 1216894 1198896 1076007 1032583 1519278 1181172 1290906
14638 1290906 1671917 1332612 1196994 1474222 1248377 1370596 1054100 1352430 1335625 1242909
$$ packed form
14709H55118J7161j86935L80245j70045J45086j56586J41162j16830J53651j51976
14699I10051l7123J16274q7136j4286l9199J90933j44314P0338p9332k3748L42641
14688A205099j90343J8121R6702j10791k89476K12600k05305O49805m67350k94518
14678F24544J22208k8326N45997k5725n36095p7918O79567n08739K89724l44080
14668G41157L57107l24279K40592K17029m36460l639J91947k15892L91802j51111
14658A008253L2059r3680K65316j88335K35854P2635j59795J70663k15405k12800
14648I14765J43546J98243j27722Q8062j7998j22889m3424M86695l38106J09734
14638A290906L81011l39305j35618K77228k25845J22219l16496K98330j6805r2716
$$ plain form
14628 1242909 1393321 1406839 1285231 1063656 1059598 1358771 1595222 1361620 1244386 1347370
14618 1347370 1430051 1484918 1086985 1316634 1256260 1495312 1557162 1486821 1723199 1299955
14608 1299955 1864299 1704136 1783909 1579863 1497330 1494226 1409008 1400005 1319476 1914260 1666202
14597 1666202 1446946 1604212 1537552 1692738 2002853 1732563 1628471 1776107 1893205 1547545
14587 1547545 1931243 1923634 1906659 1786993 1803570 1977695 1555082 1899896 1951028 1852366
14577 1852366 1473624 2101578 1880376 2179430 1890764 2130944 2212860 2336414 2197229 1918806
14567 1918806 2383169 2287405 2286554 2373503 2434527 2631370 2474547 2636479 2596775 2577576 2897751
14556 2897751 3072833 3354309 3432415 3766699 3843795 4713757 5824839 7862525 11496759
$$ packed form
14628A242909J50412J3518j21608k21575m058K99173K36451k33602j17234J02984
14618A347370Q2681N4867l97933K29649o0374K39052O1850p0341K36378m23244
14608A299955N64344j60163P9773k04046q2533l104q5218r003q0529N94784k48058
14597A666202k19256J57266o6660J55186L10115k70290j04092J47636J17098l45660
14587A547545L83698p609j6975j19666J6577J74125m22613L44814N1132r8662
14577A852366l78742O27954k21202K99054k88666K40180Q1916J23554j39185k78423
14567A918806M64363r5764q51Q6949O1024J96843j56823J61932l9704j9199L20175
14556B897751J75082K81476P8106L34284P7096Q69962J111082K037686L634234
$$ plain form
14547 11496759 21791848 41666624 40797129 20698727 10271273 5128405 3369796 2859579
14539 2859579 2065831 1787512 2072784 1704159 1685907 1842064 2026730 1929193 2183464 2314019
14529 2314019 2267334 1958053 2404461 2422196 2330152 2466876 2281133 2127333 2188453 2452724
14519 2452724 2060086 2449124 2685441 2515702 2195749 2544332 2737290 2737195 2871455 2635209
14509 2635209 2711821 2857018 2652997 2982816 2792702 2869228 3112110 2990246 3092346 2892894
14499 2892894 3174059 2936210 2963165 3170551 3162595 3125127 3206219 3385158 3314397 3346879 3410757
14488 3410757 3462001 3353549 3376118 3550045 3522228 3903096 3605262 3793491 3981064 3502339
14478 3502339 3896819 3993883 3789608 3978502 4149268 4119647 4391881 4236169 4315715 4039818
$$ packed form
14547A1496759J0295089J9874776q69495k0098402A0271273E128405j758609n10217
14539B859579p93748k78319K85272l68625j8252J56157J84666r7537K54271J30555
14529B314019m6685l09281M46408J7735r2044J36724j85743j53800O1120K64271
14519B452724l92638L89038K36317j69739l19953L48583J92958r5J34260k36246
14509B635209P6612J45197k04021L29819j90114P6526K42882j21864J02100j99452
14499B892894K81165k37849K6955K07386p956l7468Q1092J78939p0761L2482O3878
14488C410757N1244j08452K2569J73927k7817L80868k97834J88229J87573m78725
14478C502339L94480R7064k04275J88894J70766k9621K72234j55712P9546k75897
$$ plain form
14468 4039818 4411272 4352444 4516747 4417559 4562988 4370390 4463496 4783601 4713826 5534779
14458 5534779 5059660 4837779 5130313 5237569 4981138 5119425 5233453 5356312 5611615
14449 5611615 5417333 5225564 5527905 5727558 5581396 5584404 5699309 6000289 5724632 6127408
14439 6127408 6244289 6089014 6225509 6105137 6448010 6456782 6469492 6615007 6949082 7160901
14429 7160901 7098641 7237631 7352034 7306710 7129614 7558136 7306044 7383048 7974297 7697457
14419 7697457 7941271 8280138 8213366 8051104 8476664 8595704 8654070 8739699 8740394 8862191
14409 8862191 8840691 9187251 9099495 9382258 9494081 10053495 10110683 10018521 10216866 10318583
14399 10318583 10836071 10625456 10697741 11022976 11234902 11652439 11437267 12126621 12317319
$$ packed form
14468D039818L71454n8828J64303r9188J45429j92598R3106L20105o9775Q20953
14458E534779m75119k21881K92534J07256k56431J38287J14028J22859K55303
14449E611615j94282j91769L02341J99653j46162L008J14905L00980k75657M02776
14439F127408J16881j55275J36495j20372L42873Q772J2710J45515L34075K11819
14429G160901o2260J38990J14403m5324j77096M28522k52092P7004N91249k76840
14419G697457K43814L38867o6772j62262M25560J19040N8366Q5629O95J21797
14409H862191k1500L46560q7756K82763J11823N59414N7188r2162J98345J01717
14399A0318583N17488k10615P2285L25235K11926M17537k15172O89354J90698
$$ plain form
14390 12317319 12090188 12246808 12637723 13024552 13170415 13522285 13777488 13752041 14080414
14381 14080414 14483473 14787161 14643667 15001828 15631430 15595298 16127194 16219107 17102033 17229122
14371 17229122 17143461 17776820 18377509 18456879 18459192 19151628 19532386 19694326 20144532 20989444
14361 20989444 21370524 21924164 22193092 22651516 23282141 23857100 24251213 25024715 25585106
14352 25585106 26273087 26976558 27265362 27969574 29074702 29415970 30340769 31120997 31712515
14343 31712515 32845371 33531520 34476296 35904024 36496385 37570597 38595033 39682732
14335 39682732 41059935 41993291 43635254 45101242 46204316 47588541 49187067 50661088
14327 50661088 52352083 53946057 55431063 57835051 59991221 62072172 64199380 66238256
$$ packed form
14390A2317319k27131J56620L90915L86829J45863L51870K55203k5447L28373
14381A4080414M03059L03688j43494L58161O29602l6132N31896R1913Q82926J27089
14371A7229122q5661O33359O00689P9370K313O92436L80758J61940M50206Q44912
14361B0989444L81080N53640K68928M58424O30625N74959L94113P73502N60391
14352B5585106O87981P03471K88804P04212J105128L41268R24799P80228N91518
14343C1712515J132856O86149R44776J427728N92361J074212J024436J087699
14335C9682732J377203R33356J641963J465988J103074J384225J598526J474021
14327E0661088J690995J593974J485006K403988K156170K080951K127208K038876
$$ plain form
14319 66238256 68743725 71253542 73859569 76686960 79710914 82782288 86168322 89618378
14311 89618378 93305283 97262538 100972061 105930807 110111297 115159113 120417211 125947199
14303 125947199 131977550 138261270 144624619 151864308 158950226 166713697 175412647 183946615
14295 183946615 193550431 203523764 214153728 225298001 237008717 249371061 262242275
14288 262242275 275762871 289968929 304509400 319411527 334752446 350364661 365602618
14281 365602618 380881308 395393163 409026276 421921365 433443618 443494437 452146571
14274 452146571 457501355 459646454 459653820 457698799 455349914 451112526 443199600 439090087
14266 439090087 432047583 421855327 410423271 397991765 384000690 369097223 353695617
$$ packed form
14319F6238256K505469K509817K606027K827391L023954L071374L386034L450056
14311H9618378L686905L957255L709523M958746M180490N047816N258098N529988
14303A25947199O030351O283720O363349P239689P085918P763471Q698950Q533968
14295A83946615R603816R973333J0629964J1144273J1710716J2362344J2871214
14288B62242275J3520596J4206058J4540471J4902127J5340919J5612215J5237957
14281C65602618J5278690J4511855J3633113J2895089J1522253J0050819Q652134
14274D52146571N354784K145099P366j955021k348885m237388p912926m109513
14266D39090087p042504j0192256j1432056j2431506j3991075j4903467j5401606
$$ plain form
14259 353695617 338125967 322078632 307146787 292188662 277907078 264791325 251511028
14252 251511028 238991649 227158007 215387503 205002434 194722637 185142409 176037678
14245 176037678 167714820 160295583 152487490 145161632 138639497 131897674 126320641 121136464
14237 121136464 116074201 110757979 106363208 101367514 97242077 93720201 90330475 86785465
14229 86785465 83207270 79902988 76794193 73891518 71705270 68627360 66437463 63879555
14221 63879555 61686570 59810019 57551490 55787141 54017474 52334111 50665616 49286867
14213 49286867 47977463 46384096 44831551 43143143 42119107 40916916 40730283 39508086
14205 39508086 37862141 37209667 35716572 34855963 34501772 33655781 32446804 32077117 30624191
$$ packed form
14259C53695617j5569650j6047335j4931845j4958125j4281584j3115753j3280297
14252B51511028j2519379j1833642j1770504j0385069j0279797r580228r104731
14245A76037678q322858p419237p808093p325858o522135o741823n577033n184177
14237A21136464n062263n316222m394771m995694m125437l521876l389726l545010
14229H6785465l578195l304282l108795k902675k186248l077910k189897k557908
14221F3879555k192985j876551k258529j764349j769667j683363j668495j378749
14213D9286867j309404j593367j552545j688408j024036j202191j86633j222197
14205C9508086j645945o52474j493095q60609l54191q45991j208977l69687j452926
$$ plain form
14196 30624191 29906337 29013632 28593928 27926381 27217370 26197467 25983969 25280404 24412064
14187 24412064 24322133 23498568 23124462 22662746 21920085 21332897 21300221 20930255 20405170 19955822
14177 19955822 19676026 18912385 18769980 18574201 17846782 17780323 17365649 17066773 16045378
14168 16045378 16181266 15987284 15565416 15523761 15322592 14922911 14517830 14184118 14299103
14159 14299103 14003727 13525146 13178785 13353848 13025829 12666603 12697465 12131246 12184941 12186494
14149 12186494 11720481 11343798 11388835 11038747 10755943 10784750 10802191 10460833 10269488 10284327
14139 10284327 10251146 10073371 9613443 9664365 9770293 9253538 9462183 8874923 8785621 8633541
14129 8633541 8606290 8566335 8329947 8295605 8207837 8091534 7964762 7958456 7914554 7631129 7364476
$$ packed form
14196C0624191p17854q92705m19704o67547p09011j019903k13498p03565q68340
14187B4412064q9931q23565l74106m61716p42661n87188l2676l69966n25085m49348
14177A9955822k79796p63641j42405j95779p27419o6459m14674k98876j021395
14168A6045378J35888j93982m21868m1655k01169l99681m05081l33712J14985
14159A4299103k95376m78581l46361J75063l28019l59226L0862n66219N3695J553
14149A2186494m66013l76683M5037l50088k82804K8807J7441l41358j91345J4839
14139A0284327l3181j77775m59928N0922J05928n16755K08645n87260q9302j52080
14129H633541k7251l9955k36388l4342q7768j16303j26772o306m3902k83425k66653
$$ plain form
14118 7364476 7277871 7412175 7275971 7233145 7413710 7187037 7279731 6729609 6595676 6905748
14108 6905748 7004182 6777112 6313738 6234711 6299586 6135898 5992608 6137593 5919308 6015179
14098 6015179 5989709 5678697 5497870 5303534 5712112 5440300 5371261 5265014 5333624 5649919
14088 5649919 5069026 5137180 4877796 4887874 5058804 4972099 4740169 4714202 5097132 4624932
14078 4624932 4733883 4711680 4665487 4781236 4383077 4460053 4460764 4472209 4128251 4525844 4354995
14067 4354995 4032398 4340476 4244854 4076014 4167346 4070503 3914776 4095229 3948293 4007325
14057 4007325 4271196 4077040 3971577 3755682 3584987 3574443 3749767 3290228 3192256 3314114
14047 3314114 3544650 3287017 3189241 2995873 3305328 3271817 3360596 3116790 3050869 3328367
$$ packed form
14118G364476q6605J34304j36204m2826J80565k26673R2694n50122j33933L10072
14108F905748R8434k27070m63374p9027O4875j63688j43290J44985k18285R5871
14098F015179k5470l11012j80827j94336M08578k71812o9039j06247O8610L16295
14088E649919n80893O8154k59384J0078J70930q6705k31930k5967L82930m72200
14078D624932J08951k2203m6193J15749l98159P6976P11J1445l43958L97593j70849
14067D354995l22597L08078r5622j68840R1332r6843j55727J80453j46936N9032
14057D007325K63871j94156j05463k15895j70695j0544J75324m59539r7972J21858
14047C314114K30536k57633r7776j93368L09455l3511Q8779k43806o5921K77498
$$ plain form
14037 3328367 3511803 2815260 3450431 3081727 3012747 2920665 3220795 3157697 2713537 3026636
14027 3026636 2738310 2711480 2987675 2652497 2729226 2748189 2596503 2520744 2773263 2570251
14017 2570251 2576795 2755127 2623523 2641358 2432219 2221087 2369591 2287526 2319728 2032195
14007 2032195 2310487 1982454 2239288 2383132 2045054 2165255 2028819 2143830 2436280
13998 2436280 1997693 2022155 2153018 1830775 1798490 1954424 2056146 2380754 2796942 3771402
13988 3771402 6569308 14305729 34171845 43649881 23848293 13720949 8361640 5912081
13980 5912081 4735361 4107934 3623500 3381007 3023826 2738269 2706069 2620723 2837549 2502808
13970 2502808 2574948 2349750 2451790 2214329 2286560 2602169 2206211 2236388 2183693 2076743
$$ packed form
14037C328367J83436o96543O35171l68704o8980r2082L00130o3098m44160L13099
14027C026636k88326k6830K76195l35178P6729J8963j51686p5759K52519k03012
14017B570251O544J78332j31604J7835k09139k11132J48504q2065L2202k87533
14007B032195K78292l28033K56834J43844l38078J20201j36436J15011K92450
13998B436280m38587K4462J30863l22243l2285J55934J01722L24608M16188R74460
13988C771402K797906P736421J9866116R478036j9801588j0127344n359309k449559
13980E912081j176720o27427m84434k42493l57181k85557l2200q5346K16826l34741
13970B502808P2140k25198J02040k37461P2231L15609l95958L0177n2695j06950
$$ plain form
13960 2076743 2189891 2179064 1960612 2003739 2046354 2136253 2390452 1716237 1825839 1860851
13950 1860851 1921451 1661636 1983170 1506454 1634947 1937160 1866476 1707389 1739988 1745292
13940 1745292 1902782 1599648 1835652 1881124 1980270 1961863 1300404 1872569 1947719 1664673
13930 1664673 1530759 1556690 1587833 1441128 1635175 1786723 1583490 1496609 1553480 1479327
13920 1479327 1470781 1630551 1449441 1602023 1362399 1573251 1383272 1497499 1578196 1528313
13910 1528313 1415847 1770978 1526086 1377348 1284786 1269648 1126779 1067612 1217719 1421216
13900 1421216 1239644 1321462 1224113 1527733 1023075 1228134 1364758 1307269 1443719 1441989
13890 1441989 962924 1117463 1201334 1483412 1373215 1414937 1137600 1330053 1382191 1303958
$$ packed form
13960B076743J13148j0827k18452M3127M2615Q9899K54199o74215J09602L5012
13950A860851O0600k59815L21534m76716J28493L02213p0684j59087L2599N304
13940A745292J57490l03134K36004M5472R9146j8407o61459N72165P5150k83046
13930A664673j33914K5931L1143j46705J94047J51548k03233q6881N6871p4153
13920A479327q546J59770j81110J52582k39624K10852j89979J14227Q0697m9883
13910A528313j12466L55131k44892j48738r2562j5138j42869n9167J50107K03497
13900A421216j81572Q1818r7349L03620n04658K05059J36624n7489J36450j730
13890A441989m79065J54539Q3871K82078j10197M1722k77337J92453N2138p8233
$$ plain form
13880 1303958 1312293 1006582 1084218 992688 1056417 1213785 797653 1159641 1195963 953194
13870 953194 870038 954598 1161839 1360301 531501 1170439 1070911 928572 1040139 1121459
13860 1121459 694333 1026106 1314128 1056210 1050172 894484 1245049 1350031 1170404 1071446
13850 1071446 825824 985849 1028860 990412 708786 1198355 1019534 1032892 982930 893046
13840 893046 886756 645441 1014958 810953 816044 836593 1196001 636094 906155 654146
13830 654146 974588 813215 873189 934198 770347 845652 877067 951698 1031487 1091051 1096750
13819 1096750 1142478 919453 907380 1030799 879912 881929 960884 1124179 749577 861028
13809 861028 571186 760622 523007 727874 909629 676813 789934 685169 1148017 765429
$$ packed form
13880A303958Q335l05711P7636r1530O3729J57368m16132L61988L6322k42769
13870I53194q3156Q4560K07241J98462E31501O38938r9528j42339J11567Q1320
13860A121459m27126L31773K88022k57918o038j55688L50565J04982j79627r8958
13850A071446k45622J60025M3011l8448k81626M89569j78821J3358m9962q9884
13840H93046o290k41315L69517k04005N091K0549L59408n59907K70061k52009
13830F54146L20442j61373N9974O1009j63851P5305L1415P4631P9789N9564N699
13819A096750M5728k23025j2073J23419j50887K017P8955J63295l74602J11451
13809H61028k89842J89436k37615K04867J81755k32816J13121j04765M62848l82588
$$ plain form
13799 765429 818792 786598 780203 626301 939517 632551 699899 755725 1058445 981382 672620
13788 672620 736447 775499 702071 530481 839449 653507 928396 696057 889156 881740
13778 881740 733996 836795 814423 316317 830978 554027 572065 476050 417861 462505
13768 462505 621196 523160 675569 635602 760038 394696 368528 529804 835668 787216
13758 787216 692775 672371 423418 587440 595822 681444 615309 641715 582364 479484 731425
13747 731425 741613 622435 694979 433498 575877 505094 514231 876953 427960 758562
13737 758562 635220 551490 742804 529905 535684 620686 576647 588443 579889 794997 461639
13726 461639 681450 593503 810367 678923 555253 505880 589031 417217 531937 492652
$$ packed form
13799G65429N3363l2194o395j53902L13216l06966O7348N5826L02720p7063l08762
13788F72620O3827L9052p3428j71590L08968j85942K74889k32339J93099p416
13778H81740j47744J02799k2372C16317N14661k76951J8038r6015n8189M4644
13768D62505J58691r8036J52409l9967J24436l65342k6168J61276L05864m8452
13758G87216r4441k0404k48953J64022Q382Q5622o6135K6406n9351j02880K51941
13747G31425J0188j19178P2544k61481J42379p0783R137L62722D27960L30602
13737G58562j23342q3730J91314k12899N779Q5002m4039J1796q554K15108l33358
13726D61639K19811q7947K16864j31444j23670m9373Q3151j71814J14720l9285
$$ plain form
13716 492652 382574 719899 562844 639618 789180 430281 262696 388788 469693 278198
13706 278198 555959 587106 660491 580119 688042 414145 185680 484350 428195 956383
13696 956383 619957 845269 399911 487677 498745 300988 492016 567312 527460 480800
13686 480800 282549 718745 296387 304642 545084 532605 500840 13590 488759 476578 559268
13675 559268 254707 600559 622318 274142 883166 406813 539144 697779 146188 484578
13665 484578 550598 629460 570240 332167 97764 337561 756709 67575 568374 246298
13654 230390 518597 543999 406120 533989 579217 923714 409585 562472 253656 228062
13644 228062 242791 442450 620178 551952 403175 321897 617395 491592 289557 355234
$$ packed form
13716D92652j10078L37325j57055P6774J49562l58899j67585J26092Q0905j91495
13706B78198K77761L1147P3385q0372J07923k73897A85680K98670n6155N28188
13696I56383l36426K25312C99911Q7766J1068j97757J91028P5296l9852m6660
13686D80800j98251M36196B96387Q255K40442j2479l1765A3590M75169j2181Q2690
13675E59268B54707L45852K1759B74142O09024D06813J32331J58635A46188L38390
13665D84578O6020P8862n9220k38073I7764K39797M19148F7575N00799B46298
13654B30390K88207K5402j37879J27869M5228L44497D09585J52887B53656k5594
13644B28062J4729J99659J77728o8226j48777q1278K95498j25803k02035O5677
$$ plain form
13634 355234 677853 306219 369067 449312 603614 540363 721163 458188 218217 469131
13624 469131 140739 350070 257255 244378 561720 362314 474564 668307 419097 335380
13614 335380 797095 342094 416072 238356 168305 289863 380122 489093 200196 707337
13604 707337 422466 386249 456220 406742 790390 620042 156944 402877 574977 481508
13594 481508 94486 59701 332418 253647 154295 418618 225324 510632 250179 323127
13584 323127 218254 322308 336510 291327 254974 605132 594775 420938 213581 318772
13574 318772 327836 236097 199059 402747 298937 279346 540740 394724 277228 457943
13564 457943 582980 465220 124020 297212 412371 203962 583321 427789 432941 291490
$$ packed form
13634C55234L22619C06219O2848Q0245J54302o3251J80800k62975B18217K50914
13624D69131A40739K09331r2815j2877L17342j99406J12250J93743k49210q3717
13614C35380M61715C42094P3978j77716p0051J21558R0259J08971B00196N07141
13604G07337k84871l6217O9971m9478L83648j70348A56944K45933J72100r3469
13594D81508I4486l4785K72717p8771r9352K64323j93294K85308B50179P2948
13584C23127j04873J04054J4202m5183l6353L50158j0357j73837k07357J05191
13574C18772R064r1739l7038K03688j03810j9591K61394j46016j17496J80715
13564D57943J25037j17760A24020J73192J15159B03962L79359j55532N152j41451
$$ plain form
13554 291490 372592 508596 509655 182684 130626 567902 531713 117799 328334 311418 465400
13543 465400 354660 341816 370027 193070 163594 477077 92267 147120 425188 184108
13532 -51268 -52346 292138 274918 -63954 197700 334256 345154 74328 213845 396307 307323
13521 307323 197791 246227 138683 309125 196962 169619 442223 323599 -50284 -106521
13511 -106521 237961 502135 306911 291332 136019 177895 583187 437348 275669 169241
13501 169241 293455 149294 131899 442301 344782 158124 173004 524240 158949 226945
13491 226945 258784 138198 647314 47153 329578 298143 -6432 187390 206763 140137 -1846
13479 401769 152217 451531 264878 474403 356871 300770 306350 399151 145586 309543
$$ packed form
13554B91490Q1102J36004J059A82684n2058M37276l6189A17799K10535j6916J53982
13543D65400j10740j2844K8211j76957k9476L13483I2267N4853K78068A84108
13532e1268j078B92138j7220f3954A97700J36556J0898G4328J39517J82462q8984
13521C07323j09532M8436j07544J70442j12163k7343K72604j18624e0284n6237
13511a06521B37961K64174j95224j5579A36019M1876M05292j45839j61679j06428
13501A69241J24214j44161j7395L10402r7519A58124J4880L51236A58949O7996
13491B26945L1839j20586N09116D7153K82425l1435f432A87390J9373o6626a846
13479D01769A52217K99314j86653K09525j17532n6101N580R2801A45586J63957
$$ plain form
13469 309543 215023 433881 416989 220648 158823 -28255 135026 445053 356176 70210 122063
13458 122063 23076 54156 381383 248569 140579 198645 276084 268542 41858 171945 -13837
13446 49908 43504 79486 -131910 -44934 276943 -47917 144472 124540 -214652 408290 178882
13434 328108 343868 63234 412753 213555 519718 151174 360978 -400388 108379 242083
13424 242083 119252 449798 401438 172077 259525 114522 173524 -127321 149398 323206
13414 323206 498616 594584 -68266 351360 350199 -102294 369094 160089 442105 154895
13403 -13344 312545 47385 29752 524810 160598 187200 196635 302912 232643 453173 65714
13391 -220750 84645 108572 104771 149354 175350 126054 265615 202252 129351 65614 -141447
$$ packed form
13469C09543r4520K18858j6892j96341o1825b8255A35026L10027q8877G0210N1853
13458A22063B3076L1080L27227j32814j07990N8066P7439p542D1858J30087a3837
13446D9908o404L5982a31910d4934B76943d7917A44472j9932b14652D08290A78882
13434C28108J5760F3234L49519j99198L06163A51174K09804d00388A08379J33704
13424B42083A19252L30546m8360A72077Q7448A14522N9002a27321A49398J73808
13414C23206J75410R5968f8266C51360j161a02294C69094A60089K82016A54895
13403a3344C12545D7385j7633M95058A60598K6602R435J06277p0269K20530F5714
13391b20750H4645K3927l801M4583K5996m9296J39561o3363p2901o3737a41447
$$ plain form
13379 278491 99746 354594 281931 -136471 155741 -229620 240959 -81527 12889 96412
13369 96412 146248 160144 264400 203419 124253 337445 321952 371375 676494 257215 -2410
13357 215669 22610 169302 494430 104434 -95438 155025 339777 -97329 340369 267647
13347 267647 230092 186166 132852 285204 372471 272606 177921 241598 796958 94980 153012
13336 153012 176669 263540 305318 421514 250651 263531 157963 -67025 180280 424603
13326 424603 128729 58958 248497 53180 301498 -359351 369869 444408 23629 286814
13316 286814 321296 408164 165695 25097 180577 142906 60594 -96666 377384 434618 -34406
13304 343274 -93034 88857 71710 226367 169873 -124257 -119293 84115 199236 236890 331396
$$ packed form
13379B78491I9746K54848p2663a36471A55741b29620B40959h1527A2889Q3523
13369I6412M9836J3896J04256o0981p9166K13192j5493M9423L05119B57215b410
13357B15669B2610J46692L25128A04434i5438A55025J84752i7329C40369p2722
13347B67647l7555m3926n3314J52352Q7267r9865r4685O3677N55360I4980N8032
13336A53012K3657Q6871M1778J16196j70863J2880j05568f7025A80280K44323
13326D24603A28729E8958J89539E3180K48318c59351C69869P4539B3629K63185
13316B86814L4482Q6868A65695B5097J55480l7671F0594i6666C77384N7234c4406
13304C43274i3034H8857j7147J54657n6494a24257M964H4115J15121L7654R4506
$$ plain form
13293 331396 174300 189868 -38449 121015 147089 376984 9045 40834 310236 -127364 407245
13281 234173 180089 303430 -76699 140981 85067 328714 304442 -119418 243252 -149294
13270 234352 149166 35867 327396 336428 -12858 167142 235731 -127407 295759 87866 252548
13259 252548 147850 206964 237842 321558 271996 229642 -72727 -2409 277494 -139214 403978
13247 4846 289434 287132 127034 166051 13033 -128852 -169093 403866 229437 90472 268178
13236 268178 44281 261908 -130983 57019 113743 103422 89184 214930 272371 271643 447612
13225 447612 22483 -191516 -211094 -200900 156671 -105450 -5361 219325 -15448 207985 -5706
13213 62395 164211 -107911 520001 -108795 228538 106010 112727 -70290 295628 56245
$$ packed form
13293C31396j57096J5568c8449A21015K6074K29895I045L1789K69402a27364D07245
13281B34173n4084J23341g6699A40981n5914K43647k4272a19418B43252a49294
13270B34352q5186C5867K91529R032a2858A67142O8589a27407B95759H7866J64682
13259B52548j04698N9114L0878Q3716m9562m2354g2727b409B77494a39214D03978
13247D846K84588k302A27034L9017A3033a28852m0241D03866j74429I0472J77706
13236B68178D4281K17627a30983E7019N6724j0321j4238J25746N7441p28J75969
13225D47612B2483a91516j9578J0194A56671a05450e361B19325a5448B07985e706
13213F2395J01816a07911E20001a08795B28538A06010O717g0290B95628E6245
$$ plain form
13202 246 181689 415302 -124683 241036 -104818 256684 545595 -46650 334425 156487
13191 75931 117694 207346 -78492 80309 -22847 -7633 198869 159061 179023 201950 -96680 -54387
13179 -54387 148550 -102371 85778 -145993 -131669 -132671 -258962 50131 321026 -120446 -110086
13168 -110086 98920 -265819 423576 -45579 118594 249267 169674 30286 172656 210263
13158 210263 293330 -103898 -160072 19086 133037 89173 252890 -152863 375308 -178032
13147 355504 33725 294234 201518 132125 7992 375342 -221174 206554 -46755 72480 -328187
13135 10113 104958 193297 -189790 150104 27349 349903 -149543 -189985 -22277 -33153 -103202
13124 -103202 -227238 97597 24956 -63046 -191691 70116 -517922 212465 163286 -37182 227532
$$ packed form
13202B46J81443K33613a24683B41036a04818B56684K88911d6650C34425A56487
13191G5931M1763Q9652g8492H0309b2847g633A98869l9808J9962K2927i6680M2293
13179e4387A48550a02371H5778a45993J4324j002j26291E0131K70895a20446J0360
13168a10086I8920b65819D23576d5579A18594J30673p9593C0286J42370L7607
13158B10263Q3067a03898n6174A9086J13951m3864J63717a52863C75308a78032
13147C55504C3725K60509r2716o9393G992L67350b21174B06554d6755G2480c28187
13135A0113R4845Q8339a89790A50104B7349L22554a49543m0442b2277j0876p0049
13124a03202j24036I7597B4956f3046j28645G0116e17922B12465m9179c7182B27532
$$ plain form
13112 -97665 -46432 119511 156804 32069 139562 219021 286412 -375984 172968 336551 -86389
13100 493052 190892 4390 39381 -3703 446769 163232 -199263 -147389 -173872 -4396 23839
13088 14383 204696 -35287 417639 -269622 219740 -78165 -203621 174752 173620 32366 88344
13077 88344 306947 287625 -117872 382783 -15747 -98391 268523 70665 190558 -21819 -122538
13066 -122538 95583 366295 145541 -41025 -122011 200857 10224 129942 300618 -155315
13055 263831 -37032 160862 39719 64930 14468 -54213 49593 281222 40628 207722 108112
13044 108112 267204 -8728 62018 81718 6830 107254 25976 119071 118104 144314 -43086 456928
13031 256263 233727 111698 57570 13237 -135861 -101561 330772 19964 265898 -113092
$$ packed form
13112i7665d6432A19511L7293C2069J07493P9459O7391c75984A72968J63583h6389
13100D93052A90892D390L4991c703D46769A63232a99263N1874k6483d396B3839
13088A4383J90313c5287D17639b69622B19740g8165j25456A74752j132C2366N5978
13077H8344K18603j9322a17872C82783a5747q2644B68523G0665J19893b1819j00719
13066a22538I5583K70712A45541d1025q0986B00857A0224J19718J70676a55315
13055B63831c7032A60862C9719K5211A4468e4213D9593K31629D0628J67094r9610
13044A08112J59092h728F2018J9700F830J00424B5976R3095r67K6210d3086D56928
13031B56263k2536A11698n4128A3237a35861L4300C30772A9964K45934a13092
$$ plain form
13020 116620 84373 186941 166095 -97955 248635 68215 135860 85907 166159 127386 86503
13009 86503 264245 160729 -365893 -227967 96899 252333 -36126 19476 56413 101698 117978
12998 117978 406201 85579 74868 116155 222195 72636 143980 -225284 185786 273436 119139
12986 -60358 18249 -4275 113008 414724 271010 -41863 43110 120067 -50476 259859 -253836
12974 382454 132968 330207 -80371 -119500 207588 -104486 552170 41481 150103 20936
12963 -22253 225430 121954 -47589 303681 372804 190939 55885 -194547 -77769 -36120 -38408
12952 -38408 -219540 29111 238839 136110 204091 -91909 57165 13552 157951 -124234 -11082
12940 -100257 -148024 95662 174410 -52512 -161787 379633 86249 -125530 50135 201571 -140999
$$ packed form
13020A16620l2247J02568k0846i7955B48635F8215O7645m9953Q0252l8773m0883
13009H6503J77742j03516c65893J37926I6899J55434c6126A9476L6937M5285J6280
12998A17978K88223H5579j0711M1287J06040G2636P1344b25284A85786Q7650A19139
12986f0358A8249d275A13008L01716j43714d1863D3110P6957e0476B59859b53836
12974C82454A32968J97239h0371l9129B07588a04486E52170D1481J08622B0936
12963b2253B25430j03476d7589C03681O9123j81865E5885a94547g7769c6120k288
12952c8408j81132B9111K09728j02729O7981i1909E7165A3552J44399a24234a1082
12940a00257m7767I5662P8748e2512j09275C79633H6249a25530E0135J51436a40999
$$ plain form
12928 235913 -38595 -88804 -15648 121648 -98228 -25457 27090 -29189 48464 141765 229480
12917 229480 -154152 522181 404601 63883 -173673 164312 185459 193518 150642 237115 72715
12905 -130072 -99146 137693 186255 42955 282047 35258 -113271 -117905 -100412 149620 -115445
12893 41702 246752 301726 112112 -151627 109092 200936 -173211 163935 246232 -253332
12882 64220 -68076 -332630 155639 -188250 34570 -24846 -127526 45330 163182 -14719 -390115
12871 -390115 291357 69963 213037 55871 26545 -409307 87955 -271587 206216 102282
12860 -70070 -20085 52802 -29579 17445 60359 83912 28037 -59248 -153366 105701 -87082
12848 -214319 29935 36345 -96396 -153793 22392 -47887 99747 -104201 84644 380819 30121
$$ packed form
12928B35913c8595n0209a5648A21648i8228b5457B7090b9189D8464R3301Q7715
12917B29480a54152E22181j17580F3883a73673A64312K1147Q059m2876Q6473G2715
12905a30072L0926A37693M8562D2955K39092C5258a13271m634J7493A49620a15445
12893D1702K05050N4974A12112a51627A09092R1844a73211A63935Q2297b53332
12882F4220f8076k64554A55639a88250C4570b4846j02680D5330J17852a4719l75396
12871c90115B91357F9963J43074E5871B6545d09307H7955b71587B06216A02282
12860g0070b0085E2802b9579A7445M2914K3553B8037e9248r4118A05701h7082
12848b14319B9935O410i6396n7397B2392d7887I9747a04201H4644K96175C0121
$$ plain form
12836 307470 -335985 19967 -85324 256742 31160 -89593 -192537 -15036 187182 -221959
12825 -1430 169548 133397 125123 89068 -221440 257571 -141916 25526 -20728 -187049 -30459
12813 -52578 -190768 75075 121394 -112102 -15379 -51911 -320084 273847 -264691 -134027
12803 -134027 -342831 14698 71403 266133 113443 49130 -61619 81908 -313028 70933 -53101
12791 -298644 161592 181771 -73474 45540 227659 236330 7791 41897 11662 -156792 337612
12779 -243512 -86354 17211 -56437 32512 87925 40425 -206840 -347943 -221327 -30712 99008
12767 -95521 -39596 123517 -82341 -27441 -96704 62619 -50725 46090 54067 -394821 120374
12755 275766 -1485 89770 281604 22528 189640 -233383 -192318 -259497 69177 222470 -161802
$$ packed form
12836C07470c35985A9967h5324B56742C1160h9593j02944a5036A87182b21959
12825a430A69548l6151q274l6055b21440B57571a41916B5526b0728j66321c0459
12813e2578j38190G5075M6319a12102a5379l6532k68173B73847b64691J30664
12803a34027k08804A4698N6705J94730A13443D9130f1619H1908c13028G0933e3101
12791b98644A61592K0179g3474D5540J82119Q671G791L4106A1662a56792C37612
12779b43512h6354A7211e6437C2512N5413D0425b06840j41103J26616c0712I9008
12767i5521c9596A23517h2341b7441o9263F2619e0725D6090P977c94821A20374
12755B75766a485H9770J91834B2528J67112b33383M1065o7179F9177J53293a61802
$$ plain form
12743 439946 -78648 87608 -836 -124214 7055 518518 283172 93474 224348 22744 297288
12732 297288 150475 367096 40400 240931 -146780 304229 365550 -54122 -327212 19265
12721 69605 -112364 146244 -150128 -233285 50159 143241 349021 92655 41371 352315 164520
12709 272731 22022 228227 505201 198865 205079 168628 -16496 412866 279735 293796 -106344
12697 170044 93796 235904 97657 -110244 157295 114700 104616 63351 -308138 -76993 -53138
12686 -53138 54048 373110 23285 90476 146403 -10996 -54251 349464 303677 568528 -442516
12674 -120389 298646 -88435 -302698 190929 96584 -55124 -120506 190427 366912 127120
12663 -148242 259974 109718 93916 -26671 193476 119247 -140193 105650 75336 72109 239826
$$ packed form
12743D39946g8648H7608h36j23378G055N11463k35346I3474J30874B2744K74544
12732B97288j46813K16621D0400K00531a46780C04229O1321e4122k73090A9265
12721F9605a12364A46244a50128q3157E0159R3082K05780I2655D1371L10944A64520
12709B72731B2022K06205K76974A98865O214l6451a6496D12866j33131J4061a06344
12697A70044p6248J42108I7657a10244A57295m2595j0084m1265c08138g6993K3855
12686e3138E4048L19062B3285O7191N5927a0996m3255C49464m5787K64851d42516
12674a20389B98646h8435k14263A90929r4345e5124o5382A90427J76485A27120
12663a48242B59974A09718j5802b6671A93476p4229a40193A05650l0314l227J67717
$$ plain form
12652 239826 113638 253555 37834 -489458 -39067 145812 181077 5535 47877 276949 -441355
12640 1466 -85252 72676 175449 -55056 351055 52814 402316 -6322 -128178 148460 -220031
12628 158724 410650 179323 206894 133214 225362 158940 528474 -35943 -24660 176691 287010
12617 287010 45076 215774 -35143 -48017 256205 95851 261028 -137326 154352 186328
12607 186328 -196516 322158 20583 246092 149289 -27603 -93617 -71511 -54854 231986 268697
12596 268697 -33847 -235727 65201 336822 -28955 147630 222210 225989 -612 65783 -136571
12584 19598 15148 -15545 59440 -95919 128091 11573 85669 -163350 -210131 -113928 -43320
12572 213733 57735 -44985 21862 -171862 175628 35092 -190449 181819 25118 144150
$$ packed form
12652B39826A13638J39917C7834d89458c9067A45812L5265E535M2342K29072d41355
12640A466h5252G2676J02773e5056C51055E2814L49502f322j21856A48460b20031
12628A58724K51926A79323K7571p3680R2148o6422L69534c5943J1283A76691J10319
12617B87010D5076J70698c5143j2874B56205I5851J65177a37326A54352L1976
12607A86328a96516C22158B0583K25509r6803b7603o6014K2106J6657B31986L6711
12596B68697c3847k01880F5201K71621b8955A47630P4580L779f12F5783a36571
12584A9598m450a5545E9440i5919A28091A1573P4096a63350m6781R6203d3320
12572B13733E7735d4985B1862a71862A75628C5092a90449A81819B5118J19032
$$ plain form
12562 144150 -141527 -156330 -365059 -17704 -16744 16399 135704 -54207 -442326 78627 -95301
12550 175635 -128579 -262120 260203 -160487 130850 203799 212166 -164414 -103693 372860
12539 167302 -91695 -74680 -129786 157147 5853 179350 -97839 100930 -310319 242481 206878
12528 206878 195820 -9764 212711 300157 -29041 19554 -202457 -112070 -52707 -167180 -311094
12517 -311094 -12804 302557 -214677 334374 -52102 304157 92510 -347071 216989 -207533
12506 -363856 120596 13382 362093 -211902 76556 13340 226183 -392855 321211 65362
12495 212664 422333 -78377 217198 288942 465456 10668 -283621 -224344 -241176 162707
12484 150072 -25142 -360788 25593 2992 256478 -219634 17351 265704 76276 51837 37204
$$ packed form
12562A44150a41527j4803k08729a7704R60A6399J19305e4207l88119G8627i5301
12550A75635a28579j33541B60203a60487A30850P2949Q367a64414O0721C72860
12539A67302i1695J7015n5106A57147E853J73497i7839A00930c10319B42481l5603
12528B06878j1058i764B12711Q7446b9041A9554b02457R0387e2707j14473j43914
12517c11094a2804C02557b14677C34374e2102C04157I2510c47071B16989b07533
12506c63856A20596A3382L48711b11902G6556A3340K12843c92855C21211F5362
12495B12664K09669g8377B17198P1744J76514A0668b83621N9277j6832A62707
12484A50072b5142l35646B5593B992K53486b19634A7351K48353G6276k4439j4633
$$ plain form
12473 37204 278455 154769 192958 193373 -37042 -110981 236467 111152 30848 -378002 93410
12461 80718 58513 98469 132866 -48646 -210427 97937 37550 110881 172626 263768 -26258
12449 -274380 173220 -33656 3819 127839 -37299 282872 -126414 298048 39289 -83799 263441
12437 301774 -135259 13842 -39442 36542 -94167 119304 -167979 20952 211465 339839
12427 339839 319507 -450205 -108170 -157644 -162316 99107 7575 -24256 56549 -71877 -88304
12416 -88304 29851 -122281 -38011 204114 35741 -218042 130954 107485 -26556 260523 -313022
12404 90778 13046 157558 -27665 82207 104183 123767 174878 -229411 76649 30703 -80384
12392 -176311 39399 -165259 -249017 13740 18296 201702 -170989 -93935 -108168 -112771 5256
$$ packed form
12473C7204K41251j23686L8189M15c7042p3939B36467A11152C0848c78002I3410
12461H0718k2205L9956L4397d8646j61781I7937C7550P3331O1745R1142b6258
12449b74380A73220c3656C819J24020c7299B82872a26414B98048C9289h3799B63441
12437C01774a35259A3842c9442C6542i4167A19304a67979B0952J90513J28374
12427C39839k0332d50205a08170m9474m672I9107G575b4256E6549g1877j6427
12416h8304B9851a22281c8011B04114C5741b18042A30954k3469b6556B60523c13022
12404I0778A3046J44512b7665H2207K1976J9584N1111b29411G6649C0703h0384
12392a76311C9399a65259q3758A3740M556J83406a70989P7054j4233m603E256
$$ plain form
12380 179197 266861 -337466 -412383 202217 267069 81686 99525 -180688 -76628 -80722 -189542
12369 -189542 -76660 -44832 9115 -12413 7846 39497 -219929 -127696 9420 -184939 -3586 33666
12356 189583 378881 179259 351348 136788 325657 133391 -229731 -102267 4871 335823
12346 335823 302405 -91401 5889 -55095 21762 252132 136835 249873 -52104 84289 149407
12335 149407 -414277 110343 136242 44231 -135701 -98062 -139781 120131 -32765 118464
12324 101675 85580 -153209 255666 26251 3323 161516 -154681 -78914 9480 25325 -68641
12312 -202167 268065 30618 -27628 -68088 -80394 -69767 239157 106749 -491844 -100567
12301 412045 99307 328313 -116252 34182 119561 -194576 82815 43197 -127613 153118
$$ packed form
12380A79197Q7664c37466p4917B02217O4852H1686J7839a80688g6628m094j08820
12369a89542g6660L1828I115a2413G846L1651b19929R2233I420a84939c586C3666
12356A89583J89298A79259J72089A36788J88869A33391b29731a02267D871L30952
12346C35823l3418i1401E889e5095B1762K30370j15297J13038e2104H4289O5118
12335A49407d14277A10343K5899D4231a35701L7639m1719A20131c2765A18464
12324A01675j6095a53209B55666B6251C323J58193a54681P5767I480J5845f8641
12312b02167B68065C0618b7628m0460j2306J0627B39157A06749d91844a00567
12301D12045I9307K29006a16252C4182Q5379a94576H2815l9618a27613A53118
$$ plain form
12290 -825 303451 -21157 31016 -46630 189325 34978 364229 -169587 108167 59958 167851
12279 167851 310351 2425 11267 122881 -40429 -2245 385981 246494 44269 -288274 -21629
12267 293580 47541 204575 361247 -287311 -19121 22505 116476 341579 240741 55465
12256 422392 -252584 -263098 -26065 -1621 59501 117447 -105533 220186 76008 326127 72883
12244 114099 301697 -92709 311334 123478 43198 63975 -84022 -73321 -29708 -88891 -134175
12233 -134175 793 337239 -21991 67031 637915 383284 146529 195411 171588 25296 41077
12222 41077 190371 120797 152298 426443 267589 -55927 397487 290976 213686 128422 306076
12211 306076 -54264 291406 221314 115144 313499 -118674 -51302 48716 408487 36193
$$ packed form
12290h25C03451b1157C1016d6630A89325C4978L29251a69587A08167m8209J07893
12279A67851J42500B425Q842J11614d0429b245C85981j39487D4269b88274b1629
12267B93580D7541J57034J56672b87311a9121B2505R3971K25103j00838E5465
12256D22392b52584j0514b6065a621E9501N7946a05533B20186G6008K50119G2883
12244A14099J87598i2709C11334A23478D3198K0777h4022J0701b9708n9183m5284
12233a34175G93L36446b1991F7031N70884k54631A46529M8882k3823B5296J5781
12222D1077J49294o9574L1501K74145j58854e5927C97487j06511p7290q5264J77654
12211C06076e4264B91406p0092j06170J98355a18674e1302D8716L59771C6193
$$ plain form
12200 176919 457772 509131 72067 65510 78169 146849 59882 149090 166620 448323 334669
12189 334669 432371 -107220 150621 70502 -137982 89577 391077 -154177 -78293 -218889
12179 -218889 477706 -33098 253665 208845 151482 224627 472961 -191025 -86519 70273 158164
12168 158164 185542 191489 258139 -3193 226260 242497 44330 254136 -144679 36877 66438
12157 66438 -322742 148312 265927 165269 -147914 115672 309000 -31665 -106002 77001
12146 -46579 130613 342046 243033 -123265 277452 -146586 -223107 113360 69387 35182
12136 35182 -202724 -96260 -143467 -14421 128352 2721 125854 -37693 -60300 46876 99437
12125 99437 -160609 -38636 -18065 246145 -31746 -320053 221642 -186048 302964 -176608
$$ packed form
12200A76919K80853N1359G2067o557J2659O8680E9882Q9208J7530K81703j13654
12189C34669R7702a07220A50621G0502a37982H9577L01500a54177P5884j40596
12179b18889D77706c3098B53665m4820n7363P3145K48334a91025h6519G0273Q7891
12168A58164K7378N947O6650c193B26260J6237D4330K09806a44679C6877K9561
12157F6438c22742A48312J17615j00658a47914A15672J93328c1665p4337G7001
12146d6579A30613K11433r9013a23265B77452a46586p6521A13360m3973l4205
12136C5182b02724i6260m7207a4421A28352B721J23133c7693k2607D6876N2561
12125I9437a60609c8636a8065B46145c1746k88307B21642a86048C02964a76608
$$ plain form
12114 362678 -142624 252609 129636 4904 -42012 -122652 322957 -20526 -130454 155981
12103 248064 95133 16461 164577 168290 -225939 -123127 -125260 -227363 -58176 86594 -63601
12091 -107876 -40631 -235461 -125385 316933 -187828 131873 153813 -253400 112961 -79469
12080 -46880 263790 51509 -39058 102992 123319 477422 679475 1292359 1306067 284094
12069 103439 219943 316992 -127933 507220 95553 52075 28902 -313028 -11591 54819 137352
12058 137352 25847 81391 18986 -92267 9055 355756 -207412 -83469 -4821 -57974 -93632
12047 -93632 -26480 174928 -131919 -45453 346003 47699 -9930 125983 -218436 344597 23570
12035 -126957 -22886 -166879 -8364 118897 -174122 -34963 -5616 -28515 249699 -448084 197188
$$ packed form
12114C62678a42624B52609j22973D904d2012q0640C22957b0526j09928A55981
12103B48064I5133A6461J48116L713b25939J02812k133j02103e8176H6594f3601
12091a07876d0631j94830J10076C16933a87828A31873K1940b53400A12961g9469
12080d6880B63790E1509c9058A02992K0327L54103K02053O12884J3708B84094
12069A03439J16504R7049a27933E07220I5553m3478k3173c13028a1591E4819Q2533
12058A37352B5847N5544A8986i2267I055L46701b07412h3469d821n3153l5658
12047i3632b6480A74928a31919d5453C46003D7699i930A25983b18436C44597B3570
12035a26957b2886j43993h364A18897a74122c4963e616k2899B49699d48084A97188
$$ plain form
12023 280606 50405 79742 165946 32269 239907 -4344 181321 61105 -484779 -131171 -183096
12012 -183096 -2223 101129 -441434 -107600 -370649 52024 -486118 -143877 -142595 -280197
12002 -280197 124215 -255690 84916 231510 -53917 -88781 -54167 193676 -3951 -52044 -219233
11991 -219233 159274 179811 -174017 87012 -328282 -325377 -87103 -169004 171090 -95418 135247
11979 -195903 -141143 313474 62501 -82754 -188303 155345 81652 -315071 105628 -319924
11968 61258 51486 268588 499802 -37229 -177248 -258197 -390400 -103699 -213443 -267416 -17078
11956 381525 215313 -149100 -7308 85498 -131729 -164388 -96803 277127 -184504 7794 -146382
11944 -86293 -302502 -66890 -363556 34813 -208243 -375454 -96483 -375517 -262841 -214055
$$ packed form
12023B80606E0405K9337Q6204C2269K07638d344A81321F1105d84779a31171n1925
12012a83096b223A01129d41434a07600k63049E2024d86118a43877J282j37602
12002b80197A24215b55690H4916J46594e3917l4864L4614A93676c951m8093j67189
11991b19233A59274K0537a74017H7012c28282K905h7103q1901A71090i5418A35247
11979a95903N4760C13474F2501h2754j05549A55345p3693c15071A05628c19924
11968F1258r772K17102K31214c7229j40019q0949j32203a03699j09744n3973a7078
11956C81525j66212a49100g308H5498a31729l2659O7585B77127a84504G794a46382
11944h6293k16209f6890k96666C4813b08243j67211i6483k79034J12676M8786
$$ plain form
11934 -214055 -115350 -77283 319441 -113746 -202168 4564 92962 -26091 183902 -133935 -456273
11923 -456273 -68421 -32783 -356499 -21831 -375954 130313 33053 -189084 -7685 -113022 290085
11911 -41006 15368 -84770 -66916 51581 -208314 -71926 161941 -121800 106112 134423 -381082
11899 -129061 351095 124682 32893 25523 -42307 73825 32182 22265 58191 78987 -90999
11887 143971 -105864 -18601 36818 229817 90051 191140 -80739 -12143 -196902 -230720 -231912
11876 -231912 102697 -361036 115761 129391 -118453 -69959 287589 -228648 -319305 -178970
11866 -178970 207033 -211619 -158521 81367 120171 -108324 392930 -221083 -178020 50921
11855 -10256 354316 192048 -60766 240164 -332296 -266742 -156010 -240826 -122315 -2397 -506673
$$ packed form
11934b14055R8705L8067C19441a13746q8422D564Q8398b6091A83902a33935l22338
11923d56273f8421c2783l23716b1831l54123A30313C3053a89084g685j05337B90085
11911d1006A5368h4770J7854E1581b08314g1926A61941a21800A06112K8311c81082
11899a29061C51095A24682C2893p370d2307G3825C2182r917L5926K0796i0999
11887A43971a05864a8601C6818J92999I0051J01089h0739a2143j84759l3818j192
11876b31912A02697c61036A15761J3630a18453M8494B87589b28648r0657J40335
11866a78970B07033b11619N3098H1367L8804a08324C92930b21083M3063E0921
11855a0256C54316j62268f0766B40164c32296O5554J10732q4816J18511b397n04276
$$ plain form
11844 -506673 -14575 -53962 46323 -331316 -45977 168778 -37536 -79238 47785 -116580 -350354
11833 -350354 88638 -90462 -51191 -151677 20082 -30045 15027 -420326 -244336 128203 135970
11822 135970 -368978 292958 31028 66609 12057 -47032 -111355 -82243 -99259 -77784 -66843
11811 -66843 159910 -135790 -10629 200553 -113744 90153 -55914 -53916 192408 101512 -359344
11799 142635 -18863 -92483 -63968 -52995 385877 46883 223465 164203 -233543 -118815 28152
11787 224955 132558 -290262 -3537 153671 158618 -130485 316098 -107734 -13085 148706 56188
11775 212546 9980 -46180 61608 -14819 -293182 -173780 -78422 88207 972 7258 -4632 -12059
11763 -12059 62642 128297 -438194 -202243 -204234 -11583 217266 157520 -23798 10457 -110501
$$ packed form
11844e06673a4575l9387D6323c31316d5977A68778c7536m1702D7785a16580k33774
11833c50354H8638i0462L9271j00486B0082c0045A5027d20326J75990A28203P767
11822A35970c68978B92958C1028L5581A2057d7032o4323K9112j7016K1475J0941
11811f6843A59910a35790a0629B00553a13744I0153e5914J998A92408r0896c59344
11799A42635a8863p3620K8515J0973C85877D6883J76582n9262b33543J14728B8152
11787B24955r2397b90262c537A53671M947a30485C16098a07734a3085A48706E6188
11775B12546I980d6180F1608a4819k78363J19402g8422H8207I72O286d632p427
11763a2059F2642O5655d38194b02243j991a1583B17266n9746b3798A0457a10501
$$ plain form
11751 -123471 112977 -129541 -179610 -144016 -174496 -148559 -310676 19971 35674 -25500 -173144
11740 -173144 -172498 -58090 129762 -232977 138254 -97381 67531 156787 -319330 -29965 -174051
11729 -174051 -398998 68829 208368 -135969 250914 240508 -155045 295708 -166449 1807
11718 255296 -84846 -8646 66604 -24800 44372 106774 -25728 -13419 -31174 72517 9391 70604
11706 70604 8621 5761 77982 309228 19235 -344743 -120883 126136 -272941 200686 -137152
11694 6963 -61934 -289047 178223 -49238 -250706 235660 -137276 -52343 -337431 -31477 49646
11682 200339 392384 -140259 230754 -29883 127550 487808 -272672 -73314 -30090 -251714
11672 -251714 -125486 71097 167468 68902 275474 -64682 -109189 -183709 -231776 204965 25316
$$ packed form
11751a23471A12977a29541n0069L5594l0480K5937j62117A9971J5703b5500j47644
11740a73144O46e8090A29762b32977A38254i7381F7531Q9256c19330b9965j44086
11729a74051k24947F8829J39539a35969B50914j0406a55045B95708a66449A807
11718B55296h4846h646F6604b4800D4372O2402b5728J2309j7755G2517I391O1213
11706G0604H621k860P2221K31246A9235c44743a20883A26136b72941B00686a37152
11694F963f1934k27113A78223d9238k01468B35660a37276e2343k85088c1477D9646
11682B00339J92045a40259B30754b9883A27550L60258b72672g3314c0090k21624
11672b51714a25486G1097R6371F8902K06572f4682m4507p4520m8067B04965B5316
$$ plain form
11660 150364 322372 -32504 151422 243991 -68415 -54680 -273564 -28815 -7297 156171 -24178
11648 89588 89132 265467 -182542 -239502 159839 -90602 24873 185525 36833 2431 -44620
11636 410266 171968 213195 296249 179812 388700 133608 167315 -210437 28542 79017
11626 79017 -112096 21853 -156265 351776 64894 195851 -182237 258384 293539 85825
11615 3958 -193510 -47946 -21636 578 213098 -83098 -43401 -47661 -423083 188576 48726 159307
11603 159307 42456 -59286 171235 98840 -10005 -221777 -209041 103771 -65925 179767 22179
11591 35901 137367 8801 -114191 223808 310280 12300 248219 256883 301729 -161457 -103921
11580 -103921 -1963 48402 -218906 -36780 239909 -8404 87105 423831 161108 -145911 307479
$$ packed form
11660A50364J72008c2504A51422R2569f8415J3735k18884b8815g297A56171b4178
11648H9588m56J76335a82542n6960A59839i0602B4873J60652C6833B431d4620
11636D10266A71968M1227Q3054j16437K08888A33608L3707b10437B8542N0475
11626G9017a12096B1853a56265C51776F4894J30957a82237B58384L5155H5825
11615C958a93510d7946b1636E78K12520h3098L9697m260l75422A88576D8726J10581
11603A59307D2456e9286A71235p2395a0005k11772J2736A03771f5925A79767B2179
11591C5901J01466H801a14191B23808Q6472A2300K35919Q664M4846a61457N7536
11580a03921a963D8402b18906c6780B39909h404H7105L36726A61108a45911C07479
$$ plain form
11568 253705 39056 -86391 -58740 11260 38383 58176 -87167 281881 158786 -122056 364913
11556 72838 -23914 38719 -89443 20163 -50654 48985 -53482 -220082 -291978 64717 152265
11545 152265 -98627 -63705 -56939 -65220 56998 247224 -62979 165223 393093 -20089 267749
11533 954 -86391 27145 47012 283232 340228 67904 44029 23160 211280 -64237 58127 -206446
11520 -135654 -82945 336932 -14333 130284 134502 221691 105591 198919 188467 166241 -28230
11508 280176 78123 -37096 96467 489658 -171188 347680 161867 -29270 318471 -105910
11497 57057 -35865 215260 61634 -2324 -121146 -79871 175282 262957 -61621 151658 104262
11486 104262 335812 37279 83142 250420 149863 -107004 -92312 239097 -77894 54710
$$ packed form
11568B53705C9056h6391K7651A1260K7123J9793h7167B81881j23095a22056C64913
11556G2838b3914C8719h9443B0163e0654D8985e3482j66600p1896F4717Q7548
11545A52265i8627L4922O766q281E6998J90226f2979A65223K27870b0089B67749
11533I54h6391B7145J9867K36220N6996F7904k3875k0869J88120f4237E8127b06446
11520a35654N2709C36932a4333A30284M218Q7189A05591R3328j0452k2226b8230
11508B80176G8123c7096I6467L93191a71188C47680A61867b9270C18471a05910
11497E7057c5865B15260F1634b324j18822M1275A75282Q7675f1621A51658m7396
11486A04262K31550C7279M5863J67278j00557a07004J4692B39097g7894E4710
$$ plain form
11475 134450 420585 139968 281840 297606 440136 125048 88892 246355 -42226 566783
11464 236895 510906 280924 137242 146581 58947 271468 -14246 60809 138737 3214 -436452
11452 455375 -129592 -22061 -84751 -116507 -4026 -28821 31387 390693 229232 41383 253738
11441 253738 128189 219939 164907 -136918 162400 -54476 175138 -121465 17247 159034
11431 159034 -81486 63155 109567 280624 236745 -189459 33945 48689 79154 100108 -129023
11419 135275 -84533 102219 -408371 -178094 -162884 126045 -225909 -150877 -117651 -130983
11409 -130983 208702 -130973 147865 -80080 -53324 80815 19809 115141 558047 -94846 -98290
11398 -98290 178721 327521 205642 -200753 438902 123977 -138636 -217235 385496 -204220
$$ packed form
11475A34450K86135A39968J41872J5766J42530A25048l6156J57463d2226E66783
11464B36895K74011k29982A37242R339E8947K12521a4246F0809P7928C214d36452
11452D55375a29592b2061o2690l1756d026k4795C1387L59306j61461D1383K12355
11441B53738j25549R1750n5032a36918A62400e4476A75138a21465A7247J41787
11431A59034h1486F3155M6412J71057m3879a89459C3945J4744L0465K0954a29023
11419A35275h4533A02219d08371a78094J5210A26045b25909P5032L3226j3332
11409a30983B08702a30973A47865h0080K6756H0815A9809R5332M42906i4846l444
11398i8290A78721J48800j21879b00753D38902A23977a38636p8599C85496b04220
$$ plain form
11387 -108678 -107582 -30403 -16344 63241 10507 195181 -30241 129883 -166313 301336 172469
11376 172469 132483 104247 -87433 -33617 -287487 232654 123485 401910 -211430 117681
11365 -104387 -105255 63274 149580 -518407 11255 136521 138459 -156019 -85411 91073 57408
11354 57408 198879 74488 13995 -23198 -124944 221093 96338 82371 190289 47905 -14171
11342 -109245 -59051 -76163 255839 -259871 331643 176756 -4171 88055 -65459 357635 228527
11331 228527 -113856 -481629 -376129 -177600 -448780 122943 12818 67332 -242766 -114392
11320 13964 168150 -2700 190959 50306 26602 105554 7999 -168742 -24874 154566 -225507
11308 77634 -98587 -389615 -64556 42977 -298348 -106929 -130346 -193342 242704 -147221 -47060
$$ packed form
11387a08678J096c0403J4059F3241A0507J84674c0241A29883a66313C01336j28867
11376A72469l9986k8236h7433c3617k53870B32654j09169K78425b11430A17681
11365a04387q68F3274Q6306e18407A1255J25266J938a56019P0608I1073l3665
11354E7408J41471G4488A3995b3198j01746B21093I6338j3967J07918D7905a4171
11342a09245N0194j7112B55839b59871C31643j54887d171H8055f5459C57635j29108
11331B28527a13856l67773J05500a77600k71180A22943A2818N4514b42766a14392
11320A3964J54186b700A90959E0306k3704P8952G999a68742b4874A54566b25507
11308G7634i8587k91028f4556D2977b98348a06929k3417o2996B42704a47221d7060
$$ plain form
11296 -212971 -402652 -286413 125853 -74083 -246394 -194934 102978 141134 357133 -221634
11285 42850 -277382 -160724 -74509 -154659 -195539 -55496 -151041 79866 257197 41945 -64765
11273 111909 -33547 -180664 39231 36156 -81020 -268497 -261737 -281438 -156624 -10931 175490
11261 23363 -168451 -131200 269423 -277679 124802 -205655 -93673 -46840 370277 171186
11250 38452 -239590 257775 78221 -317765 137468 -31774 49168 76771 -83151 267061 -78491
11238 61950 57771 -68228 59193 75594 -255337 145312 172861 110093 -142144 -74273 -198568
11227 -198568 85172 36388 -122512 8456 90339 58954 -143648 -3953 272178 92429 26382
11215 -97533 -162602 -154912 -146876 -227752 274977 -188589 -282270 -127692 -190314 122611 273942
$$ packed form
11296b12971j89681J16239A25853g4083j72311N1460A02978L8156K15999b21634
11285D2850b77382J16658g4509q0150m0880e5496r5545G9866J77331D1945f4765
11273A11909c3547j47117C9231l075h1020j87477O760j9701J24814a0931A75490
11261B3363a68451L7251B69423b77679A24802b05655i3673M6833C70277A71186
11250C8452b39590B57775G8221c17765A37468c1774D9168K7603h3151B67061g8491
11238F1950m179f8228E9193J6401b55337A45312K7549o2768a42144O7871j24295
11227a98568H5172C6388a22512H456Q1883l1385a43648c953B72178I2429B6382
11215i7533o5069P690Q036q0876B74977a88589r3681a27692o2622A22611J51331
$$ plain form
11204 273942 -82328 196700 -33377 312900 -308452 10534 -83920 -137419 17928 -339775 134937
11192 2793 -50124 1691 -236909 35888 -100285 -49812 342283 -433794 -201704 -470615 -118991
11180 -356889 211881 -298984 57217 -10579 -305256 432409 -349085 -63614 91954 -143425
11169 -126384 -207229 -314571 -323054 -325379 -214727 225067 79950 150584 -362738 -259808 131781
11157 63541 355695 -166645 -363895 -174876 -155276 272373 162200 -199420 -465638 -215565
11146 -126463 241625 -79256 5730 -44405 82725 -91488 38685 83769 -149341 56650 -39467
11134 73446 113374 -47521 325568 14409 -235968 -34257 49280 -100144 -194502 115573 -119260
11122 4188 -440711 99509 -168221 149200 114792 -455778 5832 -71298 406111 176999 -144720
$$ packed form
11204B73942h2328A96700c3377C12900c08452A0534h3920n3499A7928c39775A34937
11192B793e0124A691b36909C5888a00285d9812C42283d33794b01704k68911a18991
11180c56889B11881b98984E7217a0579k94677D32409c49085f3614I1954a43425
11169a26384q0845j07342q483k325J10652B25067G9950P0634c62738J02930A31781
11157F3541K92154a66645j97250a74876J9600B72373j10173a99420k66218b15565
11146a26463B41625g9256E730d4405H2725i1488C8685M5084a49341E6650c9467
11134G3446L9928d7521C25568A4409b35968c4257D9280a00144r4358A15573a19260
11122D188d40711I9509a68221A49200l4408d55778E832g1298D06111A76999a44720
$$ plain form
11110 -10813 2596 -11919 228938 497231 108970 173905 83738 436604 265500 376768 -97146
11098 -108731 230194 -240492 191403 174925 52760 325831 26452 463044 365846 -128621
11087 322346 325101 10552 403457 104479 167919 238174 201367 125915 260999 104327 591656
11076 591656 452361 85615 172552 499042 549667 298215 261563 486628 180619 30978
11065 233369 138005 325374 597428 409966 778386 407851 238911 501959 509644 641262
11055 641262 423635 1002282 658362 544280 373442 684935 635320 501380 665925 706723
11045 706723 391218 713309 453397 811493 686331 633995 740191 464470 454690 440000
11035 440000 635393 502467 624297 554719 528504 710592 639929 450999 577068 797938
$$ packed form
11110a0813B596a1919B28938K68293A08970O4935H3738L52866j71104J11268i7146
11098a08731B30194b40492A91403j6478E2760K73071B6452M36592r7198a28621
11087C22346K755A0552L92905A04479O3440P0255l6807p5452J35084A04327M87329
11076E91656j39295H5615Q6937L26490N0625k51452l6652K25065A80619C0978
11065B33369r5364J87369K72054j87462L68420l70535j68940K63048P685J31618
11055F41262k17627N78647l43920j14082j70838L11493m9615j33940J64545M0798
11045G06723l15505L22091k59912L58096j25162n2336J06196k75721r780j4690
11035D40000J95393j32926J21830o9578k6215J82088p0663j88930J26069K20870
$$ plain form
11025 797938 664023 576052 652789 531559 860176 951277 382515 746551 415330 582688
11015 582688 503885 572191 886086 242159 529868 240222 701897 351283 410422 135836
11004 777563 266012 782688 627570 171479 479742 217974 792498 417182 453967 785728
10994 785728 344487 665014 488978 397118 816828 637243 602656 663995 1160330 950637
10984 950637 1010095 955417 1192241 780309 924246 1480880 1529855 1338913 1906385 2106565
10974 2106565 1997011 2196999 2309530 2615037 2254716 2340606 1998081 1911529 1920799 1862474
10964 1862474 1462927 1501164 1580343 1607266 1837677 1975700 1655705 1777462 1605641 1538274
10954 1538274 1453543 1352616 1072037 772998 1139224 687852 570578 610876 557900 598180
$$ packed form
11025G97938j33915q7971P6737j21230L28617R1101C82515L64036l31221J67358
11015E82688p8803O8306L13895B42159K87709B40222M61675l50614N9139A35836
11004G77563B66012N16676j55118A71479L08263B17974N74524l75316L6785L31761
10994G85728C44487L20527j76036r1860M19710j79585l4587O1339M96335k09693
10984I50637N9458n4678K36824m11932J43937N56634M8975j90942N67472K00180
10974B106565j09554J99988J12531L05507l60321Q5890l42525q6552R270n8325
10964A862474l99547L8237P9179K6923K30411J38023l19995J21757j71821o7367
10954A538274q4731j00927k80579k99039L66226m51372j17274M0298n2976M0280
$$ plain form
10944 598180 215267 233766 37879 70659 576635 107780 152438 9799 175967 81581 112640
10933 112640 503199 227347 -69896 278709 66113 30159 87525 -162416 -10830 133610
10922 48673 102439 -167959 -163502 40016 440 -218417 -139828 -225139 158848 153394 153272 -128157
10909 -68182 123233 -77128 198621 250510 -185950 202715 24043 244186 112541 -132932
10898 4678 -140645 -68344 22260 309570 -318701 -128928 -72514 174056 -33562 217267 -11490
10886 -52965 -81456 -176456 135255 -46038 -135919 219724 -222267 -162943 -28329 53805 -60071
10874 -269826 -50849 175117 -218849 136311 21779 -62999 132871 -219785 -134894 146858
10863 336506 128076 -179440 15210 -39860 209629 2807 -52599 -162486 -5101 -23064 33968
$$ packed form
10944E98180B15267J8499C7879L2780N05976A07780M4658I799J66168H1581L1059
10933A12640L90559B27347f9896B78709F6113C0159N7366a62416a0830A33610
10922D8673N3766a67959M457D0016D40b18417P8589q5311A58848n454j22a28157
10909f8182A23233g7128A98621N1889a85950B02715B4043K20143A12541a32932
10898D678a40645f8344B2260K87310c18701a28928N6414A74056c3562B17267a1490
10886e2965k8491r5000A35255d6038q9881B19724b22267N9324b8329E3805f0071
10874b69826e0849A75117b18849A36311B1779f2999A32871b19785Q4891A46858
10863C36506A28076a79440A5210c9860B09629B807e2599j09887e101j7963C3968
$$ plain form
10851 -105175 296364 59072 -152021 -22338 74307 56741 -176327 450446 -25723 -89322 -316372
10840 -316372 101677 -117408 206526 140663 15968 174334 -27050 11293 365031 296752
10830 296752 -30848 -185384 13183 -21062 119160 147959 -140406 -181087 -82122 -7216 -157127
10819 -157127 116861 -55105 172876 -262813 -66201 389287 -84513 255739 19083 -145809
10808 33601 298455 17939 50794 -84172 -8734 328936 136133 -318955 193032 13932 -247860
10796 99777 23003 -89457 73492 -254175 -169569 -114708 -300647 -165172 26010 29238 -51105
10784 111774 -209972 -454990 -2772 -157256 -217975 -246090 -270974 -69118 -240471 -142337 -20803
10772 27122 -157084 -27985 -162857 152832 -274136 -34746 -324677 90734 -4956 200756 79424
$$ packed form
10851a05175B96364E9072a52021b2338G4307j7566a76327D50446b5723o3599k27050
10840c16372A01677a17408B06526o5863A5968J58366b7050A1293L53738o8279
10830B96752c0848j54536A3183b1062A19160K8799a40406m0681h2122g216j49911
10819a57127A16861e5105A72876b62813f6201C89287h4513B55739A9083a45809
10808C3601K64854A7939L2855h4172h734C28936A36133c18955A93032A3932b47860
10796I9777B3003h9457G3492b54175Q4606N4861j85939J35475B6010L228e1105
10784A11774b09972k45018b772j54484o0719k8115k4884f9118j71353R8134b0803
10772B7122a57084b7985j34872A52832b74136c4746k89931I0734d956B00756G9424
$$ plain form
10760 -57273 239145 218411 -6972 118542 127337 -92330 -154569 19486 -27026 -59534 -289031
10749 -289031 112090 233130 47430 -165400 229179 -207500 -200008 -119191 -7095 -101370 -186298
10738 -186298 -32665 -312069 -270351 -127077 79789 -72722 234393 196856 -59824 -332598 111576
10726 -261545 -264756 15324 300124 -114717 211374 14712 -49651 -53967 -54298 -194065 520865
10714 -216349 21155 -63932 -62085 97868 -143419 -199719 -352296 -102351 105175 -61991 -411625
10703 -411625 -25276 -152187 -247844 -193872 -147035 -260178 -214216 78764 -218950 7921 -258332
10691 -49937 28948 -395330 -136135 -109135 -123537 -232696 35769 185284 -21107 -40411 251078
10679 -62672 -135642 -180312 -13373 -34066 -176245 11643 -160233 -57864 199501 323775 -405758
$$ packed form
10760e7273B39145k0734f972A18542Q795i2330o2239A9486b7026l2508k29497
10749b89031A12090J21040D7430a65400B29179b07500P492Q0817g095r4275q4928
10738a86298c2665k79404M1718a27077G9789g2722B34393l7537e9824k72774A11576
10726b61545l211A5324K84800a14717B11374A4712d9651m316l31j39767E20865
10714b16349B1155f3932J847I7868a43419n6300j52577a02351A05175f1991l49634
10703d11625b5276j26911r5657N3972M6837j13143M5962G8764b18950G921b58332
10691d9937B8948c95330a36135K7000j4402j09159C5769J49515b1107j9304B51078
10679f2672p2970m4670a3373k0693j42179A1643a60233e7864A99501J24274d05758
$$ plain form
10667 -8508 34094 -30112 -40710 217503 123048 -247923 188180 81432 -64188 97308 -26678
10655 -150302 -177874 -33232 -1595 -93429 -112238 268910 -50843 264585 123410 -255701 80429
10643 67972 -188963 94289 13905 -200342 -75169 -3843 -163840 58218 -152983 -84727 -210764
10632 -210764 155073 13299 -9747 -35885 -90186 -34652 124512 73544 129024 42415 140070
10621 140070 200982 -120756 11168 -367490 -240738 -55344 -138857 109910 -51397 -115615 69329
10609 213543 -239902 -169066 62700 201446 -20073 -29604 -165628 -124473 342064 111874 -38081
10597 -22510 257905 -83738 -83571 -19756 -51722 -311173 -162496 -65114 -158789 182277 -387330
10585 241891 -277473 -162109 -147960 -190649 -152721 -318460 54200 161029 -117610 120109
$$ packed form
10667h508C4094c0112j0598B17503r4455b47923A88180H1432f4188I7308b6678
10655a50302k7572c3232a595r1834j8809B68910e0843B64585A23410b55701H0429
10643F7972a88963I4289A3905b00342g5169c843j59997E8218a52983O8256j26037
10632b10764A55073A3299i747k6138n4301c4652A24512n0968N5480D2415R7655
10621A40070O0912a20756A1168c67490J26752e5344q3513A09910e1397o4218F9329
10609B13543b39902P0836F2700J38746b0073r531j36024M1155C42064A11874c8081
10597b2510B57905h3738J67a9756l1966k59451J48677f5114r3675A82277c87330
10585B41891b77473J15364J4149m2689L7928j65739E4200J06829a17610A20109
$$ plain form
10574 -293751 -105750 126177 -251955 -55569 255001 52423 -151655 134916 217238 -20521
10563 67014 65320 -259486 22255 33312 47969 -130947 48566 251194 66000 15875 36156
10552 36156 69324 112578 -270074 -158822 15766 -324449 -267360 26030 198806 160875 -37428
10540 -162137 -393904 -105218 -243430 -141957 -424922 -71608 105117 -159271 -191100 107625
10529 24562 -38129 69895 -148737 76325 319734 -242560 155289 -268613 -246460 -329794 -183834
10518 -183834 -84762 42619 268937 -332876 -107038 119340 -10060 193775 -217108 -248802
10508 -248802 -89206 -18961 -305258 -74107 247509 -72043 50894 212308 25135 335824 -55595
10496 -165749 -82680 -4800 -47796 47921 -188532 -92388 -353192 -51840 333990 -276996 -167505
$$ packed form
10574b93751a05750A26177b51955e5569B55001E2423a51655A34916Q2322b0521
10563F7014j694b59486B2255J1057J4657a30947D8566K02628F6000A5875K0281
10552C6156L3168M3254b70074J11252A5766c24449N7089B6030J72776l7931c7428
10540a62137k31767a05218j38212J01473k82965g1608A05117a59271l1829A07625
10529B4562c8129F9895a48737G6325K43409b42560A55289b68613K2153q3334J45960
10518a83834h4762D2619K26318c32876a07038A19340a0060A93775b17108l1694
10508b48802h9206a8961k86297g4107B47509g2043E0894J61414B5135L10689e5595
10496a65749h2680d800m2996D7921a88532i2388k60804e1840C33990b76996J09491
$$ plain form
10485 -167505 81095 221254 290605 422969 532274 307175 618685 -81537 325695 44722
10474 207536 -142568 -277833 -105392 -213071 -308000 -146622 -295777 -126981 321492 -251537
10463 -178527 27842 -35169 -184481 -104807 -54573 311887 28701 136487 369518 17209 -154578
10451 -293742 -114751 -69957 -61449 20590 -73198 451175 -78803 1925 376275 -4555 197286
10439 16130 237061 152973 -174113 -78911 170953 -82422 224669 -295051 -209937 209441
10428 117325 -286491 -96974 328280 -80758 145007 97683 -141972 -72142 281956 51537
10417 162734 -106823 -90136 -199691 214270 413984 7283 62122 88338 -143506 -67093 -82688
10406 -82688 -33622 72313 -49894 -61929 -22995 -238802 5389 72287 -276987 -72948 -32456
$$ packed form
10485a67505H1095J40159O9351J32364J09305k25099L11510h1537C25695D4722
10474B07536a42568j35265a05392j07679r4929a46622j49155a26981C21492b51537
10463a78527B7842c5169j49312P9674N0234C11887B8701J07786K33031A7209a54578
10451b93742a14751M4794Q508B0590g3198D51175g8803A925L74350d555A97286
10439A6130K20931q4088a74113g8911A70953h2422B24669b95051Q5114B09441
10428A17325b86491i6974C28280h0758A45007m7324a41972O9830B81956E1537
10417A62734a06823J6687j09555B14270J99714G283N4839K6216a43506f7093j5595
10406h2688c3622G2313d9894j2035b2995k15807E389O6898b76987g2948c2456
$$ plain form
10394 10676 -150631 -90104 -6937 120055 317098 -132372 -161550 -46284 60271 80887 125587
10383 125587 169412 452631 -63475 -89552 -38224 -26766 -41652 366423 265690 524830 337272
10372 337272 113221 322078 213307 159243 269382 505635 398662 723432 279126 121330
10361 136924 400916 402707 502569 131069 152642 -71008 409811 258954 339114 240244 177749
10350 177749 565236 425264 351532 176127 436384 374041 355594 144219 524760 583341
10340 583341 123375 79384 364787 161909 -210736 169995 132610 -94095 -16331 181898
10329 -106918 -91439 -22955 79767 105400 63267 184081 152835 359289 324591 223419 723
10317 326099 -16809 180790 103035 264812 147531 153174 134534 325832 403540 64326 92128
$$ packed form
10394A0676a50631O0527f937A20055J97043a32372k9178d6284F0271K0616M4700
10383A25587M3825K83219f3475k6077c8224J1458j4886C66423j00733K59140j87558
10372C37272A13221K08857j08771n4064J10139K36253j06973L24770B79126A21330
10361A36924K63992J791R9862A31069K1573g1008D09811j50857Q0160r8870o2495
10350A77749L87487j39972p3732j75405K60257o2343j8447A44219L80541N8581
10340E83341A23375m3991K85403A61909b10736A69995l7385i4095a6331A81898
10329a06918J5479b2955G9767K5633m2133J20814l1246K06454l4698j01172G23
10317C26099a6809A80790p7755J61777j17281N643j8640J91298P7708F4326K7802
$$ plain form
10306 92128 -318468 -99822 98579 -255046 -114247 39069 -52130 139411 -154784 182954
10295 179463 -160845 -37758 77538 -160781 142215 85091 -79424 -531516 -190385 21959
10284 -26815 -237029 -75316 192003 -201705 98103 78672 -93465 214339 -348113 64639 154476
10273 154476 452605 -149334 -3781 68587 41473 -364851 -89960 -429885 228957 -21142 73409
10261 244665 52476 220610 348009 641252 187603 358514 187910 343267 33147 249481
10251 249481 -449173 233091 -274737 52045 -43634 27863 -38193 -244763 72721 -173545
10240 56823 12509 -445192 -56424 62621 19264 -234040 119328 135200 103900 -214092 -312501
10229 -312501 65317 -138186 -109059 -34003 -207097 -305467 38688 -201231 284367 -119002
$$ packed form
10306I2128c18468i9822I8579b55046a14247C9069e2130A39411a54784A82954
10295A79463a60845c7758G7538a60781A42215n7124g9424m52092a90385B1959
10284b6815k10214g5316A92003b01705I8103j9431i3465B14339c48113F4639Q9837
10273A54476K98129a49334c781F8587k7114c64851h9960l39925B28957b1142G3409
10261B44665E2476J68134J27399K93243A87603J70911j70604J55357C3147K16334
10251B49481d49173B33091b74737E2045d3634B7863c8193k06570G2721a73545
10240E6823A2509d45192e6424F2621A9264b34040A19328J5872l1300b14092r8409
10229c12501F5317a38186K9127c4003j73094r8370C8688b01231B84367a19002
$$ plain form
10218 -287678 -296948 -101812 -121547 -279966 -168698 -116885 -295429 -196593 44493 -204844 -182608
10207 -182608 -155615 -179997 -125448 307223 73020 -119556 18540 713 146803 -194474 337034
10195 -140931 220776 166507 247573 -111879 215103 -340767 249412 -65458 108962 -81779
10184 16474 -224964 122214 11584 193549 -107485 -197886 -60225 -13386 -58121 181268 173695
10173 173695 53867 316279 214373 -117709 -268950 58450 186258 142245 -111146 -340608
10163 -340608 45556 -421052 103612 -82049 10643 11129 224567 563434 221812 -386503 -88755
10151 -194947 -767606 -145260 23703 -399792 24054 -87256 -262318 -259503 9231 -85793 -28950
10139 25531 -55602 -275510 -118323 -184421 40320 -305819 -189693 -159940 -103709 -69089 127415
$$ packed form
10218b87678r270a01812j9735j58419J11268N1813j78544R8836D4493b04844K2236
10207a82608K6993k4382N4549C07223G3020a19556A8540G13J46090a94474C37034
10195a40931B20776n4269Q1066a11879B15103c40767B49412f5458A08962h1779
10184A6474b24964A22214A1584J81965a07485r0401f0225a3386m4735A81268p573
10173A73695E3867K62412j01906a17709j51241E8450J27808m4013a11146k29462
10163c40608D5556d21052A03612h2049A0643M86K13438L38867B21812c86503h8755
10151a94947n72659a45260B3703c99792B4054h7256j75062K815I231h5793b8950
10139B5531e5602k19908a18323o6098D0320c05819J16126K9753N6231L4620A27415
$$ plain form
10127 -160358 -128936 -7308 227276 41867 -169696 -189357 -141824 -136203 4425 -136773 -291131
10116 -291131 53846 34575 -162535 308 62559 -223025 -403851 -62122 -138093 60130 -249527
10104 32374 81775 84677 -88535 67622 -177785 -103381 -86730 -125147 -130205 98623 111498 3749
10091 28182 -159642 -336439 -4686 -55090 234791 54791 -156810 149761 -214005 -353963
10081 -353963 4417 -142621 -97172 -292767 -227376 53560 282878 40362 150700 18224 197003
10070 197003 280627 -203839 -172436 3417 63417 162081 -220709 -329874 -548341 -193533 42258
10058 -51581 38900 -166541 -251342 61439 -169854 -295861 -35574 -108794 -63073 -112047 -374187
10047 -374187 -117100 -325765 35590 -15702 74075 44892 18342 150851 -194496 -107946 -61881
$$ packed form
10127a60358L1422g308B27276D1867a69696j9661M7533N621D425a36773j54358
10116b91131E3846j9271a62535C08O2251b23025j80826f2122p5971F0130b49527
10104C2374M9401K902h8535F7622a77785P4404J6651l8417n058I8623J2875C749
10091B8182a59642j76797d686n0404B34791E4791a56810A49761b14005j39958
10081c53963D417a42621M5449j95595O5391E3560K29318D0362J10338A8224J78779
10070A97003Q3624b03839L1403C417O0000R8664b20709j09165k18467a93533D2258
10058e1581C8900a66541q4801F1439a69854j26007c5574p3220M5721m8974k62140
10047c74187a17100k08665C5590a5702G4075k9183A8342J32509a94496Q6550M6065
$$ plain form
10036 -61881 -139560 -132805 -256936 -207334 291389 -177723 148848 -47312 -13765 -1646 227888
10024 -65751 -106644 68027 19581 140060 -196797 41275 -244960 -448939 -303947 121832
10013 119678 -258945 177204 -11520 -377975 7 -290418 -22361 -343402 -559550 -91397 -474022
10002 -474022 133962 -259785 -296334 116582 -232422 3665 -60566 -239304 -296235 91384 -83520
9990 71687 185690 179590 106313 -76166 -73157 -56938 -246351 -127855 -207541 143885 -337628
9978 67708 184634 -14040 -29027 -68689 -201658 -92803 -194537 -20156 -47446 106189 77278
9967 77278 847 -48604 39548 157773 -458421 161058 -194081 -68762 -40264 28287 -314127
9955 35191 136164 170396 -11093 67810 -140140 -131695 -119952 85698 192347 -32486 59 -129678
$$ packed form
10036f1881p7679O755j24131M9602B91389a77723A48848d7312a3765a646B27888
10024f5751m0893F8027A9581J20479a96797D1275b44960k03979J44992A21832
10013A19678b58945A77204a1520l66455Gb90418b2361l21041k16148i1397l82625
10002d74022A33962b59785l6549A16582b32422C665f0566j78738n6931I1384h3520
9990G1687J14003o100p3277g6166L009J6219j89413J18496p9686A43885c37628
9978F7708J16926a4040j4987l9662j32969i2803j01734b0156k7290A06189k8911
9967G7278H47d8604C9548J18225d58421A61058a94081f8762K8498B8287c14127
9955C5191J00973L4232a1093F7810a40140Q445J1743H5698J06649c2486E9a29678
$$ plain form
9942 105168 -259277 25669 -380467 -174666 -167910 -341568 -25059 -329694 -150987 225168
9931 77952 -127421 -82728 -179445 -348285 -6671 -233736 117810 -423058 201412 118038 178952
9920 178952 -43273 -296355 90814 -218505 55313 -35934 198518 -57776 -176099 -7872 -175220
9909 -175220 35734 -244669 -11224 201271 -507655 181239 -161915 36233 87768 -95215 97412
9897 50586 -88622 -163010 -65907 -163287 -108347 265479 -70613 -117337 7165 -151155 131424
9885 208360 -177685 -578897 -77151 27664 -10414 -84025 -84162 -179903 -80112 -188405 -61174
9873 99996 -117645 -309634 -211572 -229119 78510 307663 287799 -68770 153603 -57399 -7296
9861 88786 -168003 -27430 -228889 -314854 -52481 13810 -215694 112178 34716 -170339 188242
$$ packed form
9942A05168b59277B5669c80467a74666O756j73658b5059l04635a50987B25168
9931G7952a27421M4693r6717j68840f671k27065A17810d23058B01412q3374O0914
9920A78952d3273k53082I0814b18505E5313c5934A98518e7776j18323g872j67348
9909a75220C5734b44669a1224B01271e07655A81239a61915C6233N1535i5215I7412
9897E0586h8622p4388f5907r7380N4940B65479g0613m6724G165a51155A31424
9885B08360a77685m01212g7151B7664a0414p3611j37r5741h0112j08293f1174
9873I9996a17645j91989R8062j7547G8510K29153j9864f8770A53603e7399g296
9861H8786a68003b7430k01459q5965e2481A3810b15694A12178C4716a70339A88242
$$ plain form
9849 -241912 108984 18533 27808 -150081 -166384 114352 -118116 -1355 -116137 -235482 -11458
9837 169763 -236018 273692 15987 -172014 -34722 117590 209351 9185 137101 -353785 -23842
9825 -71409 -172458 -198918 162124 -267277 -27170 -325199 -12925 159519 -150433 12177 15867
9814 15867 -332701 -45529 79080 124807 -4430 -116859 -119980 -122136 -47118 214842 78156 243516
9802 243516 -74895 -142956 29228 410972 44964 -150189 -5180 -100938 -42282 -334158 115079
9790 -126526 -297586 175800 -113007 460485 -47555 148935 -85206 630 -171607 191528 364458
9779 364458 -20479 -21029 -133166 -119696 -389381 -183346 -163754 -82477 -256975 -175507 -36057
9767 21919 -359321 -357047 23458 -312582 37706 148209 -63419 69155 -364879 -34368 -7984
$$ packed form
9849b41912A08984A8533R275a50081j6303A14352a18116a355j14782j19345a1458
9837A69763b36018B73692A5987a72014c4722A17590R1761I185J27916c53785b3842
9825g1409j01049k6460A62124b67277b7170k98029a2925A59519a50433A2177L690
9814A5867c32701d5529G9080M5727d430j12429l121k156d7118B14842G8156J65360
9802B43516g4895o8061B9228L81744D4964a50189e180r5758d2282k91876A15079
9790a26526j71060A75800a13007D60485d7555A48935h5206F30a71607A91528J72930
9779C64458b0479n50j12137J3470k69685a83346J9592Q1277j74498Q1468c6057
9767B1919c59321K274B3458c12582C7706J10503f3419F9155c64879c4368g984
$$ plain form
9755 188035 74359 -158414 -277573 -254283 -366021 -76905 71155 29644 27344 -348907 -204408
9744 -204408 143773 -14287 7244 333 220391 -91844 51266 150763 -40170 117397 -195641
9732 256866 -20077 1718 -160049 7149 -83874 -31977 -119086 16970 -22132 4260 13571 -72748
9719 36365 -375430 -87580 -259019 187388 -404746 157930 132702 -323295 -99618 192724
9708 54971 -372677 268139 36110 23555 -239917 -29327 -26877 -59030 -163024 10581 -44278
9696 -115356 -26565 -40940 -65779 -61826 -449315 -192121 59400 -294525 -90821 -16270 -179176
9685 -179176 -202321 -235081 -277517 -63201 164716 -181505 -8907 12906 -86798 -203745 -51982
9673 151060 -366687 -13566 132850 -272482 60420 -159933 82248 7525 272179 110477 -174076
$$ packed form
9755A88035G4359a58414j19159K3290j11738g6905G1155B9644k300c48907J44499
9744b04408A43773a4287G244C33K20058i1844E1266R9497d0170A17397a95641
9732B56866b0077A718a60049G149h3874c1977q7109A6970b2132D260R311g2748
9719C6365c75430h7580j71439A87388d04746A57930k5228c23295i9618A92724
9708E4971c72677B68139C6110j2555b39917b9327K450l2153j03994A0581d4278
9696a15356b6565j4375k4839L953l87489a92121E9400b94525i0821a6270j62906
9685a79176k3145l2760m2436f3201A64716a81505h907A2906h6798j16947e1982
9673A51060c66687a3566A32850b72482F0420a59933H2248G525K64654A10477a74076
$$ plain form
9661 232007 -274253 -286613 -106836 271015 286551 17391 -22583 23034 133520 138601 -338541
9649 228801 -259660 -63986 -119063 384814 -95583 -155424 -7188 168171 -50839 -176169 -123490
9638 -123490 -87323 -77725 731 148465 -210882 -72000 -353093 -147826 -289266 -364735 -109454
9626 -237266 24961 -141054 -15828 -373718 -186348 -159056 -302064 -47977 258626 -158293
9615 -89298 124758 -203490 7190 -147152 -67659 76542 202362 93872 -397463 252694 -1346
9603 273592 147091 -5705 -239513 77578 27836 -100542 144693 -254572 -103560 -190204 -205411
9592 -205411 -164009 65757 56386 5049 -163640 -126173 -163357 -223639 362894 -65877 -291260
9581 -291260 -181957 279466 76848 -98501 -265158 -73184 -57971 224155 103639 128293 -29227
$$ packed form
9661B32007b74253j2360a06836B71015J5536A7391b2583B3034J10486N081c38541
9649B28801b59660f3986n5077C84814i5583n9841g188A68171e0839j25330N2679
9638a23490L6167R598G31J47734b10882g2000k81093a47826j41440p5469a09454
9626b37266B4961a41054a5828l57890a86348K7292j43008d7977B58626a58293
9615h9298A24758b03490G190a47152f7659G6542J25820I3872c97463B52694a346
9603B73592j26501e705k33808G7578B7836a00542A44693b54572a03560q6644j5207
9592b05411M1402F5757r371E049a63640L7467l7184o0282C62894f5877k25383
9581b91260J09303B79466G6848i8501j66657g3184J5213B24155A03639K4654b9227
$$ plain form
9569 210303 -150539 93635 -148099 -185289 -86634 -276352 -1529 221123 -260698 130295 -215023
9557 -41145 -107458 359315 -324557 -127403 11206 24191 -108222 -187342 261630 61127 -260116
9545 -377917 176036 -95944 -103902 -49509 -144245 -341562 19752 -68754 -47407 -39663 136148
9533 -135620 -25962 124348 -177207 37753 -89921 287175 -259250 23101 222046 200680 100982
9522 100982 3542 -327616 -381414 24347 93817 73020 293481 87786 242810 -275341 70880
9510 -18640 -183088 -191531 259497 -368677 301934 250953 -241165 -198785 -38557 -234866 -314766
9499 -314766 -15495 -116667 36564 -123986 -14360 -49854 103621 13320 86688 -18164 150735
9487 28694 171110 59390 -73492 58058 35028 -222500 -366789 -431676 -380891 20549 -128532
$$ packed form
9569B10303a50539I3635a48099l7190h6634j89718a529B21123b60698A30295b15023
9557d1145o6313C59315c24557a27403A1206J2985a08222p9120B61630F1127b60116
9545c77917A76036i5944p958d9509r4736j97317A9752f8754K1347P744A36148
9533a35620b5962A24348a77207C7753h9921B87175b59250B3101J98945k1366r9698
9522A00982C542c27616n3798B4347O9470k0797K20461H7786J55024b75341G0880
9510a8640j64448q443B59497c68677C01934n0981b41165M2380c8557j96309p9900
9499c14766a5495j01172C6564a23986a4360l5494A03621A3320P3368a8164A50735
9487B8694J42416E9390g3492E8058k3030b22500j44289o4887N0785B0549a28532
$$ plain form
9475 -70583 -372633 -49921 -64788 -279271 -201135 114685 324455 -148769 -80023 130431 -73820
9463 -15561 -239496 -368790 119523 -117798 -46835 17394 323791 -205621 233760 -195977
9452 -121579 34669 -101781 -73474 -30620 -155871 -255199 -20455 -348667 176493 174816 -238885
9440 -131796 71567 -190606 -31723 -21670 -216635 -307881 -269003 -182553 -6877 -26485 -203046
9429 -203046 -28152 -198541 -256910 100047 -70985 -206349 -349657 51723 -164608 -296593
9419 -296593 -57105 -235275 -167440 -61891 154887 130343 -132104 346434 -314586 100210
9408 66728 89183 -128903 -478943 201033 148002 -117844 -66668 -64423 13101 -56035 -49025
9397 -49025 -33593 -204190 -211317 -9862 75344 -329139 153005 466595 36361 -254367 -6091
$$ packed form
9475g0583l02050d9921j4867k14483P8136A14685K09770a48769O8746A30431g3820
9463a5561k23935j29294A19523a17798d6835A7394L06397b05621B33760a95977
9452a21579C4669a01781K8307c0620j25251r9328b0455l28212A76493j677b38885
9440a31796G1567a90606c1723J0053j94965r1246L8878Q6450f877j9608j76561
9429b03046b8152j70389n8369A00047g0985j35364j43308E1723a64608j31985
9419b96593e7105j78170O7835f1891A54887k4544a32104C46434c14586A00210
9408F6728K2455a28903l50040B01033n3031a17844N1176K245A3101e6035P010
9397d9025J5432j70597p127i862G5344c29139A53005L13590C6361b54367f091
$$ plain form
9385 -337816 -21329 47349 -97840 -11482 -17239 147316 113643 -80015 -25126 -372808 271329
9373 -152007 124198 -72019 6174 -123723 421188 -195398 -267458 1901 195869 -148883 13673
9361 187376 -67415 -171433 -383605 131971 181464 148162 -7243 113986 -5668 -88284 -359941
9350 -359941 -99941 -27731 -51515 257643 -165936 -7682 -78860 29330 -285543 -256542 247209
9338 -259146 -226951 -186520 -113683 -38362 -82560 -104199 -151067 -269815 -147420 165491 145385
9327 145385 -151112 169612 63165 221212 -84537 105993 -429858 62568 -1109 -163971 -227342
9316 -227342 -201127 22258 100924 -251986 180237 -196468 267530 -106380 235682 54636
9305 287635 -145609 -386527 -100123 -105570 -123389 -247280 -298640 -34182 -153230 -341598 -277665
$$ packed form
9385c37816b1329D7349i7840a1482n757A47316l3673h0015b5126l47682B71329
9373a52007A24198g2019F174a23723D21188a95398p2060A901J93968a48883A3673
9361A87376f7415j04018k12172A31971M9493l3302g243A13986e668q2616k71657
9350c59941i9941b7731k3784B57643a65936g682p1178B9330b85543K9001B47209
9338b59146L2195M0431P2837c8362m4198k1639m6868j18748J22395A65491k0106
9327A45385a51112A69612F3165J58047h4537A05993d29858F2568a109j62862o3371
9316b27342K6215B2258P8666b51986A80237a96468B67530a06380B35682E4636
9305B87635a45609k40918a00123n447j7819j23891n1360c4182j19048j88368O3933
$$ plain form
9294 -277665 -596502 -194389 12882 -304005 -153633 -103330 -397517 -95183 -56707 125817
9283 -56841 -233318 -250254 34390 -47580 -263720 43105 -68811 -188476 170805 -237717 105137
9271 -283913 19515 153507 -235638 -98463 207574 47131 -177308 -314223 362021 -32449
9260 -77536 -56997 -163198 52953 68922 -118534 -44858 -235378 -383637 -42322 -155467 -95194
9249 -95194 225971 12788 -126022 399371 48616 134933 132865 167048 -157503 91000 9769
9237 -122604 261850 92956 -102301 -118748 -66921 -70393 -169270 -53208 -103496 -78100 276267
9225 -27985 189698 -275601 14440 -226610 397504 -89117 -94755 -20102 -94764 17329 -27477
9213 49190 -312028 162935 166220 -178416 -150139 36755 -136100 86382 -189445 -323799 -121364
$$ packed form
9294b77665l18837a94389A2882c04005J50372N0303k94187i5183L8476A25817
9283e6841j76477j6936C4390d7580k16140D3105f8811j19665A70805b37717A05137
9271b83913A9515J33992b35638i8463B07574D7131a77308j36915C62021c2449
9260g7536K0539j06201E2953J5969a18534d4858j90520j48259d2322j13145O0273
9249i5194B25971A2788a26022C99371D8616Q6317k068L4183a57503I1000I769
9237a22604B61850I2956a02301j6447N1827l472r8877e3208n0288K5396B76267
9225b7985A89698b75601A4440b26610C97504h9117n638b0102p4662A7329b7477
9213D9190c12028A62935L285a78416K8277C6755a36100H6382a89445j34354a21364
$$ plain form
9201 -288440 -168940 -198134 -32480 -54572 -17634 -344668 -226943 68761 -308975 -272369 79975
9189 -207095 36664 -27025 30387 307006 -163113 -112946 -140534 -68129 15954 119083 99061
9178 99061 -131104 -77372 -24765 12632 132801 57056 -49600 -218501 119406 -118254 -72155
9167 -72155 36139 -4097 -167822 -2050 40870 225714 -399402 -280846 23797 -12780 -221814
9156 -221814 106373 -56403 99535 -6610 19259 112521 20250 -183190 136525 -132391 -78432
9145 -78432 -327469 43628 -510957 -98970 -359114 -354478 117 191437 -79016 283344 -171631
9133 -199165 50281 61964 -474398 59409 -92639 -31599 -196278 -430518 -268968 116849 -233895
9121 -17142 -15112 -100582 -10291 32409 -209430 206938 1502 77904 373256 121311 -275250
$$ packed form
9201b88440J19500k9194c2480k2092a7634l27034J17725F8761c08975L6606G9975
9189b07095C6664b7025C0387K76619a63113N0167k7588f8129A5954J03129k0022
9178I9061a31104N3732b4765A2632J20169E7056d9600j68901A19406a18254M6099
9167g2155C6139d097j63725b050D0870J84844c99402J18556B3797a2780k09034
9156b21814A06373e6403I9535f610A9259R3262B0250a83190A36525a32391N3959
9145g8432k49037D3628e10957i8970k60144M636A17J91320g9016B83344a71631
9133a99165E0281J1683d74398E9409i2639c1599j64679k34240J61550A16849b33895
9121a7142K030q5470a0291C2409b09430B06938A502P6402K95352A21311b75250
$$ plain form
9109 84045 103771 -280309 45616 14534 46436 -72372 -31979 -301951 113598 65439 -147790
9097 -250551 -164186 -93717 -234208 43273 -64374 213765 -307660 -341766 246600 -249795 204137
9085 -218464 8341 193332 176190 -233946 -222117 160379 -218530 -159592 24293 -364124 132835
9073 5101 -19775 156062 46492 168020 78125 18486 293244 -204220 -215427 189713 -427398
9061 123269 -100311 -18 -7248 15945 -164101 -137933 -212528 229916 162810 -143779 -277189
9050 -277189 -83554 -70291 -16372 138797 92580 150129 -411516 89683 136112 237600 101242
9038 -184876 158379 541777 353578 49599 -115410 -220973 -68361 -110916 -65722 -43446 97979
9026 -184705 -278482 212268 -85613 200460 167293 -348453 -208756 -132377 -35266 -199063 -102161
$$ packed form
9109H4045J9726b80309D5616A4534L1902g2372c1979k69972A13598m8159a47790
9097b50551Q6365P0469j40491D3273f4374B13765c07660l4106B46600b49795B04137
9085b18464H341J84991j7142b33946J1829A60379b18530N8938B4293c64124A32835
9073E101a9775A56062D6492J21528G8125A8486K74758b04220j1207A89713d27398
9061A23269a00311a8p230A5945a64101K6168p4595B29916o7106a43779j33410
9050b77189h3554J3263a6372A38797m6217N7549d11516H9683M6429J01488A01242
9038a84876A58379L83398j88199D9599a15410j05563f8361m2555M5194K2276I7979
9026a84705r3777B12268h5613B00460l3167c48453J39697P6379c5266j63797R6902
$$ plain form
9015 -102161 -47562 29043 244982 107056 -186970 -158419 -120161 15026 -5186 -172616 20287
9003 -37959 38916 -282371 -144378 -18074 27245 -203087 314116 -193257 424 511712 74045
8991 -243786 -149012 116588 -197152 -22044 73124 -199282 -99762 6064 -378271 148051 -245528
8979 54910 253743 232917 -221977 -121137 159070 -43716 -213731 -372751 -212826 -275163
8969 -275163 -280449 -47484 -406792 -50239 -24371 -821 -218423 -232630 -72584 -373705 -53078 -64904
8957 -64904 -46980 50812 -300990 -17291 -104886 3960 -22918 -124209 -366288 187331 -42253
8945 -67927 253644 -158561 -12059 79421 -98453 -184871 173525 -306970 -294714 50568 94975
8934 94975 142509 -73014 -129656 101419 -90904 -101269 184585 -39578 163353 616849 858249
$$ packed form
9015a02161d7562B9043K15939A07056a86970K8551L8258A5026e186j67430B0287
9003c7959C8916b82371J37993a8074B7245b03087C14116a93257D24N11288G4045
8991b43786R4774A16588a97152b2044G3124a99282R9520F064c78271A48051b45528
8979E4910J98833k0826b21977J00840A59070d3716j70015j59020J59925o2337
8969b75163n286d7484l59308e0239b4371h21k17602j4207g2584l01121e3078j1826
8957f4904J7924E0812c00990a7291q7595C960b2918j01291k42079A87331d2253
8945f7927B53644a58561a2059G9421i8453q6418A73525c06970J2256E0568M4407
8934I4975M7534g3014n6642A01419i0904j0365A84585c9578A63353M53496K41400
$$ plain form
8923 858249 2558470 8051642 11317755 3770642 1265098 424144 220101 466302 221281
8913 -110620 -198480 1833 48608 293066 478196 195994 -33854 -12363 -99743 -188672 -103273
8902 -103273 37602 -5330 -131177 -443488 -210169 81743 -140903 -151558 -225599 22451 -249992
8890 -235372 -182108 -178857 -137419 -105752 58231 -8354 -146969 45821 304976 66431 126105 148877
8878 148877 25434 -260160 -48948 -149755 141328 -170720 43258 -291398 4428 -19278 -182088
$$ packed form
8923H58249J700221N493172L266113C770642A265098D24144k04043K46201B21281
8913a10620q7860A833M6775K44458J85130A95994c3854a2363q7380q8929Q5399
8902a03273C7602e330j25847l12311b10169H1743a40903j0655p4041B2451b49992
8890b35372N3264L251M1438L1667E8231h354j38615D5821K59155F6431N9674K2772
8878A48877B5434b60160d8948j00807A41328a70720D3258b91398D428a9278j62810
$$ [...]
##END NTUPLES=NMR SPECTRUM
##END=
