##TITLE=AC1587_HBRAH13317_8313784_dZurNqBdZx
##JCAMPDX= 6.0         $$ Bruker NMR JCAMP-DX V2.0
##DATA TYPE= NMR SPECTRUM
##DATA CLASS= NTUPLES
##ORIGIN= BRUKER
##OWNER= Administrator
$$ 1.72 TOPSPIN		Version 2.1
$$ 2013-11-09 16:19:13.926 -0800  Administrator@X
$$ Compression mode = diff/dup
##.OBSERVE FREQUENCY= 400.02188249412
##.OBSERVE NUCLEUS= ^1H
##.ACQUISITION MODE= SIMULTANEOUS (DQD)
##.ACQUISITION SCHEME= undefined
##.AVERAGES= 64
##.DIGITISER RES= 22
##SPECTROMETER/DATA SYSTEM= spect
##.PULSE SEQUENCE= noesygpps1d.comp
##.SOLVENT NAME= COFFEE_meoh
##.SHIFT REFERENCE= INTERNAL, COFFEE_meoh, 1, 14.96092
##AUDIT TRAIL= $$ (NUMBER, WHEN, WHO, WHERE, PROCESS, VERSION, WHAT)
$$ ##TITLE= Audit trail, TOPSPIN		Version 2.1
$$ ##JCAMPDX= 5.01
$$ ##ORIGIN= Bruker BioSpin GmbH
$$ ##OWNER= Administrator
$$ $$ E:\/data/COFFEE/nmr/AC1587_HBRAH13317_8313784_dZurNqBdZx/12/pdata/1/auditp.txt
$$ ##AUDIT TRAIL=  $$ (NUMBER, WHEN, WHO, WHERE, PROCESS, VERSION, WHAT)
(   1,<2013-11-09 16:19:08.705 -0800>,<Administrator>,<X>,<go>,<TOPSPIN 2.1>,
      <created by zg
	started at 2013-11-09 16:07:38.164 -0800,
	POWCHK enabled, PULCHK disabled,
       configuration hash MD5:
       C8 4E 4E 5D D3 5C D8 9E 9F 52 82 E0 59 8A DE 15
       data hash MD5: 64K
       7F EC 3B 02 13 5F 87 DE 9D 91 26 04 EF A3 04 3C>)
(   2,<2013-11-09 16:19:12.200 -0800>,<Administrator>,<X>,<proc1d>,<TOPSPIN 2.1>,
      <Start of raw data processing
       efp LB = 0.3 FT_mod = 6 PKNL = 1 PHC0 = 0 PHC1 = 0 SI = 128K 
       data hash MD5: 128K
       29 82 1C 7D 92 55 EE CF 98 F3 09 8F 1A 4E 3A 9B>)
(   3,<2013-11-09 16:19:13.077 -0800>,<Administrator>,<X>,<proc1d>,<TOPSPIN 2.1>,
      <pk PHC0 = -86.77002 PHC1 = 0 
       data hash MD5: 128K
       A6 1F B8 B4 E3 8C 55 34 90 23 16 C0 12 03 0C B5>)
(   4,<2013-11-09 16:19:13.411 -0800>,<Administrator>,<X>,<proc1d>,<TOPSPIN 2.1>,
      <abs ABSG = 1 
       data hash MD5: 128K
       20 BC 8A 06 49 23 65 5B 0C A0 29 EB D7 E5 38 40>)
(   5,<2013-11-09 16:19:13.522 -0800>,<Administrator>,<X>,<proc1d>,<TOPSPIN 2.1>,
      <abs ABSG = 2 
       data hash MD5: 128K
       E5 1B B3 B7 E8 B8 57 7D 0B 04 6D AC B7 0D 74 DC>)
(   6,<2013-11-09 16:19:13.592 -0800>,<Administrator>,<X>,<proc1d>,<TOPSPIN 2.1>,
      <abs ABSG = 3 
       data hash MD5: 128K
       64 82 09 FD 94 5A 93 CD 38 99 9E E8 8A 86 DA 6E>)
(   7,<2013-11-09 16:19:13.661 -0800>,<Administrator>,<X>,<proc1d>,<TOPSPIN 2.1>,
      <abs ABSG = 4 
       data hash MD5: 128K
       D1 F2 90 3B 03 4A D7 DF 43 DC 39 63 97 31 F4 B1>)
(   8,<2013-11-09 16:19:13.717 -0800>,<Administrator>,<X>,<proc1d>,<TOPSPIN 2.1>,
      <abs ABSG = 5 
       data hash MD5: 128K
       54 1A 73 20 95 9A 2A 05 4C 48 DB C7 35 B0 A0 EB>)
$$ ##END=
$$ 
$$ $$ hash MD5
$$ $$ 54 BD 79 F8 AA B0 9C 0A 39 F1 9F 2E 5B 95 F2 D0
##$RELAX= 
##$RELAX= 
##$RELAX= 
##$RELAX= 
##$RELAX= 
##$RELAX= 
##$RELAX= 
##$RELAX= 
$$ Bruker specific parameters
$$ --------------------------
##$DU= <E:\>
##$EXPNO= 12
$$ [...]
##$TP07= 0
##$TPNAME0= <>
##$TPNAME1= <>
##$TPNAME2= <>
##$TPNAME3= <>
##$TPNAME4= <>
##$TPNAME5= <>
##$TPNAME6= <>
##$TPNAME7= <>
##$TPOAL= (0..7)
0.5 0.5 0.5 0.5 0.5 0.5 0.5 0.5
##$TPOFFS= (0..7)
0 0 0 0 0 0 0 0
##$TUNHIN= 0
##$TUNHOUT= 0
##$TUNXOUT= 0
##$USERA1= <user>
##$USERA2= <user>
##$USERA3= <user>
##$USERA4= <user>
##$USERA5= <user>
##$V9= 5
##$VALIST= <valist>
##$VCLIST= <CCCCCCCCCCCCCCC>
##$VD= 0
##$VDLIST= <DDDDDDDDDDDDDDD>
##$VPLIST= <PPPPPPPPPPPPPPP>
##$VTLIST= <TTTTTTTTTTTTTTT>
##$WBST= 1024
##$WBSW= 4
##$XGAIN= (0..3)
0 0 0 0
##$XL= 0
##$YL= 0
##$YMAX_a= 5924137
##$YMIN_a= -12187216
##$ZGOPTNS= <>
##$ZL1= 120
##$ZL2= 120
##$ZL3= 120
##$ZL4= 120
##$ABSF1= 14.96092
##$ABSF2= -5.597261
##$ABSG= 5
##$ABSL= 3
##$ALPHA= 0
##$AQORDER= 0
##$ASSFAC= 0
##$ASSFACI= 0
##$ASSFACX= 0
##$ASSWID= 0
##$AUNMP= <proc_prof1d_extract.lims>
##$AXLEFT= 0
##$AXNAME= <>
##$AXNUC= <1H>
##$AXRIGHT= 0
##$AXTYPE= 0
##$AXUNIT= <>
##$AZFE= 0.1
##$AZFW= 0.1
##$BCFW= 0
##$BC_mod= 0
##$BYTORDP= 0
##$COROFFS= 0
##$CY= 15
##$DATMOD= 1
##$DC= 0
##$DFILT= <>
##$DTYPP= 0
##$F1P= 0
##$F2P= 0
##$FCOR= 0.5
##$FTSIZE= 131072
##$FT_mod= 6
##$GAMMA= 0
##$GB= 0
##$INTBC= 1
##$INTSCL= 1
##$ISEN= 128
##$LB= 0.3
##$LEV0= 0
##$LPBIN= 0
##$MAXI= 10000
##$MC2= 0
##$MEAN= 0
##$ME_mod= 0
##$MI= 0
##$NCOEF= 0
##$NC_proc= -2
##$NLEV= 6
##$NOISF1= 0
##$NOISF2= 0
##$NSP= 0
##$NTH_PI= 0
##$NZP= 0
##$OFFSET= 14.96092
##$PC= 1
##$PHC0= -86.77002
##$PHC1= 0
##$PH_mod= 1
##$PKNL= yes
##$PPARMOD= 0
##$PPDIAG= 0
##$PPIPTYP= 0
##$PPMPNUM= 2147483647
##$PPRESOL= 1
##$PSCAL= 4
##$PSIGN= 0
##$PYNMP= <proc.py>
##$REVERSE= no
##$SF= 400.020009668105
##$SI= 131072
##$SIGF1= 0
##$SIGF2= 0
##$SINO= 400
##$SIOLD= 131072
##$SPECTYP= <>
##$SREGLST= <1H.CDCl3>
##$SSB= 0
##$STSI= 131072
##$STSR= 0
##$SW_p= 8223.68421052631
##$SYMM= 0
##$S_DEV= 0
##$TDeff= 65536
##$TDoff= 0
##$TI= <>
##$TILT= no
##$TM1= 0
##$TM2= 0
##$TOPLEV= 0
##$USERP1= <user>
##$USERP2= <user>
##$USERP3= <user>
##$USERP4= <user>
##$USERP5= <user>
##$WDW= 1
##$XDIM= 131072
##$YMAX_p= 423308279
##$YMIN_p= -13315
##$CURPLOT= <Network HP LaserJet P1505>
##$CURPRIN= <$Network HP LaserJet P1505>
##$DFORMAT= <normdp>
##$LAYOUT= <+/1D_H.xwp>
##$LFORMAT= <normlp>
##$PFORMAT= <normpl>
##$SURQMSG= 1
$$ End of Bruker specific parameters
$$ ---------------------------------
##NTUPLES= NMR SPECTRUM
##VAR_NAME=  FREQUENCY,     SPECTRUM/REAL,   SPECTRUM/IMAG
##SYMBOL=    X,             R,               I
##VAR_TYPE=  INDEPENDENT,   DEPENDENT,       DEPENDENT
##VAR_FORM=  AFFN,          ASDF,            ASDF
##VAR_DIM=   131072,        131072,          131072
##UNITS=     HZ,            ARBITRARY UNITS, ARBITRARY UNITS
##FACTOR=    0.0627417313425164, 1,          1
##FIRST=     8223.62146879497, 1833,         -59203
##LAST=      0,             2722,            -59262
##MIN=       0,             -13315,          0
##MAX=       8223.62146879497, 423308279,    0
$$ Real data points
##PAGE= N=1
##DATA TABLE= (X++(R..R)), XYDATA
$$ [...]
63930D522496K23233J96900J64953J29360R2506N5401J7331k2523o3430j03374
63920E212853j40613j74302k03605k27106k43662k53400k57387k56633k51889
63911C204256k43948k33455k20466k04797j86909j68167j50202j34131j20097
63902A542084j07312r4799q2488p1321o2018n4131m6698l9575l3527k9181k6356
63891H94678k4417k2848k1499k0483j9918j9653j9424j9194j9004j8504j7143
63880F72591j4953j2527j0097p344m355j904k71J304L403N487O970Q464J0894
63867F57662J3956J6510J8109J9137J9825K0125K0353K0826K1096K0414J8869
63856H66882J7106J5129J2433R256O536M572K630R2k811n521p744r438j0914j2856
$$ plain form
63930 4522496 4745729 4942629 5107582 5236942 5329448 5384849 5402180 5379657 5316227 5212853
63920 5212853 5072240 4897938 4694333 4467227 4223565 3970165 3712778 3456145 3204256
63911 3204256 2960308 2726853 2506387 2301590 2114681 1946514 1796312 1662181 1542084
63902 1542084 1434772 1339973 1257485 1186164 1124146 1070015 1023317 983742 950215 921034 894678
63891 894678 870261 847413 825914 805431 785513 765860 746436 727242 708238 689734 672591
63880 672591 657638 645111 635014 627670 623315 621411 621140 622444 625847 631334 638304 646768 657662
63867 657662 671618 688128 706237 725374 745199 765324 785677 806503 827599 848013 866882
63856 866882 883988 899117 911550 920806 927342 931914 934544 934636 931825 926304 918560 909122 898208 885352
63842H85352j5648j8707k1208k3135k4857k6072k6315k6221k6943k8284k8777
63831F19185k7816k6382k5354k4419k3156k1932k1018j9889j8114j6093j4210
63820C80802j2208j0072q638q445q752q497p662o826o055n136m405m313m539m385
63806B80869l800l215k607j657p09o48j595k533k502j724j201j523k340k874k779
63791B49162k458k577l278l999m104l526k678k008j673j525j304r52p63r94j357
63776B15966j275o64j04o2k88j67M88J252J517J069K77k57l79m89p81p66J3J046
63758B16396J314O18k40n68m28q9L85Q08P97L31j65m72p01o59J18J370K022J578
63740B22415R04J010J656J906J568J293J544K190K947L616L903L590K868K198
$$ plain form
63842 885352 869704 850997 829789 806654 781797 755725 729410 703189 676246 647962 619185
63831 619185 591369 564987 539633 515214 492058 470126 449108 429219 411105 395012 380802
63820 380802 368594 358522 349884 341439 332687 324190 316528 309702 303647 298511 294106 289793 285254 280869
63806 280869 277069 273854 271247 269590 268881 268233 266638 264105 261603 259879 258678 257155 254815 251941 249162
63791 249162 246704 244127 240849 236850 232746 229220 226542 224534 222861 221336 220032 219080 218317 217323 215966
63776 215966 214691 214027 213923 213861 213573 213406 213894 215146 216663 217732 218009 217752 217373 216884 216103 215337 215350 216396
63758 216396 217710 218328 218088 217520 217092 217003 217388 218196 218993 219324 219159 218687 217986 217327 217445 218815 220837 222415
63740 222415 223319 224329 225985 227891 229459 230752 232296 234486 237433 241049 244952 248542 251410 253608
63726B53608J848J825K066K418K672K819L126L673M180M466M672M746M191K816
63712B99126J300M05j1n59j214j440j295j529k406l126k814j660o61m95r37j249
63696B81435r09L5J132K015K652L120L344L152K582J981J737J951K292K258J670
63681C10447R20M87L16l0o01q97o51k72k21k99n1N00R70J324J795K225K043J145
63663C19150K43J9K22N7p06j465j658j567j962l122m516n368n270m301k885j718
63647B85153j420j915k416k277j703j272j093q56m78j34K56R12J609J831J601
63632B77798J561K048K734L370M204N190N535M709L527L400M622O101O806O913
63618C38518P267Q220R371J0272J0985J1891J3180J4658J6044J7308J8711K0563
$$ plain form
63726 253608 255456 257281 259347 261765 264437 267256 270382 274055 278235 282701 287373 292119 296310 299126
63712 299126 300426 300831 300820 300261 299047 297607 296312 294783 292377 289251 286437 284777 284116 283621 282684 281435
63696 281435 280526 280561 281693 283708 286360 289480 292824 295976 298558 300539 302276 304227 306519 308777 310447
63681 310447 311367 311854 312170 312140 311539 310642 309991 309719 309498 309199 309148 309648 310618 311942 313737 315962 318005 319150
63663 319150 319393 319412 319634 319691 318985 317520 315862 314295 312333 309211 304695 299327 294057 289756 286871 285153
63647 285153 283733 281818 279402 277125 275422 274150 273057 272201 271723 271589 271845 272757 274366 276197 277798
63632 277798 279359 281407 284141 287511 291715 296905 302440 307149 310676 314076 318698 324799 331605 338518
63618 338518 345785 354005 363376 373648 384633 396524 409704 424362 440406 457714 476425 496988
63606D96988K2924K5437K7483K8641K9014K8872K7933K5419K1011J5363R492L993
63594G62570p89m296o096o500o279n899n508n468o320q262j1093j4518j7969k0481
63580F43092k1477k1527k1572k1599k0864j9266j7467j5704j3573j1176r257p815
63568D41795n777k693K92J918K403K751L255L678M274N496O981P794P587O885
63554D86639O331O302P039Q537J0387J2300J4595J7701K1380K5014K8520L2353
63542F77098L6538M0090M1384L9001L2515K3016J2625L202m374r628j1921j1220
63530H68326q879o781n727n309n218n920p959j1292j5512k0175k4707k8350l0557
63517F91940l1242l0697k9419k7928k6446k4853k3158k1718k0609j9047j6226
$$ plain form
63606 496988 519912 545349 572832 601473 630487 659359 687292 712711 733722 749085 758577 762570
63594 762570 761781 757485 751389 744889 738610 732711 727203 721735 715415 707153 696060 681542 663573 643092
63580 643092 621615 600088 578516 556917 536053 516787 499320 483616 470043 458867 449610 441795
63568 441795 436018 433325 433617 435535 437938 440689 443944 447622 451896 457392 464373 472167 479754 486639
63554 486639 492970 499272 506311 514848 525235 537535 552130 569831 591211 616225 644745 677098
63542 677098 713636 753726 795110 834111 866626 889642 902267 905469 901095 891467 879546 868326
63530 868326 859447 852666 846939 841630 836412 830492 822533 811241 795729 775554 750847 722497 691940
63517 691940 660698 630001 600582 572654 546208 521355 498197 476479 455870 436823 420597
63506D20597j2679j0045r176r126q460p075o121o225o544n814l980k315j950k632
63492C28455l111k497j043K90P21K31m87o39j05M39L97K2j9M00Q99J390K189L266
63474C30798M047M178L852L262K361J343N97o5j391l430n083n414m773m028l368
63459C22886k602k026k026k202j757o78K51N14L82L30N53R65J347J527J724K420
63443C21608L654M816N569O423P806R155R719R876J0751J2753J5481J8879K3359
63430D59849K8446L2197L2563K8990K2629J5409R113M801K648K258L067M494O165
63417F52629Q416J2138J7586K3563K8428L1715L4031L5494L5208L2379K7235K0582
63405I59404J3110N545j100n871q470r307r164q794q633q802r533j1372j4651
$$ plain form
63506 420597 407918 397873 388697 379571 371111 364036 357915 351690 345146 339332 335352 333037 331087 328455
63492 328455 325344 322847 321804 322094 322815 323046 322559 321920 321815 322254 322651 322673 322654 323054 323953 325343 327532 330798
63474 330798 334845 339023 342875 346137 348498 349841 350438 350373 348982 345552 340469 335055 330282 326254 322886
63459 322886 320284 318258 316232 314030 312273 311595 311846 312360 312742 313072 313625 314590 315937 317464 319188 321608
63443 321608 325262 330078 335647 342070 349876 359031 368750 378626 389377 402130 417611 436490 459849
63430 459849 488295 520492 553055 582045 604674 620083 629196 633997 636645 638903 641970 646464 652629
63417 652629 661045 673183 690769 714332 742760 774475 808506 844000 879208 911587 938822 959404
63405 959404 972514 978059 976959 971088 962618 953311 944147 935353 926720 917918 908385 897013 882362
63392H82362j8949k3456k7700l1442l4029l4607l3101l0501k7940k5891k4221
63381E70525k2601k0665j8238j5567j3136j1079r073o871m691k924j640m50J189
63368D44779L441N834P729R127J0663J2575J4172J4784J4865J5569J7431K0037
63356E91006K2812K5503K8006L0252L2299L4094L5173L4973L3254K9885K4597
63345I21854J7570R964L176k273o463r115r835r182q426q218q439r407j2009j6205
63331H52992k0479k3455k5362k7197k9117l0326l0145k8503k5715k2376j9265
63320E71052j6776j4377j1027o305j206K050J288l819j0899j6381j8272j7415
63308D57913j5982j5192j4767j3980j2601j0915r302p919o671n432m240l179k218
$$ plain form
63392 882362 863413 839957 812257 780815 746786 712179 679078 648577 620637 594746 570525
63381 570525 547924 527259 509021 493454 480318 469239 460166 453295 448604 445680 444040 443590 444779
63368 444779 448220 454054 461783 470910 481573 494148 508320 523104 537969 553538 570969 591006
63356 591006 613818 639321 667327 697579 729878 763972 799145 834118 867372 897257 921854
63345 921854 939424 949388 952564 950291 943828 934713 924878 915696 907270 899052 890613 881206 869197 852992
63331 852992 832513 809058 783696 756499 727382 697056 666911 638408 612693 590317 571052
63320 571052 554276 539899 528872 522567 521361 523411 524699 520880 509981 493600 475328 457913
63308 457913 441931 426739 411972 397992 385391 374476 365174 357255 350584 345152 340912 337733 335515
63295C35515j439j253j871k628k487j448p95j507k927l582k969j905j300j175
63281C08229j018o30k85k28l23k87j10m9j96l11j88K7J51L31P21J056J009Q30
63263C08729J090J760K188K084J929K126K370K256K088K441L195L649L560L554
63249C43019M243N412O374O882P287P878Q499Q961R450J0192J1070J1932J3042
63236D54241J4650J6358J7555J8471J9918K1870K3188K3264K3018K3571K4632
63225F80736K4991K4164K2762K1541K0880K0906K1400K1759K1712K1805K2528
63214I25184K3336K3251K2017J9876J6590J1834O278J115l506q439j3933j9090
63202A004513k3111k6020k7962k8759k8532k7805k6654k4606k1633j8322j4835
$$ plain form
63295 335515 334076 332823 330952 328324 325837 324389 323594 322087 319160 315578 312609 310704 309404 308229
63281 308229 307211 306581 306296 306068 305745 305458 305348 305299 305103 304792 304604 304631 304782 305113 305834 306890 307899 308729
63263 308729 309819 311579 313767 315851 317780 319906 322276 324532 326620 329061 332256 335905 339465 343019
63249 343019 347262 352674 359048 365930 373217 381095 389594 398555 408005 418197 429267 441199 454241
63236 454241 468891 485249 502804 521275 541193 563063 586251 609515 632533 656104 680736
63225 680736 705727 729891 752653 774194 795074 815980 837380 859139 880851 902656 925184
63214 925184 948520 971771 993788 1013664 1030254 1042088 1048366 1049481 1045975 1037536 1023603 1004513
63202 1004513 981402 955382 927420 898661 870129 842324 815670 791064 769431 751109 736274
63191G36274j0669n937j807J011L370O547J0654J4837J8469K1414K3597K5022
63179H42782K5982K6759K7328K7623K7741K7603K6944K5844K4750K3686K2086
63168A129128J9805J7563J5863J4075J1184P009K073l327r255j5642k2162k8380
63156A137934l3806l8011m0992m3022m3975m3395m1488l9243l7140l4453l0589
63145G11820k6432k3494k2014k0790j8739j5943j3159j0906r159p585o068m979
63133E32552m728m946m658l539k422k147k418k299j434j85J062K129K863L319
63119E13149L882M790N661N985N773N337M777M152L823L998M169L626K449J402
63105E72973R50Q81Q67Q65R18R48Q73O87L72j04p18j339j636j117L24J806J975
$$ plain form
63191 736274 725605 719668 717861 718872 722242 728789 739443 754280 772749 794163 817760 842782
63179 842782 868764 895523 922851 950474 978215 1005818 1032762 1058606 1083356 1107042 1129128
63168 1129128 1148933 1166496 1182359 1196434 1207618 1214627 1216700 1213373 1204118 1188476 1166314 1137934
63156 1137934 1104128 1066117 1025125 982103 938128 894733 853245 814002 776862 742409 711820
63145 711820 685388 661894 639880 619090 600351 584408 571249 560343 551184 543599 537531 532552
63133 532552 527824 522878 518220 514681 512259 510112 507694 505395 503961 503776 504838 506967 509830 513149
63119 513149 517031 521821 527482 533467 539240 544577 549354 553506 557329 561327 565496 569122 571571 572973
63105 572973 573923 574804 575671 576536 577454 578402 579275 579962 580334 580230 579512 578173 576537 575420 575744 577550 579525
63088E79525M51j608k681k323j204j80K84K34K14Q32K009K993L420L837M803N992
63072E96598O716O904P018P384Q135R396J0935J2044J2401J2682J3681J5251J6833
63059G35978J8611K1145K4210K6991K9419L2339L6117M0043M3370M6280M9317
63048A103820N2418N4993N6684N7717N8539N9273N9530N8818N7205N5453N4311
63037A728761N3880N3871N4143N4627N4929N4555N3357N1305M7959M2620L5033
63026B285040K5458J4207J559j1840k5023l7239m8090n7198o4159o8922p1695
63015A942098p2360p0483o6134o0341n4242m8039m1099l3125k4749j6783r232
63004A445511j412O943J5213K2608K8914L4187L8274M1213M3711M6384M8678M9489
$$ plain form
63088 579525 579976 578368 575687 573364 572160 571980 572264 572498 572712 573544 575553 578546 581966 585803 590606 596598
63072 596598 603314 610218 617236 624620 632755 642151 653086 665130 677531 690213 703894 719145 735978
63059 735978 754589 775734 799944 826935 856354 888693 924810 964853 1008223 1054503 1103820
63048 1103820 1156238 1211231 1267915 1325632 1384171 1443444 1502974 1561792 1618997 1674450 1728761
63037 1728761 1782641 1836512 1890655 1945282 2000211 2054766 2108123 2159428 2207387 2250007 2285040
63026 2285040 2310498 2324705 2326264 2314424 2289401 2252162 2204072 2146874 2082715 2013793 1942098
63015 1942098 1869738 1799255 1733121 1672780 1618538 1570499 1529400 1496275 1471526 1454743 1445511
63004 1445511 1444099 1451042 1466255 1488863 1517777 1551964 1590238 1631451 1675162 1721546 1770224 1819713
62992A819713M8844M8018M7780M7570M6657M5173M3361M0827L7226L2906K7998
62981B286073K1594J2802K149r046k0273l1812m3458n4245o3494p1179p7265q1404
62969A870442q3390q3342q1444p7993p3632o8994o4105n8761n3305m8474m4464
62958A132538m0767l7052l3655l1055k9227k7673k5938k4051k2603k2170k2449
62947H15898k2307k1018j9143j7848j7538j7626j7303j6186j4442j2669j1396
62936F28422j0503r442q198p374p001o129m251k332j582j801j932j669j461j356
62922E63391r97n20m01n91p98j345k623l878l855k692j912k346l215l551l428
62907E31239l388l666m355n463o391o215m969l856l739m098l922l002j780o62
$$ plain form
62992 1819713 1868557 1916575 1964355 2011925 2058582 2103755 2147116 2187943 2225169 2258075 2286073
62981 2286073 2307667 2320469 2322618 2313572 2293299 2261487 2218029 2163784 2100290 2029111 1951846 1870442
62969 1870442 1787052 1703710 1622266 1544273 1470641 1401647 1337542 1278781 1225476 1177002 1132538
62958 1132538 1091771 1054719 1021064 990009 960782 933109 907171 883120 860517 838347 815898
62947 815898 793591 772573 753430 735582 718044 700418 683115 666929 652487 639818 628422
62936 628422 617919 608477 600279 592905 585904 579775 575524 573192 571610 569809 567877 566208 564747 563391
62922 563391 562394 561874 561473 560882 560084 558739 556116 552238 548383 545691 543779 541433 538218 534667 531239
62907 531239 527851 524185 519830 514367 507976 501761 496792 492936 489197 485099 481177 478175 476395 475733
62893D75733J20L44P9k24k57j54j57l14n88q07n30M11J234Q85m47j379j106k67
62875D72576K85O43J134J349P54k95r73j106j157j348j513j668k078k706l031
62860D60866k572j361L4Q66P02j43q43q48l25K05M94O30P64R42J078J006O46J69
62842D62310k20n96j132j672j909j901k051k459k734k535j961j300p08k81j43
62827D40708l12o88j132j346q71L55J612K102J997K204L052L865L954L419K828
62812D61747K589K916L833M961N687N825N698N527N277N225O016P683R175R423
62798E41582Q621P997Q471R886J1411J2362J2728J3070J3999J5716J8111K1070
62786F95024K4430K7843L1147L4754L9197M4298M9416N4492O0159O6586P2916
$$ plain form
62893 475733 475853 476197 476276 476052 475795 475641 475484 475170 474582 473775 473245 473656 474890 475775 475328 473949 472843 472576
62875 472576 472861 473504 474638 475987 476741 476446 475473 474367 473210 471862 470349 468681 466603 463897 460866
62860 460866 458294 456933 456967 457833 458535 458392 457549 456701 456376 456581 457075 457705 458469 459411 460489 461495 462141 462310
62842 462310 462090 461494 460362 458690 456781 454880 452829 450370 447636 445101 443140 441840 441132 440851 440708
62827 440708 440396 439708 438576 437230 436359 436714 438326 440428 442425 444629 447681 451546 455500 458919 461747
62812 461747 464336 467252 471085 476046 481733 487558 493256 498783 504060 509285 515301 522984 532159 541582
62798 541582 550203 558200 566671 576557 587968 600330 613058 626128 640127 655843 673954 695024
62786 695024 719454 747297 778444 813198 852395 896693 946109 1000601 1060760 1127346 1200262
62775A200262P8291Q2823Q7037R0647R2565R1921Q8662Q3110P5390O5476N3540
62764B089724L9988K5145R250p112k2794l6820m9194o0465p0394p7829q2185q4291
62752A673023q5197q4896q3021q0137p7194p4092o9906o4463n8697n3403m8570
62741H93447m4053l9916l6015l2046k8216k5079k2599k0134j7418j4841j2681
62730F00449j0884r607r061q741p744o051m460l143j397Q70K605L227L638M881
62716E54582O645P940Q570R211J0503J2716J5831J9378K2593K5229K7808L0828
62704G51834L4233L7877M1869M6219N0865N6236O2813O9876P5840Q0332Q4773
62693A392767R0139R5323R8663R9967R9744R7392R1694Q2621P1130N7434M0986
$$ plain form
62775 1200262 1278553 1361376 1448413 1539060 1631625 1723546 1812208 1895318 1970708 2036184 2089724
62764 2089724 2129712 2154857 2164107 2156995 2134201 2097381 2048187 1987722 1917328 1839499 1757314 1673023
62752 1673023 1587826 1502930 1419909 1339772 1262578 1188486 1118580 1054117 995420 942017 893447
62741 893447 849394 809478 773463 741417 713201 688122 665523 645389 627971 613130 600449
62730 600449 589565 579958 570897 562156 554412 548361 543901 540758 539361 540231 542836 546063 549701 554582
62716 554582 561227 569167 577737 586948 597451 610167 625998 645376 667969 693198 721006 751834
62704 751834 786067 823944 865813 912032 962897 1019133 1081946 1151822 1227662 1307994 1392767
62693 1392767 1482906 1578229 1676892 1776859 1876603 1973995 2065689 2148310 2219440 2276874 2317860
62682B317860K2167K668j6107l3918n0647o5411p7294q6300r3056r7876j00549
62671A721537j00780r8592r4497q9380q4027p8643p2949o6807o0578n4847m9914
62660H70523m5586m1505l7552l3909l0637k7482k4291k1421j9299j7760j6260
62649E54821j4687j3413j2614j2038j1433j0662r524q052o890o569o493n554l819
62636D33073k490k073j681o08M79O07j42j070j909k677l094k895k314j738j213
62621D10255o94k59K12R70J762K016J891K240L195L855L845L993M797N463N365
62606D48906N337O306P689Q506R201J0908J3439J5579J7066J8789K1190K3796
62594F06712K6402K9465L3066L6526L9312M1532M3335M4440M4448M3159M0481
$$ plain form
62682 2317860 2340027 2342695 2326588 2292670 2242023 2176612 2099318 2013018 1919962 1822086 1721537
62671 1721537 1620757 1522165 1427668 1338288 1254261 1175618 1102669 1035862 975284 920437 870523
62660 870523 824937 783432 745880 711971 681334 653852 629561 608140 588841 571081 554821
62649 554821 540134 526721 514107 502069 490636 479974 470450 462398 455508 448939 442446 436892 433073
62636 433073 430583 428510 426829 426221 426700 427307 427165 426095 424186 421509 418415 415520 413206 411468 410255
62621 410255 409561 409302 409514 410484 412246 414262 416153 418393 421588 425443 429288 433281 438078 443541 448906
62606 448906 454243 460549 468238 476744 485945 496853 510292 525871 542937 561726 582916 606712
62594 606712 633114 662579 695645 732171 771483 813015 856350 900790 945238 988397 1028878
62583A028878L6413L1039K4307J6115O861k448j1009j8640k5152l0028l3235l5600
62571I87501l7722l9209l9640l9432l8968l7758l5486l3015l1149k9223k6187
62560E99712k2483j9352j6945j4573j2354j0941r953q371o454n500n644n518m405
62547D57219l087k177j186M4M74o35k351l068k242n55J017J763J530R51R43J669
62531D50309K462K899L291L996M919N921P063Q293R525J1086J3352J5943J8081
62518E57140J9819K2064K5241K8850L2557L6694M1269M5511M8908N1899N4958
62507I64910N7598N8836N8115N5393N0877M5033L8291L0496K1218J0908J005p528
62495A385152j5064k2273k8794l3559l5953l6105l4420l1334k7307k2656j7481
$$ plain form
62583 1028878 1065291 1096330 1120637 1136752 1143613 1141165 1130156 1111516 1086364 1056336 1023101 987501
62571 987501 949779 910570 870930 831498 792530 754772 719286 686271 655122 625899 599712
62560 599712 577229 557877 540932 526359 514005 503064 493111 484740 478286 472786 467142 461624 457219
62547 457219 454132 451955 450769 450813 451287 450652 448301 445233 442991 442436 443453 445216 446746 447697 448640 450309
62531 450309 452771 455670 458961 462957 467876 473797 480860 489153 498678 509764 523116 539059 557140
62518 557140 576959 599023 624264 653114 685671 722365 763634 809145 858053 909952 964910
62507 964910 1022508 1081344 1139459 1194852 1245729 1290762 1329053 1359549 1380767 1391675 1392680 1385152
62495 1385152 1370088 1347815 1319021 1285462 1249509 1213404 1178984 1147650 1120343 1097687 1080206
62484A080206j1929o197k70O001J2319J7954K2506K6294K9741L2636L4155L3306
62472A276722K9411K2705J4648P114Q83m902j1655k0020k9438l8546m5858n0590
62460A150474n3080n4189n4361n3512n1639m8968m5500m1071l5904l0668k5913
62449F55669k1826j8450j5659j2949r873o597l665j258P18K188L112L968N191
62436E80569O379O893P000P404P754O852M467J710o73l166o143q858j0498j1421
62422E88269j2460j3673j4457j4501j3922j2843j1389r927q854q272q035p825
62410D52111p254o254n336n036n120m921m343l858l538k988k246j838j760j364
62396C96255n01J47K79N70J558K718L229K997K456J902J474J270J205J230J739
$$ plain form
62484 1080206 1068277 1062080 1061810 1067811 1080130 1098084 1120590 1146884 1176625 1209261 1243416 1276722
62472 1276722 1306133 1328838 1343486 1350600 1351483 1346581 1334926 1314906 1285468 1246922 1201064 1150474
62460 1150474 1097394 1043205 988844 935332 883693 834725 789225 748154 712250 681582 655669
62449 655669 633843 615393 599734 586785 576912 570315 566650 565392 566110 568298 571410 575378 580569
62436 580569 586948 593841 600841 608245 615999 622851 627318 629028 628355 625189 619046 610188 599690 588269
62422 588269 575809 562136 547679 533178 519256 506413 495024 485097 476243 467971 459936 452111
62410 452111 444857 438603 433267 428231 423111 418190 413847 409989 406451 403463 401217 399379 397619 396255
62396 396255 395754 395901 396180 396750 398308 401026 404255 407252 409708 411610 413084 414354 415559 416789 418528
62381D18528L087M653N375N320N615O596P268P089O923P532Q310Q523Q694R600
62367E13113J0802J1434J1715J2483J3731J4845J5925J7696K0307K3277K6507
62356F91835L0414L5066L9953M4531M8344N0881N1993N2132N1390M8663M2805
62345A188007L4484K5855J8269J1278M119k864q814j3670j8146k2660k6857l0100
62333A158901l2074l2832l2548l1411k9674k7619k5330k2714j9876j7266j5241
62322H72316j3694j2518j2164j3157j5163j7251j9043k0855k2632k3613k3437
62311F78789k2740k2156k1384j9818j7570j5265j3263j1613j0372r466q506p227
62299D99409n846m629l440k150j100o98p78q10n34o2M89J129J850K499K718K206
$$ plain form
62381 418528 421615 426268 431643 436963 442578 449174 456442 463531 470454 477986 486296 494819 503513 513113
62367 513113 523915 535349 547064 559547 573278 588123 604048 621744 642051 665328 691835
62356 691835 722249 757315 797268 841799 890143 941024 993017 1045149 1096539 1145202 1188007
62345 1188007 1222491 1248346 1266615 1277893 1282012 1279148 1270334 1256664 1238518 1215858 1189001 1158901
62333 1158901 1126827 1093995 1061447 1030036 1000362 972743 947413 924699 904823 887557 872316
62322 872316 858622 846104 833940 820783 805620 788369 769326 748471 725839 702226 678789
62311 678789 656049 633893 612509 592691 575121 559856 546593 534980 524608 515142 506636 499409
62299 499409 493563 488934 485494 483344 482244 481546 480768 479958 479424 479362 479851 480980 482830 485329 488047 490253
62283D90253J279R04J616K654K923K614K787L431L300K000R29J383K848M035M628
62268E27584N121N765O676Q290J0726J3212J5082J6780J9047K1707K4267K7199
62256G01456L1406L6744M2106M6900N1399N5713N9264O1352O1542N9505N5162
62245A262549M9015M1880L4290K6544J9027J1990N160k014r880j8587k7960l6969
62233A355045m3975m8208n0482n1862n2287n1301m9404m7490m5396m2251l8128
62222H34261l4202l1224k8867k6646k4492k2298j9748j6972j4667j3227j2322
62211E89596j1468j0627r954r382q655p537n999m324k945j998j237n23k1K70P09
62196E15905J454K254L062M187N433N948N571N444O434P788Q440Q775R775J1032
$$ plain form
62283 490253 491532 492436 494052 496706 499629 502243 505030 508461 511761 513761 514690 516073 518921 522956 527584
62268 527584 532705 538470 545146 553436 564162 577374 592456 609236 628283 649990 674257 701456
62256 701456 732862 769606 811712 858612 910011 965724 1024988 1086340 1147882 1207387 1262549
62245 1262549 1311564 1353444 1387734 1414278 1433305 1445295 1450455 1448441 1438561 1419974 1392014 1355045
62233 1355045 1311070 1262862 1212380 1160518 1108231 1056930 1007526 960036 914640 872389 834261
62222 834261 800059 768835 739968 713322 688830 666532 646784 629812 615145 601918 589596
62211 589596 578128 567501 557547 548165 539510 531973 525974 521650 518705 516707 515470 514947 514926 515196 515905
62196 515905 517359 519613 522675 526862 532295 538243 543814 549258 555692 563480 571920 580695 590470 601502
62182F01502J1265J0524J0152J0544J0497R193P354N904M704L352K252K080K882
62169F92205M338O432R329J3005J7349K2223K7063L0992L3716L5907L8184M0009
62157I70752L9986L7214L2118K6028K0087J4610R344M210n80n057r624j4387j8850
62144A105851k2667k6113k9315l1522l1876l0523k8227k5296k1711j7985j4871
62133H25745j2283r429o118l199j574j368k046k763k783k193k023k923l945l467
62119G69631j264J310L168M559O096P669Q607Q361O696L866P29j788l416m357
62105H09867m513l691k456j987k905m820o960q590r011q012o417n311m710l784
62091G36700k321r98j27P58J826K516K556K544L045L925M926O130P466Q515R258
$$ plain form
62182 601502 612767 623291 633443 643987 654484 663677 671031 676935 681639 684991 687243 689323 692205
62169 692205 696543 702975 712304 725309 742658 764881 791944 822936 856652 892559 930743 970752
62157 970752 1010738 1047952 1080070 1106098 1126185 1140795 1150139 1154349 1153769 1148712 1139088 1124701 1105851
62144 1105851 1083184 1057071 1027756 996234 964358 933835 905608 880312 858601 840616 825745
62133 825745 813462 804033 797915 794716 793142 791774 789728 786965 784182 781989 779966 777043 773098 769631
62119 769631 768367 769677 772845 777404 783500 791169 799776 808137 814833 818699 819428 817640 814224 809867
62105 809867 805354 801663 799207 797220 794315 789495 782535 773945 764934 756922 750505 745194 740484 736700
62091 736700 734379 733381 733254 734012 735838 738354 740910 743454 746499 750424 755350 761480 768946 777461 786719
62076G86719J0306J1981J3792J5214J6304J7148J7425J6975J6260J5725J5289
62065I53138J4870J4854J5658J7233J9311K1649K3761K4959K4979K4012K1961
62054A176385J8406J3599Q738M742J333k213o052r959j3939j8091k2263k6318
62042A124368l0355l4255l7416l9325l9977l9575l8237l6314l4313l2276k9735
62031G32590k6684k3821k1526j9298j6715j4192j2239j0667r171q040p511p060
62019E55666o189n459n708o604o981o499o000o102o326n948n136m715n057n560
62005D73382n292m044k525j431n44P93K441L412L216K597K449K646K509J947J435
61990D82991J050K66j256l136m653n387n498n557o005o646o852o335n481m752
$$ plain form
62076 786719 797025 809006 822798 838012 854316 871464 888889 905864 922124 937849 953138
62065 953138 968008 982862 998520 1015753 1035064 1056713 1080474 1105433 1130412 1154424 1176385
62054 1176385 1194791 1208390 1217128 1221870 1223203 1220990 1214938 1204979 1191040 1172949 1150686 1124368
62042 1124368 1094013 1059758 1022342 983017 943040 903465 865228 828914 794601 762325 732590
62031 732590 705906 682085 660559 641261 624546 610354 598115 587448 578277 570237 562726 555666
62019 555666 549477 544018 538310 531706 524725 518226 512226 506124 499798 493850 488714 483999 478942 473382
62005 473382 468090 464046 461521 460090 459546 460339 462780 466192 469408 472005 474454 477100 479609 481556 482991
61990 482991 484041 484307 483051 479915 475262 469875 464377 458820 452815 446169 439317 432982 427501 422749
61976D22749m177l609l107k692k125j307o53n73q24q35n56n26j057j768j982j445
61960C95513n92j97o84j718k520k559j895q97M1N66N68L46L30N83R93J778L214
61943C92870M822N603N425N459O711Q682J0095J0490J0432J0442J0490J0469J0482
61930E02472J0532J0366R809Q965Q039P123O240N350M267K764Q43j128k625l363
61916E69654l553l743m253m792m693l538j452J053L429N351O896Q352R752J0717
61902E89180J0950J0601R871Q577O553M223K189M61j315l036m224m860n450o158
61888F17562o544o319n765n257m894m692m683m712m641m747n376o266o839p114
61874E39713p627q387q729q273p280o009m538l308k885k994k734j987j529j468
$$ plain form
61976 422749 418572 414963 411856 409164 407039 405732 405079 404506 403682 402847 402291 401765 400708 398940 396958 395513
61960 395513 394921 394724 394040 392322 389802 387243 385348 384451 384492 385058 385626 385972 386302 386885 387878 389656 392870
61943 392870 397692 403295 408720 414179 420890 429572 439667 450157 460589 471031 481521 491990 502472
61930 502472 513004 523370 533179 542144 550183 557306 563546 568896 573163 575927 576770 575642 573017 569654
61916 569654 566101 562358 558105 553313 548620 545082 543630 544683 548112 553463 560359 568711 578463 589180
61902 589180 600130 610731 620602 629179 635732 639955 642144 642605 641290 638254 634030 629170 623720 617562
61888 617562 611018 604699 598934 593677 588783 584091 579408 574696 570055 565308 559932 553666 546827 539713
61874 539713 532086 523699 514970 506697 499417 493408 488870 485562 482677 479683 476949 474962 473433 471965
61860D71965q00Q96K530L149L441M646O771Q931J0844J2869J4979J6688J7759
61847E74668J8257J8174J7746J7677J8250J8589J7595J5338J2725J0084O989L321
61835G49413l96l693o399q189q659q046p160o397n305l349p12J940M168O004P612
61820G10832Q899R563R456Q743P445N106J366l217p482j0866j3676j6085j7623
61807F92461j7959j7469j6642j5574j4421j3570j2917j1675r584p652o962p272
61795E40764p478o925n650l886k184j455k016k923l127k849k934l263k977k107
61781D90990j804k677l905m274l481k065p19J07L32K28J24M4j61m40o49q30j048
61764D69772j125r50p98q91q93l07P18J564J984K280K742L295L674L534K594J057
$$ plain form
61860 471965 471165 472061 474591 477740 481181 485827 492598 501529 512373 525242 540221 556909 574668
61847 574668 592925 611099 628845 646522 664772 683361 700956 716294 729019 739103 746092 749413
61835 749413 749017 745324 738925 730736 722077 714031 706871 700474 695169 691820 691108 693048 697216 703220 710832
61820 710832 719731 729294 738750 747493 754938 760044 761410 758193 750711 739845 726169 710084 692461
61807 692461 674502 657033 640391 624817 610396 596826 583909 572234 562650 554998 548036 540764
61795 540764 533286 526361 520711 516825 514641 513186 511170 508247 505120 502271 499337 496074 493097 490990
61781 490990 489186 486509 482604 478330 474849 472784 472065 472172 472504 472732 472856 472900 472739 472299 471650 470820 469772
61764 469772 468647 467697 466899 466008 465115 464808 465526 467090 469074 471354 474096 477391 481065 484599 487193 488250
61748D88250k94q71r93j417k298l072l251k872k286j879j902k197k272j901j427
61733D59318j188r64l78M56J076J236R73N21M67J386K889L575K633R68R8L77J099
61716D74542J773K353K557K108J495J544K202K587K222J424M88n90j603k181k472
61701D88449k990l683l937l606l244l155l005k582k200k044j895j800k331l640
61687D48337m860n033m282l568l498l775l787l339k811k705l109l594l680l267
61673C97029k582j916j494j390j384j168q53q42j068r13k64M0n31j193r19o6K06
61656C80692j42R7J468K966L411K801J822Q38o9n73k88O90J830K655K992K930
61640D04120K697K419J935J049po45n96k68k90q56j600k025k007j838j839j999
$$ plain form
61748 488250 487956 487085 486092 484675 482377 479305 476054 473182 470896 469017 467115 464918 462646 460745 459318
61733 459318 458130 457166 456788 457244 458320 459556 460529 461050 461517 462903 465792 469367 472000 472968 473066 473443 474542
61716 474542 476315 478668 481225 483333 484828 486372 488574 491161 493383 494807 495295 494705 493102 490921 488449
61701 488449 485459 481776 477839 474233 470989 467834 464829 462247 460047 458003 456108 454308 451977 448337
61687 448337 443477 438444 434162 430594 427096 423321 419534 416195 413384 410679 407570 403976 400296 397029
61673 397029 394447 392531 391037 389647 388263 387095 386242 385400 384332 383419 383155 383195 382664 381471 380552 380486 380692
61656 380692 380550 380647 382115 385081 388492 391293 393115 393953 393884 393311 393023 393713 395543 398198 401190 404120
61640 404120 406817 409236 411171 412220 412213 411568 410972 410704 410414 409558 407958 405933 403926 402088 400249 398250
61624C98250k161k353k619k679k249j696j737k326k598k118j472j259j293j262
61610C70428j419j970k542k943l674m922n771n356m162l205k596j964j664k222
61596C26018l030l000k265j938k278k515k395k489k826k604j595o82n46r36j508
61581B95411k305k978k684j352j29M5m56p56o90n86m87j95K82O92P87M67L6J67
61563B85269J083J914J727R35P68J320J424O37R6P64J997K550K174J380M59m19
61547C04078p12l7J044J535J119L16k44l18k1L03L71K85M14Q34J204J263J067
61530C12501P12K40j28j96k19n89j101j153p26m66o97j120j556k120k467j831
61514B99084k33J148J402R37O53P10P02M21q7q10j526j672j003m4M19Q9p58j481
$$ plain form
61624 398250 396089 393736 391117 388438 386189 384493 382756 380430 377832 375714 374242 372983 371690 370428
61610 370428 369009 367039 364497 361554 357880 352958 347187 341831 337669 334464 331868 329904 328240 326018
61596 326018 322988 319988 317723 315785 313507 310992 308597 306108 303282 300678 299083 298401 297855 296919 295411
61581 295411 293106 290128 287444 286092 285963 286008 285552 284796 284106 283520 283033 282838 283120 283812 284599 285066 285102 285269
61563 285269 286352 288266 289993 290928 291696 293016 294440 295077 295173 295937 297934 300484 302658 304038 304497 304078
61547 304078 303366 303329 304373 305908 307027 307343 307099 306781 306760 307063 307434 307719 308133 308967 310171 311434 312501
61530 312501 313213 313453 313325 313129 312910 312321 311220 310067 309341 308875 308178 307058 305502 303382 300915 299084
61514 299084 298851 299999 301401 302338 302991 303701 304403 304824 304737 303927 302401 300729 299726 299682 300101 300190 299432 297951
61496B97951j305K9J617K082J211J83j29k18p79j344r74K41J240J314P19J13%
61479C01951N76J662K755L393L416K838J862J068J055J641J893J277K76l90o54
61464C24619p82p48l97R1L87L51r5j042k185k691k020n27R73J962K294J961J243
61447C23394P15O99R04R54R69J190J384J092L87JN63J847K868K798J887J260J596
61430C44508K311K433J943J520J329R29L48J93N29N84l9o64n50J31P40J002R65
61413C58212P24N11N53N33j17j104j310l88M77R7j165k077k250k227k327k230
61397C45912j691r47l02J98O08Q63P45J26p09j089o30J93N89M84M45O31N52Km71
61378C45509l15M28J454K548L303L243K521J954K055K533K879K859K334J316L77
$$ plain form
61496 297951 296646 296675 298292 300374 301585 301768 301639 301421 300642 299298 298324 298565 299805 301119 301838 301951 301951
61479 301951 302527 304189 306944 310337 313753 316591 318453 319521 320576 322217 324110 325387 325663 325273 324619
61464 324619 323837 323089 322692 322783 323170 323521 323426 322384 320199 317508 315488 314961 315934 317896 320190 322151 323394
61447 323394 324109 324808 325712 326666 327635 328825 330209 331301 331688 331689 332252 334099 336967 339765 341652 342912 344508
61430 344508 346819 349252 351195 352715 354044 354973 355321 355514 356043 356627 356588 355924 355374 355505 356245 357247 358212
61413 358212 358936 359447 360000 360533 360416 359312 358002 357614 358091 358188 357023 354946 352696 350469 348142 345912
61397 345912 344221 343274 342972 343170 343778 344641 345386 345512 344803 343714 343084 343277 343866 344350 344795 345426 345978 345980 345509
61378 345509 345194 345622 347076 349624 352927 356170 358691 360645 362700 365233 368112 370971 373305 374621 374998
61363C74998K31P56J114J015R49J125J228J404K333L799M483L832L050L431M682
61348D08430N696O103O074N488M269L048K508K539K729L161M039N018N608N745
61334D70455N437M477L073K068J851J771J227N51J74k52j041j617j407q83p32
61319D85152o83j25P28J295J699K356L059L447L923N077O640Q024R350J0938J2247
61304E53127J2556J2343J2819J4152J5221J5035J3504J0964P901N010K676M75
61292F75783k045m380n676o120o781q150r677j0738j1317j1686j2032j2348j2275
61279E62558j1322r584p872o641n365l547j725o63j35N35J293J681J843K149K269
61264E25474J690R10J039K284L836N131O333P634Q814R430Q880O708L508J009
$$ plain form
61363 374998 375229 375985 377099 378114 379063 380188 381416 382820 385153 388952 393435 397267 400317 403748 408430
61348 408430 414126 420229 426303 431791 436060 439108 441616 444155 446884 450045 454084 459102 464710 470455
61334 470455 475892 480369 483442 485510 487361 489132 490359 490910 491084 490832 489791 488174 486767 485884 485152
61319 485152 484469 484344 485072 486367 488066 490422 493481 496928 500851 505928 512568 520592 529942 540880 553127
61304 553127 565683 578026 590845 604997 620218 635253 648757 659721 667622 672632 675308 675783
61292 675783 673738 669358 663682 657562 650781 642631 632954 622216 610899 599213 587181 574833 562558
61279 562558 551236 541652 533780 527139 521774 518227 516502 515839 515704 516239 517532 519213 521056 523205 525474
61264 525474 527164 528074 529113 531397 535233 540364 546697 554331 563145 572575 581455 588163 591671 592680
61250E92680L97R39J127O41K03R2Jn5J43K09l73j236j649j721j994k171j633q64
61232E84736r39j697j779n68J185K736M093N252N972O493P380Q474R009Q826Q519
61217F47692Q351Q178Q348R413J0795J1069R842Q161O899N936N179N000N144M582
61203G54589L062J790J800K663L415L956M844O318Q198J0176J1839J2875J3504
61190H39029J4096J4284J3206J0809Q014N424K809J83j659k262k373l062m568
61177H93930o450q216r420r742r446r225r355r522r643j0045j0649j0825j0408
61164G70984j0090j0350j0779j0974j1253j1948j2577j2487j1794j1101j0574
61153F47057r904q864p509n971m386k812j198L42J155N32j341l396m833n713o319
$$ plain form
61250 592680 593077 594016 595143 595784 595987 596079 596080 596025 596168 596377 596004 594768 593119 591398 589404 587233 585600 584736
61232 584736 583797 582100 580321 579753 580938 583674 587767 593019 598991 605484 612864 621338 630347 639173 647692
61217 647692 656043 664221 672569 681982 692777 703846 713688 721849 728748 734684 739863 744863 750007 754589
61203 754589 757651 759441 761241 763904 767319 771275 776119 782437 790635 800811 812650 825525 839029
61190 839029 853125 867409 880615 891424 899438 904862 907671 907854 906195 903933 901560 898498 893930
61177 893930 887480 879264 869844 860102 850656 841431 832076 822554 812911 802866 792217 781392 770984
61164 770984 760894 750544 739765 728791 717538 705590 693013 680526 668732 657631 647057
61153 647057 637153 628289 620780 614809 610423 607611 606413 606755 607910 608442 607101 603705 598872 593159 586840
61138E86840o565o416o213o135n734m520k723j092m9O72J629L060M674O003P031
61123E70462Q286J0153J2377J4441J6219J7872J9463K1006K2584K4082K5144K5751
61111G87840K6301K6774K6517K5500K4890K5413K5884K4569K1525J8274J5585
61100A049072J3007J0308P824N283J766k868p720j2160j6221j9567k1419k1911
61088I85394k2344k3504k4778k5359k5303k4915k4113k2968k2045k1580k1026
61077G27459j9888j8349j6714j4934j3037j1385j0115q904p515o052m547l003
61065E93016j791j238p92M38K210L239L012K528K837L805M774N624O594P708Q834
61050F40798R907J0857J1730J2926J4729J6686J8139J9218K0508K1832K2465K2582
$$ plain form
61138 586840 580275 573859 567646 561511 555777 551257 548534 547442 547393 548065 549694 552754 557428 563431 570462
61123 570462 578748 588901 601278 615719 631938 649810 669273 690279 712863 736945 762089 787840
61111 787840 814141 840915 867432 892932 917822 943235 969119 993688 1015213 1033487 1049072
61100 1049072 1062079 1072387 1080211 1085494 1087260 1084392 1076672 1064512 1048291 1028724 1007305 985394
61088 985394 963050 939546 914768 889409 864106 839191 815078 792110 770065 748485 727459
61077 727459 707571 689222 672508 657574 644537 633152 623037 614133 606618 600566 596019 593016
61065 593016 591225 589987 589195 589633 591843 595082 598094 600622 603459 607264 612038 617662 624256 631964 640798
61050 640798 650705 661562 673292 686218 700947 717633 735772 754990 775498 797330 819795 842377
61038H42377K3402K5563K8244L0226L1108L1276L1434L2320L4218L6579L8611
61027A185358M0141M1361M2164M2387M2316M2216M2013M2251M4418M9177N5305
61016A669107O1774O9774Q0837R3989J06995J19595J33320J49121J67896J92456
61006B844864K25918K68846L21164L85831M66602N63604O76648Q12024R78878
60997G544379J179172J410104J673121J955436K183064K211706J913078J302408
60989B1372468N72028k5956l41050l76145k11234P5019L90704N83445M81562K3448
60979B2544289o63447j336516j799170j997224j988607j858321j669465j461945
60971I769594j260560j075785r08349p58932o30568n23381m33671l59086k99941
$$ plain form
61038 842377 865779 891342 919586 949812 980920 1012196 1043630 1075950 1110168 1146747 1185358
61027 1185358 1225499 1266860 1309024 1351411 1393727 1435943 1477956 1520207 1564625 1613802 1669107
61016 1669107 1730881 1800655 1881492 1975481 2082476 2202071 2335391 2484512 2652408 2844864
61006 2844864 3070782 3339628 3660792 4046623 4513225 5076829 5753477 6565501 7544379
60997 7544379 8723551 10133655 11806776 13762212 15945276 18156982 20070060 21372468
60989 21372468 21944496 21918540 21577490 21201345 20990111 21065130 21455834 22039279 22520841 22544289
60979 22544289 21880842 20544326 18745156 16747932 14759325 12901004 11231539 9769594
60971 9769594 8509034 7433249 6524900 5765968 5135400 4612019 4178348 3819262 3519321
60962C519321k54934k19961j91943j70142j53152j38223j24316j12673j03496
60953B050481r4911q5909p7548p0380o3410n6552n1632m9663m9151m8322m7221
60942A355782m6457m5500m3533m0860l8366l6437l5097l4398l4062l3425l2083
60931I35564l0093k7584k4874k2761k1724k1048j9695j7757j6031j4625j3179
60920G06193j1992j1497j1041r746q207p700p910p249n373l637k863k410j672
60907F14896r42m13J96P16N74l8l03j31q7k9N87J150M11j228j933j256r18k054
60889F09198l527l816l061k267j834j897k882m682o187o598o462o738p554q454
60875E43239r094r192q554p616p180p322p292o752o107n423m193k573j609j621
$$ plain form
60962 3519321 3264387 3044426 2852483 2682341 2529189 2390966 2266650 2153977 2050481
60953 2050481 1955570 1869661 1792113 1721733 1658323 1601771 1550139 1500476 1451325 1403003 1355782
60942 1355782 1309325 1263825 1220292 1179432 1141066 1104629 1069532 1035134 1001072 967647 935564
60931 935564 905471 877887 853013 830252 808528 787480 767785 750028 733997 719372 706193
60920 706193 694201 682704 671663 661917 653710 646010 638100 630851 625478 621841 618978 616568 614896
60907 614896 613954 613541 613737 614453 615027 614989 614686 614555 614468 614439 615026 616176 616587 615359 613426 612170 611252 609198
60889 609198 605671 601855 598794 596527 594693 592796 589914 585232 579045 572447 565985 559247 551693 543239
60875 543239 534145 524953 516399 508783 501603 494281 486989 480237 474130 468707 464514 461941 460332 458711
60861D58711j480k29J597K867L290L182K644J706P44R4k90m06n4O17J066J178
60845D75237J454K047K351J928J121M04k39r66j699k383l041l445l354l128l273
60830D63014l447k812j530p72j004j354j039l32L11R75J576J391J06j416k137
60815D51530k038j746j586j539j638j826j842j613j430j515j773k126k583k985
60801D25290l116l140l330l501l368l339m012n003n260m549l619k881k088j353
60787C76731j227j562j479q39n27r09j268j200j288j710j562m03P00O88J31K57
60771C64533J115J761J780J648J870K534L522M623N575O268O606O144M494K257
60757D14730P74O83J394K113K521K223P04j573l067k908j980j561j668j467p31
$$ plain form
60861 458711 457231 457002 458599 461466 464756 467938 470582 472288 473032 473126 472836 472430 472376 472993 474059 475237
60845 475237 476691 478738 481089 483017 484138 484542 484303 483337 481638 479255 476214 472769 469415 466287 463014
60830 463014 459567 456755 455225 454453 453449 452095 451056 450724 451035 452010 453586 454977 455083 453667 451530
60815 451530 449492 447746 446160 444621 442983 441157 439315 437702 436272 434757 432984 430858 428275 425290
60801 425290 422174 419034 415704 412203 408835 405496 401484 396481 391221 386672 383053 380172 378084 376731
60787 376731 375504 373942 372463 371624 371097 370188 368920 367720 366432 364722 363160 362757 363457 364145 364276 364533
60771 364533 365648 367409 369189 370837 372707 375241 378763 383386 388961 395229 401835 407979 412473 414730
60757 414730 415504 416187 417581 419694 422215 424438 425142 423569 420502 417594 415614 414053 412385 410918 410187
60742D10187l2N9o27j911l246m039m373m913n855o534o404n736m941m014l001
60727C54620k343k231k240k072k010k228k321j969j473j133p99m02l08o47r10
60712C31534o75j66K38M87N63L49O3Q8K21o7m79k7J323K367K447K363K832L268
60694C46729K942K320K217K508K657K776L198L637L699L658L853L892L332K632
60680C90050K539K965L231L032K530J939J613J956K646K700J887J292J625J865
60666D21870O35j729l658m458m669m706m327l467k611k186k167k372k552k368
60652C81235j745j079o59j78P14J743K395K649K723K501J746O25n44j760l047
60637C87319m060m449m327l973l400k609j828j152m02K64K89l30o85j95M99N75
$$ plain form
60742 410187 410155 410214 409587 407676 404430 400391 396018 391105 385250 378716 372312 366576 361635 357621 354620
60727 354620 352277 350046 347806 345734 343724 341496 339175 337206 335733 334600 333801 333399 333091 332444 331534
60712 331534 330859 330693 330931 331418 331981 332330 332393 332481 332702 332635 332156 332129 333452 335819 338266 340629 343461 346729
60694 346729 349671 351991 354208 356716 359373 362149 365347 368984 372683 376341 380194 384086 387418 390050
60680 390050 392589 395554 398785 401817 404347 406286 407899 409855 412501 415201 417088 418380 420005 421870
60666 421870 422505 420776 417118 412660 407991 403285 398958 395491 392880 390694 388527 386155 383603 381235
60652 381235 379490 378411 377752 377574 378288 380031 382426 385075 387798 390299 392045 392670 392126 390366 387319
60637 387319 383259 378810 374483 370510 367110 364501 362673 361521 361119 361383 361672 361342 360657 360462 360961 361536
60621C61536L01M80J098J478J346R54M14l04q54q25l48R4M18Q76J414J603J173
60604C70854K77o39j028o33J13M78L52L24O80J017J073J144J354J287P72K88R1
60587C77804j87o20n94R0O14L74p6n3J76J64K26P02J160J298J775L048M249M441
60569C94591M267N035O758Q384R545J0699J1875J2574J2676J2279J0933Q236M919
60556E12771K126j51k751n628p721q445q100o914m944k916j805j342j91K073M310
60541D70372N518O161P201Q736J0186J1330J2568J4435J7023J9615K0865J9870
60529F23880J7026J3450R663N514J194k522n197p181q845r961j0109r333q160
60516F09419p237o965p162p069o047m229k304p90J74O42R05J536K931M889P036
$$ plain form
60621 361536 361837 362317 363415 364893 366239 367193 367607 367303 366449 365624 365276 365370 365788 366664 368078 369681 370854
60604 370854 371131 370492 369464 368831 368944 369422 369774 370098 370778 371795 372868 374012 375366 376653 377425 377713 377804
60587 377804 377617 376997 376403 376493 377107 377481 377405 377352 377528 377692 377918 378620 379780 381078 382853 385901 390150 394591
60569 394591 398858 403893 410651 419035 428580 439279 451154 463728 476404 488683 499616 507852 512771
60556 512771 514897 514746 511995 506367 498646 490201 482101 475187 470243 467327 465522 464180 463989 466062 470372
60541 470372 475890 482051 489252 497988 508174 519504 532072 546507 563530 583145 604010 623880
60529 623880 640906 654356 664019 669533 670727 668205 663008 655827 646982 637021 626912 617579 609419
60516 609419 602182 595217 588055 580986 574939 570710 568406 567616 567790 568432 569337 570873 573804 578693 585729
60501E85729R407J2268J5607J9235K3142K7308L1390L5066L8445M1648M4234M5488
60489I28967M5088M3099L9653L5057K9839K4187J7616R733R94p749j6138k4200
60477A126146l1711l8242m3543m7411m9433m9383m7594m4660m1057l7286l3841
60466F61985l0660k7215k3540k0399j8101j5968j3652j1952j1425j1128r826p747
60454D60372o041n042m290l733l702l996m110m122m340m439l946l300l208l277
60440D02826k521j077k17n35j250j406r06k19J94N8m39o34j54N11P56P36P83N21
60422C97027m47j454j476o24J44N70J178J994K352K017J473J062P11N53Q59J395
60406D07334J622J520J559J912K408K945L324L020J955J012R79J468J761K029
$$ plain form
60501 585729 595136 607404 623011 642246 665388 692696 724086 759152 797597 839245 883479 928967
60489 928967 974055 1017154 1056807 1091864 1121703 1145890 1163506 1173239 1174233 1166484 1150346 1126146
60477 1126146 1094435 1056193 1012650 965239 915806 866423 818829 774169 733112 695826 661985
60466 661985 631325 604110 580570 560171 542070 526102 512450 500498 489073 477945 468119 460372
60454 460372 454331 449289 444999 441266 437564 433568 429458 425336 420996 416557 412611 409311 406103 402826
60440 402826 400305 399228 399011 398476 397226 395820 394914 394695 394889 394947 394508 393874 393720 394231 394987 395723 396506 397027
60422 397027 396580 395126 393650 393026 393170 393740 394918 396912 399264 401281 402754 403816 404527 405080 405939 407334
60406 407334 408956 410476 412035 413947 416355 419300 422624 425644 427599 428611 429590 431058 432819 434848
60392D34848K665L117K745K200K488L147K966K143J950K492K631K110J877K165
60378D69544K074J475J545K799M132M546M437M430M237L466K548K026J794J602
60364E10655J543J611J536J395J606K086K310K377K990M202N217N769O598Q212
60350E58107J0258J2371J4575J6399J6775J5418J3288J1156Q559M784J08m544
60338F77254q462j1278j2848j3447j3507j3061j1985j0750j0008r555q679p511
60326E46163o901o855o458n472m783m841m988m670m150l541k423q99J91O78J536
60311D92587L348N465P329R418J2186J5174J7859K0415K2915K4789K5716K5962
60299F83163K5151K1941J5870Q409J162n902j3300k0104k4594k6293k6115k4832
$$ plain form
60392 434848 437513 440630 443375 445575 448063 451210 454176 456319 458269 460761 463392 465502 467379 469544
60378 469544 471618 473093 474638 477437 481569 486115 490552 494982 499219 502685 505233 507259 509053 510655
60364 510655 512198 513809 515345 516740 518346 520432 522742 525119 528109 532311 537528 543297 549895 558107
60350 558107 568365 580736 595311 611710 628485 643903 657191 668347 676906 681690 681798 677254
60338 677254 668792 657514 644666 631219 617712 604651 592666 581916 571908 562353 553674 546163
60326 546163 539262 532407 525949 520477 515694 510853 505865 501195 497045 493504 491081 490182 490373 491051 492587
60311 492587 495935 501400 508729 518147 530333 545507 563366 583781 606696 631485 657201 683163
60299 683163 708314 730255 746125 754534 755696 749794 736494 716390 691796 665503 639388 614556
60287F14556k2523j9326j5798j2537r968q323p354o378n040l663k602j790j262
60274D97992j445k423l489m012m139m268m360m287m239m252l922l106k350k079
60260D49621j942j513j043r75j167j222j157j189j151o75K38J197J835K052K089
60245D44998K280K560K365J496P03P14J014N82m43j025r87j111j468j114J11J020
60229D51695Q63L78M55R41J500K385L498L860K977J790J367J509J577J786K699
60214D79280M109N375O328P056P352P157P019P379P905Q086P950P696P241O667
60200E76600O420O595O643O299O043O139O016N200M099L282K649J875R27k82j950
60185F36555l630m267l623k802k831l564m429n322o144o406n994n493n224m788
$$ plain form
60287 614556 592033 572707 556909 544372 534404 526081 518727 512349 507309 503646 501044 499254 497992
60274 497992 496547 494124 490635 486623 482484 478216 473856 469569 465330 461078 457156 454050 451700 449621
60260 449621 447679 446166 445123 444148 442981 441759 440602 439413 438262 437587 437825 439022 440857 442909 444998
60245 444998 447278 449838 452203 453699 454402 455116 456130 456712 456269 455244 454257 453146 451678 450564 450675 451695
60229 451695 452558 452936 453391 454332 455832 458217 461715 465575 468552 470342 471709 473218 474795 476581 479280
60214 479280 483389 488764 495092 502148 509500 516657 523676 531055 538960 547046 554996 562692 569933 576600
60200 576600 583020 589615 596258 602557 608600 614739 620755 625955 630054 633336 635985 637860 638787 638505 636555
60185 636555 632925 628658 625035 622233 619402 615838 611409 606087 599943 593537 587543 582050 576826 572038
60171E72038m060l556l356k776j774j388k040k615k133j194p62p06n28n22r95
60156E43633j373j177r91j328j427l46J445K668K798K111J025K21N07J597J968
60141E51331R06k86j12J177K480L509M321M385L557K988L543M266L941L137L119
60126E92262L573L255K222J556J416J124Q44J398K610L480L807M166M437L926
60112F30076K869K324K510K608K216J777J538J193O05r6r95k074k775k770k754
60097F36252l393m104m040l647l834m190l608k265j337r87l47O35J006N84K73
60082F06998M23L78p4k57O6K05j97o73j011j741l082m457n447o311p178p592p236
60065E62814o517o072o217o842p363o949n399l678k862k886k981k951l030k934
$$ plain form
60171 572038 567978 564422 561066 558290 556516 555128 553088 550473 548340 547146 546384 545678 545150 544628 543633
60156 543633 542260 541083 540092 538764 537337 536991 538436 541104 543902 546013 547038 547259 547766 549363 551331
60141 551331 552237 551951 551839 553016 555496 559005 563326 567711 571268 574256 577799 582065 586006 589143 592262
60126 592262 595835 599090 601312 602868 604284 605408 606252 607650 610260 613740 617547 621713 626150 630076
60112 630076 632945 635269 637779 640387 642603 644380 645918 647111 647716 647620 646625 644551 641776 639006 636252
60097 636252 632859 628755 624715 621068 617234 613044 609436 607171 605834 604847 604500 605135 606141 606725 606998
60082 606998 607421 607799 607725 607468 607534 607739 607542 606869 605858 604117 601035 596578 591131 584820 577642 570050 562814
60065 562814 556297 550225 544008 537166 529803 522854 517455 513777 510915 508029 505048 502097 499067 496133
60051D96133k137r31j10K67P83J513J963K024K019J961J749J890K945M387N098
60036E19554M920M697M817M739L981K683J210k6n80n68r16k173l528l939l716
60021E31155l927m729n465n954o390o467n927n576o303p475p710o914o062n351
60007D46905m268l106k715k777k168r90n01r72j326j043o91m24K45R90Q26L9J41
59990D28165J391K273K028J883K851M037M223L678L255K878K047R44O2n97j148
59975D57970j476j714k370l426m104l943l314k630j901j339j302j434r44nK68
59960D28336k98m81M28J484J564Q87L07R8J52N20J038J102M87j94l38J2O04J381
59942D37089K105K369K216J993J567N52o54j165j030j183j795j923j088M3Q83
$$ plain form
60051 496133 493996 493065 492955 493222 494005 495518 497481 499505 501524 503485 505234 507124 510069 514456 519554
60036 519554 524474 529171 533988 538727 542708 545391 546601 546575 545995 545427 544511 542338 538810 534871 531155
60021 531155 527228 522499 517034 511080 504690 498223 492296 486720 480417 472942 465232 458318 452256 446905
60007 446905 442637 439531 436816 434039 431871 430881 430380 429408 428082 427039 426348 425924 426169 427159 427985 428024 428165
59990 428165 429556 431829 433857 435740 438591 442628 446851 450529 453784 456662 458709 459653 459715 459118 457970
59975 457970 456494 454780 452410 448984 444880 440937 437623 434993 433092 431753 430451 429017 428073 428068 428336
59960 428336 428038 427557 427985 429469 431033 431920 432227 432325 432477 432997 434035 435137 435624 435430 435092 435104 435708 437089
59942 437089 439194 441563 443779 445772 447339 447891 447237 446072 445042 443859 442064 440141 439053 439096 439979
59927D39979J590K167K255K162K814M172N090N216N604O826P915P978P430O736
59913E07934N381L152J215O87J061J160Q08N38M55M20O72J277J595J111K80j50
59897E27596p3K68Q16J336J344R43R65J665K247K251K431L443M590M839M269L652
59881E62582L332L318L757M451M583L804K966K960L433L386K497J134l45j592
59867F00266k202k301k631l460m115m079l788l667l310k433j748j898k206j510
59853E60918K34K106L501M382M700M533M512N338O958Q638R564R022O595K865
59839F33866o24k694l555l939l825k647n42J324J593k63l507o501p879p545o340
59824E86922m986l881l518m053m564l928k533j920k617l571l922l878l593k713
$$ plain form
59927 439979 441569 443736 445991 448153 450967 455139 460229 465445 471049 477875 485790 493768 501198 507934
59913 507934 513315 516467 517682 518369 519430 520590 521398 521936 522391 522811 523483 524760 526355 527466 527746 527596
59897 527596 527523 527791 528607 529943 531287 532230 533195 534860 537107 539358 541789 545232 549822 554661 558930 562582
59881 562582 565914 569232 572989 577440 582023 585827 588793 591753 595186 598572 601069 602203 601858 600266
59867 600266 598064 595763 593132 589672 585557 581478 577690 574023 570713 568280 566532 564634 562428 560918
59853 560918 561152 563258 566759 571141 575841 580374 584886 590224 597182 605820 615384 624406 631001 633866
59839 633866 633242 630548 626993 623054 619229 616582 616040 617364 618957 618694 615187 608686 600807 593262 586922
59824 586922 581936 578055 574537 570484 565920 561992 559459 557539 554922 551351 547429 543551 539958 537245
59810E37245j585j325j980k160j309p68j522k472k275j412j010q89l81mn78j468
59794E16107j513j083j498k702l260k598j688j413j510j424j127q24n77n00p71
59779D93619j360k052k656k971k839k497k372k337j692k76J144J965K489L070
59765D81235L408L269L122L359L621L545L462L723M104M522N466O967Q024P867
59751E45694P053O510O269N934N582N411N231N050N313N853N640M431L457L474
59737F20902L335J802k31r63k84M10L91M9m09j147j790j725j226j105j351j192
59721F15466m47J88J45n39j573k482k640j954j224j145j368j257r85j069j385
59706E97731j488j434j425j174m83J32K69M66J271K158K356K152K250K457K095
$$ plain form
59810 537245 535660 534335 532355 530195 528886 528118 526596 524124 521849 520437 519427 518538 518157 518153 517575 516107
59794 516107 514594 513511 512013 509311 506051 503453 501765 500352 498842 497418 496291 495467 494890 494390 493619
59779 493619 492259 490207 487551 484580 481741 479244 476872 474535 472843 472567 473711 475676 478165 481235
59765 481235 484643 487912 491034 494393 498014 501559 505021 508744 512848 517370 522836 529803 537827 545694
59751 545694 552747 559257 565526 571460 577042 582453 587684 592734 598047 603900 609540 613971 617428 620902
59737 620902 624237 626039 625808 624845 624561 624971 625362 625411 625002 623855 622065 620340 619114 618009 616658 615466
59721 615466 615019 615207 615352 614813 613240 610758 608118 606164 604940 603795 602427 601170 600185 599116 597731
59706 597731 596243 594809 593384 592210 591727 591859 592128 592594 593865 596023 598379 600531 602781 605238 607333
59691F07333J288O81L05j96o65p19o82j087j682j805j443j079q73q13j219k217
59675E95127l236l821m366n277o061o143n840n640n292m520l825l563l182k383
59661E31978k013k556k857j758k1R51J324K066K916K951K599L064M232M921M923
59646E52720M919M707L354J014j079k355l181l635l590l688m622n640n460m338
59632E29126l557l184k274j094j035k180k998k729k245k193k168k106k665l649
59618D95049l762k615j527j637k484l045k982k381j372m48j24m7N48J507K013
59603D76693K141K630L184K681J294O26J194J559O40o35r46m19N9K41L02J58j25
59586D91277q1L65N67J46m41p52r89j343j577j613j768k054k034j680j505j586
$$ plain form
59691 607333 608621 609302 609607 609411 608746 608027 607345 606258 604576 602771 601328 600249 599376 598563 597344 595127
59675 595127 591891 588070 583704 578427 572366 566223 560383 554743 549451 544931 541106 537543 534361 531978
59661 531978 529965 527409 524552 522794 522773 523724 525048 527114 530030 532981 535580 538644 542876 547797 552720
59646 552720 557639 562346 565700 566714 565635 563280 560099 556464 552874 549186 544564 538924 533464 529126
59632 529126 525569 522385 520111 519017 517982 515802 512804 510075 507830 505637 503469 501363 498698 495049
59618 495049 491287 488672 487145 485508 483024 479979 476997 474616 473244 472796 472672 472625 473173 474680 476693
59603 476693 478834 481464 484648 487329 488623 489249 490443 492002 492642 492007 491061 490642 490701 490942 491244 491402 491277
59586 491277 491196 491561 492128 492274 491833 491081 490092 488749 487172 485559 483791 481737 479703 478023 476518 474932
59570D74932j385q14n19p32p37l4P91Q87K23n69r84r81q55q74q23k07P87J119
59552D69225L53m77k90M35O44N15Q63J512J899K614M499O685P663P957R424J2076
59536E25597J4173J5627J8316K1993K2685J7126P006k827r087j1537j1259r383
59524E98430o988m742k682q93J88M89N61O39K81o52j685k670l996n486o349o624
59508E57821p298q447q737p555o209o070o757p191p199o995o255m845l558l037
59494D67668k739j957j002m60o0O46J279J325J141J309J580J394R69R56J486K243
59478D75778L053L705L772L250K906L341M187M736M863M849M794M654M349L575
59464E31812K130O47J50O41J070R65J043J793K634L148L966N654P610Q882R244
$$ plain form
59570 474932 473547 472733 472214 471482 470745 470711 471502 472389 472612 472043 471059 470078 469223 468349 467526 467319 468106 469225
59552 469225 469578 469101 468811 469246 469890 470405 471268 472780 474679 477293 481792 488477 496140 504097 513521 525597
59536 525597 539770 555397 573713 595706 618391 635517 642523 639696 630609 619072 607813 598430
59524 598430 591442 586700 584018 583125 583313 583802 584363 585002 585283 584631 582946 580276 576280 570794 564445 557821
59508 557821 550523 542076 533339 525784 519575 513505 506748 499557 492358 485363 479108 474263 470705 467668
59494 467668 464929 462972 461970 461510 461450 462096 463375 464700 465841 467150 468730 470124 471093 472049 473535 475778
59478 475778 478831 482536 486308 489558 492464 495805 499992 504728 509591 514440 519234 523888 528237 531812
59464 531812 533942 534589 534739 535380 536450 537415 538458 540251 542885 546033 549999 555653 563263 572145 581389
59449E81389Q827P596N904M623L965L083J508m3j084k398m633o885p915p910p808
59434E78219p553o358m276k307j142p01p07q73p30K2J213K694M650O922Q749R815
59418E87637J0913J2766J4895J6479J7627J8723J9362J9275J9754K2228K5205
59407G84864K4324J6598L880q631j6802j9872j9155j5963j1226n923o53M810J0206
59394G46457J2970R557l57j2067j9727k1587k0219j8430j6713j4512j1904r281
59382F24187o717m382k672j490j97J361K662L484M136M564M252L285K517K380
59368F37370K521K743L266L880L945L530L463L949M256M006L721L809M097M558
59354F89114N367O149O430O787Q197J0180J1256J1294J1653J2703J3187J2594
$$ plain form
59449 581389 590216 597812 603716 608339 612304 615387 616895 616852 615768 613370 608737 601852 593937 586027 578219
59434 578219 570666 564308 560032 557725 556583 555882 555175 554302 553572 553594 554807 557501 562151 569073 577822 587637
59418 587637 598550 611316 626211 642690 660317 679040 698402 717677 737431 759659 784864
59407 784864 809188 825786 829666 821035 804233 784361 765206 749243 738017 732094 731441 736251 746457
59394 746457 759427 768984 768627 756560 736833 715246 695027 676597 659884 645372 633468 624187
59382 624187 617470 613088 610416 608926 608729 610090 612752 616236 620372 624936 629188 632473 634990 637370
59368 637370 639891 642634 645900 649780 653725 657255 660718 664667 668923 672929 676650 680459 684556 689114
59354 689114 694481 700630 707060 713847 722044 732224 743480 754774 766427 779130 792317 804911
59342H04911J2127J2442J2438J1232R594Q192O245L181J21j790l205n328p997
59329H62163j0250j1859j3021j3524j3320j3060j3057j2676j1545j0310r421q371
59317G21749o967n998n787n479m709m483n306o023n711n196n351n442m656l730
59303F46911l412k690m41K409M312N671Q031J1369J3857J3741J0132K986o004
59290G06872j3384j6683j6733j5882j4863j3045j0735r022p804n969l461j340
59278E77951N6J426L049M487N726P274R142J0816J2202J3552J4684J5172J5083
59265F90620J4632J3580J1768R745P892N571K176j584m517o498q189r745j0824
59252G14627j1358j1396j0725r488q461p895o948n092l181k083j354k18J137K368
$$ plain form
59342 804911 817038 829480 841918 853150 862744 870936 877181 880362 880483 878693 875488 870160 862163
59329 862163 851913 840054 827033 813509 800189 787129 774072 761396 749851 739541 730120 721749
59317 721749 714782 708784 702997 697518 692809 688326 683020 676997 671286 666090 660739 655297 650641 646911
59303 646911 643499 640809 640368 642777 647089 652760 660791 672160 686017 699758 709890 712876 706872
59290 706872 693488 676805 660072 644190 629327 616282 605547 596525 588721 582752 579291 577951
59278 577951 578007 579433 582482 586969 592695 599969 609111 619927 632129 645681 660365 675537 690620
59265 690620 705252 718832 730600 740345 748237 753808 755984 754400 749883 743385 735196 725451 714627
59252 714627 703269 691873 681148 671660 663199 655304 648356 643264 640083 638000 636646 636428 637565 639933
59238F39933L818N466O268N806N323N709N926M957L801L683L687K387N83N4N60
59223F97961M64m25j190k268m857q056r320q091o601o614p403p559o950o196n598
59208F17297n263n242n167m575l634k842k229j661j422j625j603r54l65l21J6
59193E80410J243K113J332jJ96J772K735K408K028K293K529K427K636L379M025
59178F11525M362M807N360N550N470N534N512N041M704N214O008O216O423P709
59164F89435R376R615Q132O268M678K874R23l93j241k772n304p992j0286j2105
59150F91208j2830j1875j0233r653j0281j0685j0133r153q031o616n561n785o713
59137E73659o789n843n141n111m889m216l867l990l713k727j636o43N94J814K442
$$ plain form
59238 639933 643751 649217 655485 661291 666614 672323 678249 683206 687007 690690 694377 696764 697347 697401 697961
59223 697961 698425 698000 696810 694542 689685 681629 672309 664218 657617 651003 643600 636041 629091 622895 617297
59208 617297 612034 606792 601625 597050 593416 590574 588345 586684 585262 583637 582034 581080 580715 580394 580410
59193 580410 581653 583766 585098 585097 585293 587065 589800 592208 594236 596529 599058 601485 604121 607500 611525
59178 611525 615887 620694 626054 631604 637074 642608 648120 653161 657865 663079 669087 675303 681726 689435
59164 689435 698811 708426 716558 722826 727504 730378 731301 730908 729667 726895 721591 713599 703313 691208
59150 691208 678378 666503 656270 646617 636336 625651 615518 606365 598334 591718 586157 580372 573659
59137 573659 566870 561027 555886 550775 545886 541670 537803 533813 530100 527373 525737 525094 525688 527502 529944
59122E29944K873L971N452O459P285Q667R889R752R072R783J1708J2659J1811
59109F39325J0483R476Q195O689N931N631M294K078J007J596J822M05j339k038
59095F93555k346l174l908l749l143k634j872q19l66p73r73l73P3n62j980l635
59079F63321n435o851o976o134n790o290o421n759n543o398p184p045o711o795
59065E73989o550n486m506m249l889k764j682j522j834j863j679j375n47N71Q58
59050E37472nr12j188j456j934j593p6J208J081K89JL4k43n40m78o27j464k245
59032E27324k024r83J45J143K072K771L340M302N710O955P762Q456R057R256R380
59017E94666J0011J0589R845P807N833M474L025J339K09m01j473k884l227k229
$$ plain form
59122 529944 532817 536788 542240 548699 555984 564651 574540 584292 593364 603147 614855 627514 639325
59109 639325 649808 659284 667479 674168 680099 685730 690024 692102 693109 694705 696527 696932 695593 693555
59095 693555 691209 688035 684127 680378 677235 674601 672729 671910 671544 670771 669798 669425 669498 668936 666956 663321
59079 663321 657886 651035 644059 637925 632135 625845 619424 613665 608122 601724 594540 587495 580784 573989
59065 573989 567439 561953 557447 553198 549309 546545 544863 543341 541507 539644 537965 536590 536043 536614 537472
59050 537472 537467 536555 535367 533911 531977 530384 530308 531516 532597 532886 532887 532921 532678 532138 531660 531033 529569 527324
59032 527324 525300 524317 524462 525605 527677 530448 533788 538090 543800 550755 558517 566973 576030 585286 594666
59017 594666 604677 615266 625111 632918 638751 643225 646250 647589 647798 647397 645924 643040 639813 637584
59003F37584j262q73M4J862L234L444L662M818O107O606O517N966M548K844K330
58988F87431K830K312J72j585j637j334k004k682k230j432j096j84K211M846O333
58973F91951P456R464J1710J2977J3749J5096J6531J6959J6700J6719J6821J6245
58961H62378J5208J4318J3320J1726R758P558M562P13k942n895r006j2701j5866
58948H93131j7684j8852j9866j9927j8788j7826j7710j6992j4707j2415j1744
58937G06620j1621j0124p543n465m165l026k303k413k480j605n51m22o94l59J80
58922F54029J23P5Q75J745J493O73O27J255J494J249J124R91M42j7L20J174K033
58905F69705L148M652N788O331P431R801J2272J3567J4106J4726J5034J4659J4534
$$ plain form
59003 637584 636322 635449 635493 637355 640589 644033 647695 652513 658620 665226 671743 677709 682257 685101 687431
58988 687431 690261 692573 692745 691160 689523 688189 686185 683503 681273 679841 678745 678561 680772 685618 691951
58973 691951 699407 708871 720581 733558 747307 762403 778934 795893 812593 829312 846133 862378
58961 862378 877586 891904 905224 916950 926708 934266 938828 939541 936599 930704 921698 908997 893131
58948 893131 875447 856595 836729 816802 798014 780188 762478 745486 730779 718364 706620
58937 706620 694999 684875 677332 671867 667702 664676 662373 659960 657480 655875 655324 654902 654208 653849 654029
58922 654029 654152 654227 655102 656847 658340 659013 659640 660895 662389 663638 664762 665753 666195 666178 666498 667672 669705
58905 669705 672853 677505 683293 689624 697055 706856 719128 732695 746801 761527 776561 791220 805754
58892H05754J5395J6341J6518J6769J7942J9185J9632K0132K1420K2168K0878
58881A012134J8230J5590J2720R057N658L531J485k077o456r924j2401j4636j6081
58868A016830j6002j5402j5476j5317j3589j1258j0169j0023r297q211q136q963
58856H74987r543r989j1062j2074j1812j0830j0523j0717j0430j0102j0642j1202
58844G46061j0353q721p979q048p773p418p902q403p508o074o147p549q275p780
58830F36131p175o594n168l369k628k699j866K34K333L830N131N955N617M801
58816F34533M845N547N764N684O246O920O438N202M573M329L315J993J700J882
58802F98971R23q02j560j616k891n340o762o448o142o962q022q551q961r274q740
$$ plain form
58892 805754 821149 837490 854008 870777 888719 907904 927536 947668 969088 991256 1012134
58881 1012134 1030364 1045954 1058674 1067731 1073389 1076920 1078405 1076328 1069872 1059948 1047547 1032911 1016830
58868 1016830 1000828 985426 969950 954633 941044 929786 919617 909594 900297 892086 883950 874987
58856 874987 865444 855455 844393 832319 820507 809677 799154 788437 778007 767905 757263 746061
58844 746061 735708 726987 719008 710960 703187 695769 687867 679464 671956 665882 659735 652186 643911 636131
58830 636131 628956 622362 617194 613825 611197 608498 606632 606866 609199 613029 618160 624115 629732 634533
58816 634533 639378 644925 650689 656373 662619 669539 675977 681179 685752 690081 693396 695389 697089 698971
58802 698971 699894 699092 697532 695916 693025 687685 680923 674475 668333 661371 653349 644798 635837 626563 617823
58787F17823p428o233n163l483j519k46O35K106L631L868L201L185L756L520K482
58772F20135J811J123j130m559o896p370p361p542p147o291o250o946o779n398
58758E49400m239l881l262j998j035n68L44J650K127J733J836K732L165K779K820
58743E53603L921N220O089O826P372P295P114P687Q389P959O874O694P329P365
58729F49737O831O913P227O211M244L431M051M196L176K464K739K908K558K787
58715G09473L942N023N794P059Q507Q746P744O730N581K978o68l399m969p014
58701G55527r712j1454j2203j3934j6929j8849j8428j7158j6316j5221j3439j1932
58689E79952j0949r365p112n778n898o145n856n809n938n058l515l195m199m390
$$ plain form
58787 617823 610395 604162 598999 595516 593997 593751 594386 596492 600123 603991 607192 610377 614133 617653 620135
58772 620135 621946 623069 621939 617380 610484 603114 595753 588211 581064 574773 568523 561577 554798 549400
58758 549400 545161 541280 538018 536020 534985 534417 534761 536411 538538 540271 542107 544839 548004 550783 553603
58743 553603 557524 562744 568833 575659 583031 590326 597440 605127 613516 621475 628349 635043 642372 649737
58729 649737 656568 663481 670708 676919 681163 684594 688645 692841 696017 698481 701220 704128 706686 709473
58715 709473 713415 718438 724232 731291 739798 748544 756288 763018 768599 771577 770909 767510 762541 755527
58701 755527 745815 734361 722158 708224 691295 672446 654018 636860 620544 605323 591884 579952
58689 579952 569003 559638 552526 546748 540850 534705 528849 523040 517102 512044 508529 505334 501135 496745
58675D96745l055k018k241k257j042M73J692L365N354O287O334P379R554J0697
58661E37267J0107R544R455P727L615m11k440l598n123o136n995n899o316n787
58647E36010m016l184m302n286m553l597l868m092k933j611j367r13J053L134
58633E00475L583L247L695M238L379J622N34L11K09J77L17J2q81j261m71O64J510
58616E21360K643M200N103N013N175O145O567N397L536K203J445J075J293J605
58602E72760J080K12L66J119O47r62j601q28n53j361j479k60O92Q99K052M419
58586E77202N756N320N459P503R535J0045J0371J1560J2130J1045R707Q970P388
58573F91991M576K967L952N484N841O556R123J1949J3332J4543J7170K0167K2122
$$ plain form
58675 496745 493690 491672 489431 487174 486132 486605 488297 491662 497016 503303 509637 517016 526570 537267
58661 537267 547374 556918 566373 574100 577715 577304 574864 571266 566143 560007 554012 548113 541797 536010
58647 536010 531994 528810 524508 519222 514669 511072 507204 503112 500179 498568 497201 496288 497341 500475
58633 500475 504058 507305 511000 515238 518617 520239 520773 521084 521293 521470 521787 521799 520918 519657 519186 519850 521360
58616 521360 524003 528203 533306 538319 543494 549639 556206 561603 565139 567342 568787 569862 571155 572760
58602 572760 573840 574052 574418 575537 576184 575222 573621 572793 572240 570879 569400 569140 569832 570731 572783 577202
58586 577202 582958 588278 593737 601240 610775 620820 631191 642751 654881 665926 675633 684603 691991
58573 691991 696567 699534 703486 708970 714811 721367 730490 742439 755771 770314 787484 807651 829773
58560H29773K3839K6011K6977K5423K2782K0448J7123J1521N285O40k556n152
58548A002114o460o062n512n949o344n929n923p024q030q780j1308j5959j9696
58535H89138k0542k0453k1310k1549j9538j6935j5620j4368j1610q585o806n255
58523G06567k991j614k235k901j932q83j391k107j708j687l138m008k750j464
58509F75758k101k851j781o58j548k777k144r89j262j574j70J147J46j564j436
58494F56196n08r44j709p63Q85J293J389K820M502N000N670P805R420Q813Q317
58479G08186J0493J3575J4880J5562J7546J8798J6525J2347R406O888K350k959
58467H43597o089p444q994r751p907n308m777n018l106L3J503J857L613O238P558
$$ plain form
58560 829773 853612 879623 906600 932023 954805 975253 992376 1003897 1009182 1009822 1007266 1002114
58548 1002114 995654 989592 984080 978131 971787 965858 959935 952911 944881 936101 924793 908834 889138
58535 889138 868596 848143 826833 805284 785746 768811 753191 738823 727213 718628 711822 706567
58523 706567 703576 701962 699727 696826 694894 694011 692620 690513 688805 687118 683980 679972 677222 675758
58509 675758 673657 670806 669025 668367 666819 664042 661898 660909 659647 658073 657903 659050 659196 657632 656196
58494 656196 655688 654744 653035 652272 653157 654450 655839 658659 663161 668161 673831 681636 691056 699869 708186
58479 708186 718679 732254 747134 762696 780242 799040 815565 827912 837318 844206 846556 843597
58467 843597 837508 830064 821070 811319 803412 798104 793327 788309 785203 785236 786739 788596 792209 798447 806005
58452H06005Q355J0600J2889J2372R672P235M678M01m082o247p116r060j1040
58439H34662j0705r100q544q002n481k692k247k519n46K343L124K970M848P555
58425H05666P937P042Q116J0326J0400Q748Q062P546M495N3k464l452n474p636
58411H59365p411o223p137q853q111o231o724q292o967l707k876m392m305k221
58397G75915j241j418j0K420K847K005L198N655N602L270K261K773J953K00M06
58382H05836J811J279j65J076L955M230K253K305M785O165O105P423R590R424
58368H66072P769Q375J0686J0905R496J0300J2918J3506J2453J3589J6308J6344
58356A008721J3859J2857J3063J0506N821L700M307L448J106J380M015M552K926
$$ plain form
58452 806005 814360 824960 837849 850221 859893 867128 871806 872207 868125 861878 854762 845702 834662
58439 834662 823957 814857 806313 798311 792830 790138 787891 785372 784826 787169 790293 793263 798111 805666
58425 805666 813603 820645 828761 839087 849487 858235 866297 873843 878338 878391 875927 872475 867001 859365
58411 859365 851954 845731 838594 829741 821630 815399 808675 800383 793416 789709 786833 782441 778136 775915
58397 775915 774674 773256 773246 775666 778513 780518 783716 789371 794973 798243 800504 803277 805230 805430 805836
58382 805836 807647 808926 808761 809837 813792 818022 820275 822580 827365 833530 839635 847058 856648 866072
58368 866072 873841 882216 892902 903807 913303 923603 936521 950027 962480 976069 992377 1008721
58356 1008721 1022580 1035437 1048500 1059006 1064827 1068527 1072834 1076282 1077388 1078768 1082783 1087335 1090261
58343A090261L441O126O667N110N867Q902R753Q464R624J3174J4271J2701J3278
58330A207639J6396J7392J5817J5958J7640J6042J1334Q914R374P896M176L038
58318A351616M506L532L24N72M393N797M179N430J0235J2391J0431R931J2480
58305A435817J3351J1889J3041J6805J7428J4825J5236J8918J9290J6054J6530
58294A609184K1717K3993K1384K1023K5301K7758K6182K6622L0620L1572K7747
58283A893103K5968K8310K8360K4580K3947K8121K9578K5854K4097K7142K8883
58272B187943K7670L0024L6704L9684L7556L8912M5888M9869M8322M9759N6733
58261B649064O0497N8253N8780O4883O7547O3882O3280O8944P1428O7582O7401
$$ plain form
58343 1090261 1093702 1099828 1106495 1111605 1117472 1126374 1136127 1144591 1154215 1167389 1181660 1194361 1207639
58330 1207639 1224035 1241427 1257244 1273202 1290842 1306884 1318218 1327132 1336506 1344402 1348578 1351616
58318 1351616 1356122 1359654 1359978 1360550 1364943 1370740 1374919 1380349 1390584 1402975 1413406 1423337 1435817
58305 1435817 1449168 1461057 1474098 1490903 1508331 1523156 1538392 1557310 1576600 1592654 1609184
58294 1609184 1630901 1654894 1676278 1697301 1722602 1750360 1776542 1803164 1833784 1865356 1893103
58283 1893103 1919071 1947381 1975741 2000321 2024268 2052389 2081967 2107821 2131918 2159060 2187943
58272 2187943 2215613 2245637 2282341 2322025 2359581 2398493 2444381 2494250 2542572 2592331 2649064
58261 2649064 2709561 2767814 2826594 2891477 2959024 3022906 3086186 3155130 3226558 3294140 3361541
58250C361541P4496P8723P6165P7121Q5857R2262R2401R6954J10034J20442J23481
58239D389477J30026J44074J53751J54993J60955J76786J89138J92546K01073
58230E892819K21201K39015K47900K61990K87814L10604L24211L45405L81983
58221H512942M16865M41504M73560N22736N72313O14522O69357P46694Q26701
58212A3797194R01075R94767J121805J261452J405624J585254J819831K089221
58204B4976223K388298K756404L215152L735096M307418M988133N826999O825288
58196E9019011Q017712R513962J1397104J3680282J6440995J9870506K4071194
58189A62010766K8924565L4228757L9598782M3762851M4150171L8058308K4952310
$$ plain form
58250 3361541 3436037 3514760 3590925 3668046 3753903 3846165 3938566 4035520 4145554 4265996 4389477
58239 4389477 4519503 4663577 4817328 4972321 5133276 5310062 5499200 5691746 5892819
58230 5892819 6114020 6353035 6600935 6862925 7150739 7461343 7785554 8130959 8512942
58221 8512942 8929807 9371311 9844871 10367607 10939920 11554442 12223799 12970493 13797194
58212 13797194 14698269 15693036 16814841 18076293 19481917 21067171 22887002 24976223
58204 24976223 27364521 30120925 33336077 37071173 41378591 46366724 52193723 59019011
58196 59019011 67036723 76550685 87947789 101628071 118069066 137939572 162010766
58189 162010766 190935331 225164088 264762870 308525721 352675892 390734200 415686510
58182D15686510P621769r261333k1936229k9229270l2160447l2525869l1779485
58175B66415646l0617494k9089295k7014920k4400150k1511742j8643138j5944358
58168I9194549j3485706j1342830r548385q049670o782699n734351m892931m201720
58160C5156257l608517l110565k710365k373948k070516j810127j605318j433584
58152A6433317j271532j130253j024016r36008q46051p62655o98418o41064n76577
58143H546743n15752m71508m33293l88472l46702l19698k98218k71460k48734
58134E252906k39940k34093k18470k00699j91598j83904j68013j51845j45398
58125C518946j41362j29966j17970j14584j13026j03994r3696r1072r0216q2490
$$ plain form
58182 415686510 423308279 414046946 392110717 362881447 330721000 298195131 266415646
58175 266415646 235798152 206708857 179693937 155293787 133782045 115138907 99194549
58168 99194549 85708843 74366013 64817628 56767958 49985259 44250908 39357977 35156257
58160 35156257 31547740 28437175 25726810 23352862 21282346 19472219 17866901 16433317
58152 16433317 15161785 14031532 13007516 12071508 11225457 10462802 9764384 9123320 8546743
58143 8546743 8030991 7559483 7126190 6737718 6391016 6071318 5773100 5501640 5252906
58134 5252906 5012966 4778873 4560403 4359704 4168106 3984202 3816189 3664344 3518946
58125 3518946 3377584 3247618 3129648 3015064 2902038 2798044 2704348 2613276 2523060 2440570
58115B440570p3596p2029p2427o6448n8883n7461n7567n2119m6084m6432m7983
58104A789541m3441l7654l7946l9956l6829l2957l5090l8836l7364l4797l7865
58093A376806m2529m1671l8066l7518l7057l1920k6398k5980k6530k2675j8887
58082A027575k0740k3319k0156j5740j7071k0455j8862j5202j5945j8367j6465
58071H25253j3177j4467j7137j4771j0274j0447j3128j1707p785p536r645q392
58059F86787n088n331q130q340o814q104j0992j0967r133r535j0762r184o976
58046E77431q093r853p587l914m286o884o255l602m028o551o312m050m254o199
58032D95563n751l872m737p429p846o756p812r811q990o773p238r059p937m952
$$ plain form
58115 2440570 2366974 2294945 2222518 2156070 2097187 2039726 1982159 1930040 1883956 1837524 1789541
58104 1789541 1746100 1708446 1670500 1630544 1593715 1560758 1525668 1486832 1449468 1414671 1376806
58093 1376806 1334277 1292606 1254540 1217022 1179965 1148045 1121647 1095667 1069137 1046462 1027575
58082 1027575 1006835 983516 963360 947620 930549 910094 891232 876030 860085 841718 825253
58071 825253 812076 797609 780472 765701 755427 744980 731852 720145 712360 704824 695179 686787
58059 686787 681699 676368 668238 659898 653084 644980 633988 623021 613888 604353 593591 584407 577431
58046 577431 569338 559485 551898 547984 543698 536814 530559 526957 522929 516378 510066 506016 501762 495563
58032 495563 489812 485940 481203 473774 465928 459172 451360 441549 432559 425786 418548 409489 401552 396600
58018C96600m528o103n692l767l765m705l067j59J5j572r62R94M71j581j206P64
58002C61737L74j541q45J835K235M47K53J488N21k413l549k611k535l090j632
57987C50674N80j64l032l805k378k363l992m100k614k462l574l307k219l038m688
57972C09518l763j210r94k811k716n08K31r39q86P58J232M74J145K941K978J535
57956C06985J449K186O98k303l156j933k043l550l332j591j629l253k958p14P5
57941B84931n90P51L983N209M061M361O725P444N831N767Q360R705P827N609M886
57926C64860L552O73j295j418k209m585o053n650n684o831o614m489l425m536
57912C16296n063l555k240k425k186n23P48R60J991L981M249K171O34R26P16j110
$$ plain form
58018 396600 392072 385969 380277 376510 372745 368040 364973 364814 364829 363257 362295 363289 363760 362179 360973 361737
58002 361737 362111 360570 359725 361560 363795 364242 364495 365983 366504 364091 360542 357931 355396 352306 350674
57987 350674 351254 351090 348058 344253 341875 339512 335520 331420 328806 326344 322770 319463 317244 314206 309518
57972 309518 305755 304545 303551 300740 298024 297516 297747 296808 295922 296680 297912 298386 299531 302472 305450 306985
57956 306985 308434 310620 311318 309015 305859 303926 301883 298333 295001 293410 291781 288528 285570 284856 284931
57941 284931 284341 285092 289075 294284 298345 302706 309431 316875 322706 328473 336833 346538 354365 359974 364860
57926 364860 368412 369085 367790 366372 364163 359578 353525 347875 342191 335360 328746 324257 320832 316296
57912 316296 311233 307678 305438 303013 300827 300304 301052 302012 304003 307984 312233 314404 315038 315964 316680 315570
57896C15570k207j266l76q40q81L96R72j72j047n35m06j527j958q14j86j296k292
57879C01135j742q68o18o1P73L5k343l839l491l232l801l277j202k9p51j046L43
57862B75986J320N32o3J102K534K795K956L953M739M893N723P245P401N918N228
57847C32262O012N633K891L40j54l49j857l231l258l499n032o097n529n141o117
57832C06874o462m723l044l557m720m159k497j531j055k16L03j09l22L82P81K59
57816B76204L81J838K622J412J10N20J082m96l579o054p346p774p024n397m589
57801B41910n230n606m566l439l345l128j829o58m98j1J655K804K059R69J378
57786B22465K577L197L720M823N475M885M294M727N167M837N010O432P389O548
$$ plain form
57896 315570 313363 312097 311721 310881 310000 310396 311368 311196 310149 309614 309208 307681 305723 304909 304723 303427 301135
57879 301135 299393 298525 297907 297846 298619 298654 296311 292472 288981 285749 281948 278671 277469 277440 276689 275643 275986
57862 275986 277306 277838 277775 278877 281411 284206 287162 291115 295854 300747 306470 313715 321116 327034 332262
57847 332262 338274 343907 346798 347138 346984 346635 344778 341547 338289 334790 329758 323661 318132 312991 306874
57832 306874 300412 295689 292645 289088 284368 280209 277712 276181 275126 274910 275213 275104 274782 275164 275945 276204
57816 276204 276585 278423 281045 282457 282567 283087 284169 283673 280094 274040 266694 258920 251896 246499 241910
57801 241910 236680 231074 226508 223069 219724 216596 214767 214109 213611 213600 215255 218059 220118 221087 222465
57786 222465 225042 228239 231959 236782 242257 247142 251436 256163 261330 266167 271177 277609 284998 291546
57772B91546N327N222N153L828K386K155J986L91j690k725l254m323n192m932
57758B95878m432m570m375l179k541l659n010m898m200m205l835j787O40J483
57744B51310J197J244J431J097J104K102K636J510K26N42J488J420J047J658K264
57729B72276J465M86J243K942L555L261L473L750K767J210P00Q51J56j105j653
57714B95377j853k911m292m620m327m829n845n984n184m378l553k415j899k831
57700B40456m082m263l975m215m046k360m84k99j003o05N71Q47M78R76J960J804
57684B21760P94O93J670K486L248N101P530Q853R246J0690J3934J7907K2105K7222
57670C53239L3478M0437M8497N8634P0445Q1451Q7530Q3156O3579K9944q601m0720
$$ plain form
57772 291546 296873 302095 307248 311076 313462 315617 317603 317994 316304 313579 310325 306002 300810 295878
57758 295878 291446 286876 282501 279322 276781 273122 268112 263214 259014 254809 250974 249187 249827 251310
57744 251310 252507 253751 255182 256279 257383 259485 262121 263631 263857 264399 265887 267307 268354 270012 272276
57729 272276 273741 274227 275470 278412 281967 285228 288701 292451 295218 296428 297128 297979 298135 297030 295377
57714 295377 293524 290613 286321 281701 277374 272545 266700 260716 255532 251154 247601 245186 243287 240456
57700 240456 236374 232111 228136 223921 219875 217515 217031 216732 215729 215124 215695 216542 217020 217996 219956 221760
57684 221760 222554 223247 224917 227403 230651 235752 243282 252135 261381 272071 286005 303912 326017 353239
57670 353239 386717 427154 475651 534285 604730 686181 773711 856867 920446 950390 941789 901069
57658I01069o0874p0379p2546o9831o4455n8123n0834m2284l4068k8221k4279
57647C25175k0397j6637j4368j3109j1053q356o824o432n210k790j090j025j253
57634B16631p42k14l66p53r79j206j227o71j15l92r75q14l62q27j879k154j633
57617B01322j364j297o62j5n09j485j295k04j2r14j404j105j132j634j595j134
57601A85561j422k107j547R7O66n88j915k012j705j930k275k302k377k503k066
57586A61575j249j038j397j214l36Q6m31j072j269j275j130p30p28j781l009l046
57570A41956k214j774j616q47j46r10k430k672j724j580k474k374n67J155J493
57555A23276J217J114Q60O11J293K616L129K713K692L087K311J58j507j761j699
$$ plain form
57658 901069 840195 769816 697270 627439 562984 504861 454027 411743 377675 349454 325175
57647 325175 304778 288141 273773 260664 249611 241255 234431 227999 222789 219999 218909 217884 216631
57634 216631 215889 215675 215309 214556 213577 212371 211144 210473 210358 209966 208991 208177 207815 206988 205109 202955 201322
57617 201322 199958 198661 197999 197984 197475 195990 194695 194491 194479 193565 192161 191056 189924 188290 186695 185561
57601 185561 184139 182032 180485 180582 181248 180660 178745 176733 175028 173098 170823 168521 166144 163641 161575
57586 161575 160326 159288 157891 156677 156341 156427 155996 154924 153655 152380 151250 150520 149792 148011 145002 141956
57570 141956 139742 137968 136352 135505 135359 134449 132019 129347 127623 126043 123569 121195 120628 121783 123276
57555 123276 124493 125607 126467 127078 128371 130987 134116 136829 139521 142608 144919 145077 143570 141809 140110
57540A40110j884j353O5R93R81J170J702J133o01j452o34Po95j349q62m53j025
57523A35853j109M61K133K014Q18L31O45Q62J063J621J879J244M30K06P6m73p46
57506A47308k10K77n0n30m37l41q16j190q51m70o48o94k8N17Q2p70j164j285j516
57487A37184j497j138j262k132k640k021j094p32n18P1N82P22J081J701J496K08
57471A30011p96p74r42k196l360l182k395k101j773o77K92R6l96J43J158J184
57455A14292K77l89n20o30p00m99m90j063j539j193m53N4O05J346J376K89n71
57438A10192J0J097J043J0n77k40M88J356K122J901L52j132j063M4O14L59J41
57421A16717K26K59L64P45P44k48j465j778j438j411j552r94J89J125J576J888
$$ plain form
57540 140110 138226 136873 136938 137931 138912 140082 141784 142917 142316 140864 140230 140237 139542 138193 137331 136878 135853
57523 135853 134744 135205 137338 139352 140170 140501 141146 142008 143071 144692 146571 147815 148245 148451 148527 148054 147308
57506 147308 147098 147375 147325 146795 146358 146017 145201 144011 143160 142690 142042 141348 141320 141837 141919 141149 139985 138700 137184
57487 137184 135687 134549 133287 131155 128515 126494 125400 124668 124150 124221 124803 125525 126606 128307 129803 130011
57471 130011 129215 128441 127499 125303 121943 118761 116366 114265 112492 111815 112107 112203 111807 111950 113108 114292
57455 114292 114569 114180 113660 113030 112330 111831 111341 110278 108739 107546 107093 107147 107752 109098 110474 110763 110192
57438 110192 110202 111299 112342 112352 111775 111535 112023 113379 115501 117402 117754 116622 115559 115603 116217 116576 116717
57421 116717 116943 117202 117566 118311 119055 118807 117342 115564 114126 112715 111163 110169 110358 111483 113059 114947
57405A14947J983J668J437J711J748P02p79j315p73j37J56M07N41J46m83n54J39
57388A21544J132K096K840L023K648K393K714L146L173K993K771K124J159Q86
57374A54642J549J762N50j006j496j356j720k198j696o55n01j323j922j806j470
57359A41354j006l9J057J451J239J286J810K302K581K778K553J534K62m19n64
57344A58179p35q89p42o61j057j427j195q44j031j222o11K65K63m86r00p62p54
57327A45391j027j061p69m97k41O9J4n18o28K76J145O95n33j056p21m98n32j34
57309A39375N50N60k49j020j257j109n84L40J085J167J099J487J830J521J232
57294A46027J774K372J774N29K51J062J595J265P06K22m33r29p00k65n22j030
$$ plain form
57405 114947 116930 118598 120035 121746 123494 124196 123417 122102 121329 121192 121348 121755 122296 122442 121959 121405 121544
57388 121544 122676 124772 127612 130635 133283 135676 138390 141536 144709 147702 150473 152597 153756 154642
57374 154642 156191 157953 158503 157497 156001 154645 152925 150727 149031 148376 147875 146552 144630 142824 141354
57359 141354 140348 140309 141366 142817 144056 145342 147152 149454 152035 154813 157366 158900 159162 158743 158179
57344 158179 157444 156555 155813 155152 154095 152668 151473 150629 149598 148376 147765 148030 148293 147807 146907 146145 145391
57327 145391 144364 143303 142534 142037 141796 141865 141879 141361 140733 141009 142154 142849 142316 141260 140539 140041 139509 139375
57309 139375 139925 140485 140236 139216 137959 136850 136266 136606 137691 138858 139957 141444 143274 144795 146027
57294 146027 147801 150173 151947 152476 152727 153789 155384 156649 157355 157577 157144 156215 155515 155250 154728 153698
57278A53698o47M27J042J178J603J873Q32r01j281J54J708K298K618L151L144
57263A70897K284J513J406J417J403K182L801M832M378L380L002K970K460J582
57249B07507J082J214J637J901J708J196R90J367J592R90K63N78J691K286J990
57234B27992J596J426J037N34O54J356J830J950K310K761K487J684J535K318L066
57219B54536L286L477L735L461K764K547K868K827K362K533L608M517M692M836
57205C02049N324N449M879M364M324M223L892M064M892N362M910M359M583N377
57191C68051O248P131P853Q051Q033Q550R410R624R216R366J0428J1316J1399
57178D84676J1427J1952J2340J2090J1711J1540J1006R826Q736Q411Q674R262
$$ plain form
57278 153698 153051 153478 154520 155698 157301 159174 160006 159105 157824 157978 159686 161984 164602 167753 170897
57263 170897 173181 174694 176100 177517 178920 181102 184903 189735 194113 197493 200495 203465 205925 207507
57249 207507 208589 209803 211440 213341 215049 216245 217235 218602 220194 221184 221447 222025 223716 226002 227992
57234 227992 229588 231014 232051 232585 233239 234595 236425 238375 240685 243446 245933 247617 249152 251470 254536
57219 254536 257822 261299 265034 268495 271259 273806 276674 279501 281863 284396 288004 292521 297213 302049
57205 302049 307373 312822 317701 322065 326389 330612 334504 338568 343460 348822 353732 358091 362674 368051
57191 368051 374299 381430 389283 397334 405367 413917 423327 432951 442167 451533 461961 473277 484676
57178 484676 496103 508055 520395 532485 544196 555736 566742 576568 585304 593715 602389 611651
57166F11651J0211J1146J1466J1537J2349J3715J4357J4174J4685J6661J8954
57155G60906K0388K1258K2228K3165K3909K4862K6150K7403K8787L0875L3143
57144A043074L4132L3631L3150L3680L4493L4542L3388L0466K5209J8421J1584
57133A365770M565l698j1582j4364q673M434K1614M0237N8376P4401Q8295J01649
57121A721024J14968J26728J36027J44085J51949J58927J64753J71052J78941
57112C068454J87237J94796K02869K13525K27620K45976K70720L03747L45594
57103E260538L97482M62837N45633O49164P77696R36964J131847J366178J646087
57094A3174426J980148K373855K826175L331946L882560M461272N042094N596549
$$ plain form
57166 611651 621862 633008 644474 656011 668360 682075 696432 710606 725291 741952 760906
57155 760906 781294 802552 824780 847945 871854 896716 922866 950269 979056 1009931 1043074
57144 1043074 1077206 1110837 1143987 1177667 1212160 1246702 1280090 1310556 1335765 1354186 1365770
57133 1365770 1370335 1366637 1355055 1340691 1332018 1336452 1358066 1398303 1456679 1531080 1619375 1721024
57121 1721024 1835992 1962720 2098747 2242832 2394781 2553708 2718461 2889513 3068454
57112 3068454 3255691 3450487 3653356 3866881 4094501 4340477 4611197 4914944 5260538
57103 5260538 5658020 6120857 6666490 7315654 8093350 9030314 10162161 11528339 13174426
57094 13174426 15154574 17528429 20354604 23686550 27569110 32030382 37072476 42669025
57086D2669025O097728O516432O821515O988008O991546O779878O259859N343579
57078I4467570M029075K435152P50555q52728k267798l447036m379324n077797
57070H5657669n572447n897311o077683o126280o047600n845641n531680n128475
57062C9430552m667288m180144l694090l229950k802424k419649k083924j794090
57054A4558993j547249j338963j163567j015340q89291p81108o87368o06015n35878
57045E994214m75537m23133l77278l37311l02440k71347k43047k17656j95683
57036C150782j76726j59375j42401j25732j10125r6057q2976o9483n4277l7017
57026B096613j7977L175K6970N0402O3732N4485J8271l4381q4359j17755j32788
$$ plain form
57086 42669025 48766753 55283185 62104700 69092708 76084254 82864132 89123991 94467570
57078 94467570 98496645 100931797 101682352 100829624 98561826 95114790 90735466 85657669
57070 85657669 80085222 74187911 68110228 61983948 55936348 50090707 44559027 39430552
57062 39430552 34763264 30583120 26889030 23659080 20856656 18437007 16353083 14558993
57054 14558993 13011744 11672781 10509214 9493874 8604583 7823475 7136107 6530092 5994214
57045 5994214 5518677 5095544 4718266 4380955 4078515 3807168 3564121 3346465 3150782
57036 3150782 2974056 2814681 2672280 2546548 2436423 2340366 2257390 2187907 2133630 2096613
57026 2096613 2078636 2081811 2108781 2159183 2222915 2277400 2295671 2261290 2176931 2059176 1926388
57015A926388j34995j29566j19459j07140r4581q2267p0241n9579n1359m5015
57005A032186l9315l4172l0135k6806k3415k0356j8560j7755j6857j5649j4698
56994G74468j3977j3051j2207j1990j1822j0546q071n227k240J270M994P977R653
56981G09231R622O795M17q091j5756k0664k2904k3214k2137k0504j9201j8083
56969E55511j6199j3270j0120p486n335l255p77K548O614J0606J4099J7751K1813
56956E72500K4559K3524J7971R087j520j2136k0373k4397k4862k4213k3844k3193
56944D93103k1456j8786j5617j2079q354m666q98L026O672R963J3913J9393K5590
56931D89804L0809L4066L4481L0026J9152L661j1872k3788l1209l4614l4633l2479
$$ plain form
57015 1926388 1791393 1661827 1542368 1435228 1340647 1258380 1188139 1128560 1077201 1032186
57005 1032186 992871 958699 928564 901758 878343 857987 839427 821672 804815 789166 774468
56994 774468 760491 747440 735233 723243 711421 700875 692804 687577 685337 686607 691601 699578 709231
56981 709231 718853 725648 726065 717974 702218 681554 658650 635436 613299 592795 573594 555511
56969 555511 539312 526042 515922 508436 503101 499846 499069 501617 508231 518837 532936 550687 572500
56956 572500 597059 620583 638554 647641 646121 633985 613612 589215 564353 540140 516296 493103
56944 493103 471647 452861 437244 425165 416811 412145 411247 414273 420945 430908 444821 464214 489804
56931 489804 520613 554679 589160 619186 638338 641999 630127 606339 575130 540516 505883 473404
56919D73404k9839k7607k5561k3334k0760j7625j4201j1670j0726j0314r165p806
56907B64796p334p017n328k839j615j866j710l86P89J045J349K286L015L168L836
56892B52189N797Q342J0631J2793J5183J7971K1549K5609K7754K5169J8077R597
56880D50661J987m717j0156j2715j2183j0803j0225r481p351m516j911J075N064
56867C74729R151J2635J6702K2654K9814L6898M4132N2058N8980O1258N5906M2240
56855H17157K2191J63j8513l0690l6822l8937l8269l5416l1296k6582k1080j4676
56843E47230p989j290O169J4847K4133L3638M4018N5587O7502P9034Q9723R6648
56831A049250R3475P5059M3027N436k8776n4235o9573p6031p6131p2385o6440
$$ plain form
56919 473404 443565 415958 390397 367063 346303 328678 314477 302807 292081 281767 272602 264796
56907 264796 257462 250445 245117 242278 240663 238797 237087 236701 237490 238535 239884 242170 245185 248353 252189
56892 252189 257986 266328 276959 289752 304935 322906 344455 370064 397818 422987 441064 450661
56880 450661 452648 447931 437775 425060 412877 402074 391849 382368 375017 370501 368590 369665 374729
56867 374729 383880 396515 413217 435871 465685 502583 546715 598773 657753 719011 774917 817157
56855 817157 839348 839511 820998 790308 753486 714549 676280 640864 609568 582986 561906 547230
56843 547230 539241 537951 544120 558967 583100 616738 660756 716343 783845 862879 952602 1049250
56831 1049250 1142725 1217784 1260811 1266247 1237471 1183236 1113663 1037632 961501 889116 822676
56820H22676n9206n1232m2638l3388k4039j5483p629O61R934J9532K9087L9280
56808F87555N0341O0675O7377O7098N6563L4719N611k2690m3754n6591o3300o5099
56796G78505o2348n6694n0521m4639l8299l1176k3965j7347j1468o135o78N800
56784D41035J3214K0262K6036L0825L4414L4711K9433J8474L824j1857k5677l4938
56772E79756l8826l9152l8266l6855l4563l1628k8542k5136k1268j7704j5084
56761B52732j2883j0570q824q246p907o649n042m434m710m595l750l002k798k762
56747A66560k645k550k403k121j973j961j457k37P66P37K12Q1J28k50o52k75O27
56730A52587J131J034Q14N98K14j45j81m4R3M17Q81R96Q41J293K452K989K022
$$ plain form
56820 822676 763470 712238 669600 636212 612173 596690 589061 589722 599656 619188 648275 687555
56808 687555 737896 798571 865948 933046 989609 1024328 1029939 1007249 963495 906904 843604 778505
56796 778505 716157 659463 608942 564303 526004 494828 470863 453516 442048 435913 435235 441035
56784 441035 454249 474511 500547 531372 565786 600497 629930 648404 652228 640371 614694 579756
56772 579756 540930 501778 463512 426657 392094 360466 331924 306788 285520 267816 252732
56761 252732 239849 229279 220455 212209 204302 197653 192611 188177 183467 178872 175122 172120 169322 166560
56747 166560 163915 161365 158962 156841 154868 152907 151450 151213 151979 152716 152928 153009 153137 152887 152235 151960 152587
56730 152587 153718 154752 155566 156164 156378 156233 156052 156008 156101 156518 157399 158395 159236 160529 162981 165970 167992
56713A67992N65JJ21p3n82o67k17L59Q86J155P12k37o25j29J99k48m73K84R62
56694A69985L41r17j344p91j03L37M51n0q63q81L0M61j88m41O86J724J221L39
56676A69997P55J592R82n71j051k54L80N11J007J792J987J777K011K353J945J342
56660A86555J631K257J862P82M53Q83R46O92J040J617J248K90J15N96M24l73n86
56643B00432l01p55j786j893r12l14p16j234j412j610j519m93N89J80j250j663
56627A85343p21p2k41J37J404J859M76j475k500k619k282j379j80M11K80L31P82
56610A79554P35j58j084j481j600j437o48L01M75Q1J45N65K61p70j336j085p56
56593A71762m06O30J871J911Q24K50P56J144P89N67R40J113P31N95J021J268J035
$$ plain form
56713 167992 168557 168558 168679 168606 168024 167357 167140 167499 168385 169540 170252 170015 169390 169261 169460 169212 168739 169023 169985
56694 169985 170326 169409 168065 167274 167171 167508 167959 167909 167046 166165 166195 166656 166468 166027 166713 168437 169658 169997
56676 169997 170752 172344 173326 172755 171704 171450 171830 172341 173348 175140 177127 178904 180915 183268 185213 186555
56660 186555 188186 190443 192305 193087 193540 194423 195369 196061 197101 198718 199966 200256 200371 200967 201391 201018 200432
56643 200432 200131 199376 197590 195697 194785 194471 193755 192521 191109 189499 187980 187487 188076 188256 187006 185343
56627 185343 184622 184550 184309 184446 185850 187709 188185 186710 184210 181591 179309 177930 177750 178161 178441 178772 179554
56610 179554 180289 180131 179047 177566 175966 174529 173881 174182 174657 174738 174883 175448 175709 174939 173603 172518 171762
56593 171762 171356 171986 173857 175768 176592 176842 177598 178742 179531 180098 181038 182151 182882 183477 184498 185766 186801
56576A86801R44J080P86K00L05J156J779J975K444L067L040K744L433M941N944
56561B20639O582Q337J1157J3209J3929J4578J5205J3888R927N277J809m88j779
56548C32270j500l22k91j703k263q17N87p7j845k800l024l530m062l897l507l701
56532B99518m227m533m724m760m123l185l319m627n312m346k978k495k333j735
56518B46821j427k141l060l224l007k951k616j915j914l013l875l532k923k995
56504B08228k912j787n56m36q42n66J48L74K39L70N26K17j42n1L0l99q25o39j90
56485B00787P9M83J192J533J100N49M03K82L5K83J040J243N72K96J251K388K439
56468B15955J755J379J484J668J669J078m04j847j691r4J028P98L89O35P21J91
$$ plain form
56576 186801 187745 188825 189611 189811 190116 191272 193051 195026 197470 200537 203577 206321 209754 214695 220639
56561 220639 227221 235558 246715 259924 273853 288431 303636 317524 327451 332728 334537 334049 332270
56548 332270 330770 330448 330157 328454 326191 325374 325961 325884 324039 321239 318215 314685 310623 306726 303219 299518
56532 299518 295291 290758 286034 281274 277151 273966 270647 266020 260708 256362 253384 250889 248556 246821
56518 246821 245394 243253 240193 236969 233962 231011 228395 226480 224566 221553 217678 214146 211223 208228
56504 208228 205316 203529 202973 202537 201695 201129 201277 201651 201890 202260 202786 203003 202861 202810 202840 202441 201616 200977 200787
56485 200787 200866 201349 202541 204074 205174 205723 206126 206408 206443 206726 207766 209009 209581 209877 211128 213516 215955
56468 215955 217710 219089 220573 222241 223910 224988 224584 222737 221046 220952 221980 222778 223167 223802 224523 224714
56452B24714nM31K48q91j279N9J556J720J516K244L012K331P07l15m50l07L2M78
56434B35801L20m43n08O39J508R15j20k66j4l56q54p36m73o36n86J56O80L29J14
56415B35470Q77J689J568J277J610J589K21j386j628q34l06j34L00P57P72O75
56399B42517O54Nj278j721n72P34P95L19M30O53K68kN39R89N26J06P32J580J598
56380B48872J352J596J617R02O24J598K425J700M55L53J004J100O97M37K9o54
56364B64107n29Q20J870J626J404K319L006K051P19Q73J971K481K497K604K045
56349B89864M24o07J11R62L11m17P24K549K706J611J314J781J475N78O29J788
56333C05803L032M151N289N687N019M609N207N332M000L021L971N131M253K292
$$ plain form
56452 224714 224709 225140 225388 224497 223218 223277 224833 226553 228069 230313 233325 235656 236363 236048 235598 235291 235323 235801
56434 235801 236121 235678 235170 235809 237317 238232 238112 237846 237832 237476 236622 235886 235413 234777 234191 234347 235027 235356 235470
56415 235470 236347 238036 239604 240881 242491 244080 244301 242915 241287 240453 240147 240013 240313 241070 241842 242517
56399 242517 243171 243176 241898 240177 239605 240339 241134 241453 241883 242536 242804 242802 243341 244330 244856 244962 245694 247274 248872
56380 248872 250224 251820 253437 254339 254963 256561 258986 260686 261141 261494 262498 263598 264295 264732 264761 264107
56364 264107 263578 264398 266268 267894 269298 271617 274623 276674 277393 278266 280237 282718 285215 287819 289864
56349 289864 290288 289681 289792 290754 291065 290648 291372 293921 296627 298238 299552 301333 302808 303386 304015 305803
56333 305803 308835 312986 318275 323962 328981 333590 338797 344129 348129 351150 355121 360252 364505 366797
56319C66797J249N02j307k755j786K74O05n71j002n24n72p93J53J450J395P65
56303C63880J498L062L616L570M522N722N318M049M087N203N633N715O878Q168
56289D30921P533N753N262N948N922N474O349Q003Q525Q451R690J1460J1437J0204
56275E40932J0371J1930J2765J3054J4832J7572J8761J8611J9753K2415K4242
56264G25238K4925K6611K9674L2319L4554L8286M3364M7729N1663N7692O5982
56253A178037P4132Q1863R1582J03759J15999J27412J39838J53945J67925J80784
56243B415276J93221K04497K12132K15284K15223K11951K03774J90293J72447
56234D234098J49579J20179Q5511M8914J1723k6306o3000r4623j20672j43511
$$ plain form
56319 366797 368046 368548 367241 364486 362700 362974 363579 363008 362006 361482 360910 360117 360270 361720 363115 363880
56303 363880 365378 368440 372056 375626 380148 385870 391188 395237 399324 404527 410160 415875 422753 430921
56289 430921 438454 444207 449469 455417 461339 466813 473162 481165 489690 498141 507831 519291 530728 540932
56275 540932 551303 563233 575998 589052 603884 621456 640217 658828 678581 700996 725238
56264 725238 750163 776774 806448 838767 873321 911607 954971 1002700 1054363 1112055 1178037
56253 1178037 1252169 1334032 1425614 1529373 1645372 1772784 1912622 2066567 2234492 2415276
56243 2415276 2608497 2812994 3025126 3240410 3455633 3667584 3871358 4061651 4234098
56234 4234098 4383677 4503856 4589367 4638281 4650004 4623698 4560698 4466075 4345403 4201892
56224D201892j63270j77508j85989j91170j93735j92125j86860j80696j74094
56215B556445j65047j53880j43523j34614j24946j14258j04830r6812q7863p8145
56205A352527p0668o5860o0797n4645m9902m7106m3517l8257l3848l1208k8059
56194H28660k3780k0891k0087j8592j5211j2407j1685j1295j0184r733j0068r033
56182F55694o394m769m989m881l820l839n071m872k818j685k161j552Q41K138
56168F11822J324J039K341K813J763K042M659O634O335N966O799O978O045O583
56154F73143R174J0838J0492J0923J3277J4921J4916J6234K0147K3824K5932K9314
56142H73135L5567M2248M8080N5552O5605P4910Q1124Q5702Q8968Q7792Q0967
$$ plain form
56224 4201892 4038622 3861114 3675125 3483955 3290220 3098095 2911235 2730539 2556445
56215 2556445 2391398 2237518 2093995 1959381 1834435 1720177 1615347 1518535 1430672 1352527
56205 1352527 1281859 1215999 1155202 1100557 1050655 1003549 960032 921775 887927 856719 828660
56194 828660 804880 783989 763902 745310 730099 717692 706007 694712 684528 674795 664727 655694
56182 655694 649300 644531 639542 634661 630841 627002 621931 617059 614241 612556 610395 608843 609684 611822
56168 611822 613146 614185 616526 619339 621102 623144 627803 634437 640772 646738 653537 660515 666560 673143
56154 673143 682317 693155 703647 714570 727847 742768 757684 773918 794065 817889 843821 873135
56142 873135 908702 950950 999030 1054582 1120187 1195097 1276221 1361923 1450891 1538683 1619650
56131A619650P1797O2760N2927M3038L7274L6853L7216L4413K9104K1977J1377
56120B058386j495j1138j4958j6532j9055k1523k4245l1380m4174n7616o7483
56109A748787p4902q0682q1743p7022p0740o5608n8892m9028l9878l4243k9285
56098A086764k2636j6918j4036j1158o618l603l798l641j016P58j80j78K804M927
56084A011471L882L460O048P801O339N844R078J1645R992P903R158J0812R859
56071A113292R448J2290J4736J3706J2735J4961J6995J5930J5378J8224K0539
56060A278234J9130J7916K0253K2299K0632J9037K0828K2070J9421J7112J8875
56049A495807K0650J8650J6890J9197K1640K0413J9250K1484K3038K1005K0445
$$ plain form
56131 1619650 1691447 1754207 1807134 1850172 1887446 1924299 1961515 1995928 2025032 2047009 2058386
56120 2058386 2056891 2045753 2030795 2014263 1995208 1973685 1949440 1918060 1873886 1816270 1748787
56109 1748787 1673885 1593203 1511460 1434438 1363698 1298090 1239198 1190170 1150292 1116049 1086764
56098 1086764 1064128 1047210 1033174 1022016 1015398 1011795 1007997 1004356 1003340 1004098 1003918 1003740 1006544 1011471
56084 1011471 1015353 1018813 1024861 1032662 1039001 1044845 1053923 1065568 1075560 1083463 1092621 1103433 1113292
56071 1113292 1122740 1135030 1149766 1163472 1176207 1191168 1208163 1224093 1239471 1257695 1278234
56060 1278234 1297364 1315280 1335533 1357832 1378464 1397501 1418329 1440399 1459820 1476932 1495807
56049 1495807 1516457 1535107 1551997 1571194 1592834 1613247 1632497 1653981 1677019 1698024 1718469
56038A718469K4639K7639K4935K2235K4807K7644K5620K3772K7555L2312L2701
56027B012328L3197L8739M4329M4544M3992M7672N0767M8841M8009N3565N9044
56016B525027N8327N7715O3710P0007O9677O8927P5078Q2224Q3018Q3224Q9968
56005C326902R7224R8033R9316J08839J19563J23062J25998J36643J48041J51992
55995D535613J56256J69574J83525J88453J93081K08294K26267K36782K48665
55986F346510K72647K98903L15333L31818L61520L95232M20570M48631M93561
55977I684725N44438N87202O34962P04654P84361Q58094R41405J055664J190020
55968A6985525J328777J492216J707248J963760K247095K585010L010258L507875
$$ plain form
56038 1718469 1743108 1770747 1795682 1817917 1842724 1870368 1895988 1919760 1947315 1979627 2012328
56027 2012328 2045525 2084264 2128593 2173137 2217129 2264801 2315568 2364409 2412418 2465983 2525027
56016 2525027 2583354 2641069 2704779 2774786 2844463 2913390 2988468 3070692 3153710 3236934 3326902
56005 3326902 3424126 3522159 3621475 3730314 3849877 3972939 4098937 4235580 4383621 4535613
55995 4535613 4691869 4861443 5044968 5233421 5426502 5634796 5861063 6097845 6346510
55986 6346510 6619157 6918060 7233393 7565211 7926731 8321963 8742533 9191164 9684725
55977 9684725 10229163 10816365 11451327 12155981 12940342 13798436 14739841 15795505 16985525
55968 16985525 18314302 19806518 21513766 23477526 25724621 28309631 31319889 34827764
55960C4827764M058652M702913N498689O456875P592222Q993939J0760773J2922147
55952I5813974J5528467J8746403K2715789K7369786L2518734L7857696M2377999
55945B92928848M3756055L9107940K7206009J0113359p702628k2085807l1192689
55938C52131087l5396620l6027188l4434484l1705019k8574455k5386293k2241328
55931A38365700j9222963j6442894j3955287j1757756r865174q298789p021351
55924E1801486n958400n071713m353630l769944l269671k837636k483823k192838
55916B1863831j931999j696945j503415j344143j195705j057988r47077q57864
55908A1328695p70684o86780o22019n72898n22008m70452m33028m07190l76969
$$ plain form
55960 34827764 38886416 43589329 49088018 55544893 63137115 72131054 82891827 95813974
55952 95813974 111342441 130088844 152804633 180174419 212693153 250550849 292928848
55945 292928848 336684903 375792843 402998852 413112211 405409583 383323776 352131087
55938 352131087 316734467 280707279 246272795 214567776 185993321 160607028 138365700
55931 138365700 119142737 102699843 88744556 76986800 67121626 58822837 51801486
55924 51801486 45843086 40771373 36417743 32647799 29378128 26540492 24056669 21863831
55916 21863831 19931832 18234887 16731472 15387329 14191624 13133636 12186559 11328695
55908 11328695 10558011 9871231 9249212 8676314 8154306 7683854 7250826 6843636 6466667
55899F466667l42410l16735k98968k76418k49972k31328k19175k02325j82426
55890D146910j70262j63575j51054j34424j24833j21078j12580j00204r3504r0859
55880B884537q2833p2091p0005p5912p8822p7218p8546q1556p7798o9058o5389
55869B055309o7047o5215n9331n7022n8149n5123m8166m4634m4199l9923l3031
55858A483469l1508l4896l5278l2563l4119l9659m1064l7233l5211l6341l4783
55847A090814l0128k8386k9878k8678k4517k3157k4649k3118j8510j6793j8268
55836H24732j7175j3186j1924j3753j3227j0050r569j1907j1487p857o379p731
55824F90487p217m933o087j0537j2367j0592j0276j2338j2304r928r956j2436
$$ plain form
55899 6466667 6124257 5807522 5508554 5232136 4982164 4750836 4531661 4329336 4146910
55890 4146910 3976648 3813073 3662019 3527595 3402762 3281684 3169104 3068900 2975396 2884537
55880 2884537 2801704 2729613 2659608 2583696 2504874 2427656 2349110 2267554 2189756 2120698 2055309
55869 2055309 1988262 1923047 1863716 1806694 1748545 1693422 1645256 1600622 1556423 1516500 1483469
55858 1483469 1451961 1417065 1381787 1349224 1315105 1275446 1234382 1197149 1161938 1125597 1090814
55847 1090814 1060686 1032300 1002422 973744 949227 926070 901421 878303 859793 843000 824732
55836 824732 807557 794371 782447 768694 755467 745417 735848 723941 712454 704597 698218 690487
55824 690487 683270 678337 672250 661713 649346 638754 628478 616140 603836 593908 583952 571516
55812E71516j2024q074n816o519n907l318k929m767l893J58K344J719K931O791
55798E32212Q462O666N690O644N501J653l55M25o07m713p329o613o345q049q108
55783E25134n158k970l608m794n854r113j3651j4956j2583j1001j1291r483m794
55770D15878j685j602m04L481N796M076J437J05j944n130n984l625k124l524m708
55755D00043l857l760n870p291o531o413q367r610q722q380r772r933p486n494
55741B98557n886o299n175m628n591n371k832r29j348j690n23k21k036l354k650
55726B50024k364m078n463m794m005m491m303k200l39l81q94p80j186k072j191
55711B11483J494K844J941J881M153N894M997L344K610J355j249l171l451m071
$$ plain form
55812 571516 559492 551418 545602 539083 533176 529858 526929 522162 518269 518427 520771 522490 525421 532212
55798 532212 540674 547340 553030 559674 565175 566828 566473 566898 566291 561578 554249 547636 541291 533242 525134
55783 525134 519976 517006 513398 508604 502750 493637 479986 465030 452447 441446 430155 420672 415878
55770 415878 414193 412591 412187 415668 421464 425540 426977 427082 425138 420008 414024 410399 408275 404751 400043
55755 400043 396186 392426 386556 379265 372734 366321 357954 348344 339622 331242 321470 311537 304051 298557
55741 298557 292671 286372 281197 276569 270978 265607 262775 261846 260498 258808 258285 258064 256028 252674 250024
55726 250024 247660 243582 238119 233325 229320 224829 220526 218326 217987 217606 216712 215932 214746 212674 211483
55711 211483 212977 215821 217762 219643 223796 229690 234687 238031 240641 241996 240747 237576 234125 230054
55697B30054n735o058m244l096m043m613l211j956k298k292q11l1j027j251Q34
55682A90222K866L041L222M786N709M673L855M590M367J430j605k119j684k558
55668B20795l508k647j167q60q55R5Q55L87J33J275K322J947J359J533J248J00
55652B23012K09K346L771K470L34m42p86j880k374j315p20k202m068m511m734
55637B09110o115p301o950o404o845o765n065l607l795l700j610M76Q5j653k311
55622A47550k012j982j757p77l63j329k002j205o39j652k451j365j02p20j993
55607A27201j920j317j720k115j000M33L60m53m15j46q26j507r11m3l03q87o24
55590A13807l95j179j821j242p22j378j716k89J446J658J191J423J388nj260p13
$$ plain form
55697 230054 224319 218261 214017 210921 206878 202265 199054 197098 194800 192508 191697 191666 190639 189388 190222
55682 190222 193088 196129 199351 204137 209846 214519 218374 222964 227331 228761 227156 225037 223353 220795
55668 220795 217287 214640 213473 212613 211758 211853 212708 213095 213228 214503 216825 218772 220131 221664 222912 223012
55652 223012 223221 225567 229338 231808 232142 231700 230914 229034 226660 225345 224625 222423 218355 213844 209110
55637 209110 202995 195694 188744 182340 175495 168730 163665 160058 156263 152563 150953 151429 151514 149861 147550
55622 147550 145538 143556 141799 141022 140659 139330 137328 136123 135484 133832 131381 130016 129914 129194 127201
55607 127201 125281 123964 122244 120129 119129 119562 119922 119469 119054 118908 118082 116575 115664 115621 115318 114431 113807
55590 113807 113412 112233 110412 109170 108448 107070 105354 105065 106511 108169 109360 110783 112171 112166 110906 110193
55574A10193M18M06J96J294K578K355J563J839K349J607M86M31N09o09j675r45
55558A22995N37P97K37J47k30j859l104k074j53J47p01n76L52L85k77k39J09m99
55540A15994j343q58M37R51Q60J224J552J087J037K600M170L553J654Q10P95k20
55524A34303j861k178j251r25j527j872j920k565l380l225k541k497k687k109
55510A03765j441j795k274j445j54j46r64r87n05q92j677j398m79l81p40k01O99
55493H8985M12n76m56P31J361J063P32L90m40r53j90Q64P51P8K22N83j33j140
55475I2284q80L8N4l03L07R55j42k086k512j539j152j424p76N33O94k53o00k73
55457H2925o89j614j357l9M91n5j97L44M46J59N86J305Q99j49m6J064J391P94
$$ plain form
55574 110193 110611 111017 111213 112507 115085 117440 119003 120842 123191 124798 125284 125715 126224 125615 123940 122995
55558 122995 123532 124329 124566 124713 124483 122624 119520 117446 117293 117440 116739 116163 116515 116900 116623 116384 116493 115994
55540 115994 114651 113793 114230 115181 116041 117265 118817 119904 120941 123541 127711 131264 132918 133728 134523 134303
55524 134303 132442 130264 129013 128088 126561 124689 122769 120204 116824 113599 111058 108561 105874 103765
55510 103765 102324 100529 98255 96810 96656 96510 95546 94559 94054 93162 91485 90087 89608 89227 88487 88286 88985
55493 88985 89397 88821 88365 89096 90457 91520 92252 92642 92202 91249 91059 91923 92674 92752 92974 93557 93424 92284
55475 92284 91404 91442 91496 91193 91500 92455 92313 90227 87715 86176 85024 83600 82824 83357 84051 83798 83198 82925
55457 82925 82236 80622 79265 79226 79717 79662 79465 79809 80255 80414 81000 82305 83204 83055 83009 84073 85464 86258
55439H6258P50J285J038K24L36R95L65j348k031j345r64j066j08J626J822R8j138
55422H6797o20J52N1m8L02K6j075j483o21Q8k66q11q44p91n90M85J825J731K44
55403H4552o80k57K05n5k12L1j96q02n13O07Q73j44q58m55J8n7N9N19M50OL55
55382H3446J151P18p08q32Q03J767P30n17l16L84L59K78P91Q27l83j585j569j103
55364H4241j190j237m90L09K93j4J15K77M0k3M26O20J27k24J22L92o2o00n58l57
55344H2207m13k82K96P27P13P50R41O80Pk19K5k45j057j152k25L62j22o22l32
55325H2039r4o79j334j185n79o4O26J610K212K051J628J161K17r65j313o66j76
55308H4489l37k65M64Q87L53m29q03j088j402j139l06J29p9m0M59M21l45n34N10
$$ plain form
55439 86258 87008 88293 89331 89555 89891 90886 91251 89903 87872 86527 85563 84497 84389 86015 87837 87935 86797
55422 86797 86177 86329 86380 86332 86634 86660 85585 84102 83481 83569 83303 82492 81648 80857 80267 80752 82577 84308 84552
55403 84552 83872 83615 83820 83765 83553 83584 83388 82586 82073 82680 83553 83409 82551 82096 82114 82057 82116 82635 83085 83091 83446
55382 83446 84597 85315 84607 83775 84578 86345 87075 86558 86242 86626 86985 87263 88054 88881 88498 86913 85344 84241
55364 84241 83051 81814 81324 81633 81926 81912 82027 82304 82344 82321 82747 83367 83494 83270 83392 83784 83722 83122 82564 82207
55344 82207 81794 81512 81808 82535 83248 83998 84939 85619 85626 85407 85432 85187 84130 82978 82753 83115 82993 82371 82039
55325 82039 81945 81266 79932 78747 78168 78104 78730 80340 82552 84603 86231 87392 87609 86644 85331 84665 84489
55308 84489 84152 83887 84351 85238 85591 85162 84359 83271 81869 80730 80424 80553 80474 80434 80893 81314 80969 80435 80945
55289H0945J627J761J352R72K17j000j672j187k55M68J251K031J947R66L79P87
55273I0589J133O28M2J53M52L03M1k9l25q53p97K8O83O83O43P81M66k24k84K33
55253I4346j5j183j603n51L99No96l95L39L80pm2J19R1J89N71O30J70j04j4l56
55232I2273j270j684j177o45m21L72J745K179J028l23p78r43j240q08M12Q07k07
55215H9320q48P3J059O57J2N79J371Q04l52l81M55O84K30Rj4l49m75J96Q33M53
55195I4316k89l15q3m89r54n23J72l1o64n55j8j38o07k83O58J044P18M70L37k64
55175I2502j081j177m33M06Q25P01o7j064j215j95Q33Q57M24L47K15n05j075o73
55157H9625J03L24L60Q86J360J043N22O44R23N53K1Q7K10l17p52j82N43J27q50
$$ plain form
55289 80945 82572 84333 85685 86657 86874 85874 84202 83015 82760 83228 84479 86510 88457 89423 89802 90589
55273 90589 91722 92350 92392 92545 92997 93300 93341 93312 92987 92134 91337 91365 92048 92731 93374 94155 94621 94397 94113 94346
55253 94346 94331 93148 91545 90994 91393 91398 90702 90307 90646 91026 91019 90977 91096 91187 91376 91947 92577 92747 92643 92629 92273
55232 92273 91003 89319 88142 87497 87076 87448 89193 91372 92400 92077 91299 90356 89116 88308 88720 89527 89320
55215 89320 88472 88545 89604 90261 90273 90852 92223 93027 92675 92294 92749 93433 93663 93672 93658 93309 92834 93030 93863 94316
55195 94316 94027 93712 93629 93140 92186 91663 91835 91804 91140 90585 90567 90429 89822 89539 90197 91241 91959 92429 92766 92502
55175 92502 91421 90244 89811 90217 91042 91743 91676 90612 89397 89202 90035 90892 91316 91663 91878 91373 90298 89625
55157 89625 89728 90052 90412 91298 92658 93701 94223 94867 95790 96343 96364 96451 96661 96344 95592 95410 95953 96080 95230
55138I5230q89j03K08p7k4L90L54n7k2L69L18j46l13j70j67o9N20R68M60n29j019
55117I5232j160j563j673o10R65J530R43L17R1j70l62K9O79Q03N66P45J265J444
55099I9071J323J421J569J279Q14O73N62J12j94m4l03j468k171j039Q80J496P39
55082A04720K15M70O78O13Q27J152R83P32J160J643J050r7l46K08L50J61P30J685
55064A16934J416j31j243j182r89j275j412j222j416j864j445r8Q01O00O9l59
55048A07184j158k062j825l39Q38P38J46j71o35j449j676o96P42J715K177K149
55032A05678J195m80j620j440n79M5L48N01L30o8r6L49N17o3q76j277j237r14
55014A00313k98M49R93J361J728J699P36o88j454j320j053j037q70m48k52l16
$$ plain form
55138 95230 94341 94238 94446 94369 94345 94735 95089 95032 95010 95379 95697 95551 95238 95068 94901 94832 95352 96320 96780 96251 95232
55117 95232 94072 92509 90836 90226 91191 92721 93664 93981 94072 93902 93540 93569 94248 95051 95617 96362 97627 99071
55099 99071 100394 101815 103384 104663 105477 106150 106712 106824 106630 106586 106283 104815 102644 101605 102485 103981 104720
55082 104720 104935 105405 106083 106696 107523 108675 109658 110390 111550 113193 114243 114146 113800 114008 114358 114519 115249 116934
55064 116934 118350 118219 116976 115794 114805 113530 112118 110896 109480 107616 106171 106073 106874 107474 107543 107184
55048 107184 106026 103964 102139 101800 102638 103376 103522 103351 102716 101267 99591 98895 99637 101352 103529 105678
55032 105678 106873 106393 104773 103333 102754 102799 103147 103648 103978 103910 103814 104163 104680 104617 103741 102464 101227 100313
55014 100313 100015 100464 101457 102818 104546 106245 106981 106293 104839 103519 102466 101429 100559 100111 99859 99543
54998I9543k9Q19J706K218K364K087J415R64J217J484P78n00j076q20p21r56o74
54981A09819K37P80N91M59P23O35j22p19n50j06M4J0m5j87q8P18J728J823R88
54962A16738M07N71O83J94m11p45j063j245o31N89J207P57J25mo2l53l58J03L09
54943A16811n1k47J50M73J98j93k52l01m50o6R54J556J003L5k53J99R13J804K837
54924A25120L611L953M216M443M148L490L557M820O266O877O993P369P714P138
54910A99715N380K809k14l237n517o622o894o866o669o361o132n851n045l737
54896A44759k594k017j678j320j169j303j422j504j861k208j661q1J486K162K213
54881A31802K213K237K282K647L326L880M330N350P010Q323Q474P739O605M990
$$ plain form
54998 99543 99514 100333 102039 104257 106621 108708 110123 111087 112304 113788 114566 114066 112990 112170 111449 110493 109819
54981 109819 110056 110836 111427 111886 112609 113244 113122 112403 111853 111747 111791 111801 111756 111569 111481 112199 113927 115750 116738
54962 116738 117145 117716 118399 118593 118182 117437 116374 115129 114498 115087 116294 117051 117176 117172 117110 116757 116399 116502 116811
54943 116811 116760 116513 116663 117136 117334 117141 116889 116588 116138 116072 117026 118582 119585 119620 119367 119566 120479 122283 125120
54924 125120 128731 132684 136900 141343 145491 148981 152538 157358 163624 170501 177494 184863 192577 199715
54910 199715 205095 207904 207690 204453 198936 192314 185420 178554 171885 165524 159392 153541 148496 144759
54896 144759 142165 140148 138470 137150 135981 134678 133256 131752 129891 127683 126022 125941 127427 129589 131802
54881 131802 134015 136252 138534 141181 144507 148387 152717 158067 165077 173400 181874 189613 196218 201208
54867B01208K909J005l61j775l764n775o895p056o860o661o398n969n343m550
54853A43715l800l256k680j867j293j608k472k798k228j477j123j003r70j167
54839A15973j366j098o28p42j348j437p34j65k86m01J79J057J502J327O77j90
54823A12320n89J7R51R42O4k92L51Q96O46M04P58Q84M3r60r60q6O97Q51L52n36
54803A16753r98k25J179J551N62j70L97J115O72k32k19N29Q88P66Q71J136Q29
54786A25404m9p16p42l14L04Q89J128J025R82J046Q11L79N67J493K090J755J455
54769A37507K254L713M701M961M948M946N200O070P180P394O457N604N527M976
54755B11438K651o27l089m512n846p136p509o856n982n218m310l530l560m171
$$ plain form
54867 201208 204117 205122 204761 202986 199222 193447 186552 179496 172636 165975 159577 153608 148265 143715
54853 143715 139915 136659 133979 132112 130819 129211 126739 123941 121713 120236 119113 118110 117140 115973
54839 115973 114607 113509 112881 112139 110791 109354 108620 108455 108169 107768 107947 109004 110506 111833 112510 112320
54823 112320 111731 111748 112699 113641 113705 113413 113764 114660 115306 115710 116468 117352 117395 116435 115475 115389 116086 116937 117289 116753
54803 116753 115755 115530 116709 118260 118822 118652 119049 120164 120836 120604 120385 120914 121802 122568 123439 124575 125404
54786 125404 125355 124639 123897 123583 123887 124776 125904 126929 127911 128957 129768 130147 130714 132207 134297 136052 137507
54769 137507 139761 143474 148175 153136 158084 163030 168230 174300 181480 188874 195331 200935 206462 211438
54755 211438 214089 213462 210373 205861 200015 192879 185370 178514 172532 167314 163004 159474 155914 151743
54741A51743m281l444k371j766j505j181p58n26o29p78m19N44J260Q72l2P9J492
54724A38300K764K928K956M119N976P193P442P409P444P295O717N538L581J155
54710B10817j003k768m760o908p984p368o109n368m942m404m340n120n567m462
54696A39714k535j404j303j328j230j319j251n06L15K16n09p54m56m57q84j020
54680A25289p14n19n65n26m93p67j022p67l44l64n21j71L49K42k64k80J82L70
54662A19115K03K06L16N2l00p1M92N90L87P02J385J404N87j28k37j50j27O9L61
54643A24856L32O0m8j19m31n17J39Q19M30n85p34J82Q67P08M90O81O54N8n18p08
54623A26616q89j074o83R1R8r57j782j378m67j69l44k03K39L66J50J57O32J198
$$ plain form
54741 151743 147462 144018 141647 139881 138376 137195 136437 135911 135282 134504 134085 134629 135889 136761 136729 136808 138300
54724 138300 141064 143992 146948 151067 157043 164236 171678 179087 186531 193826 200543 206081 209662 210817
54710 210817 209814 207046 202286 195378 187394 180026 173917 168549 163607 159203 154863 149743 144176 139714
54696 139714 137179 135775 134472 133144 131914 130595 129344 128838 129153 129369 128860 128106 127650 127193 126309 125289
54680 125289 124575 124056 123491 122965 122472 121705 120683 119916 119572 119208 118687 118516 118865 119107 118843 118563 118745 119115
54662 119115 119318 119524 119840 119892 119592 119521 120013 120603 120990 121692 123077 124481 125068 124940 124703 124553 124426 124495 124856
54643 124856 125188 125248 125200 125081 124650 124133 124272 125091 125521 124936 124202 124384 125251 125959 126449 127130 127784 127842 127324 126616
54623 126616 125727 124653 123970 124061 124159 123202 121420 120042 119575 119406 119062 118859 119098 119464 119614 119771 120403 121601
54605A21601J416J220Q94P50P70O28K41L6K84M89P2o84j056r90r82j058p67o6
54587A22798N38P35N92J62l68m29K70R83P82j14p24p03m34j00L11L81j85o97l45
54568A23453M01N25K00L24O36J15q66p23O40J360M54o44l64P17J094O50M22P88
54550A29182J097P80J6n78m89J99P49O01J79K44O42O06J93K50Q86J233R53P47
54532A37490R51R18K94k87m50q00j655k150j532m86j53n81j014j192j346j385
54516A26622r32l5P72J051P35M9n89p60m38P5N92J059J262J030O62N39M52K6l68
54497A31804r0M86L11n96r00J00J455J889J260J80r24j779k034j661j062m85O7
54480A28021K56l13j067q22N07J555J423Q55Q70J296J458J391J504J632J349O73
$$ plain form
54605 121601 123017 124237 125131 125881 126651 127279 127520 127556 127840 128329 128401 127717 126661 125671 124689 123631 122864 122798
54587 122798 123336 124071 124663 124825 124457 124028 124298 125281 126063 125949 125225 124522 124088 123988 124299 124680 124495 123798 123453
54568 123453 123854 124379 124579 124903 125539 125654 124788 124065 124705 126065 126519 125875 125511 126228 127322 127972 128394 129182
54550 129182 130279 131059 131075 130497 130008 130207 130956 131557 131736 131980 132622 133228 133421 133671 134557 135790 136743 137490
54532 137490 138441 139359 139653 139366 138916 138116 136461 134311 132779 132293 132140 131559 130545 129353 128007 126622
54516 126622 125690 125655 126427 127478 128213 128262 127673 126913 126475 126550 127142 128201 129463 130493 131155 131694 132146 132172 131804
54497 131804 131714 132200 132511 131915 131015 131115 132570 134459 135719 135899 134975 133196 131162 129501 128439 127954 128021
54480 128021 128277 127964 126897 126075 126582 128137 129560 130415 131285 132581 134039 135430 136934 138566 139915 140588
54464A40588j21r24j458j198j71Q06J184J325J582J546Q78J54L0J85n1n55p22
54447A43078n14l66l88l77l88o01q27p70n62n14n03j56M69Q77P04K2p58j069n80
54428A36777L69R46P43J78j18J7L71P36R50R31Q90J139J614J910J874J634J150
54411A52111L12n07p38n72q28j621j968j116M38J680K120J852J177O25O91J151
54395A54807J202N91L0J32N40O00K92Q0K51O91J003O72l69j383j581j207j106
54378A55245j293r76j21K45k72o25J23J409K048J744J059N32N12J149K009K283
54362A65071J912J797K477L296L459L080K681K393K222K421K899K972K240J110
54348B00030J6j154k365l155l521m103m834m545k840j270j413k646l112k265j149
$$ plain form
54464 140588 140467 139543 138085 136887 136716 137522 138706 140031 141613 143159 144037 144191 144221 144406 144355 143800 143078
54447 143078 142564 142198 141810 141433 141045 140444 139617 138847 138285 137771 137268 137112 137581 138458 139162 139184 138426 137357 136777
54428 136777 137146 138092 138835 139013 138895 138912 139283 140019 140969 141900 142790 143929 145543 147453 149327 150961 152111
54411 152111 152423 151916 151178 150606 149778 148157 146189 145073 145511 147191 149311 151163 152340 152965 153656 154807
54395 154807 156009 156600 156630 156762 157302 157902 158194 158274 158525 159216 160219 160891 160522 159139 157558 156351 155245
54378 155245 153952 152976 152855 153100 152828 152203 152326 153735 155783 157527 158586 159118 159630 160779 162788 165071
54362 165071 166983 168780 171257 174553 178012 181092 183773 186166 188388 190809 193708 196680 198920 200030
54348 200030 200046 198892 196527 193372 189851 185748 180914 176369 173529 172259 170846 168200 165088 162823 161674
54333A61674n60l34k64n20j020j305j206r88q57q23q56p90k79O28J223R50J78
54316A54851l48m31l01k3M60R08J004P02P0p99j430j164j43N11M6r60j494j337
54298A50122r08n00k56l42n86n16j84j96n80m62N07J412J510J311J392J244L71
54281A53339m01j09P00Q40L60J11N8m49j079q12K49Q79N93J42N5r6o34j093r83
54262A51670m34K19P95J075R24P21R92J570J770J391Q97O02L58O2j34j94j75J03
54244A62212P47J220P72m65j442j434q54o74j326k247k416j377K22J351J767J956
54228A58012J997J356J31n67j40N94P52P56J301J877J501M06l51m95n75o92m41
54211A65422k9j69q74j400j460j471j599j488j076p77p28o06k76LP6N0k8j25o4
$$ plain form
54333 161674 161114 160780 160516 159996 158976 157671 156465 155477 154620 153797 152941 152151 151872 152500 153723 154673 154851
54316 154851 154503 154072 153771 153748 154208 155116 156120 156822 156892 156093 154663 153499 153356 153867 153913 152953 151459 150122
54298 150122 149214 148714 148458 148116 147530 147014 146830 146634 146054 145592 146099 147511 149021 150332 151724 152968 153339
54281 153339 152938 152829 153529 154369 154729 154840 154898 154449 153370 152558 152807 153686 154279 154421 154476 154380 153746 152653 151670
54262 151670 151236 151455 152250 153325 154249 154970 155962 157532 159302 160693 161590 162192 162550 162612 162478 162284 162109 162212
54244 162212 162959 164179 164951 164486 163044 161610 160756 160082 158756 156509 154093 152716 152938 154289 156056 158012
54228 158012 160009 161365 161496 160929 160789 161383 162135 162891 164192 166069 167570 167976 167625 167130 166555 165863 165422
54211 165422 165393 165224 164350 162950 161490 160019 158420 156932 155856 155079 154351 153745 153469 153472 153548 153598 153570 153445 153381
54192A53381J06n0o06q17j33Q51J259J163R96M34r47k286k211p86N63J050J117
54175A53084J114Q15M34P54J794K390J671Q9j273j731j172lQ74Q00J50k12k38
54158A59340n57j165j313p82k31j19k34m18q23j225j056l78N8k2p2L02Q89J488
54140A53682K034J982P82q28j151K87J946K281J511P33K67j87m54o1P99J285R23
54123A65831J15m07l35k3l9m27o08j69N05Q04P97R38J206J212R86Q77Q07M83J73
54104A72726L89Q05N29n11j340j222m01N30J131J012J16p90q23j67L25N77J151
54087A74037J866J933J562J895L015L612L249L338M855O501O313M148J431p96
54073B16959k402l371l703l722l704l446k805k196j913j525o42K36M22J34O4K82
$$ plain form
54192 153381 153487 153437 152831 152014 151881 152732 153991 155154 156150 156584 155637 153351 151140 150354 150917 151967 153084
54175 153084 154198 155013 155447 156201 157995 160385 162056 162145 160872 159141 157969 157966 158840 159640 159790 159578 159340
54158 159340 158783 157618 156305 155523 155292 155173 154939 154521 153698 152473 151417 151039 151097 151075 151003 151305 152194 153682
54140 153682 155716 157698 158480 157652 156501 156788 158734 161015 162526 163259 163526 163339 162885 162824 163623 164908 165831
54123 165831 165946 165539 165204 165181 165142 164715 164107 163938 164443 165247 166044 166982 168188 169400 170386 171263 172070 172553 172726
54104 172726 173115 173920 174449 173938 172598 171376 170975 171505 172636 173648 173764 172974 172151 171984 172309 172886 174037
54087 174037 175903 177836 179398 181293 184308 187920 191169 194507 199362 205863 212176 216324 217755 216959
54073 216959 214557 211186 207483 203761 200057 196611 193806 191610 189697 188172 187530 187766 188188 188322 188386 188668
54057A88668L27J03k6Q6L12O66J220J777K066K185K406K710K890K959L086L331
54041B14766L651M011M288M333M284M508N076N665O104O587P238P890Q431Q853
54027B95685Q855Q019O559N267M473L682K466J054k21j362k279k698k823l356
54013C23321m389n130n175n275o081o987p017o269n600n319n104m812m538m089
53999B47536l221k263j814j909k092k158k241k289k064j668j488j597j681j593
53985B19458j580j831k125k141j937j902k230k536k236j343n83m44m51J26J149
53970A99394J853K006K027J976J402L54l55l42k60p23j286j084n8J095J779J963
53954B09741K006K315K888L163K745K183K388L224L655L420L562M862O780Q511
$$ plain form
54057 188668 188995 189098 189072 189158 189470 190136 191356 193133 195199 197384 199790 202500 205390 208349 211435 214766
54041 214766 218417 222428 226716 231049 235333 239841 244917 250582 256686 263273 270511 278401 286832 295685
54027 295685 304540 312559 319118 324385 328858 332540 335006 336060 335839 334477 332198 329500 326677 323321
54013 323321 318932 313802 308627 303352 297271 290284 283267 276998 271398 266079 260975 256163 251625 247536
53999 247536 244315 242052 240238 238329 236237 234079 231838 229549 227485 225817 224329 222732 221051 219458
53985 219458 217878 216047 213922 211781 209844 207942 205712 203176 200940 199597 199014 198570 198119 198245 199394
53970 199394 201247 203253 205280 207256 208658 209012 208657 208315 208055 207332 206046 204962 204904 205999 207778 209741
53954 209741 211747 214062 216950 220113 222858 225041 227429 230653 234308 237728 241290 246152 252932 261443
53940B61443J0124J1912J3524J4702J5984J7598J8211J6062J1151N315K13l848
53928C92391p121r387j0060q901o454l912k312j649j013K20J644K617L217L973
53914C53253N037O179P227P977Q034P275O223N450M828L897K680J611Q58J95n58
53899D20166j374k175k791k999k918l129m079n562p031q058q373p838o837o197
53885C50805o334o756o753o267n705n284m947m661m444m321m371m548m358l368
53871B78688k159k019l270m638m785l861k941k570k494k413k295k262k544l265
53857B37172l953l849k974k248k161k097j521r61j073j464j355q25n29o09p24
53842B10829p68p92n95j17J94Q5R2O62J244J100N28K78K06m30j558k205j808p26
$$ plain form
53940 261443 271567 283479 297003 311705 327689 345287 363498 379560 390711 396026 396239 392391
53928 392391 385270 375883 365823 356922 350468 346556 344244 342595 341582 341802 343446 346063 349280 353253
53914 353253 358290 364469 371696 379673 387707 394982 401205 406655 411483 415380 418060 419671 420529 420724 420166
53899 420166 418792 416617 413826 410827 407909 404780 400701 395139 388108 380050 371677 363839 357002 350805
53885 350805 344471 337715 330962 324695 318990 313706 308759 304098 299654 295333 290962 286414 282056 278688
53871 278688 276529 274510 271240 266602 261817 257956 255015 252445 249951 247538 245243 242981 240437 237172
53857 237172 233219 229370 226396 224148 221987 219890 218369 217408 216335 214871 213516 212691 212162 211553 210829
53842 210829 210061 209269 208674 208557 208751 208836 208928 209590 210834 211934 212462 212740 212946 212516 210958 208753 206945 206219
53824B06219M37J305J614J359J053J173J549J697J535J222P72L87P32K062L470
53809B26586L845L237K559K361K633L350M267M630M069L471L918N137N985O077
53795B82125N888N553M809L903L365K991K187J216Q83J069Q52R2l73k50k36p27
53779C13347j322j872k797l960m464m083l796m327n080n174m678m167l813l494
53765B60320l291l231l056k656k346k370k580k810l051l118k774k319k345k692
53751B21681k450j324k31j16q18j554j953k066j905j470r04l22L19R54J358J520
53735B10719J657J811J815J669J402P19n79j853k065j052L60J542K521L158K906
53720B24730J798P69N68R52J329J427J105L40k64J10J233J870J560J293J868K625
$$ plain form
53824 206219 206656 207961 209575 210934 211987 213160 214709 216406 217941 219163 219935 220322 221054 223116 226586
53809 226586 230431 233668 236227 238588 241221 244571 248838 253468 257537 261008 264926 270063 276048 282125
53795 282125 288013 293566 298375 302278 305643 308634 310821 312037 312920 313989 314841 314933 314560 314310 314074 313347
53779 313347 312025 310153 307356 303396 298932 294849 291053 286726 281646 276472 271794 267627 263814 260320
53765 260320 257029 253798 250742 248086 245740 243370 240790 237980 234929 231811 229037 226718 224373 221681
53751 221681 219231 217907 217676 217560 216742 215188 213235 211169 209264 207794 206890 206568 206887 207841 209199 210719
53735 210719 212376 214187 216002 217671 219073 219792 219213 217360 215295 214243 214603 216145 218666 221824 224730
53720 224730 226528 227297 227865 228817 230146 231573 232678 233018 232754 232864 234097 235967 237527 238820 240688 243313
53704B43313K697K470K741L226L187K902L216L960M086L354K678K679K929K819
53690B86257K371J852J305Q64Q82J397J819J543N92n32j405j888k034k043k096
53675B88884k145j935j362o93l27m07o84p06k22N15Q79M71l51p50l08M67P27K70
53657B82323k76l17o5j19n13o02j4P54R53M44k83p28o78j68M98Q56O98L35K16
53638B83314N12J180K071K695K381J127j2n3P73J524J844K094K430K643K776L119
53622C10418L518L417K683J873J605K162L582N428O659O524N602N173N542N857
53608C70043N558N039M659M145L331K615K253J942J572J587K086K305J597L69
53594D09101n11p62o29l02M1K9n08j223j690j801j582j060n74o47j218j591j501
$$ plain form
53704 243313 246010 248480 251221 254447 257634 260536 263752 267712 271798 275152 277830 280509 283438 286257
53690 286257 288628 290480 291785 292649 293531 294928 296747 298290 298882 298350 296945 295057 293023 290980 288884
53675 288884 286739 284804 283442 282749 282422 282015 281331 280625 280403 280918 281797 282268 281917 281167 280859 281326 282053 282323
53657 282323 282047 281730 281665 281546 281033 280431 280417 281171 282124 282568 282285 281557 280879 280711 281209 282065 282763 283098 283314
53638 283314 283826 285006 287077 289772 292153 293280 293268 293215 293988 295512 297356 299450 301880 304523 307299 310418
53622 310418 313936 317353 320036 321909 323514 325676 329258 334686 341345 347869 353471 358644 364186 370043
53608 370043 375601 380640 385299 389444 392775 395390 397643 399585 401157 402744 404830 407135 408732 409101
53594 409101 408590 407828 407199 406897 406938 406967 406459 405236 403546 401745 400163 399103 398529 397882 396664 395073 393572
53577C93572j544k153k761k654j986j346q28k10L75O37O32N28K32k41m66k33j6
53560C81538j52j79L19P42L14n07n72J61O00K49j13J59N68M41Q7K89J055J689
53542C86688J855J969K482L248L788L905L835L880M091M316M455M534M660N015
53528D38721N784O887P934Q611R161J0106J1554J3097J4312J5032J5101J4496
53516E70796J3752J3773J4847J6290J7333J7970J8648J9540K0515K1528K2612
53505G67604K3640K4396K4739K4562K3939K3384K3512K4108K4116K2877K0985
53494A027862J9423J8422J7689J7273J7423J7907J8250J8481J8921J9320J9043
53483A230014J8149J7509J7613J7963J7957J7724J7614J7339J6223J4173J1889
$$ plain form
53577 393572 392028 389875 387114 384460 382474 381128 380300 380090 380465 381102 381734 382262 382494 382253 381787 381554 381538
53560 381538 381386 381207 381526 382268 382582 382075 381503 381664 382264 382513 382400 382559 383127 383568 383655 383944 384999 386688
53542 386688 388543 390512 392994 396242 400030 403935 407770 411650 415741 420057 424512 429046 433706 438721
53528 438721 444505 451392 459326 467937 477098 487204 498758 511855 526167 541199 556300 570796
53516 570796 584548 598321 613168 629458 646791 664761 683409 702949 723464 744992 767604
53505 767604 791244 815640 840379 864941 888880 912264 935776 959884 984000 1006877 1027862
53494 1027862 1047285 1065707 1083396 1100669 1118092 1135999 1154249 1172730 1191651 1210971 1230014
53483 1230014 1248163 1265672 1283285 1301248 1319205 1336929 1354543 1371882 1388105 1402278 1414167
53472A414167J0036Q495O531L605K3l252n474o761p861r302j0986j2517j3627
53459A373077j4130j3815j2756j1651j1492j2772j5088j7536j9333k0104j9924
53448A204476j9306j8921j8971j8983j8463j7618j6995j6561j5617j3779j1430
53437A017832r104o952n082l823l192k658j919j389j336j090Q0J730K805L222
53423I89124L900N274O767P950R240J1106J3219J4887J5887J6570J7456J8898
53411A130278K0798K2609K3961K5265K7159K9553L1715L3346L4845L6504L8109
53400A454142L9453M0696M2099M3869M6118M8396M9686M9715M9928N1885N4833
53389A970820N6326N5479N3974N3363N2999N1601M9456M7690M6357M4646M2419
$$ plain form
53472 1414167 1424203 1432698 1439229 1442834 1442857 1439605 1434131 1427370 1419509 1410207 1399221 1386704 1373077
53459 1373077 1358947 1345132 1332376 1320725 1309233 1296461 1281373 1263837 1244504 1224400 1204476
53448 1204476 1185170 1166249 1147278 1128295 1109832 1092214 1075219 1058658 1043041 1029262 1017832
53437 1017832 1008728 1001776 996694 992871 989679 987021 985102 983713 982377 981287 981367 983097 985902 989124
53423 989124 993024 998298 1005065 1013015 1022255 1033361 1046580 1061467 1077354 1093924 1111380 1130278
53411 1130278 1151076 1173685 1197646 1222911 1250070 1279623 1311338 1344684 1379529 1416033 1454142
53400 1454142 1493595 1534291 1576390 1620259 1666377 1714773 1764459 1814174 1864102 1915987 1970820
53389 1970820 2027146 2082625 2136599 2189962 2242961 2294562 2344018 2391708 2438065 2482711 2525130
53378B525130M0268L8329L6043L2880K8626K3336J7672J2765Q973N238L88n556
53366B764092j2026j9042k6616l3599l8521m1355m3347m5239m6703m7436m7716
53355B362492m7752m7449m6908m6331m5321m3192m0140l7368l5808l5393l5738
53344A901092l6772l8326l9695m0121l9445l7996l6104l3986l1881l0077k8623
53333A508066k7077k4766k1547j8286j6106j5167j4720j4384j4584j5462j6335
53322A309632j6752j7157j7784j7772j6430j4609j3625j3319j2444j0694q956
53311A150090p700o394m681k977j593k88J044K133L005M093N436O579P532Q939
53297A165218J1071J3422J5661J8075K0688K2779K3888K4551K5464K6431K6783
$$ plain form
53378 2525130 2565398 2603727 2639770 2672650 2701276 2724612 2742284 2755049 2764022 2769260 2769648 2764092
53366 2764092 2752066 2733024 2706408 2672809 2634288 2592933 2549586 2504347 2457644 2410208 2362492
53355 2362492 2314740 2267291 2220383 2174052 2128731 2085539 2045399 2008031 1972223 1936830 1901092
53344 1901092 1864320 1825994 1786299 1746178 1706733 1668737 1632633 1598647 1566766 1536689 1508066
53333 1508066 1480989 1456223 1434676 1416390 1400284 1385117 1370397 1356013 1341429 1325967 1309632
53322 1309632 1292880 1275723 1257939 1240167 1223737 1209128 1195503 1182184 1169740 1159046 1150090
53311 1150090 1142390 1135996 1131315 1128338 1126745 1126457 1127501 1129634 1132639 1136732 1142168 1148747 1156279 1165218
53297 1165218 1176289 1189711 1205372 1223447 1244135 1266914 1290802 1315353 1340817 1367248 1394031
53286A394031K6369K5489K4240K2612K0943J9662J8568J6962J4460J1386Q290
53275A603012N360K388q19m096o933q943j0293j1564j3206j5260j7560j9908k1948
53262A480230k3219k3583k3528k3769k4561k5530k6222k6646k7092k7475k7257
53251A201348k6204k4856k3831k3017k2055k1363k1747k2942k3608k3121k2444
53240I46160k2602k3195k3199k2503k1674k0782j9487j7924j6523j5160j3420
53229G29691j1470r837q560p513p244q347j0132j1180j1300j1734j3110j4436
53217F04828j4674j4256j4251j4781j5134j4892j4234j3365j2323j1294j0550
53206D55074j0098r598q695p376o079n430n646o254o629o696o796p006p040o798
$$ plain form
53286 1394031 1420400 1445889 1470129 1492741 1513684 1533346 1551914 1568876 1583336 1594722 1603012
53275 1603012 1608372 1610760 1609941 1605845 1598912 1589969 1579676 1568112 1554906 1539646 1522086 1502178 1480230
53262 1480230 1457011 1433428 1409900 1386131 1361570 1336040 1309818 1283172 1256080 1228605 1201348
53251 1201348 1175144 1150288 1126457 1103440 1081385 1060022 1038275 1015333 991725 968604 946160
53240 946160 923558 900363 877164 854661 832987 812205 792718 774794 758271 743111 729691
53229 729691 718221 708384 699824 692311 685067 676720 666588 655408 644108 632374 619264 604828
53217 604828 590154 575898 561647 546866 531732 516840 502606 489241 476918 465624 455074
53206 455074 444976 435378 426683 419307 413228 407798 402152 395898 389269 382573 375777 368771 361731 354933
53192C54933o519o332o078n632n087m567m155l956l933l802l420l062k926k696
53178B92768k078j496j543k033k308k284k361k481k247j921k194k841k708j382
53164B62891Q4O46M88K17k54j208k099k059j159l88m07q99j185j024o52l32r4
53147B52566O7l1n52j125r95J2J013J075L67k24m22o71j052j042m51J91M80O19
53129B49825P74O73K56J03O84J596K001J632J042R18J363J708J188q6j034q71
53113B61772j27J62l8N4N34N82j23q50j009j038j575k443l005k916k148q12N50
53096B47570J069M14p83j646j842j498q75l45j73j01L07Q06P02O3j98K71O59L07
53078B44707k05k9O37R18M85k46p76q61n96n10j138k097k269j285j50J89M0J07
$$ plain form
53192 354933 348414 342082 336004 330372 325285 320718 316563 312607 308674 304872 301452 298390 295464 292768
53178 292768 290690 289194 287651 285618 283310 281026 278665 276184 273937 272016 269822 266981 264273 262891
53164 262891 262975 263621 264109 264326 264072 262864 260765 258706 257547 257159 256752 255853 254668 253644 252992 252660 252566
53147 252566 252633 252602 252050 250925 249930 249942 250955 252030 252397 252173 251751 251080 250028 248986 248535 248726 249206 249825
53129 249825 250599 251272 251528 251631 252315 253911 255912 257544 258586 259504 260867 262575 263763 263677 262643 261772
53113 261772 261645 261807 261769 261823 262357 262939 262816 261966 260957 259919 258344 255901 252896 249980 247832 247020 247570
53096 247570 248639 249053 248270 246624 244782 243284 242409 242064 241891 241790 242097 242903 243605 243668 243470 243741 244400 244707
53078 244707 244502 244473 245110 246028 246513 246267 245491 244630 244034 243524 242386 240289 238020 236735 236585 236774 236814 236921
53060B36921J90k37p63n30L02O37Nq79j120n82L14J100J469J457J472J777K048
53043B43581J787J089N10K96J59j86o24q92q81o59m03l25n32q95j097p72K19J428
53025B41803J966J431N27J92K92m0q35j037j67Q13Q61K12k95n00p09q12m68J00
53007B43334M02M19M53M94M18N37J185J913J822P07o81j489j380m52R50K189K631
52990B53452K064Q78j85m44J71R06R20L64J97P78J389J418J215J284J355J054
52974B66816P96J201K028K545K551K329J878J052K18p2N5m6n80j083j055m61K72
52957B78444L94n45j900k296j397n48r31j804j742r46q94j905k571j850m38M17
52941B59488M40J35j52l80n13n24m74l93l11l48m76l46K52Q45Q29L38Jm8k16o27
$$ plain form
53060 236921 237111 236874 236111 235581 235883 236520 236525 235646 234526 233944 234258 235358 236827 238284 239756 241533 243581
53043 243581 245368 246457 246967 247263 247422 247236 246612 245720 244839 244180 243777 243452 242920 242025 240928 240156 240375 241803
53025 241803 243769 245200 245727 245919 246211 246171 245336 244299 244132 244945 245806 246018 245723 245223 244514 243702 243234 243334
53007 243334 243736 244155 244608 245102 245520 246057 247242 249155 250977 251684 251003 249514 248134 247682 248632 250821 253452
52990 253452 255516 256394 256209 255765 255936 256842 257762 258126 258323 259101 260490 261908 263123 264407 265762 266816
52974 266816 267612 268813 270841 273386 275937 278266 280144 281196 281414 281342 281397 281351 280771 279688 278633 278172 278444
52957 278444 278838 278293 276393 274097 272700 272152 271221 269417 267675 266729 265835 263930 261359 259509 259071 259488
52941 259488 259928 260063 259911 259531 259018 258494 258020 257627 257316 256968 256492 256146 256398 257243 258072 258410 258411 258363 258147 257520
52921B57520j011j398k154l188l776l386k172o17P89J532J429J001R00R85O73
52906B47127R3N3P07J207R33K84j65m85q77j004m81L70Q20O01N0m08o46p98j023
52887B46358j182q18K50J339J453N29l74l46L79R62J029Q28O55N21L77L03M28
52870B52691P46J071J281J537K014K392K016Q22k84m63L3L77L81N06R15J294J430
52853B68759J353Q29m26k063l270l776l996m176m102l739l415l167k651j879j370
52838B32911j297j213q87p28j023j383j350r70m68J04O16Q09Q12J128J787K108
52822B30956J684Q97J88m68r06n53N71J349J011L12L61Q64P22k8k19N49J314J375
52804B39979J287J704K111J630M81l22m93q02j766k778k977k476k147k317k328
$$ plain form
52921 257520 256509 255111 252957 249769 245993 242607 240435 239818 240607 242139 243568 244569 245469 246454 247127
52906 247127 247220 247273 247980 249187 250120 250404 250239 249754 248877 247873 247392 247762 248582 249183 249233 248825 248179 247381 246358
52887 246358 245176 244358 244608 245947 247400 247929 247555 247209 247588 248550 249579 250407 251062 251583 251960 252263 252691
52870 252691 253437 254508 255789 257326 259340 261732 263748 264570 264286 263823 263856 264233 264614 265120 266035 267329 268759
52853 268759 270112 270941 270515 268452 265182 261406 257410 253234 249132 245393 241978 238811 236160 234281 232911
52838 232911 231614 230401 229514 228786 227763 226380 225030 224060 223592 223696 224312 225121 225933 227061 228848 230956
52822 230956 232640 233537 233725 233257 232351 231798 232369 233718 234729 235041 235402 236266 236988 236960 236741 237290 238604 239979
52804 239979 241266 242970 245081 246711 247192 246870 246377 245575 243809 241031 238054 235578 233431 231114 228786
52789B28786j533k11Q23J197J109P82L24lO5L45L88K38M18J045J477J207N81K36
52771B37274J78l4m80q08q63r16j207j659k044k183j891j090m8O99Q43O50O51
52754B27072J082J645J856J526R09L83O3k06n14o86m92P7Q63J746K670L445L758
52737B45197L489K953K593K457K213J711J291J267J401J207O33Q2j81j63J83Q25
52721B67158J203O38o33j570j752j919k587k992k230q28p9k32m12k25k98r74j521
52704B50747j102K0Q31P58J67j55J43O23N01l42j071q89m6N68N77L25R1j37k44
52685B51365QM37N26J35l66p21r54r34m49K00L56j37p54j112j293j280q14o0L01
52666B44454J9l30j90K46N08M97L10l3k84O2J065J988K109J617J333J835L071
$$ plain form
52789 228786 227253 227042 227865 229062 230171 230953 231277 231274 231339 231684 232072 232310 232728 233773 235250 236457 237038 237274
52771 237274 237452 237418 236938 236130 235267 234351 233144 231485 229441 227258 225367 224277 224229 224928 225771 226421 227072
52754 227072 228154 229799 231655 233181 234090 234473 234536 234330 233816 233130 232638 232715 233578 235324 237994 241439 245197
52737 245197 248686 251639 254232 256689 258902 260613 261904 263171 264572 265779 266412 266494 266313 266150 266333 267158
52721 267158 268361 268999 268366 266796 265044 263125 260538 257546 255316 254488 254409 254177 253765 253540 253242 252268 250747
52704 250747 249645 249665 250496 251254 251421 251266 251409 252032 252533 252191 251120 250231 250185 250753 251330 251655 251746 251609 251365
52685 251365 251373 251810 252336 252471 252105 251384 250430 249496 249047 249247 249603 249466 248712 247600 246307 245027 244213 244153 244454
52666 244454 244473 244143 243953 244199 244707 245204 245514 245481 245197 245259 246324 248312 250421 252038 253371 255206 258277
52649B58277M451N034M120J983k39j683k455k955l045k358j122j06J71j32n56
52634B59385q22r76j109j069n85K31P78P16N10P89J462J949K009J647O29j004
52618B64540k193j816l77M21l2p01q12r17j415j513o21M22O14M07P73J491J596
52601B59867R93L63j33p51j124o13M20Q99O32M39O32M80m39j438j694j236n85
52584B56712j2M07N76O22R37J615K216K356K115J677R34j44j124j475j171o38
52568B65603k33J0J46J38n9l60o00o93p22p95r07j032j212j384j253o00K54O75
52550B56976M61rl85o84q57o29m4K73l9m12l9R71J649J341L34n99r09n04K97R42
52530B58134J023N88N5j71P0O30J109J103N92rk38L0N86J063J158R15P86J105
$$ plain form
52649 258277 262728 267762 271882 273865 273626 271943 269488 266533 263488 261130 260008 259902 260073 259941 259385
52634 259385 258563 257587 256478 255409 254824 255055 255833 256549 257059 257848 259310 261259 263268 264915 265544 264540
52618 264540 262347 260531 260154 260575 260543 259842 259030 258113 256698 255185 254564 254986 255600 256007 256780 258271 259867
52601 259867 260860 261223 261090 260339 259215 258602 259022 259921 260553 260992 261624 262104 261665 260227 258533 257297 256712
52584 256712 256700 257107 257683 258305 259242 260857 263073 265429 267544 269221 270155 270011 268887 267412 266241 265603
52568 265603 265370 265380 265526 265664 265605 265245 264645 263952 263230 262435 261528 260496 259284 257900 256647 256047 256301 256976
52550 256976 257437 257428 257043 256359 255502 254873 254829 255102 255063 254651 254612 255583 257232 258573 258907 258308 257399 256895 257192 258134
52530 258134 259157 259745 259800 259629 259699 260329 261438 262541 263133 263124 262886 262916 263502 264565 265723 266638 267424 268529
52512B68529J577J690J528J648K151K533K545K496K517K206J364M12l04r91j800
52497B88101k393k542k508k442k073j509j484k100k228j064L89N87l67j055q80
52482B66432n90o46m25N80J754K088J392L60j89L5O08Q19N65N78J366K278K279
52465B79284J479J083J791L050L985M365M356L951L037J678R6j449k617l174l230
52450B97685l123l040k967k937k966k893k542j980j404r56q33j236j897k020j225
52435B65666j95J87L7J46O96J027O51j79r18j234j063n99j82R4M84J001J138O78
52417B67435K61N01J016J121J029J400K049K190J812J685K111K765L742N563P949
52402C02629R759J0421J0436J0080Q742N990K429j008l881n910o759o614o233
$$ plain form
52512 268529 270106 271796 273324 274972 277123 279656 282201 284697 287214 289420 290784 291196 290892 289901 288101
52497 288101 285708 283166 280658 278216 276143 274634 273150 271050 268822 267758 268147 268734 268367 267312 266432
52482 266432 265842 265196 264771 265351 267105 269193 270585 270945 270756 270791 271399 272218 272783 273361 274727 277005 279284
52465 279284 280763 281846 283637 286687 290672 295037 299393 303344 306381 308059 308155 306706 304089 300915 297685
52450 297685 294562 291522 288555 285618 282652 279759 277217 275237 273833 272877 272044 270808 268911 266891 265666
52435 265666 265471 265658 265695 265841 266537 267564 268215 268036 267118 265884 264821 264222 264040 264134 264618 265619 266757 267435
52417 267435 267696 268197 269213 270334 271363 272763 274812 277002 278814 280499 282610 285375 289117 294680 302629
52402 302629 312388 322809 333245 343325 352067 358057 360486 359478 355597 349687 342928 336314 330081
52389C30081n929n217l860k498j707j223o33j12J48M34Q80J008O65O20J451K433
52373C16541K499J812J488K015K978M028N209O290O583N716M047K193N90n33j127
52358C60329j323j239q78l71n2mJ83P69J367J501J360J488J913K254K396K540
52342C72233K620K392K086K294L107L912M319M712N596O870Q027Q862R584J0426
52328D47040J1412J2514J3714J4945J6096J7179J8387J9839K1278K2071K1749
52317F36224K0574J9447J9094J9342J9430J8994J8518J8723J9647K0568K0799
52306H51360K0241J9098J7475J5556J3944J3182J3015J2640J1824J1146J0832
52295A010313J0094Q162N464L042J155q14l207n662p749r320j0181j0141r477
$$ plain form
52389 330081 324152 318935 315075 312577 310870 309647 309014 308902 309050 309484 310364 311372 312037 312657 314108 316541
52373 316541 319040 320852 322340 324355 327333 331361 336570 342860 349443 355159 359206 361399 361989 361456 360329
52358 360329 359006 357767 356889 356518 356466 356462 356645 357414 358781 360282 361642 363130 365043 367297 369693 372233
52342 372233 374853 377245 379331 381625 384732 388644 392963 397675 403271 410141 418168 427030 436614 447040
52328 447040 458452 470966 484680 499625 515721 532900 551287 571126 592404 614475 636224
52317 636224 656798 676245 695339 714681 734111 753105 771623 790346 809993 830561 851360
52306 851360 871601 890699 908174 923730 937674 950856 963871 976511 988335 999481 1010313
52295 1010313 1020407 1028569 1034033 1037075 1038230 1037416 1034209 1028547 1020798 1011478 1001297 991156 981679
52282I81679q731p926o602m739k942j589m20Q25J997L108M566O475Q302R663J0871
52267I94537J2305J3679J4499J4726J4578J4075J3360J3021J3478J4299J4622
52256A147179J4167J3378J2782J2621J2902J3339J3354J2537J0993Q965O393L233
52244A281843m0k713m552n900p113q292r405j0350j0957j1188j1259j1275j0987
52231A177812j0228r322q689q195p392o279n355m860m475l834k949j950p75N87
52217A104096J743K193J899J448J498K178L116L988M827N733O540P018P256P483
52203A161016P539P012O020N388N708O517O776O037M820L956L858M406N229N962
52189A240244O371O379O060N589N084M440L342J548q79l609o153p977q818r123
$$ plain form
52282 981679 972948 965022 958420 953681 950739 949150 948730 949555 951552 954660 959226 965701 974003 983666 994537
52267 994537 1006842 1020521 1035020 1049746 1064324 1078399 1091759 1104780 1118258 1132557 1147179
52256 1147179 1161346 1174724 1187506 1200127 1213029 1226368 1239722 1252259 1263252 1272217 1278610 1281843
52244 1281843 1281803 1279090 1274538 1268638 1261525 1253233 1243828 1233478 1222521 1211333 1200074 1188799 1177812
52231 1177812 1167584 1158262 1149573 1141378 1133986 1127707 1122352 1117492 1113017 1109183 1106234 1104284 1103509 1104096
52217 1104096 1105839 1108032 1109931 1111379 1112877 1115055 1118171 1122159 1126986 1132719 1139259 1146277 1153533 1161016
52203 1161016 1168555 1175567 1181587 1186975 1192683 1199200 1205976 1212013 1216833 1220789 1224647 1229053 1234282 1240244
52189 1240244 1246615 1252994 1259054 1264643 1269727 1274167 1277509 1279057 1278178 1274569 1268416 1260439 1251621 1242498
52175A242498r711j0724j1273j0647r408q613q265p414n772m199l416l032k220
52162A147804p30J121K816L723L462K539K026K220K244J351j3r60j294j316j019
52147A163974k64N78R11O62K48nkK81O68P70N01K72L18K90J9J85J499L559N274
52128A179738O325P520R701J2855J6310J9360K1725K3683K5736K7922K9658L0422
52116A410955L0296K9609K8529K7356K6610K6231K5242K2933J9928J7322J5153
52105A680164J2674R846P481N937M712L539K872K961L205K804J560l15k630n143
52091A729667p511r644j1803j4054j5981j7179j7718j7914j7813j7166j5797j3840
52079A553247j1641r491p374n116k794p16J158L375O213R148J1549J3543J5569
$$ plain form
52175 1242498 1232787 1222063 1210790 1200143 1190735 1182122 1173857 1166443 1160671 1156472 1153056 1150024 1147804
52162 1147804 1147074 1148195 1151011 1154734 1158196 1160735 1162761 1164981 1167225 1168576 1168563 1167603 1166309 1164993 1163974
52147 1163974 1163710 1164288 1165199 1165861 1166109 1166104 1166102 1166383 1167051 1167821 1168322 1168594 1168912 1169202 1169221 1169406 1170905 1174464 1179738
52128 1179738 1186063 1193583 1203284 1216139 1232449 1251809 1273534 1297217 1322953 1350875 1380533 1410955
52116 1410955 1441251 1470860 1499389 1526745 1553355 1579586 1604828 1627761 1647689 1665011 1680164
52105 1680164 1692838 1702684 1710165 1716102 1720814 1724353 1727225 1730186 1733391 1736195 1737755 1737440 1734810 1729667
52091 1729667 1722156 1712512 1700709 1686655 1670674 1653495 1635777 1617863 1600050 1582884 1567087 1553247
52079 1553247 1541606 1532115 1524741 1519625 1516831 1516115 1517273 1520648 1526861 1536009 1547558 1561101 1576670
52066A576670J7383J8251J8043J7426J6955J6577J6060J5273J4026J2262J0500
52055A749426R400Q816P921O392M759L345J617j036m417p883j1060j3828j6078
$$ plain form
52066 1576670 1594053 1612304 1630347 1647773 1664728 1681305 1697365 1712638 1726664 1738926 1749426
52055 1749426 1758826 1767642 1775563 1781955 1786714 1790059 1791676 1790640 1786223 1778340 1767280 1753452 1737374
$$ [...]
##END NTUPLES=NMR SPECTRUM
##END=
