##TITLE=AC1588_HBRAH13318_8313931_AQnde7Me39
##JCAMPDX= 6.0         $$ Bruker NMR JCAMP-DX V2.0
##DATA TYPE= NMR SPECTRUM
##DATA CLASS= NTUPLES
##ORIGIN= BRUKER
##OWNER= Administrator
$$ 1.72 TOPSPIN		Version 2.1
$$ 2013-11-09 15:42:16.315 -0800  Administrator@X
$$ Compression mode = diff/dup
##.OBSERVE FREQUENCY= 400.02188249412
##.OBSERVE NUCLEUS= ^1H
##.ACQUISITION MODE= SIMULTANEOUS (DQD)
##.ACQUISITION SCHEME= undefined
##.AVERAGES= 64
##.DIGITISER RES= 22
##SPECTROMETER/DATA SYSTEM= spect
##.PULSE SEQUENCE= noesygpps1d.comp
##.SOLVENT NAME= COFFEE_meoh
##.SHIFT REFERENCE= INTERNAL, COFFEE_meoh, 1, 14.96085
##AUDIT TRAIL= $$ (NUMBER, WHEN, WHO, WHERE, PROCESS, VERSION, WHAT)
$$ ##TITLE= Audit trail, TOPSPIN		Version 2.1
$$ ##JCAMPDX= 5.01
$$ ##ORIGIN= Bruker BioSpin GmbH
$$ ##OWNER= Administrator
$$ $$ E:\/data/COFFEE/nmr/AC1588_HBRAH13318_8313931_AQnde7Me39/12/pdata/1/auditp.txt
$$ ##AUDIT TRAIL=  $$ (NUMBER, WHEN, WHO, WHERE, PROCESS, VERSION, WHAT)
(   1,<2013-11-09 15:42:11.734 -0800>,<Administrator>,<X>,<go>,<TOPSPIN 2.1>,
      <created by zg
	started at 2013-11-09 15:30:40.462 -0800,
	POWCHK enabled, PULCHK disabled,
       configuration hash MD5:
       C8 4E 4E 5D D3 5C D8 9E 9F 52 82 E0 59 8A DE 15
       data hash MD5: 64K
       EA F4 A4 16 A7 C4 BE 7C 6E 95 F7 22 E1 6B BC 8D>)
(   2,<2013-11-09 15:42:14.546 -0800>,<Administrator>,<X>,<proc1d>,<TOPSPIN 2.1>,
      <Start of raw data processing
       efp LB = 0.3 FT_mod = 6 PKNL = 1 PHC0 = 0 PHC1 = 0 SI = 128K 
       data hash MD5: 128K
       36 95 CB 7F EF 36 0C B5 92 E6 BF 89 1D EC 9F B5>)
(   3,<2013-11-09 15:42:15.451 -0800>,<Administrator>,<X>,<proc1d>,<TOPSPIN 2.1>,
      <pk PHC0 = -87.24243 PHC1 = 0 
       data hash MD5: 128K
       9D B3 50 6B 85 40 EF 9C AE BB B3 2C C7 3D 6E 44>)
(   4,<2013-11-09 15:42:15.813 -0800>,<Administrator>,<X>,<proc1d>,<TOPSPIN 2.1>,
      <abs ABSG = 1 
       data hash MD5: 128K
       A3 79 C9 3A 1C 3D CB E6 9A 55 B0 B1 BC A9 6B 5E>)
(   5,<2013-11-09 15:42:15.897 -0800>,<Administrator>,<X>,<proc1d>,<TOPSPIN 2.1>,
      <abs ABSG = 2 
       data hash MD5: 128K
       17 B7 79 B7 E7 7D A6 BC 10 94 90 A0 44 FC 71 6C>)
(   6,<2013-11-09 15:42:15.980 -0800>,<Administrator>,<X>,<proc1d>,<TOPSPIN 2.1>,
      <abs ABSG = 3 
       data hash MD5: 128K
       DA 14 62 8C 01 9B C2 9B 3B CD E7 70 80 EB 3D 00>)
(   7,<2013-11-09 15:42:16.050 -0800>,<Administrator>,<X>,<proc1d>,<TOPSPIN 2.1>,
      <abs ABSG = 4 
       data hash MD5: 128K
       69 63 4B 8E 23 6A 66 A4 34 73 16 16 F3 07 42 80>)
(   8,<2013-11-09 15:42:16.148 -0800>,<Administrator>,<X>,<proc1d>,<TOPSPIN 2.1>,
      <abs ABSG = 5 
       data hash MD5: 128K
       97 33 87 D6 CF E2 5A 37 C5 26 02 13 F0 C6 9C 4F>)
$$ ##END=
$$ 
$$ $$ hash MD5
$$ $$ E0 28 EB D4 E4 13 09 23 0E EB 9E 1D C5 DA 99 D3
##$RELAX= 
##$RELAX= 
##$RELAX= 
##$RELAX= 
##$RELAX= 
##$RELAX= 
##$RELAX= 
##$RELAX= 
$$ Bruker specific parameters
$$ --------------------------
##$DU= <E:\>
##$EXPNO= 12
$$ [...]
##$TP07= 0
##$TPNAME0= <>
##$TPNAME1= <>
##$TPNAME2= <>
##$TPNAME3= <>
##$TPNAME4= <>
##$TPNAME5= <>
##$TPNAME6= <>
##$TPNAME7= <>
##$TPOAL= (0..7)
0.5 0.5 0.5 0.5 0.5 0.5 0.5 0.5
##$TPOFFS= (0..7)
0 0 0 0 0 0 0 0
##$TUNHIN= 0
##$TUNHOUT= 0
##$TUNXOUT= 0
##$USERA1= <user>
##$USERA2= <user>
##$USERA3= <user>
##$USERA4= <user>
##$USERA5= <user>
##$V9= 5
##$VALIST= <valist>
##$VCLIST= <CCCCCCCCCCCCCCC>
##$VD= 0
##$VDLIST= <DDDDDDDDDDDDDDD>
##$VPLIST= <PPPPPPPPPPPPPPP>
##$VTLIST= <TTTTTTTTTTTTTTT>
##$WBST= 1024
##$WBSW= 4
##$XGAIN= (0..3)
0 0 0 0
##$XL= 0
##$YL= 0
##$YMAX_a= 6200307
##$YMIN_a= -12209498
##$ZGOPTNS= <>
##$ZL1= 120
##$ZL2= 120
##$ZL3= 120
##$ZL4= 120
##$ABSF1= 14.96085
##$ABSF2= -5.597332
##$ABSG= 5
##$ABSL= 3
##$ALPHA= 0
##$AQORDER= 0
##$ASSFAC= 0
##$ASSFACI= 0
##$ASSFACX= 0
##$ASSWID= 0
##$AUNMP= <proc_prof1d_extract.lims>
##$AXLEFT= 0
##$AXNAME= <>
##$AXNUC= <1H>
##$AXRIGHT= 0
##$AXTYPE= 0
##$AXUNIT= <>
##$AZFE= 0.1
##$AZFW= 0.1
##$BCFW= 0
##$BC_mod= 0
##$BYTORDP= 0
##$COROFFS= 0
##$CY= 15
##$DATMOD= 1
##$DC= 0
##$DFILT= <>
##$DTYPP= 0
##$F1P= 0
##$F2P= 0
##$FCOR= 0.5
##$FTSIZE= 131072
##$FT_mod= 6
##$GAMMA= 0
##$GB= 0
##$INTBC= 1
##$INTSCL= 1
##$ISEN= 128
##$LB= 0.3
##$LEV0= 0
##$LPBIN= 0
##$MAXI= 10000
##$MC2= 0
##$MEAN= 0
##$ME_mod= 0
##$MI= 0
##$NCOEF= 0
##$NC_proc= -2
##$NLEV= 6
##$NOISF1= 0
##$NOISF2= 0
##$NSP= 0
##$NTH_PI= 0
##$NZP= 0
##$OFFSET= 14.96085
##$PC= 1
##$PHC0= -87.24243
##$PHC1= 0
##$PH_mod= 1
##$PKNL= yes
##$PPARMOD= 0
##$PPDIAG= 0
##$PPIPTYP= 0
##$PPMPNUM= 2147483647
##$PPRESOL= 1
##$PSCAL= 4
##$PSIGN= 0
##$PYNMP= <proc.py>
##$REVERSE= no
##$SF= 400.020009697025
##$SI= 131072
##$SIGF1= 0
##$SIGF2= 0
##$SINO= 400
##$SIOLD= 131072
##$SPECTYP= <>
##$SREGLST= <1H.CDCl3>
##$SSB= 0
##$STSI= 131072
##$STSR= 0
##$SW_p= 8223.68421052631
##$SYMM= 0
##$S_DEV= 0
##$TDeff= 65536
##$TDoff= 0
##$TI= <>
##$TILT= no
##$TM1= 0
##$TM2= 0
##$TOPLEV= 0
##$USERP1= <user>
##$USERP2= <user>
##$USERP3= <user>
##$USERP4= <user>
##$USERP5= <user>
##$WDW= 1
##$XDIM= 131072
##$YMAX_p= 417854542
##$YMIN_p= -12333
##$CURPLOT= <Network HP LaserJet P1505>
##$CURPRIN= <$Network HP LaserJet P1505>
##$DFORMAT= <normdp>
##$LAYOUT= <+/1D_H.xwp>
##$LFORMAT= <normlp>
##$PFORMAT= <normpl>
##$SURQMSG= 1
$$ End of Bruker specific parameters
$$ ---------------------------------
##NTUPLES= NMR SPECTRUM
##VAR_NAME=  FREQUENCY,     SPECTRUM/REAL,   SPECTRUM/IMAG
##SYMBOL=    X,             R,               I
##VAR_TYPE=  INDEPENDENT,   DEPENDENT,       DEPENDENT
##VAR_FORM=  AFFN,          ASDF,            ASDF
##VAR_DIM=   131072,        131072,          131072
##UNITS=     HZ,            ARBITRARY UNITS, ARBITRARY UNITS
##FACTOR=    0.0627417313425164, 1,          1
##FIRST=     8223.62146879497, -1789,        -65354
##LAST=      0,             30,              -66790
##MIN=       0,             -12333,          0
##MAX=       8223.62146879497, 417854542,    0
$$ Real data points
##PAGE= N=1
##DATA TABLE= (X++(R..R)), XYDATA
$$ [...]
61697D39643l524m570m607l638k980l303l857l820l344k962k754k482k135j938
61683C93729k099k641l273l513l156k529k008j600j268j197j347j210o17l30j014
61668C65927k068k307j564o99k11J56N13N09P6l41m27j85N10J684K636K471J390
61651C68070O05P84J407J821J969J885J430R30J144K067K620K065J022M55M49
61636C88723N99R09J451J657Q58o63j857k087j630j143j058j395j863k124k149
61621C78228k126k008j525p82l54n85j145j546j654j521j246j189j773k779l405
61606C54590l354l293l793m442m504l930l194k575k142k050k269k389k167j929
61592C12559j997k208k405k819l427l478k478j183p32j162j564j495j331j360
$$ plain form
61697 439643 436119 431549 426942 423304 420324 417021 413164 409344 406000 403038 400284 397802 395667 393729
61683 393729 391630 388989 385716 382203 379047 376518 374510 372910 371642 370445 369098 367888 367271 366941 365927
61668 365927 363859 361552 359988 359289 359078 359234 359747 360256 360332 359991 359564 359379 359889 361573 364209 366680 368070
61651 368070 368675 369459 370866 372687 374656 376541 377971 378901 380045 382112 384732 386797 387819 388274 388723
61636 388723 389322 390231 391682 393339 394197 393534 391677 389590 387960 386817 385759 384364 382501 380377 378228
61621 378228 376102 374094 372569 371787 371433 370848 369703 368157 366503 364982 363736 362547 360774 357995 354590
61606 354590 351236 347943 344150 339708 335204 331274 328080 325505 323363 321313 319044 316655 314488 312559
61592 312559 310562 308354 305949 303130 299703 296225 293747 292564 291832 290670 289106 287611 286280 284920
61578B84920j380j244j108j017q42o21m73k67J72N99O56M93M76N23L34J02K60
61561B81583O31O37L58M26Q61R36M78L23J013J813J722Q65K11K23M81M86K64J00
61543B93411J51L81P12J015J097Q15L37J21M30Q99Q95M38K74P72J257R38L9o12
61525C03370q26j069j371j135j90P14P88P2q15j400j592j577j554j409p25N67
61509B91848J707J888J264O07K12r0p2O67J607J637P00p2j86m78j353j761q78
61492B97247L22M79q4j19L67L05l86o05K9N79M50K72N98Q96O59N34J348K661L258
61473C08810K808K128J881J852J592J150Q05N07mo80j154j242j164j084p21K17
61457C15701J303J573O73n81j094o52K11J101J931K436K245J564J101J104J009
$$ plain form
61578 284920 283540 282296 281188 280171 279329 278708 278235 277968 278140 278739 279395 279888 280364 280887 281221 281323 281583
61561 281583 282214 282851 283209 283635 284496 285432 285910 286233 287246 289059 290781 291646 291857 292080 292561 293047 293311 293411
61543 293411 293562 293943 294655 295670 296767 297582 297919 298040 298470 299369 300264 300702 300976 301748 303005 303943 303982 303370
61525 303370 302544 301475 300104 298969 298779 299493 300281 300353 299538 298138 296546 294969 293415 292006 291281 291848
61509 291848 293555 295443 296707 297314 297526 297436 297364 298031 299638 301275 301975 301903 301717 301239 299886 298125 297247
61492 297247 297569 298048 297964 297845 298212 298517 298131 297526 297555 298134 298584 298856 299454 300350 301009 301543 302891 305552 308810
61473 308810 311618 313746 315627 317479 319071 320221 321026 321533 321529 320849 319695 318453 317289 316205 315484 315701
61457 315701 317004 318577 319250 318669 317575 316923 317134 318235 320166 322602 324847 326411 327512 328616 329625
61442C29625L90l22m97k50j12o4M58J535K408K386J728J271J429J839J916J478
61426C45218P53J0n81q28n27K70J064J288Q88L98L62Q10J393J811J944J725J163
61409C57161N55L17M74N03r8j161j974k068j684j421j620k107k466k415j997j482
61393C38517j080p34k67L12P95J069J183J093O36o8m95k50M72J213J854K477K890
61376C49617K764K225J809J779J924K069K268K438K301J951J842J977J692O69
61362C77325l28l80L14P77O39M80Q78J766K855M046N168N795N662N047M535M518
61346D19097M998N645N964N647M848M009L381K936K676K742L151L659L943L781
61332D76477L099K100J266R30Q60N94J57j1J36L1o74j523j855j628j212p15N6
$$ plain form
61442 329625 330015 329693 329196 328946 328834 328770 329228 330763 333171 335557 337285 338556 339985 341824 343740 345218
61426 345218 345971 345981 345400 344572 344045 344315 345379 346667 347555 347953 348315 349125 350518 352329 354273 355998 357161
61409 357161 357716 358033 358507 359010 358912 357751 355777 353709 352025 350604 348984 346877 344411 341996 339999 338517
61393 338517 337437 336703 336436 336748 337543 338612 339795 340888 341524 341456 340961 340711 341183 342396 344250 346727 349617
61376 349617 352381 354606 356415 358194 360118 362187 364455 366893 369194 371145 372987 374964 376656 377325
61362 377325 376997 376617 376931 377708 378347 378827 379705 381471 384326 388372 393540 399335 404997 410044 414579 419097
61346 419097 424095 429740 435704 441351 446199 450208 453589 456525 459201 461943 465094 468753 472696 476477
61332 476477 479576 481676 482942 483872 484732 485326 485483 485472 485608 485639 484965 483442 481587 479959 478747 478032 478088
61315D78088J075K003K691L355M224N221O158P035P966Q877R537R932J0517J1780
61301E68459J3448J4426J3846J2044J0106Q423O257K951q72l816n219n712o291
61288F28050p212p991q205q065q133q633r224r473r373r169q781p771n945l695
61274E16380j688l59K33L23L83Q11J549K151K332K158J705J022N80J147K793M501
61258E36021N275N247N100M857M034K821K097K198K492K432K262K262K056J262
61244E80416L59K03Q43J443J349P11L3m49p82j027j194j271j135o20K01Q43Q31
61227E80754L45K93J430L450N181N853N882O187O982P678P853P789P922Q207Q334
61212F64140Q225Q025P769P395O941O464N854M962L851K789J994J599J772K637
$$ plain form
61315 478088 479163 481166 483857 487212 491436 496657 502815 509850 517816 526693 536230 546162 556679 568459
61301 568459 581907 596333 610179 622223 632329 640752 647009 649960 649088 645272 640053 634341 628050
61288 628050 620838 612847 604642 596577 588444 579811 570587 561114 551741 542572 533791 526020 520075 516380
61274 516380 514692 514333 514566 514889 515272 516083 517632 519783 522115 524273 525978 527000 527580 528727 531520 536021
61258 536021 541296 546543 551643 556500 560534 563355 565452 567650 570142 572574 574836 577098 579154 580416
61244 580416 580775 580978 581821 583264 584613 585324 585357 584908 584126 583099 581905 580634 579499 578879 579080 579923 580754
61227 580754 581099 581392 582822 586272 591453 597306 603188 609375 616357 624035 631888 639677 647599 655806 664140
61212 664140 672365 680390 688159 695554 702495 708959 714813 719775 723626 726415 728409 730008 731780 734417
61198G34417M002N337O164O508O930P989R641J1213J2083J2212J1819J0723Q558
61185H47596N630K928J005o26k491m159m853m749m784n299n788o030o532p427
61171H04421p908p438o862p355q589r083q320p537q023r482j0704j1172j1286
61158F90662j1355j1205j0784j0388j0072r415q172o767n799n303m804l953k835
61145E89810j812j284j493k333l418m436n312n942o023n423m504l753l267k835
61131E37975k380j890j102L11K205M034N462O562P448Q196R107J0570J2482J4295
61117F13275J5797J7376J9274K1029K2093K2664K3327K4147K4547K4188K3485
61106H51202K3081K2997K2556K1220J9316J7661J6419J4757J1929Q345M958J916
$$ plain form
61198 734417 738419 743756 749920 756428 763358 771347 780988 792201 804284 816496 828315 839038 847596
61185 847596 853226 856154 857159 856533 854042 849883 845030 840281 835497 830198 824410 818380 811848 804421
61171 804421 796513 789075 782213 774858 766269 757186 748866 741329 733306 723824 713120 701948 690662
61158 690662 679307 668102 657318 646930 636858 627443 619271 612504 606705 601402 596598 592645 589810
61145 589810 587998 586714 585221 582888 579470 575034 569722 563780 557757 552334 547830 544077 540810 537975
61131 537975 535595 533705 532603 532914 535119 539153 544615 551177 558625 566821 575928 586498 598980 613275
61117 613275 629072 646448 665722 686751 708844 731508 754835 778982 803529 827717 851202
61106 851202 874283 897280 919836 941056 960372 978033 994452 1009209 1021138 1029483 1034441 1036357
61094A036357j482n473r351j2514j5087j7251j8715j9406j9912k0592k0914k0352
61082H55308j9380j8720j8110j6860j5249j4349j4416j4422j3369j1421r533q442
61070F81037q099p737o534m547k722j629p17O06J795K099K159L338N555P180P319
61055F79103O887P028P693Q411R361J0796J2323J3535J4766J6446J8252J9609
61043H24210K0595K1664K2916K4291K6018K8188L0236L1552L2346L3286L4578
61032A129880L5937L7309L8981M1129M3652M6333M8815N0649N1699N2295N2732
61021A629411N3069N3663N5457N9274O5213P2896Q1834R1222J00203J08905J18654
61010B489801J30890J46700J67921J97521K38098K90807L56417M36056N30116
$$ plain form
61094 1036357 1034875 1029402 1020051 1007537 992450 975199 956484 937078 917166 896574 875660 855308
61082 855308 835928 817208 799098 782238 766989 752640 738224 723802 710433 699012 689479 681037
61070 681037 672938 665201 658667 654120 651398 649769 649052 649658 651453 653552 655711 659049 664604 671784 679103
61055 679103 685990 693018 700711 709122 718483 729279 741602 755137 769903 786349 804601 824210
61043 824210 844805 866469 889385 913676 939694 967882 998118 1029670 1062016 1095302 1129880
61032 1129880 1165817 1203126 1242107 1283236 1326888 1373221 1422036 1472685 1524384 1576679 1629411
61021 1629411 1682480 1736143 1791600 1850874 1916087 1988983 2070817 2162039 2262242 2371147 2489801
61010 2489801 2620691 2767391 2935312 3132833 3370931 3661738 4018155 4454211 4984327
61001D984327O38446P63355R10775J086575J293478J530804J785411K007508K097872
60992A7098551J947116J520195R12435L09613j22074l16083k95712j20130J33330
60983B1067241L47223L74485J17334l91040r94224j511925j839093j966977j939022
60974A3264002j805679j610602j391868j178229r84498q15263o71874n54002m58143
60965C793844l79440l15076k63964k24191j92941j68252j48908j33108j18982
60956A848982j06095r4861q4898p5279o6029n7865n0721m4087l8535l5350l4472
60945A160790l4281l3624l2744l1949l0737k8829k6866k5416k4219k3057k2417
60934H46651k2565k2676k1792k0185j8913j8327j7774j6661j5171j3783j2671
$$ plain form
61001 4984327 5622773 6386128 7296903 8383478 9676956 11207760 12993171 15000679 17098551
60992 17098551 19045667 20565862 21478297 21787910 21665836 21349753 21054041 20933911 21067241
60983 21067241 21414464 21788949 21906283 21515243 20521019 19009094 17170001 15203024 13264002
60974 13264002 11458323 9847721 8455853 7277624 6293126 5477863 4805989 4251987 3793844
60965 3793844 3414404 3099328 2835364 2611173 2418232 2249980 2101072 1967964 1848982
60956 1848982 1742887 1648026 1563128 1487849 1421820 1363955 1313234 1269147 1230612 1195262 1160790
60945 1160790 1126509 1092885 1060141 1028192 997455 968626 941760 916344 892125 869068 846651
60934 846651 824086 801410 779618 759433 740520 722193 704419 687758 672587 658804 646133
60923F46133j1732j0960j0499j0337j0072r190p741o464n988n989n564m443l293
60910E43861k705k418j820q33J37Q79J535K166K572K578K305K029J933J988K002
60895E56209J783J336Q50N01K70K9k87p11j352k370l783n411p018q465r599j0095
60879E11887r618q308o924o257o426o936p307p310o679n164l144j694j551k272
60865D32297k802k679k208j672r19J71J389K448L212L526L279K723K368K318K173
60850D45624J796J733K447L437L705K988J989J353R47L78k47n55o33r46j572k046
60834D60398k200k567l578m643m758l900l134l179l453k975j683l67L44L95j28
60819D24572j118k076k326j806j321j636k618l490l774l662l581l662l657l295
$$ plain form
60923 646133 634401 623441 612942 602605 592533 583343 575602 569138 563150 557161 551597 547154 543861
60910 543861 541156 538738 536918 536085 536222 537101 538636 540802 543374 545952 548257 550286 552219 554207 556209
60895 556209 557992 559328 560178 560679 560949 560978 560691 559980 558628 556258 552475 547064 540046 531581 521982 511887
60879 511887 502269 493961 487037 480780 474354 467418 460111 452801 446122 440958 437814 436120 434569 432297
60865 432297 429495 426816 424608 422936 422017 422188 423577 426025 429237 432763 436042 438765 441133 443451 445624
60850 445624 447420 449153 451600 455037 458742 461730 463719 465072 466019 466397 466150 465595 464962 464016 462444 460398
60834 460398 458198 455631 452053 447410 442652 438752 435618 432439 428986 426011 424328 423961 424305 424700 424572
60819 424572 423454 421378 419052 417246 415925 414289 411671 408181 404407 400745 397164 393502 389845 386550
60805C86550k672k313k680l591m263m099l361k819k779k740k084r40p9l3n73j100
60789C50424j297j243j104r73r14r02p33k64K64M48K93K46N87J060J288J239J132
60772C49551J100J166J324J490J547J634K073K843L408L422L294L540L856L386
60758C83634J942M11k54q3J08k93j158j984k428k431j984j107j53K23j96o83k91
60741C73273Q63J587J085j80j355k321l433m595n292n273m694l729k659k037k166
60726C39074k570k572k306k399k805k708j735m78L74P59Q36N18j85q84j231j282
60710C20406j144o75J63R86J379J326J113J049J421K274L091L128K364J618J525
60695C40024J832K106K441K953L068K181P56rL53J088J274Q56L91K39L47O18J167
$$ plain form
60805 386550 383878 381565 378885 375294 371031 366932 363571 360752 357973 355233 353149 352209 352130 352097 351524 350424
60789 350424 349127 347884 346780 345807 344893 343991 343258 342994 343258 343706 343999 344245 344832 345892 347180 348419 349551
60772 349551 350651 351817 353141 354631 356178 357812 359885 362728 366136 369558 372852 376392 380248 383634
60758 383634 385576 385987 385733 385650 385758 385465 384307 382323 379895 377464 375480 374373 374220 374443 374247 373564 373273
60741 373273 374136 375723 376808 376628 375273 372952 369519 364924 359632 354359 349665 345936 343277 341240 339074
60726 339074 336504 333932 331626 329227 326422 323714 321979 321501 321875 322634 323470 323988 323803 322919 321688 320406
60710 320406 319262 318587 318750 319736 321115 322441 323554 324603 326024 328298 331389 334517 336881 338499 340024
60695 340024 341856 343962 346403 349356 352424 354605 355361 355352 355705 356793 358067 358923 359314 359553 359900 360518 361685
60678C61685K160L397M193L905K671J418Q94R03P70L57J90N60J036J011L69o75
60662C84844k131m007n627n787m075j746o17j057j702j320k99K58L18Q13J991
60647C59856K897K775K107J826K063K222J811P71o51j972k685k798k832k984k758
60632C59648j834q29n42q19q36k63N24J165J586J630J155N79N50R61R21j6j190
60615C62390j684j370q07m33k78j76J7K83M15K31p3j55o0j64m52l92K83J119J601
60596C60295J706J557R67n8q49p48j0O83J308K303L370L503K427J112M02r4j050
60579C76824k052k065r20M96J476K128K791L489M269N368O767P976Q601Q825R101
60564D33074R641J0389J1188J1712J1527J0416Q452N700K230j465m538o579p837
$$ plain form
60678 361685 363845 367242 371435 375340 378011 379429 380323 381226 381996 382353 382543 383103 384139 385150 385519 384844
60662 384844 382713 378706 373079 367292 363217 361471 360854 359797 358095 356775 356476 356734 357052 357865 359856
60647 359856 362753 365528 367635 369461 371524 373746 375557 376328 375677 373705 371020 368222 365390 362406 359648
60632 359648 357814 356985 356443 355624 354788 354525 355049 356214 357800 359430 360585 361164 361714 362675 363596 363580 362390
60615 362390 360706 359336 358529 358096 357818 357642 357659 357942 358357 358588 358515 358360 358300 358136 357684 357292 357575 358694 360295
60596 360295 362001 363558 364525 364467 363618 362870 362860 363543 364851 367154 370524 374027 376454 377566 377968 377874 376824
60579 376824 374772 372707 371787 372283 373759 375887 378678 382167 386436 391804 398571 406547 415148 423973 433074
60564 433074 442715 453104 464292 476004 487531 497947 506399 512099 514329 512864 508326 501747 493910
60551D93910q443p968o258m081k309r02O42K160L094L650M682O434Q206R527J0836
60536E13180J2661J4826J6833J8448J9509J9649J8638J6723J4277J1339P751L520
60524F87354j027n244q302r834j0465j1203j2143j2378j1338r601q026o719n306
60511E75768l761k401j419p67k31O05K064L847N329O700R110J3128J7765K1717
60497F47454K5041K8804L3422L8234M2496M5902M8154M8796M7614M4711M0297
60486A090925L4805K8949K3060J6558Q885P14o678j3192k0107k8139l6249m2822
60474A056709m7272m9916n0902n0140m8052m5540m3035m0080l6100l1390k6964
60463E87318k3527k0801j8070j5213j2801j1223j0136r013p834o847n979m978
$$ plain form
60551 493910 485467 477499 471241 467160 464851 463949 464591 466751 469845 473495 478177 484611 492817 502344 513180
60536 513180 525841 540667 557500 575948 595457 615106 633744 650467 664744 676083 683834 687354
60524 687354 686327 681083 672781 662947 652482 641279 629136 616758 605420 595819 587793 581074 575768
60511 575768 572007 569606 568187 567420 567189 567794 569858 573705 579034 585734 594844 607972 625737 647454
60497 647454 672495 701299 734721 772955 815451 861353 909507 958303 1005917 1050628 1090925
60486 1090925 1125730 1154679 1177739 1194297 1203182 1203896 1197218 1184026 1163919 1135780 1099531 1056709
60474 1056709 1009437 959521 908619 858479 810427 764887 721852 681772 645672 614282 587318
60463 587318 563791 542990 524920 509707 496906 485683 475547 466534 458700 451853 445874 440896
60451D40896l994l517l678l979l813l063k199j910k437l195l270k511j709j461
60437D00160j366q78l85o60j570k160j936j289o64j27J61j07q02j316j351j184
60421C84526j064r52r08j062j073l59Q65J596J413J084J375J937J988J524J173
60406C92063J271J704K367L113L462K996J997J273J297J820K231K093J494J042
60392D20223J345K238K825K532J876J767K351K947L000K659K369K254K041J477
60378D51904P60N00J061K028K596K600K684L285L903L760K902K066J695J532J279
60363D84555J118J395K019K490K495K329K569L373M324N052N751O767P996R141
60349E41374J0316J1813J3181J3351J1924R740P744N801L133m24m175p339r604
$$ plain form
60451 440896 436902 433385 429707 425728 421915 418852 416653 414743 412306 409111 405841 403330 401621 400160
60437 400160 398794 397916 397531 396871 395301 393141 391205 389916 389252 389125 389286 389179 388377 387061 385710 384526
60421 384526 383462 382510 381602 380540 379467 379108 379973 381569 382982 384066 385441 387378 389366 390890 392063
60406 392063 393334 395038 397405 400518 403980 406976 408973 410246 411543 413363 415594 417687 419181 420223
60392 420223 421568 423806 426631 429163 431039 432806 435157 438104 441104 443763 446132 448386 450427 451904
60378 451904 452664 453164 454225 456253 458849 461449 464133 467418 471321 475081 477983 480049 481744 483276 484555
60363 484555 485673 487068 489087 491577 494072 496401 498970 502343 506667 511719 517470 524237 532233 541374
60349 541374 551690 563503 576684 590035 601959 611699 619443 625244 628377 627953 623778 616439 606835
60336F06835j1007j1614j1386j0208q229o225n266n736o892p582p278o237n092
60323E04083m477m634n026m668l239j577p16p00o99o0J202K746M367O116Q222
60308E00940J0783J3440J5670J7450J9209K0997K2172K2247K1360J9553J6214
60297G00035J0976M631j622p434j3059j8208k2039k4130k4669k3817k1715j8966
60285E39983j6305j3760j0901p845n198l114j332j43k31j341k166j992j507j464
60271D72684j582j434j546k572l991m601m111l311k910k919l143l399l246k248
60257D31671p72Q1l52j553k489k598j914o06J064K516L112K844K422K484K829
60242D38739K812K322J982K232K630K431J603P54K01l63j143j758j719j087k78
$$ plain form
60336 606835 595828 584214 572828 562620 554391 548166 542900 537164 530272 522690 515412 509175 504083
60323 504083 499606 494972 489946 485278 482039 480462 479746 479046 478347 478287 479489 482235 486602 492718 500940
60308 500940 511723 525163 540833 558283 577492 598489 620661 642908 664268 683821 700035
60297 700035 711011 715642 714020 706586 693527 675319 653280 629150 604481 580664 558949 539983
60285 539983 523678 509918 499017 491172 485974 482860 481528 481385 481154 479813 477647 475655 474148 472684
60271 472684 471102 469668 468122 465550 461559 456958 452847 449536 446626 443707 440564 437165 433919 431671
60257 431671 430899 430980 430628 429075 426586 423988 422074 421468 422532 425048 428160 431004 433426 435910 438739
60242 438739 441551 443873 445855 448087 450717 453148 454751 455505 455706 455343 454200 452442 450723 449636 449358
60227D49358M79J207J792J935J525R04O41J047J857K464K542K383K518L078L763
60212D77493M299M624M663M465M572N643P445Q696Q396P059O179O592P729Q421
60198E66276Q075P081O309O247O519O325N430M454L948L612K777J442K32n43j204
60183F26980k007k751l317m057n203o264o510n926n260n106n302n331m998m564
60169E60384m365m473m664m580l968k912j890j510k014k946l400k767j307O8O31
60154E20287M19j4k27j25K24P64J366J798J926J821J546R93Q3r13j423j037J23
60137E27611J514K641L455M317N487O698P358P212O617O087N689N132M271L306
60123E97395K473J869J536J544J856K250K442K283J911J814K503L880N058N148
$$ plain form
60227 449358 449837 451044 452836 454771 456296 457200 457841 458888 460745 463209 465751 468134 470652 473730 477493
60212 477493 481792 486416 491079 495544 500116 505759 513204 521900 530296 537355 543534 550126 557855 566276
60198 566276 574351 581432 587741 593988 600507 606832 612262 616716 620664 624276 627053 628495 628727 628184 626980
60183 626980 624973 622222 618905 614848 609645 603381 596871 590945 585685 580579 575277 569946 564948 560384
60169 560384 556019 551546 546882 542302 538334 535422 533532 532022 530008 527062 523662 520895 519588 519656 520287
60154 520287 520706 520692 520465 520340 520564 521328 522694 524492 526418 528239 529785 530778 530861 529948 528525 527488 527611
60137 527611 529125 531766 535221 539538 545025 551723 559081 566293 572910 578997 584686 589818 594089 597395
60123 597395 599868 601737 603273 604817 606673 608923 611365 613648 615559 617373 619876 623756 628814 633962
60109F33962M196L084K465K251K058J757J322N93m56j478k113k435k803l349l829
60094F35225l987l869l769l882l950l494k455j458j052r00k89P01J222R34M54
60079F09431K76M4n74j078q90l70l60j060k015k924l760m497n291o575q263r273
60063E62821q740p357o578o702o818o417n949n709n395m925m639m367l464k046
60049D83715j119r64n73O91J989K429K473K953L602L762L782M382N168N142M402
60034E21834L974M038L745K841K169K150K022J075k75j274j886k424k861l182
60020E31946l827n054o262o699o599o897p931r028r404q884p749o381n161m379
60006D37691l957l539k904k179j598j214r37o38k06L78Q85R51M52k34n14j66M18
$$ plain form
60109 633962 638158 641242 643707 645958 648016 649773 651095 651688 651232 649754 647641 645206 642403 639054 635225
60094 635225 631238 627369 623600 619718 615768 612274 609819 608361 607309 606409 606120 606821 608043 608977 609431
60079 609431 609707 609751 609177 608099 607209 606839 606479 605419 603404 600480 596720 592223 586932 580357 572094 562821
60063 562821 554081 546724 540146 533444 526626 520209 514260 508551 503156 498231 493592 489225 485761 483715
60049 483715 482596 481632 481059 481750 483739 486168 488641 491594 495196 498958 502740 507122 512290 517432 521834
60034 521834 525808 529846 533591 536432 538601 540751 542773 543848 543573 542299 540413 537989 535128 531946
60020 531946 528119 523065 516803 510104 503505 496608 488677 479649 470245 461361 453612 447231 442070 437691
60006 437691 433734 430195 427291 425112 423514 422300 421363 420725 420519 420897 421782 422733 423185 422951 422437 422271 422689
59989D22689O61N24O54J631L125M133M108L563L293L421L513L361L063K443J121
59974D61303o97k114k558k418k316k257j975j647j586j523j025m30m96j088j139
59959D38034j74J048J790K368L206L688K964J400K41p6k79q86j459j424q45n7
59943D49539Q19J585J816J393Q00M15m0r32j903k204j685r50o26p91j142j326
59927D44768j098l83O44J715K706L697M739N633N996N560M453L142J998J056K96
59912D84922m8K35Q75J331J480J684K204K898L571M115M253L682K700K154K401
59897E18457K774K517J798J355J481J891K304K621K717K572K510K838L453M110
59883E53398M891N802O211N479M080L365L916M846N029M439L809L467L080K270
$$ plain form
59989 422689 423350 423874 424528 426159 429284 433417 437525 441088 444381 447802 451315 454676 457739 460182 461303
59974 461303 460606 458492 455934 453516 451200 448943 446968 445321 443735 442212 441187 440757 440261 439173 438034
59959 438034 437860 438908 440698 443066 446272 449960 452924 454324 454565 454489 454210 453324 451865 450441 449596 449539
59943 449539 450358 451943 453759 455152 455952 456367 456327 455395 453492 451288 449603 448653 448027 447236 446094 444768
59927 444768 443670 443287 443931 445646 448352 452049 456788 462421 468417 473977 478430 481572 483570 484626 484922
59912 484922 484874 485109 485984 487315 488795 490479 492683 495581 499152 503267 507520 511202 513902 516056 518457
59897 518457 521231 523748 525546 526901 528382 530273 532577 535198 537915 540487 542997 545835 549288 553398
59883 553398 558289 564091 570302 575781 579861 583226 587142 591988 597017 601456 605265 608732 611812 614082
59869F14082R83o47k308l469l773l585l733m562n495n736n171m280l403k515j669
59854E64719j206j166r13J92J857L157L788M501O019P967R300R373Q232O085L203
59839F25108K39j919k860k832k182j064Q7L29r98l415n657o895p286p320p078
59824E76257o369n328m456m041l835l439k896k653l039l926m841n335n242m755
59810E16102m231l821l357k652j807j048m34J7O1n03j357j822j597r72l01L34
59794D92612Q10P97K04n51j006j111j011o61J5P82J201R72Q4j085j754j343l05
59777D88650J08o88j805k074j505j001r31p64l8J031J921K291K041J413R95J273
59761D90917K117L076L979M823N343N285N045N290N994O554O820P267Q063Q758
$$ plain form
59869 614082 615065 614418 612110 608641 604868 601283 597550 592988 587493 581757 576586 572306 568903 566388 564719
59854 564719 563513 562347 561434 561626 563483 566640 570428 574929 580948 588915 598215 607588 615820 621905 625108
59839 625108 625347 623428 620568 617736 615554 614490 614577 614906 613908 610493 604836 597941 590655 583335 576257
59824 576257 569888 564560 560104 556063 552228 548789 545893 543240 540201 536275 531434 526099 520857 516102
59810 516102 511871 508050 504693 502041 500234 499186 498752 498769 498830 498327 496970 495148 493551 492579 492278 492612
59794 492612 493422 494219 494423 493872 492866 491755 490744 490083 490098 490880 492081 493053 493137 492052 490298 488955 488650
59777 488650 488758 488070 486265 484191 482686 481685 480754 479990 479952 480983 482904 485195 487236 488649 489644 490917
59761 490917 493034 496110 500089 504912 510255 515540 520585 525875 531869 538423 545243 552510 560573 569331
59747E69331R127R481R822R560Q511P448P028O780N884M432L222K645K478K470
59733F58219K428J932P13p65j796k381l055l803l968l383k838l039l642l778l174
59718F27670k366k005k303k971l464l397k891k415k229k179k102k025j839j192
59704E94292q2Q15Q79L89J39L26M20J38r7J00M45N01M41P88J608K356K532K125
59686F08115J452Q41M80L47J89k59r72j634j902j677j292j459k673m425n433n042
59670E84656m096l911m672n430n477m970m209l231k255j767j794j736j289q33
59656E38986n26K45J863L561M277M004L594L534L642L718L717L419K563J289j5
59641E77871j180k159k782l190m110n838p291p010n107l230k512k469k208j693
$$ plain form
59747 569331 578458 587939 597761 607321 615832 623280 630308 637088 642972 647404 650626 653271 655749 658219
59733 658219 660647 662579 663292 662527 660731 658350 655295 651492 647524 644141 641303 638264 634622 630844 627670
59718 627670 625304 623299 620996 618025 614561 611164 608273 605858 603629 601450 599348 597323 595484 594292
59704 594292 594210 595025 595904 596293 596432 596758 597178 597316 597219 597319 597764 598265 598706 599494 601102 603458 605990 608115
59686 608115 609567 610408 610888 611235 611424 611165 610193 608559 606657 604980 603688 602229 599556 595131 589698 584656
59670 584656 580560 576649 571977 566547 561070 556100 551891 548660 546405 544638 542844 541108 539819 538986
59656 538986 538460 538705 540568 544129 548406 552410 556004 559538 563180 566898 570615 574034 576597 577886 577871
59641 577871 576691 574532 571750 568560 564450 558612 551321 544311 539204 535974 533462 530993 528785 527092
59627E27092j378j339j442j787k444l085l313l170k949k797k762k943l316l676
59613D90691l925m144m258l974l161k023q33J52N22J50k30L96J877K775K138P24
59597D76877j41k25k09l09r7N01Q88O26Jm13k96L18J138J651J401M09q40j832
59579D79448k352k422k187j811j391r66o00l70k17oJ39j51r39j633j493m64P09
59562D63294J195Q43K51J12M00M05k94j157j374j000q18j083j183o47J68P35J065
59545D60912J442K009K955M489O183P075P000P103Q398J0518J2790J5640J9430
59532E65944K2311K0999J4324M893l359q463j0852j1533j0947r279o906m319j948
59519E60865j73P63R22O25K35q3m50j190k525m287o007p237p747p525o810o041
$$ plain form
59627 527092 525714 524375 522933 521146 518702 515617 512304 509134 506185 503388 500626 497683 494367 490691
59613 490691 486766 482622 478364 474390 471229 469206 468373 468525 469047 469197 468967 469363 471240 474015 476153 476877
59597 476877 476736 476511 476302 475993 475896 476397 477285 477911 477912 477499 477203 477521 478659 480310 481711 482120 481280 479448
59579 479448 477096 474674 472487 470676 469285 468319 467719 467349 467132 467126 467265 467114 466175 464542 463049 462585 463294
59562 463294 464489 465332 465583 465695 466095 466500 466206 465049 463675 462675 461857 460774 459591 458944 459112 459847 460912
59545 460912 462354 464363 467318 471807 477990 485065 492065 499168 507566 518084 530874 546514 565944
59532 565944 588255 609254 623578 628471 625112 616649 605797 594264 583317 574038 567132 562813 560865
59519 560865 560692 561455 562377 563002 563237 563154 562704 561514 558989 554702 548695 541458 533711 526186 519376 513335
59503E13335n590n476n461n362n123m722m158l539k919k197j319n21j20j39k92
59488D66397k91k3M71R58J087P62K99J29M08J092K175L517M652N082M761M109
59472D95585L661L773M350M711M121K797J853J936K335K107J463J265J486J290
59458E32733N20O2N96J836L231M562N557N771N333N102N597O285O399N838M854
59443E94276L453J668m5j315k396l651m870n667o140o555o667o092n097m322l806
59428E42774l018j773m39P64J961L008L475L582M435O775R956J2698J4528J5913
59414F14639J7225J8320J9181K0326K2259K4733K6643K6394K2430J4162K997p781
59402H21528j4903j7185j5731j2307p916k744L016Q481J1827J0854M626n009j4147
$$ plain form
59503 513335 507745 502269 496808 491446 486323 481601 477443 473904 470985 468788 467469 466948 466828 466689 466397
59488 466397 466106 466083 466554 467512 468599 469361 469660 469789 470197 471289 473464 476981 481633 486715 491476 495585
59472 495585 499246 503019 507369 512080 516201 518998 520851 522787 525122 527229 528692 529957 531443 532733
59458 532733 533253 533315 533911 535747 538978 543540 549097 554868 560201 565303 570900 577185 583584 589422 594276
59443 594276 597729 599397 599352 598037 595641 591990 587120 581453 575313 568758 562091 555999 550902 546580 542774
59428 542774 539756 537983 537544 538308 540269 543277 546752 550334 554769 561544 571500 584198 598726 614639
59414 614639 631864 650184 669365 689691 711950 736683 763326 789720 812150 826312 829309 821528
59402 821528 806625 789440 773709 761402 753486 750742 753758 762239 774066 784920 789546 784537 770390
59389G70390j9733k1590k1337k0070j7851j4876j1868r166o497l916k117j364
59377F20005q75L8R45J117Q93J317K612L822M099L549K730J910J243J122J769
59362F46296K665K952K462J967K238L116L856M180M611N634O907P674P810P991
59348G10359Q802J0083J1311J2324J3237J3884J3798J2883J1762J1209J1264J1140
59336H52056R977P608M569J550j070l240n090o799q473j0021j1295j2278j3034
59323H04460j3500j3548j3282j2975j2592j1753j0383r065q404q324q353q303
59311F73978q211p866p031n981n217m612l532j916m86L61J267L039N612Q372J0968
59296F58745J3055J3472J0666M418l378j0057j4213j6177j6784j6276j4556j2017
$$ plain form
59389 770390 750657 729067 707730 687660 669809 654933 643065 633899 627402 623486 621369 620005
59377 620005 619130 619168 620113 621230 622123 623440 626052 629874 633973 637522 640252 642162 643405 644527 646296
59362 646296 648961 651913 654375 656342 658580 661696 665552 669732 674343 679977 686884 694558 702368 710359
59348 710359 719161 729244 740555 752879 766116 780000 793798 806681 818443 829652 840916 852056
59336 852056 862033 869641 874210 875760 874690 871450 866360 859561 851088 841067 829772 817494 804460
59323 804460 790960 777412 764130 751155 738563 726810 716427 707362 698958 690634 682281 673978
59311 673978 665767 657901 650870 644889 639672 635060 631528 629612 629126 629487 630754 633793 639405 647777 658745
59296 658745 671800 685272 695938 700356 696978 686921 672708 656531 639747 623471 608915 596898
59284E96898r453p268n279l470k298j860j360RJ959L606M831O342Q354J0088J0907
59269F12006J1175J1663J2568J3593J4442J4807J4243J2617J0388Q022N431K391
59257G43346p57l365n211o561p612q332q748q952q824q134o978n778m823l989
59243F55282k967j609r3J145J798K111K717L825M856N223N134N171N253M697L335
59228F95878J994J535J767J702O83j055k925m677o384p946r001r379r328r076
59214F43788q536p722p168p288p521o820n143l635l068k901k382j821j944k490
59200E75349k451j524m40J52L71N63Q07J086J453J771J812J697J790K105K332
59185E86873K516L089M047M727M675M202L816L595L476L615L960M020L549L073
$$ plain form
59284 596898 587445 580177 574898 571428 569130 567270 565910 565919 567878 571484 576315 582657 591011 601099 612006
59269 612006 623181 634844 647412 661005 675447 690254 704497 717114 727502 735524 740955 743346
59257 743346 742589 739224 734013 727452 719840 711508 702760 693808 684984 676850 669872 664094 659271 655282
59243 655282 652315 650706 650613 651758 653556 655667 658384 662209 667065 672288 677422 682593 687846 692543 695878
59228 695878 697872 699407 701174 702876 703559 702504 699579 694902 688518 680572 671571 662192 652864 643788
59214 643788 635252 627530 620362 613074 605553 598733 593590 589955 586887 583986 581604 579783 577839 575349
59200 575349 572898 571374 570934 571086 571457 572020 572827 573913 575366 577137 578949 580646 582436 584541 586873
59185 586873 589389 592478 596525 601252 605927 610129 613945 617540 621016 624631 628591 632611 636160 639233
59171F39233L154L445L216K535K174K401K606K318J902J937K343K518K081J114
59157F72977j06j375k609l800m981o205p537q916r934j0039r216q315q153q440
59143E83351q157p024n870n396n284m996m692m710m747m363l909l973m173l570
59129E12487k226j218r11l94R08K168K536K654L698N537O973P546P964Q752R542
59114E66016R929J0107J0310J0237R565Q511P552O851O277N644M782L663K613
59101F62057K059J958J766J151L19m52j164j721j798j414j224j697k338k294j533
59086F53675q56p17o95l36k3n86k147l843m756m864m777m836m923n135n942p261
59070F01978q000p241n604m615m723m837m021k833k449l085l884m049l489k559
$$ plain form
59171 639233 642387 645832 649048 651583 653757 656158 658764 661082 662984 664921 667264 669782 671863 672977
59157 672977 672871 671496 668887 665087 660106 653901 646364 637448 627514 617475 608259 599944 591791 583351
59143 583351 575194 568170 562300 556904 551620 546624 541932 537222 532475 528112 524203 520230 516057 512487
59129 512487 510261 509043 508132 507738 508646 510814 513350 516004 519702 525239 532212 539758 547722 556474 566016
59114 566016 575945 586052 596362 606599 616164 624675 632227 639078 645355 650999 655781 659444 662057
59101 662057 664116 666074 667840 668991 669310 668858 667694 665973 664175 662761 661537 659840 657502 655208 653675
59086 653675 652819 652102 651407 651071 651048 650462 648315 644472 639716 634852 630075 625239 620316 615181 609239 601978
59070 601978 593978 586737 581133 576518 571795 566958 562937 560104 557655 554570 550686 546637 543148 540589
59056E40589j642r92o64n40n34o57q39r63j105j488j990k071j405l20O07J071
59040E27057J019M66l65j031j245j097o77K5P42Q85L09k86j00R72K621M664O833
59023E40792Q458R093R232R759J0805J1717J2025J1866J1466J0759R560P760N323
59010F68615K507m0j851l176m485n529n515m349l032k535k651k346r93J055K989
58995F38664M256M718M464L720K919K488K334J787M25j215k177k266k132k183
58981F55802k094j598j060q42o52K8J322L133N395P682R260J0056J1017J2788
58967G10237J4614J5356J5110J4848J4880J4678J4006J3127J1971J0147P891N961
58955H62826M444K581Kk723n111p438r962j2256j3854j4944j5845j6297j5831
$$ plain form
59056 540589 538947 537955 537291 536751 536217 535560 534721 533758 532653 531165 529175 527104 525699 525379 525986 527057
59040 527057 528076 528542 528177 527146 525901 524804 524127 524152 524894 525779 526088 525802 525702 526674 529295 533959 540792
59023 540792 549250 558343 567575 577334 588139 599856 611881 623747 635213 645972 655532 663292 668615
59010 668615 671122 671082 669231 666055 661570 656041 650526 646177 643145 640610 637959 635613 634620 635675 638664
58995 638664 642920 647638 652102 655822 658741 661229 663563 665350 665775 664560 662383 660117 657985 655802
58981 655802 653708 652110 651050 650208 649556 649584 650906 654039 659434 667116 676376 686432 697449 710237
58967 710237 724851 740207 755317 770165 785045 799723 813729 826856 838827 848974 856865 862826
58955 862826 867270 869851 869853 867130 862019 854581 844619 832363 818509 803565 787720 771423 755592
58942G55592j4571j3125j1909j0922j0042r142q052o752n582m991m965m814l723
58929F47002j679K70J000O29L70R34J653J596R38N48O94R41J032J006O16m59j878
58912F55213k883l256l237k641j065J031K476K839K901L419M411N818P878J0362
58898F83266J2388J3493J4125J4606J4475J3488J2411J2083J2334J2630J3095
58887H28394J4144J5517J6635J7469J8262J8664J7993J6223J3984J1583Q759N452
58875A003079K189n35k792m941p058q862j0020j0436j0217r543q613p744p225
58862I17282o901o237n225m840n962q017r561j0117j0479j1104j1405j1103j1036
58849H05295j1744j2210j1213r267q016p987q219q023p896q351q942r050q919
$$ plain form
58942 755592 741021 727896 715987 705065 695023 685881 677829 671077 665495 660504 655539 650725 647002
58929 647002 645323 645593 646593 647222 647592 648526 650179 651775 652713 653261 653955 654896 655928 656934 657550 657091 655213
58912 655213 652330 649074 645837 643196 642131 643162 645638 648477 651378 654797 659208 665026 672904 683266
58898 683266 695654 709147 723272 737878 752353 765841 778252 790335 802669 815299 828394
58887 828394 842538 858055 874690 892159 910421 929085 947078 963301 977285 988868 997627 1003079
58875 1003079 1005268 1004733 1001941 997000 989942 981080 971060 960624 950407 940864 932251 924507 917282
58862 917282 910381 904144 898919 894079 888117 880100 870539 860422 849943 838839 827434 816331 805295
58849 805295 793551 781341 770128 760861 752845 744858 736639 728616 720720 712369 703427 694377 685458
58836F85458r182r768r935r333q462p947p757p389o591n577m546l391k060r01
58822E92619k93q6L13J358L079N074O572O867O233N966O851P907P616O120N046
58807F61242N071N011L755J906O35n2q88j862k398k646l442m901o034o084n599
58792F43714n719o691p543p290o185n447n736o274n882m423k665r76R19K957M436
58777E87195M987N022M966M781M428L991L043Q01k548n584p273q047q708r087
58763E77967q592p435o402n851n621n446m870l317r38J173K219K622L003L034
58749E41546K204J102Q17J393J945K065K181K581L011L254L386L515L752M305
58735E77057N116N603N352M764M504M642M843M967M835M016K611J774K442L957
$$ plain form
58836 685458 676276 666508 656573 647240 638778 630831 623074 615685 609094 603517 598971 595580 593520 592619
58822 592619 592326 592240 592553 593911 596990 602064 608636 615503 621736 627702 634553 642460 650076 656196 661242
58807 661242 666313 671324 675079 676985 677620 677568 676680 674818 672420 669774 666332 661431 655397 649313 643714
58792 643714 637995 631304 623761 616471 610286 604839 599103 592829 586947 582524 579859 578883 579802 582759 587195
58777 587195 592182 597204 602170 606951 611379 615370 618413 619214 616666 611082 603809 595762 587054 577967
58763 577967 569375 561940 555538 549687 544066 538620 533750 530433 529495 530668 532887 535509 538512 541546
58749 541546 543750 544852 545669 547062 549007 551072 553253 555834 558845 562099 565485 569000 572752 577057
58735 577057 582173 587776 593128 597892 602396 607038 611881 616848 621683 625699 628310 630084 632526 636483
58721F36483M800M467L768L506L837M689N873O857P251P450Q011Q584Q307P118
58707G21001N796M745L540J664r35m019p175r878j1986j3879j5662j6647j6409
58694F40156j5782j5868j6513j6628j5728j4123j2049r679p712o782o461n901
58682D96930n174m835m529l472k032j375j550j467r06q73j630j943q93Q44K225
58667D69320L216M250N382O632Q274J0120J1282J1222J0316Q981O957L981M46
58654E60379k995n848p617q011p561p216p114o620n731n295n497n360m290l033
58640D78191k391k054j434p54m14j32M64J015J082R74J238J748K106K420K934
58625D84993L276K868J784O71k6l08l43k86j60K94J313K575L476L985M594N325
$$ plain form
58721 636483 641283 645750 649518 653024 656861 661550 667423 674280 681531 688981 696992 705576 713883 721001
58707 721001 726797 731542 735082 736746 735811 731792 724617 714739 702753 688874 673212 656565 640156
58694 640156 624374 608506 591993 575365 559637 545514 533465 523786 516074 509292 502831 496930
58682 496930 491756 486921 482392 478920 476888 475513 473963 472496 471590 470717 469087 467144 466251 467095 469320
58667 469320 472536 476786 482168 488800 497074 507194 518476 529698 540014 548995 555952 559933 560379
58654 560379 557384 551536 543919 535908 528347 521131 514017 507397 501666 496371 490874 485514 481224 478191
58640 478191 475800 473746 472312 471558 471144 471012 471476 472491 473573 474547 475785 477533 479639 482059 484993
58625 484993 488269 491137 492921 493592 493566 493258 492915 492629 492469 492763 494076 496651 500127 504112 508706 514031
58609E14031N552N060M387L785K731J009n95j261j172j027j126j432j871k132
58595E25939j750r22m45m71j02J189K646L487M176N491P020P768P773Q058R061
58580E78918J0139J0598J0426R931R280Q516P651O681N770N301N510O241P192
58567F82154Q271R520J1029J2983J5430J7918J9882K1480K3399K5637K7087K6728
58555I01518K4641K1502J7644J3111Q150L240j172m712p166q685r501r525q673
58542I40372p555p106p548q467r854j2077j4798j6985j8289j9360k0482k0977
58530G76874k0387j9155j7646j5517j2701r973p944o381n080m386m252l835k797
58517F46820k030k265k908l059k834k788k894k867k762k474j552k09M39l1n16
$$ plain form
58609 514031 519583 524643 529030 532815 535546 536555 535960 534699 533527 532500 531374 529942 528071 525939
58595 525939 524189 523267 522822 522351 522249 523438 526084 529571 533747 539238 546258 554026 561799 569857 578918
58580 578918 589057 599655 610081 620012 629292 637808 645459 652140 657910 663211 668721 674962 682154
58567 682154 690425 699945 710974 723957 739387 757305 777187 798667 822066 847703 874790 901518
58555 901518 926159 947661 965305 978416 986566 989806 988634 983922 976756 968071 958570 949045 940372
58542 940372 932817 925711 918163 909696 899842 887765 872967 855982 837693 818333 797851 776874
58530 776874 756487 737332 719686 704169 691468 681495 673551 667170 662090 657704 653452 649617 646820
58517 646820 644790 642525 639617 636558 633724 630936 628042 625175 622413 619939 618387 618178 618617 618586 618070
58502F18070q4N36K62n61q85o83o63q67q17n23l00qN31R12Q75J091K227L811N017
58483F27941N936P098Q360R280J0032J0990J1932J2625J3454J4596J5271J4836
58471G62351J3773J2455R992N674P22k992n300p207q677q713p356n825m654l199
58457G51044j028J542M267P075R335J0333J0486J0893J1667J1749J0436Q003M845
58444H50647J125k670n851q257j0125j1367j1696j1273j0383q859o647m558l337
58431G56749k454r25J030K324K763L179M024M924N609O240O905P578Q391R077
58417H15414Q644O533L644J209q08l059n231o512p101p811q538q499p764p123
58403G72998o654n771m516l488k664j555l07N91J404K692M020M514M328M288M342
$$ plain form
58502 618070 617986 618522 618784 618223 617338 616655 615992 615125 614308 613785 613485 613477 614008 614920 615795 616886 619113 622924 627941
58483 627941 633877 640975 649335 658615 668647 679637 691569 704194 717648 732244 747515 762351
58471 762351 776124 788579 798571 804245 804967 801975 796675 789468 780791 772078 764722 758897 754243 751044
58457 751044 750016 751558 755825 762900 772235 782568 793054 803947 815614 827363 837799 845802 850647
58444 850647 851772 849102 843251 834994 824869 813502 801806 790533 780150 771291 764644 760086 756749
58431 756749 754295 753370 754400 756724 759487 762666 766690 771614 777223 783463 790368 797946 806337 815414
58417 815414 824058 830591 834235 835444 834636 831577 826346 819834 812733 804922 796384 787885 780121 772998
58403 772998 766344 760573 756057 752569 749905 748350 748043 748634 750038 752730 756750 761264 765592 769880 774222
58388G74222L843L018K697K783K440J614J000P45O06R91K376M011M768M930N583
58373H15627O580O877O564O640P000O602N611N441O483P668Q427R309J0397J0931
58359I20157J0854J1116J2045J2761J2567J1559R846P465N067L324J780k96k196
58346A016049k502j259K70J716L612N623O769P342Q647J0779J2558J3592J4574
58333A097770J5587J6109J6602J7973J9570J9759J8502J7260J6419J5071J3222
58322A283844J1838J0671Q534N905M667M938M815L712L439N149P596R315J0445
58309A374868J1579J2585J3320J3947J4189J3781J3476J4016J4533J3983J3441
58298A523718J4528J6330J6742J6254J7131J9238K0201J9647J9632K0696K1186
$$ plain form
58388 774222 778065 781083 783780 786563 789003 790617 791617 792362 792968 793959 796335 800346 805114 810044 815627
58373 815627 822207 829084 835648 842288 849288 855890 861501 866942 873425 881093 889520 898829 909226 920157
58359 920157 931011 942127 954172 966933 979500 991059 1000905 1008370 1013437 1016761 1018541 1018245 1016049
58346 1016049 1013547 1012288 1012558 1014274 1017886 1023509 1030278 1037620 1046267 1057046 1069604 1083196 1097770
58333 1097770 1113357 1129466 1146068 1164041 1183611 1203370 1221872 1239132 1255551 1270622 1283844
58322 1283844 1295682 1306353 1314887 1320792 1325459 1330397 1335212 1338924 1342363 1347512 1355108 1364423 1374868
58309 1374868 1386447 1399032 1412352 1426299 1440488 1454269 1467745 1481761 1496294 1510277 1523718
58298 1523718 1538246 1554576 1571318 1587572 1604703 1623941 1644142 1663789 1683421 1704117 1725303
58287A725303K0861K1488K3276K4338K4314K4995K6673K7618K7817K9484L3041
58276B009208L6486L9421M3735M9341N3475N5419N7731O1423O4061O4067O2898
58265B597265O1575N9263N6626N6214N7881N8308N6683N6304N8804O1549O2768
58254C243240O4390O7533O9971P0574P1686P4697P7845Q0628Q5469R2693R8943
58243D097669J03109J08579J16992J25203J31232J37737J46579J55651J64095
58234E286846J74814J88664K02203K14429K29322K48373K67411K84514L03852
58225G400428L27646L51916L74711M00868M33584M69147N05185N46148N95201
58216A1404834O49158P07049P74798Q55438R44336J040502J152520J286545J439688
$$ plain form
58287 1725303 1746164 1767652 1790928 1815266 1839580 1864575 1891248 1918866 1946683 1976167 2009208
58276 2009208 2045694 2085115 2128850 2178191 2231666 2287085 2344816 2406239 2470300 2534367 2597265
58265 2597265 2658840 2718103 2774729 2830943 2888824 2947132 3003815 3060119 3118923 3180472 3243240
58254 3243240 3307630 3375163 3445134 3515708 3587394 3662091 3739936 3820564 3906033 3998726 4097669
58243 4097669 4200778 4309357 4426349 4551552 4682784 4820521 4967100 5122751 5286846
58234 5286846 5461660 5650324 5852527 6066956 6296278 6544651 6812062 7096576 7400428
58225 7400428 7728074 8079990 8454701 8855569 9289153 9758300 10263485 10809633 11404834
58216 11404834 12053992 12761041 13535839 14391277 15335613 16376115 17528635 18815180 20254868
58207B0254868J612874J818309K066112K356780K696469L106235L607190M213522
58199D1732359M953039N877730P039442Q470597J0198749J2255414J4654342J7389506
58191A22571178K0475027K3951369K7810203L1900483L5832710L8791493L9362220
58184C40694683L5827163K7172163J4160533o41389j4167491k4416751l0988548
58177C47640363l4455435l5513905l4679766l2423938k9274220k5733496k2181227
58170A33378376j8860959j5903437j3348027j1179529r367604p875522o652763
58163E0190535n645814m815470m132359l564441l083203k675117k334073k048221
58155B1891837j804367j597649j425781j279953j151153j038997r44728q61747
$$ plain form
58207 20254868 21867742 23686051 25752163 28108943 30805412 33911647 37518837 41732359
58199 41732359 46685398 52563128 59602570 68073167 78271916 90527330 105181672 122571178
58191 122571178 143046205 166997574 194807777 226708260 262540970 301332463 340694683
58184 340694683 376521846 403694009 417854542 417213153 403045662 378628911 347640363
58177 347640363 313184928 277671023 242991257 210567319 181293099 155559603 133378376
58170 133378376 114517417 98613980 85265953 74086424 64718820 56843298 50190535
58163 50190535 44544721 39729251 35596892 32032451 28949248 26274131 23940058 21891837
58155 21891837 20087470 18489821 17064040 15784087 14632934 13593937 12649209 11787462
58147A1787462p82312p07692o42570n84891n29938m79113m35879l97669l60377
58138F867021l26721l01904k84541k69386k55573k44818k34922k22423k09003
58129D517730j98391j89353j78168j65528j54765j45545j35442j25609j19023
58120C105906j14729j09359j02789r7267r2603q7150q1950p9148p7715p5147p1880
58109B116169o9891o8554o6127o3587o2824o2531o0062n5949n2595m9861m5819
58098A458369m0625l5956l1777k7022k2204j8248j4399j0324q264r702j2073j2378
58086A215397j1926j3555j6277j7159j6701j7694j9911k0676j9957k0311k2038
58075A019192k2704k1475k0091j9369j8390j7235j7177j7888j7617j6316j5704
$$ plain form
58147 11787462 11005150 10297458 9654888 9069997 8540059 8060946 7625067 7227398 6867021
58138 6867021 6540300 6238396 5953855 5684469 5428896 5184078 4949156 4726733 4517730
58129 4517730 4319339 4129986 3951818 3786290 3631525 3485980 3350538 3224929 3105906
58120 3105906 2991177 2881818 2779029 2681762 2589159 2502009 2420059 2340911 2263196 2188049 2116169
58109 2116169 2046278 1977724 1911597 1848010 1785186 1722655 1662593 1606644 1554049 1504188 1458369
58098 1458369 1417744 1381788 1350011 1322989 1300785 1282537 1268138 1257814 1249550 1239848 1227775 1215397
58086 1215397 1203471 1189916 1173639 1156480 1139779 1122085 1102174 1081498 1061541 1041230 1019192
58075 1019192 996488 975013 954922 935553 917163 899928 882751 864863 847246 830930 815226
58064H15226j6080j5914j4656j3320j2210j0694r187q833r190q737p598p305p988
58051F73514q193p516p023o951o439n550n384n944n960n068m303m299m753n589
58037E90542p002q349q607p808o699n391l767k579k565l109l372l895n397o875
58023E15127o869n848n342n554n734o093p123p850p004n287m320m027l348k673
58009D38055l111m028l892l074l160l933l745k616k174k594k421j562j658l042
57995C97045l932l303k194j593j143n95n53j099j451j470j858k527k539j921j868
57980C68999k823m024n078o214o882o039m112k829k753k716k036j426j408j476
57966C19183j240p94J57J898L325K872R70k98k03l3n33q58o13p60j626j995j210
$$ plain form
58064 815226 799146 783232 768576 755256 743046 732352 723165 714332 705142 696405 688807 681502 673514
58051 673514 665321 657805 650782 643831 637392 631842 626458 620514 614554 609486 605183 600884 596131 590542
58037 590542 583540 575191 566584 558776 552077 546686 542919 540340 537775 534666 531294 527399 522002 515127
58023 515127 508258 502410 497068 491514 485780 479687 472564 464714 457710 452423 448103 444076 440728 438055
58009 438055 434944 430916 427024 423950 420790 416857 413112 410496 408322 405728 403307 401745 400087 397045
57995 397045 393113 389810 387616 386023 384880 384285 383732 382633 381182 379712 377854 375327 372788 370867 368999
57980 368999 366176 362152 357074 350860 343978 337939 333827 330998 328245 325529 323493 322067 320659 319183
57966 319183 317943 317149 317306 319204 322529 325401 326371 326073 325870 325837 325304 324446 323833 323073 321447 319452 318242
57949C18242m25p52j574j778j365r17n56k42p6K24J210K665L661L967M272M866
57933C31422N301N581O327P482Q040P406N906L903J592l59j416k266l900n788
57919C69231o604o606p189q208p969o144m436l779l211k152j565j812j538O4J708
57904C09790K052J602J386J262Q35O21J030J428J281J086J191J007L60K80J420
57889C26631K840L387L143K587J623M09j96j2j17j019j673j360j106j950l114
57874C30073l386l117l334l894l976l641l438l239k740k443k913l634l697k981
57860B83640j755j1J898K946K945L271M851O426O334N026M214M240M126L620L419
57845C35190L465K818J309n4n61n13l69k67m56j267k438l294l617l720l743l574
$$ plain form
57949 318242 317817 317065 315491 313713 312348 311431 310875 310633 310557 310781 311991 314656 318317 322284 326556 331422
57933 331422 336723 342304 348631 356113 364153 371559 377465 381368 382960 382601 381185 378919 375019 369231
57919 369231 362627 356021 348832 340624 332655 326511 322075 318296 315085 312933 311368 309556 308018 308082 309790
57904 309790 311842 313444 314830 316092 316927 317548 318578 320006 321287 322373 323564 324571 324931 325211 326631
57889 326631 329471 332858 336001 338588 340211 340620 340424 340412 340295 339276 337603 336243 335137 333187 330073
57874 330073 326687 323570 320236 316342 312366 308725 305287 302048 299308 296865 293952 290318 286621 283640
57860 283640 281885 281874 283772 286718 289663 292934 297785 304211 310545 315571 319785 324025 328151 331771 335190
57845 335190 338655 341473 342782 342728 342167 341654 341285 341018 340562 339295 336857 333563 329946 326226 322483 318909
57829C18909l315l157k935k399j780j422j171p25l24l99p83r33o89k63K70Q55
57813B99739J172J049Q04N67l16k391m990o762p168o799o414o245o167n954n437
57798B44688m718m027l239k022o85j45o08j066p46k10k91o71n47j7K47L28Q49
57781B27120J768K485K982L824N055O120O896P849Q956R360Q411O510M632L438
57767C05406K914K536J693K61j232k259k922l621m283m464m092l611l354l138
57753B79834k614j787j092r89j456j888j658p30M79J615K419K506J806J118J302
57738B78865J947J784N14p52j189j231j382j201l10O59R99J091J627K369K647
57723B86437K549K639K883K804K339J743R40k27j373j956k086k263k567k718k736
$$ plain form
57829 318909 315594 312437 309502 307103 305323 303901 302730 302005 301681 301282 300499 299566 298877 298614 298884 299739
57813 299739 300911 301960 302764 303331 303015 300624 295634 288872 281704 274905 268491 262246 256079 250125 244688
57798 244688 239970 235943 232704 230682 229997 229852 229244 228178 227432 227222 226931 226260 225713 225696 225943 226271 227120
57781 227120 228888 231373 234355 238179 243234 249354 256250 264099 273055 282415 290826 297336 301968 305406
57767 305406 308320 310856 312549 312810 311578 309319 306397 302776 298493 294029 289937 286326 282972 279834
57753 279834 277220 275433 274341 273352 271896 270008 268350 267620 268099 269714 272133 274639 276445 277563 278865
57738 278865 280812 282596 283110 282358 281169 279938 278556 277355 277045 277704 278703 279794 281421 283790 286437
57723 286437 288986 291625 294508 297312 299651 301394 302334 302107 300734 298778 296692 294429 291862 289144 286408
57708B86408k886l256l791m470m983m822m096l690l983m159l479k591k565l201
57694B34436l379k717j914j563j541j493j141l14P75J437J337J114J564K585L599
57679B32785M596N977P722R553J1655J4491J8047K1989K6360L1436L7195M3498
57667D65304N0512N8071O4643O7392O3192M9771K7125j112k8461m9124o1046o5401
57655F40866o4140n8954n1669m3937l6508k9733k4362k0749j7788j4091j0049
57644B68886p329o413n897m519k572j039k96o1J87R53K295L465L656L004K223
57629B56543J505O09k00l73j77n15j567k575l058l298l520l556l477l643l948
57614B28750l819l133k362j749j158p46q17j015o04K63O27J75l41m08m37q36j355
$$ plain form
57708 286408 283522 280266 276475 272005 267022 262200 258104 254414 250431 246272 242793 240202 237637 234436
57694 234436 231057 228340 226426 224863 223322 221829 220688 220374 221149 222586 223923 225037 226601 229186 232785
57679 232785 237381 243358 251080 260633 272288 286779 304826 326815 353175 384611 421806 465304
57667 465304 515816 573887 638530 705922 769114 818885 846010 844898 816437 767313 706267 640866
57655 640866 576726 517772 466103 422166 385658 355925 331563 310814 293026 278935 268886
57644 268886 261557 255144 249247 244728 242156 241117 240821 240760 240947 241900 244195 247660 251316 254320 256543
57629 256543 258048 258657 258457 258084 257907 257392 255825 253250 250192 246894 243374 239818 236341 232698 228750
57614 228750 224931 221798 219436 217687 216529 215783 214966 213951 213347 213610 214237 214412 214071 213663 213226 212390 211035
57597B11035j729k070k235j781r57q47j945l415m287m605m818m761m062l003k286
57582A68234k141k303k604l078l614l860l523k714j988j966k606l060k612j616
57568A30549r65q64q26p03r21j562k100k176k001j683r59K18J423K326K953L215
57552A25924K892K276K078K371K308J409M12K66P63P99j64j439j914j218n8N38
57536A37243L30R6N57J390J669J089K85pL86J115J554J114k04j598k233k075j584
57519A39127r12j4P32Q55N63M51N38M04J59M16J264K081K403K265J703P51p4j48
57501A52564K96M04o4n23o82r79j713k539l046l242l312l465l950m567m447l161
57485A17574j695j279j566j263l58p5o11o54L79J337J245O74K88m30j889l047
$$ plain form
57597 211035 209306 207236 205001 203220 202263 201416 199471 196056 191769 187164 182346 177585 173523 170520 168234
57582 168234 166093 163790 161186 158108 154494 150634 147111 144397 142409 140443 137837 134777 132165 130549
57568 130549 129584 128720 127894 127191 126270 124708 122608 120432 118431 116748 115789 116007 117430 119756 122709 125924
57552 125924 128816 131092 133170 135541 137849 139258 139670 139936 140699 141498 141334 139895 137981 136763 136705 137243
57536 137243 137573 137669 138226 139616 141285 142374 142659 142652 143038 144153 145707 146821 146617 145019 142786 140711 139127
57519 139127 138215 138201 138933 139788 140351 140802 141340 141744 141903 142319 143583 145664 148067 150332 152035 152786 152712 152564
57501 152564 152860 153264 153200 152677 151995 151016 149303 146764 143718 140476 137164 133699 129749 125182 120735 117574
57485 117574 115879 114600 113034 111771 111413 111338 110727 110073 110452 111789 113034 113708 113996 113566 111677 108630
57469A08630k753j516o79n46m68j84Q1M28J002J316Q63J37P2O14Q63N49L49O52
57451A09410Q98M76l16o46k01M94P44M26n0l92p74j345j763j590r47k93K19O58
57433A05008Q30N17P4Q5M63N78K13l04p43r78o02N57J633J556O05L6J48J0p43
57414A08943j253r71n48o25q15n80j02K92O80R88Q26K79JJ06K0k87p4P26J115
57395A08721O82L22O53R62N26k01n21m63k6J221K933L703L016K239K537L165K986
57378A32455K382K160J867Q45j35k3N43L05m49n79l56j027k417k941k041q81m88
57361A29220p09j097j488j460n79O24J087P93P87J423J760R92l80j181p07Q20
57345A29905K333K634J590M54L11O47L35m74o16J80R75J104Q62N94K01l02o32
$$ plain form
57469 108630 105877 104361 103682 103136 102668 102484 102565 102993 103995 105311 106174 106311 106383 106997 107860 108409 108758 109410
57451 109410 110308 110784 110468 109822 109621 110115 110859 111285 111235 110843 110069 108724 106961 105371 104424 104131 104350 105008
57433 105008 105838 106355 106429 106514 106977 107555 107768 107464 106721 105743 105141 105698 107331 108887 109492 109528 109676 109686 108943
57414 108943 107690 106719 106171 105546 104731 104151 104049 104341 105021 106009 106835 107114 107115 107221 107241 106954 106880 107606 108721
57395 108721 109403 109725 110378 111340 111866 111665 111144 110681 110655 111876 114809 118512 121528 123767 126304 129469 132455
57378 132455 134837 136997 138864 139709 139574 139551 140094 140399 139950 139371 139015 137988 135571 132630 130589 129708 129220
57361 129220 128511 127414 125926 124466 123887 124511 125598 126391 127178 128601 130361 131353 130973 129792 129085 129905
57345 129905 132238 134872 136462 136916 137227 137874 138209 137735 137119 137299 138274 139378 140240 140834 141035 140733 140101
57328A40101p95j074j384j387j131r30q07p19j017j773k115j259N5L67m74j233
57312A24425j143o69l51j54l7k04n34o95p94j121j283o89K24L84k14l90M10J342
57294A18507J501J068P52R43J686K779L616L561K698J655Q43M46Q43K095L291
57279A46284L468L008L018L543L681L324L293L717L750L179K884L309L804L942
57265A94204M147M564M566L972L539L624L581L054K687K857K947K591K445K873
57251B41651L041K333J554J632K004J531K88p56j317j931k814l619m118m317m108
57236B31054l562l275l738m544m881m511l751k742j388K18J826L292M453N010
57222B13461M935M691M647M646M503M461M742N055N047M850M745M692M637M801
$$ plain form
57328 140101 139306 138232 136848 135461 134330 133400 132593 131874 130857 129084 126969 125710 125765 126132 125658 124425
57312 124425 123282 122613 122262 122108 122071 121867 121333 120638 119844 118723 117440 116751 116975 117359 117145 116755 117165 118507
57294 118507 120008 121076 121828 122771 124457 127236 130852 134413 137111 138766 139609 140055 140898 142993 146284
57279 146284 149752 152760 155778 159321 163002 166326 169619 173336 177086 180265 183149 186458 190262 194204
57265 194204 198351 202915 207481 211453 214992 218616 222197 225251 227938 230795 233742 236333 238778 241651
57251 241651 244692 247025 248579 250211 252215 253746 254034 253278 251961 250030 247216 243597 239479 235162 231054
57236 231054 227492 224217 220479 215935 211054 206543 202792 200050 198662 198880 200706 203998 208451 213461
57222 213461 218396 223087 227734 232380 236883 241344 246086 251141 256188 261038 265783 270475 275112 279913
57208B79913N205N293M656L792L557M148N125O083O783O944O560O185O377O948
57194C57569P339P535Q081R249J0665J1825J2536J2919J3218J3663J4270J4820
57182D93689J5126J5226J5200J4986J4468J3551J2083R952P434N068L053J087
57170F20923r78k615l098k209k63K382N564R188J3143J7288K1478K5652K9821
57157G36276L3822L7256L9844M1739M3212M4254M4806M5068M5068M4298M2492
57146A198135M0502L9548L9639L9711L9373L9457M0632M2480M4490M7004N0547
57135A661518N4880N9544O4778P1185P8734Q6681R4276J01108J06924J11576J15220
57124B606424J18350J21639J25590J30135J34579J38342J41571J44718J47661
$$ plain form
57208 279913 285118 290411 295067 298859 302416 306564 311689 317772 324555 331499 338059 344244 350621 357569
57194 357569 364908 372443 380524 389773 400438 412263 424799 437718 450936 464599 478869 493689
57182 493689 508815 524041 539241 554227 568695 582246 594329 604281 611715 616783 619836 620923
57170 620923 619945 617330 614232 612023 611760 614142 619706 628894 642037 659325 680803 706455 736276
57157 736276 770098 807354 847198 888937 932149 976403 1021209 1066277 1111345 1155643 1198135
57146 1198135 1238637 1278185 1317824 1357535 1396908 1436365 1476997 1519477 1563967 1610971 1661518
57135 1661518 1716398 1775942 1840720 1911905 1990639 2077320 2171596 2272704 2379628 2491204 2606424
57124 2606424 2724774 2846413 2972003 3102138 3236717 3375059 3516630 3661348 3809009
57115C809009J49958J51794J54051J57444J62300J69112J78385J89851K02779
57106E324683K17415K35445K58903K89457L29010L80198M45885N28755O31478
57097H641229P56505R05558J079994J281393J510486J765152K040303K329467
57089B0310087K625218K918448L199270L458941L688639L875859M004054M055097
57081D8135613M006227L821279L452170K863145K063878J121106J35725p96567
57073F4802576j613238k289960k829542l246203l552800l755256l854901l854788
57065C9805888l764141l598372l376290l117224k839049k556883k282227k022903
57057A6248799j783772j567589j375173j205357j055698r23877q08456p08365
$$ plain form
57115 3809009 3958967 4110761 4264812 4422256 4584556 4753668 4932053 5121904 5324683
57106 5324683 5542098 5777543 6036446 6325903 6654913 7035111 7480996 8009751 8641229
57097 8641229 9397734 10303292 11383286 12664679 14175165 15940317 17980620 20310087
57089 20310087 22935305 25853753 29053023 32511964 36200603 40076462 44080516 48135613
57081 48135613 52141840 55963119 59415289 62278434 64342312 65463418 65599143 64802576
57073 64802576 63189338 60899378 58069836 54823633 51270833 47515577 43660676 39805888
57065 39805888 36041747 32443375 29067085 25949861 23110812 20553929 18271702 16248799
57057 16248799 14465027 12897438 11522265 10316908 9261210 8337333 7528877 6820512
57049F820512o22205n48196m84356m28551l79028l35252k97644k66016k38789
57040C220475k14114j91256j70343j51353j33979j18045j03369q9549p6385o4078
57030A908004n2389m0189k6523j1667L527J8448L1419L8018L2640J3001j7102
57019A897187m9646p6768r4069j01209j00491r4757q6007p5532o4648n4705m6454
57008A052901l9915l4892l1291k8997k7753k7188k6834k6320k5900k6403k8243
56997G29165l0631l2225l2481l1952l1396l0947l0116k8292k5288k1448j7144
56986D17245j2214o343m7N394R147J1234J1477R179M485p83m702p031q506r110
56972D19425q321o583n043l844k089L39K324L270M128N941Q367J0483J2382J4942
$$ plain form
57049 6820512 6198307 5650111 5165755 4737204 4358176 4022924 3725280 3459264 3220475
57040 3220475 3006361 2815105 2644762 2493409 2359430 2241385 2138016 2048467 1972082 1908004
57030 1908004 1855615 1815426 1788903 1777236 1780763 1799211 1830630 1868648 1901288 1914289 1897187
57019 1897187 1847541 1770773 1676704 1575495 1475004 1380247 1294240 1218708 1154060 1099355 1052901
57008 1052901 1012986 978094 946803 917806 890053 862865 836031 809711 783811 757408 729165
56997 729165 698534 666309 633828 601876 570480 539533 509417 481125 455837 434389 417245
56986 417245 405031 398688 398641 404035 413182 424416 435893 445072 449557 448774 444072 437041 428535 419425
56972 419425 411104 404521 399478 395634 393545 393884 396208 399478 403606 409547 417914 428397 440779 455721
56958D55721J8229K1009K1908K0401J6510J0217J772p614j6059k2299k6291k8314
56946D65190k8064k5279k0921j6731j3447j0343o674k743Q92M359Q022J1706J5146
56933C81113J8609K2406K6077K8542K8667K5356J7814O602o026j7466k6246l1895
56921D73553l4144l3156l0020k6160k2406j9083j6448j4331j1927q758n501l138
56909B48481j769r17m37k42J87J061J605J215P18J308K676L520L605L889M757
56894B69657N616O278P457R469J1701J3642J5543J7651J9701K1301K1982K0749
56882D40747J6547R611J596n803j1693j5532j6945j6318j4652j2414r241n032
56870C60871n65L450P196J1206J5575K0094K4798K9937L5722M2164M8858N4639
$$ plain form
56958 455721 473950 494959 516867 537268 553778 563995 565767 558153 542094 519795 493504 465190
56946 465190 437126 411847 390926 374195 360748 350405 343731 340988 341880 346239 354261 365967 381113
56933 381113 399722 422128 448205 476747 505414 530770 548584 555186 549160 531694 505448 473553
56921 473553 439409 406253 376233 350073 327667 308584 292136 277805 265878 257120 251619 248481
56909 248481 246712 245795 245358 245116 245303 246364 247969 249184 249902 251210 253886 257406 261011 264900 269657
56894 269657 275273 281551 289008 298477 310178 323820 339363 357014 376715 398016 419998 440747
56882 440747 457294 466905 468501 462698 451005 435473 418528 402210 387558 375144 365903 360871
56870 360871 360306 363756 370952 382158 397733 417827 442625 472562 508284 550448 599306 653945
56858F53945N7623N5603M6699L0525R448j1828k8894l9939m5330m5904m2637l7157
56846F02154l0925k3935j5466n890L483J2259K1186L0496L9553M8358N7883O8411
56834H07567P8690Q7032R1655Q9485P6570N1476J7814j7511m8126p0240q2591
56823A081821q6098q3231p6497o7249n6162m4179l2361k1250j1030j955O040J3819
56811F21668K2429L2096M2113N1526N9397O4350O4178N6343L9506J5218j1979
56800A056845l6751n5527o7073p1521o9902o4247n6768m8563l9860l1352k4125
56789D91156j8172j2287n789P74P001J3362J9927K5587K9391L1579L2243K9819
56777F44591K2274R553n898k0768l2495l9898m3229m3603m1917l8479l3792k8975
$$ plain form
56858 653945 711568 767171 813870 844395 853843 842015 813121 773182 727852 681948 639311 602154
56846 602154 571229 547294 531828 525938 529421 541680 562866 593362 632915 681273 739156 807567
56834 807567 886257 973289 1064944 1154429 1230999 1282475 1300289 1282778 1234652 1164412 1081821
56823 1081821 995723 912492 835995 768746 712584 668405 636044 614794 603764 601809 607849 621668
56811 621668 644097 676193 718306 769832 829229 893579 957757 1014100 1053606 1068824 1056845
56800 1056845 1020094 964567 897494 825973 756071 691824 635056 586493 546633 515281 491156
56789 491156 472984 460697 454908 455682 462683 476045 495972 521559 550950 582529 614772 644591
56777 644591 666865 676418 670520 649752 617257 577359 534130 490527 448610 410131 376339 347364
56765C47364k4879k1334j7889j4760j2433j0774r329q120p451p188o843o235n482
56752A94647m530l288k130j623j777k045k168k551l517m513m493l188j654j145
56738A56025j604j889j468j089j332j431m62J010J645J300J023J257J340R55O93
56723A55973R23J254J435J761K169K057J443J233J824K416K345K101K307K609
56709A81850K334J655J247J356J789K365K815K719K061J371R84O48K23M3K75M85
56693B04220L24K6j22k14k91j62N8j03o88j143j230j301j440j230o92n49j047
56676A94416j451j147n13k05l57r18j877k745k694j668n02K73Q51J176Q15J77
56660A83631M05J504K043J393Q33J445K410K573K275K340K404J804J055R94J245
$$ plain form
56765 347364 322485 301151 283262 268502 256069 245295 235966 227846 220395 213207 206364 200129 194647
56752 194647 190117 186829 184699 183076 181299 179254 177086 174535 171018 166505 162012 158824 157170 156025
56738 156025 154421 152532 151064 149975 148643 147212 146750 147760 149405 150705 151728 152985 154325 155280 155973
56723 155973 156896 158150 159585 161346 163515 165572 167015 168248 170072 172488 174833 176934 179241 181850
56709 181850 184184 185839 187086 188442 190231 192596 195411 198130 200191 201562 202546 203194 203417 203460 203735 204220
56693 204220 204544 204570 204448 204234 203943 203781 203839 203736 203048 201905 200675 199374 197934 196704 196012 195463 194416
56676 194416 192965 191818 191305 191100 190743 189825 187948 185203 182509 180841 180339 180612 181463 182639 183454 183631
56660 183631 184036 185540 187583 188976 189809 191254 193664 196237 198512 200852 203256 205060 206115 207109 208354
56645B08354R58L44O4j91j116k320k838k628k268j696n90M79O23N1l24l44m66
56628A96092n28K2R02J244R26O20N94N25K78m6o35j634k500k584k080j590j164
56611A88442o19k94n22q14n93k51m41q14o38k27m77j269j637j285p95m23J02P30
56593A78175J089J267J595J847J592J066P08K13q55j871j868j183j036j538j583
56578A77618p47K5p3o28p73q5J453L455M902M761L232J713J388K255L559M612
56562B06667N297O153P885J0416J2843J4572J5728J6046J4451J0775O699L780
56550C31312J474j326l819m315l134k392k907l398k894k094j813j742j448j282
56536C00222j590k026k202k187k023j585j103j061j412j689j855k139k201j473
$$ plain form
56645 208354 209312 209656 209720 209529 208413 206093 203255 200627 198359 196663 196073 196552 197175 197226 196902 196558 196092
56628 196092 195564 195586 196488 197732 198658 199278 199872 200397 200675 200629 199994 198360 195860 193276 191196 189606 188442
56611 188442 187823 187529 187007 186193 185600 185349 184908 184094 183456 183229 182752 181483 179846 178561 177766 177343 177445 178175
56593 178175 179264 180531 182126 183973 185565 186631 187339 187552 186697 184826 182958 181775 180739 179201 177618
56578 177618 176871 176896 176823 176195 175422 175337 176790 180245 185147 189908 193140 194853 196241 198496 202055 206667
56562 206667 211964 218117 226002 236418 249261 263833 279561 295607 310058 320833 327532 331312
56550 331312 332786 331460 327641 323326 320192 317800 314893 311495 308601 306507 304694 302952 301504 300222
56536 300222 298632 296606 294404 292217 290194 288609 287506 286445 285033 283344 281489 279350 277149 275676
56522B75676l71k5o72j413j626j591j633j670j765k156k591k594k366k586l257
56507B49360l739l775l566l035k088j440j865k822l085k610k427k712k501j439
56493B12256l44J94M08L66k14q77n92O15J516J480J140R56N62K7L15J787L382
56476B22977M005L734L131K347J511J018Q74N83N5j95K3L61P82J487J851P30j652
56459B43622l392l158j735p36o95j025j088o89o5K55J7l19k63j36l71l84O45K118
56441B32601K616K001J470J467J229N27K25O88J186J273J297J208M09p82j153
56426B46262n58k74q08j060k96O86J156J622K470K926K387J494R55M82j88m70
56410B56786oN79P77R66J329J232L60o37j240j562j336K8J797K040L28j341j354
$$ plain form
56522 275676 275305 275280 274608 273195 271569 269978 268345 266675 264910 262754 260163 257569 255203 252617 249360
56507 249360 245621 241846 238280 235245 233157 231717 229852 227030 223945 221335 218908 216196 213695 212256
56493 212256 211912 212106 212514 212880 212666 211789 211197 211812 213328 214808 215948 216904 217466 217493 217808 219595 222977
56476 222977 226982 230716 233847 236194 237705 238723 239597 240180 240235 240040 240063 240424 241206 242693 244544 245274 243622
56459 243622 240230 237072 235337 234601 233906 232881 231793 231104 231039 231294 231311 230992 230729 230593 230222 229838 230483 232601
56441 232601 235217 237218 238688 240155 241384 241911 242136 242824 244010 245283 246580 247788 248197 247415 246262
56426 246262 245704 245430 244622 243562 243266 243952 245108 246730 249200 252126 254513 256007 256962 257444 257256 256786
56410 256786 256780 257359 258136 259102 260431 261663 262023 261386 260146 258584 257248 257276 259073 261113 261441 260100 258746
56393B58746n17k02j77K70O26J78l76RJ017J623J645J452J075O31O98J228J207
56376B69133L81M2R80K002J826J072Q72R09M65K53J258K646K829J916J334J451
56360B89369J365P70L38L87N79Q85J626K581L174L406L712M082M137L868L521
56345C23800L155K817K692K566J841O50O1N54J227J297J258J707K161K122K124
56330C50032K580K690J828R41J121J770J683J087R84J247R44N8o78j160j742k056
56314C61329j465l06N33R50J350J506R60J54o0L60R46J792L148M385M599L955
56298C84136L416L495M131N252O501O970O295N459N518O199O623O800P251P845
56284D65891Q172Q398Q756Q800Q310Q120Q964J0248J1076J1716J2794J3917J4435
$$ plain form
56393 258746 258229 258027 257850 258120 258746 258924 258548 258557 259574 261197 262842 264294 265369 266000 266698 267926 269133
56376 269133 269514 269556 270536 272538 274364 275436 276308 277217 277682 277935 279193 281839 284668 286584 287918 289369
56360 289369 290734 291504 291842 292229 292808 293693 295319 297900 301074 304480 308192 312274 316411 320279 323800
56345 323800 326955 329772 332464 335030 336871 337521 337582 338136 339363 340660 341918 343625 345786 347908 350032
56330 350032 352612 355302 357130 358071 359192 360962 362645 363732 364716 365963 366907 366965 366287 365127 363385 361329
56314 361329 359864 359558 360091 361041 362391 363897 364857 365011 364951 365311 366257 368049 371197 375582 380181 384136
56298 384136 387552 391047 395178 400430 406931 413901 420196 425655 431173 437372 443995 450795 458046 465891
56284 465891 474063 482461 491217 500017 508327 516447 525411 535659 546735 558451 571245 585162 599597
56271E99597J4822J5842J7102J7822J8392J9797K2014K4358K6750K9347L1601
56260H37444L3135L4916L8202M2803M7814N3344O0051O7626P5313Q3530R3390
56249A467568J04951J17318J30125J43568J57266J70337J82251J92578K00375
56240B866337K04947K06518K05134J99618J88711J72495J51582J25916R5617O2109
56230D478984K7094q559m3614p5569j02623j25464j45380j61774j73347j80498
56220C489250j84483j85191j82014j76080j69276j61726j52356j41544j30996
56211B005584j21445j12475j04102r6591q9207q1183p3443o7378o2468n7129n1369
56200A088794m6471m2565l8658l4642l1145k7864k4205k1081j9784j9448j7957
$$ plain form
56271 599597 614419 630261 647363 665185 683577 703374 725388 749746 776496 805843 837444
56260 837444 870579 905495 943697 986500 1034314 1087658 1147709 1215335 1290648 1374178 1467568
56249 1467568 1572519 1689837 1819962 1963530 2120796 2291133 2473384 2665962 2866337
56240 2866337 3071284 3277802 3482936 3682554 3871265 4043760 4195342 4321258 4416875 4478984
56230 4478984 4506078 4497519 4453905 4378336 4275713 4150249 4004869 3843095 3669748 3489250
56220 3489250 3304767 3119576 2937562 2761482 2592206 2430480 2278124 2136580 2005584
56211 2005584 1884139 1771664 1667562 1570971 1481764 1400581 1327138 1259760 1197292 1140163 1088794
56200 1088794 1042323 999758 961100 926458 895313 867449 843244 822163 802379 782931 764974
56189G64974j5112j2647j1365j0471r517q813q057o670n291m904m838l722j924
56176F61643q78n36J41P68K30o84j41J501K078J203O21J009J238J054J739L652
56160F74638N554O821Q073R350R889R887J0356J1191J1553J1956J3572J5743J6807
56147H15390J7255J9340K3597K8541L3724M0143M7566N4551O1315O9456P8443
56136A289321Q5449Q9105R0285Q8667Q2036P0232N6833M5637L7837L3323L1830
56125B000555L1638K9724K4560J7038Q234j332j0014j5570j8238k0782k4951l0422
56113A990440l7558m7885o0782p2605q0369q3950q3944q0149p3165o4925n6483
56102A248625m7416l8036k9797k3043j6877j1630q688p548n929l351j564j053
$$ plain form
56189 764974 749862 737215 725850 715379 705862 697049 688992 682322 677031 672127 667289 663567 661643
56176 661643 660765 660229 660370 661138 661368 660684 660543 662044 664122 665325 665946 666955 668193 669247 670986 674638
56160 674638 680192 687013 695086 704436 714325 724212 734568 745759 757312 769268 782840 798583 815390
56147 815390 832645 851985 875582 904123 937847 977990 1025556 1080107 1141422 1210878 1289321
56136 1289321 1374770 1463875 1554160 1642827 1724863 1795095 1851928 1897565 1935402 1968725 2000555
56125 2000555 2032193 2061917 2086477 2103515 2111749 2110417 2100403 2084833 2066595 2045813 2020862 1990440
56113 1990440 1952882 1904997 1844215 1771610 1691241 1607291 1523347 1443198 1370033 1305108 1248625
56102 1248625 1201209 1163173 1133376 1110333 1093456 1081826 1073138 1065590 1059661 1056310 1054746 1053693
56090A053693k42J258J954J689K264M109N596O400Q056J0472J1454J0663J0419
56077A127785J1609J2369J1909J1930J3042J3541J3040J3595J5760J7221J6787
56066A278588J6188J6428J6076J4663J4105J5160J5999J5811J6228J7787J8702
56055A455735J8505J9125K0912K1539K0284J9368J9673J9314J7847J7608J9296
56044A669206K0688K1234K3251K7015K9534L0023L1666L6039M0754M4434M8769
56033B022613N3627N5773N4784N4487N6107N5862N2074M8503M7508M6135M2452
56022B589925L9607L9835M0498M0014M1531M6562N1155N2814N5170O1135O7557
56011C125803P1401P5176Q1263Q6849Q9619R2609R8228J03473J06170J09895J17364
$$ plain form
56090 1053693 1053451 1054709 1056663 1058352 1060616 1064725 1070321 1076721 1084777 1095249 1106703 1117366 1127785
56077 1127785 1139394 1151763 1163672 1175602 1188644 1202185 1215225 1228820 1244580 1261801 1278588
56066 1278588 1294776 1311204 1327280 1341943 1356048 1371208 1387207 1403018 1419246 1437033 1455735
56055 1455735 1474240 1493365 1514277 1535816 1556100 1575468 1595141 1614455 1632302 1649910 1669206
56044 1669206 1689894 1711128 1734379 1761394 1790928 1820951 1852617 1888656 1929410 1973844 2022613
56033 2022613 2076240 2132013 2186797 2241284 2297391 2353253 2405327 2453830 2501338 2547473 2589925
56022 2589925 2629532 2669367 2709865 2749879 2791410 2837972 2889127 2941941 2997111 3058246 3125803
56011 3125803 3197204 3272380 3353643 3440492 3530111 3622720 3720948 3824421 3930591 4040486 4157850
56000D157850J25176J30416J36172J45183J54607J62562J72845J87408K01504
55991E573723K12305K24775K42603K61331K77165K94477L17310L41813L64636
55982H110138L90237M22111M55758M88453N26552N74630O27454O81589P44150
55973A3021072Q20576R05368R95469J100424J228039J373282J533919J723151
55965B2701300J953532K224115K538958K922372L399869L982988M692822N579412
55957D9995368O695646Q070343R726632J1699439J4007347J6637697J9593930
55950A36426402K2922678K6641496L0636423L4582310L7773422L8887475L6133744
55943C64003950K8175790J5340064n5076j4774685k6284479l3592521l6959610
$$ plain form
56000 4157850 4283026 4413442 4549614 4694797 4849404 5011966 5184811 5372219 5573723
55991 5573723 5786028 6010803 6253406 6514737 6791902 7086379 7403689 7745502 8110138
55982 8110138 8500375 8922486 9378244 9866697 10393249 10967879 11595333 12276922 13021072
55973 13021072 13841648 14747016 15742485 16842909 18070948 19444230 20978149 22701300
55965 22701300 24654832 26878947 29417905 32340277 35740146 39723134 44415956 49995368
55957 49995368 56691014 64761357 74487989 86187428 100194775 116832472 136426402
55950 136426402 159349080 185990576 216626999 251209309 288982731 327870206 364003950
55943 364003950 392179740 407519804 407464728 392690043 366405564 332813043 295853433
55936B95853433l7188297l5187983l1840454k7902527k3908938k0177456j6881747
55929A02766031j4088343j1769524r853047q277570o994428n945540n074410m348979
55921C6414190l750651l252072k825652k461937k159424j905366j683409j490295
55913A6885384j328347j189862j064042r51290q56280p74177o97040o26860n69437
55904H828049n21645m76703m35894m03576l76280l47906l20382k98677k80274
55895E366712k59816k39368k24087k12075j98145j83560j72718j63949j52656
55886C560338j40185j30809j23045j12493j00581r2409q8310q5101q3273q5291
55876B518841q8945q9580q7324q5502q3914q0122p5443p3215p2645p0382o6651
$$ plain form
55936 295853433 258665136 223477153 191636699 163734172 139825234 119647778 102766031
55929 102766031 88677688 76908164 67055117 58777547 51783119 45837579 40763169 36414190
55921 36414190 32663539 29411467 26585815 24123878 21964454 20059088 18375679 16885384
55913 16885384 15557037 14367175 13303133 12351843 11495563 10721386 10024346 9397486 8828049
55904 8828049 8306404 7829701 7393807 6990231 6613951 6266045 5945663 5646986 5366712
55895 5366712 5106896 4867528 4643441 4431366 4233221 4049661 3876943 3712994 3560338
55886 3560338 3420153 3289344 3166299 3053806 2953225 2860816 2772506 2687405 2604132 2518841
55876 2518841 2429896 2340316 2252992 2167490 2083576 2003454 1928011 1854796 1782151 1711769 1645118
55865A645118o4031o1859n7447n1372m6125m1107l4211k6752k1603j7977j3296
55854A209338q629p060q100q952r927j3394j8439k1824k3496k6109k9607l1100
55842A002701k9860k7994k6424k4279k2017k1197k1282k0203j7883j5994j4817
55831G60751j3451j2404j2737j3390j2554j0839j0134j0304j0079j0031j1404
55820F33424j3065j2929j1484j0700j0497r497q177p957q139p119n682n669o301
55807E16208n301k964j659j763j464j90R99K047L848N807O440O069O150O423N503
55792E46153L852L227L630L499K554J737Q19j102l182l638k784k706m318p087
55778E40654j0947j5779j9684k0594j9171j7561j5900j2846q856n831l852j481
$$ plain form
55865 1645118 1581087 1519228 1461781 1410409 1364284 1323177 1288966 1262214 1240611 1222634 1209338
55854 1209338 1200709 1193649 1185549 1176597 1166670 1153276 1134837 1113013 1089517 1063408 1033801 1002701
55842 1002701 972841 944847 918423 894144 872127 850930 829648 809445 791562 775568 760751
55831 760751 747300 734896 722159 708769 696215 685376 675242 664938 654859 644828 633424
55820 633424 620359 607430 595946 585246 574749 565252 557075 549118 540979 533860 528178 522509 516208
55807 516208 510907 507943 506284 504521 503057 502867 503866 505913 509761 515568 522008 528077 534227 540650 546153
55792 546153 550005 553232 556862 560361 562915 564652 565471 564369 561187 557549 554765 552059 547741 540654
55778 540654 529707 513928 494244 473650 454479 436918 421018 408172 399316 393485 389633 388152
55766C88152R01J076j407m380o057o526o192n202m394m596m960m124k731k545
55752C37015l447l835l583m080n439o280o286o477o988o929o480o723p430p227
55738B55811n991m905m311l591k901k772k451r92M66J24j312j607q15j098k852
55723B20803m157m232m363m973m722l248j985j558q78M26J178J004J135K105K881
55708A99416L022L468M448M773L980L055K353Q62j679l983n280o225p109p124
55694A93977o130n211m808m077k698j514q56j02O85O46J4K8O75P55N34J772M391
55677A78081N811M661K717J899J728J149N84N17Q2j178j901q95Q35J632J393Q69
55661A97984J38p60r63n7Q92Q54M71Q99J953K583K358J550M94k98k76J94P6o81
$$ plain form
55766 388152 389053 390129 388722 384342 378285 371759 365567 360365 355971 351375 346415 342291 339560 337015
55752 337015 333568 329733 326150 322070 316631 310351 304065 297588 290600 283671 277191 270468 263038 255811
55738 255811 249820 244915 240604 237013 234112 231340 228889 227897 228363 228487 227175 225568 224753 223655 220803
55723 220803 216646 212414 208051 203078 198356 195108 193123 191565 190687 191113 192291 193295 194430 196535 199416
55708 199416 202438 205906 210354 215127 219107 222162 224515 225377 223698 219715 214435 208210 201101 193977
55694 193977 187847 182636 177828 173751 171053 169539 168683 168581 169266 169912 169926 169954 170629 171384 171918 173690 178081
55677 178081 183892 188553 191270 193169 194897 196046 196630 197147 197229 196051 194150 193255 194090 195722 197115 197984
55661 197984 198122 197362 196399 196342 197234 198088 198559 199458 201411 203994 206352 207902 208396 208098 207822 208016 208092 207411
55643B07411r24l20j56j250k615l188l458m229n019n074m846n196n935o316o201
55628A52684n766m862l630k894k942k802j667k45K67j48o02o33m05j42m8l56r14
55611A24895j285j592k369l334l347k108p81l78n26m59j68N7K50K58l35j207j279
55594A06292l27M92L49j60l10l67o27n33K08P70M01m06q71j070j242j027l20J04
55576A01356j72k80N64J671J979J701J779K382K946L116K764J719L10m71k24J15
55560A21255m48j587k350k473k307k127k250l031m047m070k714j200p66j140j422
55545H9323j462j398q13N87K109K999L486M009M246L895L596L929M217L536K291
55530A24550J580J474J150L29n16j132j670k113k360k630l099l513l719m014m407
$$ plain form
55643 207411 206487 206167 206011 204761 202146 198958 195500 191271 186252 181178 176332 171136 165201 158885 152684
55628 152684 146918 142056 138426 135532 132590 129788 128121 127876 128143 127995 127393 126760 126355 126213 126165 125809 124895
55611 124895 123610 122018 119649 116315 112968 110860 110079 109701 109175 108716 108548 108605 108855 109113 108778 107571 106292
55594 106292 105965 106457 106806 106646 106336 105969 105342 104809 105017 105787 106188 105782 104911 103841 102599 101572 101252 101356
55576 101356 101184 100904 101468 103139 105118 106819 108598 110980 113926 117042 119806 121525 121835 121364 121140 121255
55560 121255 120807 119220 116870 114397 112090 109963 107713 104682 100635 96565 93851 92651 91885 90745 89323
55545 89323 87861 86463 85650 86237 88346 91345 94831 98840 103086 106981 110577 114506 118723 122259 124550
55530 124550 126130 127604 128754 129083 128567 127435 125765 123652 121292 118662 115563 112050 108331 104317 99910
55515I9910m219l126j842j068n18J23K94m17j187j042l25O5J49L67L19n92j729
55498H5162j899j162o90r72j341j277r65o90n24o55j150j582j539j237r25k39
55482F8315R97J897J570N89K47O29O82M6m66k06N42J250J629J400M23p88j456
55465G7300j475j354j311j199j165j531k003j848r53l5K60jl44l58J10Q16J327
55448F6236J606K045K659K796K163J420J136Q83J75l94o1O66O52j03n87m47l25
55431H0520n62p16n51m34n73o22l58m2N8k1k21n28p23m85J90R79J503J430O51
55412G9495l39o81j74M52O37O13N50M3q27r53J97J301Q68n77j371j192j038j161
55394G5843q06K8K23o47j595j705j181n59K2L47o9j123j918j821j110l34K74N67
$$ plain form
55515 99910 95691 92565 90723 89655 89137 89260 89554 89137 87950 86908 86583 86648 86797 87164 87483 86891 85162
55498 85162 83263 82101 81411 80439 79098 77821 76856 76166 75642 74987 73837 72255 70716 69479 68554 68315
55482 68315 69312 71209 72779 73368 73615 74244 74926 74972 74506 74300 74842 76092 77721 79121 79544 78756 77300
55465 77300 75825 74471 73160 71961 70796 69265 67262 65414 64461 64426 64686 64685 64341 63983 64093 64909 66236
55448 66236 67842 69887 72546 75342 77505 78925 80061 80944 81119 80725 80664 81330 81982 81879 81292 80845 80520
55431 80520 79958 79242 78691 78257 77684 77062 76704 76662 76720 76699 76478 75950 75227 74742 74932 75911 77414 78844 79495
55412 79495 79156 78475 78301 78753 79390 80003 80553 80596 79769 78816 79013 80314 81182 80605 79234 78042 77004 75843
55394 75843 75037 75065 75288 74641 73046 71341 70160 69601 69623 69970 69901 68778 66860 65039 63929 63595 63869 64436
55376F4436M01J05K81R28J379J247R23Q97J216J698K124K138J523O70K18J80k4
55359H0340o57j337j672j658j446j151q54m45L38J289J577P84l61r29r67r93r07
55342G0951m19j5l47r60q97k84q9m26n20k15j33k52K30J298J783J078O4k40J35
55323G0742O34J007J121Q24L99L44N27L59p5q4K70N9r10j559j112k15J37j76o95
55304G1597j048q35K02J475J843J144M91O41J071J115R52P99K44q49j659j553
55288G5630j012o83l12M64J106R40L70K36M99M77M2l69o41j029j481j656j439
55271G1142r68l27K93N19L83N08J106J364N98m74n87K06N92K0m50K99J779K465
55253G8468J721M92mK39K51l91r28n94K01M99J76j23j64k92n19m16n5k0k79j06
$$ plain form
55376 64436 64837 64942 65223 66151 67530 68777 69700 70597 71813 73511 75635 77773 79296 79966 80184 80364 80340
55359 80340 79683 78346 76674 75016 73570 72419 71565 71120 71458 72747 74324 75108 74747 73818 72851 71858 70951
55342 70951 70532 70517 70170 69210 68313 68029 67940 67514 66994 66779 66646 66394 66624 67922 69705 70783 70847 70607 70742
55323 70742 71376 72383 73504 74328 74727 75071 75598 75957 75882 75798 76068 76127 75217 73658 72546 72331 72468 72292 71597
55304 71597 70549 69714 69916 71391 73234 74378 74869 75510 76581 77696 78648 79447 79691 78842 77183 75630
55288 75630 74618 73935 73623 74087 75193 76133 76503 76739 77238 77715 77757 77388 76747 75718 74237 72581 71142
55271 71142 70174 69847 70140 70659 71042 71550 72656 74020 74618 74144 73557 73763 74355 74375 73925 74224 76003 78468
55253 78468 80189 80681 80677 80916 81167 80776 79848 79254 79455 79954 80130 80007 79843 79551 79032 78616 78561 78541 78262 78156
55233G8156N25N94l07j150j006m36l57m72l7N38K05r29j635j331p12m22j66M86
55215G1544J179J241O11m7j05L93P99O19J60J90Q27J236P24k69p19l10L57O93
55197G9123O82N52L79J78R2K61O39R75J007P04L04M8j23l64n55m19L9N22Q70J137
55177H6051J254J013M23k82r27j320j057j2J106J346O85q7n42q79j005m88M13
55160H5692P28K17j91N7L36J09p0K81M71k19j114j069k20L89M23L61L32K9l56
55141H6186k95R8K79L65Q97J527J152l46j587j425l83K41M9k82j10M48Q11N58
55123H8183j96r65j335j267r07l84N1ln45q98m79L37O34J91k93k02L53R72J507
55104H4754J886J828J135J41n07m77k8L94O48Q91J148J116N98r0m10j80M37J321
$$ plain form
55233 78156 78681 79275 78968 77818 76812 76376 76019 75547 75510 76048 76253 75324 73689 72358 71646 71224 71058 71544
55215 71544 72723 73964 74575 74528 74423 74816 75615 76234 76394 76584 77411 78647 79371 79102 78383 78073 78430 79123
55197 79123 79805 80357 80736 80914 81006 81267 81906 82881 83888 84592 84896 84944 84821 84457 83902 83483 83522 84044 84914 86051
55177 86051 87305 88318 88741 88459 87532 86212 85155 85143 86249 87595 88280 88193 87651 86772 85767 85279 85692
55160 85692 86420 86637 86446 86503 86839 86948 86878 87159 87630 87411 86297 85228 85008 85397 85820 86181 86513 86542 86186
55141 86186 85891 85989 86268 86633 87530 89057 90209 89863 88276 86851 86468 86709 86758 86476 86366 86814 87625 88183
55123 88183 87987 87022 85687 84420 83513 83129 83180 83177 82632 81734 81255 81592 82226 82417 82124 81922 82275 83247 84754
55104 84754 86640 88468 89603 89744 89237 88760 88732 89126 89774 90665 91813 92929 93527 93437 93027 92847 93284 94605
55086I4605K285K735K134Q87O4L0O3l89q20n82L8L42L16M80R61J418J660J685
55068A07912J307L54q00j413j129k18P90J402J327O78r5p03j166j334q21K05P87
55051A07083K68q49j673k044k222k061j364o58o05q87o46PKr93j854j391J62J485
55033I1760J622P82j23m15k54k32m73m67Q4O43N75jn18p98q89n66K29P37J40j057
55013I0779j356k21J162J406N49l02l97J02O93J108J298J177O58p6n46m72j59
54996I5403p6j17J87P73R99O69L10J63k71j125j577j055k88j98m95l95k4P1K49
54977I3203J163K191J996O04m89m59k9L1o8j5j01l91k30P13J750K082J757J208
54959A04916N84Nj48J61M10L41M63J186J972J968J097N6m91l73Q1K65j72q12r06
$$ plain form
55086 94605 96890 99625 101759 102646 102710 102740 102803 102414 101594 101012 101050 101392 101708 102188 103149 104567 106227 107912
55068 107912 109219 109573 108773 107360 106231 106013 106803 108205 109532 110210 110115 109412 108246 106912 106091 106296 107083
55051 107083 107351 106502 104829 102785 100563 98502 97138 96480 95875 94988 94342 94349 94351 93358 91504 90113 90275 91760
55033 91760 93382 94164 94041 93626 93372 93140 92667 92200 92284 92927 93502 93501 92983 92185 91296 90730 90959 91696 91836 90779
55013 90779 89423 89202 90364 91770 92319 92017 91620 91722 92415 93523 94821 95998 96656 96580 96034 95562 95403
54996 95403 95327 95210 95397 96170 97169 97838 98148 98311 98040 96915 95338 94283 93995 93797 93302 92907 92883 92954 93203
54977 93203 94366 96557 98553 99157 98668 98209 98180 98211 98143 98128 98027 97636 97406 98119 99869 101951 103708 104916
54959 104916 105500 105505 105357 105518 105928 106269 106732 107918 109890 111858 112955 113011 112520 112147 112228 112493 112321 111509 110603
54940A10603m49k52p77j520j766j381n50N56J481J521N94m06o30j85L48P99J338
54923A09324J930K442K935L450L716L577L394L691M543N641O644P221P096O374
54909A71978N499M582L078N50k618n471p264p795p294o304n349m508l586k737
54895A32761k436k659k706k160j493j318j576j802j689j054J48J319J368J11j084
54880A15730q22N54J641K013K490L505M332M345M132M712O168P609Q160P574O012
54865A78155L854J734K62o08j619l309n210o373o574o505o599o395n451m311l861
54850A27190m027l938l224k370j834j526j309j204r95l56M89Q48N11p7o87j530
54834A05961k408k561j754p31j56J66N27O97N67N97R20Q31oo87l32M37M06l76
$$ plain form
54940 110603 110154 109902 109125 107605 105839 104458 103908 104464 105945 107466 108060 107654 107024 106839 107187 107986 109324
54923 109324 111254 113696 116631 120081 123797 127374 130768 134459 139002 144643 151287 158508 165604 171978
54909 171978 177477 182059 185137 185687 183069 177598 170334 162539 155245 148941 143592 139084 135498 132761
54895 132761 130325 127666 124960 122800 121307 119989 118413 116611 114922 113868 114016 115335 116703 116814 115730
54880 115730 114908 115462 117103 119116 121606 125111 129443 133788 137920 142632 148800 156409 164569 172143 178155
54865 178155 182009 183743 184005 183397 181778 178469 173259 166886 160312 153807 147208 140813 135362 131051 127190
54850 127190 123163 119225 116001 113631 111797 110271 108962 107758 106763 106407 106896 107744 108255 108178 107491 105961
54834 105961 103553 100992 99238 98507 98351 98517 99044 99741 100308 100905 101825 102656 102650 101963 101631 102068 102474 102098
54816A02098p80l44L66R57J595K085J715L23j203j838j316n3J257J874J440M42
54800A08618k48l33k49l16l41r5L26P52J120J245R03K15l11l03J65P50J061Q06
54782A13765O5o48r03p99n49N8J210K286K328J356M98N99J298J809K024K391L048
54765A29836L605L724L589L769M608N820O728O973O850O709O311N066K858K24
54751A96670k168l916m843n034m928n028n406n728n710n289m500l554k912k845
54737A34809k974k715k062j488j125o88j94k1j52MO82J321J437J375J689K256
54721A32154K591K765L309M370N464O161O424O276N577M394L162K178J130n11
54707A85444k676m637n805o311o601o741o413n539m442l452k674k202k117k081
$$ plain form
54816 102098 101318 100974 101340 102297 103892 105977 107692 108015 106812 104974 103658 103605 104862 106736 108176 108618
54800 108618 108370 108037 107788 107472 107131 107036 107362 108114 109234 110479 111382 111597 111286 110983 111148 111898 112959 113765
54782 113765 113830 113182 112279 111480 110931 110989 112199 114485 116813 118169 118667 119266 120564 122373 124397 126788 129836
54765 129836 133441 137165 140754 144523 149131 154951 161679 168652 175502 182211 188522 193588 196446 196670
54751 196670 194502 190586 185743 180709 175781 170753 165347 159619 153909 148620 144120 140566 137654 134809
54737 134809 131835 129120 127058 125570 124445 123757 123563 123542 123390 123394 124076 125397 126834 128209 129898 132154
54721 132154 134745 137510 140819 145189 150653 156814 163238 169514 175091 179485 182647 184825 185955 185444
54707 185444 182768 178131 172326 166015 159414 152673 146260 140721 136279 132827 130153 127951 125834 123753
54693A23753j488l88K22l83j480j673p07K81L28k57p08r31j333j878j990j303
54677A10065j30Q33J053M97l39p84n52K0L97L91J69p7k92m50n21n39m69p1Q13
54658A10014J748J861P92o82j327p93R1L88K2m58o97o01l1J039K013K066J200
54641A16645M39O13J361J678J154K82l03m32l14j99k24m83j090k015k798k643
54625A11671j189Q22K087K045J290O15J78j65k88k6L59M30J08l08m56l6R47J869
54607A19953J845P88l19o13l42k45m58o62p82q63o24M0M99J59n00n68j50j46o86
54588A16326r40n46j39j77k22J22M66L18j27m37n24m03N6O53P59J97l04q5N07
54569A15500P31M85J50k26q52j519j711j316p45l39j12J1J09L71Q71J327J429
$$ plain form
54693 123753 122265 121877 122099 121716 120236 118563 117856 118137 118465 118208 117500 116569 115236 113358 111368 110065
54677 110065 109935 110768 111821 112318 111979 111195 110643 110663 111060 111451 111620 111543 111251 110801 110280 109741 109272 109201 110014
54658 110014 111762 113623 114415 113733 112406 111613 111704 112092 112114 111656 110959 110358 110327 111366 113379 115445 116645
54641 116645 117084 117697 119058 120736 121890 122172 121869 121437 121123 120924 120700 120217 119127 117112 114314 111671
54625 111671 110482 111304 113391 115436 116726 117341 117519 117354 117066 117040 117399 117829 117937 117629 117173 117137 118084 119953
54607 119953 121798 122586 122267 121654 121312 121067 120609 119947 119165 118302 117678 117718 118217 118376 117876 117308 117158 117012 116326
54588 116326 115386 114840 114701 114524 114302 114424 114890 115208 115081 114644 114120 113717 113773 114426 115185 115382 115078 114993 115500
54569 115500 116231 116716 116866 116640 115788 114269 112558 111242 110497 110158 110046 110057 110166 110537 111408 112735 114164
54552A14164J322J344J367Q75j61r49o75N44J739K058J579J128J329J939K202
54537A29805J806J210Q99O91J22o88j067p12j86j60m98m67J65O82L26p10j538
54520A29680j627j171n10K46Q69R44M41j30n14j075j887k094j023N54J260R86
54504A24949P93J076J072L87k40l18n59j607k677k605j625r76j045j008l55L01
54488A15563L04jK31J198K252K623K112J139L22J0Q4K50L93N70Q04J040J271J457
54470A31622J414R49J85l78k17O51J547J635P98j24k75J91L78n4m65k48K67L85
54452A38261J51K20P99J265R42j09j202j726j643j389j345j397j170o17j64j17
54436A30759k24q5K63M55L59J91J40J94L42O34J024J308J302J040P20N55N49M40
$$ plain form
54552 114164 115486 116830 118197 119072 118911 117962 117287 117831 119570 121628 123207 124335 125664 127603 129805
54537 129805 131611 132821 133720 134411 134533 133845 132778 132066 131880 131720 131222 130755 130920 131602 131928 131218 129680
54520 129680 128053 126882 126372 126618 127487 128431 128872 128742 128228 127153 125266 123172 122149 122703 123963 124949
54504 124949 125742 126818 127890 128277 128037 127719 127160 125553 122876 120271 118646 117670 116625 115617 115262 115563
54488 115563 115867 115866 116097 117295 119547 122170 124282 125421 125743 125753 125837 126087 126480 127050 127854 128894 130165 131622
54470 131622 133036 133985 134170 133792 133575 134226 135773 137408 138206 138082 137807 137998 138376 138322 137857 137609 137876 138261
54452 138261 138412 138632 139431 140696 141638 141529 140327 138601 136958 135569 134224 132827 131657 131040 130876 130759
54436 130759 130535 130450 130713 131168 131527 131718 131858 132052 132394 133028 134052 135360 136662 137702 138422 138977 139526 139966
54418A39966m1q26j500j674j307o06J26N89O47M79L75L69K65Q8J63O59J348J860
54400A40980J903J249l8j214j303k16J054J610J576J446J151M05m33o71k91N5
54384A47263K8m9J25L72M63M76N25M77J60l15o21n19p6L53M37K93M43J128J887
54365A52850K061J656J345J653K436L148L447L434L452L627L669L185K199J073
54351A89235n1j268k315k624k292k288l137m030l938l112k613k690k700k402k229
54336A51546k239j860r47j17K28L98N55L31k74m73J41Q23P67L24K95N86M44k31
54318A50297p73p94n14j24M32R26Q37Q5p46j111j031q34p48r07j320j689j553
54301A40433q35L3N51M98q0r22j550j634j359j116q51k55M38N54J00LP66J478
$$ plain form
54418 139966 139925 139099 137599 135925 134618 134012 134138 134727 135374 135853 136228 136597 136862 136950 137113 137772 139120 140980
54400 140980 142883 144132 144094 142880 141577 141361 142415 144025 145601 147047 148198 148603 148170 147499 147208 147263
54384 147263 147291 147242 147367 147739 148202 148678 149203 149680 149840 149525 148904 148385 148309 148662 149099 149392 149835 150963 152850
54365 152850 154911 156567 157912 159565 162001 165149 168596 172030 175482 179109 182778 185963 188162 189235
54351 189235 189184 187916 185601 182977 180685 178397 175260 171230 167292 164180 161567 158877 156177 153775 151546
54336 151546 149307 147447 146500 146383 146611 147009 147564 147895 147621 147148 147289 148112 148879 149203 149498 150084 150528 150297
54318 150297 149524 148730 148216 148092 148524 149450 150287 150372 149626 148515 147484 146650 145902 144995 143675 141986 140433
54301 140433 139598 139631 140182 140680 140600 139678 138128 136494 135135 134019 133168 132913 133351 133905 134005 134008 134774 136252
54283A36252J000l39j069m81O33J228J165R15P32O01N60O50P49Q01R64J295J489
54266A47145J279Q47N51M10J81j60l92m22l78l39k34QL41O02N33J2n63m32O02
54247A49591J686J821J123N41M29J97m98j036q22l43n22j302j666j021M3N62K88
54230A49071k59n18l93j60l9K1K05N45P97P52N20M05M79M98K97J39L64P94P64
54211A54282k8j002j347j065q93j190j477j294r02p01m90l0J90m32j373j386k35
54194A40627R45J212R10P62P56N46K86L01L94J91j64k74j45lK78Q78J392J269
54176A50161P30N71R76J225P58r3o28o02k76M1K43M06O17P48M49l99j320j692
54158A51915j512j323j389j344q17k8L96J12n94j026o65L24J198J366R23M01J22
$$ plain form
54283 136252 137252 136913 135844 135363 135996 137224 138389 139304 140036 140637 141197 141847 142596 143397 144361 145656 147145
54266 147145 148424 149271 149822 150232 150413 150253 149861 149439 149061 148722 148488 148496 148837 149439 149972 149984 149421 148989 149591
54247 149591 151277 153098 154221 154762 155191 155388 154890 153854 153032 152689 152167 150865 149199 148178 148221 148783 149071
54230 149071 148812 148294 147901 147741 147702 147723 147928 148473 149270 150022 150542 150947 151426 151924 152221 152360 152724 153518 154282
54211 154282 154254 153252 151905 150840 149947 148757 147280 145986 145084 144383 143893 143863 144053 143621 142248 140862 140627
54194 140627 141572 142784 143694 144456 145212 145758 146044 146345 146739 146930 146766 146492 146347 146344 146622 147500 148892 150161
54176 150161 150891 151462 152438 153663 154421 154328 153700 153098 152822 152863 153106 153512 154129 154877 155326 154927 153607 151915
54158 151915 150403 149080 147691 146347 145530 145502 145898 146010 145416 144390 143725 144049 145247 146613 147536 147937 148059
54141A48059L9k1j96m65m61L08J662K495J870K87p94o37J50O70P28N88L64J13
54123A54759M1J56P7l80o75j23J028J643J003k28o41L82K005K923K745K095J518
54106A68328Q40j69j030j028k43M42M25j9l07l15l68o46q23m15O12J579J783J442
54088A70088J585K749M177M746M329L665L127K336R71o94k173l149l388k841j953
54073A83575j367j179q81k45L02L45O6j36j96k80m53o76q74q13k57O24J277J407
54055A80239J242J055P98M26K26N35J332K350L306L963M251M469N024N773O091
54040B21080N738N287N332N723N879N593N078M541M086L887M008M190M087L630
54026B88139L031K472K055J845J787J671J356R02L83k31r29j611k227k781l139
$$ plain form
54141 148059 148098 148077 147881 147416 146955 147263 148925 151420 153290 153577 152783 152146 152296 152966 153694 154282 154646 154759
54123 154759 154800 154956 155033 154653 153978 153855 154883 156526 157529 157301 156660 157042 159047 161970 164715 166810 168328
54106 168328 169168 168999 167969 166941 166698 167140 167565 167546 167239 166924 166556 165910 165087 164672 165284 166863 168646 170088
54088 170088 171673 174422 178599 183345 187674 191339 194466 196802 197773 197079 194906 191757 188369 185528 183575
54073 183575 182208 181029 180148 179903 180205 180550 180616 180480 180284 180004 179551 178875 178001 177188 176931 177555 178832 180239
54055 180239 181481 182536 183334 183760 183986 184521 185853 188203 191509 195472 199723 204192 209216 214989 221080
54040 221080 226818 232105 237437 243160 249039 254632 259710 264251 268337 272224 276232 280422 284509 288139
54026 288139 291170 293642 295697 297542 299329 301000 302356 303258 303641 303410 302481 300870 298643 295862 292723
54011B92723l206l316l981n083n807n646n068m790m870m891m666m266l608k656
53997B30869j824j649k076k501k478k142j861j838j962j887j348n96l00p42j403
53982B06262j603j373j235j356j471j446j423j386j144p94p14r09q83l24M34R12
53966A91547J097J213J206Q41K77J14P00J622K098J828J300J261J992L150M179
53951B14425M767N010N330O169P563R055J0092J0465J0128Q795O178K700n04k510
53937B97663l270l225k621j549l73L47M28K99N65J368K235K566K344K188K589
53922C01554L272L693L872M264M915N408N723O372P507Q537R026R223R299Q742
53908C91407P199N296L892K898J760N95l2l17j069k344l235l272l113l488m181
$$ plain form
54011 292723 289517 286201 282220 277137 271330 265684 260616 255826 250956 246065 241399 237133 233525 230869
53997 230869 229045 227396 225320 222819 220341 218199 216338 214500 212538 210651 209303 208707 208407 207665 206262
53982 206262 204659 203286 202051 200695 199224 197778 196355 194969 193825 193031 192317 191408 190525 190201 190635 191547
53966 191547 192644 193857 195063 195904 196181 196295 196995 198617 200715 202543 203843 205104 207096 210246 214425
53951 214425 219192 224202 229532 235701 243264 252319 262411 272876 283004 291799 297977 300677 300173 297663
53937 297663 294393 291168 288547 286998 286625 286972 287400 287699 288264 289632 291867 294433 296777 298965 301554
53922 301554 304826 308519 312391 316655 321570 326978 332701 339073 346580 355117 364143 373366 382665 391407
53908 391407 398606 403902 407794 410692 412452 413047 413015 412698 411629 409285 406050 402778 399665 396177 391996
53893C91996m635m889n321n898o330o689p285q080q707r000r020q600p507o085
53879B93950n221n300n582n090l890k964k914l327l585l651l722l628l174k779
53865B39123l042l674l714k874k013j871k018j628q37o17j398k455k753j997p59
53850B07473J99N55M98L19K6n01j069j220p90j30L43N14M59K62R0K8k25j008j877
53831B03946j778l93J261K038J904J399O00n44j299p46P25J574R99j31m98J37
53815B09194J023J468J357R64P25J018J854K799L354L382L162L153L695M667N483
53800B47298N630N238M906M928N012M852M649M704M710L883J991J5o92P9J100
53785B98303J207O24L47N70N04k84j270j910k381k983l563m022m714n721o331
$$ plain form
53893 391996 387361 382472 377151 371253 364923 358234 350949 342869 334162 325162 316142 307542 300035 293950
53879 293950 288729 283429 277847 272757 268867 265903 262989 259662 256077 252426 248704 245076 241902 239123
53865 239123 236081 232407 228693 225819 223806 221935 219917 218289 217452 216835 215437 212982 210229 208232 207473
53850 207473 207672 208227 208725 209044 209070 208569 207500 206280 205490 205360 205703 206217 206676 206938 207028 207056 206831 205823 203946
53831 203946 202168 201775 203036 205074 206978 208377 208977 208433 207134 206388 207113 208687 209686 209555 209057 209194
53815 209194 210217 211685 213042 214006 214731 215749 217603 220402 223756 227138 230300 233453 237148 241815 247298
53800 247298 252928 258166 263072 268000 273012 277864 282513 287217 291927 295810 297801 297816 297124 297203 298303
53785 298303 299510 300134 300481 301051 301555 301271 300001 298091 295710 292727 289164 285142 280428 274707 268376
53770B68376n934m979m348m201m114l887l546k947k206k060k894l771l416j978
53756B18095q18o09p44o36n14o52q03p37o93q46r80r29q15o74l39J57N25O17M00
53737B09005l14j504k407k149r14K70Q81J165J160N92j31LJ118K087K178K030
53721B13070K393K841K547J583O62J86K38R08J933K488K137J513J386J561J392
53706B36838R25P88J214J912K640L286L589L384K914K465K076J969K671M078M949
53691B75698M278K785K019K243K248J259n4p54q33p91p03l37J72L23j08p97j259
53674B85389j374j433j648j715j136k8P18M18n17j027n99L07Q75P15M4n60o64
53657B77765l53n8L6J47L45K74k57q20r05n97k61J02O59J161J178Q80Q79J368
$$ plain form
53770 268376 262442 257463 253115 248914 244800 240913 237367 234420 232214 230154 227260 223489 220073 218095
53756 218095 217277 216668 215924 215288 214774 214122 213319 212582 211889 211043 210063 209134 208319 207645 207306 207463 207988 208605 209005
53737 209005 208691 207187 204780 202631 201717 201987 202868 204033 205193 205785 205654 205657 206775 208862 211040 213070
53721 213070 215463 218304 220851 222434 223096 223282 223520 224428 226361 228849 230986 232499 233885 235446 236838
53706 236838 237763 238551 239765 241677 244317 247603 251192 254576 257490 259955 262031 264000 266671 270749 275698
53691 275698 279976 282761 284780 287023 289271 290530 290476 289722 288889 288098 287395 287058 287230 287553 287445 286648 285389
53674 285389 284015 282582 280934 279219 278083 278055 278773 279191 278674 277647 277048 277355 278230 278945 278989 278429 277765
53657 277765 277412 277354 277390 277537 277882 278156 277899 277079 276174 275577 275316 275418 276077 277238 278416 279296 280175 281543
53639B81543J909K112K044J823J447J106J203J795K349K311J715J018O80R54J833
53624C05842K909L530L421K980K771K869K975L022L301L902M392M292L701L087
53610C52994K630K168J823K094L075L974L982L304K809K812K831K554K369K635
53596C92054K909K380Q89p79j588j287o97q53j678j973j033K87P60N47P03J210
53580C91851R34m26j665j892j721j952k241j979j523j431j292n20L32K51n89j056
53564C75081p22k05K6J72M01N54O78R76J232R70K96j99l08k57N8R93K196K600
53546C84542J766N85K80J145K463L311L283K799K731L429M241M458M442N084O331
53531D30890P153P055O715O904P540Q174Q717R239R635R926J0466J1444J2557
$$ plain form
53639 281543 283452 285564 287608 289431 290878 291984 293187 294982 297331 299642 301357 302375 303055 304009 305842
53624 305842 308751 312281 315702 318682 321453 324322 327297 330319 333620 337522 341914 346206 349907 352994
53610 352994 355624 357792 359615 361709 364784 368758 372740 376044 378853 381665 384496 387050 389419 392054
53596 392054 394963 397343 398232 397453 395865 394578 393881 393028 391350 389377 388344 388631 389391 389938 390641 391851
53580 391851 392785 392359 390694 388802 387081 385129 382888 380909 379386 377955 376663 376143 376475 376726 376137 375081
53564 375081 374359 374154 374180 374352 374753 375307 375985 376961 378193 379163 379459 379260 378952 378695 378753 379746 381942 384542
53546 384542 386308 386893 387173 388318 390781 394092 397375 400174 402905 406334 410575 415033 419475 424559 430890
53531 430890 438043 445098 451813 458717 466257 474431 483148 492387 502022 511948 522414 533858 546415
53518E46415J3455J4147J4726J5122J5431J6040J7143J8447J9636K0762K1900
53507G33224K2729K2916K2659K2572K3037K3847K4401K4253K3559K2928K2631
53496I88756K2144K0903J9342J8528J8732J8995J8484J7634J7480J8207J8928
53485A198133J8778J7883J7137J7223J7902J8312J7962J7235J6736J6365J5464
53474A389130J3732J1526R229O806M114J202j783m637o989q551r539j0493j1554
53461A382193j2285j2374j2060j1779j1738j2036j2828j4114j5570j6823j7720
53450A232866j8297j8627j8680j8252j7199j5981j5526j6127j6700j5858j3454
53439A048165j0543p932n694l948l083k982k842k179j314n81J85J052J648J914
$$ plain form
53518 546415 559870 574017 588743 603865 619296 635336 652479 670926 690562 711324 733224
53507 733224 755953 778869 801528 824100 847137 870984 895385 919638 943197 966125 988756
53496 988756 1010900 1031803 1051145 1069673 1088405 1107400 1125884 1143518 1160998 1179205 1198133
53485 1198133 1216911 1234794 1251931 1269154 1287056 1305368 1323330 1340565 1357301 1373666 1389130
53474 1389130 1402862 1414388 1423617 1430423 1434537 1435739 1433956 1429319 1422330 1413779 1404240 1393747 1382193
53461 1382193 1369908 1357534 1345474 1333695 1321957 1309921 1297093 1282979 1267409 1250586 1232866
53450 1232866 1214569 1195942 1177262 1159010 1141811 1125830 1110304 1094177 1077477 1061619 1048165
53439 1048165 1037622 1029690 1023996 1020048 1016965 1013983 1011141 1008962 1007648 1007067 1007252 1008304 1009952 1011866
53425A011866K500L910N755P378Q702R967J1204J2459J4033J5884J7279J7683
53413A138620J7701J8496K0419K2736K4584K5772K6810K8435L0941L3694L5653
53402A423861L6624L7565L9373M1795M4041M5886M7593M9182N0475N1586N2611
53391A920592N3094N2588N1662N1457N2117N2389N1164M8820M6632M5183M3931
53380B469629M2122L9637L6783L3630K9984K5919K1855J7958J3849R242M472j23
53368B744957n016j0944j7710k4277l0053l5240l9851m3304m5286m6217m6437
53357B400622m5868m4841m4298m4415m3948m1867l8982l6888l5941l5347l4906
53346A953321l5286l6563l7630l7497l6369l5124l4205l3273l1653k9028k5932
$$ plain form
53425 1011866 1014366 1018276 1024031 1031409 1040111 1050078 1061282 1073741 1087774 1103658 1120937 1138620
53413 1138620 1156321 1174817 1195236 1217972 1242556 1268328 1295138 1323573 1354514 1388208 1423861
53402 1423861 1460485 1498050 1537423 1579218 1623259 1669145 1716738 1765920 1816395 1867981 1920592
53391 1920592 1973686 2026274 2077936 2129393 2181510 2233899 2285063 2333883 2380515 2425698 2469629
53380 2469629 2511751 2551388 2588171 2621801 2651785 2677704 2699559 2717517 2731366 2740608 2745080 2744957
53368 2744957 2739941 2728997 2711287 2687010 2656957 2621717 2581866 2538562 2493276 2447059 2400622
53357 2400622 2354754 2309913 2265615 2221200 2177252 2135385 2096403 2059515 2023574 1988227 1953321
53346 1953321 1918035 1881472 1843842 1806345 1769976 1734852 1700647 1667374 1635721 1606693 1580761
53335A580761k3391k1836k0629j9037j7219j5724j4530j3407j2873j3689j5508
53324A392918j7047j7707j8083j8679j9053j8622j7537j6278j5049j3962j3187
53313A207714j2493j1157q891o380m505l360k525j823j314p81J40J508L149N134
53299A164416P637J0397J2780J4517J6036J7875K0045K2050K3483K4293K4560
53288A358089K4223K3232K1919K0895K0443K0149J9349J7817J5790J3456J0801
53277A566163P968N311K888K38k968o280q835j0445j1924j4099j6780j8985k0193
53264A472059k0887k1773k2822k3533k3847k4238k4861k5189k4759k3868k3224
53253A213058k3179k3528k3799k3495k2329k0585j9082j8546j9010k0040k1225
$$ plain form
53335 1580761 1557370 1535534 1514905 1495868 1478649 1462925 1448395 1434988 1422115 1408426 1392918
53324 1392918 1375871 1358164 1340081 1321402 1302349 1283727 1266190 1249912 1234863 1220901 1207714
53313 1207714 1195221 1184064 1175173 1168793 1164288 1160928 1158403 1156580 1155266 1154485 1154625 1156133 1159282 1164416
53299 1164416 1172053 1182450 1195230 1209747 1225783 1243658 1263703 1285753 1309236 1333529 1358089
53288 1358089 1382312 1405544 1427463 1448358 1468801 1488950 1508299 1526116 1541906 1555362 1566163
53277 1566163 1574131 1579442 1582330 1582568 1579600 1573320 1564485 1554040 1542116 1528017 1511237 1492252 1472059
53264 1472059 1451172 1429399 1406577 1383044 1359197 1334959 1310098 1284909 1260150 1236282 1213058
53253 1213058 1189879 1166351 1142552 1119057 1096728 1076143 1057061 1038515 1019505 999465 978240
53242I78240k2272k2894k2883k2247k1062j9393j7548j6103j5339j4835j3888
53231G69776j2214j0055p918o448o251p416r259j0853j1734j2043j2282j3066
53219F50237j4712j6713j7994j7994j7212j6410j5747j5055j4388j3702j2557
53208D77753j0771r068q265q153p948p584p662q221q553q345q174q572r240r487
53194C57710r017q079p191o784o802o625n804m727m108l974l787l410l225l233
53180B80944k901k015j060n02l21m36r59j698k074j853j518j545j773j821j698
53165B58770j627j572j375j088q89p95p10o22o06o90q05q35p66q19j185j522j194
53148B41670k46M02K16r1K70P48K62r55j601j303r56r85o32M83J432J347P01L62
$$ plain form
53242 978240 955968 933074 910191 887944 866882 847489 829941 813838 798499 783664 769776
53231 769776 757562 747507 739589 733141 726890 719474 710215 699362 687628 675585 663303 650237
53219 650237 635525 618812 600818 582824 565612 549202 533455 518400 504012 490310 477753
53208 477753 466982 457914 449649 441496 433548 425964 418302 410081 401528 393183 385009 376437 367197 357710
53194 357710 348693 340614 333423 326639 319837 313212 307408 302681 298573 294599 290812 287402 284177 280944
53180 280944 278043 276028 274968 274466 274145 273709 272750 271052 268978 267125 265607 264062 262289 260468 258770
53165 258770 257143 255571 254196 253108 252219 251424 250714 250092 249486 248796 247991 247156 246390 245571 244386 242864 241670
53148 241670 241424 241826 242042 241951 242221 242969 243231 242276 240675 239372 238416 237431 236799 237282 238714 240061 240762 241124
53130B41124K94O4n4N11J510K076J816J067L28m6J48P43J227J342J358J475J479
53113B56462J333J459J926K008J151j24r53j304j650j976j920j601j551j905k356
53098B48999k653k648k131j241p00r15j252r05j31K51K71O37J270J210J88p47
53082B39503o67N2N39O81R28J265J172M88k73o10o84j016j602j672o42Q55J378
53065B39695L63j132j723j301q37r04j177j215j049q45o29m94o28q96q31j75Q24
53048B27046J782K528K940K815K121J203N63M35N56L18o99k070k707j995n59M80
53032B34757P68P63P18L96j85n13l55j36k07k20K38Q41R01L31k38k75J83Q07J398
53013B39972J847J977J645R64K89o7j19j50l15l53J36J100J894J898J185M19N8
$$ plain form
53130 241124 241418 241482 241428 241939 243449 245525 247341 248408 248736 248690 248838 249581 250808 252150 253508 254983 256462
53113 256462 257795 259254 261180 263188 264339 264215 263262 261958 260308 258332 256412 254811 253260 251355 248999
53098 248999 246346 243698 241567 240326 239626 238711 237459 236554 236423 236674 236945 237582 238852 240062 240250 239503
53082 239503 238836 238888 239427 240108 241036 242301 243473 243961 243688 243078 242394 241378 239776 238104 237462 238317 239695
53065 239695 240058 238926 237203 235902 235065 234161 232984 231769 230720 229875 229246 228752 228124 227228 226397 226222 227046
53048 227046 228828 231356 234296 237111 239232 240435 240998 241433 241989 242307 241608 239538 236831 234836 234277 234757
53032 234757 235525 236288 237006 237402 237217 236704 236349 236213 236006 235786 236024 236865 237766 238097 237859 237584 237767 238574 239972
53013 239972 241819 243796 245441 246405 246694 246627 246508 246358 246043 245690 245826 246926 248820 250718 251903 252322 252380
52996B52380j32o31j368j667j115k17J17l17q08o20J73R48J284J253J104R81R16
52979B52281Q86Q59Q21P82P76Q85J165J547J835K039K451L083L325K584J224J90
52963B76733k33o02j142j202l32Q03J149N15m94j329j690j313l25M13L7j248k357
52946B67383k590k204j770j480j223r45p25o65p83j000j198j352j390j033j05
52931B48920R17J270Q78M29K49j42r33j415j084o13q04j265j129o00n47r33q99
52914B42299l11j1l79p91p42m89k76J08O47Q72O81O03Q59R08M09j70k92o8J72
52895B44029L77L95j41r75j028J81J495J391K5r48n40M35O36p4p03n88j88k62
52877B43517p22q00k32L72N49O73J178J713J750J573J759K018J588O54K33O23
$$ plain form
52996 252380 252248 251617 250249 248582 247467 247250 247367 247050 246242 245622 245795 246743 248027 249280 250384 251365 252281
52979 252281 253167 254026 254847 255629 256405 257290 258455 260002 261837 263876 266327 269410 272735 275319 276543 276733
52963 276733 276500 275898 274756 273554 273222 274025 275174 275689 275195 273866 272176 270863 270538 270951 270988 269740 267383
52946 267383 264793 262589 260819 259339 258116 257171 256446 255781 254998 253998 252800 251448 250058 249025 248920
52931 248920 249837 251107 251985 252414 252663 252521 251588 250173 249089 248476 247672 246407 245278 244678 244131 243198 242299
52914 242299 241988 241977 241598 240807 240065 239576 239300 239408 240055 240927 241608 242211 243070 243978 244387 244217 243925 243857 244029
52895 244029 244406 244801 244660 243685 242657 242838 244333 245724 245749 244801 244261 244696 245332 245258 244555 243967 243779 243517
52877 243517 242795 241995 241763 242135 242684 243357 244535 246248 247998 249571 251330 253348 254936 255590 255823 256446
52861B56446J016R18Q78J423K183K537K325J564K06j350k358k741l234m093m553
52846B51167m069l199k611k152j595j473k230l212l436k811j833o69O09J483J605
52831B25574J392J210N63q57k013j660j84R26J158J209J384J165M75qn9l02r58
52814B29015j278p21K19P55P31L49k52p72p40j46M68P46Q39P70K28o56j126q41
52796B27588m74p35j344j494r64k32J88L8o31j354j414o48K39N17L66M63R45J277
52778B22331J151R33J101J559J727J246M20r1qK69K23j54n06o68p31o47l04N6
52760B27907j2m66p48n78l11k33m8N84J351J606J105J86o48r88o62J50J053J831
52742B31079K513K959K805K066J394J370J799K074J943J557J053N55L72P30J298
$$ plain form
52861 256446 257462 258380 259258 260681 262864 265401 267726 269290 269496 268146 265788 263047 259813 255720 251167
52846 251167 247098 243899 241288 239136 237541 236068 233838 230626 227190 224379 222546 221877 222486 223969 225574
52831 225574 226966 228176 228739 227882 225869 224209 224025 224951 226109 227318 228702 229867 230342 230334 230275 229973 229015
52814 229015 227737 227016 227235 227990 228721 229070 228818 228046 227306 227160 227628 228374 229213 229983 230211 229555 228429 227588
52796 227588 227114 226379 225035 223541 222577 222345 222533 222571 221940 220586 219172 218524 218763 219280 219646 220109 221054 222331
52778 222331 223482 224415 225516 227075 228802 230048 230468 230377 230369 230638 230861 230707 230201 229533 228802 228155 227851 227907
52760 227907 227895 227429 226681 226103 225792 225559 225511 226095 227446 229052 230157 230343 229695 228707 228045 228195 229248 231079
52742 231079 233592 236551 239356 241422 242816 244186 245985 248059 250002 251559 252612 253167 253539 254269 255567
52727B55567J445R46J77m48q54j156j361j357j046n30j61k95q38j274j315j243
52711B46257j381j489j163n84l16m22l58J41O18N37rn22p05n54j53L59P42R30
52693B41928J206J771K234J940Q88m4o1O08J029O76j13q39j435j945k044j418
52677B44381n02j63n89r87p03j58k18r38j499j290n64J30O20J058J479J715J647
52660B43419J321R22O61O15O09M35K34M88J420K594L285L248K868K607K450K002
52644B69178J021k85j470k296k895l425l672l170j796j65Q53R42N88M41O80J032
52628B55561J266J420J611J874K228K736L320L563K885J080j231k857k990k027
52614B68439j212j336j930j981j207k87J17J5k63n70q52r14o58k79P8O18J426
$$ plain form
52727 255567 257012 257958 258135 257687 256833 255677 254316 252959 251913 251383 251222 250927 250089 248815 247500 246257
52711 246257 244876 243387 242224 241640 241324 240902 240544 240685 241303 241840 241831 241309 240604 240050 239897 240256 240998 241928
52693 241928 243134 244905 247139 249079 249967 249923 249862 250470 251499 252175 252062 251223 249788 247843 245799 244381
52677 244381 243879 243716 243127 242140 241437 241279 241061 240123 238624 237334 236770 236900 237520 238578 240057 241772 243419
52660 243419 244740 245662 246323 246938 247547 247982 248216 248704 250124 252718 256003 259251 262119 264726 267176 269178
52644 269178 270199 269914 268444 266148 263253 259828 256156 252986 251190 251025 251878 252820 253408 253849 254529 255561
52628 255561 256827 258247 259858 261732 263960 266696 270016 273579 276464 277544 276313 273456 270466 268439
52614 268439 267227 265891 263961 261980 260773 260486 260603 260618 260355 259785 258933 258019 257361 257082 257160 257778 259204
52597B59204J993J686O38l70q05p10k70L84Q49O11j61n30J25J289J963J769J071
52580B68736L57j03k46k39l73n58k79O04J312J075K53j21J35J43o59j734k311
52563B65992k310j987j295k20P23J049R94J012Q64qj287j891j493j078j539k365
52547B55161k311j079M16J221J239Q97N14J46k46p11j207j415r30K22J395J830
52531B55142J302K94m03k44O54J567J803J362Q58P09O93L88j77o57q23n81K24
52514B62111J571K829L143K367J330R72J495K455L346L826L677K942J985J073
52500B95122K7j438l072m159m303l811l173k504j701r14m55l52k81n8P8j51n80
52483B68275p73o08m60o51r31p34J9O96N88k97j254j559j031M7J236K159K608
$$ plain form
52597 259204 261197 262883 263521 263151 262346 261636 261366 261750 262599 263210 263049 262519 262644 263933 265896 267665 268736
52580 268736 269093 268990 268744 268505 268132 267574 267295 267899 269211 270286 270539 270418 270553 270696 270037 268303 265992
52563 265992 263682 261695 260400 260180 260903 261952 262946 263958 264822 264814 263527 261636 260143 259065 257526 255161
52547 255161 252850 251771 252187 253408 254647 255544 256058 256204 255958 255247 254040 252625 251695 251917 253312 255142
52531 255142 256444 256738 256335 256091 256745 258312 260115 261477 262335 263044 263737 264125 263948 263291 262468 261887 262111
52514 262111 263682 266511 269654 272021 273351 274323 275818 278273 281619 285445 289122 292064 294049 295122
52500 295122 295149 293711 290639 286480 282177 278366 275193 272689 270988 270074 269619 269267 268986 268928 269006 268855 268275
52483 268275 267502 266894 266434 265783 264852 264118 264137 264833 265421 265124 263870 262311 261280 261327 262563 264722 267330
52466B67330K635K492K377K303K249K314K594K985L207L001K296J276L23l31r13
52451B96138j844k977l486k920k010j843k352k443j668r24j100j824k168k053
52437B66526k016k014j441l54L00m2p42q51k65M08P51Q73J079J508K013K215J808
52420B69756R22L2n66q74q34k54O95J402J529J467J819K670L715M742N711O586
52404B98518P376Q201R076R817J0267J0195Q951N841J268l063n669o597o781o742
52390C40658o554o505o733o529n088k895j322p69k60R04K057K198J301J65m39
52375C10189j07J131K696L859M511N072N545N453M904M776N373N763N107L834
52361C68106K734J680K48j071j416j001q15j040q80O7J260K155K709K870K508
$$ plain form
52466 267330 269965 272457 274834 277137 279386 281700 284294 287279 290486 293487 295783 297059 297382 297051 296138
52451 296138 294294 291317 287831 284911 282901 281058 278706 276263 274595 273671 272571 270747 268579 266526
52437 266526 264510 262496 261055 260701 261001 260959 260217 259366 259101 259509 260260 261133 262212 263720 265733 267948 269756
52420 269756 270678 270710 270144 269270 268436 268182 268877 270279 271808 273275 275094 277764 281479 286221 291932 298518
52404 298518 305894 314095 323171 332988 343255 353450 362401 368242 369510 366447 360778 354181 347400 340658
52390 340658 334104 327599 320866 314337 309249 306354 305032 304263 304003 304907 306964 309162 310463 310628 310189
52375 310189 310082 311213 313909 317768 322279 327351 332896 338349 343253 348029 353402 359165 364272 368106
52361 368106 370840 372520 372768 371697 370281 369280 368465 367425 366545 366612 367872 370027 372736 375606 378114
52346C78114K089K474L606M360M083L539L659M214M473M531N066O130P130P905
52332D41373Q917J0319J1593J2405J3189J4562J6518J8519K0165K1485K2707K3955
52320F35707K5115K5914K6251K6413K6718K6919K6307K4610K2566K1234K0900
52309I08654K0948K0732K0212J9647J9106J8423J7492J6306J4855J3184J1455
52298A101014R790Q106O357M786L620K545Q14j933n186q041r994j1122j1739j2060
52284A076957j2157j1995j1500j0649r416p575m882j537J701M184O070Q008J0236
52271A037445J2263J3536J4180J4869J6076J7555J8538J8415J7327J6075J5444
52260A211723J5580J5931J5784J4782J3150J1501J0342R655R014Q097O976N785
$$ plain form
52346 378114 380203 382677 386283 390643 394726 398265 401924 406138 410611 415142 420208 426338 433468 441373
52332 441373 450290 460609 472202 484607 497796 512358 528876 547395 567560 589045 611752 635707
52320 635707 660822 686736 712987 739400 766118 793037 819344 843954 866520 887754 908654
52309 908654 929602 950334 970546 990193 1009299 1027722 1045214 1061520 1076375 1089559 1101014
52298 1101014 1110804 1118910 1125267 1130053 1133673 1136218 1137032 1135099 1129913 1121872 1111878 1100756 1089017 1076957
52284 1076957 1064800 1052805 1041305 1030656 1021240 1013665 1008783 1007246 1008947 1013131 1019201 1027209 1037445
52271 1037445 1049708 1063244 1077424 1092293 1108369 1125924 1144462 1162877 1180204 1196279 1211723
52260 1211723 1227303 1243234 1259018 1273800 1286950 1298451 1308793 1318448 1327462 1335559 1342535 1348320
52248A348320M463K970J459m3j928m600p887j1176j3979j6034j7050j6965j6410
52235A251140j6273j6614j6554j5517j4017j2923j2321j1618j0466r140q069p389
52223A100239o907o272n249l985k897k111j244J5J372K310K767L064L345L563
52209A088010L894M639N691O554O990P210P379P321O879O187N412M580L803L311
52195A167860L072K783K433K512L284M218M549M153L487K874K322J858J532J097
52181A208034J67j189k433l196l705m462n784p645r633j1004j1141j0140q675
52168A129194p248n885m637l843l569l154j900m2J476K183K603L465M728N601
52154A118972N408M210K636J328N40K10J85L41N77Q46J147J461J711J913K264
$$ plain form
52248 1348320 1352783 1355753 1357212 1357169 1355241 1350641 1342754 1331578 1317599 1301565 1284515 1267550 1251140
52235 1251140 1234867 1218253 1201699 1186182 1172165 1159242 1146921 1135303 1124837 1115697 1107628 1100239
52223 1100239 1093332 1087060 1081811 1077826 1074929 1072818 1071574 1071589 1072961 1075271 1078038 1081102 1084447 1088010
52209 1088010 1091904 1096543 1102234 1108788 1115778 1122988 1130367 1137688 1144567 1150754 1156166 1160746 1164549 1167860
52195 1167860 1170932 1173715 1176148 1178660 1181944 1186162 1190711 1194864 1198351 1201225 1203547 1205405 1206937 1208034
52181 1208034 1208201 1207012 1204579 1201383 1197678 1193216 1187432 1179787 1170154 1159150 1148009 1137869 1129194
52168 1129194 1121946 1116061 1111424 1107581 1104012 1100858 1098958 1098916 1100392 1102575 1105178 1108643 1113371 1118972
52154 1118972 1124380 1128590 1131226 1132554 1133094 1133304 1133489 1133830 1134407 1135253 1136400 1137861 1139572 1141485 1143749
52139A143749K832L288L200K658K290K580L455M590N824P147Q637J0616J3436
52126A214302J6856J9992K2271K4131K6383K9103L1701L3827L5665L7309L8382
52115A529922L8307L6731L3768L0161K7043K4961K3200K0609J7064J3478J0429
52104A805673P557M506J658n51k336m007n305n998o687q154j0089j1384j1701
52091A753182j2004j3197j4947j6305j7031j7633j8373j8838j8640j7949j7016
52080A571249j5521j2859r063m992j455J534M447P457J0259J2531J4230J5548
52068A593365J6805J8282J9871K0975K1058K0243J9078J7885J6674J5505J4416
52057A794157J3097J1202Q941O798M666K019r65l305m630n931q311j1609j4823
$$ plain form
52139 1143749 1146581 1149869 1153069 1155727 1158017 1160597 1164052 1168642 1174466 1181613 1190250 1200866 1214302
52126 1214302 1231158 1251150 1273421 1297552 1323935 1353038 1384739 1418566 1454231 1491540 1529922
52115 1529922 1568229 1604960 1638728 1668889 1695932 1720893 1744093 1764702 1781766 1795244 1805673
52104 1805673 1813230 1817736 1819394 1818843 1816507 1812500 1807195 1801197 1794510 1786356 1776267 1764883 1753182
52091 1753182 1741178 1727981 1713034 1696729 1679698 1662065 1643692 1624854 1606214 1588265 1571249
52080 1571249 1555728 1542869 1533806 1528814 1527359 1528893 1533340 1540797 1551056 1563587 1577817 1593365
52068 1593365 1610170 1628452 1648323 1669298 1690356 1710599 1729677 1747562 1764236 1779741 1794157
52057 1794157 1807254 1818456 1827397 1834195 1838861 1840880 1839915 1836610 1831980 1826049 1817738 1806129 1791306
52044A791306j7405j9500k1304k2898k4561k6566k8691l0341l1039l0586k9068
52033A509347k7014k5170k3660k1819j9326j6942j5483j4603j3462j2129j1297
52022A308442j0928j0316r526r519j0656j2064j2851j3063j3001j2510j1492j0489
52010A172027j0115j0415j1211j2527j4240j5789j6787j7555j8589j9894k1176
51999A003729k2247k2822k2390k0973j9561j9176j9619j9727j8708j6717j4318
51988G87471j2045j0414r772r928j0279j0429j0410j0354j0223r977r785r881
51976F63974j0336j0902j1138j0862j0444j0428j0795j0912j0317r160p651n630
51964E45399l025l06J985L873N558O779P209P178P267P236O193L957J504k14j286
$$ plain form
52044 1791306 1773901 1754401 1733097 1710199 1685638 1659072 1630381 1600040 1569001 1538415 1509347
52033 1509347 1482333 1457163 1433503 1411684 1392358 1375416 1359933 1345330 1331868 1319739 1308442
52022 1308442 1297514 1287198 1277672 1268153 1257497 1245433 1232582 1219519 1206518 1194008 1182516 1172027
52010 1172027 1161912 1151497 1140286 1127759 1113519 1097730 1080943 1063388 1044799 1024905 1003729
51999 1003729 981482 958660 936270 915297 895736 876560 856941 837214 818506 801789 787471
51988 787471 775426 765012 755240 745312 735033 724604 714194 703840 693617 683640 673855 663974
51976 663974 653638 642736 631598 620736 610292 599864 589069 578157 567840 558680 551029 545399
51964 545399 542374 542068 544053 547926 553484 560263 567472 574650 581917 589153 595346 599303 600807 600593 599307
51949E99307k360l646m847n658n934n527m384k705p75J262L390N591P894J0315
51935E91923J2581J4150J4781J4904J5089J5266J4744J3044J0382P352M433J934
51923G30583J02j207k859n967j0756j6068k0294k2762k3895k4212k3670k2217
51911E56778k0386j8770j7183j4929j1948r099p107n724m279k746j674j117k12
51898D41604J856M682O899P608P188O478N528L709Q47k318n003p099q690r417
51884D53872q922p627o415n570m622l263j777m51Q95K453L967N073N843O628P525
51869D47609Q202Q221P356N745L868K205Q83k50j260k124l084m455n909o472n621
51854D54914l913k209o49J007K495L197L091K797K663K388J641M54j110k997m706
$$ plain form
51949 599307 596947 593301 588454 582796 576862 571335 566951 564246 563471 564733 568123 573714 581608 591923
51935 591923 604504 618654 633435 648339 663428 678694 693438 706482 716864 724216 728649 730583
51923 730583 730685 729478 726619 720652 709896 693828 673534 650772 626877 602665 578995 556778
51911 556778 536392 517622 500439 485510 473562 464463 457356 451632 447353 444607 442933 441816 441604
51898 441604 443460 448142 455041 462649 469837 476315 481843 485552 486399 484081 479078 471979 463289 453872
51884 453872 444950 437323 430908 425338 420716 417453 415676 415225 416120 418573 422540 427613 433456 440084 447609
51869 447609 455811 464032 471388 477133 481001 483206 484089 483839 482579 480455 477371 472916 467007 460535 454914
51854 454914 451001 448792 448143 449150 451645 454842 457933 460730 463393 465781 467422 467876 466766 463769 459063
51839D59063n420n046m578m896n676n923n299m293l389k655k031j419n02Q85K199
51824D11020K583J933J022M17j53j045j947k375k484k794l283l365k674j513m49
51809C94893J79L71M04O88J352K006K132J689J081N69J19k48l48k04p2j9J85N09
51791D05286M18m94j848k819l045k898k920l184l217k486j044L22Q17N36L58P90
51775C84572J367J436J095R22J109J488K132L228M380M828M549M562N690P529
51761D28887Q929R187Q349O793M960L288J866K33k094m905p433r128r936r934
51747D29062r215q133p205o561n860m891l829k778j501P0J480K401L274M762O726
51732C97802Q374R271R609R435Q382O454M451L128K398J861J716K418L516L668
$$ plain form
51839 459063 453643 448597 444019 439123 433447 427524 422225 417932 414543 411888 409857 408438 407936 408821 411020
51824 411020 413603 415536 416558 416975 416822 415777 413830 411455 408971 406177 402894 399529 396855 395342 394893
51809 394893 395072 395443 395847 396535 397887 399893 402025 403714 404795 405364 405483 405235 404887 404683 404611 404592 404777 405286
51791 405286 405704 405210 403362 400543 397498 394600 391680 388496 385279 382793 381749 382071 382888 383424 383782 384572
51775 384572 385939 387375 388470 389392 390501 391989 394121 397349 401729 406557 411106 415668 421358 428887
51761 428887 437816 447003 455352 462145 467105 470393 472259 472492 470398 465493 458060 448932 438996 429062
51747 429062 419847 411714 404509 397948 392088 387197 383368 380590 379089 379159 380639 383040 386314 391076 397802
51732 397802 406176 415447 425056 434491 442873 449327 453778 456906 459304 461165 462881 465299 468815 472483
51718D72483K029q35l641n586o551o537n534l972k792k729l530m223m172l765
51704D20645l781m229m148k706k07K284M032N012N365M964L704J859Jj281j560
51689D29954q21L54J115J059N15j8m79j149k208l600n155o546p240o804n339l409
51673C90229j506K48J860L163L943M314M690N337O100O762P545Q864J0531J1587
51659D63667J1181R315O430K646j966o485r295r448p509m842k371k36J779L725
51645D56591N208N460L889P62k891o105q470r831j0083r485q674q000p199o025
51631C95147m790l897l187k236r87L14J562K691L352L221K455J449L05j033k296
51616C92070l051l214l020k665k367k460k927l076k357j249o95p83p84m34k72
$$ plain form
51718 472483 474512 473677 470036 464450 457899 451362 445828 441856 439064 436335 432805 428582 424410 420645
51704 420645 416864 412635 408487 405781 405574 407858 411890 416902 422267 427231 430935 432794 432795 431514 429954
51689 429954 429133 429487 430602 431661 432176 432158 431679 430530 428322 424722 419567 413021 405781 398977 393638 390229
51673 390229 388723 388971 390831 393994 397937 402251 406941 412278 418378 425140 432685 441549 452080 463667
51659 463667 474848 484163 490593 493239 491273 484788 475493 466045 458536 453694 451323 451087 452866 456591
51645 456591 461799 467259 471148 471910 469019 462914 454444 444613 434530 425045 416371 408371 401172 395147
51631 395147 390357 386460 383273 381037 380050 380364 381926 384617 387969 391190 393645 395094 395399 394366 392070
51616 392070 389019 385805 382785 380120 377753 375293 372366 369290 366933 365684 364989 364206 363422 362988 362716
51601C62716o05r25o46K46J550L165M756N765O146O625P722Q951R329Q357O242
51586D29394L488O47j819l734n042n477m848l647k681j896l42K354N250P362Q954
51571D27963J0833J2993J4740J5723J6070J5923J5693J6333J8330K0580K1372
51560F06553K0505J9514J9729K1075K2984K5345K8033L0305L1348L0855K8497
51549H84743K3429J5206M902n380j4140k1180k6893l1407l4506l5929l5640l4026
51537F89179l1815k9544k7044k3787j9782j5842j2843j0881r320p542n554l905
51525D91320l173l408m025m274l882l268l066l505m261m900n322n719o182o487
51511D29848o275n449m343l509l274l504l802l929l916l813l501k937k412k250
$$ plain form
51601 362716 362111 361186 360540 360786 362336 365501 370257 376022 382168 388793 396515 405466 414795 423152 429394
51586 429394 432882 433529 431710 427976 422934 417457 412609 408962 406281 404385 404043 406397 411647 419009 427963
51571 427963 438796 451789 466529 482252 498322 514245 529938 546271 564601 585181 606553
51560 606553 627058 646572 666301 687376 710360 735705 763738 794043 825391 856246 884743
51549 884743 908172 923378 928280 922900 908760 887580 860687 829280 794774 758845 723205 689179
51537 689179 657364 627820 600776 576989 557207 541365 528522 517641 508321 500779 495225 491320
51525 491320 488147 484739 480714 476440 472558 469290 466224 462719 458458 453558 448236 442517 436335 429848
51511 429848 423573 418124 413781 410272 406998 403494 399692 395763 391847 388034 384533 381596 379184 376934
51497C76934k299k026j205k45L54N41N60N26M80O42J189J820J928J293L64k14
51481C80642j71L08P21N16m65j640k144j853j650k298l361l738l173k618k921
51466C56155l698l935l306k392j707j146m73J67N07N86N58L54j18o31q26o45k45
51449C39205L82J320K354L182L903M833N806O305O477P363R570J2158J3452J2729
51435D29039J0649Q125N482K738K27j426j837j258n06m29j256k493l547m364n207
51420D33937o013o326n890n011m214l768l578l360k849k011j160o94o57o58k88
51405C87460M75J214J424R51K08j11K92J030J492J459J138Q24P67J226K270L552
51389D05671M621N417O217P159Q259R752J1985J4887J8008K1189K4777K8944L3237
$$ plain form
51497 376934 374635 372609 371404 371159 371513 372054 372614 373140 373620 374262 375451 377271 379199 380492 380856 380642
51481 380642 380471 380779 381500 382016 381551 379911 377767 375914 374264 371966 368605 364867 361694 359076 356155
51466 356155 352457 348522 345216 342824 341117 339971 339498 339665 340172 340758 341316 341670 341552 340921 340095 339450 339205
51449 339205 339587 340907 343261 346443 350346 355179 360985 367290 373767 381130 390700 402858 416310 429039
51435 429039 439688 447813 453295 456033 456260 454834 452997 451739 451233 450804 449548 447055 443508 439144 433937
51420 433937 427924 421598 415708 410697 406483 402715 399137 395777 392928 390917 389757 389063 388406 387748 387460
51405 387460 387935 389149 390573 391524 391732 391621 391913 392943 394435 395894 397032 397856 398623 399849 402119 405671
51389 405671 410292 415709 421926 429085 437344 447096 459081 473968 491976 513165 537942 566886 600123
51376F00123L7083M0424M3607M6885N0176N2784N3111M9141M0003K7111J3285
51365A053733O85j0196j9754k8128l5004m0083m3377m5161m5872m5915m5393m3992
51353F51543m1268l7195l2376k7700k3643k0013j6440j3049j0417q880q124p613
51341D04825p128o689o211n594m981m567m162l395k360j648j525j484r22l4L76
51326C54501j8o35o75o9N32O39N46R52J988K761K174K19j708k128j083n9k38j141
51308C56558j391n56L74L76l61r70j173j407j849j964j294j74O15O45N5q61j864
51291C44759k700l099k931k240j177qQ55J104Q98Q10J264K132K998L728M560N622
51275C56575O555O817O238N072L553J737p5j205j243o19q2K81J075K580M214N163
$$ plain form
51376 600123 637206 677630 721237 768122 818298 871082 924193 973334 1013337 1040448 1053733
51365 1053733 1054418 1044222 1024468 996340 961336 921253 877876 832715 786843 740928 695535 651543
51353 651543 610275 573080 540704 513004 489361 469348 452908 439859 429442 420562 412438 404825
51341 404825 397697 391008 384797 379203 374222 369655 365493 362098 359738 358090 356565 355081 354159 354125 354501
51326 354501 354483 353848 353173 353104 353636 354275 354821 355773 357761 360522 362696 362915 361207 359079 357996 357937 357699 356558
51308 356558 355167 354611 354985 355361 355000 354030 352857 351450 349601 347637 346343 346169 346784 347429 347484 346623 344759
51291 344759 342059 338960 336029 333789 332612 332604 333459 334563 335461 336271 337535 339667 342665 346393 350953 356575
51275 356575 363130 369947 376185 381257 384810 386547 386472 385267 384024 383405 383323 383604 384679 387259 391473 396636
51259C96636N141M285K758Q22r69k111k622k872l071l296l819m933o382p331p138
51244C65098n922m283k774j678j076q97r98j291j657j779j339n01Q0Nl22j90M94
51227C40970J168J437J503J639J601R95L9m97j48P90J745K452K807K604J816R44
51211C61865N90O82O39K69N2L82R94J424J560J488J228R97J297K219K942K612
51195C81240J465N54L72M35K00k28n07o62r26j337j676j586p48O78J813J760O85
51178C81532l24o18o51j007j456j436r29l21J90M75K48m69r05l71P43J482J670
51161C77853K004K812L549L650L227K689K237J870J432N30j053k741l547l277
51147C91235k766k659k624k143j486j383k073l116l819l587k288o44K58J71o1
$$ plain form
51259 396636 401777 406062 408820 409642 408673 406562 403940 401068 397997 394701 390882 385949 379567 372236 365098
51244 365098 359176 354893 352119 350441 349365 348468 347470 346179 344522 342743 341404 340903 340983 340988 340666 340476 340970
51227 340970 342138 343575 345078 346717 348318 349313 349352 348855 348707 349497 351242 353694 356501 359105 360921 361865
51211 361865 362455 363137 363776 364045 364097 364479 365473 366897 368457 369945 371173 372170 373467 375686 378628 381240
51195 381240 382705 383259 383631 384066 384266 384038 383531 382869 381943 380606 378930 377344 376596 377274 379087 380847 381532
51178 381532 381208 380590 379939 378932 377476 376040 375111 374790 374980 375455 375703 375234 374329 373958 374701 376183 377853
51161 377853 379857 382669 386218 389868 393095 395784 398021 399891 401323 401853 400800 398059 394512 391235
51147 391235 388469 385810 383186 381043 379557 378174 376101 372985 369166 365579 363291 362647 362905 363076 363015
51132C63015J67L43n2l43M61J948K717K382K033K510L230L250K606K033J854J727
51116C89881J317P40M49Q30J791K649K730K138J626J661J992K160K072J904J797
51101D15737J827J885J612Q53J50K42R48J248P09O7N9L63L68K58N64J098J226
51084D29214R96J148J948K699K542J306m42j801k069j344n34l61m39J39J464K650
51068D37116L080L130L434M059M661N115N659O666Q465J1107J4230J7336K0148
51055E44206K2330K2919K0816J6218J1137Q007P821R782J2341J4152J4381J2820
51043G16930R987O818L932J137k256o541j1019j4397j5758j5035j2654r210n897
51030F46037m588o506j0711j4592j6179j5524j3787j1776r811q257p317o528n182
$$ plain form
51132 363015 363182 363525 363473 363130 363591 365539 368256 370638 372671 375181 378411 381661 384267 386300 388154 389881
51116 389881 391198 391938 392387 393217 395008 397657 400387 402525 404151 405812 407804 409964 412036 413940 415737
51101 415737 417564 419449 421061 421914 422064 422306 423254 424502 425211 425278 425337 425700 426068 426326 426890 427988 429214
51084 429214 430210 431358 433306 436005 438547 439853 439411 437610 435541 434197 433663 433302 432863 433002 434466 437116
51068 437116 440196 443326 446760 450819 455480 460595 466254 472920 481385 492492 506722 524058 544206
51055 544206 566536 589455 610271 626489 637626 645633 653454 663236 675577 689729 704110 716930
51043 716930 726917 733735 737667 738804 736548 730007 718988 704591 688833 673798 661144 651934 646037
51030 646037 641449 634943 624232 609640 593461 577937 564150 552374 542563 534306 526989 520461 515279
51017E15279l196j101P51K465M097N395O208O773P472Q449R614J0789J1839J2730
51003E97564J3470J3911J3690J2592J0899R189P859O955O347N749M707K998J074
50990G07004k26n25k23J37M28P29R59J121J713L366O096R274J2455J5777J9306
50975G77391K2372K4067K4277K3830K3653K4172K5624K8400L2699L8100M3765
50964A088350M9059N3828N8324O3037O8257P3493P7610P9996Q1299Q2445Q3173
50953A858871Q2235P8974P4007O8143O1422N3614M5048L6370K7915J9841J2595
50942B419035O740K369q52l189m765n875p025q590j0588j2781j4817j6482j7953
50929B325227j9746k2202k5206k8517l2180l6386m1130m6216n1447n6547o1084
$$ plain form
51017 515279 512083 510982 511733 514198 518295 523690 529898 536671 544143 552592 562206 572995 584834 597564
51003 597564 611034 624945 638635 651227 662126 671315 679174 686129 692476 698225 702932 705930 707004
50990 707004 706778 706253 706030 706167 706595 707324 708283 709404 711117 714483 720579 729853 742308 758085 777391
50975 777391 799763 823830 848107 871937 895590 919762 945386 973786 1006485 1044585 1088350
50964 1088350 1137409 1191237 1249561 1312598 1380855 1454348 1531958 1611954 1693253 1775698 1858871
50953 1858871 1941106 2020080 2094087 2162230 2223652 2277266 2322314 2358684 2386599 2406440 2419035
50942 2419035 2425775 2428144 2427292 2424103 2419338 2413463 2406438 2397848 2387260 2374479 2359662 2343180 2325227
50929 2325227 2305481 2283279 2258073 2229556 2197376 2160990 2119860 2073644 2022197 1965650 1904566
50918A904566o4751o7554o9529p0428o9877o7771o4313n9941n5280n0893m6768
50907A217461m2414l7694l3250k9722k6962k4429k2021j9957j8142j6324j4686
50896I31860j3618j2935j1977j0510q998p791o651n188l427j717m50J38K05L75
50882H49316J132K179K781K768K676K969L646M697O303Q306J0053J1170J2077
50869I20073J3359J4975J6384J7284J7931J8938K0875K3812K7140L0107L2671
50858A153549L5479L8940M2856M7094N2144N8499O5922P3847Q2320R1968J03024
50847A845642J14824J26391J37276J47582J57369J66257J73777J79900J84859
50838C233877J88357J89356J86848J80480J70036J54942J34993J11399Q6153O0525
$$ plain form
50918 1904566 1839815 1772261 1702732 1632304 1562427 1494656 1430343 1370402 1315122 1264229 1217461
50907 1217461 1175047 1137353 1104103 1074381 1047419 1022990 1000969 981012 962870 946546 931860
50896 931860 918242 905307 893330 882820 873822 866031 859380 854192 850765 849048 848598 848736 848941 849316
50882 849316 850448 852627 855408 858176 860852 863821 867467 872164 878467 886773 896826 907996 920073
50869 920073 933432 948407 964791 982075 1000006 1018944 1039819 1063631 1090771 1120878 1153549
50858 1153549 1189028 1227968 1270824 1317918 1370062 1428561 1494483 1568330 1650650 1742618 1845642
50847 1845642 1960466 2086857 2224133 2371715 2529084 2695341 2869118 3049018 3233877
50838 3233877 3422234 3611590 3798438 3978918 4148954 4303896 4438889 4550288 4636441 4696966
50828D696966L4997J0623j0817k8320m2153n2342n7836n8057n4253m8210m0325
50817D350273l0338j9451j0346n031l894o958j4757k7363m3526o1482q0144r8928
50805C948055j16916j32945j46428j57431j65803j70678j71139j67377j60741
50796B558597j52554j43056j31867j19230j06195r3567q1387o9707n9151n0136
50786A551747m2185l4702k7984k2642j8481j4867j1892j0160r518r080q633q896
50774A332707j0112j1341j1676j1365j1128j1075j0947j0912j1386j2353j3438
50763A206974j4448j5343j5917j5952j5556j4966j4136j2897j1411j0065q964
50752A057319p798o222m227k043J78K600N560R064J2685J6196K0078K4871L0142
$$ plain form
50828 4696966 4731963 4742586 4731769 4703449 4661296 4608954 4551118 4493061 4438808 4390598 4350273
50817 4350273 4319935 4300484 4290138 4285107 4281213 4274255 4259498 4232135 4188609 4127127 4046983 3948055
50805 3948055 3831139 3698194 3551766 3394335 3228532 3057854 2886715 2719338 2558597
50796 2558597 2406043 2262987 2131120 2011890 1905695 1812128 1730741 1661034 1601883 1551747
50786 1551747 1509562 1474860 1446876 1424234 1405753 1390886 1378994 1368834 1359316 1350236 1341603 1332707
50774 1332707 1322595 1311254 1299578 1288213 1277085 1266010 1255063 1244151 1232765 1220412 1206974
50763 1206974 1192526 1177183 1161266 1145314 1129758 1114792 1100656 1087759 1076348 1066283 1057319
50752 1057319 1049521 1043299 1039072 1037029 1037207 1039807 1045367 1054431 1067116 1083312 1103390 1128261 1158403
50739A158403L4885L9016M3586M9156N4846N9633O3896O8722P4141P9059Q2803
50728A808146Q5868Q8981R2107R4619R5905R5656R3965R1250Q7922Q3995P9232
50717B797646P3443O6231N6635M3683K7488R471q516k5004l8981m9674n6520n9084
50705B836818n7132n1217m3024l4493k6398j8302j0077k839J995L967L385K60
50693B602943n930j5522k8013m2171n6503o9736q1094r0045r5846r7716r5766
50682A924601r1331q5864p9697p2325o3735n4740m6034l7531k9003k0795j3459
50671A330087o997r89M661R554J3432J6494J8914K0409K0617J9704J8235J6606
50659A480727J4907J3267J1965J1154J0861J1307J2707J4561J5676J5472J4871
$$ plain form
50739 1158403 1193288 1232304 1275890 1325046 1379892 1439525 1503421 1572143 1646284 1725343 1808146
50728 1808146 1894014 1982995 2075102 2169721 2265626 2361282 2455247 2546497 2634419 2718414 2797646
50717 2797646 2871089 2937320 2993955 3037638 3065126 3074597 3066081 3041077 3002096 2952422 2895902 2836818
50705 2836818 2779686 2728469 2685445 2650952 2624554 2606252 2596175 2593336 2595331 2599298 2602683 2602943
50693 2602943 2597013 2581491 2553478 2511307 2454804 2385068 2303974 2213929 2118083 2020367 1924601
50682 1924601 1833270 1747406 1667709 1595384 1531649 1476909 1430875 1393344 1364341 1343546 1330087
50671 1330087 1323090 1322101 1326762 1336316 1349748 1366242 1385156 1405565 1426182 1445886 1464121 1480727
50659 1480727 1495634 1508901 1520866 1532020 1542881 1554188 1566895 1581456 1597132 1612604 1627475
50648A627475J5286J6942J8878K0528K2462K5327K8859L2344L5492L8338M0761
50637A922692M2682M4462M6404M8060M8669M8170M7239M6356M5441M4484M3856
50626B428515M3768M3918M3830M2870L9489L1257J6724k426k1597l6019m3478
50615B586851m4816m2250l7390l0636k2242j3524o499k126M44K378L306J715k948
50602B392263r540j6882k5210l5265m6487n6959o5070p0530p3765p5079p4698
50591A842778p3060p0580o7314o3202n8501n3695m9125m4901m1110l7812l4833
50580A248645l1818k8595k5324k2248j9369j6487j3463j0346p248m149r13K391
50568A071076N322P422Q810J0211J2140J4242J5746J6511J7295J8859K1148K3509
$$ plain form
50648 1627475 1642761 1659703 1678581 1699109 1721571 1746898 1775757 1808101 1843593 1881931 1922692
50637 1922692 1965374 2009836 2056240 2104300 2152969 2201139 2248378 2294734 2340175 2384659 2428515
50626 2428515 2472283 2516201 2560031 2602901 2642390 2673647 2690371 2687945 2666348 2630329 2586851
50615 2586851 2542035 2499785 2462395 2431759 2409517 2395993 2389494 2387368 2387812 2390190 2393496 2395211 2392263
50602 2392263 2382723 2365841 2340631 2305366 2258879 2201920 2136850 2066320 1992555 1917476 1842778
50591 1842778 1769718 1699138 1631824 1568622 1510121 1456426 1407301 1362400 1321290 1283478 1248645
50580 1248645 1216827 1188232 1162908 1140660 1121291 1104804 1091341 1080995 1073747 1069598 1068685 1071076
50568 1071076 1076398 1083820 1092630 1102841 1114981 1129223 1144969 1161480 1178775 1197634 1218782 1242291
50556A242291K5481K7063K8354K9282K9781K9866K9484K8498K7019K5578K4666
50545A547363K4175K3571K2591K1609K1237K1873K3604K6316K9721L3499L7660
50534A833219M2541M8297N4532O0778O7008P3317P9293Q4343Q8628R3050R8050
50523B623056J02932J06744J09301J10910J11431J10202J06805J01319R3897Q4469
50513C661066P2940N9326M3697K6380Q227r717k6963m3636n9618p3895q5069r2421
50501C480317r6193r6861r4314q8004p7885o4926n0349l4625j7738n05J5164K7725
50489B901806L7049M3322M5500M1897L2043J6935k429k5355n0078p3470r3031
50478B874189j08329j19752j26809j28791j26408j21415j14772j06387r6631q6851
$$ plain form
50556 1242291 1267772 1294835 1323189 1352471 1382252 1412118 1441602 1470100 1497119 1522697 1547363
50545 1547363 1571538 1595109 1617700 1639309 1660546 1682419 1706023 1732339 1762060 1795559 1833219
50534 1833219 1875760 1924057 1978589 2039367 2106375 2179692 2258985 2343328 2431956 2525006 2623056
50523 2623056 2725988 2832732 2942033 3052943 3164374 3274576 3381381 3482700 3576597 3661066
50513 3661066 3734006 3793332 3837029 3863409 3871636 3861919 3834956 3791320 3731702 3657807 3572738 3480317
50501 3480317 3384124 3287263 3192949 3104945 3027060 2962134 2911785 2877160 2859422 2858917 2874081 2901806
50489 2901806 2938855 2982177 3027677 3069574 3101617 3118552 3116123 3090768 3040690 2967220 2874189
50478 2874189 2765860 2646108 2519299 2390508 2264100 2142685 2027913 1921526 1824895 1738044
50468A738044p8004o9759o1398n2989m5238l8795l4128l1431l0093k8667k5978
50457A241564k2122j8009j4187j0562p027l733p04K291N382Q369J1059J3505J5793
50444A221619J7811J9489K1073K2846K4597K5613K5311K3671K0983J7453J3393
50433A453859R582O880N380M393L407K659K474K534K352K098K314L035L788M545
50419A509300N828P822R996J2012J4395J7841K2288K7142L2063L7000M1671M5681
50407A783039M9012N1923N4225N5208N4509N2632N0324M7703M4253L9608L3956
50396B316392K7701K0939J3372M589n626j7147k9401m1391n1987o0389o6337o9875
50384B040840p0999o9644o5963o0390n3371m5153l5871k5790j5382n241M012J1731
$$ plain form
50468 1738044 1660040 1590281 1528883 1475894 1430656 1391861 1357733 1326302 1296209 1267542 1241564
50457 1241564 1219442 1201433 1187246 1176684 1169657 1165924 1165220 1167511 1172893 1181262 1192321 1205826 1221619
50444 1221619 1239430 1258919 1279992 1302838 1327435 1353048 1378359 1402030 1423013 1440466 1453859
50433 1453859 1463441 1470321 1475701 1480094 1483501 1486160 1488634 1491168 1493520 1495618 1497932 1500967 1504755 1509300
50419 1509300 1515128 1522950 1532946 1544958 1559353 1577194 1599482 1626624 1658687 1695687 1737358 1783039
50407 1783039 1832051 1883974 1938199 1993407 2047916 2100548 2150872 2198575 2242828 2282436 2316392
50396 2316392 2344093 2365032 2378404 2382993 2377367 2360220 2330819 2289428 2237441 2177052 2110715 2040840
50384 2040840 1969841 1900197 1834234 1773844 1720473 1675320 1639449 1613659 1598277 1593036 1597048 1608779
50372A608779J7297K0274K0633J8751J4947R036N69j0252k2020l2781m1247m7309
50360A556677n1479n4095n5087n4255n1658m7801m3452l9227l5360l1858k8644
50349A063761k5448k1802j7454j2664p910l517J10K159J878o08m327q142j1099
50336I54937j2292j1238q518n454k905p85J151K701L747M737O118P675Q883R635
50322I58392J0176J0604J0854J1012J1186J1242J0930J0143Q795O715L997J240
50310A065286j004k708m048m770m437l174j680m70M63J371K428L710N140O487
50296A062594P658Q953J0716J2899J5248J7809K0834K4248K7629L0779L4031L7926
50284A311324M2466M6285M6302L9000K3305K503j7353l1438l8651m0652l9509
$$ plain form
50372 1608779 1626076 1646350 1666983 1685734 1700681 1709717 1710286 1700034 1678014 1645233 1603986 1556677
50360 1556677 1505198 1451103 1396016 1341761 1290103 1242302 1198850 1159623 1124263 1092405 1063761
50349 1063761 1038313 1016511 999057 986393 978483 974966 975076 977235 979113 978505 974178 966036 954937
50336 954937 942645 931407 922889 917435 914530 913745 914896 917597 921344 926081 932199 939874 948757 958392
50322 958392 968568 979172 990026 1001038 1012224 1023466 1034396 1044539 1053334 1060049 1064046 1065286
50310 1065286 1064282 1061574 1057526 1052756 1048319 1045145 1043465 1042995 1043458 1044829 1047257 1050967 1056107 1062594
50296 1062594 1070252 1079205 1089921 1102820 1118068 1135877 1156711 1180959 1208588 1239367 1273398 1311324
50284 1311324 1353790 1400075 1446377 1485377 1508682 1511185 1493832 1462394 1423743 1383091 1343582
50273A343582l6534l2479k7879k3173j8862j5483j3185j1551j0149r139q953r398
50261A126797r482q323o073l688j791n0K257N251Q382J1185J3663J5777J7096
50248A171001J7337J6963J6724J6778J6705J6356J6150J6440J6922J6876J5792
50237A354044J3655J0682O901K085l716r721j4809j8539k1237k2931k2928k0979
50225A252507j8256j6301j5316j4540j4073j5240j8826k3905k8821l2519l4571
50214A020139l4685l2939l0070k6862k3498j9898j6377j3450j1149r090p130n597
50202G89394m849m772m859m610l956l287l004l061l165l263l490l678l451k933
50188G37016k900l825n141n789n399m622m357m835n480n589n183m985n483o256
$$ plain form
50273 1343582 1307048 1274569 1246690 1223517 1204655 1189172 1175987 1164436 1154287 1145148 1136195 1126797
50261 1126797 1117315 1108992 1102919 1099231 1097440 1097390 1099647 1104898 1113280 1124465 1138128 1153905 1171001
50248 1171001 1188338 1205301 1222025 1238803 1255508 1271864 1288014 1304454 1321376 1338252 1354044
50237 1354044 1367699 1378381 1385282 1387367 1383651 1373930 1359121 1340582 1319345 1296414 1273486 1252507
50225 1252507 1234251 1217950 1202634 1188094 1174021 1158781 1139955 1116050 1087229 1054710 1020139
50214 1020139 985454 952515 922445 895583 872085 852187 835810 822360 811211 802121 794991 789394
50202 789394 784545 779773 774914 770304 766348 763061 760057 756996 753831 750568 747078 743400 739949 737016
50188 737016 734116 730291 725150 719361 713962 709340 704983 700148 694668 689079 683896 678911 673428 667172
50174F67172o478n869m791l640k668k121j947j514l32J033J598J462J778L003
50160F46686M212M492M208M282M965N861O592O967P070P563R259J1946J4222J4997
50146G53322J4544J3697J2854J2299J2518J3384J3923J3791J4215J6386J9691
50135I10624K2735K5414K8585L2072L4680L5986L6659L6933L6272L4825L3734
50124A268519L3533L3319L2063K9661K6098K0712J3102M083n016j3481k1040k7286
50112A394267l1903l5090l7143l8016l7643l6284l4041l0634k6205k1869j8794
50101A046645j7057j5963j5150j4720j4528j4103j3287j2338j1441j0488r371
50090H98199q018o183l614n46K332M486N883O794P559Q536R827J0923J0990R733
$$ plain form
50174 667172 660694 654825 650034 646394 643726 641605 639658 638144 637812 638845 640443 641905 643683 646686
50160 646686 650898 655390 659598 663880 668845 674706 681298 688265 695335 702898 712157 724103 738325 753322
50146 753322 767866 781563 794417 806716 819234 832618 846541 860332 874547 890933 910624
50135 910624 933359 958773 987358 1019430 1054110 1090096 1126755 1163688 1199960 1234785 1268519
50124 1268519 1302052 1335371 1367434 1397095 1423193 1443905 1457007 1461090 1456074 1442593 1421553 1394267
50112 1394267 1362364 1327274 1290131 1252115 1214472 1178188 1144147 1113513 1087308 1065439 1046645
50101 1046645 1029588 1013625 998475 983755 969227 955124 941837 929499 918058 907570 898199
50090 898199 890181 883998 880384 879838 882170 886656 892539 899333 906892 915428 925255 936178 947168 956901
50076I56901P754N861M263K748J467R73J301J513N30j663m038n688o527o862o848
50061I51685o645o647p076p577p595p023o186n343m635m223m012l413j887K82
50047H79705K282L742M927O015O804P335Q197R834J1890J3544J4235J3884J2754
50034I95148J1307J0041R155Q512P984P570P158O477N467M504L989L893L824L544
50020A088573L315L709M977O560P531P687P877Q881J0168J0404R045O882N012
50007A180621L871L413L534M023M488M613M210K849q5m595r661j3948j6906j8958
49993A147469k0799k2587k3751k3584k2125k0380j9382j9183j9084j8642j7958
49982I19994j7163j6259j5507j5380j5962j6854j7669j8122j7793j6455j4690
$$ plain form
50076 956901 964655 970516 974779 977527 978994 979967 981268 982781 983311 981648 977610 971922 965395 958533 951685
50061 951685 945040 938393 931317 923740 916145 909122 902936 897593 892958 888735 884723 881310 879423 879705
50047 879705 881987 885729 890656 896671 903475 910810 919007 928841 940731 954275 968510 982394 995148
50034 995148 1006455 1016496 1025651 1034163 1042147 1049717 1056875 1063352 1068819 1073323 1077312 1081205 1085029 1088573
50020 1088573 1091888 1095597 1100574 1107134 1114665 1122352 1130229 1139110 1149278 1159682 1168727 1175609 1180621
50007 1180621 1184492 1187905 1191439 1195462 1199950 1204563 1208773 1211622 1211537 1206942 1197281 1183333 1166427 1147469
49993 1147469 1126670 1104083 1080332 1056748 1034623 1014243 994861 975678 956594 937952 919994
49982 919994 902831 886572 871065 855685 839723 822869 805200 787078 769285 752830 738140
49971G38140j3371j2461j1107r122p447o853o975p061o890o460n584m391l549
49958F36869l380l363l072k880l038k808j442O01K370L942O096Q765J0882J1756
49944F61298J1699J1202J0352R182P995P011O182N470M905M337L454K077J13k614
49930G42663o115r888j3179j5480j6585j6453j5369j3926j2369j0381p949n887
49918E99082m824m066k446n0J880K682K894L060K910K175J373J249J952L081M238
49903F15190N198N863O347O912P686Q617R692J0871J1861J2299J2092J1295R839
49890G33762P806N729M021K296j1k475m085m833n891p892r990j1172j1644j2220
49876F83401j2913j3067j2540j1921j1584j1139j0036q317o558n255m357l406
$$ plain form
49971 738140 724769 712308 701201 692079 684632 677779 670804 663743 656853 650393 644809 640418 636869
49958 636869 633489 630126 627054 624174 621136 618328 616886 617487 619857 623799 629895 638660 649542 661298
49944 661298 672997 684199 694551 703733 711728 718739 724921 730391 735296 739633 743087 745164 745277 742663
49930 742663 736548 726660 713481 698001 681416 664963 649594 635668 623299 612918 604969 599082
49918 599082 594258 590192 587746 587696 589576 592258 595152 598212 601122 603297 604670 605919 607871 610952 615190
49903 615190 620388 626251 632598 639510 647196 655813 665505 676376 688237 700536 712628 723923 733762
49890 733762 741568 747297 751318 753614 753603 751128 747043 742210 736319 728427 718437 707265 695621 683401
49876 683401 670488 657421 644881 632960 621376 610237 600201 591884 585326 580071 575714 572308
$$ [...]
##END NTUPLES=NMR SPECTRUM
##END=
