##TITLE=AC1589_HPIAH13319_8313978_fjU4cUrUpK
##JCAMPDX= 6.0         $$ Bruker NMR JCAMP-DX V2.0
##DATA TYPE= NMR SPECTRUM
##DATA CLASS= NTUPLES
##ORIGIN= BRUKER
##OWNER= Administrator
$$ 1.72 TOPSPIN		Version 2.1
$$ 2013-11-09 11:46:24.015 -0800  Administrator@X
$$ Compression mode = diff/dup
##.OBSERVE FREQUENCY= 400.02188249412
##.OBSERVE NUCLEUS= ^1H
##.ACQUISITION MODE= SIMULTANEOUS (DQD)
##.ACQUISITION SCHEME= undefined
##.AVERAGES= 8
##.DIGITISER RES= 22
##SPECTROMETER/DATA SYSTEM= spect
##.PULSE SEQUENCE= zg30
##.SOLVENT NAME= COFFEE_meoh
##.SHIFT REFERENCE= INTERNAL, COFFEE_meoh, 1, 14.98509
##AUDIT TRAIL= $$ (NUMBER, WHEN, WHO, WHERE, PROCESS, VERSION, WHAT)
$$ ##TITLE= Audit trail, TOPSPIN		Version 2.1
$$ ##JCAMPDX= 5.01
$$ ##ORIGIN= Bruker BioSpin GmbH
$$ ##OWNER= Administrator
$$ $$ E:\/data/COFFEE/nmr/AC1589_HPIAH13319_8313978_fjU4cUrUpK/10/pdata/1/auditp.txt
$$ ##AUDIT TRAIL=  $$ (NUMBER, WHEN, WHO, WHERE, PROCESS, VERSION, WHAT)
(   1,<2013-11-09 11:46:17.281 -0800>,<Administrator>,<X>,<go>,<TOPSPIN 2.1>,
      <created by zg
	started at 2013-11-09 11:45:10.638 -0800,
	POWCHK enabled, PULCHK disabled,
       configuration hash MD5:
       C8 4E 4E 5D D3 5C D8 9E 9F 52 82 E0 59 8A DE 15
       data hash MD5: 64K
       38 7A F4 4D E9 5C 09 C7 C9 14 AD DA 61 73 E3 5B>)
(   2,<2013-11-09 11:46:20.156 -0800>,<Administrator>,<X>,<proc1d>,<TOPSPIN 2.1>,
      <Start of raw data processing
       efp LB = 0 FT_mod = 6 PKNL = 1 PHC0 = 0 PHC1 = 0 SI = 32K 
       data hash MD5: 32K
       CE 5C E9 E1 FD CC 49 39 BA 66 7B 8C 21 BA A0 FC>)
(   3,<2013-11-09 11:46:20.468 -0800>,<Administrator>,<X>,<proc1d>,<TOPSPIN 2.1>,
      <pk PHC0 = 89.14856 PHC1 = 0 
       data hash MD5: 32K
       5D 0D 98 86 93 37 EE 4E 51 2B 37 F7 F3 73 48 E8>)
(   4,<2013-11-09 11:46:20.562 -0800>,<Administrator>,<X>,<proc1d>,<TOPSPIN 2.1>,
      <abs ABSG = 1 
       data hash MD5: 32K
       21 B2 4A 47 52 23 42 8D 89 20 34 5D AC 9E 44 E0>)
(   5,<2013-11-09 11:46:20.671 -0800>,<Administrator>,<X>,<proc1d>,<TOPSPIN 2.1>,
      <abs ABSG = 2 
       data hash MD5: 32K
       FA 72 2F 43 3B A7 2E 7D 37 B7 F8 AB 1B 48 62 A9>)
(   6,<2013-11-09 11:46:20.734 -0800>,<Administrator>,<X>,<proc1d>,<TOPSPIN 2.1>,
      <abs ABSG = 3 
       data hash MD5: 32K
       1E AD D0 6D 5A C6 B6 BE DE 90 8C 55 4E 13 4E 14>)
(   7,<2013-11-09 11:46:20.796 -0800>,<Administrator>,<X>,<proc1d>,<TOPSPIN 2.1>,
      <abs ABSG = 4 
       data hash MD5: 32K
       3A 93 3F B0 EC 91 B5 6B AD F4 4D 1D 94 4A 2F F0>)
(   8,<2013-11-09 11:46:20.859 -0800>,<Administrator>,<X>,<proc1d>,<TOPSPIN 2.1>,
      <abs ABSG = 5 
       data hash MD5: 32K
       30 0C 57 8F 9E 27 2D DC 87 08 9D 17 84 90 49 C9>)
$$ ##END=
$$ 
$$ $$ hash MD5
$$ $$ 70 A4 51 D7 53 3D D0 1F 49 C4 84 DB 34 1C 11 B4
##$RELAX= 
##$RELAX= 
##$RELAX= 
##$RELAX= 
##$RELAX= 
##$RELAX= 
##$RELAX= 
$$ Bruker specific parameters
$$ --------------------------
##$DU= <E:\>
##$EXPNO= 10
##$NAME= <AC1589_HPIAH13319_8313978_fjU4cUrUpK>
$$ [...]
150 150 150 150 150 150 150 150
##$TP07= 0
##$TPNAME0= <>
##$TPNAME1= <>
##$TPNAME2= <>
##$TPNAME3= <>
##$TPNAME4= <>
##$TPNAME5= <>
##$TPNAME6= <>
##$TPNAME7= <>
##$TPOAL= (0..7)
0.5 0.5 0.5 0.5 0.5 0.5 0.5 0.5
##$TPOFFS= (0..7)
0 0 0 0 0 0 0 0
##$TUNHIN= 0
##$TUNHOUT= 0
##$TUNXOUT= 0
##$USERA1= <user>
##$USERA2= <user>
##$USERA3= <user>
##$USERA4= <user>
##$USERA5= <user>
##$V9= 5
##$VALIST= <valist>
##$VCLIST= <CCCCCCCCCCCCCCC>
##$VD= 0
##$VDLIST= <DDDDDDDDDDDDDDD>
##$VPLIST= <PPPPPPPPPPPPPPP>
##$VTLIST= <TTTTTTTTTTTTTTT>
##$WBST= 1024
##$WBSW= 4
##$XGAIN= (0..3)
0 0 0 0
##$XL= 0
##$YL= 0
##$YMAX_a= 638893
##$YMIN_a= -555419
##$ZGOPTNS= <>
##$ZL1= 120
##$ZL2= 120
##$ZL3= 120
##$ZL4= 120
##$ABSF1= 14.98509
##$ABSF2= -5.573092
##$ABSG= 5
##$ABSL= 3
##$ALPHA= 0
##$AQORDER= 0
##$ASSFAC= 0
##$ASSFACI= 0
##$ASSFACX= 0
##$ASSWID= 0
##$AUNMP= <proc_prof1d_extract_pilot.lims>
##$AXLEFT= 0
##$AXNAME= <>
##$AXNUC= <1H>
##$AXRIGHT= 0
##$AXTYPE= 0
##$AXUNIT= <>
##$AZFE= 0.1
##$AZFW= 0.1
##$BCFW= 0
##$BC_mod= 0
##$BYTORDP= 0
##$COROFFS= 0
##$CY= 15
##$DATMOD= 1
##$DC= 0
##$DFILT= <>
##$DTYPP= 0
##$F1P= 0
##$F2P= 0
##$FCOR= 0.5
##$FTSIZE= 32768
##$FT_mod= 6
##$GAMMA= 0
##$GB= 0
##$INTBC= 1
##$INTSCL= 1
##$ISEN= 128
##$LB= 0
##$LEV0= 0
##$LPBIN= 0
##$MAXI= 10000
##$MC2= 0
##$MEAN= 0
##$ME_mod= 0
##$MI= 0
##$NCOEF= 0
##$NC_proc= -8
##$NLEV= 6
##$NOISF1= 0
##$NOISF2= 0
##$NSP= 0
##$NTH_PI= 0
##$NZP= 0
##$OFFSET= 14.98509
##$PC= 1
##$PHC0= 89.14856
##$PHC1= 0
##$PH_mod= 1
##$PKNL= yes
##$PPARMOD= 0
##$PPDIAG= 0
##$PPIPTYP= 0
##$PPMPNUM= 2147483647
##$PPRESOL= 1
##$PSCAL= 4
##$PSIGN= 0
##$PYNMP= <proc.py>
##$REVERSE= no
##$SF= 400.02
##$SI= 32768
##$SIGF1= 0
##$SIGF2= 0
##$SINO= 400
##$SIOLD= 32768
##$SPECTYP= <>
##$SREGLST= <1H.CDCl3>
##$SSB= 0
##$STSI= 32768
##$STSR= 0
##$SW_p= 8223.68421052631
##$SYMM= 0
##$S_DEV= 0
##$TDeff= 65536
##$TDoff= 0
##$TI= <>
##$TILT= no
##$TM1= 0
##$TM2= 0
##$TOPLEV= 0
##$USERP1= <user>
##$USERP2= <user>
##$USERP3= <user>
##$USERP4= <user>
##$USERP5= <user>
##$WDW= 1
##$XDIM= 32768
##$YMAX_p= 472224124
##$YMIN_p= -676283
##$CURPLOT= <Network HP LaserJet P1505>
##$CURPRIN= <$Network HP LaserJet P1505>
##$DFORMAT= <normdp>
##$LAYOUT= <+/1D_H.xwp>
##$LFORMAT= <normlp>
##$PFORMAT= <normpl>
##$SURQMSG= 1
$$ End of Bruker specific parameters
$$ ---------------------------------
##NTUPLES= NMR SPECTRUM
##VAR_NAME=  FREQUENCY,     SPECTRUM/REAL,   SPECTRUM/IMAG
##SYMBOL=    X,             R,               I
##VAR_TYPE=  INDEPENDENT,   DEPENDENT,       DEPENDENT
##VAR_FORM=  AFFN,          ASDF,            ASDF
##VAR_DIM=   32768,         32768,           32768
##UNITS=     HZ,            ARBITRARY UNITS, ARBITRARY UNITS
##FACTOR=    0.250966925370066, 1,           1
##FIRST=     8223.43324360094, 131356,       -186055
##LAST=      0,             37371,           -202625
##MIN=       0,             -676283,         0
##MAX=       8223.43324360094, 472224124,    0
$$ Real data points
##PAGE= N=1
##DATA TABLE= (X++(R..R)), XYDATA
$$ [...]
19545B4104O098c05001B13776A0281b55547r9157a57435b7761E1669k0921N182
$$ 24104 30202 -305001 213776 10281 -255547 -354704 -157435 -27761 51669 30748 35930
19534C5930g5656A26896a51748B05687L9739A00884L1118a13912j7809j08652
$$ 35930 -75656 126896 -151748 205687 245426 100884 132002 -113912 -131721 -240373
19524b40373c3017A02933d3754F1987q13i5103D4541J92687a39280l79353a06989
$$ -240373 -33017 102933 -43754 61987 61174 -95103 44541 237228 -139280 -518633 -106989
19512A16404c8635n1768H5795b78884k0326k63655a78466J3951a3147k13049J7077
$$ 116404 -38635 -90403 85795 -278884 -299210 -562865 -178466 -164515 -13147 -226196 -209119
19501b09119A16716d5359J9613C2175g3937m3776o5729Q6997k2210c5425a6603
$$ -209119 116716 -45359 -25746 32175 -73937 -117713 -183442 -96445 -118655 -35425 -16603
19489c32720a06110A67511f74k2235j30765A52053a19461A59737a99558d9307
$$ -332720 -106110 167511 -674 -22909 -153674 152053 -119461 159737 -199558 -49307
19478a24085k73544J38779F094a2668I6768a17838j14806M6985r2269f1621r1439
$$ -124085 -397629 -258850 6094 -12668 96768 -117838 -232644 -185659 -277928 -61621 -153060
19467a53060k28579d6006G0898b05865f681E9452a24100l244b7313j6469j16037
$$ -153060 -381639 -46006 70898 -205865 -6681 59452 -124100 -127344 -27313 -43782 -159819
19456a59819R4N0713A00574O718a15302B32020a0F6126K1997a10141A30984b0137
$$ -159819 -159725 -109012 100574 107292 -115302 232020 -10 66126 88123 -110141 130984 -20137
19443c49271a23677d5507a5259j01289o7181C58561a73474h512j93070a2474I7990
$$ -349271 -123677 -45507 -15259 -116548 -183729 358561 -173474 -8512 -201582 -12474 97990
19431h8225C3720b1779H2048a61053I1605M5823a07865a22l7410m7391l4627A37860
$$ -88225 33720 -21779 82048 -161053 91605 137428 -107865 -122 -37532 -84923 -119550 137860
19418B29556E1028J53867a53744j1271j07327a03786p9991G8398a62652g6876
$$ 229556 51028 204895 -153744 -165015 -272342 -103786 -183777 78398 -162652 -76876
19407B87498c54048B17008b25763b1217A1088e2191N968F5438A0391J17174b91442
$$ 287498 -354048 217008 -225763 -21217 11088 -52191 -46223 65438 10391 127565 -291442
19395h7827A34326a78547q413H4417a76838c5758j04202A11447c21287J2373m393
$$ -87827 134326 -178547 -186960 84417 -176838 -35758 -139960 111447 -321287 -308914 -313307
19384c13307C47173a6449m424B8777b10384n3439J23388e6741k9280j75497R5264
$$ -313307 347173 -16449 -20873 28777 -210384 -263823 -140435 -56741 -86021 -261518 -166254
19373a66254j23806B9379q078J96016d5358q5161D2336P3728a33446M2681A9141
$$ -166254 -290060 29379 21301 217317 -45358 -130519 42336 116064 -133446 -90765 19141
19361a97932A69647c0639j55772N9978C1852c87287g8469A36698a30780k00934
$$ -197932 169647 -30639 -186411 -126433 31852 -387287 -78469 136698 -130780 -331714
19351c31714B57128c29444A58773n3760h2816l77344C96517e7598A90679M7924
$$ -331714 257128 -329444 158773 105013 -82816 -460160 396517 -57598 190679 238603
19341B38603J8222e14392a67718e926k422B2416J35949b31956r7956A47192h731
$$ 238603 256825 -514392 -167718 -5926 -8348 22416 158365 -231956 -329912 147192 -8731
19329a24221N0849k2517K4283O350j80616C38017a55463M6152q0372j2271P5117
$$ -124221 -73372 -95889 -71606 -65256 -245872 338017 -155463 -109311 -189683 -201954 -126837
19318a26837A18246B0993J41954a58491j62660F8601a6036l329l19105a55547
$$ -126837 118246 20993 162947 -158491 -321151 68601 -16036 -19365 -338470 -155547
19307b01959L3419o268k13460a86971F703J4913P5131a59430a0260j03170o2523
$$ -201959 -168540 -174808 -388268 -186971 6703 21616 96747 -159430 -10260 -113430 -175953
19296a75953E2901a34170a0107j44976E05501b4707l4579A55362D7417f1445J8438
$$ -175953 52901 -134170 -10107 -155083 505501 -24707 -59286 155362 47417 -61445 -43007
19285d3007A82500D7933i0521l08411a56455f0233l0852q2970N6259l43313a60714
$$ -43007 182500 47933 -90521 -398932 -156455 -60233 -91085 -174055 -117796 -461109 -160714
19273d78773b35138f7595k9488A2056J56692a01394j38936A42940g5459J6025
$$ -478773 -235138 -67595 -97083 12056 168748 -101394 -240330 142940 -75459 -59434
19263e9434h080A15992D5737a28360l04308H8659k2361b79853D4639a45752k2329
$$ -59434 -8080 115992 45737 -128360 -432668 88659 66298 -279853 44639 -145752 -168081
19252a68081f2835A64668c49455j91043F4978k3176K03e7942l4323h253j52299
$$ -168081 -62835 164668 -349455 -540498 64978 41802 42005 -57942 -92265 -8253 -160552
19241a60552A60523B8771R533b10123G7921g2943D5377d08441a01223C5249f08189
$$ -160552 160523 28771 38304 -210123 77921 -72943 45377 -408441 -101223 35249 -608189
19229a86133B12595c04086A16299a90006j43691J14068G6117e462j87780A66114
$$ -186133 212595 -304086 116299 -190006 -333697 -219629 76117 -5462 -193242 166114
19218c31032g5530A42192J10573a28687e8430j35360A78128L5049D4435K31427
$$ -331032 -75530 142192 252765 -128687 -58430 -193790 178128 213177 44435 275862
19208B75862b8113F1199b61810L0893E6803a84305h1418k52549A13585J43433
$$ 275862 -28113 61199 -261810 -230917 56803 -184305 -81418 -333967 113585 257018
19198B57018A3785J47421i0122A96507o2930e1745k6245p9034j46207a43077A99093
$$ 257018 13785 161206 -90122 196507 133577 -51745 -77990 -157024 -303231 -143077 199093
19186I6420a75447A980b79206I0655g5843j74419J21789i736j5977D57181b09010
$$ 96420 -175447 1980 -279206 90655 -75843 -250262 -128473 -9736 -25713 457181 -209010
19174I0502J06048a55809G3761c84906a70699n5565Q7253k3150C07555c75886
$$ 90502 196550 -155809 73761 -384906 -170699 -226264 -139011 -162161 307555 -375886
19163F487b39l3561J4090l636O042A12574b08146K389g6839B0910A604b04822
$$ 6487 -239 -33800 -19710 -23346 -17304 112574 -208146 -205757 -76839 20910 1604 -204822
19150c02440J00245b3531n439n9599k976k20275a20652k62384J39227h6256B9068
$$ -302440 -202195 -23531 -28970 -88569 -91545 -311820 -120652 -383036 -243809 -86256 29068
19138B27886O4077j44040F6612b13266A81681h8002a3343G2136c10747i0365j6449
$$ 227886 291963 147923 66612 -213266 181681 -88002 -13343 72136 -310747 -90365 -106814
19127a06814I4707j0213a49941k57002D7917J90145f4359O309k2910I370a38920
$$ -106814 94707 84494 -149941 -406943 47917 238062 -64359 -58050 -80960 9370 -138920
19115a11916J7987J5362E5528c24068a25013A05981a13784l969K518r2689G3232
$$ -111916 -93929 -78567 55528 -324068 -125013 105981 -113784 -117753 -115235 -207924 73232
19103d53431K11610a08057A20667b07016k25955C319J02169K9872a13077a0282
$$ -453431 -241821 -108057 120667 -207016 -432971 3319 105488 135360 -113077 -10282
19092b59255O3498j2054i2336A51583M814c4517l82734h1689l6890B10439b27949
$$ -259255 -195757 -207811 -92336 151583 156397 -34517 -417251 -81689 -118579 210439 -227949
19080a71449j65626Q5139k3474A15020N0008E0406a60758M5380j73225B9111P3156
$$ -171449 -337075 -251936 -275410 115020 165028 50406 -160758 -115378 -288603 29111 102267
19069A02267M3063M0643i7563j3427a6426j48772F937K5296J17002g9060j13477
$$ 102267 145330 185973 -97563 -110990 -16426 -165198 6937 32233 149235 -79060 -192537
19058a92537j90667e172l10859g1933j755j32128a02687j41912a12051A6762g3650
$$ -192537 -383204 -5172 -316031 -71933 -73688 -205816 -102687 -244599 -112051 16762 -73650
19046B39691a40289B89445E3692g3861B4512b27530f2129j60546b7827F3198J00064
$$ 239691 -140289 289445 53692 -73861 24512 -227530 -62129 -222675 -27827 63198 163262
19035A63262a07630d9135p036a6162A25861E640a37728k8692A4482a39268j05148
$$ 163262 -107630 -49135 -56171 -16162 125861 5640 -137728 -166420 14482 -139268 -244416
19024b44416M2674B39779n6898A1353G72N155c31237A0792b08348E4726N4550
$$ -244416 -201742 239779 182881 11353 772 5927 -331237 10792 -208348 54726 109276
19013A09276b62768D9082a6751j80303c5278A10695g3887L472j83370E9666h1047
$$ 109276 -262768 49082 -16751 -197054 -35278 110695 -73887 -70415 -253785 59666 -81047
19001b2866I9160a26397J6196D3842J58336b98515A47264c4794j0147j08343c4015
$$ -22866 99160 -126397 -110201 43842 202178 -298515 147264 -34794 -44941 -153284 -34015
18989a22583B02856a77927o3417H5653b17837A03109J10190a69650a7735l32522
$$ -122583 202856 -177927 -241344 85653 -217837 103109 213299 -169650 -17735 -350257
18979c50257A0209K6854O2897c67535J05365a25011e9280j50870A3053f5975D98204
$$ -350257 10209 37063 99960 -367535 -262170 -125011 -59280 -210150 13053 -65975 498204
18967I841b45525N0982K0862A31227c36645N9854C9957O2304G460h7097G0525
$$ 9841 -245525 -194543 -173681 131227 -336645 -276791 39957 102261 7460 -87097 70525
18955a42507A66987a80118h3710j66239k1675m95h4788C53839a24200j52186B3788
$$ -142507 166987 -180118 -83710 -249949 -271624 -272119 -84788 353839 -124200 -276386 23788
18943c19287a4123k3936A4901a15485M8229J5764I7549j5820K53543H0654J00684
$$ -319287 -14123 -38059 14901 -115485 -67256 -51492 97549 81729 335272 80654 181338
18932A81338g5790K1057n7328A07223l2788A2779a06998K9026j28475g1619C06598
$$ 181338 -75790 -54733 -112061 107223 74435 12779 -106998 -77972 -206447 -71619 306598
18920A76090J07511D5099k0415K6059h8454G826c4995O146B59655G2626f433l0653
$$ 176090 283601 45099 24684 50743 -88454 7826 -34995 -28849 259655 72626 -6433 -37086
18908c7086k11070M4680k16564C01477H7638g3612H4701J33414E3623b53743f2854
$$ -37086 -248156 -203476 -420040 301477 87638 -73612 84701 218115 53623 -253743 -62854
18896A42159h187k74169A5902f0639a5360j56568h0191q4015K6128A62724n6350
$$ 142159 -8187 -282356 15902 -60639 -15360 -171928 -80191 -164206 -138078 162724 106374
18885A06374i2638B5282d24465I3161J20058a02160G5870e37096A4465L00536
$$ 106374 -92638 25282 -424465 93161 213219 -102160 75870 -537096 14465 315001
18875C15001d2666A37043M8388a92581d5553H060a49845M8138B4642L21453a18310
$$ 315001 -42666 137043 185431 -192581 -45553 8060 -149845 -101707 24642 346095 -118310
18863H3305J3508J40596b52180A78569f3242l4282C32396c4303j49016j7273G2526
$$ 83305 96813 237409 -252180 178569 -63242 -97524 332396 -34303 -183319 -200592 72526
18851A6110h4528j29526N1381B23490a39529e8624q493k2360o1920G055e10685
$$ 16110 -84528 -214054 -162673 223490 -139529 -58624 -67117 -89477 -151397 7055 -510685
18839b04659C42562e9937j60656A19872b45604A20194b20036M8540P3748c6653
$$ -204659 342562 -59937 -220593 119872 -245604 120194 -220036 -171496 -97748 -36653
18828E7096J3052K1554a62147j31959B585b03522A91255a5047n0464b7944a3791
$$ 57096 70148 91702 -162147 -294106 2585 -203522 191255 -15047 -65511 -27944 -13791
18816A091P0064b9021i624B33669m4706q3102A4415K65411j35563J55071J72600
$$ 1091 71155 -29021 -9624 233669 188963 105861 14415 279826 144263 299334 471934
18805D71934A38523d7218j89285i5793B6521K7007A9872b69681e2653C5603b52097
$$ 471934 138523 -47218 -236503 -95793 26521 53528 19872 -269681 -52653 35603 -252097
18793a53537q9644g2569p1412g437l50992J59251A784N808a46533a4227n7966
$$ -153537 -243181 -72569 -143981 -7437 -358429 -199178 1784 7592 -146533 -14227 -72193
18782g2193F6635B4212a15676b5530A5004L05729A46120g679j65798K8804H637
$$ -72193 66635 24212 -115676 -25530 15004 320733 146120 -7679 -173477 -144673 8637
18770F9509a49759P4852A06246h0241A30743a47119N9312E2320h2356E3213B1322
$$ 69509 -149759 -74907 106246 -80241 130743 -147119 -87807 52320 -82356 53213 21322
18758A45977g6227b846r5484c5178j99365c673q7737k34200B62142a62151j30101
$$ 145977 -76227 -2846 -98330 -35178 -234543 -3673 -91410 -325610 262142 -162151 -292252
18747b92252B67020a11504A41283f0050N320j59841C51092a48166j65877a7026
$$ -292252 267020 -111504 141283 -60050 -54730 -214571 351092 -148166 -314043 -17026
18736B85508j19835a60897A80252m3222E2460c05812m269O7922J11194b5705A22644
$$ 285508 165673 -160897 180252 137030 52460 -305812 -310081 -242159 -130965 -25705 122644
18724e8129k80282E4849b09376R428k0845k7522A00191a13282q9187D3545A603
$$ -58129 -338411 54849 -209376 -199948 -220793 -248315 100191 -113282 -202469 43545 1603
18712C0788a67730N5096F8154N0178a81385p2785B40019B7585b05212h6274G6564
$$ 30788 -167730 -112634 68154 118332 -181385 -254170 240019 27585 -205212 -86274 76564
18700b1531j52413B36501a5965j70763c2495l16408A98085b62197Q0073c6407
$$ -21531 -173944 236501 -15965 -186728 -32495 -348903 198085 -262197 -182124 -36407
18689h4488A9240R8155a81703c6942A44594b88112d4832A2375b0203C05047b32808
$$ -84488 19240 117395 -181703 -36942 144594 -288112 -44832 12375 -20203 305047 -232808
18677h8245k29365I0697j4231K1659c5145k4569n1128e1071I1018b4078k83194
$$ -88245 -317610 90697 76466 98125 -35145 -59714 -110842 -51071 91018 -24078 -307272
18666c07272R0621l3288h8915F5557c18397f7039C817a98949j09293M0876B77231
$$ -307272 -216651 -249939 -88915 65557 -318397 -67039 3817 -198949 -308242 -267366 277231
18654A16777c1362k86555B16966a08850p0877j89150E2931Q1810J28352d49895
$$ 116777 -31362 -317917 216966 -108850 -179727 -368877 52931 134741 263093 -449895
18643A21804B1390a21909p4395O6961g764k05041E739c8118J7642p9662K3367
$$ 121804 21390 -121909 -196304 -129343 -7764 -212805 5739 -38118 -20476 -100138 -76771
18632g6771r303l09071a35928j09937I2740Q0077F768i3150a6263C2177a6357
$$ -76771 -86074 -395145 -135928 -245865 92740 172817 6768 -93150 -16263 32177 -16357
18620D30892b78821a5236k20908P5695A61528e9210H2102j7102J15504a97491
$$ 430892 -278821 -15236 -236144 -160449 161528 -59210 82102 65000 180504 -197491
18609F1217a27995F7337a11838k07650J59335D9378J9150b0465A70062a04611
$$ 61217 -127995 67337 -111838 -319488 -160153 49378 68528 -20465 170062 -104611
18598e16991f7366j25979A11120B2681e2269j13848A08662a39224M4197B2196
$$ -516991 -67366 -193345 111120 22681 -52269 -166117 108662 -139224 -95027 22196
18587e8268j733J5835D21685a72331C8650c13092J51363l6993j67114A06807e0732
$$ -58268 -60001 -44166 421685 -172331 38650 -313092 -161729 -198722 -365836 106807 -50732
18575a60272m2450a6461k13958B25042H393c4782q5516B8845c92584a10624G4212
$$ -160272 -202722 -16461 -230419 225042 8393 -34782 -120298 28845 -392584 -110624 74212
18563c53908e9135j67888J07961k24151J57095I0549a89012d7475b555F7536K4476
$$ -353908 -59135 -227023 -119062 -343213 -186118 90549 -189012 -47475 -2555 67536 92012
18552I2012J738K8868D4537h4000K5702A59010D597a09662d0495a43D539a10453
$$ 92012 93750 122618 44537 -84000 -58298 159010 4597 -109662 -40495 -143 4539 -110453
18539f7450B38099a42413C0661f7317f133k30319B50625a09896B13838n6932C2633
$$ -67450 238099 -142413 30661 -67317 -6133 -236452 250625 -109896 213838 156906 32633
18527a84677L4376B12148I4925K67844p2003a60732A05155b46355A7686a78788
$$ -184677 -150301 212148 94925 362769 290766 -160732 105155 -246355 17686 -178788
18516C3913d0790A22522l367c36353h2056A8189J55247J48613A1379c26902c7612
$$ 33913 -40790 122522 119155 -336353 -82056 18189 173436 322049 11379 -326902 -37612
18504C15925A51785b16565J2302B42885D2744g9177A93608J16108a78594L7993
$$ 315925 151785 -216565 -204263 242885 42744 -79177 193608 309716 -178594 -140601
18494a40601k80799I3293f7572C37378d8929q152q5155c8371j62556h5268C01585
$$ -140601 -421400 93293 -67572 337378 -48929 -57081 -142236 -38371 -200927 -85268 301585
18482a44269B48571g6225r6161F3707J26287o384a52400M2124J6539I845b22227
$$ -144269 248571 -76225 -172386 63707 189994 183610 -152400 -110276 -93737 9845 -222227
18470c90997J65029O9770j16833A1350a54845D862a30461A37764E6232d326F4966
$$ -390997 -225968 -156198 -273031 11350 -154845 4862 -130461 137764 56232 -4326 64966
18458a63577r5943A3238a3538A74926E5065J22985p4442b44261F1001a62779h255
$$ -163577 -259520 13238 -13538 174926 55065 178050 103608 -244261 61001 -162779 -8255
18446g5128g540n7287B6774d04226J45297a0152o6339H3899J03685J58831B3136
$$ -75128 -7540 -64827 26774 -404226 -258929 -10152 -76491 83899 187584 346415 23136
18434f4215k5257E2304a14839A93798o4122L9513l1764a01082j74496l9626A76914
$$ -64215 -89472 52304 -114839 193798 129676 169189 137425 -101082 -275578 -315204 176914
18422A64694a73081J0573k49524f5855B5308b72928e2686A16507h6659o3643C01585
$$ 164694 -173081 -162508 -412032 -65855 25308 -272928 -52686 116507 -86659 -150302 301585
18410g9932B9476a14898C00465b69073R1152q4910i4244n5840C3282a31292C73371
$$ -79932 29476 -114898 300465 -269073 -177921 -262831 -94244 -150084 33282 -131292 373371
18398e2521D3368d3777B54648d3238j39888r8998B62271j05388d07477a93447
$$ -52521 43368 -43777 254648 -43238 -183126 -282124 262271 156883 -407477 -193447
18387A30181c0763Q989L314B0557O2898a7035j74807L1634n0598A24181J87921
$$ 130181 -30763 -21774 -18460 20557 83455 -17035 -191842 -160208 -210806 124181 312102
18376C12102a30535j32565A75037c58983J29116M9804a4374L830A41475b66793
$$ 312102 -130535 -263100 175037 -358983 -229867 -180063 -14374 -10544 141475 -266793
18365C7331b11821E4148a56849A70930a34631j04782J01359L3869b6951C50430
$$ 37331 -211821 54148 -156849 170930 -134631 -239413 -138054 -104185 -26951 350430
18354A12590b94563h6731J1898k59452F3978a71309E0736K34811i6685A66549
$$ 112590 -294563 -86731 -74833 -334285 63978 -171309 50736 285547 -96685 166549
18343F2149K44331e7076k32936a20121o3973E2965a02294k48119R2145c4941J501
$$ 62149 306480 -57076 -290012 -120121 -184094 52965 -102294 -350413 -258268 -34941 -33440
18332c3440j35707M933G9071B3170A354a94541B2901a34560r9460A66412A9200
$$ -33440 -169147 -164214 79071 23170 1354 -194541 22901 -134560 -234020 166412 19200
18320G457K69546b0396D5361M3065J7871d52734b11432R7634k41882B02632E760
$$ 7457 277003 -20396 45361 88426 106297 -452734 -211432 -113798 -355680 202632 5760
18308I3662e07729a1797C0980l662a55051A14484Q2597j23m7441i9972l29775
$$ 93662 -507729 -11797 30980 27318 -155051 114484 197081 196958 149517 -99972 -429747
18297d29747a84427c0788m7597C6567a5337n6063b5887E695J8923f5587A94116
$$ -429747 -184427 -30788 -78385 36567 -15337 -71400 -25887 5695 24618 -65587 194116
18285c8668l78025a96985k48541J47274B55504A13194a06610J6724K8738j02218
$$ -38668 -416693 -196985 -445526 -298252 255504 113194 -106610 -89886 -61148 -163366
18275a63366A0862P6535O9358J977A5652J99234a31252k433m5693b0258C16737
$$ -163366 10862 87397 156755 158732 15652 214886 -131252 -133685 -179378 -20258 316737
18263a79445A47184a43956L9534L8090J8610j02339B30652E4245A6819a1770j7995
$$ -179445 147184 -143956 -104422 -66332 -47722 -150061 230652 54245 16819 -11770 -29765
18252b9765k45046J22929B5142c00220a44764j31918C863f3179a1925l595j34278
$$ -29765 -274811 -151882 25142 -300220 -144764 -276682 3863 -63179 -11925 -15520 -149798
18241a49798k03188h7602j85272B0200C902J25234b49709J00888j53170h7935
$$ -149798 -352986 -87602 -272874 20200 3902 129136 -249709 -148821 -301991 -87935
18230G3236a25409l52863a52685j69768L3666d4974F7046k685j998a74108A03090
$$ 73236 -125409 -478272 -152685 -322453 -288787 -44974 67046 64361 62363 -174108 103090
18218a52357B27721i8927E5368e2841k52432g4991B9009f5714H0172d76134B00505
$$ -152357 227721 -98927 55368 -52841 -305273 -74991 29009 -65714 80172 -476134 200505
18206i4945K3215I1875b12339A15508D9141M4606a03823E4453b05698m3685B17507
$$ -94945 -71730 91875 -212339 115508 49141 93747 -103823 54453 -205698 -249383 217507
18194A88513H7990b95225a35935l620E2322h8196j1079k7293j17196b4810n8163
$$ 188513 87990 -295225 -135935 -139555 52322 -88196 -99275 -126568 -243764 -24810 -82973
18183h2973B21832i8200A06609f9859C0848h0518c0110%l47460e7429C4112C028
$$ -82973 221832 -98200 106609 -69859 30848 -80518 -30110 -30110 -377570 -57429 34112 3028
18170B64730e8099k2324b5700F1497a10091o604O151L5558A00554K2737K0361
$$ 264730 -58099 -80423 -25700 61497 -110091 -116695 -110544 -74986 100554 123291 143652
18159A43652a30986L4144A38609a16996d6616a3185j03966m9169p8042B99261
$$ 143652 -130986 -96842 138609 -116996 -46616 -13185 -117151 -166320 -244362 299261
18148b20888A04175G449g0793p4022k49246a25544C6192N438L5285j4588a80210
$$ -220888 104175 7449 -70793 -144815 -394061 -125544 36192 41630 76915 62327 -180210
18136B40641c7940A36251b66444B60664j09673a44418j61986C75162b50737n8581
$$ 240641 -37940 136251 -266444 260664 150991 -144418 -306404 375162 -250737 -309318
18126c09318A13354a83899O1213k31335A15095A3425a9873B45129r6161J6888
$$ -309318 113354 -183899 -122686 -354021 115095 13425 -19873 245129 148968 165856
18116A65856g9160k21815a41146e6877n3276j51447d6041j25040m9163e4950C57739
$$ 165856 -79160 -300975 -141146 -56877 -110153 -261600 -46041 -171081 -220244 -54950 357739
18104A43707C7403J29855c87749F0588h8489L0390B14283a21669j39593G7522
$$ 143707 37403 167258 -387749 60588 -88489 -58099 214283 -121669 -261262 77522
18093E4140K47004a47499e3979b5224k06327A04692N0507a13771k7708f9079A2365
$$ 54140 301144 -147499 -53979 -25224 -231551 104692 155199 -113771 -141479 -69079 12365
18081a2499j75586j10518J29978F3729c15177n8486a27306K1536L6665k26084
$$ -12499 -188085 -298603 -168625 63729 -315177 -373663 -127306 -105770 -69105 -295189
18071b95189P1731K3531Q2500E9742J53425q2375L46533b97144J47099A51123
$$ -295189 -223458 -199927 -117427 59742 213167 130792 477325 -297144 -150045 151123
18060A10749b46127L7446C9339g598A64494n3273e6007K6794F1212O1462J19742
$$ 110749 -246127 -208681 39339 -7598 164494 111221 -56007 -29213 61212 122674 242416
18049B42416j13326d01821a83285J549j11663A952M9443a91028A19481k0525G933
$$ 242416 129090 -401821 -183285 -181736 -293399 1952 51395 -191028 119481 98956 7933
18037G3680N510c65743D1970j1283f9662L1408A15509a27926n2857A22343B8895
$$ 73680 79190 -365743 41970 30687 -69662 -38254 115509 -127926 -180783 122343 28895
18025C9091J52962M3737a04787l9965l55679a42919B55814D0771a587D845A469
$$ 39091 192053 235790 -104787 -144752 -500431 -142919 255814 40771 -1587 4845 1469
18013A237g763l33108A08612R2324A5145J20943b3961A10955J3376B717a97937
$$ 1237 -7763 -340871 108612 200936 15145 136088 -23961 110955 124331 2717 -197937
18001F4323J0647Q113J54175a49827A92656C542J76981c4230j18632j14482p5728
$$ 64323 74970 83083 237258 -149827 192656 3542 180523 -34230 -152862 -267344 -343072
17990c43072A00729i8766B68580A03690J18992J00606c3196C6170k122P7145a18393
$$ -343072 100729 -98766 268580 103690 222682 323288 -33196 36170 34048 111193 -118393
17978a90985f8048G0289K22813A2500f8291F8100j8522J03989b2256m4604A67409
$$ -190985 -68048 70289 293102 12500 -68291 68100 49578 153567 -22256 -66860 167409
17966A53796a090j44112A48694B8876J04156K7558c18741d027m36D3387J56985
$$ 153796 -1090 -145202 148694 28876 133032 160590 -318741 -4027 -4463 43387 200372
17955B00372a40561E244a06526D5190a77124B02911b92719A03692k1348b79737
$$ 200372 -140561 5244 -106526 45190 -177124 202911 -292719 103692 82344 -279737
17944e0632P588F8205N9753i4050n2540A52685a61508k03959I9237a33137j09236
$$ -50632 -43044 68205 127958 -94050 -146590 152685 -161508 -365467 99237 -133137 -242373
17933b42373L7597H5439m0850h6486A37113F3230c09338H3257J48347a78965c9887
$$ -242373 -204776 85439 44589 -86486 137113 63230 -309338 83257 231604 -178965 -39887
17921a24698k22964N1488R4693C88232b74942A56835c6899A73656q2565d20433
$$ -124698 -347662 -296174 -201481 388232 -274942 156835 -36899 173656 91091 -420433
17910a51424e8647G2650J64495a223I066P1348C097L4535a56993d9446k02758
$$ -151424 -58647 72650 237145 -1223 9066 80414 3097 37632 -156993 -49446 -252204
17899b52204d256k71928F4181L5388a89850j21395b2634p0187B45653a6247k19011
$$ -252204 -4256 -276184 64181 99569 -189850 -311245 -22634 -92821 245653 -16247 -235258
17888b35258R8815C32792e1001l28903H1461f7479k020H0865K37577j08196F3329
$$ -235258 -136443 332792 -51001 -379904 81461 -67479 -69499 80865 318442 210246 63329
17876a30561B98790j31300f2918n4498L7892q027o7415e8270j95839C17494a53926
$$ -130561 298790 167490 -62918 -117416 -79524 -87551 -154966 -58270 -254109 317494 -153926
17864a31492K2537M4970b8221q2289N4778j95908j45188a97622r7409G2881i3110
$$ -131492 -108955 -63985 -28221 -110510 -55732 -251640 -396828 -197622 -295031 72881 -93110
17852A84026c6063C5294d1902q9530O4748o6914A14847J87206c09646A70350e0407
$$ 184026 -36063 35294 -41902 -131432 -66684 -133598 114847 302053 -309646 170350 -50407
17840e6449G2894N7042b47741q3840h7154a6730b059k08384a7857A2210a55138
$$ -56449 72894 129936 -247741 -331581 -87154 -16730 -2059 -210443 -17857 12210 -155138
17828a03286A92565K11779a13037A11990B295J27724a31561B54198d3941j64665
$$ -103286 192565 404344 -113037 111990 2295 130019 -131561 254198 -43941 -208606
17818b08606P4142B66741n3697k134q1781e3515a4570k70879p5835J08852C4671
$$ -208606 -134464 266741 213044 210910 129129 -53515 -14570 -285449 -361284 -252432 34671
17806h7366A56015b72132H8700J38455h9841B54029a70364G6102A8093J51087
$$ -87366 156015 -272132 88700 227155 -89841 254029 -170364 76102 18093 169180
17796A69180c05991a2622r5462j05506A83166q8125a72785k13371J30010a0328
$$ 169180 -305991 -12622 -108084 -213590 183166 95041 -172785 -386156 -256146 -10328
17785F0185H77J45333b8620j67830B0060f0019r2060A67841h6605n63093B42853
$$ 60185 877 146210 -28620 -196450 20060 -60019 -152079 167841 -86605 -649698 242853
17773G120K6377o284a05933j57729A31676a94144A61534i4096G2765B9191K24942
$$ 7120 33497 27213 -105933 -263662 131676 -194144 161534 -94096 72765 29191 254133
17762B54133A13943e3381j31677M7199e7886J2706n9620L9164E9782a30642e8398
$$ 254133 113943 -53381 -185058 -137859 -57886 -45180 -104800 -65636 59782 -130642 -58398
17750A74707G9744L1751b20221D8506Q5687L8303n8752L5014a2992m9282B96966
$$ 174707 79744 111495 -220221 48506 134193 172496 113744 148758 -12992 -62274 296966
17738E4317J13776C0197J37564k6824a50135B12402c6723E7542k2477M1861C6752
$$ 54317 168093 30197 167761 140937 -150135 212402 -36723 57542 35065 76926 36752
17726a11101I2778i1m8949E7102b80895H0766k1192O2068d02432A9892K07540
$$ -111101 92778 -91 -49040 57102 -280895 80766 59574 121642 -402432 19892 227432
17715B27432r862p851N5506F9185b9264j33203D5269L9087N4382a52130k967e5324
$$ 227432 217570 209719 265225 69185 -29264 -162467 45269 84356 138738 -152130 -155097 -55324
17702a65574e3591K0358G2109O1636M84011a7685o7762j34253A07495c49052J37000
$$ -165574 -53591 -33233 72109 133745 617756 -17685 -85447 -219700 107495 -349052 -212052
17691b12052A07045M7352K75637B11605C6339M1298a34679b2703E5105f0105m86
$$ -212052 107045 154397 430034 211605 36339 77637 -134679 -22703 55105 -60105 -60591
17680f0591j35373F203b25923I1324l5553K4512J5363J1835K15394A14626b41777
$$ -60591 -195964 6203 -225923 91324 55771 80283 95646 107481 322875 114626 -241777
17668c56394J21541h2527G682b32044C60172A07368a63535L4471B18351j03691
$$ -356394 -234853 -82527 7682 -232044 360172 107368 -163535 -129064 218351 114660
17658A14660a85142G8289k2782R7430k1559h2629A58469J03799j19467B8817J78566
$$ 114660 -185142 78289 55507 152937 131378 -82629 158469 262268 142801 28817 207383
17647B07383I7920M9179a72459E7624J15158K51131p6797F2047M7202a5553B34093
$$ 207383 97920 147099 -172459 57624 172782 423913 347116 62047 109249 -15553 234093
17635a51860e4108k54285A21979C7895J35213h3289B47902R009A19638M339L5741
$$ -151860 -54108 -308393 121979 37895 173108 -83289 247902 256911 119638 123977 159718
17624A59718a07726C9342a56182G4603b2973B07963Q6671A29731K04334A58158
$$ 159718 -107726 39342 -156182 74603 -22973 207963 294634 129731 334065 158158
17613g2246K0558B1398J46074H0832l6248O1994e4558F1234h3788B42498K15056
$$ -72246 -51688 21398 167472 80832 44584 106578 -54558 61234 -83788 242498 457554
17602D57554A41834K5158m1551J00481b28747A97480i6542C9577J33892k1806
$$ 457554 141834 166992 125441 225922 -228747 197480 -96542 39577 173469 151663
17592A51663a26384c0239j58655k9566c6794k16638B68703F0640A0992a91643
$$ 151663 -126384 -30239 -188894 -218460 -36794 -253432 268703 60640 10992 -191643
17581A85700c13435m0152A08124m5780a40831B0341b18385c698A27273a64442
$$ 185700 -313435 -353587 108124 62344 -140831 20341 -218385 -3698 127273 -164442
17570a2772j71330C6240c34755A78449o8651a09914H7753a74806b2364A63876
$$ -12772 -184102 36240 -334755 178449 109798 -109914 87753 -174806 -22364 163876
17559a70009J2749I6720L5351F07M3033L586j0740g3356B888c1110M873A38883
$$ -170009 -157260 96720 132071 607 43640 47226 36486 -73356 2888 -31110 -26237 138883
17546I677J57869b26210D3559A1976J44615h3312D3937J23254e6351o0648o6565
$$ 9677 167546 -226210 43559 11976 156591 -83312 43937 167191 -56351 -116999 -183564
17535a83564A43164e3439n257a4889m5466C72700A72142O7890j13980a18857M0845
$$ -183564 143164 -53439 -58696 -14889 -60355 372700 172142 240032 126052 -118857 -78012
17524g8012B7202K4024J28906a19197d2662j0829m5409B43003a00185n6436d3610
$$ -78012 27202 51226 180132 -119197 -42662 -53491 -98900 243003 -100185 -156621 -43610
17512c23829J51140n21A1128R6112P3027k602f4882j45508C9756a2720A34197
$$ -323829 -172689 -173210 11128 107240 180267 177665 -64882 -210390 39756 -12720 134197
17500h4413H5030b17113D32769f6279C43079j20838l8327M2648d3379C42167g0564
$$ -84413 85030 -217113 432769 -66279 343079 222241 183914 226562 -43379 342167 -70564
17488A54755J9649m4317B5303J9351a8694B66484J2351N2945f8902D64944a05707
$$ 154755 174404 130087 25303 44654 -18694 266484 278835 331780 -68902 464944 -105707
17476G5923a03030H2958a24055G3009K35350A13696D5195J35329l9843b03770
$$ 75923 -103030 82958 -124055 73009 308359 113696 45195 180524 140681 -203770
17465d0141C06054e7825a0994l6419A80902K4017B1102P5418J26698M0636d7118
$$ -40141 306054 -57825 -10994 -47413 180902 204919 21102 96520 223218 263854 -47118
17453B8956K75259I5195q241N03461B92947j14585m6333K83723q8981Q0708r3660
$$ 28956 304215 95195 86954 590415 292947 178362 132029 415752 326771 407479 313819
17442C13819F8235J22483Q6242A01492P2710p8945K03879J08972A09637J84109
$$ 313819 68235 190718 276960 101492 174202 95257 299136 408108 109637 293746
17432B93746a87166A97540L33122A11127j2564P8243O2628f9348I0874R1277L04182
$$ 293746 -187166 197540 530662 111127 98563 176806 239434 -69348 90874 182151 486333
17421D86333J36712B39927K37270j19171A20913L91123A02866L63129A18392j3302
$$ 486333 623045 239927 477197 358026 120913 512036 102866 465995 118392 105090
17411A05090L97152b18821A20477i0058B07666j2514J60352c6351j88025C30038
$$ 105090 502242 -218821 120477 -90058 207666 195152 355504 -36351 -224376 330038
17400c5223A03371J1517C3096K62597B3163a62234j67476A58958h0735C9667J60488
$$ -35223 103371 114888 33096 295693 23163 -162234 -329710 158958 -80735 39667 200155
17389B00155k098B4674M45093B23000p7459J935a399C35574o7622f4733j59315
$$ 200155 198057 24674 469767 223000 145541 147476 -1399 335574 267952 -64733 -224048
17378b24048Q1518o0772b3496o3180C4179K76908j44008K49248h187k70469A22249
$$ -224048 -142530 -203302 -23496 -86676 34179 311087 167079 416327 -8187 -278656 122249
17366B70568h1860A77695a94195F5358a42790P166A23044O4161e3717b2829A60563
$$ 270568 -81860 177695 -194195 65358 -142790 -135624 123044 187205 -53717 -22829 160563
17354C3182A2331R570b51159d0617A56105b82481A07205M4544a51807C57097l003
$$ 33182 12331 21901 -251159 -40617 156105 -282481 107205 151749 -151807 357097 354094
17343C54094o0920A28983h3124A45704N6098I1564L04490a19539j42014R9943
$$ 354094 293174 128983 -83124 145704 201802 91564 396054 -119539 -261553 -161610
17333a61610b2310B85255A10148g832C32782A4532K68185h9409G6579L65471H0166
$$ -161610 -22310 285255 110148 -7832 332782 14532 282717 -89409 76579 442050 80166
17321A02062K13687M3290j20481g6782C77221H6945K25041F8669J90419R4510
$$ 102062 315749 359039 238558 -76782 377221 86945 311986 68669 259088 353598
17311C53598M0419j91326q4837k408a33001D17012A66381m8207J61648K6214p6206
$$ 353598 394017 202691 117854 115446 -133001 417012 166381 118174 279822 306036 229830
17300B29830K5274a10044G1765J52171a09058B84283H37M59306A77894J27609
$$ 229830 255104 -110044 71765 223936 -109058 284283 837 460143 177894 305503
17290C05503Q0640j38795f2936A84753a08998A0545J85186k1610J0215p4603a35973
$$ 305503 386143 247348 -62936 184753 -108998 10545 195731 174121 184336 109733 -135973
17278h3472r4493G9723K39039A39768h8513A62137B3224K43542m7407P5480E4816
$$ -83472 -177965 79723 318762 139768 -88513 162137 23224 266766 219359 294839 54816
17266C84164J90919A53529n7617J23845J77931j45689n3759Q7377P8398c3150
$$ 384164 575083 153529 95912 219757 397688 251999 198240 285617 364015 -33150
17255B95730j47368d1169A82512P1046j02647l2567L49931a7928A40563J83259
$$ 295730 148362 -41169 182512 253558 150911 118344 468275 -17928 140563 323822
17245C23822p9507o8893J87734i110C13400I3859L30080j9460k00628J33126a0001
$$ 323822 244315 175422 363156 -9110 313400 93859 423939 404479 203851 336977 -10001
17233F7212J78889l5063F2882K02611J50765O9702B19696a00773A8339L80204
$$ 67212 246101 211038 62882 265493 416258 485960 219696 -100773 18339 398543
17223C98543j48159k3788K17472q2757d5961B78826a9168H8525J65611l7595b6179
$$ 398543 250384 226596 444068 361311 -45961 278826 -19168 88525 254136 216541 -26179
17211A29274K63697j27593b09988a2440C93662J47254I8833P2961l4551n394J13537
$$ 129274 392971 265378 -209988 -12440 393662 540916 98833 171794 137243 131849 245386
17200B45386O8620j32307b65752f8366B78140f70A41703n1297J88855G0753J22107
$$ 245386 314006 181699 -265752 -68366 278140 -670 141703 90406 279261 70753 192860
17189A92860K9361K685i4482A96256B8522M08181d6951D24892B09603J01021j31795
$$ 192860 222221 224906 -94482 196256 28522 436703 -46951 424892 209603 310624 178829
17178A78829j3593E8891L65159D9956K28784p7021N1026M9257c075A44312K25933
$$ 178829 165236 58891 424050 49956 278740 201719 252745 302002 -3075 144312 370245
17167C70245J7738p0594A32369L65953p3343O2734r3452q6135Q8731j66027L2470
$$ 370245 387983 317389 132369 498322 424979 487713 394261 308126 396857 230830 263300
17156B63300J95462j41182E7842J69587J78566K6311K52132B11324a00745C76955
$$ 263300 458762 317580 57842 227429 405995 432306 684438 211324 -100745 376955
17145C79165F7532R0887J81997J32521n3996h1785C20148R9683c6606B59381q8829
$$ 379165 67532 158419 340416 472937 418941 -81785 320148 419831 -36606 259381 170552
17134A70552J31515j49902K75486B12524J79275j5325B9403M87581k38358J44284
$$ 170552 302067 152165 427651 212524 391799 376474 29403 516984 278626 422910
17124D22910K62937B00994L27684o1569O5655k15477K35038k07324k4511l1149
$$ 422910 685847 200994 528678 467109 532764 317287 552325 345001 320490 289341
17114B89341J52981l8428m3036k7513j12503J46046O9113L3471B29701k0030J68013
$$ 289341 442322 403894 360858 333345 220842 366888 436001 469472 229701 209671 377684
17103C77684R9558B15606J30171f2435A83801K17865J78145k60617j40161K79563
$$ 377684 477242 215606 345777 -62435 183801 401666 579811 319194 179033 458596
17093D58596j48737J89706R2121B25973o8569k4143K86302J41098J28158k02305
$$ 458596 309859 499565 591686 225973 157404 133261 419563 560661 688819 486514
17083D86514r3885J79606Q266B45890J73796k9406P2285j37849j61130L62991
$$ 486514 392629 572235 580501 245890 419686 390280 462565 324716 163586 526577
17073E26577J07618L8517B49385M32597C6121K97853j9387K64453q7450q2691
$$ 526577 634195 672712 249385 681982 36121 333974 314587 579040 491590 408899
17063D08899K01213q1070k59767M65493k67132O2506K00167k73002n8017M55720
$$ 408899 610112 529042 269275 734768 467636 530142 730309 457307 399290 855010
17053H55010o2552C72904N46642D25036p7259K87222k07234K01698k10098J13950
$$ 855010 792458 372904 919546 425036 347777 634999 427765 629463 419365 533315
17043E33315j35902L84097r907l10646l6725J58864k61747m0995L28455A67911
$$ 533315 397413 781510 771603 460957 424232 583096 321349 280354 608809 167911
17032E88517J17527k26537H7903P53706j55324O4729p4006J76260l13767l2054
$$ 588517 706044 479507 87903 841609 686285 751014 677008 853268 539501 507447
17022E07447p1626j2062J56421j0362n0870N10267C15721J74979P5479L8758M5248
$$ 507447 435821 423759 580180 569818 518948 1029215 315721 490700 566179 604937 650185
17011F50185J24551j13136L38241C52571M65332C45374L70208j2747J99353k70138
$$ 650185 774736 661600 999841 352571 817903 345374 715582 702835 902188 632050
17001F32050j27187L57255p3866j08583M6472L1923k00872K16839p1601j0524
$$ 632050 504863 862118 788252 679669 726141 758064 557192 774031 702430 691906
16991F91906j00168J58058J50000l45291N2457K55891k30167M2702j26081M27097
$$ 691906 591738 749796 899796 554505 606962 862853 632686 675388 549307 976404
16981I76404l01086o6642K25867k52290k1506K14029n8657M27944k93082j6211
$$ 976404 675318 608676 834543 582253 560747 774776 716119 1144063 850981 834770
16971H34770J22574j65928K58484k28507o1741R5786j56524M23306k7252q5591
$$ 834770 957344 791416 1049900 821393 759652 855438 698914 1122220 1094968 1009377
16961A009377j08191j42986L97649n11274K55647j65737L34756j87206L66418
$$ 1009377 901186 758200 1155849 644575 900222 734485 1069241 882035 1248453
16952A248453n5080m44362J02049M58105m13070L92118l96197O5710N0022o2653
$$ 1248453 1193373 749011 851060 1309165 896095 1288213 892016 957726 1007748 945095
16942I45095L21302j22293j50570j4055L98124l25259o1652N08578o59015L27129
$$ 945095 1266397 1144104 993534 979479 1377603 1052344 990692 1499270 840255 1167384
16932A167384K76134l52626j38184J86918k48005J20908J15491k12492J62291
$$ 1167384 1443518 1090892 952708 1139626 891621 1012529 1128020 915528 1077819
16923A077819J62405N4357q8512K63055l8336j58104K26019k68541k27914M67660
$$ 1077819 1240224 1294581 1206069 1469124 1430788 1272684 1498703 1230162 1002248 1469908
16913A469908J0092J46362j68024J55774j42493p64K3604P8777j69797J64324
$$ 1469908 1480000 1626362 1458338 1614112 1471619 1470855 1494459 1573236 1403439 1567763
16903A567763R6861k0272N8732k01219L06328l1753q9049J9171q2846K29959J78813
$$ 1567763 1664624 1644352 1703084 1501865 1808193 1776440 1687391 1706562 1623716 1853675 2032488
16892B032488k45644K7238M4787K30099j51189m1472j62617K7415K80455j7836
$$ 2032488 1786844 1814082 1858869 2088968 1937779 1896307 1733690 1761105 2041560 2023724
16882B023724l22898L91515k10786L4651K77406N5034K5138l41102K63338J12792
$$ 2023724 1700826 2092341 1881555 1916206 2193612 2248646 2273784 1932682 2196020 2308812
16872B308812Q8320j60916m7093J70890j71897J26141L41451k07989n3854R8600
$$ 2308812 2397132 2236216 2189123 2360013 2188116 2314257 2655708 2447719 2393865 2492465
16862B492465L02793o73525O21504k50917J15881J58501k0056J77724n6560l36685
$$ 2492465 2795258 2121733 2743237 2492320 2608201 2766702 2746646 2924370 2867810 2531125
16852B531125L98494N4207k68047M85815p1361m1355j05471L99757l60052J77300
$$ 2531125 2929619 2983826 2715779 3201594 3130233 3088878 2983407 3383164 3023112 3200412
16842C200412L71461j78428J1602M08042K33467j56433k82697K04659J05792M23254
$$ 3200412 3571873 3393445 3405047 3813089 4046556 3890123 3607426 3812085 3917877 4341131
16832D341131m58311L85173J01837M5439m08410O55365j39400k68630M20922J23356
$$ 4341131 3882820 4267993 4369830 4415269 4006859 4662224 4522824 4254194 4675116 4798472
16822D798472l12705J33303L86217J15049M3609j24874N1675J65054L16840N9053
$$ 4798472 4485767 4619070 5005287 5120336 5163945 5039071 5090746 5255800 5572640 5631693
16812E631693O347K64494K6178J15609L47529J20130j23392m1634P27760j3656
$$ 5631693 5638040 5902534 5928712 6044321 6391850 6511980 6388588 6346954 7074714 7061058
16802G061058O2413m5506K35864o8739J94419L21732K19595J54369L24964J58139
$$ 7061058 7123471 7077965 7313829 7245090 7439509 7761241 7980836 8135205 8460169 8618308
16792H618308L06644J25866L63851K97524l908K82995L31468L5251O70641J8333
$$ 8618308 8924952 9050818 9414669 9712193 9708285 9991280 10322748 10357999 11028640 11046973
16782A1046973L93361K2832J77326R78102K22744N31230M67116J22701J92445
$$ 11046973 11440334 11463166 11640492 12618594 12841338 13372568 13839684 13962385 14154830
16773A4154830O50234M40495N49067M36174K94750P72061P69188M47846P31515
$$ 14154830 14805064 15245559 15794626 16230800 16525550 17297611 18066799 18514645 19246160
16764A9246160L70827R67204M65489J149600O12971J356403P99848J061768J238617
$$ 19246160 19616987 20584191 21049680 22199280 22812251 24168654 24968502 26030270 27268887
16755B7268887O39295J298435J597997J244123J353769J576613J711903J489788
$$ 27268887 27908182 29206617 30804614 32048737 33402506 34979119 36691022 38180810
16747C8180810J645048K481700K104902K331880K363153K947531K330895L223406
$$ 38180810 39825858 42307558 44412460 46744340 49107493 52055024 54385919 57609325
16739E7609325K898639L863366L089315M092849M428730M482894M932510N107117
$$ 57609325 60507964 64371330 67460645 71553494 75982224 80465118 85397628 90504745
16731I0504745N533896N722772O108067O869030O891004P188452P049574P887736
$$ 90504745 96038641 101761413 107869480 114738510 121629514 128817966 135867540 143755276
16723A43755276P631205P542887P435442P151050O567859N541447M957738M057227
$$ 143755276 151386481 158929368 166364810 173515860 180083719 185625166 190582904 194640131
16715A94640131K402775J744222L27209j297809k589022l351669m926806n669061
$$ 194640131 197042906 198787128 199114337 197816528 195227506 191875837 186949031 181279970
16707A81279970o566661p274312p118815p241234q524050p427290p831179p308475
$$ 181279970 174713309 167438997 160320182 153078948 144554898 137127608 129296429 121987954
16699A21987954o872772o903657o591260o173879n609749n412940m762919m534597
$$ 121987954 115115182 108211525 101620265 95446386 89836637 84423697 79660778 75126181
16691G5126181m299322m171594l866614l207899l187800l179944k541675k780234
$$ 75126181 70826859 66655265 62788651 59580752 56392952 53213008 50671333 47891099
16683D7891099k729707j878958k666336j872594j531646k010593j338353j568158
$$ 47891099 45161392 43282434 40616098 38743504 37211858 35201265 33862912 32294754
16675C2294754j680396r88577j099732j350288j133251j395626r36583p53119
$$ 32294754 30614358 29625781 28526049 27175761 26042510 24646884 23710301 22957182
16667B2957182q80157p00670j211508n53554m84160p21976o85442n90436o10834
$$ 22957182 22077025 21376355 20164847 19611293 19127133 18405157 17719715 17129279 16518445
16658A6518445n29865o23618n15318n28746n81157k92842o72056j13111m99978
$$ 16518445 15988580 15364962 14849644 14320898 13739741 13446899 12774843 12661732 12161754
16649A2161754m09137n83905p6940n29663q5839k33437k44834n14097N4126m41798
$$ 12161754 11752617 11168712 11091772 10562109 10476270 10242833 9997999 9483902 9538028 9096230
16639I096230l28943O4672q5694o74651j58691l11530k47965l8797k42908J49813
$$ 9096230 8767287 8831959 8746265 8071614 7912923 7601393 7353428 7314631 7071723 7221536
16629G221536l91264m55346L69069l26574m52988r5733Q8526l81289M88179n20337
$$ 7221536 6830272 6374926 6743995 6417421 5964433 5868700 5957226 5575937 6064116 5543779
16619E543779j455n0047q8323l65385K92884l57479k47225J0042Q0564l28200
$$ 5543779 5542324 5492277 5403954 5038569 5331453 4973974 4726749 4736791 4817355 4489155
16609D489155J54727k8780l59534N4711l88052N67083m65144p8987k9740r3961
$$ 4489155 4643882 4615102 4255568 4310279 3922227 4489310 4024166 3945179 3915439 3821478
16599C821478r2361l17378M6302K7740k86297L16430j91111J5718j24814r6795
$$ 3821478 3729117 3411739 3458041 3485781 3199484 3515914 3324803 3340521 3215707 3118912
16589C118912l3911r8722l6310K92445m43353k81177M21970l61037K77106k1088
$$ 3118912 3085001 2986279 2949969 3242414 2799061 2517884 2939854 2578817 2855923 2834835
16579B834835l72560L03676n16207K59816p3826l61034M59781m28385K05478j7309
$$ 2834835 2462275 2765951 2249744 2509560 2435734 2074700 2534481 2106096 2311574 2294265
16569B294265P6007r2257J52724l06265M608k41334J72949l2780K05094k96679
$$ 2294265 2370272 2278015 2430739 2124474 2129082 1887748 2060697 2027917 2233011 1936332
16559A936332J60870j48698J05093l70002J06024P4702o8741k33743K21284m6264
$$ 1936332 2097202 1948504 2053597 1683595 1789619 1864321 1795580 1561837 1783121 1736857
16549A736857q3822N5019K336k24689O8765k50944K78105J05370l0485j48349
$$ 1736857 1653035 1708054 1710390 1485701 1554466 1303522 1581627 1686997 1656512 1508163
16539A508163J62079l32515M38235m26380M15045l92612J25286q6433p1673K0172
$$ 1508163 1670242 1337727 1775962 1349582 1764627 1372015 1497301 1410868 1339195 1359367
16529A359367Q2287l49393n6461k6488L76156j58017j33639L24703j74361n0457
$$ 1359367 1441654 1092261 1035800 1009312 1385468 1227451 1093812 1418515 1244154 1193697
16519A193697l7790P5790l48398Q8320P0471Q3994j37052K31695J79829k64544
$$ 1193697 1155907 1231697 883299 971619 1042090 1126084 989032 1220727 1400556 1136012
16509A136012j07579j45118J37593l08359R4481J99121J09079j33564j2067l93030
$$ 1136012 1028433 883315 1020908 712549 807030 1006151 1115230 981666 969599 576569
16499E76569L44040k1173J81665m45936L78620j36775k74285L48916j9660j54840
$$ 576569 920609 899436 1081101 635165 1013785 877010 602725 951641 931981 777141
16489G77141K96098k81831O2673j55313Q4126j48915j15285N97094l04045O5145
$$ 777141 1073239 791408 854081 698768 782894 633979 518694 1115788 811743 876888
16479H76888K4501r2922l74983K25559J21572m1530J3720L8017j27062k1676k08313
$$ 876888 901389 808467 433484 659043 780615 739085 752805 790822 663760 642084 433771
16468D33771J62647j52001N3730k2205M37881k92426M3715k01650L47286C10438
$$ 433771 596418 444417 498147 475942 913823 621397 665112 463462 810748 310438
16457H74423j80041j55912j34896J63861j00001o243K50573j86931o0685L7029
$$ 874423 694382 538470 403574 567435 467434 461191 711764 524833 464148 501177
16447E01177K44540k0395C48411K11030j26456j40671M90915k3973j14602k36877
$$ 501177 745717 725322 348411 559441 432985 292314 783229 759256 644654 407777
16437D07777K19721n777J73708p8754r9212j56356B06520J04637N04548k19248
$$ 407777 627498 621721 795429 716675 617463 461107 206520 311157 815705 596457
16427E96457B28131P058L47022p8963R5441j89284L12730j71078J39654j21345
$$ 596457 228131 235189 582211 503248 598689 409405 722135 551057 690711 569366
16417E69366k39376j6329k2117K51921J52454q1409L5927B38404R7132N1131j14828
$$ 569366 329990 313661 291544 543465 695919 614510 650437 238404 335536 386667 271839
16406B71839J92960M25084B62459J06737K26529k69119O3722J54474k14444K62105
$$ 271839 464799 889883 262459 369196 595725 326606 390328 544802 330358 592463
16396E92463B68185j10481K15984A72862J99690A40169K0806M29533k00863A53260
$$ 592463 268185 157704 373688 172862 372552 140169 160975 590508 389645 153260
16385D08014j87449K3913m8848Q9062H9525L52386n307j26336L72498B96716I2897
$$ 408014 220565 244478 195630 284692 89525 441911 436604 310268 682766 296716 92897
16373E68202k19579J70965A41834J55212K90970k69862l0586J77230A51616K49278
$$ 568202 348623 519588 141834 297046 588016 318154 287568 464798 151616 400894
16363D00894j0170a91183D37403k18244a01414E64578H575L75999A88245J46661
$$ 400894 390724 -191183 437403 219159 -101414 564578 8575 384574 188245 334906
16353C34906J11278B20271K46352F2924J28802O8708l1008J62844E5838K6626
$$ 334906 446184 220271 466623 62924 191726 260434 229426 392270 55838 82464
16343H2464L07434A72490K29067j30981M6689l6370o415N818K5623A22499c7276
$$ 82464 389898 172490 401557 270576 317265 280895 274480 280298 305921 122499 -37276
16331E07526P082A29794J01149R532A2486J48956K68332C6856i0998B96855A46832
$$ 507526 514608 129794 230943 240475 12486 161442 429774 36856 -90998 296855 146832
16319a70708A14668J89547J00689J21960k14539k9903r1653o9939a89484A02997
$$ -170708 114668 304215 404904 526864 312325 282422 190769 120830 -189484 102997
16308A80998Q7498m99A15517K59999A81774b0232B26141L4378I3999M909J84224
$$ 180998 268496 267997 115517 375516 181774 -20232 226141 260519 93999 98908 283132
16297B83132J0732F0203J00317j9352o6082J90828J22654c9262B58833l359E6864
$$ 283132 293864 60203 160520 141168 75086 265914 388568 -39262 258833 255474 56864
16285B67800d0701B52962c9863A14920J98222j31470h3482A75659a21766F5658
$$ 267800 -40701 252962 -39863 114920 313142 181672 -83482 175659 -121766 65658
16274D0712L71641m9608m1933E4879a62864B62834a2286C67674R0828A02291a02108
$$ 40712 412353 362745 320812 54879 -162864 262834 -12286 367674 458502 102291 -102108
16262C62659A59176J64186F8320a49314D1299N6893L53837a7313k24048C6752
$$ 362659 159176 323362 68320 -149314 41299 98192 452029 -17313 -241361 36752
16251B10116c7432a7103j719A35421J74740F8797J7567d1020B38664F1876J26637
$$ 210116 -37432 -17103 -18822 135421 310161 68797 86364 -41020 238664 61876 188513
16240A88513o0325a8586j7830o0148I4920b39621A16156a06675B82480j01990
$$ 188513 128188 -18586 -36416 -96564 94920 -239621 116156 -106675 282480 180490
16230A80490B404c2175k37061f3343G0199Q7135M6740j3359a04100I3217C6530
$$ 180490 2404 -32175 -269236 -63343 70199 157334 204074 190715 -104100 93217 36530
16218A85913a06882b914l08367B00698a2379n4436I9191k0410a34844A37833a25463
$$ 185913 -106882 -2914 -311281 200698 -12379 -66815 99191 78781 -134844 137833 -125463
16206A03287a69235F2783a21218B7953a79553A93443J7793a19242q0839d358n8429
$$ 103287 -169235 62783 -121218 27953 -179553 193443 211236 -119242 -200081 -4358 -62787
16195f2787C11347A07278E2402a20545A07872e4529E9905e887B77050A9929L78847
$$ -62787 311347 107278 52402 -120545 107872 -54529 59905 -5887 277050 19929 398776
16184C98776r2251h9750A78983E0169R7388f1015B61040c2995I3252J40057f048
$$ 398776 306525 -89750 178983 50169 147557 -61015 261040 -32995 93252 233309 -6048
16172I3025a96337B30878c9149j04118O5417c3152E0862c840A96945J19953i2986
$$ 93025 -196337 230878 -39149 -143267 -77850 -33152 50862 -3840 196945 316898 -92986
16160B4341b92574B22234B6618R7690h2199A11311J42880R353I371a9347j34255
$$ 24341 -292574 222234 26618 124308 -82199 111311 254191 263544 9371 -19347 -153602
16149a53602D1051J31822d939A40597J64047j19366J82225c6907B66138N4222
$$ -153602 41051 172873 -4939 140597 304644 185278 367503 -36907 266138 320360
16139C20360j24262a16505B69627q2541M7040f251o1752k79930j94066B91464
$$ 320360 196098 -116505 269627 187086 234126 -6251 -68003 -347933 -541999 291464
16128a63927d3139k91749m1013h5842j87313c0556B31481a77619E3188c90639
$$ -163927 -43139 -334888 -375901 -85842 -273155 -30556 231481 -177619 53188 -390639
16117d9841B54028a77358B5739P3589a3986n6676m2764j28698J17758K4439C1331
$$ -49841 254028 -177358 25739 99328 -13986 -70662 -113426 -242124 -124366 -99927 31331
16105a05119A11523J98560a19364B91519A2167K24395A16076i5183k94412a45601
$$ -105119 111523 310083 -119364 291519 12167 236562 116076 -95183 -389595 -145601
16094A0777J92473d0118l2110F0552a70532D786J60126b49590a06991F5044b21921
$$ 10777 203250 -40118 -72228 60552 -170532 4786 164912 -249590 -106991 65044 -221921
16082e0522m6831I5796a26547j3575A24854a33924e3898j01884o1864e7136j95976
$$ -50522 -97353 95796 -126547 -140122 124854 -133924 -53898 -155782 -217646 -57136 -253112
16071b53112d3379A67397a40749B55307O5101d2105A46860J12676b45135L1421
$$ -253112 -43379 167397 -140749 255307 320408 -42105 146860 259536 -245135 -213714
16061b13714H4650K9249i720l9074G3326a84457p8602A29313D0586b81381A8142
$$ -213714 84650 113899 -9720 -48794 73326 -184457 -263059 129313 40586 -281381 18142
16049B68651c21474g2403J8145k00583H2249J49734b83623q9801J59326a01442
$$ 268651 -321474 -72403 -54258 -254841 82249 231983 -283623 -373424 -214098 -101442
16038A43797a1602A76706k6572e7451k9499C1913L55229a0162j49546q0858a04576
$$ 143797 -11602 176706 150134 -57451 -86950 31913 387142 -10162 -159708 -240566 -104576
16026A35299b09261f7828l44785i6361b6990A1204b63437a318A43816E3616d51100
$$ 135299 -209261 -67828 -412613 -96361 -26990 11204 -263437 -1318 143816 53616 -451100
16014b17694J05616A18462N2014k0102G62L3339c7079j17377c5507j07099E2154
$$ -217694 -112078 118462 170476 150374 762 34101 -37079 -154456 -35507 -142606 52154
16002D589J25880J63362a78143B11642A5763b34504j13290J66350B51556I8292
$$ 4589 130469 293831 -178143 211642 15763 -234504 -347794 -181444 251556 98292
15991I2659b29462a13958D0270c49248A85196L3488l9093a7050A48127J1512J71785
$$ 92659 -229462 -113958 40270 -349248 185196 218684 179591 -17050 148127 159639 331424
15980C31424j22945K1170d9647A09467k1295e4545A63125c87179c6737A58086
$$ 331424 208479 229649 -49647 109467 88172 -54545 163125 -387179 -36737 158086
15969b60453E3365A9381a05827j16767B18718J41001a00663F1213b98374A95843
$$ -260453 53365 19381 -105827 -222594 218718 359719 -100663 61213 -298374 195843
15958A60139a57017D4051K3662D984d3324f311A42457d2783q4123E4069K93192
$$ 160139 -157017 44051 67713 4984 -43324 -6311 142457 -42783 -126906 54069 347261
15947C47261a58151B60427A26653E9327I540O871b83832A51216P5924b53783j2781
$$ 347261 -158151 260427 126653 59327 9540 16411 -283832 151216 227140 -253783 -266564
15936b66564P8032A5810L6307q502C112J832K6246k825b0357k38362H6312i1600
$$ -266564 -188532 15810 52117 43615 3112 4944 31190 28365 -20357 -258719 86312 -91600
15923c84331a70676E4879b32780n2057g1919o191k29310i4335I1924i9297o4579
$$ -384331 -170676 54879 -232780 -284837 -71919 -78110 -307420 -94335 91924 -99297 -163876
15912a63876k7824C1150i3124b5376q5480J2600B26392a55946b9193A70831J64034
$$ -163876 -191700 31150 -93124 -25376 -110856 -98256 226392 -155946 -29193 170831 334865
15901C34865A70b34245h1208B2427J24801J0939m273a48511B5848c580G7749a66731
$$ 334865 170 -234245 -81208 22427 147228 158167 153894 -148511 25848 -3580 77749 -166731
15888D9944a85380A38301n4338l3996c71105f1492j78469e669l6038j91483J4000
$$ 49944 -185380 138301 83963 49967 -371105 -61492 -239961 -5669 -41707 -233190 -219190
15877b19190e3597m6378M4514K0142G0890h7244j76803A33783L7925c986C41127
$$ -219190 -53597 -99975 -55461 -35319 70890 -87244 -264047 133783 171708 -3986 341127
15865f771j7509A03948c6180p0061J0842N690l962d3579j42187A93197b1101A50989
$$ -6771 -24280 103948 -36180 -106241 -95399 -89709 -93671 -43579 -185766 193197 -21101 150989
15852A5082c29760A9746J29338C574K08455o4024n3563b90742J29171r3984A74032
$$ 15082 -329760 19746 149084 3574 212029 148005 94442 -290742 -161571 -255555 174032
15840e9132A37557F6033K88106F77c0695j4812j73157o3268J22182a3325A05864
$$ -59132 137557 66033 354139 677 -30695 -45507 -218664 -281932 -159750 -13325 105864
15828f7270A03534b74230G0897L9257a29355k89269a81347b2916B1519c45641
$$ -67270 103534 -274230 70897 110154 -129355 -418624 -181347 -22916 21519 -345641
15817B75997G3024b94351J44986n8327k23947a63927d6427N397r2088B4909g0231
$$ 275997 73024 -294351 -149365 -207692 -431639 -163927 -46427 -41030 -133118 24909 -70231
15805a59364g6659A37769J32349F4139Q4096c7288j32644B5317d16979A53981
$$ -159364 -76659 137769 270118 64139 148235 -37288 -169932 25317 -416979 153981
15794B58579b84295R7224A47544b16807F9195b71173a26455A23627E1144a24986
$$ 258579 -284295 -187071 147544 -216807 69195 -271173 -126455 123627 51144 -124986
15783a9460A52088g7381n5538R337j14581a5775j6314A39837a67978k11486M4400
$$ -19460 152088 -77381 -132919 -123582 -238163 -15775 -32089 139837 -167978 -379464 -335064
15772c35064d9071j88490B4479O6474J05256b03995B10431d0780k67577E4676
$$ -335064 -49071 -237561 24479 90953 196209 -203995 210431 -40780 -308357 54676
15761D47247f8350j16493K0894j15369C01450A03070n626a3971k09955M6722M2889
$$ 447247 -68350 -184843 -163949 -279318 301450 103070 97444 -13971 -223926 -177204 -134315
15750a34315F8744K05211G5910a80226C53119m8562n2717o3207O7612g0004B2827
$$ -134315 68744 273955 75910 -180226 353119 304557 251840 188633 256245 -70004 22827
15738b08597A0059b94576H2553J9969L43422f0012B2339L71192a59342K092j45965
$$ -208597 10059 -294576 82553 102522 445944 -60012 22339 393531 -159342 -157250 -303215
15727c03215a31462c3801B27741d3920K291j53381A09106m6415h9298l31914E3215
$$ -303215 -131462 -33801 227741 -43920 -41629 -195010 109106 62691 -89298 -421212 53215
15715G8182a32963L8322D5852K4230b31879C8185a33122A20919h8241k5513d7766
$$ 78182 -132963 -94641 45852 70082 -231879 38185 -133122 120919 -88241 -113754 -47766
15703I6663f8556k34773f4565l9626K8897k32069G5104b5613k016E0432a15967
$$ 96663 -68556 -303329 -64565 -104191 -75294 -307363 75104 -25613 -27629 50432 -115967
15691C44957I5213l9843P542d0711a7120A58016a12538r320g094F9899a7490B39072
$$ 344957 95213 55370 62912 -40711 -17120 158016 -112538 -121858 -7094 69899 -17490 239072
15678c46757J45704A57333F6751a22395A20404a45306A29729c84924C28305a56959
$$ -346757 -201053 157333 66751 -122395 120404 -145306 129729 -384924 328305 -156959
15667E5499N199a28150E1334R8438b71449A18707c2775C22175b59786G8942b03987
$$ 55499 60698 -128150 51334 149772 -271449 118707 -32775 322175 -259786 78942 -203987
15655c85850P0700E7850K064k2402L5418d45971K09965f2699K9214A37915c46
$$ -385850 -315150 57850 59914 37512 72930 -445971 -236006 -62699 -33485 137915 -346
15643E6925a7507l66263e1421j33934f5082A32198b77308c7106J0387k99843e2578
$$ 56925 -17507 -383770 -51421 -185355 -65082 132198 -277308 -37106 -26719 -326562 -52578
15631a74037F6774L475b05887A05643f33001c12739A0925J15844J08018f5711
$$ -174037 66774 70249 -205887 105643 -633001 -312739 10925 126769 234787 -65711
15620h4033C77560I1480J57146b71918A48035d3317l83813A77739a60057H3582
$$ -84033 377560 91480 248626 -271918 148035 -43317 -427130 177739 -160057 83582
15609a28221j89424B64391a94771E3769i3611k39112I4252a42559D3609Q8430
$$ -128221 -317645 264391 -194771 53769 -93611 -332723 94252 -142559 43609 132039
15599A32039O3525o1733n5989g6187n6782D8257a70818c8406B63219h8805q5156
$$ 132039 195564 133831 77842 -76187 -132969 48257 -170818 -38406 263219 -88805 -173961
15588a73961B27a57624f7946k37875J04152E186c8431B05585B0844a79844C76635
$$ -173961 227 -157624 -67946 -305821 -201669 5186 -38431 205585 20844 -179844 376635
15576A81722f2285n2328H9720l1157a11336a3269B27586a33274j094A54276b25124
$$ 181722 -62285 -114613 89720 58563 -111336 -13269 227586 -133274 -134368 154276 -225124
15564b4962k00917A11080E5442N5832c55727a76207m4451I1183b36796B3244a1633
$$ -24962 -225879 111080 55442 111274 -355727 -176207 -220658 91183 -236796 23244 -11633
15552A73637C0462b03361L1235h0052C60594j66136r4677J11671b974p7704A28504
$$ 173637 30462 -203361 -172126 -80052 360594 194458 99781 211452 -2974 -80678 128504
15540g5616H3652J05859b5190A3888b41549A08211c54181B80821a8316A4951P8069
$$ -75616 83652 189511 -25190 13888 -241549 108211 -354181 280821 -18316 14951 93020
15529I3020a1238G1332a58538j22050f1564k1089j00227E6167P3944c875j90543
$$ 93020 -11238 71332 -158538 -280588 -61564 -82653 -182880 56167 130111 -3875 -194418
15518a94418j524C4995M6101c0017k22632a22675I4870D6551J48594B9493f9838
$$ -194418 -195942 34995 81096 -30017 -252649 -122675 94870 46551 195145 29493 -69838
15506h1346k9905c1053G0707N4461a55639J1840f9732j25057g6080n2519o1290
$$ -81346 -111251 -31053 70707 125168 -155639 -143799 -69732 -194789 -76080 -128599 -189889
15495a89889l4886n2565A47052c17938L3719F655J40124i7470A40336l2165k4186
$$ -189889 -224775 -277340 147052 -317938 -284219 6655 146779 -97470 140336 108171 83985
15484H3985a34435k9632g9033G1443l4757K52896A3193h1609J3702G9255a2272
$$ 83985 -134435 -164067 -79033 71443 36686 289582 13193 -81609 -67907 79255 -12272
15472h2286B95902b68882j26518a64054h013j60395A70047q0557b01856A69815
$$ -82286 295902 -268882 -395400 -164054 -8013 -168408 170047 89490 -201856 169815
15461c09189d3067m162k12925B66892e1674n8984a3110A08125i0549j05956J6979
$$ -309189 -43067 -47229 -260154 266892 -51674 -110658 -13110 108125 -90549 -196505 -179526
15450a79526m8972D5407a61802A62455m0251k978h3520j81727a18530J6646l8423
$$ -179526 -228498 45407 -161802 162455 122204 119226 -83520 -265247 -118530 -101884 -140307
15439a40307g581C6496J84038k304l7242d5585I2609b17938A52765a6101o9082
$$ -140307 -7581 36496 220534 218230 180988 -45585 92609 -217938 152765 -16101 -85183
15428h5183j25890A52577a07927C05516f4855A21488E7410J18605o8229E2765
$$ -85183 -211073 152577 -107927 305516 -64855 121488 57410 176015 107786 52765
15417c17362B48228B9139R6920b3833A10804Q7865a13144H406c59872C0096J48788
$$ -317362 248228 29139 126059 -23833 110804 198669 -113144 8406 -359872 30096 178884
15406A78884b44551a16320L510j4820B10434G4586c3954B6986a24839A81469I0721
$$ 178884 -244551 -116320 -112810 -127630 210434 74586 -33954 26986 -124839 181469 90721
15394A16139D3355P9815b40406b6577j1571J6888k22740C9960O6511b19964D1221
$$ 116139 43355 123170 -240406 -26577 -38148 -21260 -244000 39960 106471 -219964 41221
15382b17718D981Q9315J54831a48839d7997n4268B42567b8844D6067J62164m6234
$$ -217718 4981 94296 249127 -148839 -47997 -102265 242567 -28844 46067 208231 161997
15371A61997j9587l3960K8010i8140b0333k28770F860Q6109b81887J21680j75685
$$ 161997 142410 108450 136460 -98140 -20333 -249103 6860 92969 -281887 -160207 -335892
15360c35892A36008E6476b19466a03025a14l53701D1159b73422C43539a54250
$$ -335892 136008 56476 -219466 -103025 -114 -353815 41159 -273422 343539 -154250
15349a4819j64842Q6182C67121i880A01875K15413A01146I819K97623b51101a16798
$$ -14819 -179661 -93479 367121 -9880 101875 317288 101146 9819 307442 -251101 -116798
15337B29676D6006K58692A37155n8442L5833a15561B01731K7486A7447K80640
$$ 229676 46006 304698 137155 78713 114546 -115561 201731 229217 17447 298087
15327B98087j02777e8026E00983A59061c01642J42444A23039b61528a10596a7204
$$ 298087 195310 -58026 500983 159061 -301642 -159198 123039 -261528 -110596 -17204
15316A38216d00857H8336K6214D9333c18074A77177C5972A472a25343o0308A55657
$$ 138216 -400857 88336 114550 49333 -318074 177177 35972 1472 -125343 -185651 155657
15304a2174B52532A09099J4230g2327a4415C8902J00774k9966k532A7835f0105
$$ -12174 252532 109099 123329 -72327 -14415 38902 139676 109710 107178 17835 -60105
15292A74494e2454r4664A58307e4879A01060B0877I358a4512D6097a43978l7664
$$ 174494 -52454 -147118 158307 -54879 101060 20877 9358 -14512 46097 -143978 -181642
15281a81642A70828c8762D2101e8405A778c3068A08331J25323J13922h8352A43181
$$ -181642 170828 -38762 42101 -58405 1778 -33068 108331 233654 347576 -88352 143181
15269A08785K12688c1992G4780N5529D0957M9502b2873A89060n312a54458a1504
$$ 108785 321473 -31992 74780 130309 40957 90459 -22873 189060 183748 -154458 -11504
15257A69861p5283N2937a96818A70160P4301L4044k6429o6100L21331K35170M39095
$$ 169861 94578 147515 -196818 170160 244461 278505 252076 185976 507307 742477 1181572
15246A181572M55598k06538K94898p87843B20366K42118e5751k35284c3034p2719
$$ 1181572 1637170 1430632 1725530 937687 220366 462484 -55751 -291035 -33034 -105753
15236a05753D408a96615C454J66038c0902B42693B8376K7596c4024A37203h1609
$$ -105753 4408 -196615 3454 169492 -30902 242693 28376 55972 -34024 137203 -81609
15224D1445b16457C22990g9941J7780C84740l4239c6819A08168R4955D111g6075
$$ 41445 -216457 322990 -79941 -62161 384740 350501 -36819 108168 203123 4111 -76075
15212c7653C0627b87781q9227A39094N3397J23154C3037P6817a40933b5046g886
$$ -37653 30627 -287781 -377008 139094 192491 315645 33037 109854 -140933 -25046 -7886
15200a67798b2813H1653C0703e3842C24760b6517C59550q5224n3473O6453j22059
$$ -167798 -22813 81653 30703 -53842 324760 -26517 359550 274326 220853 287306 165247
15189A65247f3432B46246j16765b07714F6665a28543a215j1664n0350A11387R7885
$$ 165247 -63432 246246 129481 -207714 66665 -128543 -1215 -12879 -63229 111387 209272
15178B09272d1869C58956F9466P0885K80138q9519A28593C2686A1209L07141i9214
$$ 209272 -41869 358956 69466 140351 420489 330970 128593 32686 11209 318350 -99214
15166D5168J06572Q9341k6315a59946I5301B669L5087a40511M5027N487H6481
$$ 45168 151740 241081 214766 -159946 95301 2669 37756 -140511 -95484 -89997 86481
15154e5153A92974a16472A2172J48480l5004a99013A57641J45333a40998D07355
$$ -55153 192974 -116472 12172 160652 125648 -199013 157641 302974 -140998 407355
15143b13989j23510C10418j34945k1461J57864G3076a35242A28649K85260A63920
$$ -213989 -337499 310418 175473 154012 311876 73076 -135242 128649 413909 163920
15132A03494a01077C28797A11278J18145B442K8399a24928B5740R0871a27802
$$ 103494 -101077 328797 111278 229423 2442 30841 -124928 25740 116611 -127802
15121a95621A75814b4662H212J75133B8870a6979O809k41759P9686A35103J01936
$$ -195621 175814 -24662 8212 183345 28870 -16979 -10170 -251929 -172243 135103 237039
15110B37039n9013o3242b09071F07412B32459M0118n4560a21147J3047j20634
$$ 237039 178026 114784 -209071 607412 232459 272577 218017 -121147 -108100 -228734
15100b28734A67264J76500c04774a0655A5517J5930q194J4648K47501j31885e7009
$$ -228734 167264 343764 -304774 -10655 15517 31447 23253 37901 285402 153517 -57009
15088A99768r1485l3917e8211B01565b0820D6660h3730B74292G5155b38172R2423
$$ 199768 108283 74366 -58211 201565 -20820 46660 -83730 274292 75155 -238172 -145749
15077a45749B04998K24032c0208B33993j8834G0188M99179A02385J7625O6946
$$ -145749 204998 429030 -30208 233993 215159 70188 569367 102385 120010 186956
15067A86956o355P5008M2431K1041k0646j5351j29152C3528b4188D97404j65460
$$ 186956 180601 255609 298040 319081 298435 283084 153932 33528 -24188 497404 331944
15056C31944e4558A73193K1451j3341j105A8604b5662A81652m6193P0312Q843
$$ 331944 -54558 173193 194644 181303 180198 18604 -25662 181652 135459 205771 214614
15045B14614q914J97719i9177B24716K32274j07503B98K46545G1687K03533p2765
$$ 214614 205700 403419 -99177 224716 456990 349487 298 246843 71687 275220 202455
15034B02455n942L996J9386C1118b62688a7552B01827J95434j53862q2442J74675
$$ 202455 196513 200509 219895 31118 -262688 -17552 201827 397261 243399 160957 335632
15023C35632F0274J19049e205r6135A82949N13519B18445b8118D24266k09909
$$ 335632 60274 179323 -5205 -101340 182949 696468 218445 -28118 424266 214357
15013B14357C1759K27902K3476F6405a0365B95833A24054L1714K17854j66776
$$ 214357 31759 259661 283137 66405 -10365 295833 124054 155768 373622 206846
15003B06846f1813B66956o7537l3273J63043l4320A18446N9338e8075A02637J36361
$$ 206846 -61813 266956 199419 166146 329189 294869 118446 177784 -58075 102637 238998
14992B38998K36998C4450K66427d2813D4136h4077H1407K51352A40895J50933
$$ 238998 475996 34450 300877 -42813 44136 -84077 81407 332759 140895 291828
14982B91828r015K18109A82393B8063e4064E72193a06447A51670P8423I2375Q6281
$$ 291828 282813 500922 182393 28063 -54064 572193 -106447 151670 230093 92375 178656
14971A78656b95961I4170K74280R6095B20244J45850b632D21999j33831G8773
$$ 178656 -295961 94170 368450 464545 220244 366094 -2632 421999 288168 78773
14960D26116A28404N3426K3307J81959A41943b53630I6635R8242f9551J7004A79878
$$ 426116 128404 181830 205137 387096 141943 -253630 96635 194877 -69551 -52547 179878
14948E24947G2880L4325J49763J6020J34349C1108L28337b59960A35864g4434
$$ 524947 72880 107205 256968 272988 407337 31108 359445 -259960 135864 -74434
14937E90723B90669J09032A47017K53123J53754H4231K13278N2137m1857K16330
$$ 590723 290669 399701 147017 400140 553894 84231 297509 349646 307789 524119
14927E24119k39369J83844j57612B3925K52455A793J48620Q9040n5779P2035K66839
$$ 524119 284750 468594 310982 23925 276380 1793 150413 239453 183674 255709 522548
14916E22548k35399p4531N8057D0292K8680J55890k9469M0837H5488L53235j38337
$$ 522548 287149 212618 270675 40292 68972 224862 195393 236230 85488 438723 300386
14905C00386J27659j98951I5711K38978j18769H4309K65282K0015J28921j69978
$$ 300386 428045 229094 95711 334689 215920 84309 349591 369606 498527 328549
14895C28549o6694J86130A12833E1842M65090b660B59164R3515A03127L41288
$$ 328549 261855 447985 112833 51842 516932 -2660 259164 352679 103127 444415
14885D44415J0886c5934F12199B85113R3645N7859A93609O1686A21259L44741
$$ 444415 455301 -35934 612199 285113 378758 436617 193609 255295 121259 466000
14875D66000l7292L1196A88012J17173q3956K58432k27820K00623r3134j11431
$$ 466000 428708 459904 188012 305185 221229 479661 251841 452464 359330 247899
14865B47899l5268N2231L60032j75032m3767K15153B57095K42332j62966J21549
$$ 247899 212631 264862 624894 449862 406095 621248 257095 499427 336461 458010
14855D58010J85599B66638K7252K89697k40696I8741L94487r632j16546J61478
$$ 458010 643609 266638 293890 583587 342891 98741 493228 483596 367050 528528
14845E28528J24997C26429C7011L56998K6593L35402l04486l1134K48805l06327
$$ 528528 653525 326429 37011 394009 420602 756004 451518 420384 669189 362862
14835C62862l7119Q9268o3538J9551K5460Q7689j03109k6595J58197q3986j22862
$$ 362862 325743 415011 351473 371024 396484 484173 381064 354469 512666 428680 305818
14824C05818K65753o0124K3757k8662A80454N8738M35542Q6885d9513D40479A96121
$$ 305818 571571 511447 535204 506542 180454 239192 674734 761619 -49513 440479 196121
14812D42646o1710L2391P5811q0307q3655L75466k30478L26694B84841J37215
$$ 442646 380936 413327 489138 408831 325176 700642 470164 796858 284841 422056
14802D22056L5548l6669K22041o9817K71591k69378L23556C35112k1135J28084
$$ 422056 457604 420935 642976 573159 844750 575372 898928 335112 313977 442061
14792D42061J20903j7419J2626A73562K42332K35511j99118J42250K70478l59810
$$ 442061 562964 545545 558171 173562 415894 651405 452287 594537 865015 505205
14782E05205j04805K17319r4870L0380m4582j33746K00683R9455J98875D28428
$$ 505205 400400 617719 522849 553229 508647 374901 575584 675039 873914 428428
14771G20142L8545k7083l10684M17151C13536L02571L4977k27823Q6746j43134
$$ 720142 758687 731604 420920 838071 313536 616107 651084 423261 510007 366873
14761C66873Q6851j90642K17751k8468J80395o8033k5233K54682N8659r9161k79148
$$ 366873 453724 263082 480833 452365 632760 564727 539494 794176 852835 753674 474526
14750D74526k3612J60720k42679L90340k51953K07970j03588j14966J08348k3318
$$ 474526 450914 611634 368955 759295 507342 715312 611724 496758 605106 581788
14740E81788j89952l1005K72413r947N2543Q6329j12154J389O29251n52310l12813
$$ 581788 391836 360831 633244 623297 675840 762169 650015 651404 1280655 728345 415532
14729D15532P72463m22224j02032l22002Q6621L22688n1645q4071k4755K13366
$$ 415532 1187995 765771 663739 341737 428358 751046 699401 615330 590575 803941
14719H03941O8259m9339J91363D08583L37552J05049k4055j19357J30538k47626
$$ 803941 872200 822861 1014224 408583 746135 851184 827129 707772 838310 590684
14709E90684J78133p1960L83709j80132r6495p0768K18490j94406J94229j44670
$$ 590684 768817 696857 1080566 900434 803939 733171 951661 757255 951484 806814
14699H06814J13121k22071Q9961j23706K33595O2341J56751m93809M27012j16604
$$ 806814 919935 697864 787825 664119 897714 960055 1116806 622997 1050009 933405
14689I33405m05809O54914l14611j0026R1609k66032K22042q4227M191J8277j0270
$$ 933405 527596 1182510 867899 857873 949482 683450 905492 821265 825456 843733 833463
14678H33463K13947k72837K51994o4252R4767J09583n9035J32124l37365R0876
$$ 833463 1047410 774573 1026567 962315 1057082 1166665 1107630 1239754 902389 993265
14668I93265K62373l49249l40982O15488n6164o6783j34433R4736J94356k57580
$$ 993265 1255638 906389 565407 1180895 1124731 1057948 923515 1018251 1212607 955027
14658I55027R0829l3191J86788E56292L54762L49763O8250m13551J68212L77480
$$ 955027 1045856 1012665 1199453 556292 911054 1260817 1329067 915516 1083728 1461208
14648A461208m65351J07544o7080m0154L4064M83281m0896n46050J44613J78581
$$ 1461208 995857 1103401 1036321 996167 1030231 1513512 1472616 926566 1071179 1249760
14638A249760J8293j87573K69059l31017J27287J28897J16432j51728K8339R1986
$$ 1249760 1268053 1080480 1349539 1018522 1145809 1274706 1391138 1239410 1267749 1359735
14628A359735k41071J26670J26577J20866j53328L27118l36291q1765K31992n5349
$$ 1359735 1118664 1245334 1371911 1492777 1339449 1666567 1330276 1248511 1480503 1425154
14618A425154J63971j01107j98948k7393j3993K80824j25774m6797R94J25806
$$ 1425154 1589125 1488018 1289070 1261677 1247684 1528508 1402734 1355937 1356931 1482737
14608A482737k36521L73408J95491l95084K03931K47480l14201L3075p4658J50368
$$ 1482737 1246216 1619624 1815115 1420031 1623962 1871442 1557241 1590316 1515658 1666026
14598A666026j6419k55461q5164J95835p0682L20902J62281o20514O45626j79857
$$ 1666026 1649607 1394146 1308982 1504817 1434135 1755037 1917318 1296804 1942430 1762573
14588A762573j92967K78684k64533N61227k82206J10172n3284K08970k12743K12139
$$ 1762573 1569606 1848290 1583757 2144984 1862778 1972950 1919666 2128636 1915893 2128032
14578B128032R6648m06080M17386l26533K10498J52744J30954j07816p4306k19098
$$ 2128032 2224680 1818600 2235986 1909453 2119951 2272695 2403649 2295833 2221527 2002429
14568B002429K14430J98701l844J52511r9468m4677J86091l3620J07786J1095
$$ 2002429 2216859 2415560 2411716 2564227 2464759 2420082 2606173 2572553 2680339 2691434
14558B691434P0428L93787k97937M84066j43610L27911P48020O31777N65591J660332
$$ 2691434 2761862 3155649 2857712 3341778 3198168 3526079 4274099 4905876 5471467 7131799
14548G131799M585146R173247J4317647J4611053k4712057A1207020m850812k951529
$$ 7131799 11716945 20890192 35207839 49818892 25106835 11207020 6356208 3404679
14540C404679j121266k45731k30109M62961m11787J63093l4760k84422L70680
$$ 3404679 2283413 2037682 1807573 2270534 1858747 2021840 1987080 1702658 2073338
14531B073338j15975K68251j22802k7715K22189j54905K79584j1920K20712j60658
$$ 2073338 1957363 2225614 2102812 2075097 2297286 2142381 2421965 2410045 2630757 2470099
14521B470099J059L85027n99741L79856p4998l6473P5916m41815N38376K46367
$$ 2470099 2471158 2856185 2256444 2636300 2561302 2524829 2600745 2158930 2697306 2943673
14511B943673m19354J55401Q4973r6027K54548M6640q5196L74621n35706K40451
$$ 2943673 2524319 2679720 2764693 2668666 2923214 2969854 2884658 3259279 2723573 2964024
14501B964024K97171k42960K68597k63180L52993k01083J973O9006N0260K75678
$$ 2964024 3261195 3018235 3286832 3023652 3376645 3175562 3177535 3246541 3296801 3572479
14491C572479J26235m3666J9415j36067R1834q4720N05396k85249q2362O2181
$$ 3572479 3698714 3655048 3674463 3538396 3630230 3545510 4050906 3765657 3683295 3745476
14481C745476j75464K18042L15394K28152k80763K44148j73615k55819L90208
$$ 3745476 3570012 3788054 4103448 4331600 4050837 4294985 4121370 3865551 4255759
14472D255759l07572K68841k5422K94966q512j1731N2637l4263J81304j15496
$$ 4255759 3948187 4217028 4191606 4486572 4478060 4466329 4518966 4484703 4666007 4550511
14462D550511J31183M18794j07302p25832R72079l91529J74082m20421O19977
$$ 4550511 4681694 5100488 4993186 4267354 5239433 4847904 5021986 4601565 5221542
14453E221542J58586j42572O5437N0824P3319J08807j5861J88655j711j65939
$$ 5221542 5380128 5237556 5302993 5353817 5427136 5535943 5520082 5708737 5707026 5541087
14443E541087J63952K9280L04322M28875j46896J537J22240M1977j05755K43625
$$ 5541087 5705039 5734319 6038641 6467516 6320620 6322157 6444397 6486374 6380619 6624244
14433F624244J02370J89171j68714M56708j52531J18411M1887p315K25571J23605
$$ 6624244 6726614 6915785 6747071 7203779 7051248 7169659 7211546 7204231 7429802 7553407
14423G553407O7623L46556j07128L41176k40667J60667K97203J84822O3255P0772
$$ 7553407 7621030 7967586 7860458 8201634 7960967 8121634 8418837 8603659 8666914 8737686
14413H737686q4220K32722k31031M13748L12227K96920o3250K15180Q4645O10933
$$ 8737686 8653466 8886188 8655157 9068905 9381132 9678052 9614802 9829982 9914627 10525560
14403A0525560k53465N5044M98M98430L0266M72712J58616J76658r0719L61950
$$ 10525560 10272095 10327139 10327637 10826067 10856333 11329045 11487661 11664319 11573600 11935550
14393A1935550N5562L68981K9318K76760j74331Q41867J62825L35930j72082O83897
$$ 11935550 11991112 12360093 12389411 12666171 12491840 13333707 13496532 13832462 13660380 14344277
14383A4344277K50813l6111M34495r380L63094M37870J59316K73204K26444O19579
$$ 14344277 14595090 14558979 14993474 14984094 15347188 15785058 15944374 16217578 16444022 17063601
14373A7063601J91999J18495N17528M78094L99786k2941O89818O96338O4540K90876
$$ 17063601 17255600 17374095 17891623 18369717 18769503 18746562 19436380 20132718 20197258 20488134
14363B0488134N71289K95380Q45044L84653L23779P74388P15239L96010K54315
$$ 20488134 21059423 21354803 22199847 22584500 22908279 23682667 24397906 24793916 25048231
14354B5048231N75842M94551P69812R30927M30852J087248P75538N69408J021615
$$ 25048231 25624073 26118624 26888436 27819363 28250215 29337463 30113001 30682409 31704024
14345C1704024J73178J291162J203739N16430R17744J426955N35219J059664J354046
$$ 31704024 31877202 33168364 34372103 34888533 35806277 37233232 37768451 38828115 40182161
14336D0182161J167181J126352R02939J581792J326736J718757J504728J115956
$$ 40182161 41349342 42475694 43378633 44960425 46287161 48005918 49510646 50626602
14328E0626602J924637J846957J469330K074582K158533J779387K347130K209874
$$ 50626602 52551239 54398196 55867526 57942108 60100641 61880028 64227158 66437032
14320F6437032K155388K864529K924804K361700K981952L038795L842187L133962
$$ 66437032 68592420 71456949 74381753 76743453 79725405 82764200 86606387 89740349
14312H9740349L685576M004714M165700M440843M193751M927209N171623N705970
$$ 89740349 93425925 97430639 101596339 106037182 110230933 115158142 120329765 126035735
14304A26035735N642623N955846O885851O956695P210095P882507Q564745Q492725
$$ 126035735 131678358 137634204 144520055 151476750 158686845 166569352 175134097 183626822
14296A83626822R223237R704752J0463466J0988738J1792020J1579389J2729027
$$ 183626822 192850059 202554811 213018277 224007015 235799035 247378424 260107451
14289B60107451J3230364J3816325J4296540J4903184J4948979J4986002J5412052
$$ 260107451 273337815 287154140 301450680 316353864 331302843 346288845 361700897
14282C61700897J5474314J5187800J4655465J4030446J2871917J1202425R956442
$$ 361700897 377175211 392363011 407018476 421048922 433920839 445123264 455079706
14275D55079706Q275607N840617L028194j450744l727604m351841o14246m138017
$$ 455079706 463355313 469195930 472224124 470773380 467045776 462693935 462079689 457941672
14267D57941672o534510r558872j0649448j2350422j3914728j4685241j5415991
$$ 457941672 451407162 441848290 431198842 418848420 404933692 390248451 374832460
14260C74832460j5711207j5656941j5958417j5401873j4947659j4424340j3795521
$$ 374832460 359121253 343464312 327505895 312104022 297156363 282732023 268936502
14253B68936502j2571965j2588726j2061571j1548797j0989189r959199r881720
$$ 268936502 256364537 243775811 231714240 220165443 209176254 199217055 189335335
14246A89335335r054045q657064p739872p622366p356519o469945o411167o446558
$$ 189335335 180281290 171624226 163884354 156261988 148905469 142435524 136024357 129577799
14238A29577799n195109n048278m782907n390357m537570l954541m133528k923819
$$ 129577799 124382690 119334412 114551505 109161148 104623578 100669037 96535509 93611690
14230I3611690l876414l724972l465712k611941l719095k565625k331133k575520
$$ 93611690 89735276 86010304 82544592 79932651 76213556 73647931 71316798 68741278
14222F8741278k574728j955327k188571k202543j758011j918335j521002j901066
$$ 68741278 66166550 64211223 62022652 59820109 58062098 56143763 54622761 52721695
14214E2721695j370756j231340j877449j895862j276318q70553j577744o46112
$$ 52721695 51350939 50119599 48242150 46346288 45069970 44199417 42621673 41975561
14206D1975561p52559j544474j519802p87741j136460r22738k36971j276891j061057
$$ 41975561 41223002 39678528 38158726 37370985 36234525 35311787 35074816 33797925 32736868
14197C2736868j115419m87544n75631r14407m05388j125609m13929j023502n33598
$$ 32736868 31621449 31133905 30558274 29643867 29238479 28112870 27698941 26675439 26141841
14188B6141841m10994q43607l29769p26824k40428o78535m02516n77426o96670
$$ 26141841 25730847 24887240 24557471 23830647 23590219 22911684 22509168 21931742 21235072
14179B1235072j75103m10165l31242k80914n81294m71685o8645o25566j24804
$$ 21235072 21059969 20649804 20318562 20037648 19456354 18984669 18916024 18290458 18165654
14170A8165654m52384o55902L26882q59498k17025K62218j253157J49308j90882
$$ 18165654 17713270 17057368 17384250 16524752 16307727 16569945 15316788 15466096 15275214
14161A5275214l72695m05937k97763j32467l29414k66660k58839J64298l36853
$$ 15275214 14902519 14496582 14198819 14066352 13736938 13470278 13211439 13375737 13038884
14152A3038884p8897q02258R2430j40579J16494p73678L67743n41278j31521J53509
$$ 13038884 12959987 12157729 12250159 12109580 12226074 11452396 11820139 11278861 11147340 11300849
14142A1300849n53059p0561K17354p41305J32337o6467j63487k72266J57070o03262
$$ 11300849 10747790 10677229 10894583 10153278 10285615 10219148 10055661 9783395 9940465 9337203
14132I337203J92348J4264m69605R390J48355k6127k54357l29620L1866l00694
$$ 9337203 9529551 9543815 9074210 9083600 9231955 9205828 8951471 8621851 8653717 8353023
14122H353023j9602K82529m49697k68895j81916O0058m23309K81826O929n54057
$$ 8353023 8333421 8615950 8166253 7897358 7715442 7775500 7352191 7634017 7640946 7086889
14112G086889J34492j38176Q6879j44093j19874j28594o0207K02036k82464l12865
$$ 7086889 7221381 7083205 7170084 7025991 6906117 6777523 6717316 6919352 6636888 6324023
14102F324023j8958n3023N7367k29309L7121J8837m3506q7442q9952j12033p4701
$$ 6324023 6305065 6252042 6309409 6080100 6117221 6136058 6092552 6005110 5915158 5803125 5728424
14091E728424p213m522k92590J86078m70378J56220M23364k36934l44360j93622
$$ 5728424 5721211 5716689 5424099 5610177 5139799 5296019 5719383 5482449 5138089 4944467
14081D944467L09583k3312k59214j7957K19800k32019k20057j40075K23311k45119
$$ 4944467 5254050 5230738 4971524 4953567 5173367 4941348 4721291 4581216 4804527 4559408
14071D559408J97974j59871o878p2728l00595K45453j76406k09672L25669k07128
$$ 4559408 4757382 4597511 4590633 4517905 4217310 4462763 4286357 4076685 4402354 4195226
14061D195226K81358j53153l7523j67647J0909j98857K32287j20531L6565j58998
$$ 4195226 4476584 4323431 4285908 4118261 4129170 3930313 4162600 4042069 4078634 3919636
14051C919636m20189J46243o0732K98441j70262k09769J25408k69211L66280m80513
$$ 3919636 3499447 3645690 3584958 3883399 3713137 3503368 3628776 3359565 3725845 3245332
14041C245332M41513K6859J33462n27964k04303J95035p5087r8770J35202M534
$$ 3245332 3686845 3713704 3847166 3319202 3114899 3309934 3234847 3136077 3271279 3275813
14031C275813l9968j90328Q2670J51836j26324j62307j56220J22793L8930k87336
$$ 3275813 3235845 3045517 3128187 3280023 3153699 2991392 2835172 2957965 2996895 2709559
14021B709559J85731J52340j34198K2879j02553L1765j67052j49987j28987P1027
$$ 2709559 2895290 3047630 2913432 2936311 2833758 2865523 2698471 2548484 2419497 2490524
14011B490524O1968k89510K4032K9213Q4370p8826J95988k52432O3913j73423
$$ 2490524 2552492 2262982 2287014 2316227 2400597 2321771 2517759 2265327 2329240 2155817
14001B155817L34977p1575j72246J22654m35881K32551j66128J42828K41588j30136
$$ 2155817 2490794 2419219 2246973 2369627 1933746 2166297 2000169 2142997 2384585 2254449
13991B254449J40074L75667J026474K484008P492816J4132823K0412152j7702670
$$ 2254449 2394523 2770190 3796664 6280672 13773488 27906311 48318463 30615793
13983C0615793A4489022n829438k363131j159518j058950k10247n62365k38671
$$ 30615793 14489022 8659584 6296453 5136935 4077985 3867738 3305373 3066702
13975C066702k40621M5943J19729K8430l22861j67242J11152J19341k08941k75169
$$ 3066702 2826081 2872024 2991753 3020183 2697322 2530080 2641232 2760573 2551632 2276463
13965B276463L59173l16238K25634m32126j79822O28778o59420L18693m74995
$$ 2276463 2635636 2319398 2545032 2112906 1933084 2561862 1902442 2221135 1746140
13956A746140L32158O9701L4125j65237r4454L46791j21985J12112l93216q0487
$$ 1746140 2078298 2147999 2182124 2016887 1922433 2269224 2147239 2259351 1866135 1785648
13946A785648P3755J2926O1664K27104j95312J11684m98278K77983K18014N7695
$$ 1785648 1859403 1872329 1933993 2161097 1965785 2077469 1579191 1857174 2075188 2132883
13936B132883k44827K06763J75808m71504O4532k84478P0784K02622j23149q8662
$$ 2132883 1888056 2094819 2270627 1799123 1863655 1579177 1649961 1852583 1729434 1640772
13926A640772r0548J41008k2393J50835M0045l72703L15583j6235O0163k11556
$$ 1640772 1550224 1691232 1668839 1819674 1859719 1487016 1802599 1786364 1846527 1634971
13916A634971k87171L18296j98690K5491J65028n75861J79833M26573k01248R4583
$$ 1634971 1347800 1666096 1467406 1492897 1657925 1082064 1261897 1688470 1487222 1581805
13906A581805j77526j5625J80875K27089j48741m12605J44124q8052J82079o8328
$$ 1581805 1404279 1388654 1569529 1796618 1647877 1235272 1379396 1291344 1473423 1405095
13896A405095J05912N7396j58458m1435j2931n7009K28446N3118l47256l52l6045
$$ 1405095 1511007 1568403 1409945 1368510 1355579 1298570 1527016 1580134 1232878 1232526 1196481
13885A196481J89831K1467K34187n18626L28623k00222J42113k9821j42685k141
$$ 1196481 1386312 1407779 1641966 1123340 1451963 1251741 1393854 1364033 1221348 1219207
13875A219207R8289J43719q3561k19770K67958j25997j49927K8714r2922J18374
$$ 1219207 1317496 1461215 1377654 1157884 1425842 1299845 1149918 1178632 1085710 1204084
13865A204084j62785K21063k5454k50656L46346m604P6226k95789K66509L4266
$$ 1204084 1041299 1262362 1236908 986252 1332598 1327994 1404220 1108431 1374940 1409206
13855A409206j01317l78553Q3475k67959M53344k45564L92991l04245R0078K64532
$$ 1409206 1307889 929336 1012811 744852 1198196 952632 1345623 1041378 1131456 1395988
13845A395988q9849l46197L95004R2073o23544K64502P6710M6262l78370P4077
$$ 1395988 1306139 959942 1354946 1447019 823475 1087977 1164687 1210949 832579 906656
13835I06656K74804K913J90918m68054P2221j13071O6408J6996K46668L71834
$$ 906656 1181460 1184373 1375291 907237 979458 866387 932795 949791 1196459 1568293
13825A568293n12672l58115r7770J68567K03917n7488K23266r1994M1913k38324
$$ 1568293 1055621 697506 599736 768303 972220 914732 1137998 1046004 1087917 849593
13815H49593q5335K97780l02498N93206n73456m0212p7553L59058j10359j77858
$$ 849593 764258 1062038 759540 1352746 779290 739078 661525 1020583 910224 732366
13805G32366J94770j48388j3358J89420j72219N1230J64546p4130K12778j95815
$$ 732366 927136 778748 765390 954810 782591 833821 998367 924237 1137015 941200
13795I41200q8604J3683j52428j1500J55515L4123j87992j47057K86018k41211
$$ 941200 852596 866279 713851 702351 857866 891989 703997 556940 842958 601747
13785F01747L80758r9541M4102k23608K9590q0598k88036N15575r1324j2635Q7107
$$ 601747 982505 882964 927066 703458 733048 652450 364414 879989 788665 776030 863137
13774H63137o6416J94155P6238l54031K7961P5970p3422q219o6314L06851k62031
$$ 863137 796721 990876 1067114 713083 741044 817014 743592 735373 669059 975910 713879
13763G13879k19528J35503J23453j40480J19839k9904N3866J75032j71744K61221
$$ 713879 494351 629854 753307 612827 732666 702762 756628 931660 759916 1021137
13753A021137m15541R2574J97509j88463K33071j72774l38389M71495k60986k48790
$$ 1021137 605596 698170 895679 707216 940287 767513 429124 900619 639633 390843
13743C90843M10476p7566J97094j33849p5110Q4669j41754Q5370J45059B98826
$$ 390843 801319 723753 920847 786998 711888 796557 654803 740173 885232 298826
13732G93090J01192j85180l51765M94400K3211j11040j61923n9512L2215k78488
$$ 793090 894282 709102 357337 851737 874948 763908 601985 542473 574688 296200
13722B96200K69538J28148n2239K89802D41518J59715R7608k25080M96464k52179
$$ 296200 565738 693886 641647 931449 441518 601233 698841 473761 970225 718046
13712G18046l8562k4647o6343k5327j05685j5892K08073K49593k88596k94427
$$ 718046 679484 654837 588494 563167 457482 441590 649663 899256 610660 316233
13702C16233K22241N596j13656K61282J05290k27996P6569k98045N90306l56334
$$ 316233 538474 544070 430414 691696 796986 568990 645559 347514 937820 581486
13692E81486L25658C51014J02935N8326k43454L42652j68943J08406j3847A83354
$$ 581486 907144 351014 453949 512275 268821 611473 442530 550936 537089 183354
13681D83347J22409J58094C45387j02466K07245j944L00610B52761K39356B43732
$$ 483347 605756 763850 345387 242921 450166 448222 748832 252761 492117 243732
13670F95742j66949N7679r3234k00233J45898R4057N5895J6324k09015n224o0265
$$ 695742 528793 586472 493238 293005 438903 532960 588855 605179 396164 390940 330675
13659C30675J67915l7056j85749K04540K47956B77964J44425K40867k87994A42513
$$ 330675 498590 461534 275785 480325 728281 277964 422389 663256 375262 142513
13648D17529p0004K39624p3120R2613P673l8215K7039j85924j6264m8495K64899
$$ 417529 347525 587149 514029 606642 614315 576100 603139 417215 400951 352456 617355
13637F17355k71993m5306K87462k07815K25699j14945M49091m13788r3063K56572
$$ 617355 345362 300056 587518 379703 605402 490457 939548 525760 432697 689269
13627F89269L8763j43104J10729j79978a3354C63698K37302r1705j06796L39282
$$ 689269 728032 584928 695657 515679 -13354 363698 601000 509295 402499 741781
13617G41781j41632B78943L56260l07161J77889p9774j65079M21554k75155A15477
$$ 741781 600149 278943 635203 328042 505931 426157 261078 682632 407477 115477
13606D73611J40384k86264K46311o3883j93663F8847K27098G4184L68075J06597
$$ 473611 613995 327731 574042 510159 316496 68847 295945 74184 442259 548856
13596E48856Q1525B43304j08782Q726M98099A91181J92310b2999A07434L90677
$$ 548856 630381 243304 134522 143248 641347 191181 383491 -22999 107434 498111
13586D98111J26175k41590O4332K06326B21423q1271J38322q2689J12277A16167
$$ 498111 624286 382696 447028 653354 221423 140152 278474 195785 308062 116167
13575E47576j77213j8770J96419B07997H5012L36248J45893j46458k431n9104
$$ 547576 370363 351593 548012 207997 85012 421260 567153 420695 418264 359160
13565C59160A26970O2513m3661M15148j66165N6417j41244J79243j15124j24038
$$ 359160 126970 189483 145822 560970 394805 451222 309978 489221 374097 250059
13555B50059K29169N0706C6860Q2475L21293j63689N53230A80741Q2146R4554
$$ 250059 479228 529934 36860 119335 440628 276939 830169 180741 262887 357441
13545C57441q3114O3919Q693J3661J57255M40783m41271j60986A76996J94062
$$ 357441 274327 338246 346939 360600 517855 958638 517367 356381 176996 371058
13535C71058p5088K05615j79494J42550A97363J35679q199j03477a33384A44374
$$ 371058 295970 501585 322091 464641 197363 333042 324843 221366 -133384 144374
13524D09461j79252K9004J62496J39717m6909j07583K29977k99707A36842N7079
$$ 409461 230209 259213 421709 561426 514517 406934 636911 337204 136842 193921
13514A93921b9805D53914J55344A97306J44385j12522j2788f6516C03686N7128
$$ 193921 -29805 453914 609258 197306 341691 229169 216381 -66516 303686 360814
13504C60814j39184J26591A62069o5439b0448q2905D15342q5149J20315j47697
$$ 360814 221630 348221 162069 96630 -20448 -103353 415342 330193 450508 302811
13494C02811J05653A10020M73318A51327J12333Q6648K77342j77628B07610K70195
$$ 302811 408464 110020 583338 151327 263660 350308 627650 450022 207610 477805
13484D77805A75708L5310J0172K52468p0267j16948p085K72137r8569j62917g0893
$$ 477805 175708 211018 221190 473658 403391 286443 279358 551495 452926 290009 -70893
13472H4812J15067J26129j46153M06958A79511J40893A53911K06615j19586n375
$$ 84812 199879 326008 179855 586813 179511 320404 153911 360526 240940 235565
13462B35565L33264j36801m3972b3877D89137j84079j19281F8896K44658j00399
$$ 235565 568829 432028 388056 -23877 489137 305058 185777 68896 313554 213155
13452B13155K33518B20983A04624J07110P3455B62N67956B28157J05806N8533
$$ 213155 446673 220983 104624 211734 285189 262 568218 228157 333963 392496
13442C92496j1919L6876D8658K11159J12138K086D4712M68354B44520J20935q5726
$$ 392496 380577 417453 48658 259817 371955 374041 44712 513066 244520 365455 279729
13431B79729C0426J69430F928a32730J8876j1610F06152B56514J53669k02947
$$ 279729 30426 199856 6928 -132730 -113854 -125464 606152 256514 410183 207236
13421B07236K3895R2223l9034a43780A57502J71409j13696R1293K22134G8466
$$ 207236 231131 323354 284320 -143780 157502 328911 215215 306508 528642 78466
13410A07573k1719J49191L35394j96372g0278E1468O00218A53693c9135B32424
$$ 107573 85854 235045 570439 374067 -70278 51468 651686 153693 -39135 232424
13399D59937H9791B7187J60424J8081M2934K31547A94498a06892A40553J50171
$$ 459937 89791 27187 187611 205692 248626 480173 194498 -106892 140553 290724
13389B90724H3858K93715J01586A2560K61295j08945j7729J22614A24589j9520
$$ 290724 83858 377573 479159 12560 273855 164910 147181 269795 124589 105069
13379A05069L0740J56760n6094n2248a6153B01089K97923q1122E1328J29312J90236
$$ 105069 135809 292569 236475 184227 -16153 201089 499012 417890 51328 180640 370876
13368C70876m2568A50016J76509r8515l4571J80271j53367J50234j49730a71893
$$ 370876 328308 150016 326525 228010 193439 373710 220343 370577 220847 -171893
13357A97455a70465B82924j25875L5258J60836q8501d9968A01074N98961B40105
$$ 197455 -170465 282924 157049 192307 353143 264642 -49968 101074 700035 240105
13346D60669l5801q4931J07377j07949K7181A51611E6415O07767l22418J27655
$$ 460669 424868 339937 447314 339365 366546 151611 56415 664182 341764 469419
13336D69419a2015D26379k2486A08605O6407K22085j79122j0138o1412J50086
$$ 469419 -12015 426379 403893 108605 175012 397097 217975 207837 146425 296511
13326B96511r8627K60732j56876K1960k9092K3455j3446E5496J70958Q1766n8949
$$ 296511 197884 458616 301740 323700 294608 318063 304617 55496 226454 308220 249271
13315B49271M7395N2872J00055B22740m9388l7573L42554F5575i339C37654j34498
$$ 249271 296666 349538 449593 222740 173352 135779 478333 65575 -9339 337654 203156
13304B03156K04342a7416D46259l7699A14531J33812O1305M5446k2281D7222a03704
$$ 203156 407498 -17416 446259 408560 114531 248343 309648 355094 332813 47222 -103704
13292A14479j3128J77543A30938K48839j83963l4427k3913a35492A68222B7801
$$ 114479 101351 278894 130938 379777 195814 161387 137474 -135492 168222 27801
13281a23202J9513L3177C6025P4053C4809J05073b3988C52762A49036J0955a48169
$$ -123202 -103689 -70512 36025 110078 34809 139882 -23988 352762 149036 159991 -148169
13269C43463j31718a67263A14037d509r9538A74536B1936J08168a0358B31693
$$ 343463 211745 -167263 114037 -4509 -104047 174536 21936 130104 -10358 231693
13258B17086a12819D5226e5172A67737p0339K45260j19825c26002B18879C3364
$$ 217086 -112819 45226 -55172 167737 97398 342658 222833 -326002 218879 33364
13247A61115J64453c37755e8765C04022a2138B93240J0757A40853A7886N6968
$$ 161115 325568 -337755 -58765 304022 -12138 293240 303997 140853 17886 74854
13237G4854J11417J5214f2455A85951B7906C23J38093a90130A20205D8596B2632
$$ 74854 186271 201485 -62455 185951 27906 323 138416 -190130 120205 48596 22632
13225A6948J75503G4368g7597A18189n3181b2888A96153M3478F9910a85203B67051
$$ 16948 192451 74368 -77597 118189 65008 -22888 196153 239631 69910 -185203 267051
13213A16908J95490n6659k8510a18114j8875G6159M2347P4533C3262a32900B21459
$$ 116908 312398 255739 227229 -118114 -136989 76159 118506 193039 33262 -132900 221459
13201A52397b0163A13830K55534A01028h4095D28057M30f7280A89905b0160D7837
$$ 152397 -20163 113830 369364 101028 -84095 428057 428487 -67280 189905 -20160 47837
13189B7107f6312C17070B196L22376C9309M29214d5565b0279C79772A56895K55712
$$ 27107 -66312 317070 2196 324572 39309 468523 -45565 -20279 379772 156895 412607
13178D12607a69509D54907a5024I4463b4496B986J84728o6970K08841l9772b0881
$$ 412607 -169509 454907 -15024 94463 -24496 2986 187714 120744 329585 289813 -20881
13166A28515A6497J0435b405G5653J19339G7080R4024D498L11264r722b14729
$$ 128515 16497 26932 -2405 75653 194992 77080 171104 4498 315762 306040 -214729
13154a4442D0674a72774G4778L82156A70829P7246f8080B44164j15798l6647K16500
$$ -14442 40674 -172774 74778 456934 170829 248075 -68080 244164 128366 91719 308219
13143C08219q18I4808N0078J81163H6513d9589j23969F7944g6189o7498B25762
$$ 308219 307401 94808 144886 326049 86513 -49589 -173558 67944 -76189 -143687 225762
13131A59594b57613A01088d7841B51246L3340A927M2501h1457n4170B90713K5583
$$ 159594 -257613 101088 -47841 251246 284586 1927 44428 -81457 -135627 290713 316296
13120C16296a3085A71435f3030H2247M7231C0341h7289C39g8456A16315M2422
$$ 316296 -13085 171435 -63030 82247 129478 30341 -87289 339 -78456 116315 158737
13109A58737l9381a18382A83529o8261L75198A40056B0978J52373m0167P209J79546
$$ 158737 119356 -118382 183529 115268 490466 140056 20978 173351 133184 140393 319939
13098C19939J71417B11411J05256K5792f8788E4641q492L129J39505a6204B67597
$$ 319939 491356 211411 316667 342459 -68788 54641 46149 49278 188783 -16204 267597
13086C92054b6899C69675b63383A26618K3857J30412a08253A43843L20082A46478
$$ 392054 -26899 369675 -263383 126618 150475 280887 -108253 143843 463925 146478
13075H6788K86213j55643J94090F5693O3034r024a04352A56668b03838j3015C25565
$$ 86788 373001 217358 411448 65693 128727 119703 -104352 156668 -203838 -216853 325565
13063A67139C9367J6995K67780E8088M85790A19808D8026J91155A03318O9482
$$ 167139 39367 56362 324142 58088 543878 119808 48026 239181 103318 172800
13053A72800G9008K4002K13840D8964Q3729B4523K20533c1947A46775L3452i1837
$$ 172800 79008 103010 316850 48964 132693 24523 245056 -31947 146775 180227 -91837
13041b05248C25618G1633J02557F7589J08629A2790K93038G8918R0870a78772
$$ -205248 325618 71633 174190 67589 176218 12790 305828 78918 169788 -178772
13030C88982D7803a9086A60069L337p3092M4204g892C20633e10252F4442B8036
$$ 388982 47803 -19086 160069 163406 90314 134518 -7892 320633 -510252 64442 28036
13018B97033j10293K1344a38350B25199a352k35682d1148E21748b7704j15954
$$ 297033 186740 208084 -138350 225199 -1352 -237034 -41148 521748 -27704 -143658
13008a43658e7849B06741r5941J15716P4374L6173A17077a0068A91101B0363N8768
$$ -143658 -57849 206741 110800 226516 300890 337063 117077 -10068 191101 20363 79131
12997G9131J59608C6361J61509E2336L48936d6084A11801L9417b5423C0445i92
$$ 79131 238739 36361 197870 52336 401272 -46084 111801 151218 -25423 30445 -992
12985A54604L4364a17209B22129c6389A34788i0926C42624a00045m5397o4204
$$ 154604 188968 -117209 222129 -36389 134788 -90926 342624 -100045 -145442 -209646
12975b09646J5158n5838a21045j87541A59157d1935H7760L3257A0354K49004k7654
$$ -209646 -194488 -250326 -121045 -308586 159157 -41935 87760 121017 10354 259358 231704
12964B31704q7064R4885J17123B9049L5481a9661q27j02709e4366l26325a19925
$$ 231704 144640 239525 356648 29049 64530 -19661 -20488 -123197 -54366 -380691 -119925
12952B55846A9217b00898g5444B58210e4147j35562j9710B88725A5248b02570
$$ 255846 19217 -200898 -75444 258210 -54147 -189709 -209419 288725 15248 -202570
12941d6839p8800C16756b360A71889h3576A51345k3191J93837C5176P3038J20060
$$ -46839 -125639 316756 -2360 171889 -83576 151345 128154 321991 35176 108214 228274
12930B28274C3935K81472d3958q3737C8879i6884E0313a55801A0180c49459B86
$$ 228274 33935 315407 -43958 -127695 38879 -96884 50313 -155801 10180 -349459 286
12918H3544K57884f2481A01317L99965G3040a38553A64998D0031J6552a67291
$$ 83544 341428 -62481 101317 501282 73040 -138553 164998 40031 56583 -167291
12907a52972A89534c03197J9084d3340j29451C32937E5452a19679A66243I359
$$ -152972 189534 -303197 -284113 -43340 -172791 332937 55452 -119679 166243 9359
12896B4654L12215b20977A55252L98854k13485n9606A02377C4491J4213K34639
$$ 24654 336869 -220977 155252 554106 340621 281015 102377 34491 48704 283343
12886B83343b47115J22571I7797g5994L1291B92556a84271A99080h904A04174
$$ 283343 -247115 -124544 97797 -75994 -44703 292556 -184271 199080 -8904 104174
12875a00320j10312M42A86849d45462i3168A45879K15577o9409b9504A84445c32358
$$ -100320 -210632 -210190 186849 -445462 -93168 145879 361456 292047 -29504 184445 -332358
12863a61164P9982l67057F2379A8018f6747A85565a34174c3306B35259I7647d8791
$$ -161164 -81182 -448239 62379 18018 -66747 185565 -134174 -33306 235259 97647 -48791
12851A11522J58922h2760a6109I6201j3056a89122L8066D55456b0030A80708l9297
$$ 111522 270444 -82760 -16109 96201 83145 -189122 -151056 455456 -20030 180708 141411
12840A41411b23709C30087G5976A657c72508A92696b8865A21584K2844O0500i2938
$$ 141411 -223709 330087 75976 1657 -372508 192696 -28865 121584 144428 204928 -92938
12828C80320a75825G5656b65502h9064M0437D2250K0951K4643b4927B74665E0770
$$ 380320 -175825 75656 -265502 -89064 -48627 42250 63201 87844 -24927 274665 50770
12816d04410B37487c8008H6572G085J8953d5401A3515a67528A59895D0754a68298
$$ -404410 237487 -38008 86572 7085 26038 -45401 13515 -167528 159895 40754 -168298
12804B7568J04738J02755a53633A01172b3787B04608a83419C43895f3285j26742
$$ 27568 132306 235061 -153633 101172 -23787 204608 -183419 343895 -63285 -190027
12794a90027b4123j58285E4639j2418P857Q2815O8851R5641D7154O3907C282c0873
$$ -190027 -24123 -182408 54639 42221 50078 132893 201744 297385 47154 111061 3282 -30873
12781I0294a12345j9559I4696J11756a08441K019A01208g2421G9302a1503l5090
$$ 90294 -112345 -131904 94696 206452 -108441 -106422 101208 -72421 79302 -11503 -46593
12770d6593D0823a86966j1104j0109A36062b53860A26029k865h0842A29656M2700
$$ -46593 40823 -186966 -198070 -208179 136062 -253860 126029 123164 -80842 129656 172356
12759A72356f4687B2138Q6026f9613A42619b8909B9367l715h1321D63103G8421
$$ 172356 -64687 22138 108164 -69613 142619 -28909 29367 25652 -81321 463103 78421
12747b02780D9599Q7586C0045b11511B83982D7491M5356L1857E9365L66302b41221
$$ -202780 49599 137185 30045 -211511 283982 47491 92847 124704 59365 425667 -241221
12735C78574j02607a10747C80806i4860B69004M6768B2159M79212a00487A1551
$$ 378574 275967 -110747 380806 -94860 269004 315772 22159 501371 -100487 11551
12724B13641r5641a10956k35756O6737A47018a24752A62127f7672A98883a01556
$$ 213641 118000 -110956 -346712 -279975 147018 -124752 162127 -67672 198883 -101556
12713A72416a02025g562l6382C30083A65008k7678N6032A615a0379A80571J70145
$$ 172416 -102025 -7562 -43944 330083 165008 137330 193362 1615 -10379 180571 350716
12702C50716j7061j07439a55196B19912G5069k1583K06579D7341J06117A3646
$$ 350716 333655 226216 -155196 219912 75069 53486 260065 47341 153458 13646
12691H2907C9767P9159a36837I832d0271A02110d5276j33121P2198B19414M1458
$$ 82907 39767 118926 -136837 9832 -40271 102110 -45276 -178397 -106199 219414 260872
12680B60872c1918C07856m1905C9009H71a01632A39308J47768J45934A48318a8396
$$ 260872 -31918 307856 265951 39009 871 -101632 139308 287076 433010 148318 -18396
12668C80983A38831C5501K46706b16257h8408d2260I970B134b5210F8827C2798
$$ 380983 138831 35501 282207 -216257 -88408 -42260 9970 2134 -25210 68827 32798
12656a81636a3663A93688J6348j00905i7988C37784j17508C3351L71979A64757
$$ -181636 -13663 193688 210036 109131 -97988 337784 220276 33351 405330 164757
12645I8752D3367c345A02981m5240K0055J52084d0681H6315O4856k8850Q0498
$$ 98752 43367 -3345 102981 57741 77796 229880 -40681 86315 151171 122321 202819
12634B02819a65083H411L76701a77663A13997J87732B6553J41643k1490n8296
$$ 202819 -165083 8411 385112 -177663 113997 301729 26553 168196 146706 88410
12624H8410J55552A0739O5956J70861M3378Q8646j7578q6097m1758G1523J70529
$$ 88410 243962 10739 76695 247556 290934 379580 362002 275905 234147 71523 242052
12613B42052a71279p4509D36129A3847b53672I7577a52887B14551J4232C9448
$$ 242052 -171279 -245788 436129 13847 -253672 97577 -152887 214551 228783 39448
12602b6850A86008q300a81982O9873A72025G7697L4929j5424a11180b9584i42
$$ -26850 186008 177708 -181982 -112109 172025 77697 112626 97202 -111180 -29584 -942
12590G1399J44386b1987B24867A5930K10254b21632D6841a27938g614I7352a14799
$$ 71399 215785 -21987 224867 15930 226184 -221632 46841 -127938 -7614 97352 -114799
12578C04320b38749Q6339B23754H1264m0342a17937j19L7422B02481e9413B06431
$$ 304320 -238749 -152410 223754 81264 40922 -117937 -118056 -80634 202481 -59413 206431
12566a96518E0369a43464D26320j90224e7897C26399J1097j3768a09532j35064
$$ -196518 50369 -143464 426320 236096 -57897 326399 337496 323728 -109532 -244596
12556b44596A49957i0109A46553d9257h591I4595M2983J00814D8499b34766C4132
$$ -244596 149957 -90109 146553 -49257 -8591 94595 137578 238392 48499 -234766 34132
12544C98587j20436r4218J96107F087a12339E4211l480J89911b37552Q6026K138
$$ 398587 278151 183933 380040 6087 -112339 54211 50731 240642 -237552 -151526 -149388
12533a49388g347A45798a29724n388K315B14550Q3920p7196H1754K0736K19181
$$ -149388 -7347 145798 -129724 -135112 -132797 214550 298470 221274 81754 102490 321671
12522C21671j35162b34869P3338n7068e6262A68293E1050M1319L04444b79221
$$ 321671 186509 -234869 -161531 -218599 -56262 168293 51050 92369 396813 -279221
12511C11825j36306a90358A9217Q9209J8326J18001b10337g7305l14082A11784
$$ 311825 175519 -190358 19217 108426 126752 244753 -210337 -77305 -391387 111784
12500h2152j37575B3712R0963b41175A68332e9126A45428J20137D1599g0142G9281
$$ -82152 -219727 23712 114675 -241175 168332 -59126 145428 265565 41599 -70142 79281
12488C39950j19615A06772J18235N553A004J30344f1523o9451j05836B7047n252
$$ 339950 220335 106772 225007 230560 1004 131348 -61523 -130974 -236810 27047 21795
12477B1795a34404q2023c3108g368k5746A25686b03504r617A75694H978J98882
$$ 21795 -134404 -216427 -33108 -7368 -33114 125686 -203504 -213121 175694 8978 207860
12466B07860c0031A55116i9434A03219J66405d34865J99419I8504l4128P6221
$$ 207860 -30031 155116 -99434 103219 269624 -434865 -235446 98504 64376 140597
12456A40597e58890a2332q398F3321a28400L8082L6492n7256A7743J49810e4326
$$ 140597 -558890 -12332 -20730 63321 -128400 -90318 -53826 -111082 17743 167553 -54326
12444B1018J62417f5897o5828b4317j33390c7246j34144A60413f6011p6833B00161
$$ 21018 183435 -65897 -131725 -24317 -157707 -37246 -171390 160413 -66011 -142844 200161
12432d11444B25557D8630b75590a04350B54734a27405A06287J1487C8165a12162
$$ -411444 225557 48630 -275590 -104350 254734 -127405 106287 117774 38165 -112162
12421c408j31821H2521a1791i19B053b52610C7552J10111n633i0274A30603b07458
$$ -3408 -135229 82521 -11791 -919 2053 -252610 37552 147663 142030 -90274 130603 -207458
12408C88373d557q0581A49253K1409D3980J11582b8245B85682G8987B4899L35537
$$ 388373 -4557 -85138 149253 170662 43980 155562 -28245 285682 78987 24899 360436
12397C60436E1127a44773E3851J01684i2911G4217B0785N7609a3499A6244b88530
$$ 360436 51127 -144773 53851 155535 -92911 74217 20785 78394 -13499 16244 -288530
12385I9208J4621C8351b7887j92886A14900D7414j2845O4529D1507r960a5394
$$ 99208 113829 38351 -27887 -220773 114900 47414 34569 99098 41507 31547 -15394
12373G2804j1367O8254a28039R727B63223a51952A35484o7509K2112g4517D3543
$$ 72804 61437 129691 -128039 -118312 263223 -151952 135484 67975 90087 -74517 43543
12361e15389A58085L004A3420Q450L270f9501C5566P2941d01903B07K31752a30061
$$ -515389 158085 161089 13420 21870 25140 -69501 35566 108507 -401903 207 231959 -130061
12348H8467J40309g5950E1900K9433P4106a19247k2479C248J80162M3985a13295
$$ 88467 228776 -75950 51900 81333 155439 -119247 -141726 3248 183410 227395 -113295
12336b52267C01609a69655f0139E676K03426a27300A9642a37647C8974K34081
$$ -252267 301609 -169655 -60139 5676 209102 -127300 19642 -137647 38974 273055
12326B73055A34576a01294k3457M9063p6605B93032r2472b21100E6539b3559I8369
$$ 273055 134576 -101294 -124751 -75688 -152293 293032 200560 -221100 56539 -23559 98369
12314C7898J663j4031g0494K4212j16178A37417i6773A82636b55228j31321a28694
$$ 37898 39561 25530 -70494 -46282 -162460 137417 -96773 182636 -255228 -386549 -128694
12302a56563E7535D931J76306g4868l26940A24464k994J51647j30113b48318B31702
$$ -156563 57535 4931 181237 -74868 -401808 124464 121470 273117 143004 -248318 231702
12290a67812B04643J26398i1506A15611b41288d8701d251B12021Q6096G3368h7867
$$ -167812 204643 331041 -91506 115611 -241288 -48701 -4251 212021 298117 73368 -87867
12278B37355E0312j4875M51788B27774j3488J17453F5607d2336l302B50812G7515
$$ 237355 50312 35437 487225 227774 214286 331739 65607 -42336 -45638 250812 77515
12266D407R7128J61037H8180C0336M3965J19303J98428b4066B27265Q3431b28523
$$ 4407 101535 262572 88180 30336 74301 193604 392032 -24066 227265 310696 -228523
12254a09368A02077d3746i335F3770K55941A50868M4840b1388A54233c17832E84287
$$ -109368 102077 -43746 -9335 63770 319711 150868 195708 -21388 154233 -317832 584287
12242a61791A11227q804N8410n1539a23668A26716R3715j07746D0495J84390c6765
$$ -161791 111227 102423 160833 109294 -123668 126716 220431 112685 40495 224885 -36765
12230C17769c6083A78096a0353B03411K67014B26093p3238f598B67060j4744J88416
$$ 317769 -36083 178096 -10353 203411 470425 226093 152855 -6598 267060 252316 440732
12219D40732A14682J75716f249B48053g0840C00185k3487j2108h8084B34234A12428
$$ 440732 114682 290398 -6249 248053 -70840 300185 276698 264590 -88084 234234 112428
12207B75282A34470J28955C9599Q2173J09701E3020j9041R1839J50156j26391
$$ 275282 134470 263425 39599 121772 231473 53020 33979 125818 275974 149583
12197A49583o7536a6154B29384J11717p0962F2070K03972K46056A59285M11233
$$ 149583 82047 -16154 229384 341101 270139 62070 266042 512098 159285 570518
12187E70518k31887b3772q8658F9271B4108b17990I0319K24654g7737l0110A17454
$$ 570518 338631 -23772 -112430 69271 24108 -217990 90319 314973 -77737 -107847 117454
12175i9487B58405a21831C06043h6382r4753C22728B4247J63369G8188K99448
$$ -99487 258405 -121831 306043 -86382 -181135 322728 24247 187616 78188 377636
12165C77636R7205A1348Q6251J32180o1165j5860G476f4091E1070J91471G4427
$$ 377636 474841 11348 97599 229779 168614 152754 7476 -64091 51070 242541 74427
12153g196D1806a27950A43062E7779L23112a5401j2445G8934K10313A29452j7796
$$ -7196 41806 -127950 143062 57779 380891 -15401 -27846 78934 289247 129452 111656
12142A11656J05858L9972K20594A16169m0589J37395b54359F1344a11275j3552
$$ 111656 217514 257486 478080 116169 75580 212975 -254359 61344 -111275 -124827
12132a24827l8460b5023l6045J4057j04546F5849c9854e918H5173e868C6895a18090
$$ -124827 -163287 -25023 -61068 -47011 -151557 65849 -39854 -5918 85173 -5868 36895 -118090
12119B72264r8061N1661a4148A04547B5854c2517A54328b6304F490a1267B06380
$$ 272264 174203 225864 -14148 104547 25854 -32517 154328 -26304 6490 -11267 206380
12107b2888A11453L0287K442C7322J25331K1467P603n5367A3715L67891A80224
$$ -22888 111453 141740 144182 37322 162653 184120 191723 136356 13715 381606 180224
12095a4164j74430A26272m0023a31195G8061K44504n8996J2283b7383O071E9318
$$ -14164 -188594 126272 86249 -131195 78061 322565 263569 275852 -27383 -21312 59318
12083F1194Q8948k2339c3389p7529A24859K42718j37189L15964L07561J010339
$$ 61194 150142 127803 -33389 -110918 124859 367577 230388 546352 853913 1864252
12073A864252q72712C52704j56921H5583c2277a5570I8809L3820J49196A09305
$$ 1864252 991540 352704 195783 85583 -32277 -15570 98809 132629 281825 109305
12062C09783b84968D714g2016a517A85802g5124E4165a51563L9577A08528a14684
$$ 309783 -284968 4714 -72016 -1517 185802 -75124 54165 -151563 -111986 108528 -114684
12050I4908h4913a0413r034G149b364G6255e32484d5419k80045l2583H7724g135
$$ 94908 -84913 -10413 -19447 7149 -2364 76255 -532484 -45419 -325464 -358047 87724 -7135
12037i5032A68900G3883b02510Q6185j25022n9143J49697D30156i1837J5055A29067
$$ -95032 168900 73883 -202510 -116325 -241347 -300490 -150793 430156 -91837 -76782 129067
12025D26363a30342B70367g3518D8525b9543o5803M1667j70139A31666i8624o3805
$$ 426363 -130342 270367 -73518 48525 -29543 -95346 -53679 -223818 131666 -98624 -162429
12014a62429J0218R660r9688B45763a6301j9042D3604O3117R6410J88297a84939
$$ -162429 -152211 -142551 -242239 245763 -16301 -35343 43604 106721 203131 391428 -184939
12002e995k71420N5774A8640a04267B33262a50543N474M8052Q273j34640g7598
$$ -5995 -277415 -221641 18640 -104267 233262 -150543 -145069 -97017 -88744 -223384 -77598
11990G5224O6664i1695A7392b64045i966C2156a19879B25368h9841B02173L4708
$$ 75224 141888 -91695 17392 -264045 -9966 32156 -119879 225368 -89841 202173 236881
11979B36881g0272q08p0624F122R3081J56851H2476c26n4059j44419E5144J75035
$$ 236881 -70272 -71080 -141704 6122 99203 256054 82476 -326 -54385 -198804 55144 230179
11967B30179j6875G5047b51795H1456a56313A00441K19207A2627M3738a9145C13258
$$ 230179 213304 75047 -251795 81456 -156313 100441 319648 12627 56365 -19145 313258
11955B6990P8705b46951e885k24923A11727J9050b39939P9355e2886H0882l9961
$$ 26990 105695 -246951 -5885 -230808 111727 130777 -239939 -160584 -52886 80882 40921
11944D0921J64086f7417j59519i9866H5787b37486A5905L6399h1489D7442a8451
$$ 40921 205007 -67417 -226936 -99866 85787 -237486 15905 52304 -81489 47442 -18451
11932c5940A28000b39000F9665K11311h376q8666l06265i7244j23031E1935K8987
$$ -35940 128000 -239000 69665 280976 -8376 -97042 -403307 -97244 -220275 51935 80922
11921H0922M9491d295p0356D5807c3165j78472R8654C23396a23144D11682a59172
$$ 80922 130413 -4295 -74651 45807 -33165 -211637 -112983 323396 -123144 411682 -159172
11909C4083a6664j25071f477C29627a40402k8276N5858k54148J65348P1679e0992
$$ 34083 -16664 -141735 -6477 329627 -140402 -168678 -112820 -366968 -201620 -129941 -50992
11897e68895a22437C091a28001c0341H2210q607c966A68689j5053R4499a28953
$$ -568895 -122437 3091 -128001 -30341 82210 73603 -3966 168689 153636 248135 -128953
11885a07099A67012q0210C5906a88827O8496G1035a18723B6833i2229e996q5683
$$ -107099 167012 86802 35906 -188827 -120331 71035 -118723 26833 -92229 -5996 -91679
11874i1679j34581G1171a84136d7364j8731C1688a6014j61998L5732C13324r2500
$$ -91679 -226260 71171 -184136 -47364 -66095 31688 -16014 -178012 -142280 313324 220824
11863B20824A06560b1020M168A70712a11265N0484q4870O5564E430a24774A14126
$$ 220824 106560 -21020 -16852 170712 -111265 -60781 -145651 -80087 5430 -124774 114126
11851b34580i8101M6698j69943f6918A68609K00496a17325A52881b02628B9891
$$ -234580 -98101 -51403 -221346 -66918 168609 369105 -117325 152881 -202628 29891
11840a4523A40641o8904J27932k3413B1269b35576j1318i5797k71750G5459j1686
$$ -14523 140641 71737 199669 176256 21269 -235576 -246894 -95797 -367547 75459 63773
11829F3773a80868D71090c133A39727J14771p4024D7879J16602O8172C6491J57178
$$ 63773 -180868 471090 -3133 139727 254498 180474 47879 164481 232653 36491 193669
11818A93669q0659a9476k99371I6066m3278d2000A15640h586r7319j20754A48267
$$ 193669 113010 -19476 -318847 96066 52788 -42000 115640 -8586 -105905 -226659 148267
11806a06902B60542e1985l7244A08531J20767I2755l9436c20041c0912A39140
$$ -106902 260542 -51985 -89229 108531 229298 92755 53319 -320041 -30912 139140
11795e8412E2657b12377d4833n4575A46756o9017a37597e5289j71613R6624k77231
$$ -58412 52657 -212377 -44833 -99408 146756 77739 -137597 -55289 -226902 -130278 -407509
11784d07509C8694l292a84451P5349M6422j25548N5109i62B75719i1992c7972
$$ -407509 38694 35402 -184451 -109102 -62680 -188228 -133119 -962 275719 -91992 -37972
11772f2560A64370J03371d91585A12463e1797J7943E5405J09302a51043A64746
$$ -62560 164370 267741 -491585 112463 -51797 -33854 55405 164707 -151043 164746
11761a27039A24644N9312A8991b21213g426j31348e9839j96754m587C31896l4028
$$ -127039 124644 183956 18991 -221213 -7426 -138774 -59839 -256593 -261180 331896 297868
11750B97868d01658A94535J7891b83667n849e2449j2264B1805a81262A56046e1056
$$ 297868 -401658 194535 212426 -283667 -289516 -52449 -64713 21805 -181262 156046 -51056
11738D1101R6542a18243K3094A37466b86767A86128m0636i9328A19844e5378k61662
$$ 41101 137643 -118243 -95149 137466 -286767 186128 145492 -99328 119844 -55378 -317040
11727c17040A81018a2094m7781A86602a21759B35613g9753B26593c4832k3337
$$ -317040 181018 -12094 -59875 186602 -121759 235613 -79753 226593 -34832 -58169
11717e8169A42705e38650e380l21515A55958J96580A08396d2900B60411d8559
$$ -58169 142705 -538650 -5380 -326895 155958 352538 108396 -42900 260411 -48559
11706a65485B00542p9349n461d3363l48449D3721J81951b27753I5785a08661A62851
$$ -165485 200542 121193 115732 -43363 -391812 43721 225672 -227753 95785 -108661 162851
11694F1993B034O9684K84786H2733L5178D6031d6061K1708A66599a63163K1893
$$ 61993 2034 71718 356504 82733 117911 46031 -46061 -24353 166599 -163163 -141270
11683a41270N7595L2490A33050K33163a38257c1584B83300K81377A93491n6643
$$ -141270 -83675 -51185 133050 366213 -138257 -31584 283300 564677 193491 136848
11673A36848f9869A40420A4702e2830C7336b20646A17882k2153A9391b7679A33027
$$ 136848 -69869 140420 14702 -52830 37336 -220646 117882 95729 19391 -27679 133027
11661B02197a58853F1251J24131b37539D5337O5024a50987K9613B46563J8595
$$ 202197 -158853 61251 185382 -237539 45337 110361 -150987 -121374 246563 265158
11651B65158o1752q0225J6924L31398d6426r207o7170J2510r8711C537J32197
$$ 265158 203406 123181 140105 471503 -46426 -55633 -122803 -110293 -209004 3537 135734
11640A35734g5363B54927A12219b83698a39919f57C17427j10611h438A58088A7444
$$ 135734 -75363 254927 112219 -283698 -139919 -657 317427 206816 -8438 158088 17444
11628f671k02779C16540p0541a96272A98913i5634B07720I3011K32156f3308j34059
$$ -6671 -209450 316540 245999 -196272 198913 -95634 207720 93011 325167 -63308 -197367
11617a97367C02900K88586D7505K4901a52862A02054J89748c3258m8162o077G3086
$$ -197367 302900 591486 47505 72406 -152862 102054 291802 -33258 -81420 -87497 73086
11605A74578J22216p6036a04491A25871j6999b6056j3407E821P7708J11429C1811
$$ 174578 296794 220758 -104491 125871 108872 -26056 -39463 5821 83529 194958 31811
11593d3229j5215I1468n441K33919m3099E9270b9789B32611h6781j02745C34695
$$ -43229 -58444 91468 86027 319946 276847 59270 -29789 232611 -86781 -189526 334695
11581a6213r5591C325e8534B14604E668c9847B6289J61148b64254C34895b34761
$$ -16213 -111804 3325 -58534 214604 5668 -39847 26289 187437 -264254 334895 -234761
11569E96K55459d3556B11717D3123J84964L8294J19913E571e7455j76714d1819
$$ 596 256055 -43556 211717 43123 228087 266381 386294 5571 -57455 -234169 -41819
11557B50036K34651f1464E02079h98D30257k08413d6706q6821A23421m6888K07784
$$ 250036 484687 -61464 502079 -898 430257 221844 -46706 -133527 123421 76533 284317
11546B84317D6814L0509a03397L8693A29088k1451a97124B48694a35844C03405
$$ 284317 46814 77323 -103397 -64704 129088 107637 -197124 248694 -135844 303405
11535A16361K50013j38322C5071g1835B19209b00934A60619a95181i0098j24608
$$ 116361 366374 228052 35071 -71835 219209 -200934 160619 -195181 -90098 -214706
11525b14706B31452A05174m3395a97124h6285A67207L8366C2042L11208A29205
$$ -214706 231452 105174 61779 -197124 -86285 167207 205573 32042 343250 129205
11514B41070O4414C9385N5592j5140C3291K85422A9290K02145E3324N1876f4945
$$ 241070 305484 39385 94977 79837 33291 318713 19290 221435 53324 105200 -64945
11502A47689p259a46841D7932R8630J04553L20265g3659I1930K94582c5598H545
$$ 147689 140430 -146841 47932 146562 251115 571380 -73659 91930 386512 -35598 8545
11490A86254a10982r2199h5525G0830J78715A9240O0670a3921k59559C90815j69247
$$ 186254 -110982 -203181 -85525 70830 249545 19240 79910 -13921 -273480 390815 221568
11479B21568J10250n7458n0618a35590C82372D2344P5881N804L5170a8835D18171
$$ 221568 331818 274360 223742 -135590 382372 42344 118225 124029 159199 -18835 418171
11467B78330D577L01457l3569j23839a4190C88763j07087a5125j9679G913L73212
$$ 278330 4577 306034 272465 148626 -14190 388763 281676 -15125 -34804 7913 381125
11456C81125L8657A00396a9567j64481e806G3607c5687j18259A05096k7027K8427
$$ 381125 419782 100396 -19567 -184048 -5806 73607 -35687 -153946 105096 78069 106496
11445A06496Q1275J45333a57290N5178B12739k7016d5595D58042b3055p3779k29103
$$ 106496 187771 333104 -157290 -102112 212739 185723 -45595 458042 -23055 -96834 -325937
11434c25937B78654b6375A97178C1576c9943a19E2406j6250K2251B9148a33098
$$ -325937 278654 -26375 197178 31576 -39943 -119 52406 36156 58407 29148 -133098
11422A71894G8986L9563b42733A11419e9167r631j57680M3962N3448I2845b42513
$$ 171894 78986 118549 -242733 111419 -59167 -68798 -226478 -182516 -129068 92845 -242513
11410B61572C9373A3057L8718K43939g9332K2809n3847C97808A91549k9860c8759
$$ 261572 39373 13057 51775 295714 -79332 -56523 -110370 397808 191549 161689 -38759
11398B03454J78261a19583B39817a19430A27021b7767j53288A15581L3311n9332
$$ 203454 381715 -119583 239817 -119430 127021 -27767 -181055 115581 148892 89560
11388H9560a10998A16887B3609N4402J16549A879d1926D4802a65935J1277H9422
$$ 89560 -110998 116887 23609 78011 194560 1879 -41926 44802 -165935 -154658 89422
11376h8671A10238d9398E19018A19751a79008P8057A60340o966D7462a58872A3905
$$ -88671 110238 -49398 519018 119751 -179008 -100951 160340 153374 47462 -158872 13905
11364B0225J2788P6802B8377J6545c87308a68154i206A37365a95497A30622J1635
$$ 20225 33013 109815 28377 44922 -387308 -168154 -9206 137365 -195497 130622 142257
11353A42257C8266R212K09335H2212a3293a688j61674A52086k9063g7305A49326
$$ 142257 38266 47478 256813 82212 -13293 -1688 -163362 152086 123023 -77305 149326
11341D3673R8855a24801D931b35622D1955K28321d5770I9893b37259a15118A0286
$$ 43673 142528 -124801 4931 -235622 41955 270276 -45770 99893 -237259 -115118 10286
11329B58751b26233A60033a40667n6764g237D2998a5651r8552D8872J90764j4638
$$ 258751 -226233 160033 -140667 -197431 -7237 42998 -15651 -114203 48872 239636 224998
11318B24998a17162c8058j95551E3718d50912a68543A58314k5316C785Q7605J9971
$$ 224998 -117162 -38058 -233609 53718 -450912 -168543 158314 132998 3785 91390 111361
11307A11361J72772j16033i0548k504A1049c8566j45539b1948o7590C5334L9429
$$ 111361 284133 168100 -90548 -93052 11049 -38566 -184105 -21948 -89538 35334 74763
11296G4763a01569C2850j5309g8926C3670M14611d9211B29888b5090j92964B26046
$$ 74763 -101569 32850 17541 -78926 33670 448281 -49211 229888 -25090 -218054 226046
11284g4385B07736G8964F570a78346M3739J0305q0615o4441d6519l93642C79759
$$ -74385 207736 78964 6570 -178346 -134607 -124302 -204917 -269358 -46519 -440161 379759
11272h6192C329J1656N8050A7855J59749n2500O6030G0196J69857K0594h4468
$$ -86192 3329 14985 73035 17855 177604 125104 191134 70196 240053 260647 -84468
11260c23820J33664A97871G6160J8286c9407A18568d5103O783k7277C33186j05897
$$ -323820 -190156 197871 76160 94446 -39407 118568 -45103 -38320 -65597 333186 227289
11249B27289a15898D9239e8376b3666F6682d8659j12464A71526l4232B482P9130
$$ 227289 -115898 49239 -58376 -23666 66682 -48659 -161123 171526 137294 2482 81612
11238H1612P8908B7584L08277A64127J31200e1752A61865c83070J63638L8415
$$ 81612 160520 27584 335861 164127 295327 -51752 161865 -383070 -219432 -181017
11228a81017r4164j30859c2039E9355B0718b5676A95265f6703G3344a44821m0364
$$ -181017 -275181 -406040 -32039 59355 20718 -25676 195265 -66703 73344 -144821 -185185
11217a85185h0851j77490B05689E5271c1865D8784J35267c9811k64889i5746j26136
$$ -185185 -80851 -258341 205689 55271 -31865 48784 184051 -39811 -304700 -95746 -221882
11206b21882H1369a41078H1184b0276A32894f2096j15582k7552h0480A64379a26644
$$ -221882 81369 -141078 81184 -20276 132894 -62096 -177678 -205230 -80480 164379 -126644
11194A36992o4229O5261E0189J244c19343a00916J6646l93399A73202a45631G7516
$$ 136992 72763 138024 50189 51433 -319343 -100916 -84270 -477669 173202 -145631 77516
11182b70729i868j95159H4323J62927l5394G6622g7316B55354a37744A9703b12088
$$ -270729 -9868 -205027 84323 247250 211856 76622 -77316 255354 -137744 19703 -212088
11170c34116A7627o233a09648o9725G0000a27105K9281A9997O6376a96872H4914
$$ -334116 17627 11394 -109648 -179373 70000 -127105 -97824 19997 86373 -196872 84914
11158a01447k9021B03504a38019q9270B47519A22179e52085A79822e5092K2742
$$ -101447 -130468 203504 -138019 -227289 247519 122179 -552085 179822 -55092 -32350
11148c2350A16021k9600b35532h0533C24509A02924a37985q9186A02551b8839
$$ -32350 116021 86421 -235532 -80533 324509 102924 -137985 -227171 102551 -28839
11137h3309b3943B3177L5011c9146C8002a48956C36693J93572A0674a27031E4887
$$ -83309 -23943 23177 58188 -39146 38002 -148956 336693 530265 10674 -127031 54887
11125E8677B7922K7591g3657j85618A2853J19126a92993D0153K74366a2559D266
$$ 58677 27922 55513 -73657 -259275 12853 131979 -192993 40153 314519 -12559 4266
11113b8661C8366m940K91048B2166J85515K29740j08505d246A55767a02987B24212
$$ -28661 38366 33426 324474 22166 207681 437421 328916 -4246 155767 -102987 224212
11101A32989J28103f3343B15427N0698a75085A71556O3289D1237Q2810N7035D6393
$$ 132989 261092 -63343 215427 266125 -175085 171556 234845 41237 124047 181082 46393
11089D00710l7278j34482J15580j55370K6880J24034a07171A66297J02251M86152
$$ 400710 363432 228950 344530 189160 216040 340074 -107171 166297 268548 754700
11079G54700C14078n7937R4619H0862m692l0956M65173a02965E53483A72313m1653
$$ 754700 314078 256141 350760 80862 76170 45214 510387 -102965 553483 172313 130660
11068A30660K07101n6359J04132J47122L045q7884J40198j68983o7715J87817
$$ 130660 337761 281402 385534 532656 535701 447817 588015 419032 351317 539134
11058E39134J09947j16454q3122J27277l7490P650j19098j16770J43686K48751
$$ 539134 649081 532627 449505 576782 539292 546942 427844 311074 454760 703511
11048G03511j82331O2017K8452P0372P4112Q9600k55581J4938R5753J65684B07300
$$ 703511 521180 583197 611649 682021 756133 845733 590152 605090 700843 866527 207300
11036G63002j63332J19773k74263P0366M92569C79411K54412k2258j07001K10510
$$ 763002 599670 719443 445180 515546 1008115 379411 633823 611565 504564 715074
11026G15074j26633M6791j96940L76462k04768j65612J05082p8318L92549l25180
$$ 715074 588441 635232 438292 814754 609986 444374 549456 471138 863687 538507
11016E38507A41666N13033N0285j86552K45366k05385L06995k38421O5623j42899
$$ 538507 141666 654699 704984 518432 763798 558413 865408 626987 692610 549711
11006E49711Q5853K86939C87633J92182j13630L12858j80966k5742L42677l27380
$$ 549711 635564 922503 387633 579815 466185 779043 598077 572335 915012 587632
10996E87632A01390K93064K15764M04611D93603K50351k4999k25753L92300J39986
$$ 587632 101390 394454 610218 1014829 493603 743954 718955 493202 885502 1025488
10986A025488l11299M08174l38288M00214l62632K94135J24536K80967k55395
$$ 1025488 714189 1122363 784075 1184289 821657 1115792 1240328 1521295 1265900
10977A265900L69466j28978P36031k86284N11461L43836l48972L46330J16846
$$ 1265900 1635366 1506388 2242419 1956135 2467596 2811432 2462460 2808790 2925636
10968B925636n87665J97591l85946l31421r8510L03170J7777N7879j54947q2007
$$ 2925636 2337971 2535562 2149616 1818195 1719685 2022855 2040632 2098511 1943564 1861557
10958A861557K31794j55050O6632p9431l35374M3935k35454k04714j94856j29120
$$ 1861557 2093351 1938301 2004933 1925502 1590128 1634063 1398609 1193895 999039 869919
10948H69919C41250L64190B21070L09916j5186A19728L29738j09646J95439J5549
$$ 869919 341250 705440 221070 530986 515800 119728 449466 339820 535259 550808
10938E50808B22023N6815q4593C3182J3346L36330j03010f6663A13850K5327E9715
$$ 550808 222023 278838 194245 33182 46528 382858 279848 -66663 113850 139177 59715
10926B4819J81788p1046a44821A87722p0489m7535g5946K4722B1711J06021J51704
$$ 24819 206607 135561 -144821 187722 117233 69698 -75946 -51224 21711 127732 279436
10915B79436r4852a75814K5941A08293C2078J26385i4960D26569a01879M4829
$$ 279436 184584 -175814 -149873 108293 32078 158463 -94960 426569 -101879 -57050
10905e7050C79834A8619a56595B63122j28095n7709J45847E9306K57769c01996
$$ -57050 379834 18619 -156595 263122 135027 77318 223165 59306 317075 -301996
10894D8424b19909A78665q0016k4972J477a10887E4896b39724D2587m891d3136
$$ 48424 -219909 178665 98649 73677 75154 -110887 54896 -239724 42587 37696 -43136
10882b9812B69805I8528B5871K43748D1604i3921B65962a42407B8172D202a34232
$$ -29812 269805 98528 25871 269619 41604 -93921 265962 -142407 28172 4202 -134232
10870A59678E9479L3050c72260g7709L8065A89061L3381g8946A06791P3430b01608
$$ 159678 59479 92529 -372260 -77709 -39644 189061 222442 -78946 106791 180221 -201608
10858a4802D2638J1578J4290J9082d24181A4432L3847a21303m6705e3885B6311
$$ -14802 42638 54216 68506 87588 -424181 14432 48279 -121303 -168008 -53885 26311
10846b09873A52832E1616d00256A59834i5363c3505B22475c9817A40359K1925
$$ -209873 152832 51616 -400256 159834 -95363 -33505 222475 -39817 140359 162284
10836A62284k3433f4863A33184h7194A57655i9345p1980A73807a35330B59253
$$ 162284 138851 -64863 133184 -87194 157655 -99345 -171325 173807 -135330 259253
10825H9367J34116a41366A25105b38374A28561a33403k48308Q3831a0983B56109
$$ 89367 223483 -141366 125105 -238374 128561 -133403 -381711 -297880 -10983 256109
10814A52267a39102c4187l66027A39598a57437B46902C4939a48697B2537K13154
$$ 152267 -139102 -34187 -400214 139598 -157437 246902 34939 -148697 22537 235691
10804B35691f8920B7050K51627e8634M034A59228a98371Q6875G5575A4288M6307
$$ 235691 -68920 27050 278677 -58634 -54600 159228 -198371 -111496 75575 14288 60595
10793F0595a7506n4900C0292c6670m3815j41368b6773D31147G6786a15678G3022
$$ 60595 -17506 -72406 30292 -36670 -80485 -221853 -26773 431147 76786 -115678 73022
10781E2871c4434B0261P811L415j2026a3950j64983b0836r0252d2762D5404J51756
$$ 52871 -34434 20261 28072 31487 19461 -13950 -178933 -20836 -111088 -42762 45404 197160
10769A97160L8905A02397K86365H1312c4999B38751B8038c24499K9791d5294E9189
$$ 197160 236065 102397 388762 81312 -34999 238751 28038 -324499 -294708 -45294 59189
10757b08466j07088a20509C8874b45349A06942a55056g37l9739j81828B05435
$$ -208466 -315554 -120509 38874 -245349 106942 -155056 -737 -40476 -222304 205435
10746A10023d3630k8394c2214j6096J5096k07054B03579g0350j63635N6172I14
$$ 110023 -43630 -72024 -32214 -48310 -33214 -240268 203579 -70350 -233985 -177813 914
10734h1211c4082A71136K66340j30991k2978a40114e2332N017k96457I094i2928
$$ -81211 -34082 171136 437476 306485 283507 -140114 -52332 -47315 -343772 9094 -92928
10722f4210B18209D1664j6159a7194k9478l8878H2640B5725J15453b2451B45136
$$ -64210 218209 41664 25505 -17194 -46672 -85550 82640 25725 141178 -22451 245136
10710a12965J0935l042B26738a37305N3982L6667B70117O5603a04732k10465f4239
$$ -112965 -102030 -105072 226738 -137305 -83323 -46656 270117 335720 -104732 -315197 -64239
10698f8858l6242C57830b57933H7945a02316k06788B69546c66841g2217j07724
$$ -68858 -105100 357830 -257933 87945 -102316 -309104 269546 -366841 -72217 -179941
10688a79941l58432h4727A2190J47647G6638f1882j28304F4666L0986K60445g5972
$$ -179941 -538373 -84727 12190 159837 76638 -61882 -190186 64666 95652 356097 -75972
10676a32413H4667K74360j65595e7785j40839F0625a15115a6007l02534d8958
$$ -132413 84667 359027 193432 -57785 -198624 60625 -115115 -16007 -318541 -48958
10665a51425l4627l3770K603l4689h384o9228j19943k9042a9387j36122a9814
$$ -151425 -186052 -219822 -217219 -251908 -8384 -77612 -197555 -226597 -19387 -155509 -19814
10653f2709A17604C8897a14800B10068c0043A30531a71214f7438A93790i96A8752
$$ -62709 117604 38897 -114800 210068 -30043 130531 -171214 -67438 193790 -996 18752
10641a1512l92245J51739I8821R8121d4249j51340A99777c34355G1927h0193D7702
$$ -11512 -403757 -252018 98821 196942 -44249 -195589 199777 -334355 71927 -80193 47702
10629A7648c03197f3354L283G1027b01094C86920A08357d2839B25969i8853B83329
$$ 17648 -303197 -63354 -60071 71027 -201094 386920 108357 -42839 225969 -98853 283329
10617d2737A06791D1749a56342N4015j64096c2455j91757R8581j02106L6411b9460
$$ -42737 106791 41749 -156342 -102327 -266423 -32455 -224212 -125631 -227737 -191326 -29460
10605b66299J5820h8938r0105a2666l14106J62659M3119A65757d7261E4823J81516
$$ -266299 -250479 -88938 -179043 -12666 -326772 -164113 -120994 165757 -47261 54823 236339
10594B36339C9324a124A26273a85608e4727q9932B23461A8876P6917K9601B171
$$ 236339 39324 -1124 126273 -185608 -54727 -144659 223461 18876 95793 125394 2171
10582a99339B31525a16210p5524R4950A73492J82274d51158A60220g271k06631
$$ -199339 231525 -116210 -191734 -96784 173492 355766 -451158 160220 -7271 -213902
10572b13902O5790e2167A12666k6586l2219j479N7465b60514B03701h4575G4151
$$ -213902 -148112 -52167 112666 86080 53861 52382 109847 -260514 203701 -84575 74151
10560B35021c976r1338k24800k5380F3825B3321B216J32723c20689n6918G0040
$$ 235021 -3976 -95314 -320114 -345494 63825 23321 2216 134939 -320689 -377607 70040
10548G2400b38516B6803c08695i736B34522a99465d7742k03062A04562c1463k119
$$ 72400 -238516 26803 -308695 -9736 234522 -199465 -47742 -250804 104562 -31463 -33582
10537c3582F6348j8697N6776J17864q0677a58990c4755j07592A11410E1772g5332
$$ -33582 66348 47651 104427 222291 141614 -158990 -34755 -142347 111410 51772 -75332
10525a55492H4884e9345k45341J03884h8039K0421k25346b5167l2279C510K82687
$$ -155492 84884 -59345 -304686 -200802 -88039 -67618 -292964 -25167 -57446 3510 286197
10514B86197f317k1148j33443A86681F3260c3251j68384n7329C11994a10818k81708
$$ 286197 -6317 -27465 -160908 186681 63260 -33251 -201635 -258964 311994 -110818 -392526
10503c92526B63311h7017o7656A4170J32502a07158I4631J08227C1634a15776
$$ -392526 263311 -87017 -154673 14170 146672 -107158 94631 202858 31634 -115776
10492F3966c01256J34615A55270g7519A60652B3254b20222A58057c7032B02068
$$ 63966 -301256 -166641 155270 -77519 160652 23254 -220222 158057 -37032 202068
10481b75055C30810R1643j45544N2065A40296Q8314K53648A02388c91758c5968
$$ -275055 330810 422453 276909 328974 140296 228610 482258 102388 -391758 -35968
10470a07532C2951a96067e8218E2032R3564b3428j10153e2725l09922r2124i4532
$$ -107532 32951 -196067 -58218 52032 145596 -23428 -133581 -52725 -362647 -454771 -94532
10458a99956a8144A67129a34772f0908D1749e0789j04013A38689b82301E2351
$$ -199956 -18144 167129 -134772 -60908 41749 -50789 -154802 138689 -282301 52351
10447G2705a5799j12638d8689o1291j77788a24615j1184C60919B3408N62019B32660
$$ 72705 -15799 -128437 -48689 -109980 -287768 -124615 -135799 360919 23408 585427 232660
10435g493C71190A28976C9043P0127J06917O5158a15843D92933A79641N7897a97436
$$ -7493 371190 128976 39043 109170 216087 281245 -115843 492933 179641 237538 -197436
10423F125f5614I3884a91171I4432J01062d7134K1780B11539j7886J7784a07758
$$ 6125 -65614 93884 -191171 94432 195494 -47134 -25354 211539 193653 211437 -107758
10411A44787F6814i8680C2888f5132b2168j48435C77302K0121D8052J14439n6591
$$ 144787 66814 -98680 32888 -65132 -22168 -170603 377302 397423 48052 162491 105900
10400A05900c2772k60698A8634K8384H583J12214k0062C0544h4646K172A57706
$$ 105900 -32772 -293470 18634 47018 8583 120797 100735 30544 -84646 -82474 157706
10388g4077E388K18883a35955b5300D1643L1887C6710f7807n5815B56298g0059
$$ -74077 5388 224271 -135955 -25300 41643 73530 36710 -67807 -123622 256298 -70059
10376A95289q9475L6727R755n0245d3269A68525K36040A80547l4635M62558n3082
$$ 195289 105814 142541 152296 102051 -43269 168525 404565 180547 145912 608470 555388
10365E55388k70153l9738o6328M74550A46698a7884B01953A9793J20790M4525
$$ 555388 285235 245497 179169 653719 146698 -17884 201953 19793 140583 185108
10355A85108f1402i036C21227J13937o1943K03679r7219J39487B79898J49483
$$ 185108 -61402 -9036 321227 435164 373221 576900 479681 619168 279898 429381
10345D29381j11248j12826N4958k086J65956M0442D0027b26697b5345N09B25848
$$ 429381 318133 205307 260265 258179 424135 464577 40027 -226697 -25345 -24836 225848
10333A77830l5282j0892J41986A8639M32246F345i7673A07526A959Q9532K12464
$$ 177830 142548 131656 273642 18639 450885 6345 -97673 107526 1959 91491 303955
10322C03955J15968r426N4089j87801H8384L73997l2327n5449A22460J3563c4382
$$ 303955 419923 410497 464586 276785 88384 462381 430054 374605 122460 136023 -34382
10310B01594G3170K30158P7127m7013j17252j2377c17429B5276L39979a68073
$$ 201594 73170 303328 380455 333442 216190 203813 -317429 25276 365255 -168073
10299A97613D3526A3236P2051b57657I1054a40803C30543a88313j6208i5898m0709
$$ 197613 43526 13236 85287 -257657 91054 -140803 330543 -188313 -204521 -95898 -136607
10288a36607F8777d749E3324N8957b05120l2548E5699a37260I4640a36423l9441
$$ -136607 68777 -4749 53324 112281 -205120 -237668 55699 -137260 94640 -136423 -175864
10277a75864q898L5062I3767k0831a62210A022O2175L10323A20570d4931C541
$$ -175864 -184762 -149700 93767 72936 -162210 1022 63197 373520 120570 -44931 3541
10265b56316B52616a25044I5088O3964O0792J3769J32404K35129k12206K43114
$$ -256316 252616 -125044 95088 159052 219844 233613 366017 601146 388940 632054
10255F32054B29576J7683b2231B24233j04448M0253Q6153b57524a17065A21782
$$ 632054 229576 247259 -22231 224233 119785 160038 246191 -257524 -117065 121782
10244B10162b93758B12047c4339H9131a03850j23684L5602g1463n0150F8595i3597
$$ 210162 -293758 212047 -34339 89131 -103850 -227534 -191932 -71463 -121613 68595 -93597
10232e3612p6005I1317a12239H9057a08547f086A48034a3299j48014L2935A6394
$$ -53612 -129617 91317 -112239 89057 -108547 -6086 148034 -13299 -161313 -128378 16394
10220G2968J91906q81e7953k02433a11961c3573p524j91773A04348g8061E2868
$$ 72968 264874 263993 -57953 -260386 -111961 -33573 -41097 -232870 104348 -78061 52868
10208b42394h6775L7026l64901B9906c11368c8456k3591k7782A07627i1238c6466
$$ -242394 -86775 -49749 -414650 29906 -311368 -38456 -62047 -89829 107627 -91238 -36466
10196a80281G3555R8496b24460e9109k22224l704i2857l4051A16752a51963j47929
$$ -180281 73555 172051 -224460 -59109 -281333 -285037 -92857 -126908 116752 -151963 -299892
10185b99892a32697A23537a17925k1607A93408J13735F4968d7475b3037j92062
$$ -299892 -132697 123537 -117925 -139532 193408 307143 64968 -47475 -23037 -215099
10175b15099m3200j0645A17047a57973B30857a65659j3342j05696N9926b0540
$$ -215099 -258299 -268944 117047 -157973 230857 -165659 -179001 -284697 -224771 -20540
10164H2527Q5123a65158j14432P7544j82850N4708A40465b66536E7019a06174
$$ 82527 167650 -165158 -279590 -202046 -384896 -330188 140465 -266536 57019 -106174
10153i1951k74718j19841i4920k13109J39869j37238i6363m74165A33721c1830
$$ -91951 -366669 -486510 -94920 -308029 -168160 -305398 -96363 -570528 133721 -31830
10142b59152A62152n95a67918I1074c37848A1608g6012B90957C5058a43566p1111
$$ -259152 162152 161557 -167918 91074 -337848 11608 -76012 290957 35058 -143566 -214677
10131b14677f8898n0877C7747a66013g7102H4953J45275J62102D528c47533G2630
$$ -214677 -68898 -119775 37747 -166013 -77102 84953 230228 392330 4528 -347533 72630
10119b5829E2533D602L7947J95313a9009D3893k1813M8684K15103c58916k1323
$$ -25829 52533 4602 42549 237862 -19009 43893 22080 70764 285867 -358916 -380239
10108c80239f9954k99632R3482a06770o8826A54444J65867b1819o910A01598C3337
$$ -380239 -69954 -369586 -276104 -106770 -175596 154444 320311 -21819 -28729 101598 33337
10096A9925e7311m7458j20985c7820j57288P5096j23604I1489f8665B588a17136
$$ 19925 -57311 -104769 -225754 -37820 -195108 -120012 -243616 91489 -68665 2588 -117136
10084B55801N3587A22035h482j9035A76719a46767E4448K979J68841b14269f2740
$$ 255801 309388 122035 -8482 -27517 176719 -146767 54448 57427 226268 -214269 -62740
10072A46099f9714A16357E936Q1158b5533k3972A5590K06223r1699a39639B61837
$$ 146099 -69714 116357 5936 87094 -25533 -49505 15590 221813 130114 -139639 261837
10060b29411n1379A75808H3830c4771A16768l8397J38870i4673J5491j61284p2533
$$ -229411 -280790 175808 83830 -34771 116768 78371 217241 -94673 -79182 -240466 -312999
10049c12999J23504o0731c2652n6306j65523I6558a72716B23611b2544j82446
$$ -312999 -189495 -250226 -32652 -88958 -254481 96558 -172716 223611 -22544 -204990
10039b04990R2501n9604k066L8409N3619b689F2252c23240D4797O0399d6162k91445
$$ -204990 -112489 -172093 -174159 -135750 -82131 -2689 62252 -323240 44797 105196 -46162 -337607
10027c37607J57887f9633L3352B06839p1523f4915A37431b52434a25662b0944
$$ -337607 -179720 -69633 -36281 206839 135316 -64915 137431 -252434 -125662 -20944
10016b93987A1017c14497a6947r6702E2717a3453j87252A61338b46088i8164l4517
$$ -293987 11017 -314497 -16947 -113649 52717 -13453 -200705 161338 -246088 -98164 -132681
10005a32681A20534e3366l61035A50575e4286A68756f4642C56622e38625d0087
$$ -132681 120534 -53366 -414401 150575 -54286 168756 -64642 356622 -538625 -40087
9994b06035A23405a33175e9765M909J6056B17787a45611P577N8661F9475b78228
$$ -206035 123405 -133175 -59765 -54856 -38800 217787 -145611 -138034 -79373 69475 -278228
9982B8003a80951l8602L4703c3015j33190L2221g618A06309b69392A22707a48976
$$ 28003 -180951 -219553 -184850 -33015 -166205 -133984 -7618 106309 -269392 122707 -148976
9970a00746F9978g2897k50073A35404a49505e3913D9741a3385j76356b4380Q210
$$ -100746 69978 -72897 -322970 135404 -149505 -53913 49741 -13385 -189741 -24380 -16170
9959a6170j24014B48952P8963a40077j44305H1884b33180A37176a42822C21469
$$ -16170 -140184 248952 327915 -140077 -284382 81884 -233180 137176 -142822 321469
9948A199g0074j1825A05399m0168a14697J5004l2023m9167j07713a23542j78722
$$ 1199 -70074 -81899 105399 65231 -114697 -99693 -131716 -180883 -288596 -123542 -302264
9937c02264a29467b2204A05057g967A19540e7496f28k41250g7268F3843L37937
$$ -302264 -129467 -22204 105057 -7967 119540 -57496 -628 -241878 -77268 63843 401780
9926D01780A7528N1287f0770G4702a24231K6371b7923m16128H280b14787a03032
$$ 401780 17528 68815 -60770 74702 -124231 -97860 -27923 -444051 8280 -214787 -103032
9914c12509J0241B51209b1488q6134k9094A00220k1879b13131k62956i8734A21612
$$ -312509 -302268 251209 -21488 -107622 -136716 100220 78341 -213131 -476087 -98734 121612
9902a3866k9146A7064c21026P8984L5242P0835l6384L7065a8374j29226J6283
$$ -13866 -43012 17064 -321026 -242042 -206800 -135965 -172349 -135284 -18374 -147600 -131317
9891a31317B7704d26296e3744p2431A31153a50442B11217O3839E8730H285a58601
$$ -131317 27704 -426296 -53744 -126175 131153 -150442 211217 275056 58730 8285 -158601
9879d2494b0573q1194j02817J6751O8766A34345K46029i5974q7465C8101b8819
$$ -42494 -20573 -101767 -204584 -187833 -119067 134345 380374 -95974 -183439 38101 -28819
9867A99668n7416d0353A43262a13199j31959J18091j39661a18667q2693E9207
$$ 199668 142252 -40353 143262 -113199 -245158 -127067 -266728 -118667 -201360 59207
9856a87751A66105b8166m5189a2020B4521c62327A35600c1006j80020O3707o0059
$$ -187751 166105 -28166 -73355 -12020 24521 -362327 135600 -31006 -211026 -147319 -207378
9845b07378A5612a57253d3999k3433J868I0502a72719o9447M770H4217g0595B40820
$$ -207378 15612 -157253 -43999 -67432 -65564 90502 -172719 -242166 -237396 84217 -70595 240820
9832A59451a27570p0014C5775a83385Q939j04961b9634j67525R5418H8957b26737
$$ 159451 -127570 -197584 35775 -183385 -174446 -279407 -29634 -197159 -101741 88957 -226737
9820a43454j21871O4964H0013a63530j48144J40715c3220n2717A32073b24063
$$ -143454 -265325 -200361 80013 -163530 -311674 -170959 -33220 -85937 132073 -224063
9809b20437C14164A11334a74510f6688K6576m74A39086D0335b94370a03836C57
$$ -220437 314164 111334 -174510 -66688 -40112 -40586 139086 40335 -294370 -103836 357
9797f2821r5631k32603G5640K4252e2921J5411B5911b19009d0947q21A61659a45344
$$ -62821 -158452 -391055 75640 99892 -52921 -37510 25911 -219009 -40947 -41768 161659 -145344
9784A5434a12185J5196B8924b61567q7939C4708Q3304b79561A33809c66919J50543
$$ 15434 -112185 -96989 28924 -261567 -349506 34708 118012 -279561 133809 -366919 -216376
9773b16376k74439M4741i4572E813b84305A55588a00881B3364f6816A51073a49426
$$ -216376 -490815 -446074 -94572 5813 -284305 155588 -100881 23364 -66816 151073 -149426
9761h0067l2928k4396n6952F2018P8989a51432d8890k32l12644A4301b37884f6483
$$ -80067 -112995 -137391 -194343 62018 141007 -151432 -48890 -49122 -361766 14301 -237884 -66483
9748a18350A8718f4664j39258B50675a38235e4096j71761h40k06994j58829a41436
$$ -118350 18718 -64664 -203922 250675 -138235 -54096 -225857 -840 -207834 -366663 -141436
9736A26028e6006K1358C14303a08679j40148E2066A2460a6741k2480j91657f0776
$$ 126028 -56006 -34648 314303 -108679 -248827 52066 12460 -16741 -39221 -230878 -60776
9724H513d43928e6975j18990o8271a08557M1037D240R0885a21856A49899a36239
$$ 8513 -443928 -56975 -175965 -244236 -108557 -67520 4240 95125 -121856 149899 -136239
9712b35949m3241E403L7293b14159B08292a28785B76791a49720a121A07948l4572
$$ -235949 -279190 5403 42696 -214159 208292 -128785 276791 -149720 -1121 107948 73376
9701G3376b97532C6299d4314p258C6908K54877m1759c9936O676C1906R0383b47221
$$ 73376 -297532 36299 -44314 -51572 36908 291785 250026 -39936 -33260 31906 122289 -247221
9688a06314A10167j8538c01896n649B0660a76071f388A16823E4259a23687k3321
$$ -106314 110167 91629 -301896 -307545 20660 -176071 -6388 116823 54259 -123687 -147008
9677a47008j73104e9054B0129J40629c49101J19588k95731C0308m730a14433k0236
$$ -147008 -320112 -59054 20129 160758 -349101 -229513 -525244 30308 25578 -114433 -134669
9666a34669o3713F4138Q9208J28244c4388l5317A67272m7348a32880J9172E150
$$ -134669 -198382 64138 153346 281590 -34388 -69705 167272 119924 -132880 -113708 5150
9654B00868b82086A35396a59268A27582b8325B65805k5137c11887N4952B57014
$$ 200868 -282086 135396 -159268 127582 -28325 265805 240668 -311887 -256935 257014
9643A42191a09191b7901m34705J09544a8396A74401H4202a95015e8846m1330C5595
$$ 142191 -109191 -27901 -462606 -353062 -18396 174401 84202 -195015 -58846 -100176 35595
9631A47588E9491O1458a59160c2976B39557a36978n1306k09202p0734H9947J26594
$$ 147588 59491 120949 -159160 -32976 239557 -136978 -188284 -397486 -468220 89947 216541
9620B16541a41217k13895J0530h4581C19276f4737n5627a1137m4225F2392D244
$$ 216541 -141217 -355112 -344582 -84581 319276 -64737 -120364 -11137 -55362 62392 4244
9608d9042G3397g316D9111f9784l7448n1138B46122m6817I482a63743k19805D91272
$$ -49042 73397 -7316 49111 -69784 -107232 -158370 246122 199305 9482 -163743 -383548 491272
9595G6282a82002d3785E6867c88710i8599J3813j71912K2953N682l42a2113q8492
$$ 76282 -182002 -43785 56867 -388710 -98599 -84786 -256698 -233745 -228063 -228405 -12113 -100605
9583a00605c8096J3253H1743C8562i4606d4803A49208K2450b35846D7556b04471
$$ -100605 -38096 -24843 81743 38562 -94606 -44803 149208 171658 -235846 47556 -204471
9571b11926j33822B68119f1440I1096f1978j09304j06858F1962a29764A64815
$$ -211926 -345748 268119 -61440 91096 -61978 -171282 -278140 61962 -129764 164815
9560A26244l5376b72966B37191a7239o7800o479G8745l7521f9542j43678j4400
$$ 126244 90868 -272966 237191 -17239 -85039 -91518 78745 41224 -69542 -213220 -227620
9549b27620A43526b98795J44387D0523Q351a39831j75543c5151B1516a2342j47918
$$ -227620 143526 -298795 -154408 40523 48874 -139831 -315374 -35151 21516 -12342 -160260
9538a60260c2881r467A56938c22858a39701A44349a29300G6414a3393q284A54756
$$ -160260 -32881 -42348 156938 -322858 -139701 144349 -129300 76414 -13393 -21677 154756
9526A495b63331B19622a87843A69594e8632I2604l0545a68155B3994Q5577i7119
$$ 1495 -263331 219622 -187843 169594 -58632 92604 62059 -168155 23994 109571 -97119
9514a93036K710F5059a00804A2699a41867c6371A2363J01419e19095a6302o8897
$$ -193036 -190326 65059 -100804 12699 -141867 -36371 12363 113782 -519095 -16302 -85199
9503h5199E9957a47264l6837d5155j73460i840n8926o7745c66j17952A6517N0954
$$ -85199 59957 -147264 -184101 -45155 -218615 -9840 -68766 -136511 -366 -118318 16517 67471
9491F7471f1769m3122o5433R034K8368C05444c8689j45540A74608a79120p7970
$$ 67471 -61769 -104891 -170324 -161290 -132922 305444 -38689 -184229 174608 -179120 -257090
9480b57090G3397M4583c90996J79963f0842K2781A85885B1428l955b58879P1247
$$ -257090 73397 117980 -390996 -211033 -60842 -38061 185885 21428 17473 -258879 -187632
9469a87632l86458d7955l21363f8594m2142j93415e4065B4163a74937F2123a02586
$$ -187632 -574090 -47955 -369318 -68594 -110736 -304151 -54065 24163 -174937 62123 -102586
9457C1093a01985j08350h6407r1106L3567a0886j60652p8525j50396a94922d6991
$$ 31093 -101985 -210335 -86407 -177513 -143946 -10886 -171538 -250063 -400459 -194922 -46991
9445A90963A4634a25805B88028a91r5742Q30G4395c99303a41170B661J02466c18642
$$ 190963 14634 -125805 288028 -191 -95933 -95103 74395 -399303 -141170 2661 105127 -318642
9432c9249k90800J54097j11575L1624M8095R5998H8982a43293I6498g7311j91721
$$ -39249 -330049 -175952 -287527 -255903 -207808 -111810 88982 -143293 96498 -77311 -269032
9421b69032B6474J46582e4846m1949C17847e8406D54762A97922b8501m1298D5163
$$ -269032 26474 173056 -54846 -96795 317847 -58406 454762 197922 -28501 -69799 45163
9409a16126A33471a18908j74598A83004g3275K5322b3641m09993h5675j74237
$$ -116126 133471 -118908 -293506 183004 -73275 -47953 -23641 -433634 -85675 -259912
9399b59912m6363F6459b23711J8244B82307F4041a75207g9929n9439J5366n1785
$$ -259912 -306275 66459 -223711 -205467 282307 64041 -175207 -79929 -139368 -124002 -175787
9388a75787c0186r7349j15989J5491M6716M7895A60502c84859a87471c5908A80286
$$ -175787 -30186 -127535 -243524 -228033 -181317 -133422 160502 -384859 -187471 -35908 180286
9376F8393a79224M7791A10679D3324c34033B0322c80722A99504a92009J1077A88346
$$ 68393 -179224 -131433 110679 43324 -334033 20322 -380722 199504 -192009 -180932 188346
9364c67701A17573M3589l956D0842K33681A8501c48280a7614B50272b62378i8485
$$ -367701 117573 161162 157206 40842 274523 18501 -348280 -17614 250272 -262378 -98485
9352b43209J13663B18809a76384Q611m4461B41719b08779I657a34210B05133a97202
$$ -243209 -129546 218809 -176384 -167773 -212234 241719 -208779 9657 -134210 205133 -197202
9340c45499A45685o6285K01240a05228j57850e4714B5810a43808j9152o0092r4962
$$ -345499 145685 79400 280640 -105228 -263078 -54714 25810 -143808 -162960 -223052 -318014
9329c18014a53020M6716j11810m0246d6241A02978d39012J20928H2036j192k8174
$$ -318014 -153020 -106304 -218114 -258360 -46241 102978 -439012 -318084 82036 80844 52670
9318E2670b9746k37992a05008A06016d26832c4582j82357A9700a59654g2958l5088
$$ 52670 -29746 -267738 -105008 106016 -426832 -34582 -216939 19700 -159654 -72958 -108046
9307a08046l280c4401q109p8177A20157a3485A56553J97200E0036a45043k8057
$$ -108046 -111326 -34401 -42510 -120687 120157 -13485 156553 353753 50036 -145043 -173100
9296a73100A60144g007I980a44969d1024E2759f6094A21864c02559A48045A6273
$$ -173100 160144 -7007 9980 -144969 -41024 52759 -66094 121864 -302559 148045 16273
9284F4098b65020d1667b812k82980B35185a2965j89873A4757a75006a008B3713
$$ 64098 -265020 -41667 -2812 -285792 235185 -12965 -202838 14757 -175006 -1008 23713
9272i2435B07454b29954c351l17586G1815c6166C01827o8740F2738d8966j51165
$$ -92435 207454 -229954 -3351 -320937 71815 -36166 301827 233087 62738 -48966 -200131
9261b00131o2269a15081A81175d8900H7940K5503b08889k4211J01199D8118a83651
$$ -200131 -262400 -115081 181175 -48900 87940 113443 -208889 -233100 -131901 48118 -183651
9249b40042P1480j29420R9642g405D4444L1311c7423r1308f1138F1179L23090
$$ -240042 -168562 -297982 -198340 -7405 44444 75755 -37423 -128731 -61138 61179 384269
9238C84269a7822A2134a08286I0099K3943a28214A67657a87640a0986A32113d01182
$$ 384269 -17822 12134 -108286 90099 114042 -128214 167657 -187640 -10986 132113 -401182
9226G8647B54J04445b65066g4552B9691G595b50434D3898O908N5560c34999a10448
$$ 78647 254 104699 -265066 -74552 29691 7595 -250434 43898 50806 106366 -334999 -110448
9213b05786B39495a04014L2902k43683d5934G2149a3582k56940B21110a21646
$$ -205786 239495 -104014 -71112 -314795 -45934 72149 -13582 -270522 221110 -121646
9202E9871b48433I352J13213B6626a4250A93313M7455H9066b58040Q6704o4469
$$ 59871 -248433 9352 122565 26626 -14250 193313 240768 89066 -258040 -171336 -235805
9191b35805r460a03389G7544d44871d1055B44670o5650g6850A29152l2283C3451
$$ -235805 -245265 -103389 77544 -444871 -41055 244670 179020 -76850 129152 96869 33451
9179d877j12613a2118l21987B44298d06706h0446j65291i7226A71472c57956F7670
$$ -4877 -117490 -12118 -334105 244298 -406706 -80446 -245737 -97226 171472 -357956 67670
9167A62809a15911A95856e0038Q308A2086N2829b10865B70933a72671k49567F2788
$$ 162809 -115911 195856 -50038 -41730 12086 64915 -210865 270933 -172671 -422238 62788
9155H6771c2486C77831a44762A81522f4261j70448P3328A62444a79974A37657
$$ 86771 -32486 377831 -144762 181522 -64261 -234709 -161381 162444 -179974 137657
9144C8843o998a88502L6498O7446l5716P360j76601H8104a16821A64917f7569
$$ 38843 31845 -188502 -152004 -84558 -120274 -112914 -289515 88104 -116821 164917 -67569
9132b9986B00840c00516a13025o6447G6598R6838p8643a15780L2668B36838b7558
$$ -29986 200840 -300516 -113025 -179472 76598 173436 94793 -115780 -83112 236838 -27558
9120a18401k28503a264j15294j32962L1949p5702a3983j27494I7938b87866k2563
$$ -118401 -346904 -1264 -116558 -249520 -217571 -293273 -13983 -141477 97938 -287866 -310429
9109c10429m7679E8103a84356j3606G5382a43246l19062b2412j85691E4833c25960
$$ -310429 -358108 58103 -184356 -197962 75382 -143246 -462308 -22412 -208103 54833 -325960
9097A20906e2513m5023K942h083k11667f720G2405g7916R519n13290A60676b09078
$$ 120906 -52513 -97536 -94594 -8083 -219750 -6720 72405 -77916 -68397 -581687 160676 -209078
9084a07322N2387q3001D6572i9528C73187b03127i4325G2101b6305l4182A06309
$$ -107322 -54935 -137936 46572 -99528 373187 -203127 -94325 72101 -26305 -60487 106309
9072D39623a08257k78628A59322o9342B6890b12342A81703a498m7485A07628h5913
$$ 439623 -108257 -386885 159322 89980 26890 -212342 181703 -1498 -48983 107628 -85913
9060b53035D6190P9779d5152l2162J6260o1436G1422a87970A04276b66163h2153
$$ -253035 46190 125969 -45152 -77314 -61054 -122490 71422 -187970 104276 -266163 -82153
9048A64282F3039f7720K5327k06895J03234N5929E9989b09660c6095j40308r9505
$$ 164282 63039 -67720 -42393 -249288 -146054 -90125 59989 -209660 -36095 -176403 -275908
9037b75908J31845N203F6275b5729B52490G0707J9088c78181a05437A64741B5924
$$ -275908 -144063 -138860 66275 -25729 252490 70707 89795 -378181 -105437 164741 25924
9025d1840A80255a03203C833d1464p9420m4407j23435j78551A70830F7853A6380
$$ -41840 180255 -103203 3833 -41464 -120884 -165291 -288726 -467277 170830 67853 16380
9013a6542oC8173a16424N0996Q374l0035A05994L5520c2090m4504j24993O2645
$$ -16542 -16548 38173 -116424 -65428 -57054 -87089 105994 141514 -32090 -76594 -201587 -138942
9001a38942j60092Q0570c3175h31C78283a56152A8568c6952o0709A71155c37918
$$ -138942 -299034 -218464 -33175 -831 378283 -156152 18568 -36952 -97661 171155 -337918
8989B20559a5217I31L11389d37j14948B25087i2649p1490B5643P9794a10943p8092
$$ 220559 -15217 931 312320 -437 -115385 225087 -92649 -164139 25643 105437 -110943 -189035
8977a89035j50939a37229E7005b82433O5210i466A94267M9532n7335a9620C8691
$$ -189035 -339974 -137229 57005 -282433 -217223 -9466 194267 243799 186464 -19620 38691
8965E7947J31953C726L1402g5858p8858G8748a19097e5653j00730l3632k12458
$$ 57947 189900 3726 35128 -75858 -154716 78748 -119097 -55653 -156383 -190015 -402473
8954d02473a41402G5393a01155k29782A23479h439A1597a95569B96277b0001A68229
$$ -402473 -141402 75393 -101155 -330937 123479 -8439 11597 -195569 296277 -20001 168229
8942b53130j4722J18069c2212k17653D332Q2066l1236K22530A07579K01250d4783
$$ -253130 -267852 -149783 -32212 -249865 4332 86398 55162 277692 107579 308829 -44783
8930a62440I5853Q5345E1354Q4681L20715H8051R29623J190406L413666Q112237
$$ -162440 95853 181198 51354 136035 456750 88051 1017674 2208080 5621746 13733983
8920A3733983E131817A300025E43817m3566A00122P4576e2528m16835L316a73978
$$ 13733983 5131817 1300025 543817 500251 100122 174698 -52528 -469363 -466047 -173978
8909f1283B53381l9751L13552e79833H3408b55273i3880C92692i9357M461p2450
$$ -61283 253381 213630 527182 -579833 83408 -255273 -93880 392692 -99357 -94896 -167346
8898a67346k40001a08394l78822c9076j81737H3818a56436C8316a86639e9888
$$ -167346 -407347 -108394 -487216 -39076 -220813 83818 -156436 38316 -186639 -59888
8887a3858n67072A66222a27934B04813b8503k33036g0938A0253J83418R4542a49460
$$ -13858 -580930 166222 -127934 204813 -28503 -261539 -70938 10253 193671 288213 -149460
8875F70b80980M5891B4110a35009A76379b90585a2035C31209b42866h4082j06642
$$ 670 -280980 -235089 24110 -135009 176379 -290585 -12035 331209 -242866 -84082 -190724
8864a90724C04K49087j6562m7018c15952A10581J59593H5000a73411P8169k50608
$$ -190724 304 249391 232829 185811 -315952 110581 270174 85000 -173411 -95242 -345850
$$ [...]
##END NTUPLES=NMR SPECTRUM
##END=
