##TITLE=AC1590_HPIAH13320_8314025_3dXMPT6A9y
##JCAMPDX= 6.0         $$ Bruker NMR JCAMP-DX V2.0
##DATA TYPE= NMR SPECTRUM
##DATA CLASS= NTUPLES
##ORIGIN= BRUKER
##OWNER= Administrator
$$ 1.72 TOPSPIN		Version 2.1
$$ 2013-11-09 11:08:19.380 -0800  Administrator@X
$$ Compression mode = diff/dup
##.OBSERVE FREQUENCY= 400.02188249412
##.OBSERVE NUCLEUS= ^1H
##.ACQUISITION MODE= SIMULTANEOUS (DQD)
##.ACQUISITION SCHEME= undefined
##.AVERAGES= 8
##.DIGITISER RES= 22
##SPECTROMETER/DATA SYSTEM= spect
##.PULSE SEQUENCE= zg30
##.SOLVENT NAME= COFFEE_meoh
##.SHIFT REFERENCE= INTERNAL, COFFEE_meoh, 1, 14.98509
##AUDIT TRAIL= $$ (NUMBER, WHEN, WHO, WHERE, PROCESS, VERSION, WHAT)
$$ ##TITLE= Audit trail, TOPSPIN		Version 2.1
$$ ##JCAMPDX= 5.01
$$ ##ORIGIN= Bruker BioSpin GmbH
$$ ##OWNER= Administrator
$$ $$ E:\/data/COFFEE/nmr/AC1590_HPIAH13320_8314025_3dXMPT6A9y/10/pdata/1/auditp.txt
$$ ##AUDIT TRAIL=  $$ (NUMBER, WHEN, WHO, WHERE, PROCESS, VERSION, WHAT)
(   1,<2013-11-09 11:08:12.005 -0800>,<Administrator>,<X>,<go>,<TOPSPIN 2.1>,
      <created by zg
	started at 2013-11-09 11:07:01.738 -0800,
	POWCHK enabled, PULCHK disabled,
       configuration hash MD5:
       C8 4E 4E 5D D3 5C D8 9E 9F 52 82 E0 59 8A DE 15
       data hash MD5: 64K
       1E D7 2F 39 BC F4 38 D0 F9 A7 29 A7 20 AD FB 7E>)
(   2,<2013-11-09 11:08:15.193 -0800>,<Administrator>,<X>,<proc1d>,<TOPSPIN 2.1>,
      <Start of raw data processing
       efp LB = 0 FT_mod = 6 PKNL = 1 PHC0 = 0 PHC1 = 0 SI = 32K 
       data hash MD5: 32K
       7B 11 19 9C 03 22 74 28 F8 D8 1E E6 06 D0 4A 59>)
(   3,<2013-11-09 11:08:15.630 -0800>,<Administrator>,<X>,<proc1d>,<TOPSPIN 2.1>,
      <pk PHC0 = 93.6145 PHC1 = 0 
       data hash MD5: 32K
       77 5E CD 24 84 B8 7A EC 61 01 D1 D2 0B F2 F4 47>)
(   4,<2013-11-09 11:08:15.974 -0800>,<Administrator>,<X>,<proc1d>,<TOPSPIN 2.1>,
      <abs ABSG = 1 
       data hash MD5: 32K
       01 2F DC A4 51 11 23 52 C8 65 58 47 E9 AB 5C 16>)
(   5,<2013-11-09 11:08:16.083 -0800>,<Administrator>,<X>,<proc1d>,<TOPSPIN 2.1>,
      <abs ABSG = 2 
       data hash MD5: 32K
       E5 C7 DE 89 74 CD 08 2B C3 4D 6A 64 3B 55 E5 C8>)
(   6,<2013-11-09 11:08:16.208 -0800>,<Administrator>,<X>,<proc1d>,<TOPSPIN 2.1>,
      <abs ABSG = 3 
       data hash MD5: 32K
       30 E1 07 C1 75 4B AD 53 2A 2F 18 2B F7 E9 2D 34>)
(   7,<2013-11-09 11:08:16.286 -0800>,<Administrator>,<X>,<proc1d>,<TOPSPIN 2.1>,
      <abs ABSG = 4 
       data hash MD5: 32K
       A6 53 38 B2 3E FC 44 4D DE A7 1D 92 0B 25 37 A1>)
(   8,<2013-11-09 11:08:16.365 -0800>,<Administrator>,<X>,<proc1d>,<TOPSPIN 2.1>,
      <abs ABSG = 5 
       data hash MD5: 32K
       72 B3 BA 95 1A 0B 01 77 F0 D6 43 02 FA B5 94 A8>)
$$ ##END=
$$ 
$$ $$ hash MD5
$$ $$ 59 8F 69 1C A9 26 B1 5D A6 AF 37 D1 C3 04 AC FB
##$RELAX= 
##$RELAX= 
##$RELAX= 
##$RELAX= 
##$RELAX= 
##$RELAX= 
##$RELAX= 
$$ Bruker specific parameters
$$ --------------------------
##$DU= <E:\>
##$EXPNO= 10
##$NAME= <AC1590_HPIAH13320_8314025_3dXMPT6A9y>
$$ [...]
##$TP= (0..7)
150 150 150 150 150 150 150 150
##$TP07= 0
##$TPNAME0= <>
##$TPNAME1= <>
##$TPNAME2= <>
##$TPNAME3= <>
##$TPNAME4= <>
##$TPNAME5= <>
##$TPNAME6= <>
##$TPNAME7= <>
##$TPOAL= (0..7)
0.5 0.5 0.5 0.5 0.5 0.5 0.5 0.5
##$TPOFFS= (0..7)
0 0 0 0 0 0 0 0
##$TUNHIN= 0
##$TUNHOUT= 0
##$TUNXOUT= 0
##$USERA1= <user>
##$USERA2= <user>
##$USERA3= <user>
##$USERA4= <user>
##$USERA5= <user>
##$V9= 5
##$VALIST= <valist>
##$VCLIST= <CCCCCCCCCCCCCCC>
##$VD= 0
##$VDLIST= <DDDDDDDDDDDDDDD>
##$VPLIST= <PPPPPPPPPPPPPPP>
##$VTLIST= <TTTTTTTTTTTTTTT>
##$WBST= 1024
##$WBSW= 4
##$XGAIN= (0..3)
0 0 0 0
##$XL= 0
##$YL= 0
##$YMAX_a= 621704
##$YMIN_a= -527231
##$ZGOPTNS= <>
##$ZL1= 120
##$ZL2= 120
##$ZL3= 120
##$ZL4= 120
##$ABSF1= 14.98509
##$ABSF2= -5.573092
##$ABSG= 5
##$ABSL= 3
##$ALPHA= 0
##$AQORDER= 0
##$ASSFAC= 0
##$ASSFACI= 0
##$ASSFACX= 0
##$ASSWID= 0
##$AUNMP= <proc_prof1d_extract_pilot.lims>
##$AXLEFT= 0
##$AXNAME= <>
##$AXNUC= <1H>
##$AXRIGHT= 0
##$AXTYPE= 0
##$AXUNIT= <>
##$AZFE= 0.1
##$AZFW= 0.1
##$BCFW= 0
##$BC_mod= 0
##$BYTORDP= 0
##$COROFFS= 0
##$CY= 15
##$DATMOD= 1
##$DC= 0
##$DFILT= <>
##$DTYPP= 0
##$F1P= 0
##$F2P= 0
##$FCOR= 0.5
##$FTSIZE= 32768
##$FT_mod= 6
##$GAMMA= 0
##$GB= 0
##$INTBC= 1
##$INTSCL= 1
##$ISEN= 128
##$LB= 0
##$LEV0= 0
##$LPBIN= 0
##$MAXI= 10000
##$MC2= 0
##$MEAN= 0
##$ME_mod= 0
##$MI= 0
##$NCOEF= 0
##$NC_proc= -8
##$NLEV= 6
##$NOISF1= 0
##$NOISF2= 0
##$NSP= 0
##$NTH_PI= 0
##$NZP= 0
##$OFFSET= 14.98509
##$PC= 1
##$PHC0= 93.6145
##$PHC1= 0
##$PH_mod= 1
##$PKNL= yes
##$PPARMOD= 0
##$PPDIAG= 0
##$PPIPTYP= 0
##$PPMPNUM= 2147483647
##$PPRESOL= 1
##$PSCAL= 4
##$PSIGN= 0
##$PYNMP= <proc.py>
##$REVERSE= no
##$SF= 400.02
##$SI= 32768
##$SIGF1= 0
##$SIGF2= 0
##$SINO= 400
##$SIOLD= 32768
##$SPECTYP= <>
##$SREGLST= <1H.CDCl3>
##$SSB= 0
##$STSI= 32768
##$STSR= 0
##$SW_p= 8223.68421052631
##$SYMM= 0
##$S_DEV= 0
##$TDeff= 65536
##$TDoff= 0
##$TI= <>
##$TILT= no
##$TM1= 0
##$TM2= 0
##$TOPLEV= 0
##$USERP1= <user>
##$USERP2= <user>
##$USERP3= <user>
##$USERP4= <user>
##$USERP5= <user>
##$WDW= 1
##$XDIM= 32768
##$YMAX_p= 441290270
##$YMIN_p= -666698
##$CURPLOT= <Network HP LaserJet P1505>
##$CURPRIN= <$Network HP LaserJet P1505>
##$DFORMAT= <normdp>
##$LAYOUT= <+/1D_H.xwp>
##$LFORMAT= <normlp>
##$PFORMAT= <normpl>
##$SURQMSG= 1
$$ End of Bruker specific parameters
$$ ---------------------------------
##NTUPLES= NMR SPECTRUM
##VAR_NAME=  FREQUENCY,     SPECTRUM/REAL,   SPECTRUM/IMAG
##SYMBOL=    X,             R,               I
##VAR_TYPE=  INDEPENDENT,   DEPENDENT,       DEPENDENT
##VAR_FORM=  AFFN,          ASDF,            ASDF
##VAR_DIM=   32768,         32768,           32768
##UNITS=     HZ,            ARBITRARY UNITS, ARBITRARY UNITS
##FACTOR=    0.250966925370066, 1,           1
##FIRST=     8223.43324360094, 251240,       14367
##LAST=      0,             -50485,          -54160
##MIN=       0,             -666698,         0
##MAX=       8223.43324360094, 441290270,    0
$$ Real data points
##PAGE= N=1
##DATA TABLE= (X++(R..R)), XYDATA
$$ [...]
$$ plain form
19552 192917 -196425 106242 -114249 283145 -97816 100557 43490 -324783 154475 57608
19541 81975 27453 -46749 374745 -78118 -233111 -1281 163076 214195 82441 279709 -75899
19529 -176340 -81658 155656 4308 -130986 -81393 -233171 7822 -40597 -148726 -61165 -274
19517 -189433 -291655 20190 -155710 -316034 124909 -33396 -257647 -307803 169940 -63802
19506 391812 -4675 -221747 96441 -255667 90596 137614 -55651 -238732 -242624 135528 55951
19494 346163 -49664 77978 -177498 -91956 173485 32133 -30532 160656 -119497 -248326
19484 -248326 179100 -38412 -174806 95760 -215644 -65730 -53193 -45349 -62547 -277131 335428
19472 -91060 41864 -199335 89887 -68697 279692 -216159 93303 61179 -163149 -57042 -179735
$$ packed form
19552A92917a96425A06242a14249B83145i7816A00557D3490c24783A54475E7608
19541H1975B7453d6749C74745g8118j54993a281A63076N1119H2441J97268g5899
19529a76340h1658A55656D308a30986M9593j51778G822d0597j08129f1165b74
19517a89433j02222B0190a55710j60324A24909c3396k24251n0156A69940f3802
19506C91812d675k17072I6441b55667I0596M7018e5651j83081l892A35528E5951
19494C46163d9664G7978a77498Q5542A73485C2133c0532A60656a19497j28829
19484b48326A79100c8412j36394I5760b15644f5730J2537P844j7198k14584C35428
19472i1060D1864a99335H9887f8697B79692b16159I3303l2124a63149e7042j22693
$$ plain form
19461 -179735 -72487 -104791 -218348 -217015 -163183 -56059 -35689 -11291 -353187 63207 -404820
19449 -58166 -290645 30319 -76810 -44960 60042 -25847 -214764 -35536 -58331 28318 -249180
19437 138916 -59553 -27441 -45528 81571 -121661 233705 4129 -164375 -74988 -26865 247895
19425 326604 -130375 -214933 -181089 133448 163202 -320569 -17062 206252 -52204 -233621
19415 -233621 110796 169122 115769 63439 -295825 -408046 -43350 51939 223402 173875 97260
19404 97260 -218203 24872 -80253 -174562 31216 303309 -134629 -96164 -3280 14872 77214
19393 77214 -345261 -263602 -53255 -352402 -201651 19420 -144126 -173790 170856 -248016
19382 -100993 223377 -167896 220534 32870 2429 -299264 51728 -144918 -8280 24276 93308
$$ packed form
19461a79735g2487l2304j13557J333N3832e6059K0370a1291l41896F3207d04820
19449e8166k32479C0319g6810L1850F0042b5847j88917c5536k2795B8318b49180
19437A38916e9553b7441j8087H1571a21661B33705D129a64375g4988b6865B47895
19425C26604a30375q4558L3844A33448K9754c20569a7062B06252e2204j81417
19415b33621A10796N8326n3353n2330b95825j12221d3350E1939J71463m9527p6615
19404I7260b18203B4872h0253r4309C1216K72093a34629L8465c280A4872O2342
19393G7214c45261Q1659e3255k99147J50751A9420a44126k9664A70856b48016
19382a00993B23377a67896B20534C2870B429b99264E1728a44918h280B4276O9032
$$ plain form
19371 93308 128543 -299778 28043 27136 -165462 -134726 -185525 265832 211228 -71253 -188365
19360 -188365 -215475 -441204 88210 243113 -378366 -120990 151652 -62271 -2703 2434 -412298
19348 -679 -230550 -243263 -73606 -184879 -103477 -5916 3133 -81960 -62112 -311243 -143244 -2912
19335 -296763 -186582 -117595 4186 -156350 -160449 -230248 -117469 52463 -291472 -110569 -111824
19324 -111824 98691 168368 -174360 -372762 74294 -40895 -202420 -353945 212313 -22225
19313 -267851 126343 -140922 -31223 8188 151407 68512 -362581 107075 -32240 101074
19302 -303203 139990 28051 179851 -74672 -214430 45472 2924 -237810 -428081 -96100 -26881
19290 -70003 -167444 -101939 345572 52762 -332104 -153658 135483 205417 -39724 -160673 -76334
$$ packed form
19371I3308L5235b99778B8043r07a65462L0736n0799B65832n4604g1253j17112
19360a88365k7110k25729H8210J54903c78366a20990A51652f2271b703B434d12298
19348f79k29871j2713g3606j11273Q1402e916C133h1960J9848k49131a43244b912
19335b96763J10181O8987D186a56350m099o9799J12779E2463b91472a10569j255
19324a11824I8691O9677a74360j98402G4294d0895j61525j51525B12313b2225
19313b67851A26343a40922c1223H188J43219F8512c62581A07075c2240A01074
19302c03203A39990B8051J51800g4672j39758D5472B924b37810j90271i6100b6881
19290g0003r7441O5505C45572E2762c32104a53658A35483O9934c9724j20949g6334
$$ plain form
19278 160879 -247087 -438575 -292804 -201044 -155781 -271878 43412 181047 -138587 -96549
19268 -96549 114873 -20647 -81792 148057 -200462 191565 -306191 -278223 -84453 -151306 -103171
19257 -103171 170755 -118767 -229758 170808 -276365 243056 183424 192459 37634 -290909
19246 49312 -327360 9486 -239061 -215352 -106388 95414 42118 -487459 236093 -296649 -53433
19234 -204457 -47025 185486 257318 258180 -75198 -166748 -390844 23182 280431 -156345 -245184
19223 -245184 -263106 166157 -98495 -296494 -62411 20448 155856 -88333 18702 -373001 -349816
19212 -349816 27894 201440 -14623 -180779 -30602 -65215 -165345 -180563 -303901 80648 -178653
19200 -244461 -292138 15236 -67248 59045 -20574 46494 100209 88575 135277 -51470 82843
$$ packed form
19278A60879b47087j91488J45771R1760M5263j16097D3412J37635a38587M2038
19268i6549A14873b0647o1145A48057b00462A91565c06191K7968h4453o6853M8135
19257a03171A70755a18767j10991A70808b76365B43056n9632R035C7634b90909
19246D9312c27360I486b39061K3709a06388I5414D2118d87459B36093b96649e3433
19234b04457d7025A85486P1832Q62g5198r1550k24096B3182K57249a56345q8839
19223b45184j7922A66157i8495j97999f2411B0448J35408h8333A8702c73001K3185
19212c49816B7894J73546a4623j66156c0602l4613j00130j5218j23338H0648a78653
19200b44461m7677A5236f7248E9045b0574D6494N3715j1634M6702e1470H2843
$$ plain form
19188 41529 184263 -25387 -111198 -36736 27353 -121133 33862 -64905 -222748 -63204 -97981
19177 -97981 -246750 -440841 154636 -298697 20218 -160259 -237518 123929 -239736 -189599
19167 -189599 64227 84619 -58451 147760 251483 84335 -430548 -15817 -115735 208744 -199896
19155 73339 -122301 68369 71592 -102483 24474 -71972 -137814 -314339 -84150 -37160 22728
19143 -217454 400346 338995 -162224 -100512 -100239 -41140 -190701 156178 -119825 184395 -2584
19131 -112500 -431045 -130931 191245 73580 132489 40753 55204 -122417 -28013 22428 -145348
19119 -42620 -126513 184798 171219 -292793 230512 59203 -75066 -164168 354763 -38803 -439136
19108 -439136 -382798 260039 -177 -96095 -151846 54458 168603 267722 -186410 -128933 21618
$$ packed form
19188D1529J42734b5387q5811c6736B7353a21133C3862f4905j57843f3204l4777
19177i7981j48769j94091A54636b98697B0218a60259p7259A23929b39736N0137
19167a89599F4227K0392e8451A47760J03723H4335d30548a5817r9918B08744a99896
19155G3339a22301F8369L223a02483B4474g1972o5842j76525h4150c7160B2728
19143b17454D00346o1351a62224O1712K73d1140j49561A56178a19825A84395b584
19131a12500l18545a30931A91245G3580N8909D0753J4451a22417b8013B2428a45348
19119d2620q3893A84798j3579b92793B30512E9203g5066q9102C54763c8803m00333
19108d39136N6338B60039a77r5918n5751E4458J14145R9119a86410N7477B1618
$$ plain form
19096 219163 -180572 -237596 -267566 -247796 293284 181064 -66025 -189462 341820 198856
19086 198856 -908 -424420 -272242 -39156 -153605 -62478 82092 39560 550652 -83339 75893
19074 79719 124198 315725 165162 -254776 32693 -175502 -100767 -546729 -261314 -93158
19063 263154 -291341 187486 -334438 406990 -136855 -221003 46796 154487 -97562 -223442
19053 -223442 -152097 -167763 -313390 -284055 -1220 38609 -167884 209557 98131 240637 -171119
19041 -255595 -97621 -258660 -14362 -93547 -70713 28408 61636 -29006 29901 -314877 -38826
19029 115195 -123862 -22104 132046 -83221 -278533 -122294 -101360 -50192 121969 22581
19018 -39561 -159287 450650 -299806 -157508 -238651 271620 -96537 26248 -180909 -128360
$$ packed form
19096B19163a80572n7024k9970J9770B93284j12220f6025j23437C41820j42964
19086A98856i08m23512J52178c9156j14449f2478H2092C9560N11092h3339G5893
19074G9719M4479J91527j50563b54776C2693a75502P4735m45962b61314i3158
19063B63154b91341A87486c34438D06990a36855q4148D6796J07691i7562j25880
19053b23442P1345j5666j45627K9335a220C8609a67884B09557I8131J42506a71119
19041b55595i7621j61039a4362p9185K2834B8408L3228b9006B9901c14877c8826
19029A15195a23862b2104A32046h3221j95312a22294K0934e0192A21969B2581
19018c9561j19726D50650b99806J42298q1143B71620i6537B6248a80909N2549
$$ plain form
19008 -128360 -161429 -519 -94087 167537 -74423 -206029 -100451 90942 -11322 -159046 57684
18996 9119 -81325 -24171 -275339 -134792 -18838 -74931 69370 51697 16229 160445 -235164
18984 187975 5932 -90347 -5828 -252710 -164545 99934 -276943 -212194 -209790 -119526 232256
18972 -41838 -213801 -139122 284981 -192252 -200992 165102 275341 -273882 -257404 -317567 -196759
18961 -196759 119625 -177402 84487 -19623 340419 15907 -161191 -74605 180218 137255
18951 137255 83092 -421602 -153583 -131444 -195575 -28948 -193978 84029 188595 -340706
18940 30966 -140362 81969 -123454 -243956 -227625 -473630 -363207 -234538 -117589 3187
18929 -370099 -53427 -74659 -237997 156186 -181960 -125540 -45266 319531 -44852 28940 -288332
$$ packed form
19008a28360l3069e19r3568A67537g4423j31606a00451I0942a1322j47724E7684
18996I119h1325b4171k51168a34792a8838n6093F9370j7673A6229J44216b35164
18984A87975E932i0347e828k46882Q8165I9934b76943O4749K404R0264B32256
18972d1838j71963P4679B84981a92252q740A65102J10239b73882J6478o0163J20808
18961a96759A19625a77402H4487a9623C40419A5907a61191g4605A80218m2963
18951A37255n4163d21602a53583K2139o4131b8948j65030H4029J04566c40706
18940C0966a40362H1969a23454j20502J6331k46005J10423J28669J16949C187
18929c70099e3427k1232j63338A56186a81960N6420d5266C19531d4852B8940b88332
$$ plain form
18917 98536 -44592 -24036 343585 216071 21068 -100721 -11091 -281550 -242216 332139 -38026
18905 -151079 -40231 -346508 -64092 -67361 -245262 315950 -161680 -60548 -359449 -69409 -48928
18894 -48928 -51644 106727 108425 -52388 9120 189845 -56776 -580761 -26584 34520 -238916
18882 52423 -181261 145954 7286 -219108 195265 -278128 233831 208982 492862 -145442
18871 -337119 -256685 -48269 97758 79341 75788 -16209 -396162 -67476 68976 -66262 -204329
18860 -204329 -232889 32974 -305565 -5455 -290671 -194310 -162585 -250281 6208 142493 -62529
18848 78721 -95253 -87894 192866 178914 153002 85409 -66490 -39335 -537582 -261809 -52708
18836 148721 -164564 19309 178181 41466 -170061 93146 -34266 -105588 32257 -54668 -238820
$$ packed form
18917I8536d4592K0556C43585j27514B1068a00721a1091k70459L9334C32139c8026
18905a51079d0231l06277f4092l269j77901C15950a61680f0548k98901f9409K0481
18894d8928k716A06727J698e2388I120J80725e6776n23985b6584C4520b38916
18882E2423a81261A45954G286b19108A95265b78128B33831k4849K83880a45442
18871c37119Q0434d8269I7758j8417l553a6209l79953f7476F8976f6262j38067
18860b04329k8560C2974c05565e455k85216R6361L1725q7696F208J36285f2529
18848G8721i5253P359A92866j3952k5912o7593f6490K7155m98247b61809e2708
18836A48721a64564A9309J58872D1466a70061I3146c4266p1322C2257e4668j84152
$$ plain form
18825 -238820 124096 -404479 148980 -66250 -290734 -15030 -283316 197532 144677 -144692
18814 -3148 -29455 -30681 109495 204058 25904 184857 450318 94052 326234 -336004 -125357
18802 102953 -356864 -140354 -165943 158233 -194990 -130756 -63524 -157738 283645 155239
18792 155239 -67142 -148198 113953 -281200 -131255 136111 -76018 174927 -7860 -57504 -285555
18781 -285555 33088 -172763 481887 -137338 -179101 133397 -64462 -270631 211220 -462180
18770 283548 17391 150808 116571 243165 -51246 -141063 -179991 -351780 41663 -51537 -124275
18759 -124275 -45101 -182173 -309860 -313969 -22186 -44815 50679 -19210 -174213 -248965 51690
18747 -331193 -270270 -35499 -113276 26093 179548 21318 23012 108888 47830 -9601 -251907
$$ packed form
18825b38820A24096d04479A48980f6250k24484a5030k68286A97532n2855a44692
18814c148k6307j226A09495R4563B5904J58953K65461I4052K32182c36004a25357
18802A02953c56864a40354k5589A58233a94990O4234f3524r4214B83645j28406
18792A55239f7142q1056A13953b81200a31255A36111g6018A74927g860m9644k28051
18781b85555C3088a72763D81887a37338m1763A33397f4462k06169B11220d62180
18770B83548A7391J33417l4237J26594e1246q9817l8928j71789D1663e1537p2738
18759a24275d5101j37072j27687m109b2186k2629E0679a9210j55003p4752E1690
18747c31193O0923c5499p7777B6093J53455B1318J694Q5876D7830i601k42306
$$ plain form
18736 -251907 -177721 -309326 -385546 29655 -284998 -50358 368206 -206020 145077 175389
18726 175389 -253418 166747 42388 36620 -79853 25052 -81419 151915 359058 -110719 -4267
18714 -209616 -294766 96630 -95861 247978 -5607 -387084 -113044 479928 -204590 -280496 -208702
18703 -208702 203539 -183448 -360155 -87978 61817 -107289 -117012 -161004 -317283 -84457 -144325
18692 -144325 -181835 -150122 -220530 90728 -65129 -257401 124578 -116847 199991 332812
18682 332812 22929 118853 -26629 -226024 89600 55364 -30020 121402 -79493 28569 -32709
18670 85728 -185185 -29631 230222 210204 -178575 160151 24088 -85030 -93736 -63229 211713
18658 28454 -194816 -65297 281316 134162 -225821 59351 -61052 142325 23500 140944
$$ packed form
18736b51907P4186j31605p6220B9655b84998e0358C68206b06020A45077L0312
18726A75389b53418A66747D2388n768g9853B5052h1419A51915K07143a10719d267
18714b09616q5150I6630i5861B47978e607l81477a13044D79928b04590p5906P1794
18703b08702B03539a83448j76707h7978F1817a07289r723m3992j56279h4457n9868
18692a44325l7510L1713p0408I0728f5129j92272A24578a16847A99991J32821
18682C32812B2929R5924b6629j99395H9600l4236c0020A21402g9493B8569c2709
18670H5728a85185b9631B30222k0018a78575A60151B4088h5030q706L0507B11713
18658B8454a94816f5297B81316A34162b25821E9351f1052A42325B3500J17444
$$ plain form
18648 140944 27192 296007 -94144 191 10599 470878 -23381 68752 -128645 -299404 -178688
18637 -178688 -131812 -163191 -15704 132125 -210076 -200206 24845 236580 22080 -140179 159812
18625 90249 -229262 -144658 -73740 -190862 101086 141360 -338515 162767 -103092 -112255 27057
18613 -173769 -316519 -67033 255394 272024 -92170 -206202 87399 -302839 -415002 66539
18602 118928 -129941 -107319 -110226 -116966 2324 386032 -58544 -171834 -210050 -306548 189900
18590 59658 -153272 6413 -137383 171885 11993 300607 137641 240141 37253 413081
18580 413081 -250683 160325 117589 2551 -381566 18548 43502 -385866 -274535 43092 -60113
18568 -123323 171930 -190090 22072 -311191 -319660 -45141 -448129 35489 -123831 -29491 -242617
$$ packed form
18648A40944B7192K68815i4144A91J0408M60279b3381F8752a28645j70759J20716
18637a78688M6876l1379a5704A32125b10076R870B4845K11735B2080a40179A59812
18625I0249b29262Q4604P0918j17122A01086M0274c38515A62767a03092r163B7057
18613a73769j42750f7033B55394J6630i2170j14032H7399c02839j12163F6539
18602A18928a29941K2622k907o740B324L83708e8544j13290l8216r6498A89900
18590E9658a53272F413a37383A71885A1993K88614A37641J02500C7253L75828
18580D13081b50683A60325m2736B551c81566A8548K4954c85866J11331D3092f0113
18568a23323A71930a90090B2072c11191q469d5141m02988C5489a23831b9491k13126
$$ plain form
18557 -242617 -54883 -42432 -31104 -54511 31684 81649 -202059 -45891 -191987 83975 -138882
18545 54119 40006 -282741 -62657 286487 -182434 -29193 254165 -66857 -198193 50669 270767
18534 270767 -186610 34156 166318 187694 -33129 -154264 -174952 139909 -120327 -44144
18523 -154312 -357569 -416610 -219546 309608 -422158 -13628 52243 92228 -131038 -154126
18513 -154126 -141521 358423 -317097 27734 77091 191428 400038 -138462 7739 124045
18503 124045 -15150 -220872 17384 320482 -54121 -88749 -103096 -32979 140486 -40230 47805
18491 -162365 204524 61263 -60801 -11923 49659 -100014 103395 -302595 -66179 -115677 -136680
18480 -136680 -60218 -283626 -203000 41443 10748 -5838 -4344 -72999 -247914 -72196 -98754
$$ packed form
18557b42617e4883J2451J1328k3407C1684M9965b02059d5891j46096H3975a38882
18545E4119j4113b82741f2657B86487a82434b9193B54165f6857j31336E0669K20098
18534B70767a86610C4156J32162K1376c3129j21135k0688A39909a20327d4144
18523a54312k03257n9041J97064C09608d22158a3628E2243L9985a31038k3088
18513a54126J2605C58423c17097B7734M9357J14337K08610a38462G739J16306
18503A24045a5150k05722A7384L03098e4121l4628j4347c2979A40486d0230D7805
18491a62365B04524F1263f0801a1923D9659a00014A03395c02595f6179m9498k1003
18480a36680f0218k23408Q0626D1443A0748e838J494o8655j74915g2196k6558
$$ plain form
18469 -98754 4154 165822 -220096 -29869 -375743 -13357 -176544 -40363 132708 -226310 -137275
18458 -137275 -172618 -488185 -154418 187173 -9196 -139448 264043 -215203 69383 90986
18448 90986 -170509 -13930 -76754 -29301 33349 -302290 107471 38513 -304293 -24359 96129
18436 61074 -84281 -263082 -18400 -248375 -262000 -150075 -100232 -2533 -185905 -69476 -263796
18425 -263796 92014 -64637 -140949 -28101 -74226 -165598 -15875 -177381 29652 79392 207972
18414 207972 -127463 35279 306014 -267186 95137 -150668 -205054 194729 81878 90515 -158714
18402 29368 98890 -363550 -68727 12669 59253 -209241 39877 55708 -43511 190128 -356807
18390 -169632 -39346 82235 -42062 -72855 178074 -79212 -9410 126480 -110031 197441 156015
$$ packed form
18469i8754D154J61668b20096b9869l45874a3357j63187d0363A32708b26310Q9035
18458a37275l5343l15567a54418A87173i196j30252B64043b15203F9383K1603
18448I0986a70509a3930o2824b9301C3349c02290A07471C8513c04293b4359I6129
18436F1074h4281j78801a8400k29975j3625J11925M9843b533j83372f9476j94320
18425b63796I2014f4637p6312b8101m6125r1372a5875j61506B9652M9740J28580
18414B07972a27463C5279K70735b67186I5137a50668n4386A94729H1878Q637a58714
18402B9368O9522c63550f8727A2669M6584b09241C9877J5831d3511A90128c56807
18390a69632c9346H2235d2062l0793A78074g9212i410A26480a10031A97441m1426
$$ plain form
18379 156015 216230 -207766 -256239 -43662 -34400 53625 -76140 -18590 84775 -124684 -220539
18368 -220539 -81979 442426 82876 -33388 144002 -209928 125630 -113251 257196 -102532
18357 77330 39627 -66736 -15406 141327 -143296 -130721 203887 -123537 -241081 -424677
18347 -424677 -185856 -30291 -107540 -28055 -81371 -309491 10958 -56861 19520 362563 91510
18335 124785 160676 -14725 163713 108721 -52771 3059 -91912 307567 27029 -30260 46541
18323 -5183 158690 46672 153446 510580 -291868 -394847 15319 81028 178627 -132123 -188828
18312 -188828 140092 17556 3099 -404706 232611 274723 -74470 106132 143388 -165656 12355
18300 -1559 -192847 -169679 -27207 126972 12727 30478 -136284 -225614 -78800 190823 166081
$$ packed form
18379A56015O0215b07766m8473d3662R262E3625g6140a8590H4775a24684r5855
18368b20539h1979D42426H2876c3388A44002b09928A25630a13251B57196a02532
18357G7330l7703f6736a5406A41327a43296J2575B03887a23537j17544j83596
18347d24677a85856c0291p7249b8055n3316k28120A0958e6861A9520L43043I1510
18335A24785L5891a4725A63713n4992e2771C059i1912C07567B7029c0260D6541
18323e183A58690D6672J06774L57134b91868j02979A5319O5709R7599a32123n6705
18312a88828A40092A7556C099d04706B32611M2112g4470A06132L7256a65656A2355
18300a559j91288K3168b7207A26972A2727J7751a36284q9330g8800A90823k4742
$$ plain form
18289 166081 -325935 -281727 -57259 -46861 86126 -87522 159402 -30144 83133 153979 184973
18278 184973 -136125 167215 65500 243562 -239651 60001 -13706 90772 -342142 80555
18267 -220841 -111250 -184296 -63673 -186093 -157640 -45086 -62673 -89279 138589 -247873 -4889
18255 -459570 -141903 -194638 141208 -26219 96089 89703 178516 259624 257874 171477 -55393
18243 -7716 -67244 -262951 -197299 167996 -14829 10555 -110681 -12341 529982 -316707 41327
18231 41593 54889 59798 -295111 154721 -433665 -15309 -74844 32370 5122 -98286 71765
18219 -139225 -217669 22462 -76461 -10430 146916 287166 -88307 130435 7768 52285 171193
18208 171193 174028 -177810 -359302 -45891 -33414 170644 -218447 -33129 -263280 -70005 -200521
$$ packed form
18289A66081c25935M4208e7259J0398H6126h7522A59402c0144H3133P0846L0994
18278A84973a36125A67215F5500J78062b39651F0001a3706I0772c42142H0555
18267b20841J09591p3046f3673j22420K8453d5086j7587k6606A38589b47873d889
18255d59570a41903n2735A41208b6219I6089o386Q8813Q1108j750q6397e5393
18243g716n9528j95707O5652A67996a4829A0555a10681a2341E29982c16707D1327
18231D1593J3296M909b95111A54721d33665a5309n9535C2370E122i8286G1765
18219a39225p8444B2462g6461a0430A46916J40250h8307A30435G768M4517J18908
18208A71193K835a77810j81492d5891J2477A70644b18447c3129k30151g0005j30516
$$ plain form
18197 -200521 -330757 198981 -56130 104315 -159808 116166 -171070 154106 58615 -174062
18186 -105771 395043 61764 -66618 -88462 55621 121607 68524 -400584 32188 9099 -34965
18174 88733 -61422 -126224 -85214 -171035 -344904 -106188 171422 -17347 -261369 -248601 171123
18162 67197 129051 90829 178439 -41748 -61928 -175577 202749 39563 -125521 -16305 -128870
18151 -128870 68360 -99351 20060 222535 -23202 -135877 -37539 183042 -244684 24672 -339564
18139 -102721 -36621 30207 130491 24978 13534 -16876 -396572 217484 -113734 117968
18128 37592 -42019 -8634 -158072 172165 -75288 -83393 -48712 -9256 -222555 -16973 296046
18116 15066 -30318 -131812 101115 -3459 15436 -113879 -70984 64612 -33698 225300 -23316
$$ packed form
18197b00521j30236A98981e6130A04315a59808A16166a71070A54106E8615a74062
18186a05771C95043F1764f6618k1844E5621O5986n3083d00584C2188I099c4965
18174H8733f1422o4802M1010q5821j73869a06188A71422a7347k44022J2768A71123
18162F7197O1854l8222Q7610d1748k0180j13649B02749C9563a25521a6305j12565
18151a28870F8360i9351B0060K02475b3202j12675c7539A83042b44684B4672c39564
18139a02721c6621C0207J00284B4978j1444a6876l79696B17484a13734A17968
18128C7592d2019h634j49438A72165g5288q105L4681i256k13299a6973B96046
18116A5066c0318j01494A01115c459A5436a13879M2895F4612c3698B25300b3316
$$ plain form
18104 -161880 -137282 -48634 -102067 -42390 -199506 -324237 -296175 -110401 -234809 -694 468241
18092 48439 -293075 -30099 -24999 -153840 -79829 -205245 -290966 -106510 -214071 -77785 -44151
18081 -44151 11252 87655 -127811 120370 -131170 -205187 203087 -12564 54268 -158462 -347319
18070 -347319 -147133 -19435 110125 -147638 -22993 -156089 -99691 230945 -230754 229362
18059 68989 -159699 -68978 222739 -125142 -191988 54039 -172398 63402 123995 135785 40033
18047 67794 103964 5750 101050 -279716 -141021 -151678 -203925 10624 19781 -130160 42631
18035 109910 -7848 110253 105201 34775 102264 81561 -294122 94038 176344 -62185 -200959
18024 -200959 -287746 76140 -139237 -90342 -64000 217847 115328 -151760 -61622 -346687
$$ packed form
18104a61880K4598d8634n3433d2390j57116j24731K8062a10401j24408f94D68241
18092D8439b93075c0099N100j28841P4011j25416q5721a06510j07561g7785L3634
18081d4151A1252P6403a27811A20370a31170p4017B03087a2564E4268a58462j88857
18070c47319a47133a9435A10125a47638b2993j33096N6398B30945b30754B29362
18059F8989a59699f8978B22739a25142o6846E4039a72398F3402O0593J1790D0033
18047F7794L6170E750R5300b79716J38695j0657n2247A0624R157a30160D2631
18035A09910g848A10253n052C4775O7489k0703b94122I4038Q2306f2185j38774
18024b00959q6787G6140a39237M8895K6342B17847j02519a51760f1622k85065
$$ plain form
18014 -346687 113824 -302672 -149224 274809 -11602 66718 -238543 -66649 -5287 163496
18003 -223091 127853 -44444 -314199 -35960 17503 70070 -60330 22638 -216876 94892 -209148
17991 -55584 -262783 -218083 106481 19883 -82579 84820 155292 -10860 -237572 -78963 63127
17979 -166674 278633 -199271 56208 -125875 -214874 207847 -152439 -244815 -329404 218251
17968 -127629 -12813 -87769 313655 14008 -142705 4427 -178296 -8590 27717 -165203 -143210
17957 -143210 148340 -21173 57844 59671 -218241 -28790 -66643 -172468 -281791 -95888 146631
17945 31258 -152798 116195 -135891 264042 23717 -86552 81460 46757 -148895 52355 -163203
17933 -177529 -3127 223168 46158 -8212 112581 8718 256413 69117 176138 141081 -89835
$$ packed form
18014c46687A13824c02672a49224B74809a1602F6718b38543f6649e287A63496
18003b23091A27853d4444k69755c5960A7503N2567f0330B2638b16876I4892b09148
17991e5584k07199M4700A06481A9883h2579H4820P0472a0860k26712g8963F3127
17979a66674B78633a99271E6208a25875q8999B07847a52439r2376q4589B18251
17968a27629a2813p4956C13655A4008a42705D427a78296h590B7717a65203K1993
17957a43210A48340b1173E7844J827b18241b8790l7853j05825j09323i5888A46631
17945C1258a52798A16195a35891B64042B3717h6552H1460l4703a48895E2355a63203
17933a77529c127B23168D6158h212A12581H718K47695F9117J07021l5057h9835
$$ plain form
17921 -198776 56786 -80517 306304 -68415 281545 -21558 361419 -176794 -1279 -292378 128153
17909 107678 158265 -95282 -219499 135299 165549 97765 -58151 8382 30455 119131 146706
17898 146706 -194163 -101427 201013 -173272 -344040 2384 26516 -2333 231712 158909 -156342
17886 312097 -270597 132577 -139947 36485 161997 -98957 63849 -172692 -325133 33882
17875 -41997 -57860 134092 -16479 -167612 16007 -10459 -351429 -8927 44817 75805 -285377
17863 -154301 -304731 -24659 -226280 -36451 214714 111269 -65874 260503 -150169 78755
17852 108830 -222666 227500 -7978 -1874 133568 58048 94610 49590 237866 101845 -74888
17840 -95045 -198839 219945 -16977 337937 312667 63008 258376 176951 127403 -85346 23549
$$ packed form
17921a98776E6786h0517C06304f8415B81545b1558C61419a76794a279k91099A28153
17909A07678N0587i5282j24217A35299L0250o7784e8151H382K2073Q8676K7575
17898A46706a94163R2736B01013a73272j70768B384K4132b333B31712p2803a56342
17886C12097b70597A32577a39947C6485J25512i8957F3849a72692j52441C3882
17875d1997j5863A34092a6479j51133A6007a0459l40970h927D4817L0988b85377
17863a54301j50430b4659k01621c6451B14714j03445f5874B60503a50169G8755
17852A08830b22666B27500g978a874A33568E8048L6562m5020J88276A01845g4888
17840i5045j03794B19945a6977C37937k5270F3008J95368q1425m9548h5346B3549
$$ plain form
17828 38414 -319604 -173473 -96910 304721 113905 -1492 33878 -21631 -22588 23093 -297719
17816 -92743 216742 -441005 36608 69183 340568 5188 63909 -280847 408126 89970 438342
17805 438342 117825 -244275 -20515 -48168 298969 61973 -366355 122736 -138024 102969
17794 117348 39824 75646 -233079 12626 -165649 35408 90027 139204 -144931 421872 59163
17782 157993 -322295 4794 43228 -158190 126750 71754 28129 -64994 -107861 87760 183092
17771 183092 150222 42390 -148904 130015 199228 153015 -205069 4502 -140558 250314 181483
17760 181483 130139 -184270 -62234 133930 -92507 222893 29760 -233934 81531 299191
17750 299191 -222670 799 15404 58099 70223 68430 107387 -34153 132416 -252258 -4458 -84787
$$ packed form
17828C8414c19604J46131P6563C04721A13905a492C3878b1631r57B3093b97719
17816i2743B16742d41005C6608L2575K71385E188N8721b80847D08126H9970L48372
17805D38342A17825b44275b0515k7653B98969F1973c66355A22736a38024A02969
17794A17348C9824L5822b33079A2626a65649C5408N4619M9177a44931D21872E9163
17782A57993c22295D794L8434a58190A26750n4996B8129f4994m2867H7760R5332
17771A83092l2870D2390a48904A30015O9213m6213b05069D502a40558B50314o8831
17760A81483n1344a84270f2234A33930i2507B22893B9760b33934H1531K17660
17750B99191b22670G99J4605M2695J2124j793L8957c4153A32416b52258d458q0329
$$ plain form
17738 -84787 96575 -194650 142977 -43006 166422 -118761 -114829 93805 184629 -187862 24169
17726 -142679 28177 163412 -243372 72195 -167683 -339683 148741 -173680 20916 22874
17716 22874 22229 -110295 -196731 -122557 263186 -154248 -252559 -164988 -59702 -279921 216393
17704 -117721 72874 -179356 -432801 21415 80316 -198459 110903 96411 -16013 -60298 -57653
17693 -57653 55442 124563 -49585 97219 148225 -4457 91765 -149644 -225244 3960 256405 49844
17680 306131 136448 108613 -25624 -54334 -43257 315405 -112533 -174231 141589 -14366 155303
17668 -215327 -11525 -329227 223751 82413 272215 122346 67206 192154 -158498 205182
17657 102865 41677 12275 -144236 363026 -143094 -216082 391519 243400 -13260 -79054
$$ packed form
17738h4787I6575a94650A42977d3006A66422a18761L932I3805R0824a87862B4169
17726a42679B8177J35235b43372G2195a67683j72000A48741a73680B0916J958
17716B2874o45a10295q6436P4174B63186a54248r8311Q7571e9702k20219B16393
17704a17721G2874a79356k53445B1415N8901a98459A10903j4492a6013m4285K645
17693e7653E5442O9121d9585I7219N1006d457I1765a49644p5600C960K52445D9844
17680C06131A36448k7835b5624k8710J1077C15405a12533o1698A41589a4366A55303
17668b15327a1525l17702B23751H2413J89802A22346n5140J24948a58498B05182
17657A02865D1677A2275a44236C63026a43094p2988C91519j48119a3260o5794
$$ plain form
17647 -79054 87562 286706 31687 -60254 245446 -79162 90278 -77264 -32258 -171639 15598
17635 402563 336950 281679 -6067 111297 311242 -222338 358245 -11927 -127498 187093
17624 915 393618 92204 16957 108604 84203 100441 213223 90209 146105 -96107 73320 110301
17612 110301 -128440 -11805 -104052 -411966 202524 9822 196285 -2554 227819 216131 -408778
17600 -29110 106410 -172441 -14028 400618 -58321 127607 183729 -155801 -191804 -91730 62598
17588 36735 21707 9782 -163387 -160201 -191992 75500 -306799 163383 100061 -144158 55592
17576 -156981 34729 -96858 32582 15926 4576 68578 149849 140941 89078 265135 -92350 169742
17563 164265 44733 -60146 315737 -127307 -49893 -191028 162436 -110940 -48982 93799
$$ packed form
17647g9054H7562J99144C1687f0254B45446g9162I0278g7264c2258j39381A5598
17635D02563o5613n5271f067A11297J99945b22338C58245a1927j15571A87093
17624I15L92703I2204A6957R1647k4401J6238J12782I0209N5896i6107G3320L6981
17612A10301a28440a1805r2247l07914B02524I822J86463b554B27819j1688d08778
17600b9110A06410a72441a4028D00618e8321A27607N6122a55801l6003i1730F2598
17588C6735j5028I782a63387L186l1791G5500c06799A63383o3322a44158E5592
17576a56981C4729i6858C2582A5926D576O4002Q1271q908n1863J76057i2350A69742
17563A64265D4733f0146C15737a27307d9893j41135A62436a10940d8982I3799
$$ plain form
17552 -39495 -84162 -121770 181877 136065 269997 383307 293855 122277 -281877 337960
17541 -119292 -306664 183913 312319 -32993 179862 179598 21194 233695 95482 -14678 363262
17529 250820 -174469 -88630 -179980 120121 -94704 -188791 173960 -219823 77895 105996 -146149
17517 126037 392429 -250250 -124513 32475 108797 -31333 113685 79327 162508 -86231 -43500
17506 -43500 287501 141433 123098 -206353 75650 247122 206902 -39703 -156688 -107269 169214
17494 129332 -7998 81282 85435 170720 -288115 68646 555824 180442 211819 -76564 98617
17482 457594 287215 41227 101807 20266 264082 -100012 -215179 207886 -192086 256473
17471 337919 233846 4284 289236 167576 149698 298692 378935 126211 -12000 203635
$$ packed form
17552c9495m4667l7608A81877m5812J33932J13310q9452A22277b81877C37960
17541a19292j87372A83913J28406c2993A79862k64B1194K12501I5482a4678C63262
17529B50820a74469Q5839r1350A20121i4704r4087A73960b19823G7895K8101a46149
17517A26037K66392b50250a24513C2475P6322c1333A13685l4358Q3181h6231M2731
17506d3500B87501A41433j8335b06353G5650J71472m0220c9703j16985M9419A69214
17494A29332g998H1282M153Q5285b88115F8646M87178A80442L1377g6564I8617
17482D57594j70379D1227O0580B0266K43816a00012j15167B07886a92086B56473
17471C37919j04073D284K84952j21660j7878J48994Q0243A26211a2000B03635
$$ plain form
17460 95998 -2436 142996 100984 -22718 -154177 294401 161841 142483 19966 360167 251027
17449 251027 100166 317212 377921 414581 298992 -47220 338674 330071 97552 371555 -87145
17437 259502 101617 23509 202944 159053 110454 87237 129113 -62641 223412 13885 148338
17426 148338 399487 206041 346544 172050 582800 330943 70686 108917 246808 242673
17416 242673 274827 304697 191645 364798 101985 -104966 211959 210213 -2675 190730 4092
17404 -111204 282180 17073 247539 198532 246000 71122 206026 289955 275350 -76695 401072
17392 324361 286101 233745 215336 351208 -161261 -131328 173052 220263 148839 345222 298682
17381 298682 10131 148680 -13193 153635 189888 78752 -46276 145608 400277 -103555
$$ packed form
17460I5998b436A42996m2012b2718j31459B94401j32560j9358A9966L40201j09140
17449B51027A00166K17046O0709L6660j15589d7220C38674q603I7552K74003h7145
17437B59502A01617B3509J79435m3891m8599k3217M1876f2641B23412A3885J34453
17426A48338K51149j93446J40503A72050M10750k51857G0686L8231J37891m135
17416B42673L2154K9870j13052J73153A01985a04966B11959j746b675A90730D092
17404a11204B82180A7073K30466m9007M7468G1122J34904Q3929j4605g6695D01072
17392C24361l8260n2356j8409J35872a61261K9933A73052M7211p1424J96383m6540
17381B98682A0131J38549a3193A53635L6253G8752d6276A45608K54669a03555
$$ plain form
17370 151052 -115381 207295 -234059 186243 100081 67389 -28256 377391 363577 237889
17360 237889 213379 120105 291515 64421 218494 381464 -148565 240374 308437 -105336
17349 122294 150088 261957 191830 250198 494899 147800 132372 -45555 255382 233193 -3363
17337 -69864 432798 159442 -86844 56533 -71288 -20201 237813 357600 124362 495455
17327 495455 -287980 38223 200117 462229 289210 170555 -162805 470381 69788 72240
17317 72240 -54570 514235 163878 237772 -5231 100353 238683 64518 29339 343437 134044
17305 308947 358520 141342 135567 14225 152819 216074 23703 102418 325941 -70571 206132
17293 -161279 -140370 182444 193439 -87823 186841 291101 505221 242601 162396 272418
$$ packed form
17370A51052a15381B07295b34059A86243q6162l2692b8256C77391j3814j25688
17360B37889k4510r3274J71410F4421J54073J62970a48565B40374O8063a05336
17349A22294K7794J11869p0127N8368K44701A47800j5428d5555B55382k2189c363
17337f9864D32798A59442h6844E6533g1288b0201B37813J19787A24362L71093
17327D95455b87980C8223J61894K62112j73019j18655a62805D70381F9788K452
17317G2240e4570E14235A63878P3894e231A00353J38330F4518B9339L14098A34044
17305C08947M9573A41342n775A4225J38594O3255B3703P8715K23523g0571B06132
17293a61279K0909A82444J0995h7823A86841J04260K14120B42601q0205J10022
$$ plain form
17283 272418 183222 143824 224708 -17202 -25769 97220 235975 122295 148723 87549 504968
17272 504968 296495 69808 -202918 213201 434162 -84986 224825 92889 121023 128280 -82648
17260 55076 160645 -16021 195838 118855 89268 584233 522813 236849 254547 447440 428834
17249 428834 226114 409052 242271 367942 -503 103727 -75310 -44754 -9911 25381 6494
17237 363650 111993 -5243 131365 -159141 251508 -26172 256087 171971 399076 300323
17227 300323 131809 416393 293567 189581 180707 239101 -6093 409891 476786 316416 91654
17215 321628 220204 230468 322148 105121 196238 -6332 -70658 19600 134125 218733 137585
17204 137585 575780 443445 119654 177604 493847 183421 11571 331343 186726 121898
$$ packed form
17283B72418q9196l9398Q0884a7202q567I7220J38755j13680K6428o1174M17419
17272E04968k08473F9808b02918B13201K20961h4986B24825I2889K8134P257h2648
17260E5076J05569a6021A95838p6983k9587M94965o1420B36849J7698J92893j8606
17249D28834k02720J82938j66781J25671e03A03727g5310L0556i911B5381F494
17237C63650A11993e243A31365a59141B51508b6172B56087q4116K27105r8753
17227C00323A31809K84584j22826j03986q874N8394f093D09891O6895j60370I1654
17215C21628j01424J0264R1680A05121R1117f332o4326A9600J14525Q4608q1148
17204A37585M38195j32335A19654N7950L16243A83421A1571L19772j44617o4828
$$ plain form
17194 121898 430452 372425 -150558 217471 220257 364189 360902 565925 198496 399908
17184 399908 459902 78677 358734 415750 252032 188198 632147 -22514 -7832 390948 481363
17173 481363 416206 384871 -81311 24678 169904 311265 566157 139268 370335 565598
17163 565598 210197 -78716 487805 188835 128864 -39074 111970 -38899 157582 519783
17153 519783 290950 228102 371297 158630 222985 209165 399504 170994 458748 -117247
17142 509573 175161 135432 514598 219530 252519 182533 108442 523391 325967 364674
17132 364674 93930 429134 224418 364757 641948 353851 482606 412095 237942 165181
17122 165181 371651 11264 616238 121193 217328 699941 289021 463293 15323 292935
$$ packed form
17194A21898L08554n8027a50558B17471K786J43932l287K05023A98496K01412
17184C99908N9994G8677K80057N7016j63718o3834M43949b2514g832C90948R0415
17173D81363o5157l1335h1311B4678J45226J41361K54892A39268K31067J95263
17163E65598B10197g8716D87805A88835n9971c9074A11970c8899A57582L62201
17153E19783k28833o2848J43195A58630O4355j3820J90339A70994K87754a17247
17142E09573A75161l9729L79166B19530L2989o9986p4091M14949j97424L8707
17132C64674I3930L35204k04716J40339K77191k88097J28755p0511j74153p2761
17122A65181K06470A1264O04974A21193R6135M82613B89021J74272A5323K77612
$$ plain form
17112 292935 476160 222622 504750 337662 -11637 308693 744885 377739 473670 282384
17102 282384 435045 -112774 656845 419935 464794 525980 439426 393415 252341 335188
17092 335188 189690 419479 403037 436277 514275 327320 189394 414119 231896 619903
17082 619903 309785 588105 192024 391049 468640 340901 385900 392665 552561 418485
17072 418485 551458 382155 237747 412723 381126 440324 264757 468802 433445 401655
17062 401655 239341 298782 317034 837880 417164 554212 565644 445777 360822 739177
17052 739177 315916 574080 408001 504660 486438 460011 481196 608634 731309 606640
17042 606640 382953 650617 490841 724000 821491 303147 403529 454454 636428 903043
$$ packed form
17112B92935J83225B22622K82128j67088a1637C08693M36192l67146R5931j91286
17102B82384J52661a12774F56845k36910M4859O1186q6554m6011j41074Q2847
17092C35188j45498K29789j6442L3240P7998j86955j37926K24725j82223L88007
17082F19903C09785K78320A92024J99025P7591j27739M4999O765J59896j34076
17072D18485J32973j69303j44408J74976l1597N9198j75567K04045l5357l1790
17062D01655j62314N9441J8252N20846D17164J37048J1432j19867q4955L78355
17052G39177C15916K58164j66079R6659j8222k6427K1185J27438J22675j24669
17042F06640k23687K67664j59776K33159R7491C03147J00382N0925J81974K66615
$$ plain form
17032 903043 406754 223231 432703 541700 459853 766066 724236 489026 374333 397528
17022 397528 760562 560370 630137 601885 622984 681260 563276 334064 896117 862982
17012 862982 851725 487795 395965 1068911 1065012 638139 925850 616214 572176 568371 874137
17001 874137 790412 843241 565487 809823 576200 880798 752860 1019486 681752 990694
16991 990694 630657 939646 800307 817236 464071 908090 579161 788573 889055 1000636
16981 1000636 602905 718211 1112965 1157551 706222 652633 825965 841617 1137227 783833
16971 783833 1003585 910793 790360 801909 822595 997704 719791 909182 689817 975103
16961 975103 845403 698040 823142 880596 1049763 859732 1183203 1045998 883423 652283
$$ packed form
17032I03043D06754j83523K09472J08997q1847L06213m1830k35210j14693K3195
17022C97528L63034k00192O9767k8252K1099N8276j17984k29212N62053l3135
17012H62982j1257l63930r1830O72946l899m26873K87711l09636m4038l805L05766
17001H74137q3725N2829k77754K44336k33623L04598j27938K66626l37734L08942
16991I90694l60037L08989j39339J6929l53165M44019l28929K09412J00482J11581
16981A000636l97731J15306L94754M4586m51329n3589J73332J5652K95610l53394
16971G83833K19752r2792j20433J1549K0686J75109k77913J89391k19365K85286
16961I75103j29700j47363J25102N7454J69167j90031L23471j37205j62575k31140
$$ plain form
16951 652283 717843 756519 1153412 990224 1046999 1112199 917582 1193989 927793 1154288
16941 1154288 935609 861687 1272990 914142 1495987 759239 1175117 1304505 1108002 1119761
16931 1119761 1463454 992027 1196855 1276415 1057968 1418035 1424135 1355300 1512543 1418568
16921 1418568 1434820 1559668 1315883 1443669 1431724 1778733 1610707 1372789 1210084 1480715
16911 1480715 1554116 1478034 1488737 1429679 1820343 1154974 1466150 1442649 1337808 1629582
16901 1629582 1518554 1701061 1571374 1586436 1365690 1664556 1839429 1776247 1677283 1781822
16891 1781822 1852898 1590982 1969387 1941620 1716924 1583256 1859866 1773168 2001182 1883288
16881 1883288 2037071 1793541 1993323 2050592 2259219 2291839 2086546 2129719 2088036 2308815
$$ packed form
16951F52283O5560L8676L96893j63188N6775O5200j94617K76407k66196K26495
16941A154288k18679p3922M11303l58848N81845p36748M15878J29388j96503J1759
16931A119761L43693m71427K04828P9560k18447L60067O100o8835J57243r3975
16921A418568J6252J24848k43785J27786j1945L47009j68026k37918j62705K70631
16911A480715P3401p6082J0703n9058L90664o65369L11176k3501j04841K91774
16901A629582j11028J82507j29687J5062k20746K98866J74873o3182r8964J04539
16891A781822P1076k61916L78405k7767k24696j33668K76610q6698K28014j17894
16881A883288J53783k43530J99782N7269K08627L2620k05293M3173m1683K20779
$$ plain form
16871 2308815 2236757 2165016 2361857 2481452 2451832 2164336 2385338 2422228 2565068 2555540
16861 2555540 2713549 2468353 2465121 2818275 2556118 2927421 2944180 2714111 2920681 2632633
16851 2632633 2930457 2567828 2868474 2706481 3008170 3142659 3045922 2963466 3188402 3241408
16841 3241408 3216442 3312043 3051299 3554900 3526737 3485495 3675479 3859623 3763166 3734418
16831 3734418 3895094 4357185 4091755 4093224 4114093 4283134 4420143 4411894 4252450 4557160
16821 4557160 4939481 4784985 4765815 4826117 5103922 5115445 5333831 5345138 5358316 5437417
16811 5437417 5650673 5761234 6098094 5744140 6258730 6427391 6341932 6264578 6720409 6671765
16801 6671765 7052806 7293470 7270803 7488738 7836260 8104908 7801472 8100434 8347654 8397346
$$ packed form
16871B308815p2058p1741J96841J19595k9620k87496K21002L6890J42840r528
16861B555540J58009k45196l232L53154k62157L71303J6759k30069K06570k88048
16851B632633K97824l62629L00646j61993L01689J34489r6737q2456K24936N3006
16841C241408k4966R5601k60744N03601k8163m1242J89984J84144r6457k8748
16831C734418J60676M62091k65430J469K0869J69041J37009q249j59444L04710
16821D557160L82321j54496j9170O0302K77805J1523K18386J1307J3178P9101
16811E437417K13256J10561L36860l53954N14590J68661q5459p7354M55831m8644
16801F671765L81041K40664k2667K17935L47522K68648l03436K98962K47220M9692
$$ plain form
16791 8397346 8648383 9119272 9346757 9697271 9486130 9951804 10184886 10627200 10623711 10885125
16781 10885125 11443197 11463596 12205762 12797642 13019429 13108465 13783902 13940975 14325755 15133276
16771 15133276 15564244 15989784 16189677 17206098 17493451 18490087 18686747 19539660 20065408
16762 20065408 20956989 21935238 22411775 23646725 24485543 25686469 26546491 27793030 28671752
16753 28671752 30283076 31712702 33072381 34509268 36156699 37954728 39492002 41737985
16745 41737985 43941570 46423439 48590127 51399167 54452711 57514751 60926844 64463530
16737 64463530 68072815 72329696 76721962 81588659 86615091 92145401 97856414 103862360
16729 103862360 110589658 117556962 124743217 132638751 140088072 148113692 155959103 163987133
$$ packed form
16791H397346K51037M70889K27485L50514k11141M65674K33082M42314l489K61414
16781A0885125N58072K0399P42166N91880K21787Q9036O75437J57073L84780Q07521
16771A5133276M30968M25540J99893J016421K87353R96636J96660Q52913N25748
16762B0065408Q91581R78249M76537J234950Q38818J200926Q60022J246539Q78722
16753B8671752J611324J429626J359679J436887J647431J798029J537274K245983
16745D1737985K203585K481869K166688K809040L053544L062040L412093L536686
16737F4463530L609285M256881M392266M866697N026432N530310N711013O005946
16729A03862360O727298O967304P186255P895534P449321Q025620P845411Q028030
$$ plain form
16721 163987133 171341832 178367690 183832617 189336802 193235629 195973279 197195695 196738884
16713 196738884 195338558 192271446 188396828 182983934 176708755 169827265 162293015 154079521
16705 154079521 146325073 138605973 130494959 122698045 115457646 108682688 101441213 95544223
16697 95544223 89855645 84129258 79049108 74170034 69465138 65744248 61694646 57800261
16689 57800261 54969124 52277616 49343652 46317672 44328620 41402324 39502321 37180302
16681 37180302 35717966 33537873 32397895 30363151 29318626 28216622 26471116 25624592
16673 25624592 24404109 23219683 22182681 21414265 20700106 19700540 18943503 18309149 17573973
16664 17573973 17007234 16152795 15782475 15034243 14839208 14187124 13656994 13044213 12917728
$$ packed form
16721A63987133P354699P025858N464927N504185L898827K737650J222416m56811
16713A96738884j400326l067112l874618n412894o275179o881490p534250q213494
16705A54079521p754448p719100q111014p796914p240399o774958p241475n896990
16697I5544223n688578n726387n080150m879074m704896l720890m049602l894385
16689E7800261k831137k691508k933964l025980j989052k926296j900003k322019
16681C7180302j462336k180093j139978k034744j044525j102004j745506q46524
16673B5624592j220483j184426j037002p68416p14159r99566p57037o34354p35176
16664A7573973n66739q54439l70320p48232j95035o52084n30130o12781j26485
$$ plain form
16655 12917728 12290808 12071084 11293290 11066391 10951038 10676030 10239634 9957604 9567188
16646 9567188 9111906 9393616 9053320 8440193 8305629 8327199 7972417 7617303 7776844 7353362
16636 7353362 7024581 7065610 6983342 6433173 6280152 6385794 6224766 5975700 5754406 5753668
16626 5753668 5712169 5259587 5383122 5422684 5165846 5117603 4899122 4820247 4837188 4351264
16616 4351264 4684801 4568448 4307287 3928457 4251700 3928624 3928155 3992290 3818098 4137349
16606 4137349 4064812 3900050 3628821 3709926 3501167 3386024 3495230 3447750 3286699 3193151
16596 3193151 3219403 3095140 2938495 2897059 2830864 2888387 2822782 2510061 2943702 2640070
16586 2640070 2635468 2442112 2618191 2477173 2701874 2362636 2176206 2145411 2523620 2336501
$$ packed form
16655A2917728o26920k19724p77794k26899j15353k75008m36396k82030l90416
16646I567188m55282K81710l40296o13127j34564K1570l54782l55114J59541m23482
16636G353362l28781M1029q2268n50169j53021J05642j61028k49066k21294p38
16626E753668m1499m52582J23535L9562k56838m8243k18481p8875J6941m85924
16616D351264L33537j16353k61161l78830L23243l23076m69O4135j74192L19251
16606D137349p2537j64762k71229Q1105k08759j15143J09206m7480j61051r3548
16596C193151K6252j24263j56645m1436o6195N7523o5605l12721M33641l03632
16586B640070m602j93356J76079j41018K24701l39238j86430l0795L78209j87119
$$ plain form
16576 2336501 1918290 1987033 1849554 2186235 2387769 1964936 1977527 1624943 1757735 1871216
16566 1871216 1961471 1611179 2303403 1726932 1864844 1776122 1523509 1678648 1663060 1902043
16556 1902043 1289450 1549444 1812759 1647616 1618416 1277796 1435734 1590411 1447893 906705
16546 906705 1415494 1354422 1144103 1140548 1134714 1401036 1232346 1261897 1194085 1244786 1260391
16535 1260391 1196471 1010288 1216850 963956 736674 1027479 1240650 875050 1086218 1061022
16525 1061022 1181068 1149275 1008369 855140 1118619 1001534 952125 810677 793797 759891
16515 759891 823735 547615 882151 710096 705689 885287 825034 698453 1211183 1034922
16505 1034922 837696 752653 721519 732423 770181 821526 867400 650688 702969 827498 741992
$$ packed form
16576B336501m18211O8743j37479L36681K01534m22833J2591l52584J32792J13481
16566A871216R0255l50292O92224n76471J37912q8722k52613J55139j5588K38983
16556A902043o12593K59994K63315j65143k9200l40620J57938J54677j42518n41188
16546I06705N08789o1072k10319l555n834K66322j68690K9551o7812N0701J5605
16535A260391o3920j86183K06562k52894k27282K90805K13171l65600K11168k5196
16525A061022J20046l1793j40906j53229K63479j17085m9409j41448j6880l3906
16515G59891O3844k76120L34536j72055m407J79598o0253j26581N12730j76261
16505A034922j97226q5043l1134J0904L7758N1345M5874k16712N2281J24529q5506
$$ plain form
16494 741992 1109542 601230 500785 506427 757484 794376 606253 638420 743513 1072722
16484 1072722 673564 562277 839215 737315 517847 397997 1058520 690430 665231 885539
16474 885539 812670 506510 279433 536663 534886 750628 691164 576883 557413 475886 569407
16463 569407 524516 650632 435948 708342 360459 437889 430403 355971 447854 550779 326542
16452 326542 341940 443687 352839 650705 125035 162121 436630 565428 465145 361617
16442 361617 347733 353818 430540 706643 663452 403778 125273 939866 434075 506679 573049
16431 573049 437113 438791 385934 387804 461232 146444 255794 426693 304816 426295 502310
16420 502310 408466 95229 313267 123082 311566 353152 645331 554996 -46510 186332
$$ packed form
16494G41992L67550n08312j00445N642K51057L6892j88123L2167J05093L29209
16484A072722l99158j11287K76938j01900k19468j19850O60523l68090k5199K20308
16474H85539p2869l06160k27077K57230j777K15742n9464j14281j9470q1527R3521
16463E69407m4891J26116k14684K72394l47883P7430p486p4432R1883J02925k24237
16452C26542J5398J01747r0848K97866A25035L7086K74509J28798j00283j03528
16442C61617j3884O085P6722K76103m3191k59674A25273Q14593D34075P2604O6370
16431E73049j35936J678n2857J870P3428A46444J09350J70899j21877J21479P6015
16420E02310r3844I5229K18038A23082J88484M1586K92179r0335d6510A86332
$$ plain form
16409 225656 408292 150958 -4748 24436 176763 201562 229484 172366 298647 -72826 370963
16397 92544 364731 309219 57603 273962 618738 312881 293511 32543 400071 309015 257131
16386 257131 206174 108460 336580 118826 20163 502395 4828 38292 140199 372328 -30884
16374 100397 100367 509510 -233537 326929 313460 11379 -43223 148304 10267 165745 482666
16363 482666 185374 508774 179650 116930 264320 116739 249619 174255 213014 585178
16353 585178 195488 252796 161942 124662 -11724 74958 243840 -81701 -36536 252781 -7320
16341 18787 -37884 28770 380727 -26350 25501 256620 423062 431645 357971 -488608 400756
16329 7227 88443 285000 232191 298158 521093 505537 -228012 -32960 24186 115988 321601
$$ packed form
16409B25656J82636A50958d748B4436J52327K4799K7922n7118J26281g2826C70963
16397I2544K72187n5512E7603K16359L44776l05857j9370C2543L67528r1056n1884
16386B57131n0957r7714K28120A18826B0163M82232D828L3464J01907K32129c0884
16374A00397l0M09143b33537C26929j3469A1379d3223A48304A0267J55478L16921
16363D82666A85374L23400A79650o2720J47390A16739J32880p5364L8759L72164
16353E85178A95488N7308r0854l7280a1724G4958J68882h1701c6536B52781g320
16341A8787c7884B8770L51957b6350B5501K31119J66442Q583p3674d88608D00756
16329G227Q1216J96557n2809O5967K22935j5556b28012c2960B4186R1802K05613
$$ plain form
16318 321601 -148135 69746 101862 185633 -110675 57410 570918 204855 100194 193134
16308 193134 224285 -79745 3726 -31636 193968 1340 266309 85568 28956 523643 75500
16296 163088 45772 -144168 326296 144348 -34582 -35097 84397 290799 22288 262443 -267083
16284 218769 -9002 43130 199075 64146 -47252 -294419 -6123 6502 176097 -52381 123362
16272 97774 175688 209379 71867 -203561 155860 428042 220930 91050 25374 -590 280463
16260 127037 256347 10283 126479 -109126 278425 -56784 108516 106268 130609 171075 -14
16248 49850 152496 111836 -391815 -9323 -19511 231209 264503 -205499 11749 333580 78072
16236 -164227 203190 19847 -157892 207600 15068 362071 77382 240931 -24019 89052
$$ packed form
16318C21601a48135F9746L2116Q3771a10675E7410N13508B04855A00194R2940
16308A93134L1151g9745C726c1636A93968A340K64969H5568B8956M94687G5500
16296A63088D5772a44168C26296A44348c4582n15H4397K06402B2288K40155b67083
16284B18769i002D3130J55945F4146d7252k47167f123F502J69595e2381A23362
16272I7774P7914L3691G1867b03561A55860K72182k07112I1050B5374e90B80463
16260A27037J29310A0283J16196a09126B78425e6784A08516k248K4341M0466a4
16248D9850J02646m0660c91815i323j0188B31209L3294b05499A1749L21831G8072
16236a64227B03190A9847a57892B07600A5068L47003G7382J63549b4019H9052
$$ plain form
16225 53539 -211182 15642 45848 -220150 -502648 113382 136160 -14208 83296 -132864 4444
16213 -13137 -1814 39854 197499 42045 73233 36368 -63464 -313830 540970 -303993 391382
16201 -56152 322387 171380 -294274 -139504 -134962 23252 -73621 -23159 253369 47415 -78493
16189 133714 -230710 -602616 -10825 -122797 157573 -77842 114769 41926 127411 -323444
16178 -27543 -417489 26772 31134 59415 -325167 191617 10202 53828 108340 -98119 -233100
16167 -233100 -33667 27161 67974 -92904 249797 -175959 19778 -482080 378003 -55879 -10413
16155 74891 48442 -258980 -69628 135416 101251 280556 284696 1714 -312938 126185 82142
16144 82142 -72129 103758 114537 -56042 303803 185283 -39086 -62273 139995 -101521 148309
$$ packed form
16225E3539b11182A5642L0206b20150k82498A13382K2778a4208H3296a32864D444
16213a3137a814C9854J57645D2045L1188C6368f3464k50366E40970c03993C91382
16201e6152C22387j51007b94274a39504M542B3252g3621b3159B53369D7415g8493
16189A33714b30710l71906a0825j11972A57573g7842A14769D1926Q5485c23444
16178b7543l89946B6772M362K8281c25167A91617A0202M3626N4512i8119j34981
16167b33100c3667B7161M0813i2904B49797a75959A9778d82080C78003e5879a0413
16155G4891k6449b58980f9628A35416l4165J79305M140A714c12938A26185m4043
16144H2142g2129A03758J0779e6042C03803j18520c9086k3187A39995a01521A48309
$$ plain form
16132 277532 -105339 82474 189240 235823 132522 305671 138479 -293448 285593 189508
16122 189508 322120 126872 145130 -61958 -85204 110875 243545 -111604 276335 -10430
16111 -82097 -114536 16325 103579 151631 -48251 10036 -105627 -249254 23825 260235 153039
16100 153039 -368054 99204 -198803 144415 -55919 -19018 24794 -51479 11251 134984 247138
16089 247138 -123131 -160958 253945 44401 -76671 -100354 -258880 -206953 236258 -142643
16078 109015 34542 64246 18090 -179427 236940 -482269 -224775 -177642 -295744 -109611
16067 -303343 -57432 -119659 257646 367153 -53253 -65134 117742 73174 107224 41359 79042
16056 79042 -209514 -225525 -126118 -249282 3164 -414367 -164501 -255355 56139 64443 -224947
$$ packed form
16132B77532a05339H2474J06766M6583j03301J73149A38479b93448B85593r6085
16122A89508J32612A26872J8258f1958k3246A10875J32670a11604B76335a0430
16111h2097l2439A6325Q7254M8052d8251A0036a05627j43627B3825K36410j07196
16100A53039c68054I9204a98803A44415e5919a9018B4794e1479A1251J23733J12154
16089B47138a23131l7827B53945D4401g6671k3683j58526N1927B36258a42643
16078A09015C4542K9704A8090a79427B36940d82269b24775M7133j18102a09611
16067c03343e7432o2227B57646J09507e3253j1881A17742m4568L4050D1359L7683
16056G9042b09514j6011R9407j23164C164d14367a64501r0854E6139Q304b24947
$$ plain form
16044 373239 14994 -160820 -293939 -389756 -16576 -59387 -111221 -150252 -7712 -68776 -252642
16033 -252642 10012 -306548 -8927 -468617 -62461 29139 -237295 -42542 -179564 241035 -196094
16021 117006 -144112 -67961 -3223 143597 318537 -149579 -65430 150740 -427280 -34629
16010 138389 335918 1311 -121848 130219 271277 80989 -354977 -10880 56116 -121482
15999 54918 -2903 193926 -27123 -165472 57746 61274 -177081 -368826 -149477 -323241 -49284
15987 -159024 44539 171034 -166093 -265837 239174 -158605 874831 270157 206909 372693
15977 372693 24654 341955 135253 197634 -126288 227009 -154540 -133306 -208355 267681
15966 88969 -85365 214892 177149 -241171 42364 221479 260623 198970 -102832 -348255 -215827
$$ packed form
16044C73239A4994a60820j33119r5817a6576m2811n1834l9031g712o1064j83866
16033b52642A0012c06548h927m59690f2461B9139b37295d2542j37022B41035a96094
16021A17006a44112f7961c223A43597J74940a49579f5430A50740d27280c4629
16010A38389J97529A311a21848A30219J41058H0989c54977a0880E6116a21482
15999E4918b903A93926b7123j38349E7746L528a77081j91745a49477j73764d9284
15987a59024D4539J26495a66093r9744B39174a58605H74831B70157o3248J65784
15977C72693B4654L17301A35253O2381a26288B27009a54540K1234p5049B67681
15966H8969h5365B14892l7743b41171D2364J79115L9144o1653a02832k45423J32428
$$ plain form
15955 -215827 -61559 104636 127321 -212177 97749 -198735 -204107 -408421 -284604 -104205
15944 19152 -315071 -188721 -139770 253655 87414 63121 122918 66511 -363251 274755 -170220
15932 43432 -480320 -69993 -286083 -33284 65001 246608 -150530 -2896 50670 -38391 -183374
15921 -183374 128236 140257 643 -69847 86681 23637 76857 -47469 -140494 -2020 -46140 -24988
15909 -24988 -204089 -196423 -142044 -141251 -49105 38535 19574 -11081 -302856 -378399 -125445 -212719
15897 -212719 191903 -299349 -17498 -95568 -295339 -66578 67596 -189521 127069 -21422
15886 199193 -44499 162003 372975 -277790 -218882 -42636 136215 -319129 -107454 190366
15875 90744 60962 -19593 25188 -41632 -195593 -485055 -387162 -40897 66209 162221 117686
$$ packed form
15955b15827f1559A04636K2685b12177I7749a98735n372k04314J23817a04205
15944A9152c15071J26350M8951B53655H7414k4293N9797n6407c63251B74755a70220
15932D3432d80320f9993k16090c3284F5001J81607a50530b896E0670c8391j44983
15921a83374A28236J2021F43f9847H6681B3637N3220d7469r3025b020m4120K1152
15909b4988j79101P666N4379P93d9105C8535j8961a1081k91775p5543a25445q7274
15897b12719A91903b99349a7498p8070j99771f6578F7596a89521A27069b1422
15886A99193d4499A62003K10972b77790N8908d2636A36215c19129a07454A90366
15875I0744k9782a9593B5188d1632j53961k89462R7893d0897F6209R6012m4535
$$ plain form
15864 117686 227130 -14803 -73288 -224423 279537 139207 82891 -48043 -260014 83595
15853 -61091 276 110140 -33068 -14574 96501 134463 -420961 51067 86812 -14386 -68532 113272
15840 -309898 -7878 -74573 -40380 106799 60507 -226112 140224 5015 -80968 -249299 -275969
15829 -275969 -298527 -2722 -134100 409070 45807 -574604 -84060 -124585 -79236 -175546 -481972
15818 -481972 -287351 1159 -63105 -8430 -234025 -54575 167462 423426 -186838 -170992 -152946
15807 -152946 -212627 45026 -150390 213279 -144653 252849 137339 -61281 -121642 -62292
15797 -62292 64882 189812 -73105 187260 -241760 202444 -50239 -18198 -363061 63582 480515
15786 480515 -291294 -276602 257187 85903 426241 -63642 83568 55359 16649 37495 -12403
$$ packed form
15864A17686J09444a4803n8485j51135B79537A39207n6316d8043k11971H3595
15853f1091B76J09864c3068a4574I6501L7962d20961E1067L5745a4386n4146A13272
15840c09898g878o6695L4193A06799m6292b26112A40224E015h0968j68331k6670
15829b75969k2558b722j31378D09070D5807e74604h4060m0525M5349r6310l06426
15818d81972J94621A159f3105h430k25595e4575A67462K55964a86838J5846J8046
15807a52946n9681D5026a50390B13279a44653B52849j15510f1281o0361N9350
15797f2292F4882J24930g3105A87260b41760B02444e0239a8198l44863F3582M16933
15786D80515b91294J4692B57187H5903L40338f3642H3568k8209A6649K0846a2403
$$ plain form
15774 109456 -66141 -11597 71498 -146245 -40719 -100586 -33162 39414 -124976 -132708 142214
15762 -7117 -223122 41095 317898 -268408 293385 73518 90585 -7552 110041 56463 -96243
15750 72318 11282 167204 -355495 674 -47541 121964 -99448 175672 269124 368991 179036
15738 141686 115381 -38384 -200262 83511 31603 -189609 137044 109792 -117479 107467
15727 195885 -233816 -10482 147938 -328430 -74249 -307506 249363 170152 9221 -158231
15716 114464 -185293 -43657 143872 -60125 72794 -4027 100220 31505 -32 -31144 -14522 -73791
15704 -73791 71161 128497 163751 -41380 -33508 105190 165777 -16513 34156 -140044 222724
15692 -109067 -239496 -188759 -272000 11833 -2736 17825 -123427 246088 -84899 31305 250618
$$ packed form
15774A09456f6141a1597G1498a46245d0719n9867c3162C9414a24976p732A42214
15762g117k16005D1095K76803b68408B93385G3518J7067g552A10041n3578i6243
15750G2318A1282J55922c55495F74d7541A21964i9448A75672R3452R9867A79036
15738A41686k6305c8384j61878H3511C1603a89609A37044k7252a17479A07467
15727A95885b33816a0482A47938c28430g4249k33257B49363p9211I221a58231
15716A14464a85293d3657A43872f0125G2794d027A00220C1505c2l1112a4522n9269
15704g3791G1161N7336L5254d1380P872A05190O0587a6513C4156a40044B22724
15692a09067j30429N0737q3241A1833b736A7825a23427B46088h4899C1305K19313
$$ plain form
15681 250618 -195512 -295548 27513 -8964 -241145 -127336 105367 -190850 181788 -81653
15670 -23124 -56219 -236758 124908 230308 43634 3444 409121 -40293 166445 -128225 143286
15658 63572 -56593 61818 43688 -270813 -142043 -278767 67521 -263658 -91033 -42789 308420
15646 195396 115781 -64307 -34029 104854 65698 -100259 -164834 -108239 -133696 98174 -307038
15634 -166366 172790 -198703 53025 -124987 105096 157042 170919 -232551 -111034 -63826
15624 -63826 99047 -34191 -221978 -10413 -303691 219812 96629 -71697 -114290 35780 -267565
15612 262495 -103646 -85675 89082 -236019 -185746 -96737 -69228 -167848 259826 50577 5575
15600 -430465 -584944 -393384 -373305 -43686 87535 -257031 219865 -53592 155069 -184877
$$ packed form
15681B50618a95512j00036B7513h964k32181J13809A05367a90850A81788h1653
15670b3124l3095j80539A24908J05400D3634C444M05677d0293A66445a28225A43286
15658F3572e6593F1818j8130b70813J28770j36724F7521b63658i1033d2789C08420
15646A95396p9615f4307L0278A04854l9156a00259o4575N6595k5457I8174c07038
15634a66366A72790a98703E3025a24987A05096N1946J3877b32551a11034M7208
15624f3826I9047c4191j87787a0413k93278B19812I6629g1697m2593C5780b67565
15612B62495a03646J7971H9082b36019N0273Q9009K7509r8620B59826E0577E575
15600d30465j54479J91560K0079d3686H7535b57031B19865e3592A55069a84877
$$ plain form
15589 -185084 131775 -162965 -179681 -226363 -57963 247774 -100531 -152185 250880 128541
15579 128541 -5797 10038 108211 2691 -21298 -129434 220046 -129694 113608 -49078 150457
15567 -113556 201920 44967 243691 -195004 35917 -103179 -494296 116869 -62298 -119344
15557 -119344 -13991 -6956 287416 -151403 -232999 -99699 48690 37437 21857 230710 -244147
15545 -169809 -69428 -14286 141050 14921 319781 142371 -61112 175164 255933 117742
15534 43736 141444 -91155 -337128 -52707 -99940 257438 -15415 -64141 -193681 -191774 145778
15522 -39048 182249 30427 81863 40826 -47759 -111038 -593870 -64349 -165017 87368 13295
15510 -254196 13048 13555 -180064 -4671 -31327 -9007 -218310 -124452 -127035 35073 99892 -130832
$$ packed form
15589a85084A31775a62965j6716m6682e7963B47774a00531n1654B50880j22339
15579A28541e797A0038R8173B691b1298j08136B20046a29694A13608d9078A50457
15567a13556B01920D4967J98724a95004C5917a03179l91117A16869f2298n7046
15557a19344a3991f956B87416a51403q1596i9699D8690j1253j5580K08853b44147
15545a69809f9428a4286A41050A4921L04860A42371f1112A75164Q0769A17742
15534D3736R7708i1155k45973e2707m7233B57438a5415m8726j29540J907A45778
15522c9048A82249C0427N1436D0826d7759o3279m82832f4349j00668H7368A3295
15510b54196A3048N07a80064d671k6656i007k09303R3858k583C5073O4819a30832
$$ plain form
15497 -159463 -29921 -184081 140344 18788 90340 -335266 -101890 -169270 77735 -201657
15486 329153 -123598 -76065 173008 244032 -112821 -208641 186618 -112564 -140502 11546
15475 -20578 -45262 83552 141760 196794 329752 212084 90052 -19372 -66821 -76182 -43645
15464 -43645 108813 -33962 -458568 141989 28212 -40382 -10621 -120880 -88727 92679 201438
15453 201438 408612 -189148 -74133 32906 -175639 -398553 7848 226174 68609 -91102 283834
15441 -144636 -185915 154683 -1808 134842 135167 168655 212694 -144393 101633 49080 -110531
15429 -135285 19510 142013 -230705 379088 -135091 -405906 -230438 13849 -122072 170707
15418 209420 -61762 -11976 -75475 1673 -69142 -9892 -341279 67259 191994 -25990 -62561
$$ packed form
15497a59463b9921j54160A40344A8788P1552c35266a01890o7380G7735b01657
15486C29153a23598M7533A73008P1024a12821r5820A86618a12564k7938A1546
15475b0578k4684H3552N8208N5034J32958j17668I0052a9372m7449r361L2537
15464d3645A08813c3962m24606A41989B8212d0382a0621j10259L2153I2679J08759
15453B01438K07174a89148g4133C2906a75639k22914G848K18326F8609i1102B83834
15441a44636m1279A54683a808A34842L25L3488M4039a44393A01633D9080a10531
15429a35285A9510J22503b30705C79088a35091k70815J75468A3849a22072A70707
15418B09420f1762a1976o3499A673f9142i892l31387F7259J24735b5990l6571
$$ plain form
15407 -62561 133273 -55085 158835 -187724 -174848 30422 -224234 3117 141610 203942 -75077
15395 30243 -14062 114042 262552 -26390 12771 -37471 75257 -132694 -69989 122984 -135309
15383 240902 201138 -155991 29414 -244465 -160608 -32633 93200 -73453 16749 -74809 -116756
15372 -116756 -259391 -290524 82700 47466 -349711 195350 -50129 -6775 -47618 105662 297461
15361 297461 -217121 23043 -21421 -14415 177440 -103360 168045 -143943 -205618 12353 218585
15350 218585 31792 118882 -13582 26341 -172805 -173029 177977 42726 -106872 232035 32266
15338 -66104 -125590 111288 -230147 385839 275355 -106635 -252083 -52135 1388 169146
15328 169146 -32225 42416 -187881 -269662 388632 -100424 146069 -90374 58583 -430480
$$ packed form
15407f2561A33273e5085A58835a87724J2876C0422b24234C117J38493O2332g5077
15395C0243a4062A14042J48510b6390A2771c7471G5257a32694O2705A22984a35309
15383B40902l9764a55991B9414b44465Q3857c2633I3200g3453A6749g4809m1947
15372a16756j42635l1133H2700l5234c49711A95350e0129f775m0843A05662J91799
15361B97461b17121B3043b1421P006A77440a03360A68045a43943o1675A2353K06232
15350B18585C1792Q7090a3582B6341a72805k24A77977D2726a06872B32035C2266
15338f6104n9486A11288b30147C85839j10484a06635j45448e2135A388J67758
15328A69146c2225D2416a87881q1781C88632a00424A46069i0374E8583d30480
$$ plain form
15317 -37152 -206239 -97231 138224 247451 86276 46125 248453 313261 72680 290755 97235
15305 -105155 -47335 -72919 127257 47863 108474 -32143 -249557 -156723 336718 -110147 197835
15293 120230 148130 -139336 141357 -7375 147502 -80130 -319712 -215116 -346252 319491
15282 -166911 -66444 -67024 44562 -33603 18330 -94324 185984 218190 -112394 114857 -203487
15270 154227 -169844 99437 121465 -212351 283008 -87932 246134 -20731 39313 -79810 260953
15258 48236 -34840 -12286 147161 -38834 131882 497511 192633 -11179 207212 69098 572798
15247 572798 847951 1464566 1459332 1168209 1114680 304943 369464 333889 225584 62039 292281
15236 292281 -168784 -74002 103103 113150 -147189 -78481 177934 218597 212748 -106498 -289349
$$ packed form
15317c7152j69087i7231A38224J09227H6276m0151K02328O4808G2680K18075I7235
15305a05155d7335k5584A27257D7863O0611c2143k17414R2834C36718a10147A97835
15293A20230K7900a39336A41357g375A47502h0130k39582J04596j31136C19491
15282a66911f6444n80D4562c3603A8330i4324A85984L2206a12394A14857b03487
15270A54227a69844I9437K2028b12351B83008h7932B46134b0731C9313g9810B60953
15258D8236c4840a2286A47161c8834A31882L65629A92633a1179B07212F9098N03700
15247E72798K75153O16615n234k91123n3529C04943O4521l5575j08305F2039K30242
15236B92281a68784g4002A03103J0047a47189O8708A77934M0663n849a06498j82851
$$ plain form
15225 -289349 -169600 -41546 338871 162594 193714 -73710 193359 -236867 70860 -108939
15214 -289293 -9503 244262 33329 -107236 321815 326082 17107 343415 -34806 -122175 -25715
15202 -4349 -71369 406498 323591 -60938 231418 30960 8364 -500 286866 -174634 347717
15190 114437 -76101 373724 286042 34060 21397 164401 240951 180985 83187 172725 137407
15179 137407 -87564 -214357 300296 340191 205628 -213876 -191048 58159 -99010 -209655
15169 -209655 -10644 302449 172532 37025 78218 169842 267025 -86928 418860 84318 389935
15158 389935 109669 -45535 157536 -148523 271259 160915 165705 258710 -62995 -198598
15148 -198598 48698 -45248 473063 556860 480838 5143 -380492 212387 88982 79866 -8184
$$ packed form
15225b89349J19749d1546C38871A62594L1120g3710A93359b36867G0860a08939
15214b89293i503B44262C3329a07236C21815M267A7107L26308c4806q7369b5715
15202d349o7020D06498q2907f0938B31418C0960H364e00B86866a74634C47717
15190A14437g6101C73724q7682C4060j2663J43004P6550n9966H3187Q9538l5318
15179A37407h7564j26793C00296L9895j34563b13876K2828E8159i9010j10645
15169b09655a0644C02449j29917C7025M1193R1624R7183h6928D18860H4318L05617
15158C89935A09669d5535A57536a48523B71259j10344M790R3005f2995j35603
15148a98598D8698d5248D73063Q3797p6022E143c80492B12387H8982r116h184
$$ plain form
15136 -23421 176568 57772 -210354 169352 47496 212422 303072 -35078 276304 7497 182512
15125 182512 172353 134257 155396 339924 203841 104070 133470 -90546 482958 143947 44996
15113 218609 -271180 64810 65825 191665 -22363 333443 209034 198381 374866 -76810 112656
15101 207213 -76554 370378 234662 -31998 -3366 -169434 39440 -53850 71927 279890 331924
15090 331924 101236 162596 299921 247504 193822 109555 23933 10608 455796 -62563 92596
15078 -14341 -222150 115589 -14066 149280 293400 -121503 -1752 230791 133212 147996 122141
15067 122141 197411 -127269 101411 -42475 103169 207674 87506 351621 -44774 121542
15056 -36134 179561 290279 -23560 500191 577385 -14093 12536 -23392 224295 2 -260677
$$ packed form
15136b3421A76568E7772b10354A69352D7496J64926R0650c5078B76304G497J75015
15125A82512j0159l8096K1139J84528j36083r9771K9400i0546D82958A43947D4996
15113B18609b71180F4810J015J25840b2363C33443j24409j0653J76485g6810A12656
15101B07213g6554C70378j35716c1998c366j66068C9440e3850G1927K07963N2034
15090C31924A01236O1360J37325n2417n3682q4267B3933A0608M45188f2563I2596
15078a4341k07809A15589a4066A49280J44120a21503a752B30791r7579J4784k5855
15067A22141P5270a27269A01411d2475A03169J04505H7506K64115d4774A21542
15056c6134A79561J10718b3560E00191P7194a4093A2536b3392B24295Bb60677
$$ plain form
15044 -218038 171238 144395 -20421 57745 178740 234367 1732 316851 160297 -180409 312939
15032 349905 -22976 326526 239039 479685 46480 61700 235072 -1530 217415 384126 276722
15021 276722 -150573 104496 253376 -334275 355506 506263 420339 -13336 439133 232438
15011 232438 126988 353426 381928 382123 220248 397754 223081 -48252 80520 165247 18436
14999 516803 424181 90969 -46354 160841 409896 183417 -89643 136961 48732 31365 478220
14988 478220 181270 433938 562798 368618 392625 79357 44496 473062 355592 324353
14978 324353 323187 426142 143871 352053 259843 165774 229050 274651 272506 112633 303400
14967 303400 469018 314271 431269 85954 244471 455161 76734 369988 186487 133737
$$ packed form
15044b18038A71238k6843b0421E7745J20995N5627A732L15119j56554a80409C12939
15032C49905b2976C26526q7487K40646D6480J5220J73372a530B17415J66711j07404
15021B76722a50573A04496J48880c34275C55506J50757q5924a3336D39133k06695
15011B32438j05450K26438K8502J95j61875J77506j74673d8252H0520Q4727A8436
14999E16803r2622I0969d6354A60841K49055A83417h9643A36961D8732j7367M46855
14988D78220A81270K52668J28860j94180K4007G9357l4861M28566j17470l1239
14978C24353j166J02955A43871K08182r2210r4069O3276M5601k145A12633J90767
14967C03400J65618j54747J16998H5954J58517K10690G6734K93254j83501n2750
$$ plain form
14957 133737 -291046 185967 764672 374389 375070 262411 209225 240527 322930 -162982 575282
14945 265507 423629 470384 370154 162992 -244648 116822 519930 316444 272278 -21284
14934 85277 146392 217170 231542 -110292 -68212 197985 58662 201848 27444 528511 198249
14922 193216 396597 420483 468013 573550 165758 427931 291114 370353 349172 211268
14912 211268 128103 317739 392815 412828 141433 418525 53385 251343 301544 16802 459993
14901 459993 528624 142487 122899 373007 531066 284342 209346 279778 507057 -70214
14890 393754 256058 637475 207590 306296 304867 202678 335922 194705 276907 547643
14880 547643 164219 413868 91740 213412 423862 415747 330763 376811 500718 463797 387531
$$ packed form
14957A33737b91046A85967N78705C74389O81j12659n3186L1302Q2403a62982E75282
14945B65507J58122M6755j00230A62992b44648A16822M03108k03486m4166b1284
14934H5277O1115P0778J4372a10292M2080A97985E8662J43186B7444N01067A98249
14922A93216K03381K3886M7530J05537A65758K62173j36817P9239k1181j37904
14912B11268q3165J89636P5076K0013A41433K77092E3385J97958N0201A6802M43191
14901D59993O8631A42487j9588K50108J58059k46724p4996P0432K27279g0214
14890C93754j37696L81417B07590R8706j429j02189J33244j41217Q2202K70736
14880E47643A64219K49649I1740J21672K10450q115q4984M6048J23907l6921p6266
$$ plain form
14869 387531 641488 438289 456624 325263 390344 166904 352579 700584 591814 342686
14859 342686 283121 497493 545647 726166 387655 21724 435208 412234 909488 711068
14849 711068 609652 241651 105983 276104 654685 62359 189508 349030 370338 255401
14839 255401 547842 561860 410681 920119 497359 701989 831424 447116 737966 574855
14829 574855 515759 809717 374390 395359 638426 298393 593073 403222 757061 539318
14819 539318 505715 411878 372533 341332 524225 56741 571132 314067 557235 393533
14809 393533 541557 492777 456024 465637 555171 242739 516083 600840 153319 667426 599837
14798 599837 375083 673793 596952 670385 625714 637792 432566 624602 613499 387598
$$ packed form
14869C87531K53957k03199J8335j31361O5081A66904J85675L48005j08770k49128
14859C42686n9565K14372M8154J80519l38511B1724M13484k2974M97254j98420
14849G11068j01416B41651A05983J70121L78581F2359J27149J59522K1308j14937
14839B55401K92441J4018j51179N09438m22760K04630J29435l84308K90850j63111
14829E74855n9096K93958C74390K0969K43067B98393K94680j89851L53839k17743
14819E39318l3603r3837l9345l1201J82893E6741N14391k57065K43168j63702
14809C93533J48024m8780l6753R613Q9534B42739K73344Q4757A53319N14107o7589
14798E99837k24754K98710p6841P3433m4671J2078k05226J92036j1103k25901
$$ plain form
14788 387598 413532 487397 616437 209934 373671 419068 271708 564586 71173 545012
14778 545012 435201 419229 401783 368807 150131 616299 663836 541079 551127 616470 418808
14767 418808 254400 554662 706627 299856 709578 446876 898714 862056 755393 679967
14757 679967 533258 621089 523948 877155 655860 726149 688693 930152 636432 650010
14747 650010 551908 1099026 447741 466617 294442 639039 305722 539453 617878 905367
14737 905367 824284 561338 714670 510802 662142 632893 886910 613139 1195481 746115
14727 746115 937323 794279 538104 439904 708523 752821 482774 558532 885238 928122
14717 928122 624638 914438 684120 691837 953442 824984 798925 773621 602928 1012055
$$ packed form
14788C87598K5934P3865J29040B09934J63737M5397j47360K92878G1173M73839
14778E45012j09811j5972j7446l2976A50131M66168M7537j22757J0048O5343j97662
14767D18808j64408L00262J51965B99856M09722k62702M51838l6658j06663p5426
14757F79967j46709Q7831r7141L53207k21295P0289l7456K41459k93720J3578
14747F50010r8102N47118D47741J8876j72175L44597C05722K33731P8425K87489
14737I05367q1083k62946J53332k03868J51340k9249K54017k73771N82342m49366
14727G46115J91208j43044k56175r8200K68619M4298k70047P5758L26706M2884
14717I28122l03484K89800k30318P717K61605j28458k6059k5304j70693M09127
$$ plain form
14707 1012055 874127 833236 722678 593889 826158 714974 866297 801419 1077214 757485
14697 757485 939211 996488 621228 766638 1075014 902334 1090951 924947 1095210 1026826
14687 1026826 1056669 925102 1199739 823709 1077226 1342200 1050290 1026093 1120640 1033972
14677 1033972 1288937 1135764 1013359 731320 1056816 770243 885163 945229 1039573 734960
14667 734960 986281 1189326 764814 934733 993001 1181340 1037291 866602 1013127 900221
14657 900221 1090669 1471168 1207888 786631 1010753 815784 1353367 1157294 1304803 1465722
14647 1465722 1286855 1279833 937522 1165766 1014185 1012125 1563770 1209189 1142818 1247331
14637 1247331 1512110 1252079 1430464 1077947 983646 1232119 1038880 1430758 1179459 1246609
$$ packed form
14707A012055j37928m0891j10558j28789K32269j11184J51323o4878K75795l19729
14697G57485J81726N7277l75260J45410L08376j72680J88617j66004J70263o8384
14687A026826K9843j31567K74637l76030K53517K64974k91910k4197R4547q6668
14677A033972K54965j53173j22405k82039L25496k86573J14920O0066R4344l04613
14667G34960K51321K03045m24512J69919N8268J88339j44049j70689J46525j12906
14657I00221J90448L80499k63280m21257K24122j94969N37583j96073J47509J60919
14647A465722j78867p022l42311K28244j51581k060N51645l54581o6371J04513
14637A247331K64779k60031J78385l52517r4301K48473j93239L91878k51299O7150
$$ plain form
14627 1246609 1145285 1378480 1209285 1309611 1232097 1126582 1501891 982322 1266190 1311581
14617 1311581 1633699 1571990 1370403 1193034 1639671 1247438 1326941 1710493 1553234 1154508
14607 1154508 1940044 1270308 1162995 1863515 1648539 1712193 1642863 1744454 1581559 1535748
14597 1535748 1679300 1445341 1820098 2024135 1869730 1603656 1802647 1916415 1827961 1787738
14587 1787738 1870541 1812933 1914330 1735333 1546429 1804082 2128653 1726790 2050611 1679717
14577 1679717 1804650 1751376 2171575 1856825 1794672 2021908 2113989 2077098 2088018 2280758
14567 2280758 1838495 2335703 2238653 2378619 2599796 2905444 2546214 2430923 2568117 2861448
14557 2861448 3117976 2838439 3364116 3524483 3520119 4077633 4810452 5573937 7190748 11070732
$$ packed form
14627A246609j01324K33195j69195J00326p7514j05515L75309n19569K83868M5391
14617A311581L22118o1709k01587j77369M46637l92233P9503L83552j57259l98726
14607A154508P85536o69736j07313P00520k14976O3654o9330J01591j62895m5811
14597A535748J43552k33959L74757K04037j54405k66074J98991J13768q8454m0223
14587A787738Q2803n7608J01397j78997j88904K57653L24571m01863L23821l70894
14577A679717J24933n3274M20199l14750o2153K27236R2081l6891J0920J92740
14567B280758m42263M97208r7050J39966K21177L05648l59230j15291J37194K93331
14557B861448K56528k79537N25677J60367m364N57514P32819P63485J616811L879984
$$ plain form
14547 11070732 20923204 38310279 41453270 20855875 10673310 6749232 3889277 2908840
14539 2908840 2170617 2470466 2098569 2188609 2197472 1957915 1946194 1878536 1881449 1944998 2269755
14528 2269755 2033071 2179780 2082988 2256178 2146285 2428053 2240032 2815898 2508476 2713380
14518 2713380 2498927 2203331 2334828 2707633 2659202 2619470 2664276 2687056 2645993 2593115
14508 2593115 2824660 2949909 2983257 3128370 3201959 3019020 2824759 3006464 3193183 2988607
14498 2988607 3155412 3126263 3523239 3362309 3188431 3604707 3159400 3544349 3634723 3502129
14488 3502129 3693857 3779649 3810517 3629469 3892466 3973299 3848965 3800694 3835569 4074426
14478 4074426 3773873 4165659 4120354 4055950 4224263 3948486 4090913 4060310 4135033 4244996
$$ packed form
14547A1070732R852472J7387075L142991k0597395j0182565l924078k859955r80437
14539B908840p38223K99849l71897R0040Q863k39557j1721o7658K913O3549L24757
14528B269755k36684J46709r6792J73190j09893K81768j88021N75866l07422K04904
14518B713380k14453k95596J31497L72805m8431l9732M4806K2780m1063n2878
14508B593115K31545J25249L3348J45113P3589j82939j94261J81705J86719k04576
14498B988607J66805k9149L96976j60930j73878M16276m45307L84949R0374j32594
14488C502129J91728Q5792L0868j81048K62997Q0833j24334m8271L4875K38857
14478D074426l00553L91786m5305o4404J68313k75777J42427l0603P4723J09963
$$ plain form
14468 4244996 4257774 4406076 4609409 4726602 4244121 4768672 4477799 4721870 4734076 5322367
14458 5322367 5270366 4829419 4996511 5426192 5321651 5159202 5486409 5394859 5527381 5629926
14448 5629926 5566044 5723630 5521360 6006834 6230075 5904087 5934505 6241999 6303607 6345665
14438 6345665 6279819 6041671 6524408 6518633 6716688 6420366 6922633 6529754 6808015 6949533
14428 6949533 6551845 7042317 7316315 7073931 7558432 7656122 7701517 8069989 7639007 7790793
14418 7790793 8022158 8176959 8466348 8664510 8355515 8561478 8879742 8650731 8540095
14409 8540095 9069711 9217670 9228472 9306582 9692793 9364348 9876031 10008459 10299606 10419378
14399 10419378 10519957 10802714 10992531 11116564 11559431 11558558 11502643 11667110 11821463 12055521
$$ packed form
14468D244996J2778J48302K03333J17193m82481N24551k90873K44071J2206N88291
14458E322367n2001m40947J67092M29681j04541j62449L27207r1550J32522J02545
14448E629926o3882J57586k02270M85474K23241l25988L0418L07494O1608M2058
14438F345665o5846k38148M82737n775J98055k96322N02267l92879K78261J41518
14428F949533l97688M90472K73998k42384M84501R7690M5395L68472m30982J51786
14418G790793K31365J54801K89389J98162l08995K05963L18264k29011j10636
14409H540095N29616J47959J0802P8110L86211l28445N11683J32428K91147J19772
14399A0419378J00579K82757J89817J24033M42867q73n5915J64467J54353K34058
$$ plain form
14389 12055521 12256457 12504763 13123156 13036261 13296326 13801166 13899953 13979379 14531896 14347882
14379 14347882 14972301 14882968 15390437 15791196 16113412 15965272 16876253 17055498 17157641
14370 17157641 17781200 18138175 18233937 18657705 19215942 19720435 20091692 20566690 20745598
14361 20745598 21129977 21764113 22207540 22696802 23222561 23905173 24568852 25025911 25401975
14352 25401975 26225221 26930715 27411262 28063722 28707751 29494931 30022813 31048945 31697394
14343 31697394 32651483 33562606 34312190 35487285 36266753 37472580 38249267 39699024 40521164
14334 40521164 41811535 43174344 44356084 45907159 47182016 48345010 50267534 52040010
14326 52040010 53402868 55497360 57698747 59485324 61239534 63333078 65700758 67930822
$$ packed form
14389A2055521K00936K48306O18393q6895K60065N04840R8787P9426N52517j84014
14379A4347882O24419q9333N07469M00759L22216j48140R10981J79245J02143
14370A7157641O23559L56975R5762M23768N58237N04493L71257M74998J78908
14361B0745598L84379O34136M43427M89262N25759O82612O63679M57059L76064
14352B5401975Q23246P05494M80547O52460O44029P87180N27882J026132O48449
14343C1697394R54089R11123P49584J175095P79468J205827P76687J449757Q22140
14334D0521164J290371J362809J181740J551075J274857J162994J922524J772476
14326E2040010J362858K094492K201387J786577J754210K093544K367680K230064
$$ plain form
14318 67930822 70718535 73126252 75766028 78715639 81875963 84844567 88667784 91943567
14310 91943567 95640881 99450116 103834903 108408834 113035725 118179301 123524191 129036565
14302 129036565 134964537 140960217 148171189 154917414 162318404 170444044 179010812 187968920
14294 187968920 197231271 207480445 218190027 229090415 240375735 252621482 265040442
14287 265040442 278124368 291406652 305442850 319225541 333334356 347637901 361519890
14280 361519890 375146393 388228751 400439729 411564070 421213301 429702474 436086201
14273 436086201 440597711 441290270 437871796 435402378 432819507 428741045 422619457 415535048
14265 415535048 407032876 396531464 385190564 373589048 361222557 348194410 334193159
$$ packed form
14318F7930822K787713K407717K639776K949611L160324K968604L823217L275783
14310I1943567L697314L809235M384787M573931M626891N143576N344890N512374
14302A29036565N927972N995680P210972O746225P400990Q125640Q566768Q958108
14294A87968920R262351J0249174J0709582J0900388J1285320J2245747J2418960
14287B65040442J3083926J3282284J4036198J3782691J4108815J4303545J3881989
14280C61519890J3626503J3082358J2210978J1124341R649231Q489173O383727
14273D36086201M511510O92559l418474k469418k582871m078462o121588p084409
14265D15535048q502172j0501412j1340900j1601516j2366491j3028147j4001251
$$ plain form
14258 334193159 319865903 305434438 291194324 277396634 264206348 252207672 240470303
14251 240470303 228548000 217220431 206640769 196871815 186997596 178348790 169952397
14244 169952397 162316387 154846622 147803699 141060846 134750728 128518429 123309587 118075784
14236 118075784 113019433 108150922 103420099 99380885 95462012 92182162 88229282 84904101
14228 84904101 81755086 78246772 75549902 73107721 70298189 67832279 65272189 63178900
14220 63178900 60919095 59097716 56862076 55154144 53170281 51743324 50487855 49059618
14212 49059618 47279322 45954955 44396674 43039897 42148686 41356065 40383705 38688391
14204 38688391 37704398 36523972 35858594 35283276 34271498 33467755 32390181 31640533 30781721
$$ packed form
14258C34193159j4327256j4431465j4240114j3797690j3190286j1998676j1737369
14251B40470303j1922303j1327569j0579662r768954r874219q648806q396393
14244A69952397p636010p469765p042923o742853o310118o232299n208842n233803
14236A18075784n056351m868511m730823m039214l918873l279850l952880l325181
14228H4904101l149015l508314k696870k442181k809532k465910k560090k093289
14220F3178900k259805j821379k235640j707932j983863j426957j255469j428237
14212D9059618j780296j324367j558281j356777q91211p92621r72360j695314
14204C8688391r83993j180426o65378n75318j011778q03743j077574p49648q58812
$$ plain form
14195 30781721 29946705 29477596 28778903 27832068 27260087 26286755 25572069 25172716 24453674
14186 24453674 24097620 23772070 23170716 22377467 22231975 21826151 21233420 21011208 20405780
14177 20405780 19879981 19470863 19410016 18800753 18198662 18251740 17728981 17438093 17162498 16755402
14167 16755402 16450742 16041936 15529819 15373401 15070501 14797292 14759267 14487843 14454591 14030380
14157 14030380 13829318 13662773 13480425 13231303 12860291 12707607 12433445 12227946 11979725
14148 11979725 11908489 11406201 11233238 11239403 11023385 10429274 11038491 10650953 10458605 10060539
14138 10060539 10279160 10035966 9815323 9633619 9515891 9517498 9263307 8895344 8905694 9165417
14128 9165417 8796269 8719473 8644657 8566218 8060009 8424966 8454836 7801884 7738900 8067035
$$ packed form
14195C0781721q35016m69109o98693r46835n71981r73332p14686l99353p19042
14186B4453674l56054l25550o01354p93249j45492m05824n92731k22212o05428
14177B0405780n25799m09118o0847o09263o02091N3078n22759k90888k75595m07096
14167A6755402l04660m08806n12117j56418l02900k73209l8025k71424l3252m24211
14157A4030380k01062j66545j82348k49122l71012j52684k74162k05499k48221
14148A1979725p1236n02288j72963O165k16018n94111O09217l87538j92348l98066
14138A0060539K18621k43194k20643j81704j17728J607k54191l67963J0350K59723
14128I165417l69148p6796p4816p8439n06209L64957K9870o52952o2984L28135
$$ plain form
14118 8067035 7756020 7608671 7627935 7650072 7124622 7149124 6974460 6913249 6882185 6704436
14108 6704436 6954126 6518086 6952836 6339311 6915100 6266284 6097991 6269993 6081320
14099 6081320 6030336 6134063 5757238 5732246 5755851 5621635 5560933 5637541 5575913 5354026
14089 5354026 5670677 5251074 5259060 4968509 5077357 5295264 5009474 5318434 4890053 4673380
14079 4673380 4815194 4755477 4912122 4733103 4747011 4567435 4309496 4642952 4241766 4319003
14069 4319003 4206336 4455710 4107107 4372972 4305727 4195533 4454625 3880170 4092949 4237160
14059 4237160 4158649 4171122 4199039 3955227 4004320 3744077 4124415 3823278 3740820 3650832
14049 3650832 3707303 3523003 3733163 3499770 3316489 3777265 3725245 3530273 3088312 2811913
$$ packed form
14118H067035l11015j47349J9264K2137n25450K4502j74664o1211l1064j77749
14108F704436K49690m36040M34750o13525N75789o48816j68293J72002j88673
14099F081320n0984J03727l76825k4992K3605j34216o0702P6608o1628k21887
14089E354026L16651m19603P986k90551J08848K17907k85790L08960m28381k16673
14079D673380J41814n9717J56645j79019J3908j79576k57939L33456m01186P7237
14069D319003j12667K49374l48603K65865o7245j10194K59092n74455K12779J44211
14059D237160p8511J2473K7917k43812M9093k60243L80338l01137q2458q9988
14049C650832N6471j84300K10160k33393j83281M60776n2020j94972m41961k76399
$$ plain form
14039 2811913 3277717 3174668 3296116 3004889 3286268 2976673 3017425 3007236 3200772 3066766
14029 3066766 2772321 3307811 2903603 3085426 2581680 2862945 2911013 2800023 2642447 2730305
14019 2730305 2678845 2672059 2737551 2633037 2631461 2184733 2617007 2583586 2517826 2395793 2514969
14008 2514969 2060968 1899599 2432269 2156751 2424967 2445763 2261639 2142623 1951921 2013917
13998 2013917 2262316 2236114 1796354 1977534 2074960 2043827 2086447 2067382 2490004 3269582
13988 3269582 5603682 13283154 31380702 43412449 26227090 13440454 8765512 6220255
13980 6220255 5243276 4648912 4097928 3512891 3112562 3276731 2910254 2744986 2599823
13971 2599823 2847104 2702505 2594135 2842887 2284142 2344951 2117634 2412189 2226021 1920072
$$ packed form
14039B811913M65804j03049J21448k91227K81379l09595M0752j0189J93536j34006
14029C066766k94445N35490m04208J81823n03746K81265M8068j10990j57576Q7858
14019B730305n1460o786O5492j04514j576m46728M32274l3421o5760j22033J19176
14008B514969m54001j61369N32670k75518K68216K0796j84124j19016j90702O1996
13998B013917K48399k6202m39760J81180R7426l1133M2620j9065M22622P79578
13988C269582K334100P679472J8097548J2031747j7185359j2786636m674942k545257
13980F220255r76979n94364n50984n85037m00329J64169l66477j65268j45163
13971B599823K47281j44599j08370K48752n58745O0809k27317K94555j86168l05949
$$ plain form
13961 1920072 2285940 2080278 2151485 2267903 2071221 1977261 1813042 1928545 2003565 1901130
13951 1901130 2100657 1980785 2064696 1762179 2028249 2005732 1759526 1509019 1929939 1579498
13941 1579498 1909753 1931590 1952185 1792617 1766068 1952205 1495735 1424307 1587591 1811206
13931 1811206 1966300 1612348 1586599 1669109 1497556 1620929 1532388 1756566 1438913 1630806
13921 1630806 1892796 1471123 1427962 1513515 1596616 1345408 1736666 1583017 1629008 1461229
13911 1461229 1789933 1467560 1420795 1277097 1411680 1653735 1448147 1565008 1556919 1517556
13901 1517556 1415614 1401714 1332025 1312995 1544185 1435007 1427416 815482 1246094 1460157
13891 1460157 1198851 1128945 1890164 1397528 1380221 1221107 1379010 1095091 1448257 1438006
$$ packed form
13961A920072L65868k05662P1207J16418j96682r3960j64219J15503P5020j02435
13951A901130J99527j19872Q3911l02517K66070k2517k46206k50507M20920l50441
13941A579498L30255K1837K0595j59568k6549J86137m56470p1428J63284K23615
13931A811206J55094l53952k5749Q2510j71553J23373q8541K24178l17653J91893
13921A630806K61990m21673m3161Q5553Q3101k51208L91258j53649M5991j67779
13911A461229L28704l22373m6765j43698J34583K42055k05588J16861q089l9363
13901A517556j01942j3900o9689j9030K31190j09178p591o11934M30612K14063
13891A460157k61306o9906P61219m92636j7307j59114J57903k83919L53166j0251
$$ plain form
13881 1438006 1470161 863879 1455937 1531105 1482894 1028383 1217815 1053177 1140262 760965
13871 760965 1418908 1175593 1436923 1296202 1216068 1269676 1207841 1186439 1199061 1296386 867601
13860 867601 1004496 1047030 1077239 1124486 1266120 1203067 1161601 1156178 1128831 996656 1109121
13849 1109121 1005279 1261181 664492 1060679 1083959 857636 1295079 1314486 892578 1133080
13839 1133080 1007233 1358176 1091712 610807 924017 960273 953964 1100312 1188655 1036967
13829 1036967 743844 729440 1000603 660942 794209 686829 888048 845399 906240 899287
13819 899287 872885 686708 824466 1002099 843346 1093917 1225794 992530 717258 709299
13809 709299 659463 1032220 1019042 700897 760691 772640 1027129 713860 1091409 678851
$$ packed form
13881A438006L2155o06282N92058P5168m8211m54511J89432j64638Q7085l79297
13871G60965O57943k43315K61330j40721q0134N3608o1835k1402J2622R7325m28785
13860H67601J36895M2534L0209M7247J41634o3053m1466n423k7347j32175J12465
13849A109121j03842K55902n96689L96187K3280k26323M37443J9407m21908K40502
13839A133080j25847L50943k66464m80905L13210L6256o309J46348Q8343j51688
13829A036967k93123j4404K71163l39661J33267j07380K01219m2649O0841o953
13819H99287k6402j86177J37758J77633j58753K50571J31877k33264k75272p959
13809G09299m9836L72757j3178l18145N9794J1949K54489l13269L77549m12558
$$ plain form
13799 678851 560155 556440 777504 776278 677201 908825 866395 683038 781196 685303 822468
13788 822468 742155 1004345 644733 912369 645163 1027976 818407 689141 858304 702345
13778 702345 910026 1084867 980084 1121872 807476 819096 671929 603028 620773 827838
13768 827838 759621 413585 892380 970426 505926 831148 919690 839097 650443 758276
13758 758276 926396 1003589 431966 728227 742143 824422 745021 740186 669033 424926 944711
13747 944711 591136 530628 659213 422925 762076 406802 515893 605557 582640 911734
13737 911734 747276 520587 512020 656781 454352 604575 591567 581730 647138 663717 669024
13726 669024 775681 442613 513754 765797 625881 617497 535084 567905 984528 512958
$$ packed form
13799F78851j18696l715K21064j226r9077K31624m2430j83357R8158r5893J37165
13788H22468q0313K62190l59612K67636k67206L82813k09569j29266J69163j55959
13778G02345K07681J74841j04783J41788l14396J1620j47167o8901J7745K07065
13768H27838o8217l46036M78795P8046m64500L25222Q8542q0593j88654J07833
13758G58276J68120P7193D31966K96261J3916Q2279p9401m835p1153k44107N19785
13747I44711l53575o0508J28585k36288L39151l55274J09091Q9664k2917L29094
13737I11734j64458k26689q567J44761k02429J50223j3008r837O5408J6579N307
13726F69024J06657l33068P1141K52043j39916q384q2413L2821M16623m71570
$$ plain form
13716 512958 749258 829260 437698 393992 386692 316199 216587 616091 625945 501336 545330
13705 545330 714655 687086 684807 750037 439014 684653 463096 582562 476040 615515
13695 615515 698933 486147 402363 441853 579514 381625 559216 561776 409442 748065
13685 748065 580054 623745 692371 648536 481059 752156 556094 545468 580013 530893 365434
13674 365434 642851 390924 221106 586271 491652 867219 265148 772889 366391 485876
13664 485876 511827 167374 662423 490003 446685 654258 479692 379973 437804 264339
13654 264339 408489 582008 373904 464627 257674 529144 42511 400586 240093 470939
13644 470939 479153 267179 580349 325557 387545 451107 178618 519205 450089 520075 623585
$$ packed form
13716E12958K36300Q0002l91562m3706p300p0493r9612L99504R854j24609M3994
13705E45330J69325k7569k279O5230l11023K45639k21557J19466j06522J39475
13695F15515Q3418k12786q3784L9490J37661j97889J77591K560j52334L38623
13685G48065j68011M3691O8626m3835j67477K71097j96062j0626L4545m9120j65459
13674C65434K77417k51927j69818L65165r4619L75567B65148N07741C66391J19485
13664D85876K5951A67374M95049j72420m3318K07573j74566r9719N7831j73465
13654B64339J44150J73519k08104R0723k06953K71470D2511L58075j60493K30846
13644D70939Q214k11974L13170k54792O1988O3562A78618L40587o9116O9986J03510
$$ plain form
13633 623585 442463 461522 414085 163535 354846 317075 304238 559924 450696 436850
13623 436850 779183 506446 593299 410072 491344 742887 426004 488156 311055 322341
13613 322341 544766 624291 546604 554105 574039 235076 561927 241414 432988 539552
13603 539552 301454 411605 203623 356064 453805 231319 273058 214834 426786 460864
13593 460864 350410 218479 105852 281329 410965 363370 539819 205828 489149 230130
13582 294698 461793 141829 181526 669093 168417 433994 534946 217275 732294 350999
13571 355308 342036 304675 418439 211741 490808 585981 187119 494202 287199 -4472
13560 17935 358431 527365 376442 309321 163282 228056 377550 565911 365880 432716
$$ packed form
13633F23585j81122J9059m7437A63535J91311l7771j2837K55686j09228j3846
13623D36850L42333k72737Q6853j83227Q1272K51543l16883O2152j77101J1286
13613C22341K22425P9525p7687P501J9934B35076L26851B41414J91574J06564
13603E39552k38098J10151B03623J52441R7741k22486M1739n8224K11952L4078
13593D60864j10454j31931A05852J75477J29636m7595J76449B05828K83321B30130
13582B94698J67095A41829L9697M87567A68417K65577J00952B17275N15019C50999
13571C55308j3272l7361J13764k06698K79067R5173A87119L07083k07003d472
13560A7935L40496J68934j50923o7121j46039O4774J49494J88361k00031O6836
$$ plain form
13550 432716 366216 286519 252892 426313 243750 640785 417338 145128 228439 289730
13540 289730 337538 170142 380391 497353 352998 291032 553045 171772 90285 472906
13530 472906 134990 215667 254708 -200742 393032 610609 210782 302720 337640 101525
13519 255046 402148 387673 115177 150026 404297 340652 79714 459375 357441 611970
13509 611970 139175 376946 694806 798237 426203 188363 172119 512934 17550 310621
13499 310621 420448 181701 510254 343488 12900 418980 471348 214008 121056 346980
13489 346980 237219 58722 228647 67616 113966 193298 724844 16831 378368 -34351 226564
13477 57305 357098 355779 256259 136797 168026 298479 196993 141159 352309 299812 567314
$$ packed form
13550D32716o6500p9697l3627J73421j82563L97035k23447A45128Q3311O1291
13540B89730M7808j67396K10249J16962j44355o1966K62013A71772q1487L82621
13530D72906A34990Q0677L9041b00742C93032K17577B10782R1938L4920A01525
13519B55046J47102j4475A15177L4849K54271o3645G9714L79661j01934K54529
13509F11970A39175K37771L17860J03431l72034A88363j6244L40815A7550K93071
13499C10621J09827A81701L28553j66766A2900M06080N2368B14008r2952K25924
13489C46980j09761E8722J69925F7616M6350P9332N31546A6831L61537c4351B26564
13477E7305K99793j319r9520j19462L1229J30453j01486n5834K11150n2497K67502
$$ plain form
13466 567314 167652 51452 161874 436320 15955 321893 78539 330110 61507 387230
13456 387230 201922 165941 30908 181738 405337 439402 328365 382495 359332 393932 236679
13445 236679 19797 342306 416853 3902 -3572 327782 183946 222002 397638 265849 136620
13434 136620 254478 175638 241093 52627 321991 -1527 130312 286560 240516 -53068 160497
13422 311320 117142 222966 -14594 195993 332403 277251 453754 231907 405370 -121018
13411 112751 142664 214282 235341 179960 -241331 89481 211888 489662 325009 442531
13401 442531 385652 377001 -52442 142512 330924 380774 164956 43417 393080 381154 367454
13390 367454 178632 134448 49589 655874 -51273 239739 52902 245159 237550 190708 161090
$$ packed form
13466E67314A67652E1452J10422K74446A5955L05938G8539K51571F1507L25723
13456C87230j85308l5981C0908J50830K23599L4065j11037N4130k3163L4600j57253
13445B36679A9797L22509P4547C902c572C27782j43836L8056J75636j31789j29229
13434A36620J17858p8840O5455E2627K69364a527A30312J56248m6044e3068A60497
13422C11320A17142J05824a4594A95993J36410n5152J76503k21847J73463a21018
13411A12751K9913P1618K1059n5381b41331H9481J22407K77774j64653J17522
13401D42531n6879q651e2442A42512J88412M9850A64956D3417L49663j1926j3700
13390C67454A78632m4184D9589O06285e1273B39739E2902J92257p609m6842k9618
$$ plain form
13379 161090 114949 521739 298329 244760 244269 346383 167926 190331 160203 8844 308935
13368 308935 231427 146841 122898 128166 327722 567297 331990 35832 315020 100982 -25971
13356 410972 236815 279989 472171 23210 49528 209140 211128 240345 139600 382798 365191
13345 365191 420562 554204 344371 64333 495119 68687 81997 109547 248719 257144 152837
13334 152837 528122 -140740 -186596 -23384 57058 195679 386014 447561 381047 483518
13324 483518 243325 299498 -30393 469791 141812 -12370 115199 71392 299368 226156
13314 226156 132783 -211125 34291 64572 206997 -8148 212597 226134 272142 -508 115583
13302 277858 31881 290521 65068 104949 300994 -6698 77494 -95396 421370 180333 200248
$$ packed form
13379A61090m6141M06790k23410n3569m91J02114A67926K2405l0128H844L00091
13368C08935p7508q4586k3943N268J99556K39575k35307C5832K79188A00982b5971
13356D10972j74157M3174J92182B3210K6318J59612J988K9217j00745K43198j7607
13345C65191N5371J33642k09833F4333M30786F8687J3310K7550J39172Q425j04307
13334A52837L75285a40740m5856b3384E7058J38621J90335O1547o6514J02471
13324D83518k40193N6173c0393D69791A41812a2370A15199m3807K27976p3212
13314B26156r3373b11125C4291L0281J42425h148B12597J3537M6008e08A15583
13302B77858C1881K58640F5068L9881J96045f698G7494i5396D21370A80333J9915
$$ plain form
13291 200248 191565 45141 -250557 71040 372126 110900 152174 403788 225298 249376 17018
13279 -4838 148172 -154967 -67627 118624 145155 -1146 353851 -94521 84156 133987 -166498
13267 78883 463083 53373 3286 137051 78446 221329 -61815 255421 -40916 156323 253223
13256 253223 99493 -52678 -172917 -151936 -28598 379548 -15262 56431 383662 -78980 1926
13244 511841 501793 442127 204031 66991 203599 -151200 382451 115245 79886 -181846
13233 290005 58050 105563 110570 163425 163643 56453 -48950 77594 57530 -59766 -132859 -184956
13221 -184956 176031 574906 406817 -139575 -41174 -263657 233364 70409 106801 171559
13211 171559 -68220 66841 286895 69381 264479 103403 215715 -123767 223326 -110642
$$ packed form
13291B00248q683D5141b50557G1040L01086A10900M1274K51614j78490K4078A7018
13279d838A48172a54967f7627A18624K6531a146C53851i4521H4156M9831a66498
13267G8883L84200E3373C286J33765n8605J42883f1815B55421d0916A56323R6900
13256B53223I9493e2678j20239K0981b8598C79548a5262E6431L27231g8980A926
13244E11841j0048n9666B04031F6991J36608a51200C82451A15245l5359a81846
13233B90005E8050M7513N007N2855K18E6453d8950G7594k0064e9766p3093n2097
13221a84956A76031L98875j68089a39575d1174k22483B33364G0409L6392O4758
13211A71559f8220F6841K20054F9381J95098A03403J12312a23767B23326a10642
$$ plain form
13200 173196 35710 271110 337928 152129 -98293 51382 257226 174349 69799 301034 305903
13189 305903 -158076 178021 -13539 333166 -276871 214696 283411 59406 218318 240050
13179 240050 328941 -143411 -94086 106313 329137 378554 314751 172217 -24229 -187860
13169 -187860 -55798 193595 385534 40985 165167 176369 -200662 423568 176419 526909
13159 526909 60208 289384 2586 331146 97042 355077 -270082 28502 253293 396387
13149 396387 25587 -31770 48455 28143 90584 -34527 -148513 366031 215258 45122 393695
13138 393695 -56660 394347 -81995 161086 360993 546671 276693 -12251 -23040 130227
13127 -42117 65295 191504 37353 219303 -240795 328905 81879 38897 391269 128222
$$ packed form
13200A73196C5710K35400O6818A52129i8293E1382K05844q2877F9799K31235M869
13189C05903a58076A78021a3539C33166b76871B14696O8715E9406J58912K1732
13179B40050Q8891a43411M9325A06313K22824M9417o3803j42534b4229j63631
13169a87860e5798A93595J91939D0985J24182J1202b00662D23568A76419L50490
13159E26909F0208K29176B586L28560I7042K58035b70082B8502K24791J43094
13149C96387B5587c1770D8455k0312O2441c4527j13986C66031j50773D5122L48573
13138C93695e6660C94347h1995A61086J99907J85678k69978a2251j0789A30227
13127d2117F5295J26209C7353J81950b40795C28905H1879C8897L52372A28222
$$ plain form
13116 26611 -6022 -129198 136928 -64579 183378 261956 124837 46130 190335 236588 128934
13105 128934 270740 -181966 51956 229354 -50294 -73638 318664 -110221 -191049 141815
13094 202961 63973 348540 174387 78315 95417 111843 145714 -3177 -113347 -31704 303323
13082 -452276 45330 63928 118885 -133397 -67226 139150 -48083 370317 45761 53511 -52569
13070 320683 178963 194475 146329 -93968 84486 158349 15207 9815 -54338 91659 191228
13059 191228 108892 33538 498694 -122734 -144808 311414 -43589 368304 79622 177362 -252050
13047 -49898 203798 150914 -206785 319990 121250 -315427 39123 98547 -40497 184528
13036 212638 23658 -33645 105755 374615 298191 125149 312929 438972 366449 221854
$$ packed form
13116B6611f022j23176A36928f4579A83378P8578A24837D6130J44205M6253j07654
13105A28934J41806a81966E1956J77398e0294k3344C18664a10221q0828A41815
13094B02961F3973K84567j74153G8315J7102J6426L3871c177j10170c1704C03323
13082d52276D5330J8598N4957a33397O6171A39150d8083C70317D5761P750e2569
13070C20683j41720J5512m8146i3968H4486P3863A5207n392e4338I1659R9569
13059A91228q2336C3538M65156a22734k2074C11414d3589C68304G9622R7740b52050
13047d9898B03798n2884b06785C19990A21250c15427C9123N9424d0497A84528
13036B12638B3658c3645A05755K68860p6424A25149J87780J26043p2523j44595
$$ plain form
13026 221854 80967 -122767 278381 -84451 -15037 -172681 -72415 -342787 110051 144020
13016 144020 326288 472777 189371 57382 8577 2375 259404 148819 -19396 18929 -86362
13004 32738 341904 194430 137091 -83052 190967 -114821 123293 135531 -24585 -78969 12832
12992 241669 30230 73807 261020 -17765 -130550 39044 75559 114122 152351 -201781 -39255
12980 10664 -66298 94993 213198 481398 325843 368092 -119463 72560 -101272 555291
12969 119449 -56335 182316 -81493 85677 271723 299965 250972 197521 164278 55734 151230
12958 151230 35227 172110 436615 180565 -489624 -187263 522226 471281 235834 339364
12948 339364 81112 -55151 130845 -316503 115356 605643 175558 -258159 221980 -44792
$$ packed form
13026B21854H0967a22767B78381h4451a5037j57644g2415k70372A10051L3969
13016A44020J82268J46489A89371E7382H577B375K57029j10585a9396A8929h6362
13004C2738L09166j47474n7339h3052A90967a14821A23293J2238b4585n4384A2832
12992B41669C0230M3577J87213a7765j12785C9044L6515L8563L8229b01781c9255
12980A0664f6298I4993J18205K68200j55555M2249a19463G2560a01272E55291
12969A19449e6335A82316h1493H5677J86046K8242m8993n3451l3243E5734R5496
12958A51230C5227J36883K64505A80565d89624a87263E22226n0945k35447J03530
12948C39364H1112e5151A30845c16503A15356M90287A75558b58159B21980d4792
$$ plain form
12937 106129 -344535 91371 -81277 -23558 -169031 -83437 18989 -145022 -73162 -155477 154401
12925 -8087 307837 -166857 154297 -95338 -63370 -68449 177372 -132992 50590 114573 -35516
12913 107250 288894 -114048 289918 -119773 136524 82328 87726 -129570 283984 -35356
12902 343627 -161216 298735 343545 70550 291842 -8832 74210 135211 237777 -187605 -254307
12891 -254307 144369 164140 3835 446783 164867 119392 1781 -153675 -6441 -61283 25013
12879 246 181490 -165847 351270 56305 -439 50632 29295 103291 -4036 57871 107166 187722
12867 187722 136752 312794 194915 -55407 371560 42098 -37597 -119442 202743 -57004 297754
12855 -51711 -60448 -219196 -84004 306924 -41222 -100094 75104 -213064 125497 -242216 -46600
$$ packed form
12937A06129c44535I1371h1277b3558j45473h3437A8989a45022P1860q2315A54401
12925h087C07837a66857A54297i5338L1968n079A77372a32992E0590O3983c5516
12913A07250J81644a14048B89918a19773A36524n4196N398a29570B83984c5356
12902C43627a61216B98735M4810G0550K21292h832G4210O1001J02566a87605o6702
12891b54307A44369J9771C835M42948A64867m5475A781a53675f441n4842B5013
12879B46J81244a65847C51270E6305d39E0632k1337P3996d036E7871M9295Q0556
12867A87722n0970J76042j17879e5407C71560D2098c7597q1845B02743e7004B97754
12855e1711q737j58748h4004C06924d1222n8872G5104b13064A25497b42216d6600
$$ plain form
12843 -175059 29978 -110676 149166 166381 15255 140665 -429025 104173 -38533 -197184
12833 -197184 -355729 126202 45221 92780 -108609 -148169 -11361 -110569 262260 -117386
12822 -202952 127168 198546 163462 -80627 163579 -106926 -200399 -65053 -197340 -292278 -90651
12810 128146 309248 53721 38243 -22968 -11977 -254235 129927 248236 129582 -94127
12799 133863 -40050 27613 404852 58576 -109754 -151093 74544 -499429 -70460 124802 187457
12788 187457 189060 257335 4682 58360 -212442 -11428 319255 -160801 148557 -198481 -187977
12777 -187977 -89667 -127537 99561 88287 52778 -107814 -54642 214628 38212 218097 26935
12765 178969 -174343 9681 95057 -3401 -193245 -186269 129159 316865 -111254 -155996 -190125
$$ packed form
12843a75059B9978a10676A49166J7215A5255J25410d29025A04173c8533j58651
12833a97184j58545A26202D5221M7559a08609l9560a1361r9208B62260a17386
12822b02952A27168P1378l5084h0627A63579a06926r3473f5053j32287r4938i0651
12810A28146J81102E3721j5478b2968J0991k42258A29927J18309j18654i4127
12799A33863d0050B7613L77239E8576a09754m1339G4544d99429g0460A24802O2655
12788A87457J603O8275D682N3678b12442a1428C19255a60801A48557a98481J0504
12777a87977h9667l7870I9561j1274l5509a07814N3172B14628C8212J79885B6935
12765A78969a74343I681Q5376c401j89844O976A29159J87706a11254m4742l4129
$$ plain form
12754 -190125 98036 -3852 324656 211624 141390 225472 178242 120932 352775 160457 -173350
12742 -295781 86681 60022 -28409 422811 497943 279593 -173374 -50435 311899 -180879
12731 64130 164156 -91911 -182038 233181 129534 -219171 -76774 223768 38515 252500
12721 252500 -54942 -87198 -272814 41998 108824 -66094 93704 -74525 299396 235349 282775
12710 282775 233875 30031 208183 79860 232545 74436 35904 118726 279556 98812 295093
12699 295093 -153465 24155 -7247 271294 137786 -134806 -125070 93582 17637 -171336 211914
12687 -114436 130831 -239428 -76402 -167163 381872 -138670 -36399 72060 191259 107300
12677 107300 128060 238598 193842 251390 191037 337824 139437 33092 382564 23500 34693
$$ packed form
12754a90125I8036c852C24656j13032p0234Q4082m7230n7310K31843A60457a73350
12742b95781H6681k6659b8409D22811P5132k18350a73374e0435C11899a80879
12731F4130J00026i1911r0127B33181j03647b19171g6774B23768C8515K13985
12721B52500e4942l2256j85616D1998O6826f6094I3704g4525B99396o4047M7426
12710B82775m8900C0031J78152G9860J52685G4436C5904Q2822J60830I8812J96281
12699B95093a53465B4155g247B71294j33508a34806R736I3582A7637a71336B11914
12687a14436A30831b39428g6402r0761C81872a38670c6399G2060J19199q3959
12677A07300K0760J10538m4756N7548o0353J46787A39437C3092L49472B3500J1193
$$ plain form
12666 34693 239845 277499 132477 99292 -43352 145725 239572 326535 161501 12664 -20612
12654 47217 231882 150969 70601 -231336 269824 219571 20076 490112 372003 22134 -107026
12642 168004 70267 -37058 -43094 207092 100402 -190239 245445 209909 89124 182062 -4786
12630 470726 295800 6746 51113 128128 -161572 217536 352281 4046 -307659 166428 156220
12619 156220 -69867 97265 324658 442704 -60453 -303994 48153 18732 419942 -119417
12608 -281766 41302 70562 -40860 -251503 23531 -74210 174465 175295 -46787 -322976 92760
12596 116687 123316 241792 62889 186842 108286 208657 -58471 -201023 222838 303526 -72132
12584 -50401 152734 -132200 32628 -222324 -40372 -143007 84027 -101982 383100 -46355
$$ packed form
12666C4693K05152L7654A32477l3185d3352A45725R3847Q6963A61501A2664b0612
12654D7217J84665q0913G0601b31336B69824n0253B0076M70036j18109B2134a07026
12642A68004G0267c7058o036B07092A00402a90239B45445l5536H9124R2938d786
12630D70726j74926F746M4367P7015a61572B17536J34745D046c07659A66428j0208
12619A56220f9867I7265K27393J18046f0453k43541D8153A8732M01210a19417
12608b81766D1302K9260d0860k10643B3531g4210A74465Q30d6787k76189I2760
12596A16687O629J18476F2889J23953p8556J00371e8471j42552B22838Q0688g2132
12584e0401A52734a32200C2628b22324d0372j02635H4027a01982C83100d6355
$$ plain form
12573 29009 -273405 -51226 -994 35694 -122870 202934 147972 -26731 120764 315973 26573
12561 -140444 -136484 32884 -101498 -187725 34694 -285456 -87868 39474 -78563 337581 -109358
12549 130583 44904 48373 93813 143260 -57915 173251 129877 -17851 -38582 -134486 87118
12537 224727 112254 169296 -42457 -288230 37288 -22890 -17556 239790 52126 405012 -86708
12525 -82562 -69161 122107 79634 -205061 29668 349853 131565 -198117 -8572 -233133 65708
12513 167017 -328452 -100026 143102 70463 81553 172190 90776 135332 -70001 282910 -129372
12501 86547 -27631 179509 -276387 76566 260319 -334138 31906 -44421 17202 -240295 -104865
12489 134747 17869 192474 24980 29682 185193 332154 -313946 158205 -4498 9811 -119419
$$ packed form
12573B9009b73405e1226i94C5694a22870B02934n4962b6731A20764J95209B6573
12561a40444L960C2884a01498q6227C4694b85456h7868C9474g8563C37581a09358
12549A30583D4904L469M5440M9447e7915A73251m3374a7851k0731r5904H7118
12537B24727A12254N7042d2457k45773C7288b2890N334B39790E2126L52886h6708
12525h2562J3401A22107m2473b05061B9668L20185A31565a98117h572k24561F5708
12513A67017c28452a00026A43102G0463J1090R0637q1414M4556g0001B82910a29372
12501H6547b7631A79509b76387G6566J83753c34138C1906d4421A7202b40295a04865
12489A34747A7869J74605B4980M702J55511J46961c13946A58205d498I811a19419
$$ plain form
12477 322982 -121932 379993 205202 92845 -14919 93730 -17216 63843 211248 -7723 110164
12465 -67485 -69333 -129310 -27389 253682 -17195 234589 37508 5202 -17892 -17508 79897 -292687
12452 103144 60545 242878 -97302 270969 -222905 -147063 272273 -20519 136569 206637
12442 206637 248155 39887 -200447 41254 -186264 292808 68883 -73091 147600 -214349
12431 -176119 292860 -24169 -49876 -198704 -2023 169722 -47243 138814 -163387 -15702 213714
12419 -33452 -5877 218577 -95279 -135165 -122063 -48347 -319530 2836 218589 -184389 15909
12407 -275424 165859 -196928 -104287 -296215 -123963 -73063 53534 89395 25176 -274389
12396 -254291 442923 105346 -43696 91310 102772 264350 122046 -169193 5173 247179
$$ packed form
12477C22982a21932C79993j74791I2845a4919I3730a7216F3843J47405g723A10164
12465f7485j848n9977b7389B53682a7195B34589C7508E202a7892L84G9897b92687
12452A03144m2599J82333i7302B70969b22905P5842B72273b0519A36569P0068
12442B06637M1518C9887b00447D1254a86264B92808F8883g3091A47600b14349
12431a76119B92860b4169k5707j48828b023A69722d7243A38814a63387a5702B13714
12419c3452e877B18577i5279l9886J3102d8347k71183B836K15753a84389A5909
12407b75424A65859a96928R2641j91928a23963N0900E3534L5861B5176b74389
12396b54291D42923A05346d3696I1310J1462J61578A22046a69193E173K42006
$$ plain form
12386 247179 -50116 69231 -79371 -18763 9965 -23719 -53085 -76874 41264 82112 28066 35624
12374 35624 216583 126219 -45600 2743 269027 432172 -163912 -41160 280407 561 209178
12363 209178 -82975 -215691 77431 46093 -88830 22365 -252848 -182235 116718 -31756 307058
12351 -21028 257554 237874 -16553 -17139 99353 72475 -113080 -66014 -89567 -160377 217137
12339 220168 150667 156714 36935 159764 167036 255235 -202648 -41915 -149642 207241 13855
12327 -18333 -120814 78916 -185450 -66891 99701 231217 172022 67392 166207 -64363 115568
12315 -76309 -391966 259126 28915 -30999 -24496 171699 -132143 123604 -87886 -125837 154778
12303 -12850 -66781 -176039 11795 -228003 6291 45650 304184 -162239 83069 42572 101560
$$ packed form
12386B47179e0116F9231g9371a8763I965b3719k9366k3789D1264M0848B8066P558
12374C5624J80959r0364d5600B743K66284J63145a63912d1160B80407E61K08617
12363B09178h2975j32716G7431l1338h8830B2365b52848P0613A16718c1756C07058
12351b1028B57554j9680a6553n86I9353k6878a13080M7066k3553p0810B17137
12339B20168o9501O047C6935J22829P272Q8199b02648d1915j07727B07241A3855
12327a8333j02481G8916a85450f6891I9701J31516n9195F7392R8815f4363A15568
12315g6309l15657B59126B8915c0999O503A71699a32143A23604h7886l7951A54778
12303a2850n3931j09258A1795b28003F291L9359K58534a62239H3069m0497N8988
$$ plain form
12292 101560 -23945 245153 182438 -100249 179264 16250 -280093 23557 45061 66801 5949
12280 -147349 188623 286930 -80076 57776 34958 213500 65066 659931 159258 151833 379260
12269 379260 361128 257942 125236 440277 385376 38740 94253 335964 -217317 -1497 18721
12257 -8234 123904 218733 528610 -57417 108372 154101 102953 275293 134279 158014 93436
12246 93436 55606 248809 -287193 -16337 -132491 290148 -193544 -172191 49246 111251 249622
12235 249622 10755 267522 224137 190192 265190 198261 340673 249914 -58222 53711 193554
12224 193554 302935 284002 47750 7952 377813 157727 -28008 508766 310487 16060 -57161
12212 157402 -6335 27934 -53824 60343 -210235 61302 -45042 -228503 154857 331151 192290
$$ packed form
12292A01560b3945B45153o2715a00249A79264A6250b80093B3557K1504K1740E949
12280a47349A88623R8307h0076E7776k2818J78542F5066N94865A59258p425K27427
12269C79260j8132j03186A25236L15041n4901C8740N5513K41711b17317a497A8721
12257h234A23904R4829L09877e7417A08372M5729n1148J72340A34279K3735o4578
12246I3436l7830J93203b87193a6337j16154B90148a93544K1353D9246O2005J38371
12235B49622A0755K56767m3385l3945P4998o6929J42412r0759e8222E3711J39843
12224A93554J09381j8933D7750G952L69861A57727b8008E08766j98279A6060e7161
12212A57402f335B7934e3824F0343b10235F1302d5042j83461A54857J76294j38861
$$ plain form
12201 192290 -316679 163810 256514 205346 -42551 18126 -23166 5076 268264 230619 377386
12190 377386 -107269 155671 -118180 35024 58888 -103432 -329139 -60468 2581 455683
12180 455683 -57234 105060 -11375 39668 5080 365134 165224 128489 95056 245508 -92533
12168 -80706 -129709 -28467 49399 -9310 -15716 -143837 357164 -134169 -163260 -19773 -10061 38330
12155 13598 166689 62418 -54287 -36472 365897 8881 -194703 -53386 32326 246662 -105608
12143 259517 -70088 46796 -113359 -135893 86580 -125577 -17676 126979 286813 -153300
12132 -114589 101666 -139406 118031 -110148 -209168 86886 -148909 110689 -148815 219258
12121 -100579 55025 243685 113058 366569 51060 -165618 145598 -62579 -95002 134788
$$ packed form
12201A92290c16679A63810R2704n1168d2551A8126b3166E076K63188l7645J46767
12190C77386a07269A55671a18180C5024K3864a03432k25707f0468B581M53102
12180D55683e7234A05060a1375C9668E080L60054A65224l6735l3433J50452i2533
12168h0706m9003b8467D9399i310o406j28121C57164a34169k9091a9773R712C8330
12155A3598J53091F2418e4287J7815C65897H881a94703e3386C2326K14336a05608
12143B59517g0088D6796a13359k2534H6580a25577a7676A26979J59834a53300
12132a14589A01666a39406A18031a10148r9020H6886a48909A10689a48815B19258
12121a00579E5025J88660A13058K53511E1060a65618A45598f2579l2423A34788
$$ plain form
12110 -47226 161184 169326 -97152 40647 -138676 -164404 19514 30413 -140864 -51219 -192472
12099 -192472 -158011 43392 -87559 305763 275261 59276 72938 45749 168585 -82289 -232528
12088 -232528 -36381 221281 146215 64070 88809 126342 166788 315986 -90029 291700 224619
12077 224619 184470 -89643 733373 1322804 2038147 730917 572123 263325 -144019 184487
12066 149423 141462 -59011 187177 -82851 -69110 -67757 39446 -26926 -281612 -93315 138714
12054 -76036 -205876 104267 24908 -93311 104662 -26192 151279 -309109 59209 -196087
12043 49350 -45360 108041 63679 213644 -239 171035 34348 -4485 -67367 86976 117030 97158
12031 97158 -252124 156117 -14180 -30322 111724 15328 -362249 -141190 -105924 189860
$$ packed form
12110d7226A61184Q142i7152D0647a38676k5728A9514J0899a40864e1219j41253
12099a92472L4461D3392h7559C05763l0502E9276J3662k7189J22836h2289j50239
12088b32528c6381B21281p5066F4070K4739L7533M0446J49198i0029B91700o7081
12077B24619m0149h9643G33373N89431P15343G30917j58794B63325a44019A84487
12066A49423p961e9011A87177h2851J3741J353C9446b6926k54686i3315A38714
12054g6036j29840A04267B4908i3311A04662b6192A51279c09109E9209a96087
12043D9350d5360A08041m4362J49965b39A71035C4348d485o2882H6976L0054j9872
12031I7158b52124A56117a4180j6142A11724A5328c62249a41190L5266A89860
$$ plain form
12020 -88568 212949 -91032 -83798 158595 -103521 59342 214194 382148 93933 -390608 -13790
12008 189108 -38368 -41307 46745 57608 -164224 8686 -72643 -5922 -50744 44103 6932 -153781
11995 -152855 125967 54101 8451 -237436 55315 -75843 143437 190070 68447 192467 -65798
11983 -120128 155902 -196988 80694 105400 98324 -108585 -71173 -259841 -56276 28218 -131365
11971 147058 68302 51683 -203307 148733 -170155 -110836 -37540 151779 279104 41337
11960 12963 292109 44414 -82923 -210811 -175287 55938 -76765 -357304 120983 -267695 16906
11948 50340 93773 60447 -205330 27697 19902 253743 80006 276953 169807 -200406 135693
11936 62076 -97365 -48672 45835 97684 -217501 -228519 106329 -95986 36138 74561 177193
$$ packed form
12020h8568B12949i1032P234A58595a03521E9342J54852J67954I3933c90608a3790
12008A89108c8368k939D6745J0863a64224H686g2643e922m4822D4103F932a53781
11995a52855A25967E4101H451b37436E5315g5843A43437M6633F8447J24020f5798
11983a20128A55902a96988H0694K4706p076a08585L7412j88668e6276B8218a31365
11971A47058F8302j6619b03307A48733a70155N9319c7540A51779J27325D1337
11960A2963K79146D4414h2923j27888L5524E5938g6765k80539A20983b67695A6906
11948E0340M3433l3326b05330B7697p795K33841H0006J96947j07146b00406A35693
11936F2076i7365d8672D5835N1849b17501j1018A06329i5986C6138L8423J02632
$$ plain form
11925 177193 -146040 73757 34768 794 -41094 -158629 147771 -207205 -141091 102474 122630
11914 122630 -285831 328154 -42915 -226184 -205484 -355701 108679 -318409 -54187 -139979
11904 -139979 -47963 54477 124496 44862 -58413 -14008 135633 -196274 -99099 -306948 -94695
11892 414289 122673 97270 -97717 -339864 46352 -157641 132979 149013 89930 -152704
11881 227541 177663 117753 318774 47779 31755 -281100 84683 5292 -220660 -95502 139820
11869 -336704 138033 -213324 143672 413503 -29000 76548 118437 -155506 -56429 58428
11858 311537 -58940 -154182 -75149 201501 193092 137496 -235008 -13016 163095 368909 -445834
11846 327606 -198870 -178628 7912 57517 167695 -33594 -123205 -50993 -205254 18787 -184153
$$ packed form
11925A77193a46040G3757C4768G94d1094j17535A47771b07205O6114A02474K0156
11914A22630b85831C28154d2915j83269K0700j50217A08679c18409e4187q5792
11904a39979d7963E4477P0019D4862e8413a4008A35633a96274R7175k07849i4695
11892D14289A22673k5403i7717k42147D6352a57641A32979J6034n9083a52704
11881B27541m9878n9910K01021D7779j6024b81100H4683E292b20660i5502A39820
11869c36704A38033b13324A43672K69831b9000G6548M1889a55506e6429E8428
11858C11537e8940r5242g5149B01501q409n5596b35008a3016A63095K05814d45834
11846C27606a98870K0242G912M9605J10178c3594q9611e0993j54261A8787a84153
$$ plain form
11834 8018 -345935 147165 12214 -118327 -283180 -15161 -71567 -464794 -86711 93665 -148963
11822 -77990 -275887 -26815 -133604 -92081 -241946 -192122 -337575 25316 -147108 -271896
11812 -271896 63300 43183 151927 119687 194892 37380 310497 -10461 22491 67038 -57516
11800 -125942 -141234 -37137 84496 194158 -38002 -153355 -88922 122117 -50220 65947 283975
11789 283975 -177449 99866 71358 -118000 -287539 208479 332859 -112734 43598 6468
11778 67026 -38765 -5751 51692 -61454 -1418 182028 -26440 264974 -132301 -175484 -148554
11767 -148554 -69963 126714 60469 -111036 175076 -115327 -287669 -9283 128405 -18991
11756 27682 -146817 -220262 63062 -77385 81618 -8125 -173157 -169131 156107 -112792 -88461
$$ packed form
11834H018c45935A47165A2214a18327j64853a5161n6406l93227h6711I3665a48963
11822g7990j97897b6815j06789M1523j49865M9824j45453B5316a47108j24788
11812b71896F3300k0117J08744l2240P5205C7380K73117a0461B2491M4547e7516
11800a25942j5292c7137H4496J09662c8002j15353O4433A22117e0220F5947K18028
11789B83975a77449I9866k8508a18000j69539B08479J24380a12734D3598F468
11778F7026c8765e751E1692f1454a418A82028b6440B64974a32301m3183K6930
11767a48554f9963A26714F0469a11036A75076a15327j72342i283A28405a8991
11756B7682a46817p3445F3062g7385H1618h125j65032M026A56107a12792K4331
$$ plain form
11745 -88461 133656 -177505 369953 -134876 203901 397922 292053 249606 -94236 1888
11734 -191856 113700 -276660 40815 23799 -292740 281078 -52071 -206446 -10588 106933
11723 213828 78028 -23172 179601 -210317 -2940 -98751 167852 120408 -288831 377397 131336
11711 167424 -200941 -110496 173065 -235621 -189728 -271079 91109 145656 432417 176447
11700 4787 263135 -54097 -112581 -115861 -78606 441450 200254 171725 235510 -188739 36698
11688 264902 216994 -205083 -18613 247400 -310529 -27647 367212 167850 -163549 -234687
11678 -234687 -78786 -71617 87335 199058 -40654 -39615 -47926 300817 -16692 -85404 -53480 71901
11665 -42856 -129742 262128 272209 105929 150070 62298 82076 40781 -192509 177043 73729
$$ packed form
11745h8461A33656a77505C69953a34876B03901J94021j05869m2447i4236A888
11734a91856A13700b76660D0815j7016b92740B81078e2071j54375a0588A06933
11723B13828G8028b3172A79601b10317b940r5811A67852m7444b88831C77397A31336
11711A67424b00941R0445A73065b35621M5893q1351I1109N4547K86761A76447
11700D787K58348e4097n8484l280L7255D41450B00254k8529O3785a88739C6698
11688B64902m7908b05083a8613B47400c10529b7647C67212A67850a63549p1138
11678b34687g8786P169H7335J11723d0654J039q311C00817a6692o8712L1924G1901
11665d2856q6886B62128J0081A05929M4141F2298J9778D0781a92509A77043G3729
$$ plain form
11653 395649 -89407 57100 264217 65166 149331 -58118 -91872 247499 13460 -228389 105420
11641 224884 131986 -72836 195332 95511 183575 -64745 -629 100641 295394 102844 -78370
11629 24506 -60208 -134965 187339 -60876 -435701 19306 148046 -103598 63684 -174487 130124
11617 144721 -89380 118768 88123 -196228 242042 188159 385533 -147540 -130268 -318138
11607 -318138 32919 -153635 -119610 -299624 74308 37035 456901 -38016 -141231 -24938 189815
11595 -51726 256034 101625 119657 42721 -5880 -55034 150432 360991 59133 295669 423417
11584 423417 104257 152061 -12315 200201 -42627 8979 -134588 -19057 72960 117251 148969
11573 148969 69621 -131593 55401 5583 301181 -90218 -48917 106805 -367190 137810 156654
$$ packed form
11653C95649h9407E7100K07117F5166Q4165e8118l3754B47499A3460b28389A05420
11641B24884r2898g2836A95332I5511Q8064f4745f29A00641J94753A02844g8370
11629B4506f0208p4757A87339f0876l74825A9306J28740a03598F3684a74487A30124
11617A44721h9380A18768l0645a96228B42042n3883J97374a47540J7272j87870
11607c18138C2919a53635L4025j80014G4308C7035M19866c8016j03215b4938A89815
11595e1726B56034A01625J8032D2721e880m9154A50432K10559E9133K36536J27748
11584D23417A04257M7804a2315B00201d2627H979a34588a9057G2960M4291L1718
11573A48969F9621a31593E5401E583K95598i0218M1301A06805c67190A37810J8844
$$ plain form
11562 156654 -118892 -91293 160668 -40179 175331 179462 -113984 50115 -15603 -24704 906
11550 -179987 102182 -13153 146093 227158 -50097 54523 127880 -159056 185424 7741 236352
11539 236352 157692 232075 264382 -32455 -347770 360603 114557 9038 -58052 204920 6928
11527 -496 138491 284515 -164817 35108 141792 339601 -139661 386350 -150234 371610
11516 191878 -144620 -211375 -137830 88112 415078 56129 260013 245631 68027 446448 236014
11505 236014 473443 -285429 160473 -102095 346068 -225436 404503 -61063 35014 121158
11495 121158 -159255 287916 210048 289136 101985 -267364 -166004 242302 78909 -12297
11484 -9379 194373 397151 46125 137767 -443173 -11541 334442 229870 199266 118516 213817
$$ packed form
11562A56654a18892K7599A60668d0179A75331M131a13984E0115a5603r101I06
11550a79987A02182a3153A46093Q1065e0097E4523P3357a59056A85424G741K28611
11539B36352p8660P4383L2307c2455l15315C60603A14557I038e8052B04920F928
11527d96A38491J46024a64817C5108J06684J97809a39661C86350a50234C71610
11516A91878a44620o6755P3545H8112L26966E6129K03884j4382F8027L78421k10434
11505B36014K37429b85429A60473a02095C46068b25436D04503f1063C5014Q6144
11495A21158a59255B87916p7868P9088A01985b67364J01360B42302G8909a2297
11484i379A94373K02778D6125R1642d43173a1541C34442j04572l0604q0750R5301
$$ plain form
11473 213817 359272 -27388 160408 -250692 -177007 -244668 -16859 72754 223077 246823 117894
11461 18610 305807 -159304 591382 351830 157748 74568 -39065 -80367 253481 -22144
11450 32477 229671 -16666 152482 -207759 -86673 218550 -1359 208568 341543 123217
11439 303867 -89922 107486 -85136 108241 51618 135127 111596 123385 -115042 386393 -8250
11427 -401333 -25449 -51363 133226 -163892 -138866 -170890 -50455 -31481 -107284 128135 -23498
11415 -55311 -88777 176897 119955 -113267 26137 79562 -51013 56740 -14682 92872 -170816
11403 372475 -32970 -31082 5483 311335 -140794 -138467 161870 -62301 8869 289342 -264880
11391 -19177 93417 86439 -238296 74259 -107481 -475426 -3181 87251 4373 -10542 123552
$$ packed form
11473B13817J45455b7388A60408b50692P3685o7661a6859G2754J50323K3746A17894
11461A8610K87197a59304E91382k39552A57748G4568c9065m1302B53481b2144
11450C2477J97194a6666A52482b07759h6673B18550a359B08568J32975A23217
11439C03867h9922A07486h5136A08241E1618Q3509k3531J1789a15042C86393h250
11427d01333b5449k5914A33226a63892K5026l2024e0455J8974p5803A28135b3498
11415e5311l3466A76897n6942a13267B6137N3425e1013E6740a4682I2872a70816
11403C72475c2970J888E483L05852a40794K327A61870f2301H869K80473b64880
11391a9177I3417o978b38296G4259a07481l67945c181H7251D373a0542A23552
$$ plain form
11379 182641 197293 244223 -152152 313403 63825 -117377 -138599 158149 257839 88519 28386
11367 94662 156299 -11800 60369 -271080 -44992 -83301 -40803 83695 -209163 -14502 -203662
11356 -203662 314808 -40813 -75240 -104572 133915 -6773 -144627 -16095 259920 -195001 171916
11344 -102366 238312 149972 -176597 -41776 -102365 -12935 -175783 -316375 268794 175021
11334 175021 37354 -97221 -99842 27802 -146151 -237403 9606 -131023 119511 -315977 -19530
11322 80228 -292279 171246 -303749 80975 -305423 54995 64531 -402416 -166125 -43971 -118344
11311 -118344 -79713 227485 344652 -100593 282275 -209739 144570 207045 73857 190744
11301 190744 264609 -69425 127818 90198 -6099 256702 -232093 19907 -129412 71567 -117917
$$ packed form
11379A82641J4652M6930a52152C13403F3825a17377k1222A58149R9690H8519B8386
11367I4662O1637a1800F0369b71080d4992l8309d0803H3695b09163a4502j89160
11356b03662C14808d0813l4427k9332A33915f773j37854a6095B59920a95001A71916
11344a02366B38312q8340a76597d1776o0589a2935j62848j40592B68794r3773
11334A75021C7354i7221k621B7802a46151r1252I606a31023A19511c15977a9530
11322H0228b92279A71246c03749H0975c05423E4995R536d02416a66125d3971p4373
11311a18344L8631B27485J17167a00593B82275b09739A44570O2475G3857J16887
11301A90744P3865f9425A27818l7620f099B56702b32093A9907a29412G1567a17917
$$ plain form
11289 -190351 -298505 -30475 -186820 -220463 -218615 -48270 285630 -79806 -139206 206024 363981
11278 363981 -221705 -45588 191294 -98832 335249 -70248 -27166 -4299 -40614 -9049 -100775
11267 -100775 126067 -317236 -306891 -335 -253593 -90966 128991 106815 86972 53407 -285457
11255 11332 208104 -47717 223271 -224511 -19051 19070 128409 68630 -208132 98096 -65582
11243 -7747 159996 -417672 -165026 151564 -2492 -104236 33819 46609 126165 -422743 371249
11231 48155 149528 84066 -180440 -246516 -211493 -157505 -153126 63416 145868 -103944 -210204
11220 -210204 -170077 -124968 102062 -25827 -135357 234942 102202 250218 -95744 -23097
11209 23352 -141539 95418 109173 134780 -4216 -156908 -115448 -287907 45920 117557 -419504
$$ packed form
11289a90351j08154c0475j56345l3643J848d8270B85630g9806n9400B06024J57957
11278C63981b21705d5588A91294i8832C35249g0248b7166d299l6315i049r1726
11267a00775A26067c17236J0345c35k53258i0966A28991k2176j9843l3565b85457
11255A1332J96772d7717B23271b24511a9051A9070J09339n9779b08132I8096f5582
11243g747A59996d17672a65026A51564b492j01744C3819J2790P9556d22743C71249
11231D8155J01373o5462a80440o6076L5023N3988M379F3416Q2452a03944j06260
11220b10204M0127M5109A02062b5827j09530B34942A02202J48016i5744b3097
11209B3352a41539I5418J3755K5607d216j52692M1460j72459D5920P1637d19504
$$ plain form
11197 -5469 90554 54719 16430 -119935 -54052 -128427 247043 -10149 -118785 79920 -57301
11185 79486 -152327 -508517 -445421 -304410 -119551 242403 -26968 -276955 -264445 163398
11174 -16926 169328 -32884 -288682 289275 35554 -85068 -153142 140221 47489 -241015 220038
11162 -47597 63930 -236534 -29199 -15299 139573 -340505 10659 159822 -56815 -257041 -298198
11151 -298198 144227 -254753 352569 101375 -352225 284102 34172 -63728 -122401 -42591
11140 22083 179509 -15254 8181 16464 -70869 -120065 -196790 -33803 -200855 33744 191305
11129 191305 88612 126280 16436 6865 96807 71917 128685 -112926 -110642 -31636 -96743 -73227
11117 -73227 207726 187589 -237980 179620 233182 -118913 33374 188814 240621 -113683
$$ packed form
11197e469I0554l5835A6430a19935e4052p4375B47043a0149j08636G9920e7301
11185G9486a52327l56190O3096J41011a19551B42403b6968k49987J2510A63398
11174a6926A69328c2884k55798B89275C5554h5068o8074A40221D7489b41015B20038
11162d7597F3930b36534b9199J3900A39573c40505A0659J49163e6815k00226m1157
11151b98198A44227b54753C52569A01375c52225B84102C4172f3728n8673d2591
11140B2083J57426a5254H181Q283g0869m9196p6725c3803j67052C3744J57561
11129A91305H8612L7668A6436F865Q9942k4890N6768a12926K284c1636o5107K3516
11117g3227B07726k0137b37980A79620N3562a18913C3374J55440N1807a13683
$$ plain form
11106 26103 256353 500501 435511 113144 -190333 50943 -313367 138160 -29802 -12803
11095 396018 327905 267635 -22549 69570 283962 274941 -100033 165760 445256 -75310 164074
11083 -50099 337481 77957 333047 518947 286421 233211 340477 166805 203480 276539
11073 276539 44008 333378 377350 337604 353640 148962 385490 156693 296219 294279 659864
11062 659864 110212 123865 502262 575837 615761 770445 573590 467223 658946 507380
11052 507380 671680 253995 725493 661832 520182 710841 581282 718481 781185 731494
11042 731494 311159 589556 800169 756477 419744 780088 617567 556475 843603 356658
11031 336083 1050729 553683 743028 646720 551682 753883 661343 646894 565027 660476 393834
$$ packed form
11106B6103K30250K44148o4990A13144a90333E0943c13367A38160b9802a2803
11095C96018o8113o0270b2549F9570K14392r021a00033A65760K79496g5310A64074
11083e0099C37481G7957K55090J85900k32526n3210J07266A66805L6675P3059
11073B76539D4008K89370M3972l9746J6036A48962K36528A56693J39526j940L65585
11062F59864A10212J3653L78397P3575L9924J54684j96855j06367J91723j51566
11052E07380J64300B53995M71498o3661j41650J90659j29559J37199O2704m9691
11042G31494C11159K78397K10613m3692l36733L60344j62521o1092K87128C56658
11031C36083P14646m97046J89345r6308r5038K02201r2540j4449q1867R5449k66642
$$ plain form
11020 393834 685606 98723 536496 248206 471245 897872 536523 567715 503746 540120
11010 540120 24194 674574 394613 424594 491481 570985 742880 1002388 472543 331647
11000 331647 473334 517519 555624 600134 369925 867748 823955 383903 491927 345356
10990 345356 491525 368928 508452 707379 1002884 790183 829686 693591 723584 1272800
10980 1272800 1009797 1085655 1233668 1411373 1367690 1869233 1651748 2046088 2141810 2561853
10970 2561853 2287377 2354987 2360981 2280493 2025611 1897853 1400598 1459192 1495090 1498632 1638434
10959 1638434 1772901 1478905 1669016 1522365 1666049 1627201 1750034 1237096 1185921 844615
10949 844615 564439 852488 255583 616198 711383 181324 434519 187003 651911 491383
$$ packed form
11020C93834K91772I8723M37773B48206K23039M26627l61349L1192o3969L6374
11010E40120B4194O50380k79961K9981O6887P9504J71895K59508D72543j40896
11000C31647J41687M4185L8105M4510k30209M97823m3793C83903J08024j46571
10990C45356J46169j22597J39524J98927K95505k12701L9503j36095K9993N49216
10980A272800k63003P5858J48013J77705m3683N01543k17485L94340R5722M20043
10970B561853k74476O7610N994q0488k54882j27758m97255N8594L5898L542J39802
10959A638434J34467k93996J90111j46651J43684l8848J22833n12938n1175l41306
10949H44615k80176K88049B55583L60615R5185A81324K53195A87003M64908j60528
$$ plain form
10939 491383 436645 6980 11455 135065 -144884 -7997 93192 269582 -208659 50877 165788
10928 165788 200202 56864 -45633 26562 -178390 -377093 26033 389927 68436 -189392 39079
10916 -122639 183659 -27169 -288775 -179570 -138132 42922 50359 -230359 132216 -29794 -152218
10905 -152218 3123 126013 -307546 247311 40801 -304634 -365622 33820 136372 -201480
10894 -96186 4425 -65723 -112423 134576 -133135 -159919 -211588 -11745 12851 -144683 -181279
10883 -181279 194992 261269 -41684 33713 -140134 377413 -143525 88781 -63136 -254901
10873 -254901 -169114 36133 -29516 -214243 -57987 -60674 147554 179120 128521 151309 -119368
10861 -138061 254416 288467 -288828 16069 12829 40434 -116051 -57333 121504 20177 -280552
$$ packed form
10939D91383n4738F980M475J23610a44884g997I3192J76390b08659E0877J14911
10928A65788L4414E6864d5633B6562a78390j98703B6033L63894F8436a89392C9079
10916a22639A83659b7169k61606J09205M1438D2922P437b30359A32216b9794j22424
10905a52218C123J22890c07546B47311D0801c04634o0988C3820J02552b01480
10894i6186D425f5723m6700A34576a33135k6784n1669a1745A2851a44683l6596
10883a81279A94992O6277d1684C3713a40134C77413a43525H8781f3136j91765
10873b54901Q5787C6133b9516j84727e7987k687A47554L1566n0599K2788a19368
10861a38061B54416L4051b88828A6069l240K7605a16051e7333A21504B0177b80552
$$ plain form
10849 -68680 9689 -327480 240062 -20374 201597 69334 -429950 -286010 -8990 -193581 74694
10837 -3240 -43639 -340215 198973 17328 52585 118690 -204762 -24647 -311 -235622 -184644
10826 -184644 -261409 -12253 -182741 -186303 122566 -90309 115883 138076 -128372 248878 -22759
10814 -66037 114891 -180722 -43855 -79043 67401 3971 -370047 187258 -76412 -189726 172291
10802 47009 38943 -142938 180154 -15959 -239724 -112621 -66025 115685 -29944 -167014 -56009
10790 14917 -13785 154553 201706 -291092 194376 -42796 -87161 -162325 -16035 -6541 -198481
10779 -198481 -13114 -27452 524645 181816 107934 278261 -92898 58809 416764 31072 325475
10768 325475 307429 -220471 122364 -245000 -55779 -44754 4332 58163 -106213 165321 117732
$$ packed form
10849f8680I689c27480B40062b0374B01597F9334d29950J43940h990j84591G4694
10837c240m0399k96576A98973A7328L5257O6105b04762b4647c11k35311N0978
10826a84644p6765a2253j70488l562A22566i0309A15883K2193a28372B48878b2759
10814f6037A14891a80722d3855l5188F7401C971c70047A87258g6412j13314A72291
10802D7009q066a42938A80154a5959k23765a12621M6596A15685b9944j37070e6009
10790A4917a3785A54553M7153b91092A94376d2796m4365p5164a6035f541j91940
10779a98481a3114j4338E24645A81816p3882J70327i2898E8809L57955C1072K94403
10768C25475j8046b20471A22364b45000e5779J1025D332N3831a06213A65321m7589
$$ plain form
10757 117732 -212089 115990 -224785 186143 19557 -149617 -257965 -35085 -292194 -76882
10746 287014 -56672 64236 202885 -386953 42567 -126866 95717 92419 -9063 -136811 -41051
10734 -223961 -78928 -57603 -244250 41712 -100992 62090 -358773 -211670 -21561 48583 101936
10723 101936 104654 -485577 -293018 310687 -156233 -57262 -311855 299081 -155760 -193385
10713 -193385 87134 -296262 63817 170577 -138313 -8648 96573 -18549 -239931 -107508 280000
10701 4989 -57458 -143683 112762 49373 51605 813 195152 -233968 45896 -162082 104936
10689 -175281 -458904 178181 -28582 -176732 -46409 -473622 -50949 155763 3332 -245128
10678 -20333 -24654 113519 16707 220216 -282509 118404 83409 250743 -164638 125466
$$ packed form
10757A17732b12089A15990b24785A86143A9557a49617j08348c5085k57109g6882
10746B87014e6672F4236J38649c86953D2567a26866I5717l298i063j27748d1051
10734b23961g8928K1325j86647D1712a00992F2090c58773J47103b1561D8583N3353
10723A01936K718d85577J92559C10687a56233e7262k54593B99081a55760l7625
10713a93385H7134b96262F3817J06760a38313h648I6573a8549k21382a07508B80000
10701D989e7458q6225A12762D9373K232H13J94339b33968D5896a62082A04936
10689a75281k83623A78181b8582j48150d6409m27213e0949A55763C332b45128
10678b0333m321A13519A6707K03509b82509A18404l4995J67334a64638A25466
$$ plain form
10667 -278200 -95681 107760 121621 -53294 -55391 158647 179042 -65036 -117636 -27903 62098
10655 -324377 -133087 -270932 -216501 142013 -12313 -319966 -10758 121985 -67089 -15321
10644 -241362 -379425 -149613 497142 205333 -87304 11221 -186721 -194516 -174999 223432
10633 -64340 31313 -129128 77741 -357127 -59161 -174632 -283347 57578 -387563 54552 -2599
10621 86480 -198830 271618 -417784 285986 -108328 -301082 165035 131261 165698 55812
10610 167154 207307 -195604 -91276 -41729 220845 -106403 51664 8672 67663 -210633 -2721
10598 37707 51063 -149871 31486 -306292 -253257 -108241 -139995 -303112 -273814 24901 80701
10587 80701 56174 -46582 469166 -235642 152158 -388301 -231722 -36646 -210348 -141933
$$ packed form
10667b78200i5681A07760J3861e3294k097A58647K0395f5036n2600b7903F2098
10655c24377a33087j37845N4431A42013a2313l07653a0758A21985f7089a5321
10644b41362j38063a49613D97142B05333h7304A1221a86721p795J9517B23432
10633f4340C1313a29128G7741c57127e9161j15471j08715E7578c87563E4552b599
10621H6480a98830B71618d17784B85986a08328j92754A65035l3774L4437E5812
10610A67154M0153a95604i1276d1729B20845a06403E1664H672N8991b10633b721
10598C7707J3356a49871C1486c06292N3035a08241l1754j63117K9298B4901N5800
10587H0701k4527d6582D69166b35642A52158c88301J56579c6646j73702O8415
$$ plain form
10577 -141933 26212 -75513 -121230 61149 176338 -204291 -40955 -171727 -172233 -198208 130159
10565 280323 -157305 -58079 -282745 -313824 -128462 208792 129790 45901 -36657 -227567
10555 -227567 -15751 28247 -205173 194888 -13375 109843 232778 189747 -24587 195068
10544 -119980 214392 71793 -235545 -119515 -292578 170203 -387320 38216 -145111 120842
10533 106984 -226721 -58961 -126424 -74868 -143607 -60815 112291 -209297 212355 -52746 -343721
10522 -343721 293656 81335 -28320 235 -278885 107941 -406995 -118621 -34565 -170470 186672
10510 41902 -430038 -351516 289871 122156 266569 -116199 -6698 -255593 221307 -29608
10499 -242168 49346 -194717 230919 -145434 -30638 188881 50470 302640 -167561 39800
$$ packed form
10577a41933B6212g5513m5717F1149J15189b04291d0955j30772n06k5975A30159
10565B80323a57305e8079k24666l1079a28462B08792p9002D5901c6657j90910
10555b27567a5751B8247b05173A94888a3375A09843J22935m3031b4587A95068
10544a19980B14392G1793b35545J16030j73063A70203c87320C8216a45111A20842
10533A06984b26721e8961o7463N1556o8739f0815A12291b09297B12355e2746k90975
10522c43721B93656H1335b8320B35b78885A07941d06995a18621c4565j35905A86672
10510D1902d30038P8522B89871A22156J44413a16199f698k48895B21307b9608
10499b42168D9346a94717B30919a45434c0638A88881E0470K52170a67561C9800
$$ plain form
10488 126395 -136241 258600 -85633 -125303 -286412 -146203 253601 284719 321326 722877
10478 722877 375787 255258 160055 -14290 182112 182830 -47411 24280 -18655 95876 -129863
10466 81413 -64466 6110 -168709 18956 -60183 190953 -163005 188188 -63321 25172 67094
10455 67094 -217209 -91072 329271 27192 -199396 51239 -56309 398668 -69444 21489 -124069
10443 -90715 295115 -71801 93500 -333640 -212430 -333182 -52269 7359 -129231 -112860 -57872
10432 -57872 -85146 -14096 -722 -29799 33024 -222809 -97668 -111841 79405 -70505 -274619 239273
10419 302491 -225322 312259 66979 -119370 307454 -187372 71250 120815 -14498 179539
10408 -13694 269103 -154394 -69974 121916 135502 46615 127334 -147867 170443 -240246
$$ packed form
10488A26395a36241B58600h5633l9670j61109J40209B53601L1118L6607M01551
10478G22877l47090j20529r5203a4290A82112P18d7411B4280a8655I5876a29863
10466H1413f4466F110a68709A8956f0183A90953a63005A88188f3321B5172M1922
10455F7094b17209i1072C29271B7192a99396E1239e6309C98668f9444B1489a24069
10443i0715B95115g1801I3500c33640J21210j20752e2269G359a29231J6371N4988
10432e7872k7274a4096g22k9077C3024b22809i7668j4173G9405g0505k04114B39273
10419C02491b25322C12259F6979a19370C07454a87372G1250M9565a4498A79539
10408a3694B69103a54394f9974A21916J3586D6615Q0719a47867A70443b40246
$$ plain form
10397 180286 -66321 141758 -144049 99407 357241 186935 256518 103945 -24334 52126
10386 257379 319346 -33157 -113132 206978 -30074 -93112 287577 283022 192725 99216 490491
10375 490491 320750 -54598 136721 67098 31498 129444 177597 288387 408406 358404 71874
10363 209776 81012 22347 352865 488508 577830 81058 184570 149930 235204 461169 138253
10351 -47524 256546 497622 331615 438952 531153 256796 88045 427852 92183 -35852
10340 512205 -103774 101640 129186 112885 390460 -44471 8508 -48710 -53189 131248 115088
10329 115088 185105 -191730 36594 214804 41299 149142 -5647 294834 386309 156282 145131
10318 145131 -30934 -127805 132092 53107 100517 190604 -324291 372212 -166475 -303812
$$ packed form
10397A80286f6321A41758a44049I9407K57834j70306O9583A03945b4334E2126
10386B57379O1967c3157p9975B06978c0074o3038B87577m555r0297r3509L91275
10375D90491j69741e4598A36721F7098C1498R7946M8153J10790J20019n0002G1874
10363B09776H1012B2347L30518J35643Q9322H1058J03512l4640Q5274K25965A38253
10351d7524B56546K41076j66007J07337R2201B56796H8045L39807I2183c5852
10340E12205a03774A01640K7546j6301K77575d4471H508d8710m479A31248j6160
10329A15088P0017a91730C6594J78210D1299J07843e647B94834R1475A56282j1151
10318A45131c0934r6871A32092E3107M7410R0087c24291C72212a66475j37337
$$ plain form
10308 -303812 117939 -93887 142980 -91386 273941 118589 -149775 -17389 -283120 60567
10297 96479 11101 -132761 66343 -67033 31144 20512 -161223 -256164 -1526 171502 -185045
10285 -40103 174797 -192498 -28481 -41799 -99076 -146540 -260254 22792 56753 -155460 154951
10273 -136272 -422772 -30393 179723 -35954 -131893 -149396 -94274 201097 347846 -126558
10262 -163757 314816 288320 223863 101010 57731 446027 274271 -133702 165975 26032
10251 133933 281638 -217543 -141519 -67570 -57715 -95980 -52850 58329 274047 7512 -132433
10239 -215159 -91347 197983 62918 231541 6824 71766 350421 195193 129173 -156490 254729
10227 -67468 -373643 -248370 -106539 -14463 -257787 93605 64079 326684 -247499 -117645
$$ packed form
10308c03812A17939i3887A42980i1386B73941A18589a49775a7389k65731F0567
10297I6479A1101a32761F6343f7033C1144j0632a61223r4941a526A71502a85045
10285d0103A74797a92498b8481j3318n7277m7464j13714B2792L3961a55460A54951
10273a36272k86500c0393A79723c5954r5939j7503N5122B01097J46749a26558
10262a63757C14816k6496o4457A01010m3279L88296j71756a33702A65975B6032
10251A33933J47705b17543P6024f7570R855l8265M3130E8329K15718G512a32433
10239b15159i1347A97983F2918J68623F824O4942K78655j55228o6020a56490B54729
10227f7468l06175J25273a06539a4463k43324I3605k9526K62605b47499a17645
$$ plain form
10216 -327985 -140492 -129468 -59261 -13781 313891 -188710 -81834 -114208 -568289 44307 -218990
10204 -33113 96008 -169671 -217193 165723 -169156 -139139 -20110 51248 -75497 -203878 -289663
10193 -289663 -108817 -22511 -148676 -50720 -150861 60306 -218228 86877 -273467 -38073
10182 -234267 -196275 202952 -89972 163427 -115103 -90725 -31887 -214420 -113954 84885
10171 208314 -166181 -198143 -67885 -59134 -68233 94706 -233587 -71722 -189888 -181520 -92875
10160 -92875 -153528 -142517 281785 -218210 291260 -232836 35091 182005 -80666 -7355 88245
10148 -182844 147604 -183813 -244413 191101 -288799 -46032 -184969 161109 -12604 108071
10137 -19386 -185089 -174312 128937 190269 -188708 -291592 -27384 117382 -207835 68190
$$ packed form
10216c27985a40492J1024e9261a3781C13891a88710h1834l2374m54081D4307b18990
10204c3113I6008a69671m7522A65723a69156L0017b0110E1248g5497j28381q5785
10193b89663a08817b2511j26165e0720j00141F0306b18228H6877b73467c8073
10182b34267L7992B02952h9972A63427a15103K4378c1887j82533J00466H4885
10171B08314a66181l1962f7885Q751r099I4706b33587g1722j18166Q368Q8645
10160i2875o0653J1011B81785b18210B91260b32836C5091J46914h0666g355H8245
10148a82844A47604a83813o0600A91101b88799d6032j38937A61109a2604A08071
10137a9386j65703J0777A28937O1332a88708j02884b7384A17382b07835F8190
$$ plain form
10126 -185291 -131105 -88110 -131543 -4460 -179638 15838 -156805 102301 -250797 -119998 -305359
10115 -305359 -385235 165988 181479 -128202 -200176 -180022 -6124 -194491 -133354 -242649 327441
10103 190708 -86996 -18750 -15364 -124666 -126697 36340 260366 180175 -95841 152634 58881
10091 -91176 -435527 202207 -13393 -290528 -41005 -149037 -161529 -71251 138314 -243787
10080 -185794 -315571 -84056 -142902 155047 121907 -100075 -351850 -207733 113436 -124341
10069 -64886 74476 73791 -21878 242967 67987 -2953 -43440 -184900 -16931 -198786 74731 -84868
10056 -68301 6660 -123491 -196797 -129955 -161480 -13116 126069 141315 -11072 150262 -80035
10044 -168913 -141084 14162 74586 181526 59858 -47867 74503 109294 -106436 -128797 221482
$$ packed form
10126a85291N4186M2995m3433d460j75178A5838a56805A02301b50797a19998j85361
10115c05359p9876A65988J5491a28202p1974K0154f124j88367O1137j09295C27441
10103A90708h6996a8750L386j09302k031C6340K24026q0191i5841A52634E8881
10091i1176l44351B02207a3393k77135d1005j08032j2492g1251A38314b43787
10080a85794j29777h4056n8846A55047l3140a00075k51775J44117A13436a24341
10069f4886G4476o85b1878B42967F7987b953m0487j41460a6931j81855G4731h4868
10056f8301F660a23491p3306O6842l1525a3116A26069J5246a1072A50262h0035
10044a68913K7829A4162O0424J06940E9858d7867G4503L4791a06436k2361B21482
$$ plain form
10032 27943 -389501 -245557 -175797 -116275 -273594 -314655 -23001 -218899 10311 105699 -157087
10020 -78480 -69159 -176349 7808 -132235 -191853 3564 -27372 111462 -20865 98902 -16220 -242735
10008 -242735 -162946 4323 -237087 101634 -253753 -177958 -104040 15914 -205914 -65206 12518
9996 274015 356440 -218537 70425 -48832 -18550 145745 173213 163114 208800 209585 -73508 -106003
9984 -106003 25823 30691 113882 260051 130673 2644 -16399 -71835 -395628 -159281 -434960
9973 -434960 -61078 -231479 343227 -3100 4180 -201980 302321 365669 -303354 13762 -141137
9961 186065 150761 -242112 -18783 -82968 233700 -205277 -371672 -25292 54972 -277641 138629
9949 -187332 77093 149169 -343291 -90623 -286900 -354395 -87350 -194499 96246 -196375 -122281
$$ packed form
10032B7943c89501J43944O9760N9522j57319m1061b3001j95898A0311R5388a57087
10020g8480R321j07190G808a32235n9618C564b7372A11462b0865I8902a6220k26515
10008b42735P9789D323b37087A01634b53753P5795P3918A5914b05914f5206A2518
9996B74015Q2425b18537G0425d8832a8550A45745K7468j0099M5686P85g3508l2495
9984a06003B5823M868Q3191J46169j29378B644a6399n5436l23793a59281k75679
9973d34960f1078j70401C43227c100D180b01980C02321O3348c03354A3762a41137
9961A86065l5304b42112a8783o4185B33700b05277j66395b5292E4972b77641A38629
9949a87332G7093P2076c43291i0623j96277o7495h7350j07149I6246a96375P4094
$$ plain form
9938 -122281 -212743 -277533 177782 11653 -294331 -97514 -232037 18898 -207666 312714 -170506
9926 -67755 244520 136340 -94967 -386663 -18864 217073 -51726 122325 130902 71549 -224739
9914 9718 -277584 -232799 253465 -157530 -228887 -99392 95929 92866 -172993 -209358 -329039
9903 -329039 -167271 -118219 78095 -349276 -98728 56879 87077 -528090 95127 -168124 -56710
9891 -10892 -165035 -491238 -41605 59745 -79435 96446 -224446 63304 -17405 39102 37429
9880 37429 -40863 -14653 -330820 -135459 -161706 -133990 -53376 95649 -79048 -93824 400203
9868 -323393 -245462 -204358 -108726 -15233 208318 -376590 179898 -209806 -9094 -160786 -31808
9856 -242417 2017 77638 152159 -20725 -192001 -255326 -315031 157202 89235 -130364 -311197
$$ packed form
9938a22281r0462o4790A77782A1653b94331i7514j34523A8898b07666C12714a70506
9926f7755B44520j08180i4967k91696a8864B17073e1726A22325Q577n9353b24739
9914I718b77584M4785B53465a57530p1357i9392I5929l063a72993l6365j19681
9903c29039J61768M9052G8095c49276i8728E6879L0198e28090I5127a68124e6710
9891a0892j54143l26203d1605E9745g9435I6446b24446F3304a7405C9102j673
9880C7429d0863a4653l16167a35459k6247K7716e3376I5649g9048j4776D00203
9868c23393P7931M1104R5632a5233B08318c76590A79898b09806i094j51692c1808
9856b42417B017P5621P4521b0725j71276o3325n9705A57202o7967a30364j80833
$$ plain form
9845 -311197 -105251 -13072 131728 -154771 15401 -33747 -104075 106062 -166916 -208059 29396
9833 -359991 -279521 50388 -3671 -317201 -2668 165860 202420 -132793 63473 -236288 -462877
9822 -462877 296616 -228329 -285 -127227 -81998 -70063 -113181 -106735 223002 -125172 -150159
9811 -150159 -120110 -1246 -466517 193971 -416017 -160849 151538 8027 183695 74153 -333714
9799 32797 246055 -88453 286396 125012 161730 -108867 -54075 -265277 -164990 -255422 61067
9787 -36201 192863 -62498 101299 1321 -234584 27335 -120642 -154941 -89884 248034 225542
9776 225542 14862 -104928 -266547 -125235 18517 -436298 -177334 -47686 310158 -47004
9765 -18367 -156827 -225316 -224639 -56828 124349 158052 113039 -76922 291046 -160337 -115989
$$ packed form
9845c11197a05251a3072A31728a54771A5401c3747p0328A06062a66916m1143B9396
9833c59991Q0470E0388c671l13530b668A65860L6560a32793F3473b36288k26589
9822d62877B96616b28329b85j26942M5229J1935m3118O446B23002a25172k4987
9811a50159L0049a246m65271A93971d16017a60849A51538H027J75668G4153c33714
9799C2797K13258h8453B86396A25012L6718a08867e4075k11202J00287r0432F1067
9787c6201A92863f2498A01299A321b34584B7335a20642l4299O5057B48034k2492
9776B25542A4862a04928j61619a25235A8517d36298a77334d7686C10158d7004
9765a8367j38460o8489O77e6828A24349L3703m5013g6922B91046a60337M4348
$$ plain form
9754 -115989 -160200 -397946 -298435 -51426 -148363 51502 -26930 122344 -164673 -15270 -89484
9743 -89484 -94200 -7890 -84704 80949 48095 71995 -238103 -20435 -9287 -40335 -73049 27385
9730 282134 -93788 18501 72380 -287240 -173542 -273751 -90135 87382 -179090 117202 56243
9718 24906 -312717 -136701 -3655 203482 3225 95169 -138468 -93854 -216725 -96201 -5933
9706 -91281 -59333 5362 32614 4606 -229719 46392 -271438 -75139 -333754 63625 15407 -438510
9693 154564 4450 -94961 -61851 64662 -18974 -758 52983 -353246 -149550 70104 217286 25475
9680 -189284 265327 -221400 421842 -128175 -497735 -76761 24130 -107161 -70709 -196584
9670 -196584 -22733 37209 108371 32911 253413 89017 -10096 243906 -58336 212863 114495
$$ packed form
9754a15989m4211k37746R9511e1426r6937E1502b6930A22344a64673a5270p4214
9743h9484m716g890p6814H0949l2854K3900b38103b0435i287l1048l2714B7385
9730B82134i3788A8501N3879b87240J13698j00209i0135H7382a79090A17202E6243
9718B4906c12717a36701c655B03482C225R1944a38468M4614j22871i6201e933
9706i1281L1948E362K7252D606b29719D6392b71438g5139k58615F3625A5407d38510
9693A54564D450i4961L3110F4662a8974g58E2983c53246a49550G0104J47182B5475
9680a89284B65327b21400D21842a28175l69560g6761B4130a07161L6452j25875
9670a96584b2733C7209P1162C2911K20502H9017a0096B43906e8336B12863r8368
$$ plain form
9659 114495 151830 -39254 -420193 -177243 -121178 113691 -79357 18574 -268310 115562 127828
9648 127828 -72035 -82626 -318627 65522 -263224 -284747 66879 117418 -339589 -172704 125555
9636 -419652 -68394 -369960 -52166 93706 -294760 -18739 -26540 -13706 275821 390632 -253733
9624 -92288 -107765 157938 -216750 -412033 85942 -309584 38503 203128 167681 -285296 -166075
9613 -166075 -118371 -18037 -246290 29602 71938 -25984 109603 172095 -38819 -107462 275788
9601 286795 -75487 -220244 -287703 -32418 -43288 -92469 -30816 150326 187855 47937 -197847
9589 -156771 -369841 -373900 127684 -118069 15715 -12347 152575 -329418 -179716 -399842
9579 -399842 -72495 -243731 -407933 136951 113334 59200 5199 -154889 197379 155495 -82247
$$ packed form
9659A14495L7335c9254l80939a77243N6065A13691g9357A8574b68310A15562J2266
9648A27828g2035j0591k36001F5522b63224k1523F6879N0539c39589J66885A25555
9636d19652f8394l01566e2166I3706b94760a8739p801J2834B75821J14811b53733
9624i2288j5477A57938b16750j95283H5942c09584C8503J64625l5447b85296J19221
9613a66075M7704a8037k28253B9602M2336b5984A09603O2492c8819o8643B75788
9601B86795g5487j44757o7459c2418j0870m9181c0816A50326L7529D7937a97847
9589a56771k13070m059A27684a18069A5715a2347A52575c29418J49702k20126
9579c99842g2495j71236j64202A36951k3617n4134E199a54889A97379m1884h2247
$$ plain form
9567 243178 -391610 -122910 -261801 367855 -50410 -918 181055 -38860 258820 103455 -185916
9555 126297 7936 -61526 -45172 238384 -121925 -126338 2234 -100343 -135696 -201227 -96768 -27400
9542 -50446 -138981 -183823 234993 -182646 -84829 -346493 -54229 -26902 267761 -21925 -29017
9531 -29017 91376 217188 -217453 -334728 -224005 -270987 -52677 -404587 147927 -118079
9520 -144277 89082 -36243 -106932 109416 88236 -156692 -219475 225823 483123 -73857 -10469
9508 7095 86104 34579 -122185 -31893 39210 -236272 -209876 -103809 55328 -106840 -205242
9497 -205242 -48514 -187876 143787 -70978 -189982 -71370 -57695 -117825 72046 116189 10003
9485 -246659 -142261 -444707 -85210 -52643 -187679 16771 -196017 -235025 -65897 323 -82910
$$ packed form
9567B43178c91610a22910j38891C67855e0410i18A81055c8860B58820A03455a85916
9555A26297G936f1526J6354B38384a21925m413B234a00343l5353o5531i6768b7400
9542e0446q8535m4842B34993a82646h4829k61664e4229b6902B67761b1925p092
9531b9017I1376J25812b17453j17275J10723m6982e2677l51910A47927a18079
9520a44277H9082c6243p0689A09416k1180a56692o2783B25823K57300g3857a0469
9508G095P9009C4579a22185c1893C9210b36272K6396a03809E5328a06840r8402
9497b05242d8514j39362A43787g0978j19004g1370J3675o0130G2046M4143A0003
9485b46659J04398l02446h5210L2567j35036A6771a96017l9008f5897C23h2910
$$ plain form
9473 -92274 -232874 34100 14520 -46698 30557 -51633 13876 -180751 -28687 -94375 -44558
9461 -197318 -43092 -93643 -217695 -151549 74516 -222457 -90614 -197245 -21327 166379 -100364
9449 -135977 -105049 54452 -17351 -34477 -54710 -327875 152487 -28242 -237247 -207170 221095
9437 131093 -54723 215897 -71212 -56594 35744 -60368 -121811 85404 166103 61991 12975
9425 -342483 -305834 -333468 -13355 179515 10317 -4573 -85196 -495340 -9800 -64925 -388577
9414 -388577 44655 288948 266112 -261002 -8625 -633 -89030 -611894 -258525 -479455 191271
9402 -159484 65304 -265808 -98073 -16693 -13440 -216940 -153623 -136439 -281322 -118145 -107909
9391 -107909 188356 -9656 -192189 -407770 -13149 -174406 -200726 61975 -238684 -79670 -251413
$$ packed form
9473i2274j40600C4100A4520d6698C0557e1633A3876a80751b8687o5688d4558
9461a97318d3092n0551j24052O6146G4516b22457i0614j06631b1327A66379a00364
9449a35977L0928E4452a7351j7126k0233k73165A52487b8242k09005L0077B21095
9437A31093e4723B15897g1212J4618C5744f0368o1443H5404Q0699F1991A2975
9425c42483L6649k7634a3355A79515A0317d573q0623m10144i800n5125l23652
9414c88577D4655K44293k2836b61002h625f33q8397n22864b58525k20930A91271
9402a59484F5304b65808i8073a6693L253k03500O3317J7184j44883a18145J0236
9391a07909A88356i656j82533k15581a3149j61257k6320F1975b38684g9670j71743
$$ plain form
9380 -251413 -51632 -77151 -283745 52360 -12431 -56650 54039 -332735 -144631 72625 13024
9368 103625 -490191 108705 38657 -254361 21990 402461 -65971 -106929 -216313 220841
9357 24520 -12374 -360340 -96960 -192337 -171979 -211736 17677 -56837 -320636 162247 -162753
9345 -105105 115876 75934 -459480 -131794 -165061 87461 -14158 31518 -8385 45123 -86368
9333 -180038 -18489 36895 -253698 -42669 -101169 -89757 156117 286738 107290 144770 -218865
9321 -77338 -192261 -176775 -28966 48141 -159608 -100767 100425 452467 -183424 -74835 -666698
9310 -666698 234538 -100955 -238114 -179984 285005 -63988 467469 -128681 43302 -124471
9299 21918 -311306 233110 426249 -18851 -365695 169776 -379267 -266848 -187727 -274917
$$ packed form
9380b51413e1632k5519k06594E2360a2431m4219E4039c32735a44631G2625A3024
9368A03625d90191A08705C8657b54361B1990L80471f5971m0958j09384B20841
9357B4520a2374l47966i6960r5377K0358l9757A7677e6837k63799A62247a62753
9345a05105A15876l9942d59480a31794l3267H7461a4158C1518h385D5123h6368
9333a80038a8489C6895b53698d2669n8500J1412A56117J30621A07290L7480b18865
9321g7338j14923J5486b8966D8141a59608N8841A00425L52042a83424g4835n91863
9310f66698B34538a00955j37159N8130B85005f3988D67469a28681D3302a24471
9299B1918c11306B33110J93139a8851l46844A69776c79267J12419P9121q7190
$$ plain form
9289 -274917 -296387 -90755 -47584 67058 -220704 -310157 17310 -128689 -61100 135399 23073
9277 -207083 1702 58758 249591 126693 -80224 -217904 -125310 -151438 -73616 -124464 -51634
9265 -181272 203761 -15750 -70885 -88212 33805 156698 91368 -48535 -146312 -199951 -32163
9253 -116626 136868 -70531 -161526 93982 153052 50286 -259637 10879 30069 164375 188219
9242 188219 68320 -11670 -32347 160862 57355 304577 85545 127303 -44237 -155541 -232797
9231 -232797 38800 27112 151884 177281 115240 125570 -80046 138651 65583 -34628 -376669
9220 -376669 -389057 149356 -244356 232532 -267086 128695 106239 104783 -101586 -213585
9210 -213585 -20793 78089 32873 -58011 -70901 -145489 -246467 -13463 -14398 86076 -247532 134993
$$ packed form
9289b74917k1470i0755M3171F7058b20704q9453A7310a28689f1100A35399B3073
9277b07083A702N7056J90833j22898h0224j37680R2594k6128g3616n0848e1634
9265a81272B03761a5750n5135j7327C3805J22893o5330d8535r7777n3639c2163
9253a16626A36868g0531r0995I3982N9070E0286b59637A0879J9190J34306K3844
9242A88219F8320a1670k0677A60862E7355K47222H5545M1758d4237j11304p7256
9231b32797C8800j1688J24772K5397o2041J0330h0046A38651F5583c4628l42041
9220c76669j2388A49356b44356B32532b67086A28695k2456j456a01586j11999
9210b13585b0793G8089C2873e8011j2890p4588j00978a3463r35H6076b47532A34993
$$ plain form
9197 -156770 -199069 104890 -9061 -82717 64703 -232998 -39754 -225560 -236222 -27946 -52301
9186 -52301 -275368 179242 95814 -50046 -156419 -104862 72443 -85153 -75985 202754 -16548
9174 -141260 238791 -369282 -51980 -8170 -139762 -38138 269990 -321389 -133881 -272064
9164 -272064 -54374 -299511 -117626 82105 -130706 -293508 -75090 -19417 163556 -77723 157123
9152 -299815 55343 -230020 37771 -156741 62384 180728 -190930 -145369 8292 37980 68147
9141 68147 -17682 43013 -177011 -348990 136178 -153870 -298937 75146 -130261 -159594 -378392
9130 -378392 -100970 -94282 -227609 -335816 44959 140462 -105438 -110947 75039 -73022 -194575
9119 -194575 -12463 -183135 -18333 -396963 -47357 -95856 80717 -56330 28150 14223 82802
$$ packed form
9197a56770m2299A04890i061p3656F4703b32998c9754j85806j0662b7946k4355
9186e2301k23067A79242q3428e0046j06373N1557G2443h5153R168B02754a6548
9174a41260B38791c69282e1980h170j31592c8138B69990c21389a33881j38183
9164b72064e4374k45137a17626H2105a30706j62802g5090a9417A63556g7723A57123
9152b99815E5343b30020C7771a56741F2384J18344a90930M5561H292K9688L0167
9141F8147a7682D3013a77011j71979A36178a53870j45067G5146a30261k9333k18798
9130c78392a00970O688j33327j08207D4959R5503a05438n509G5039g3022j21553
9119a94575a2463j70672a8333l78630d7357m8499H0717e6330B8150j3927O8579
$$ plain form
9108 82802 -201282 150715 -173729 182684 -51439 94512 -155914 -251766 -5533 15468 -58457
9096 -386351 -219888 -135193 80429 -270205 56554 288062 10058 -250174 -17015 -51717 224819
9084 -245985 -108407 -461931 -133163 63601 193452 -199159 -152500 153210 -6469 -69213 62679
9072 -115669 87125 166539 -129740 -47086 215416 -68143 109207 -31385 -176585 -291943 -295105
9061 -295105 -394513 -317203 -70369 -52599 -330882 -115483 -158502 -117939 -216653 -204681 -211590
9050 -211590 -423056 266149 -190148 146663 -189994 250893 -88211 198468 -1487 -109438
9040 -109438 -217104 3805 120788 -30895 5044 510395 -55449 -61279 69172 -168363 141645
9028 54414 104701 -184575 -57296 -322138 -58892 57467 -78545 -304587 -126387 -100341 35169
$$ packed form
9108H2802b01282A50715a73729A82684e1439I4512a55914r5852e533A5468e8457
9096c86351J66463Q4695H0429b70205E6554K31508A0058b50174a7015l4702B24819
9084b45985a08407l53524a33163F3601J29851a99159M6659A53210f469o2744F2679
9072a15669H7125P9414a29740d7086B15416f8143A09207c1385j45200j15358l162
9061b95105r9408P7310g0369J7770k78283a15483m3019M0563r8714J1972o909
9050b11590k11466B66149a90148A46663a89994B50893h8211A98468a487j07951
9040a09438j07666C805J16983c0895E044N05351e5449n830F9172a68363A41645
9028E4414N0287a84575e7296k64842e8892E7467g8545k26042a26387K6046C5169
$$ plain form
9016 -16818 259528 258265 112081 -9835 2009 -18736 -239603 99303 -124639 -223788 293205
9004 286099 -51807 -202847 186694 -140833 169528 -141884 -163857 -216402 -110092 24523
8993 -28521 21640 260446 -158992 -149786 -10881 -325963 38549 -334581 -64083 -17901 -337191
8982 -337191 183357 -332404 127085 -122865 53867 -110383 112816 -256093 37213 145286
8972 145286 -11802 -298984 -47573 236789 54431 -80329 169866 -134197 26390 57332 -91200
8960 -179281 10704 -200130 1917 175733 75001 117731 -177291 -94142 181726 -180989 -336059
8949 -336059 -260921 -69078 -301733 35735 -140529 -425147 -16256 53827 -190720 5740 -156367
8937 -53077 -245732 -479795 106580 386037 165240 58577 237117 -170700 36609 2392 9865
$$ packed form
9016a6818B59528j263A12081i835B009a8736k20867I9303a24639r9149B93205
9004B86099e1807j51040A86694a40833A69528a41884k1973n2545J06310B4523
8993b8521B1640K38806a58992R206a0881l15082C8549c34581f4083a7901l19290
8982c37191A83357c32404A27085a22865E3867a10383A12816b56093C7213J08073
8972A45286a1802k87182d7573B36789E4431h0329A69866a34197B6390L0942i1200
8960a79281A0704b00130A917J73816G5001M2730a77291Q3149A81726a80989j55070
8949c36059P5138f9078k32655C5735a40529k84618a6256E3827a90720E740a56367
8937e3077j92655k34063A06580K79457A65240E8577J78540a70700C6609B392P473
$$ plain form
8926 9865 421427 268787 211189 1323990 4951081 11934580 5072028 1627966 838446
8917 838446 494102 485950 212219 398342 188343 -546 -257255 153126 36434 268263 -13275
8905 153140 -340611 68790 -274042 136060 -138829 -213570 -98685 2935 79550 32822 211882
8894 211882 -108217 14586 173975 59558 -139274 -257101 292244 230501 77995 -28486 -22049
8883 -22049 84458 -206492 -158605 56704 -10632 145145 328398 -124723 -89973 -29680 185470
$$ packed form
8926I865M11562j52640n7598J112801L627091O983499E072028A627966p89520
8917H38446l44344q152B12219J86123A88343e46k56709A53126C6434K31829a3275
8905A53140c40611F8790b74042A36060a38829p4741i8685B935P6615C2822J79060
8894B11882a08217A4586J59389E9558a39274j17827B92244o1743G7995b8486O437
8883b2049H4458b06492M7887E6704a0632A45145J83253a24723L4750b9680A85470
$$ [...]
##END NTUPLES=NMR SPECTRUM
##END=
