##TITLE=AC1590_HPIAH13320_8314025_3dXMPT6A9y
##JCAMPDX= 6.0         $$ Bruker NMR JCAMP-DX V2.0
##DATA TYPE= NMR SPECTRUM
##DATA CLASS= NTUPLES
##ORIGIN= BRUKER
##OWNER= Administrator
$$ 1.72 TOPSPIN		Version 2.1
$$ 2013-11-09 11:21:18.134 -0800  Administrator@X
$$ Compression mode = diff/dup
##.OBSERVE FREQUENCY= 400.02188249412
##.OBSERVE NUCLEUS= ^1H
##.ACQUISITION MODE= SIMULTANEOUS (DQD)
##.ACQUISITION SCHEME= undefined
##.AVERAGES= 64
##.DIGITISER RES= 22
##SPECTROMETER/DATA SYSTEM= spect
##.PULSE SEQUENCE= noesygpps1d.comp
##.SOLVENT NAME= COFFEE_meoh
##.SHIFT REFERENCE= INTERNAL, COFFEE_meoh, 1, 14.96121
##AUDIT TRAIL= $$ (NUMBER, WHEN, WHO, WHERE, PROCESS, VERSION, WHAT)
$$ ##TITLE= Audit trail, TOPSPIN		Version 2.1
$$ ##JCAMPDX= 5.01
$$ ##ORIGIN= Bruker BioSpin GmbH
$$ ##OWNER= Administrator
$$ $$ E:\/data/COFFEE/nmr/AC1590_HPIAH13320_8314025_3dXMPT6A9y/12/pdata/1/auditp.txt
$$ ##AUDIT TRAIL=  $$ (NUMBER, WHEN, WHO, WHERE, PROCESS, VERSION, WHAT)
(   1,<2013-11-09 11:21:13.024 -0800>,<Administrator>,<X>,<go>,<TOPSPIN 2.1>,
      <created by zg
	started at 2013-11-09 11:09:43.599 -0800,
	POWCHK enabled, PULCHK disabled,
       configuration hash MD5:
       C8 4E 4E 5D D3 5C D8 9E 9F 52 82 E0 59 8A DE 15
       data hash MD5: 64K
       93 B9 68 E6 FA C1 FC 28 1A 58 77 A3 43 6C 69 DE>)
(   2,<2013-11-09 11:21:16.196 -0800>,<Administrator>,<X>,<proc1d>,<TOPSPIN 2.1>,
      <Start of raw data processing
       efp LB = 0.3 FT_mod = 6 PKNL = 1 PHC0 = 0 PHC1 = 0 SI = 128K 
       data hash MD5: 128K
       4F 39 CF A0 88 BA DE D5 6B 6C 2F DC E9 E0 D0 B6>)
(   3,<2013-11-09 11:21:17.149 -0800>,<Administrator>,<X>,<proc1d>,<TOPSPIN 2.1>,
      <pk PHC0 = -85.51758 PHC1 = 0 
       data hash MD5: 128K
       99 12 97 1D 18 FB F7 3A 8E 54 CB 77 0E A9 C3 CD>)
(   4,<2013-11-09 11:21:17.571 -0800>,<Administrator>,<X>,<proc1d>,<TOPSPIN 2.1>,
      <abs ABSG = 1 
       data hash MD5: 128K
       1E CA D3 D5 1D 1E 83 6D A7 5D D8 48 B7 C8 EF 8C>)
(   5,<2013-11-09 11:21:17.696 -0800>,<Administrator>,<X>,<proc1d>,<TOPSPIN 2.1>,
      <abs ABSG = 2 
       data hash MD5: 128K
       C2 3F 99 23 11 F3 4C D3 6B 8D AA DF BE 34 A4 FD>)
(   6,<2013-11-09 11:21:17.790 -0800>,<Administrator>,<X>,<proc1d>,<TOPSPIN 2.1>,
      <abs ABSG = 3 
       data hash MD5: 128K
       21 17 BB 8F A7 80 78 51 CA 8F C3 F6 6A DF 61 73>)
(   7,<2013-11-09 11:21:17.868 -0800>,<Administrator>,<X>,<proc1d>,<TOPSPIN 2.1>,
      <abs ABSG = 4 
       data hash MD5: 128K
       30 C4 C1 2E 3A 34 8F BD 92 CE 43 E0 9B E9 E6 C4>)
(   8,<2013-11-09 11:21:17.962 -0800>,<Administrator>,<X>,<proc1d>,<TOPSPIN 2.1>,
      <abs ABSG = 5 
       data hash MD5: 128K
       4E 4C B2 36 13 47 0B 6B 3A 73 75 8B E8 94 C9 FB>)
$$ ##END=
$$ 
$$ $$ hash MD5
$$ $$ 2D 58 62 75 03 4F CE 31 E0 D7 C7 A7 EE C0 C0 D9
##$RELAX= 
##$RELAX= 
##$RELAX= 
##$RELAX= 
##$RELAX= 
##$RELAX= 
##$RELAX= 
##$RELAX= 
$$ Bruker specific parameters
$$ --------------------------
##$DU= <E:\>
##$EXPNO= 12
$$ [...]
##$TP07= 0
##$TPNAME0= <>
##$TPNAME1= <>
##$TPNAME2= <>
##$TPNAME3= <>
##$TPNAME4= <>
##$TPNAME5= <>
##$TPNAME6= <>
##$TPNAME7= <>
##$TPOAL= (0..7)
0.5 0.5 0.5 0.5 0.5 0.5 0.5 0.5
##$TPOFFS= (0..7)
0 0 0 0 0 0 0 0
##$TUNHIN= 0
##$TUNHOUT= 0
##$TUNXOUT= 0
##$USERA1= <user>
##$USERA2= <user>
##$USERA3= <user>
##$USERA4= <user>
##$USERA5= <user>
##$V9= 5
##$VALIST= <valist>
##$VCLIST= <CCCCCCCCCCCCCCC>
##$VD= 0
##$VDLIST= <DDDDDDDDDDDDDDD>
##$VPLIST= <PPPPPPPPPPPPPPP>
##$VTLIST= <TTTTTTTTTTTTTTT>
##$WBST= 1024
##$WBSW= 4
##$XGAIN= (0..3)
0 0 0 0
##$XL= 0
##$YL= 0
##$YMAX_a= 6239980
##$YMIN_a= -13358677
##$ZGOPTNS= <>
##$ZL1= 120
##$ZL2= 120
##$ZL3= 120
##$ZL4= 120
##$ABSF1= 14.96121
##$ABSF2= -5.596972
##$ABSG= 5
##$ABSL= 3
##$ALPHA= 0
##$AQORDER= 0
##$ASSFAC= 0
##$ASSFACI= 0
##$ASSFACX= 0
##$ASSWID= 0
##$AUNMP= <proc_prof1d_extract.lims>
##$AXLEFT= 0
##$AXNAME= <>
##$AXNUC= <1H>
##$AXRIGHT= 0
##$AXTYPE= 0
##$AXUNIT= <>
##$AZFE= 0.1
##$AZFW= 0.1
##$BCFW= 0
##$BC_mod= 0
##$BYTORDP= 0
##$COROFFS= 0
##$CY= 15
##$DATMOD= 1
##$DC= 0
##$DFILT= <>
##$DTYPP= 0
##$F1P= 0
##$F2P= 0
##$FCOR= 0.5
##$FTSIZE= 131072
##$FT_mod= 6
##$GAMMA= 0
##$GB= 0
##$INTBC= 1
##$INTSCL= 1
##$ISEN= 128
##$LB= 0.3
##$LEV0= 0
##$LPBIN= 0
##$MAXI= 10000
##$MC2= 0
##$MEAN= 0
##$ME_mod= 0
##$MI= 0
##$NCOEF= 0
##$NC_proc= -2
##$NLEV= 6
##$NOISF1= 0
##$NOISF2= 0
##$NSP= 0
##$NTH_PI= 0
##$NZP= 0
##$OFFSET= 14.96121
##$PC= 1
##$PHC0= -85.51758
##$PHC1= 0
##$PH_mod= 1
##$PKNL= yes
##$PPARMOD= 0
##$PPDIAG= 0
##$PPIPTYP= 0
##$PPMPNUM= 2147483647
##$PPRESOL= 1
##$PSCAL= 4
##$PSIGN= 0
##$PYNMP= <proc.py>
##$REVERSE= no
##$SF= 400.020009552915
##$SI= 131072
##$SIGF1= 0
##$SIGF2= 0
##$SINO= 400
##$SIOLD= 131072
##$SPECTYP= <>
##$SREGLST= <1H.CDCl3>
##$SSB= 0
##$STSI= 131072
##$STSR= 0
##$SW_p= 8223.68421052631
##$SYMM= 0
##$S_DEV= 0
##$TDeff= 65536
##$TDoff= 0
##$TI= <>
##$TILT= no
##$TM1= 0
##$TM2= 0
##$TOPLEV= 0
##$USERP1= <user>
##$USERP2= <user>
##$USERP3= <user>
##$USERP4= <user>
##$USERP5= <user>
##$WDW= 1
##$XDIM= 131072
##$YMAX_p= 435943775
##$YMIN_p= -11767
##$CURPLOT= <Network HP LaserJet P1505>
##$CURPRIN= <$Network HP LaserJet P1505>
##$DFORMAT= <normdp>
##$LAYOUT= <+/1D_H.xwp>
##$LFORMAT= <normlp>
##$PFORMAT= <normpl>
##$SURQMSG= 1
$$ End of Bruker specific parameters
$$ ---------------------------------
##NTUPLES= NMR SPECTRUM
##VAR_NAME=  FREQUENCY,     SPECTRUM/REAL,   SPECTRUM/IMAG
##SYMBOL=    X,             R,               I
##VAR_TYPE=  INDEPENDENT,   DEPENDENT,       DEPENDENT
##VAR_FORM=  AFFN,          ASDF,            ASDF
##VAR_DIM=   131072,        131072,          131072
##UNITS=     HZ,            ARBITRARY UNITS, ARBITRARY UNITS
##FACTOR=    0.0627417313425164, 1,          1
##FIRST=     8223.62146879497, -842,         -63044
##LAST=      0,             -196,            -64060
##MIN=       0,             -11767,          0
##MAX=       8223.62146879497, 435943775,    0
$$ Real data points
##PAGE= N=1
##DATA TABLE= (X++(R..R)), XYDATA
$$ [...]
61598C85311k817j437o15m79q98j701k564l065l067k759k302j782j521j820k337
$$ 385311 382494 381057 380442 379963 379065 377364 374800 371735 368668 365909 363607 361825 360304 358484 356147
61583C56147k361j817j365j263r69k48J87k49j058j474j600j845j830r22M48J081
$$ 356147 353786 351969 350604 349341 348372 348124 348311 348062 347004 345530 343930 342085 340255 339333 339781 340862
61567C40862O59J04J80O26Q94R73R90P14ko98p44j78M08O71Q46J229J682J842
$$ 340862 341521 341625 341805 342431 343325 344298 345288 346002 346000 345302 344558 344380 344788 345459 346305 347534 349216 351058
61549C51058J642J392J323J276R69M92K50M02O41O75P36J254K099K475J815O36
$$ 351058 352700 354092 355415 356691 357660 358152 358402 358804 359445 360120 360856 362110 364209 366684 368499 369135
61533C69135J81J057K450L013K416J630J539J782J342r5j870l214l823l731l162
$$ 369135 369316 370373 372823 375836 378252 379882 381421 383203 384545 384450 382580 379366 375543 371812 368650
61518C68650k521k052j540q22l99q69j772j862p43N10P63J71l32l30j75l28r47
$$ 368650 366129 364077 362537 361715 361316 360447 358675 356813 356070 356580 357343 357514 357182 356852 356677 356349 355402
61501C55402j832k377j896m09J137J783J466Q12L30J67K93N21N45L08J39L03O65
$$ 355402 353570 351193 349297 348888 350025 351808 353274 354086 354416 354583 354876 355397 355942 356250 356389 356692 357357
61484C57357R94J241J300R49L34J00N67J206J372J240J437K029K427K243J684
$$ 357357 358351 359592 360892 361841 362175 362275 362842 364048 365420 366660 368097 370126 372553 374796 376480
61469C76480J159Q67P87P49N11q7r59j849k388k142r45O89J845K057J614R44K22
$$ 376480 377639 378506 379293 380042 380553 380466 379507 377658 375270 373128 372183 372872 374717 376774 378388 379332 379554
61452C79554l05k85J79M82L99M32Q80J250J142J075J626K316K242J519J177J697
$$ 379554 379249 378964 379143 379625 380024 380456 381336 382586 383728 384803 386429 388745 390987 392506 393683 395380
61436C95380K488K815K605K209J943J953K093J943J349P76P14Q90O37p1n23k84
$$ 395380 397868 400683 403288 405497 407440 409393 411486 413429 414778 415554 416268 417158 417795 417724 417201 416917
61420D16917K38L89M0l72k78N55J782K665K654J817O59k27l73J96P09L02p99j394
$$ 416917 417155 417544 417584 417212 416934 417489 419271 421936 424590 426407 427066 426839 426466 426662 427371 427673 426874 425480
61402D25480j030p74j607k784k844j733p84p51j067j054q17o35m24j50r1l29m71
$$ 425480 424450 423676 422069 419285 416441 414708 413924 413173 412106 411052 410235 409600 409176 409026 408935 408606 408135
61385D08135k16K49N76O04L57R6L16J185J998J901J117P44J208J720J509Q36L80
$$ 408135 407919 408168 408744 409348 409705 409801 410117 411302 413300 415201 416318 417062 418270 419990 421499 422335 422715
61368D22715L06M60R23J719K387K442K075J926K242K649K694K289J698J334J553
$$ 422715 423021 423481 424404 426123 428510 430952 433027 434953 437195 439844 442538 444827 446525 447859 449412
61353D49412K405L523M429M976N513O521Q026R349R647Q756P366O201N341M542
$$ 449412 451817 455340 459769 464745 470258 476779 484805 494154 503801 512557 519923 526124 531465 536007
61339E36007L920L827M208M520M386L975L666L552L371K783J775P67J20m83j687
$$ 536007 539927 543754 547962 552482 556868 560843 564509 568061 571432 574215 575990 576757 576877 576394 574707
61324E74707l336m269l739k510j874j947j785r03K33J209K261L572M764N440N743
$$ 574707 571371 567102 563363 560853 558979 557032 555247 554344 554577 555786 558047 561619 566383 571823 577566
61309E77566O084O689P620Q850J0175J1305J2233J3159J4055J4573J4429J3517
$$ 577566 583650 590339 597959 606809 616984 628289 640522 653681 667736 682309 696738 710255
61297G10255J1757R223O396L809J450j043l610n735p158q150q996r684j0174j0506
$$ 710255 722012 731235 737631 741440 742890 741847 738237 732502 725344 717194 708198 698514 688340 677834
61283F77834j0580j0281r770r214q336o833n159m101l621k855j418J26J278K214
$$ 677834 667254 656973 647203 637989 629653 622820 617661 613560 609939 607084 605666 605792 607070 609284
61269F09284L096L552L375L019K890K759K337J987K254L174M449N907P259P930
$$ 609284 612380 615932 619307 622326 625216 627975 630312 632299 634553 637727 642176 648083 655342 663272
61255F63272P712P255P293P567P113N504L324J466L75r4m18r50j617k048k103
$$ 663272 670984 678239 685532 693099 700212 705716 709040 710506 710881 710787 710369 709419 707802 705754 703651
61240G03651j992j839j544j234j374k081k741k794k495k428k499j946l34J906
$$ 703651 701659 699820 698276 697042 695668 693587 690846 688052 685557 683129 680630 678684 678350 680256
61226F80256L891M957N046M780N021O028P114P462P131O938P386Q179Q786R036
$$ 680256 684147 689104 694150 698930 703951 709979 717093 724555 731686 738624 746010 754189 762975 772011
61212G72011R028Q750Q164P421O712N936M811L412K349K115K434K563K285K238
$$ 772011 781039 789789 797953 805374 812086 818022 822833 826245 828594 830709 833143 835706 837991 840229
61198H40229L052M594O320Q129J0303J2748J4893J6356J7283J7894J8071J7566
$$ 840229 843281 847875 854195 862324 872627 885375 900268 916624 933907 951801 969872 987438
61186I87438J6304J4326J1730Q809N983L504J393l19j573k515l416m285m927n425
$$ 987438 1003742 1018068 1029798 1038607 1044590 1048094 1049487 1049168 1047595 1045080 1041664 1037379 1032452 1027027
61172A027027o174p228q061q246q119q433r553j1193j2803j4022j4824j5459j6197
$$ 1027027 1020853 1013625 1005564 997318 989199 980766 971213 960020 947217 933195 918371 902912 886715
61159H86715j7033j7642j7640j6838j5393j3767j2480j1675j0942r763p984n770
$$ 886715 869682 852040 834400 817562 802169 788402 775922 764247 753305 743542 735558 729788
61147G29788l336j015O37J223R06N1j300l199n119o202o176n559m910m347l904
$$ 729788 726452 725437 726074 727297 728203 728254 726954 723755 718636 712434 706258 700699 695789 691442 687538
61132F87538l681l413k422m17J941L722M830O111Q313J1152J3534J4807J5538
$$ 687538 683857 680444 678022 677605 679546 683268 688098 694209 702522 713674 727208 742015 757553
61119G57553J6799J8781K0690K2151K3905K6558K9332L0931L1246L1198L1186
$$ 757553 774352 793133 813823 835974 859879 886437 915769 946700 977946 1009144 1040330
61108A040330L0759K9841K9177K9168K9072K7833K5210K1822J8464J5576J2900
$$ 1040330 1071089 1100930 1130107 1159275 1188347 1216180 1241390 1263212 1281676 1297252 1310152
61097A310152R605N161O6m807r374j4118j8782k2330k4363k5690k7092k8380k9009
$$ 1310152 1319757 1324918 1324984 1320177 1310803 1296685 1277903 1255573 1231210 1205520 1178428 1150048 1121039
61084A121039k8901k8233k7043k5526k4130k2974k1675k0075j8564j7393j6193
$$ 1121039 1092138 1063905 1036862 1011336 987206 964232 942557 922482 903918 886525 870332
61073H70332j4570j2696j0919r282p722o245m694k827q38P01J640K451L442M418
$$ 870332 855762 843066 832147 822865 815143 808898 804204 801377 800539 801240 802880 805331 808773 813191
61059H13191N247O123P022P671Q247R356J0979J2286J2918J3619J5126J7168J9108
$$ 813191 818438 824561 831583 839254 847501 856857 867836 880122 893040 906659 921785 938953 958061
61046I58061K0843K2496K3880K4942K6092K7548K8908K9892L0909L2323L3753
$$ 958061 978904 1001400 1025280 1050222 1076314 1103862 1132770 1162662 1193571 1225894 1259647
61035A259647L4739L5482L6362L7170L7526L7609L7885L8448L9125L9913M0863
$$ 1259647 1294386 1329868 1366230 1403400 1440926 1478535 1516420 1554868 1593993 1633906 1674769
61024A674769M1868M2906M4157M5605M6946M8043M8993M9757N0404N1722N4736
$$ 1674769 1716637 1759543 1803700 1849305 1896251 1944294 1993287 2043044 2093448 2145170 2199906
61013B199906N9443O5038P1466P9607Q9631J00432J11237J22687J36064J52815
$$ 2199906 2259349 2324387 2395853 2475460 2565091 2665523 2776760 2899447 3035511 3188326
61003C188326J75179K05810K46290K97637L62760M46504N52685O83008Q38619
$$ 3188326 3363505 3569315 3815605 4113242 4476002 4922506 5475191 6158199 6996818
60994F996818J018948J218417J429504J649629J872652K060372K128805J988063
$$ 6996818 8015766 9234183 10663687 12313316 14185968 16246340 18375145 20363208
60986B0363208J616879J099208N79152J76919n5219j15937k9183J46217K98414
$$ 20363208 21980087 23079295 23658447 23835366 23780147 23664210 23635027 23781244 24079658
60977B4079658K92224M6628m08002r49615j440652j791927j975314k003596j910842
$$ 24079658 24371882 24418510 24010508 23060893 21620241 19828314 17853000 15849404 13938562
60968A3938562j741218j537458j329864j134549r59575q08966o82172n75178m84724
$$ 13938562 12197344 10659886 9330022 8195473 7235898 6426932 5744760 5169582 4684858
60959D684858m09834l49203k99858k59268k26514k00473j78908j60232j44371
$$ 4684858 4275024 3925821 3625963 3366695 3140181 2939708 2760800 2600568 2456197
60950B456197j30935j18372j05928r4761q5900p8501p1320o4699n9867n7163n5966
$$ 2456197 2325262 2206890 2100962 2006201 1920301 1841800 1770480 1705781 1645914 1588751 1532785
60939A532785n5578n5219n4028n1897m9670m7717m5227m1575l7571l4450l2333
$$ 1532785 1477207 1421988 1367960 1316063 1266393 1218676 1173449 1131874 1094303 1059853 1027520
60928A027520l0598k9006k7501k5564k2785j9764j7490j6095j4924j3539j2025
$$ 1027520 996922 967916 940415 914851 892066 872302 854812 838717 823793 810254 798229
60917G98229j0552r309q580q323p879o683n088m010l863m201m265l549k098n09
$$ 798229 787677 778368 769788 761465 753586 746903 741815 737805 733942 729741 725476 721927 719829 719320
60903G19320M66N90K79Q8K32O23R19N41q50k763m269m995n329n573n610n510n728
$$ 719320 719786 720376 720655 720743 720975 721598 722517 723058 722208 719445 715176 710181 704852 699279 693669 688159 682431
60886F82431o382o914o828o285n753n479n513n809o120o241o365o745p018o624
$$ 682431 676049 669135 662307 656022 650269 644790 639277 633468 627348 621107 614742 607997 600979 594355
60872E94355n892n797o476o845o120m871m068l779l353k413j122J04Q85J119J226
$$ 594355 588463 582666 576190 569345 563225 558354 554286 550507 547154 544741 543619 543723 544608 545727 546953
60857E46953J693K344K630K608K846L314L277K547J890J751J528P04j84l33K19
$$ 546953 548646 550990 553620 556228 559074 562388 565665 568212 570102 571853 573381 574085 573901 573568 573787
60842E73787R30J555J976J768O15j162k912m174m681m485m254m746n661n806m742
$$ 573787 574717 576272 578248 580016 580631 579469 576557 572383 567702 563217 558963 554217 548556 542750 538008
60827E38008l405k631k134j531j353k072l032l318l058k873k706k197j656j607
$$ 538008 534603 531972 529838 528307 526954 524882 521850 518532 515474 512601 509895 507698 506042 504435
60813E04435j786j654j523k077l066l570l435l392l742l924l461k575j697j053
$$ 504435 502649 500995 499472 497395 494329 490759 487324 483932 480190 476266 472805 470230 468533 467480
60799D67480q48j226j933k500k768k821k564j913j309j347j934k358k207j739
$$ 467480 466632 465406 463473 460973 458205 455384 452820 450907 449598 448251 446317 443959 441752 440013
60785D40013j343j126r76o66L4R16J233N11o78j301j051m12K70J018J618J563
$$ 440013 438670 437544 436568 435902 435936 436852 438085 438596 437918 436617 435566 435154 435424 436442 438060 439623
60769D39623R11N17J069K257L214L495L306K960K442J540L17o64p37K06J528K427
$$ 439623 440534 441051 442120 444377 447591 451086 454392 457352 459794 461334 461651 460987 460250 460456 461984 464411
60753D64411K531J958J066K80j46l61o95j106j143o18R4N73P42N30l13j700k944
$$ 464411 466942 468900 469966 470246 470100 469739 469044 467938 466795 466177 466271 466844 467586 468116 467803 466103 463159
60736D63159l541l797m264m837m943m415l711l419l794m545m847l983k326j115
$$ 463159 459618 455821 451557 446720 441777 437362 433651 430232 426438 421893 417046 413063 410737 409622
60722D09622r21r02j81O75N05o14j384j113m78l35o13p95p55p08o66m00K16J041
$$ 409622 408701 407799 407618 408293 408798 408184 406800 405687 405209 404874 404261 403466 402711 402003 401337 400937 401153 402194
60704D02194J765K188K430K754L050K805J905J132J353K311K795K098Q08M9K10
$$ 402194 403959 406147 408577 411331 414381 417186 419091 420223 421576 423887 426682 428780 429588 429637 429847
60689D29847P23Q79O34N68J114J981K525K572K524K621K574K110J489J098R41
$$ 429847 430570 431449 432083 432651 433765 435746 438271 440843 443367 445988 448562 450672 452161 453259 454200
60674D54200Q56R51J357J813J870J454Q41L09n2k99p13j574k634l122k635j681
$$ 454200 455056 456007 457364 459177 461047 462501 463342 463651 463599 463300 462587 461013 458379 455257 452622 450941
60658D50941j089j147j659k382k958k839j830m86M40Q13R05Q38O64O97J162J727
$$ 450941 449852 448705 447046 444664 441706 438867 437037 436551 436991 437804 438709 439547 440211 440908 442070 443797
60642D43797J921J797J593J009m36k412l797l874l060k298k101k246k176j614
$$ 443797 445718 447515 449108 450117 449681 447269 443472 439598 436538 434240 432139 429893 427717 426103
60628D26103q59l34O0P68J661J952J345O10M35M52P8l03k6M75J06j156k153k152
$$ 426103 425244 424910 424970 425738 427399 429351 430696 431306 431741 432193 432271 431968 431942 432417 432523 431367 429214 427062
60610D27062j626j140n26L97J136J164P51N83Q59J174J125O72L5n54r74j172j027
$$ 427062 425436 424296 423770 424167 425303 426467 427218 427801 428660 429834 430959 431631 431666 431112 430138 428966 427939
60593D27939m11M84J125J180R49R09J122J387J718K233K724K847K570K078J406
$$ 427939 427528 428012 429137 430317 431266 432175 433297 434684 436402 438635 441359 444206 446776 448854 450260
60578D50260O42K19L91O44L50j29K04J487K747L337L857N155P080Q797R923J0755
$$ 450260 450902 451121 451512 452156 452506 452377 452581 454068 456815 460152 464009 469164 476244 485041 494964 505719
60562E05719J1611J2428J3004J3266J3156J2480J0932Q316M823J094k105m339
$$ 505719 517330 529758 542762 556028 569184 581664 592596 600912 605735 606829 604724 600385
60550F00385n633o219o265n854n089m118l044j834m42R18J855K360L087M692P001
$$ 600385 594752 588533 582268 576414 571325 567207 564163 562329 561887 562805 564660 567020 570107 574799 581800
60535E81800R302J1392J3723J6490J9139K0954K1524K0560J8027J4667J1560Q814
$$ 581800 591102 602494 616217 632707 651846 672800 694324 714884 732911 747578 759138 767952
60523G67952N537J542j937l910n105o806q941j0385j0628j0032q937p573o563
$$ 767952 773489 775031 773094 769184 764079 757273 748332 737947 727319 717287 708350 700777 694214
60510F94214o374o392n607l998k339q48Q60K623L801M552N860Q136J0865J3910
$$ 694214 687840 681448 675841 671843 669504 668656 669516 672139 675940 680492 686352 694488 705353 719263
60496G19263J7942K3139K8460L2910L6749M0833M5316M9492N2357N3005N0976
$$ 719263 737205 760344 788804 821714 858463 899296 944612 994104 1046461 1099466 1150442
60485A150442M6758M1534L6043K9871K2125J2443J299j0221k0871k9923l7597
$$ 1150442 1197200 1238734 1274777 1304648 1326773 1339216 1340515 1330294 1309423 1279500 1241903
60474A241903m4372m9902n3218n4041n3159n1272m8283m4106l9535l5587l2397
$$ 1241903 1197531 1147629 1094411 1040370 987211 935939 887656 843550 804015 768428 736031
60463G36031k9347k6000k2513j9312j6727j4919j3823j3141j2459j1377r658p576
$$ 736031 706684 680684 658171 638859 622132 607213 593390 580249 567790 556413 546755 539179
60451E39179n979n609o198o669o288n338m552m260m226m049l513k681j772q84
$$ 539179 533200 527591 521393 514724 508436 503098 498546 494286 490060 486011 482498 479817 478045 477161
60437D77161M5Q75J120M29q82k098k752k745k096j062k51j42n29q44r40j088j401
$$ 477161 477206 478081 479201 479630 478748 476650 473898 471153 469057 467995 467744 467602 467073 466229 465289 464201 462800
60420D62800j661j696j428p28M11J628K474K779K539J787R34P15J280J831J756
$$ 462800 461139 459443 458015 457287 457698 459326 461800 464579 467118 468905 469839 470554 471834 473665 475421
60405D75421J553J906K475K526K219K124J967J148J95K47J123J415O89J81Q03
$$ 475421 476974 478880 481355 483881 486100 488224 490191 491339 491534 491781 492904 494319 495008 495189 495992
60390D95992J805K102J841J845K273K627K586K237J803J523J491J478J264J203
$$ 495992 497797 499899 501740 503585 505858 508485 511071 513308 515111 516634 518125 519603 520867 522070
60376E22070J803K813L413L360L188L187L070K739K602K817L055L164L370L625
$$ 522070 523873 526686 530099 533459 536647 539834 542904 545643 548245 551062 554117 557281 560651 564276
60362E64276L593L421L621M041L887K971K024J569J423J588K518M053N180N450
$$ 564276 567869 571290 574911 578952 582839 585810 587834 589403 590826 592414 594932 598985 604165 609615
60348F09615N735O971Q913J0592J1300J0702Q847O502M627L137J031j867m380
$$ 609615 615350 622321 631234 641826 653126 663828 672675 679177 683804 686941 687972 686105 681725
60335F81725n641o167o632o743o175n552n511n633n258m657m431m436m263m149
$$ 681725 676084 669917 663285 656542 650367 644815 639304 633671 628413 623756 619325 614889 610626 606477
60321F06477m473m857m682m032l364k692j917j360j189q33K30J541K422L190M737
$$ 606477 602004 597147 592465 588433 585069 582377 580460 579100 577911 577078 577308 578849 581271 584461 589198
60306E89198P206R916J2358J4473J6204J7534J8787K0202K1290K1080J8974J5087
$$ 589198 596404 606320 618678 633151 649355 666889 685676 705878 727168 748248 767222 782309
60294G82309J0092M913J06m656r907j5042j8506j9641j9353j8504j6830j4156
$$ 782309 792401 797314 797420 792764 782857 767815 749309 729668 710315 691811 674981 660825
60282F60825j1510r784q314o126l847l001l780m850n144m714m008l416l456m342
$$ 660825 649315 639531 631217 625091 621244 618243 614463 609613 604469 599755 595747 592331 588875 584533
60268E84533n400n654m927l745k480j353q42j268k195l007l648m111l782k323
$$ 584533 579133 573479 568552 564807 562327 560974 560132 558864 556669 553662 550014 545903 542121 539798
60254E39798o90j22m52n60j22K93N69J132J795J912J685J992K737K680J323k39
$$ 539798 539108 538986 538534 537974 537852 538145 538714 539846 541641 543553 545238 547230 549967 552647 553970 553731
60238E53731q63p16o26q66j210j481j475q87K26J281J819J986K184K579L093L500
$$ 553731 552868 552152 551526 550660 549450 547969 546494 545607 545833 547114 548933 550919 553103 555682 558775 562275
60222E62275L480K981K494K522K864K920K688K804L610M734N724O544P270P840
$$ 562275 565755 568736 571230 573752 576616 579536 582224 585028 588638 593372 599096 605640 612910 620750
60208F20750Q308Q903R669J0328J0600J0459J0085R801R868J0105R881Q819P286
$$ 620750 629058 637961 647630 657958 668558 679017 689102 698903 708771 718876 728757 737576 744862
60195G44862N922M943M240L770L336K477J074k93j254k327l983n532n975n657
$$ 744862 750784 755727 759967 763737 767073 769550 770624 770331 769077 766750 762767 757235 751260 745603
60181G45603n935p276q688r178q783q031p236o579o211n978n606n173m894m494
$$ 745603 739668 732392 723704 714526 705743 697712 690476 683897 677686 671708 666102 660929 656035 651541
60167F51541l512k187j301j046q38m46m23j089j766j556m24Q57J566J565J209
$$ 651541 648029 645842 644541 643495 642657 642211 641788 640699 638933 637377 636953 637810 639376 640941 642150
60152F42150R53R88J235J610K070K290J834J005Q64J901L129L347K769K559L150
$$ 642150 643103 644091 645326 646936 649006 651296 653130 654135 654999 656900 660029 663376 666145 668704 671854
60137F71854M014M896O122P678Q978R765J0369J0936J1126J0764J0040R017P599
$$ 671854 675868 680764 686886 694564 703542 713307 723676 734612 745738 756502 766542 775559 783158
60124G83158O041M782L781K719J775J451J611J625J472J705K311K583K355K299
$$ 783158 789199 793981 797762 800481 802256 803707 805318 806943 808415 810120 812431 815014 817369 819668
60110H19668K708K963K641K186J938J377k0j898l605n080o514p662q144q120q064
$$ 819668 822376 825339 827980 830166 832104 833481 833461 831563 827958 822878 816364 808702 800558 792438 784374
60095G84374q083p842p103o083n282m979m739l690j627L37R63N18M91J670L332
$$ 784374 776291 768449 761346 755263 749981 745002 740263 736573 734946 735283 736246 736764 737255 738925 742257
60080G42257M428M716M439L778K983K447K172J632M68j133k947m986p044q579
$$ 742257 746685 751401 755840 759618 762601 765048 767220 768852 769320 768187 765240 760254 753210 744631
60066G44631r443j0135j1012j1732j1818j1257j0256q905p463o433n987n670n023
$$ 744631 735188 725053 714041 702309 690491 679234 668978 660073 652610 646177 640190 634520 629497
60053F29497m197l605l307k986k358j390l39M33R33J739L324N258O599P031P100
$$ 629497 625300 621695 618388 615402 613044 611654 611315 611748 612681 614420 617744 623002 629601 636632 643732
60038F43732P283P484P471P241O771N923M718L379K123J211R07Q90J62j712l696
$$ 643732 651015 658499 665970 673211 679982 685905 690623 694002 696125 697336 698243 699133 699295 697583 693887
60023F93887m531m540n047o363p671q783j0398j2435j3677j3512j2614j1465r692
$$ 693887 689356 684816 679769 673406 665735 656952 646554 634119 620442 606930 594316 582851 573159
60010E73159p578o548p072p470o093l640j973j535j388j035p48m28L72J399J832
$$ 573159 565581 559033 551961 544491 538398 534758 532785 531250 529862 528827 528079 527651 528023 529422 531254
59995E31254J546J265J443J766J850J774J808K153K870L704M141M029L841M009
$$ 531254 532800 534065 535508 537274 539124 540898 542706 544859 547729 551433 555574 559603 563444 567453
59981E67453M337M495M521M296L174Q97j546k915l255l603m381m985m903m318
$$ 567453 571790 576285 580806 585102 588276 589173 587627 584712 581457 577854 573473 568488 563585 559267
59967E59267l535k612j726j210r78m18Q43K460L845M794N531O282O986P295O883
$$ 559267 555732 553120 551394 550184 549206 548788 549631 552091 555936 560730 566261 572543 579529 586824 593707
59952E93707N807M420K918J212n24j700k052k148k659l376l528k943k229j837
$$ 593707 599514 603934 606852 608064 607540 605840 603788 601640 598981 595605 592077 589134 586905 585068
59938E85068j538j122j024j786l091l826l301k117j486j727j849q44J011K550
$$ 585068 583530 582408 581384 579598 576507 572681 569380 567263 565777 564050 562201 561357 562368 564918
59924E64918L196L403L763M358N057N818O367O163N076L717K755K257J934J715
$$ 564918 568114 571517 575280 579638 584695 590513 596880 603043 608119 611836 614591 616848 618782 620497
59910F20497J759K238L254M696O002O499O200N861O002O245N906M907L745K905
$$ 620497 622256 624494 627748 632444 638446 644945 651145 657006 663008 669253 675159 680066 683811 686716
59896F86716K511K352J989J130J03l39J90J341K536L474M073M358M476M514M199
$$ 686716 689227 691579 693568 694698 694801 694462 694652 695993 698529 702003 706076 710434 714910 719424 723623
59881G23623L374K665L016M374N571N781N441N337N461N292M633L684K591J435
$$ 723623 726997 729662 732678 737052 742623 748404 753845 759182 764643 769935 774568 778252 780843 782278
59867G82278L83m74j254k105l132m490o094p265p264o332n542n460n591n340m776
$$ 782278 782661 782187 780933 778828 775696 771206 765112 757847 750583 744251 738709 733249 727658 722318 717542
59852G17542m197l619k999k358j466n8J490K481L070M177O018P657Q403Q554Q262
$$ 717542 713345 709726 706727 704369 702903 702845 704335 706816 709886 714063 720081 727738 736141 744695 752957
59837G52957O858M067R97j010j749j663q67M77J671K243K519K651J877l16l045
$$ 752957 759815 763882 764879 763869 762120 760457 759590 760067 761738 763981 766500 769151 771028 770712 767667
59822G67667n109o531q018r457j0087r817r292q978q905r014q957q143o670n578
$$ 767667 762558 756027 748009 738552 728465 718648 709356 700378 691473 682459 673502 665359 658689 653111
59808F53111n325m847l230j435j013j777k221j788j143n70K29Q39L11j089j943
$$ 653111 647786 642939 639709 638274 637261 635484 633263 631475 630332 629762 629991 630830 631141 630052 628109
59793F28109j745j524k010k585k616k545k896l240k977k356j969j876j874k088
$$ 628109 626364 624840 622830 620245 617629 615084 612188 608948 605971 603615 601646 599770 597896 595808
59779E95808k581k852k372j366n11j01Q3K16K07ok16j03M71J344K174K745L086
$$ 595808 593227 590375 588003 586637 586126 586025 586108 586324 586531 586525 586309 586206 586677 588021 590195 592940 596026
59762E96026L370L809M601N689O607O920O897P193P870Q378Q642R362J0828J2284
$$ 596026 599396 603205 607806 613495 620102 627022 633919 641112 648982 657360 666002 675364 686192 698476
59748F98476J3021J3339J3731J3975J3759J3380J2890J1451Q689N864M375L686
$$ 698476 711497 724836 738567 752542 766301 779681 792571 804022 812711 818575 822950 826636
59736H26636K226j34k140l311m277n066m925m167m260n496o252n492m450m650
$$ 826636 828862 828728 826588 823277 819000 813934 809009 804842 800582 795086 788834 783342 778892 774242
59722G74242n529n437m170l024k758k829k636k421k639l175l514l335k737k056
$$ 774242 768713 763276 759106 756082 753324 750495 747859 745438 742799 739624 736110 732775 730038 727982
59708G27982j589j421j490j701j811j391l36O96Q26N0o87o82k53l7J7M32J266
$$ 727982 726393 724972 723482 721781 719970 718579 718243 718939 719765 719815 719128 718446 718193 718156 718173 718605 719871
59691G19871J904J872J474J352J561J453N80n31r82o86m53q17j388j582j469j461
$$ 719871 721775 723647 725121 726473 728034 729487 730067 729536 728554 727868 727415 726598 725210 723628 722159 720698
59675G20698j711k229l084m029m500m499m872o056p092o774n331l982l244k659
$$ 720698 718987 716758 713674 709645 705145 700646 695774 689718 682626 675852 670521 666539 663295 660636
59661F60636k061j883k180k317j861j080l16M53J236J855K316K893L749M804N863
$$ 660636 658575 656692 654512 652195 650334 649254 648938 649391 650627 652482 654798 657691 661440 666244 672107
59646F72107O458N932M243K321R21m32k494m709n756n462m910m656m156l209k627
$$ 672107 678565 684497 688740 691061 691982 691550 689056 684347 678591 673129 668219 663563 659407 656198 653571
59631F53571k925l407l165k214j120k23K29r9j142k276l055l591l973l939l483
$$ 653571 650646 647239 644074 641860 640740 640517 640746 640647 639505 637229 634174 630583 626610 622671 619188
59616F19188l131l204l332l094k590k047j411p02k27j21o2K49P37J381K338L391
$$ 619188 616057 612853 609521 606427 603837 601790 600379 599677 599450 599329 599267 599516 600253 601634 603972 607363
59600F07363L776L052J753Q25P03J093J298P15n72j567j393n27l20j132j851j528
$$ 607363 611139 614191 615944 616769 617472 618565 619863 620578 620006 618439 617046 616519 616199 615067 613216 611688
59584F11688o71k86n06q43j156j548j783j603j318j377j635j614j300r79o24o1
$$ 611688 611017 610731 610225 609382 608226 606678 604895 603292 601974 600597 598962 597348 596048 595069 594445 594384
59568E94384L40Jq85j415j168o43k44M08J601K506J938L5j614j798j026n75p63
$$ 594384 594724 594725 593840 592425 591257 590614 590370 590778 592379 594885 596823 596858 595244 593446 592420 591845 591082
59551E91082q83n21j09m8q7J16M81Q75J465K265K924L368M180N768P663R284J0988
$$ 591082 590199 589678 589569 589521 589434 589550 590031 590906 592371 594636 597560 600928 605108 610876 618539 627823 638811
59534F38811J3607J7087K0196K1396J9665J4865Q071J404l179n080m927l642j957
$$ 638811 652418 669505 689701 711097 730762 745627 753698 755102 751923 746843 741916 738274 736317
59521G36317m18P59J622J943J237l50j859k800l887n737p668q743r201r715r890
$$ 736317 735899 736658 738280 740223 741460 741110 739251 736451 732564 726827 719159 710416 701215 691500 681610
59506F81610q925p332o494o612o583n904n304n299n384m987m169l202k346k152
$$ 681610 672685 665353 658859 652247 645664 639760 634456 629157 623773 618786 614617 611415 609069 606917
59492F06917k883l603k989j159M14R30J018J327J678J957K576L505L966L659L307
$$ 606917 604034 600431 597442 596283 596697 597627 598645 599972 601650 603607 606183 609688 613654 617313 620620
59477F20620L409L504L242L284M305N861O923P035O400N293L929K570J509J048
$$ 620620 624029 627533 630775 634059 638364 644225 651148 658183 664583 669876 673805 676375 677884 678932
59463F78932J387K118K136R24l90k29J352K929L892M979O534P724P998P944Q071
$$ 678932 680319 682437 684573 685497 685107 684878 686230 689159 693051 698030 704564 712288 720286 728230 736301
59448G36301P885O917N669M746L891K535O66j412l526n427o768p604q274q597
$$ 736301 744186 751103 756772 761518 765409 767944 768610 767198 763672 758245 751477 743873 735599 727002
59434G27002q091p082o550o569o069m488k598j148J34J628K998M043N351P358
$$ 727002 718911 711829 705279 698710 692641 688153 685555 684407 684541 686169 689167 693210 698561 705919
59420G05919R552J1350J3010J4982J7078J8873K0321K1363K1654K1180K0621K0626
$$ 705919 715471 726821 739831 754813 771891 790764 811085 832448 854102 875282 895903 916529
59408I16529K1078K1160J9570J4841O688k787j0276j4041j4746j3656j1288p874
$$ 916529 937607 958767 978337 993178 999866 997079 986803 972762 958016 944360 933072 925198
59396I25198l689J273O536R870Q603K802m526j0837j5912j9835k1482k0364j8053
$$ 925198 921509 922782 929318 939188 947791 950593 946067 935230 919318 899483 878001 857637 839584
59383H39584j6134j4211j1396q308n962m041j913k77n2o20p52m37l11j51M58Q97
$$ 839584 823450 809239 797843 789535 783573 779532 777619 777342 777290 776670 775918 775481 775170 775019 775477 776374
59367G76374N45K35J005K116K131J312J236K374L763M803N753O624P090P452Q325
$$ 776374 776919 777154 778159 780275 782406 783718 784954 787328 791091 795894 801647 808271 815361 822813 831138
59352H31138R461J0147J0612J1770J3630J5204J5990J6436J6939J7356J7473J7126
$$ 831138 840599 850746 861358 873128 886758 901962 917952 934388 951327 968683 986156 1003282
59340A003282J6021J4236J2565J1479J0107P274L150j128n066q903j2419j4854
$$ 1003282 1019303 1033539 1046104 1057583 1067690 1074964 1078114 1076986 1071920 1063017 1050598 1035744
59328A035744j6029j6496j6661j6558j6363j6321j6285j6065j5866j5746j5071
$$ 1035744 1019715 1003219 986558 970000 953637 937316 921031 904966 889100 873354 858283
59317H58283j3382j1354j0041r505r029q242p254o174n291n164n732n970n259
$$ 858283 844901 833547 823506 814001 804972 796730 789476 783302 778011 772847 767115 761145 755886
59304G55886m361m024l580k152m21L54M45J202K920M706O295Q388J1156J3638
$$ 755886 751525 747501 743921 741769 741348 741702 742147 743349 746269 750975 757270 765658 776814 790452
59290G90452J4693J3573R814L797k746p934j1385j3716j4857j4124j1751q980
$$ 790452 805145 818718 828532 832329 829583 821649 810264 796548 781691 767567 755816 746836
59278G46836o570m234j570J454M749P959J0323J1666J3124J5727J8652K0104J9581
$$ 746836 740266 736032 734462 735916 740665 748624 758947 770613 783737 799464 818116 838220 857801
59265H57801J8024J6068J3586J0747Q083N450K232j367m460o840q989j0794j1560
$$ 857801 875825 891893 905479 916226 924309 929759 931991 930624 926164 919324 910335 899541 887981
59252H87981j1355j1052j0864j0064q370o498n095m104l352k769j924l22J720
$$ 887981 876626 865574 854710 844646 836276 829778 824683 820579 817227 814458 812534 812212 813932
59239H13932L296M121M724N522O451P421Q293Q526P698O154M500K709N81j450
$$ 813932 817228 821349 826073 831595 838046 845467 853760 862286 869984 876138 880638 883347 883928 882478
59225H82478k886m138n850p741r150j0248j1527j2587j2732j2308j2208j2384
$$ 882478 879592 875454 869604 861863 852713 842465 830938 818351 805619 793311 781103 768719
59213G68719j2130j1438j0705r627p821o053n293n020m132l008k825l210k659
$$ 768719 756589 745151 734446 724819 716998 710945 705652 700632 696500 693492 690667 687457 684798
59200F84798j192l94p22q47m7P65R86J307K112K584K232J885K313L116L642L922
$$ 684798 683606 683212 682490 681643 681596 682361 683347 684654 686766 689350 691582 693467 695780 698896 702538 706460
59184G06460M108M036L817L906M327M738N320O445P437P083N458L948L314L156
$$ 706460 710568 714604 718421 722327 726654 731392 736712 743157 750594 757677 763135 767083 770397 773553
59170G73553L297M103N210N645N515N959P021P288O076M355K902J231r31k709
$$ 773553 776850 780953 786163 791808 797323 803282 810303 817591 823667 828022 830924 832155 831224 828515
59156H28515l546m207n417o769p816r027j0755j2329j2994j2836j2140j0840r214
$$ 828515 824969 820762 815345 808576 800760 791733 780978 768649 755655 742819 730679 719839 710625
59143G10625q137p941p918p451o767o187n619n104m850m491l440k147j737k152
$$ 710625 702488 694547 686629 679178 672411 666224 660605 655501 650651 646160 642720 640573 638836 636684
59129F36684k039q15N97J479K255L197L702L604L805M923O426P730Q897R807R953
$$ 636684 634645 633830 634427 635906 638161 641358 645060 648664 652469 657392 663818 671548 680445 690252 700205
59114G00205R607R783J0579J0974J0728J0750J1031J0141P766N815N718O270N616
$$ 700205 709812 719595 730174 741148 751876 762626 773657 783798 791564 797379 803097 809367 814983
59101H14983L979K751K108J213J2p87j074j383j907k433k865l052k575j443m22
$$ 814983 818962 821713 823821 825034 825046 824259 823185 821802 819895 817462 814597 811545 808970 807527 807105
59086H07105q3j04j6K4k96r66k064l870o055p640q183q257q417q647q963r532
$$ 807105 807022 806918 806902 806926 806630 805664 803600 799730 793675 786035 777852 769595 761178 752531 743568 734036
59070G34036r854r066p385o051n522n042m285l930m122l999l306k930l124k854
$$ 734036 724182 715116 707731 701680 696158 691116 686831 682901 678779 674780 671474 668544 665420 662566
59056F62566j667o64o72j023j046j144j457j104R8Q21L50p2N92J246N32q49j331
$$ 662566 660899 660235 659563 658540 657494 656350 654893 653789 653887 654708 655058 654986 655578 656824 657356 656507 655176
59039F55176q76m08Q5J124K199K330J689J227J225J475K304M081O261Q001R374
$$ 655176 654300 653892 653977 655101 657300 659630 661319 662546 663771 665246 667550 671631 677892 685893 695267
59024F95267J0964J2774J4404J5728J6623J6653J5818J4855J4081J2685R891O056
$$ 695267 706231 719005 733409 749137 765760 782413 798231 813086 827167 839852 849743 855799
59012H55799K000j769m680o108o450o982p920p994o674n248m643l846j779P54
$$ 855799 857799 856030 851350 845242 838792 831810 823890 815896 809222 803974 799331 795485 793706 794460
58998G94460K482L699N287O900P715P961Q167P798O269M410L423L065K279R75
$$ 794460 796942 800641 805928 812828 820543 828504 836671 844469 850738 855148 858571 861636 863915 864890
58984H64890j93j130k075k755k938l089l439l220j891k54Q13J745L292N138O673
$$ 864890 864697 863567 861492 858737 855799 852710 849271 846051 844160 843906 844719 846464 849756 854894 861567
58969H61567Q189J0066J1838J3150J4512J5970J6411J5519J4969J5960J6962J5766
$$ 861567 869756 879822 891660 904810 919322 935292 951703 967222 982191 998151 1015113 1030879
58957A030879J2621R380O599L529K02k672n342q656j2385j5523j7870j9748k0781
$$ 1030879 1043500 1052880 1059479 1063008 1063210 1060538 1055196 1046540 1034155 1018632 1000762 981014 960233
58944I60233k0401j9111j7809j6461j4782j3387j2771j1997j0016p502n737m475
$$ 960233 939832 920721 902912 886451 871669 858282 845511 833514 823498 815996 810259 805784
58932H05784k670n80O83J124J581K018J827J355J404J640J102j41j316k365l570
$$ 805784 803114 802534 803217 804341 805922 807940 809767 811122 812526 814166 815268 815127 813811 811446 807876
58917H07876m397m230l651l477l281k350j270q54m59Q42K315K754K787L919N975
$$ 807876 803479 799249 795598 792121 788840 786490 785220 784366 783907 784749 787064 789818 792605 796524 802499
58902H02499P584Q587R838J1252J2226J3430J5887J8639J9691J9059J8660J9288
$$ 802499 810083 818670 828508 839760 851986 865416 881303 899942 919633 938692 957352 976640
58890I76640J9986K0366K1286K2958K4389K5023K5280K5334K4901K4164K3328
$$ 976640 996626 1016992 1038278 1061236 1085625 1110648 1135928 1161262 1186163 1210327 1233655
58879A233655K1434J7344J1717O328J764k597o754j0183j3334j6966k0263k1678
$$ 1233655 1255089 1272433 1284150 1290478 1292242 1289645 1282891 1272708 1259374 1242408 1222145 1200467
58867A200467k1426k1043k0674j9088j6314j3998j2897j2118j1076j0281r917
$$ 1200467 1179041 1157998 1137324 1118236 1101922 1087924 1075027 1062909 1051833 1041552 1031635
58856A031635r475r027r132r408q960q141q092q647q580p802p278o961o057n268
$$ 1031635 1022160 1013133 1004001 994593 985633 977492 969400 960753 952173 944371 937093 930132 924075 918807
58842I18807o379r334j1965j2950j3001j2829j2177j1313j1253j1929j2005j1011
$$ 918807 912428 903094 891129 878179 865178 852349 840172 828859 817606 805677 793672 782661
58830G82661r878r005p776o273n443n186m273k567j230m41R75L080M300M064L783
$$ 782661 772783 763778 756002 749729 744286 739100 734827 732260 731030 730589 731564 734644 738944 743008 746791
58815G46791M371M857M500M276N062O002N910N015M231L791L365K622J271n33
$$ 746791 751162 756019 760519 764795 769857 775859 781769 786784 791015 794806 798171 800793 802064 801531
58801H01531j751j648j244k037l516l917l301l601n304o542o182n511n840o429
$$ 801531 799780 798132 796888 794851 791335 787418 784117 780516 775212 768670 762488 756977 751137 744708
58787G44708o020m811l688k818j995j254l78J120L011M390M952N141M906L756
$$ 744708 738688 733877 730189 727371 725376 724122 723744 724864 727875 732265 737217 742358 747264 751020
58773G51020K101R75K88j036l105m899o094p289q214p772o108m746m293l846k937
$$ 751020 753121 754096 754384 753348 750243 745344 739250 731961 723747 715975 709867 705121 700828 696982 694045
58758F94045k137j415N3K007L078L010K968L240K744J303K54K18L13J57N87J754
$$ 694045 691908 690493 690546 692553 695631 698641 701609 704849 707593 708896 709150 709368 709681 709838 710425 712179
58742G12179K645L016L838N233O083O194O634P455P355O233N641O021O010N223
$$ 712179 714824 717840 721678 726911 732994 739188 745822 753277 760632 766865 772506 778527 784537 789760
58728G89760N162O334P080O484N898O293O485N510M455M369M494M130M290N830
$$ 789760 794922 801256 808336 814820 820718 827011 833496 839006 843461 847830 852324 856454 860744 866574
58714H66574P744Q835R386R861R643Q422P113O164M606J949p68k904n318q501
$$ 866574 874318 883153 892539 902400 912043 920465 927578 933742 938348 940297 939529 936625 931307 922806
58700I22806j1524j3927j6574j9483k1021k0680k0358k1274k1740j9833j6384
$$ 922806 911282 897355 880781 861298 840277 819597 799239 777965 756225 736392 720008
58689G20008j3393j1230r287p860p519p719p696p603p563o924n582m610m529m442
$$ 720008 706615 695385 686098 678238 670719 663000 655304 647701 640138 633214 627632 623022 618493 614051
58675F14051l784l206k782j421Q79K339K275K459M160O092O924P643R475J1477
$$ 614051 610267 607061 604279 602858 603737 606076 608351 610810 614970 621062 627986 635629 645104 656581
58661F56581J2233J2147J2030J1074Q344M783J800q44l932o846q485q945q779
$$ 656581 668814 680961 692991 704065 712409 717192 718992 718148 714216 707370 698885 689940 681161
58648F81161p845o307n317n312n126m114l482m060m492l319j247K65J155J882
$$ 681161 673316 667009 661692 656380 651254 647140 643658 639598 635106 631787 630540 630805 631960 633842
58634F33842K060J619J796L267M725M823M084L446K529Q58p67j615k258l059l079
$$ 633842 635902 637521 639317 642584 647309 652132 656216 659662 662191 663049 662282 660667 658409 655350 652271
58619F52271j781j67J048K562M611O002O376P193Q998R940Q688O591N283M315
$$ 652271 650490 650323 651371 653933 658544 664546 670922 678115 687113 697053 705741 712332 717615 721930
58605G21930K937J854J454O39q36j317m52n72k779m512l640k129k560l732l078
$$ 721930 724867 726721 728175 728814 727978 726661 726209 725637 722858 718346 714706 712577 710017 706285 703207
58590G03207j199l60k98R12L107M636N615P451R929J1654J2600J3595J4160J3316
$$ 703207 702008 701648 701350 702262 705369 710005 715620 723071 733000 744654 757254 770849 785009 798325
58576G98325J1692J0545R673Q410P493P801Q525Q730R376J1626J4642J7173J9754
$$ 798325 810017 820562 830235 838645 846138 853939 862464 871194 880570 892196 906838 924011 943765
58563I43765K3205K6640K9193L1855L5159L6936L5057L0695K6250K1702J5737
$$ 943765 966970 993610 1022803 1054658 1089817 1126753 1161810 1192505 1218755 1240457 1256194
58552A256194Q891K762k391o746r160q953p854p695p802p044o525p634r466j0930
$$ 1256194 1265085 1267847 1265456 1258710 1249550 1240597 1232743 1225048 1217246 1210202 1203677 1196043 1186577 1175647
58538A175647j3301j7776k2599k5570k7252k8726k8587k5653k2204k0753j9779
$$ 1175647 1162346 1144570 1121971 1096401 1069149 1040423 1011836 986183 963979 943226 923447
58527I23447j6569j2217r671q730p215n440n092n203l675j563j474k835l059k316
$$ 923447 906878 894661 884990 876260 869045 863605 858513 853310 849635 848072 846598 843763 840704 838388
58513H38388k694l620k741o75k77j593j953q84o38j851k693k487k371k467j816
$$ 838388 835694 832074 829333 828658 828381 826788 824835 823951 823313 821462 818769 816282 813911 811444 809628
58498H09628j027j521k513k103q38p65j588j336j24M39P87K554M976N976O148
$$ 809628 808601 807080 804567 802464 801626 800861 799273 797937 797813 798252 799039 801593 806569 812545 818693
58483H18693P697J0278J1851J2879J5373J8483J9510J8761J8908J9856J8794J5187
$$ 818693 826390 836668 848519 861398 876771 895254 914764 933525 952433 972289 991083 1006270
58471A006270J1270P645K864k635o588r020j1984j5056j5404j2658r465p040m143
$$ 1006270 1017540 1025185 1028049 1025414 1018826 1009806 997822 982766 967362 954704 945239 938199 934056
58458I34056o64J962M011P096J0517J2056J2303J3810J6062J5785J2372Q438M922
$$ 934056 933392 935354 939365 946461 956978 969034 981337 995147 1011209 1026994 1039366 1047804 1052726
58445A052726L09n006q401r702j1530j4277j5259j3626j1689j0504q473n165k464
$$ 1052726 1053035 1048029 1039628 1029926 1018396 1004119 988860 975234 963545 953041 944568 939403 936939
58432I36939j050M08J980K289J885K881N029O244O935R414J3015J4471J3273J1895
$$ 936939 935889 936297 938277 940566 942451 945332 950361 956605 963540 972954 985969 1000440 1013713 1025608
58418A025608J0596P107J770k136l928o212r416j0739r551q759r718j0585j0666
$$ 1025608 1036204 1043311 1045081 1042945 1039017 1032805 1023389 1012650 1003099 994340 984622 974037 963371
58405I63371j1556j2986j2405r799q098p951o845m265k681k546j405J057K172
$$ 963371 951815 938829 926424 916625 908527 900576 893731 889466 886785 884239 882834 883891 886063
58392H86063J487J675L306L822K704K392L154K470M85N18L039M710M548N286P490
$$ 886063 887550 889225 892531 896353 899057 901449 904603 907073 907558 908076 911115 915825 920373 925659 933149
58377I33149Q229P068P300R685J0870R692R096J0054R735P598P166R610J1601
$$ 933149 941378 948446 955746 965431 976301 985993 995089 1005143 1014878 1022476 1029642 1039252 1050853
58364A050853J1606J2323J4819J6264J5726J6075J7956J8018J5339J3386J3276
$$ 1050853 1062459 1074782 1089601 1105865 1121591 1137666 1155622 1173640 1188979 1202365 1215641
58353A215641J1534O951L213K156Q80j792k669p31L87n94Q8L816O376N549N117
$$ 1215641 1227175 1234126 1237339 1239495 1240375 1238583 1235914 1235183 1235570 1234976 1235064 1238880 1245256 1250805 1255922
58338A255922P621R844R381R238J1846J4618J5419J6443J8938K0081J8641J7726
$$ 1255922 1263543 1273387 1282768 1292006 1303852 1318470 1333889 1350332 1369270 1389351 1407992 1425718
58326A425718J8516J7553J3514J0205R433P693L421O11J511K593J552J300L362
$$ 1425718 1444234 1461787 1475301 1485506 1494939 1502632 1506053 1506664 1508175 1510768 1512320 1513620 1516982
58313A516982M400L143L412O482Q033O556O845J0961J3878J2663J1761J4334J6561
$$ 1516982 1521382 1524525 1527937 1534419 1542452 1549008 1555853 1566814 1580692 1593355 1605116 1619450 1636011
58300A636011J5609J5006J6943J7550J5037J4123J7039J8751J6663J6062K0088
$$ 1636011 1651620 1666626 1683569 1701119 1716156 1730279 1747318 1766069 1782732 1798794 1818882
58289A818882K3421K2199K1034K3654K5736K3941K2908K6027K8392K6256K4478
$$ 1818882 1842303 1864502 1885536 1909190 1934926 1958867 1981775 2007802 2036194 2062450 2086928
58278B086928K7130K9889K9194K9603L4333L8013L6844L6318M0701M4724M4051
$$ 2086928 2114058 2143947 2173141 2202744 2237077 2275090 2311934 2348252 2388953 2433677 2477728
58267B477728M3925M8638N2767N1924N1814N7210O2491O2728O3346O8770P2671
$$ 2477728 2521653 2570291 2623058 2674982 2726796 2784006 2846497 2909225 2972571 3041341 3114012
58256C114012O9960O7164P0037P2468O8963O6242P0553P5557P5139P5902Q3939
$$ 3114012 3183972 3251136 3321173 3393641 3462604 3528846 3599399 3674956 3750095 3825997 3909936
58245C909936R1850R2603R3622J02739J13022J16449J19605J30194J41251J45065
$$ 3909936 4001786 4094389 4188011 4290750 4403772 4520221 4639826 4770020 4911271 5056336
58235E056336J49434J62953J77702J84302J90452K06127K24281K35407K46975
$$ 5056336 5205770 5368723 5546425 5730727 5921179 6127306 6351587 6586994 6833969
58226F833969K68515K91955L07556L24320L53116L85282M10401M38666M81753
$$ 6833969 7102484 7394439 7701995 8026315 8379431 8764713 9175114 9613780 10095533
58217A0095533N29147N68882O13422O77730P50974Q19215Q96069R99499J119460
$$ 10095533 10624680 11193562 11806984 12484714 13235688 14054903 14950972 15950471 17069931
58208A7069931J242267J384733J567834J780701K010859K284742K635229L057826
$$ 17069931 18312198 19696931 21264765 23045466 25056325 27341067 29976296 33034122
58200C3034122L548712M156723M944407N933381P153190Q707835J0718039J3228735
$$ 33034122 36582834 40739557 45683964 51617345 58770535 67478370 78196409 91425144
58192I1425144J6240051J9759959K3715263K7885986L2066707L6131568L9548705
$$ 91425144 107665195 127425154 151140417 179026403 211093110 247224678 286773383
58185B86773383M0772816L7627101K8861327J5469322L34158j3448237k3941829
$$ 286773383 327546199 365173300 394034627 409503949 409838107 396389870 372448041
58178C72448041l0534090l3416910l3204330l0801806k7250514k3501484k0244769
$$ 372448041 341913951 308497041 275292711 244490905 217240391 193738907 173494138
58171A73494138j7809097j6131536j4888969j3764656j2618414j1434753j0213053
$$ 173494138 155685041 139553505 124664536 110899880 98281466 86846713 76633660
58164G6633660q969172p773064o700201n765134m947117m247828l676362l206966
$$ 76633660 67664488 59891424 53191223 47426089 42478972 38231144 34554782 31347816
58156C1347816k801019k451869k168357j934467j724077j537816j388637j266274
$$ 31347816 28546797 26094928 23926571 21992104 20268027 18730211 17341574 16075300
58148A6075300j149916j041832r55971q85775q13786p41843o82799o32553n77654
$$ 16075300 14925384 13883552 12927581 12041806 11228020 10486177 9803378 9170825 8593171
58139H593171n21436m76498m39566l98329l55565l23102k99099k73427k48708
$$ 8593171 8071735 7595237 7155671 6757342 6401777 6078675 5779576 5506149 5257441
58130E257441k34448k26672k13896j97601j87196j80589j68730j54012j45555
$$ 5257441 5022993 4796321 4582425 4384824 4197628 4017039 3848309 3694297 3548742
58121C548742j41227j32193j20458j14514j12088j04278r2749q6390q4504p9269
$$ 3548742 3407515 3275322 3154864 3040350 2928262 2823984 2731235 2644845 2560341 2481072
58111B481072p1394o7905o7553o3337n6556n4026n4361n0927m5467m4907m7486
$$ 2481072 2409678 2341773 2274220 2210883 2154327 2100301 2045940 1995013 1949546 1904639 1857153
58100A857153m5682m0388l8825m0714l9562l5545l4299l4862l1472k5672k4317
$$ 1857153 1811471 1771083 1732258 1691544 1651982 1616437 1582138 1547276 1515804 1490132 1465815
58089A465815k6886k6654k3218k2277k4068k3497k0796k1078k3894k3879k1082
$$ 1465815 1438929 1412275 1389057 1366780 1342712 1319215 1298419 1277341 1253447 1229568 1208486
58078A208486k0530k2244k1627j8965j8843k0847k0422j8058j8300k0467j9688
$$ 1208486 1187956 1165712 1144085 1125120 1106277 1085430 1065008 1046950 1028650 1008183 988495
58067I88495j6268j4906j5500j3858j0653j0415j2385j1469p851o660q528r223
$$ 988495 972227 957321 941821 927963 917310 906895 894510 883041 875190 868530 860002 850779
58055H50779q275r298j1991j2368j0692j0963j2765j1890q686p539q444p349m575
$$ 850779 842504 833206 821215 808847 798155 787192 774427 762537 753851 746312 737868 730519 725944
58042G25944m438o647o511l829l216n254n664l750l454n302n471l690m199p621
$$ 725944 721506 714859 708348 704519 701303 696049 690385 686635 683181 677879 672408 668718 664519 656898
58028F56898r618q828q703j0235j0246q284p960r828r970p346n769o869p503n990
$$ 656898 647280 638452 629749 619514 609268 600984 593024 583196 573226 565880 560111 553242 545739 539749
58014E39749m692m739m177k797l009m565m275k176j956m070m520j998j21q29j412
$$ 539749 535057 530318 526141 523344 520335 515770 511495 509319 507363 503293 498773 496775 496654 495825 494413
57999D94413j3J458J867L050N587P303P625Q629J0337R806O322K823R19q86k964
$$ 494413 494400 495858 497725 500775 506362 513665 521290 529919 540256 550062 556384 559207 560126 559240 556276
57984E56276l472k549k799m520n101m029l690m484m141k672k736m269m064j680
$$ 556276 552804 550255 547456 542936 537835 533806 530116 525632 521491 518819 516083 511814 507750 506070
57970E06070l54r68o78J162J468n66j627l28L68j092k031q11J83o44j228l28j99
$$ 506070 505716 504748 504070 505232 506700 506134 504507 504179 504547 503455 501424 500613 500796 500152 498924 498596 498397
57953D98397k159l845l544l106l987m356k784j018o64o03J39M08j83J41J920L170
$$ 498397 496238 492393 488849 485743 481756 477400 474616 473598 472934 472331 472470 472878 472695 472836 474756 477926
57937D77926L142L762N702O808O188O084P796R418R436Q922Q482O835M074K505
$$ 477926 481068 484830 490532 497340 503528 509612 517408 526826 536262 545184 553666 560501 564575 567080
57923E67080K443J181k089m426m223l896n321o628o137n571o611p716p114n775
$$ 567080 569523 570704 568615 564189 559966 556070 550749 544121 537984 532413 525802 518086 510972 505197
57909E05197m987m024k499j844k317j769M67J833Q19n05l90k98j448k003m56J469
$$ 505197 500210 496186 493687 491843 489526 487757 488224 490057 490876 490371 489981 489683 488235 486232 485776 487245
57893D87245J937K037L080L931L626L620M833N442M210L032L494L894K415M66
$$ 487245 489182 491219 494299 498230 501856 505476 510309 515751 519961 522993 526487 530381 532796 533262
57879E33262r6k83j692l406m001m225m951m948l330j873k130k648j726n79r79
$$ 533262 533166 532883 531191 527785 523784 519559 514608 509660 506330 504457 502327 499679 497953 497374 496395
57864D96395j969j801j031r87j114m45K29J24M17K012L481L620L795N323O778
$$ 496395 494426 492625 491594 490607 489493 489048 489277 489401 489818 491830 495311 498931 502726 508049 514827
57849E14827O580N984O642P406O491M867M386M371L092J115J73L8o48j700k180
$$ 514827 521407 527391 534033 541439 547930 552797 557183 561554 564646 565761 565934 565972 565324 563624 561444
57834E61444k610l815m852m546l845m241n066m798l837l548l705l152k041j260
$$ 561444 558834 555019 550167 545621 541776 537535 532469 527671 523834 520286 516581 513429 511388 510128
57820E10128p36j60k48j345k176j795j292j760k224j609r43j449k157j808j443
$$ 510128 509392 509232 508984 507639 505463 503668 502376 500616 498392 496783 495840 494391 492234 490426 488983
57805D88983k669m799o171o837p588p754o524n100m980n300m400k828k287k611
$$ 488983 486314 481515 475344 468507 460919 453165 446641 441541 436561 431261 426861 424033 421746 419135
57791D19135k307j243m42N6Q95J832K393L180M626N618N259M774N621P025P505
$$ 419135 416828 415585 415143 415199 416094 417926 420319 423499 428125 433743 439002 443776 449397 456422 463927
57776D63927P459Q007Q600Q170P451P678Q093P198N473M444M020L147K150K020
$$ 463927 471386 479393 487993 496163 503614 511292 519385 526583 532056 536500 540520 543667 545817 547837
57762E47837K139J168n53j742k566m036n731o349n976n735n770n424m725l959
$$ 547837 549976 551144 550591 548849 546283 542247 536516 530167 524191 518456 512686 507262 502537 498578
57748D98578k683q76P5o14j427q69Rm07j267q10L68L66o84j077n15j3M23J396
$$ 498578 495895 495019 495094 494480 493053 492184 492193 491786 490519 489709 490077 490443 489759 488682 488167 488154 488577 489973
57730D89973K150J613P62J383L034L819L527L479L727L195K122J811K123J745
$$ 489973 492123 493736 494498 495881 498915 502734 506261 509740 513467 516662 518784 520595 522718 524463
57716E24463P11K61M58K86j46J18O48O7j509k671l118l665m189l889l288l647
$$ 524463 525174 525435 525893 526179 526033 526151 526799 526866 525357 522686 519568 515903 511714 507825 504537 500890
57700E00890m602m584l441k443j965j415j053j580k217j575k31p5j237k121k232
$$ 500890 496288 491704 488263 485820 483855 482440 481387 479807 477590 476015 475784 475709 474472 472351 470119
57685D70119k550l129k863j769j132j117m80J218L144N034P465J0309J3011J6317
$$ 470119 467569 464440 461577 459808 458676 457559 457079 458297 461441 466475 473940 484249 497260 513577
57671E13577K1628K8611L5579M2081M9072N6637O3596O8902P1017O6439N1950
$$ 513577 535205 563816 599395 641476 690548 747185 810781 879683 950700 1017139 1069089
57660A069089K8815K492k1968m2123n6368o3336o3783o0400n5012m7985m0472
$$ 1069089 1097904 1100396 1078428 1036305 979937 916601 852818 792418 737406 689421 648949
57649F48949l4463l0082k5459k0014j5392j2485j0080p353n293m536l993k828
$$ 648949 614486 584404 558945 538931 523539 511054 500974 493621 488328 483792 479799 476971
57637D76971j788j547j493j202j310k004k240j476n83k76j27J65L9p03j372j664
$$ 476971 475183 473636 472143 470941 469631 467627 465387 463911 463328 463052 462925 463090 463129 462426 461054 459390
57621D59390k106k768k958k531k111j814j225p27j127j863j472l1P60J78p69j388
$$ 459390 457284 454516 451558 449027 446916 445102 443877 443150 442023 440160 438688 438657 439417 439595 438826 437438
57605D37438k073k688k303j034k05j75K1N91N45k53p28p08j212k158k129j001
$$ 437438 435365 432677 430374 429340 429135 428960 428981 429572 430117 429864 429136 428428 427216 425058 422929 421928
57589D21928m58j167j681j077m27o92j263j513j797j980j187J53J87j417k600
$$ 421928 421470 420303 418622 417545 417118 416426 415163 413650 411853 409873 408686 408839 409026 407609 405009
57574D05009k064j083j037j373j313j443k088k134r82J06P3l47l35m94j208j434
$$ 405009 402945 401862 400825 399452 398139 396696 394608 392474 391492 391598 391671 391324 390989 390495 389287 387853
57558C87853n81K08J48K97J420K211J474L80O71K021L032L478L832L807L072K287
$$ 387853 387272 387480 387628 387925 389345 391556 393030 393410 394081 396102 399134 402612 406444 410251 413323 415610
57542D15610J896J060p01k101j938j048p66o83K61J527J748R77L81L11J88j56
$$ 415610 417506 418566 417865 415764 413826 412778 412012 411329 411590 413117 414865 415842 416223 416534 416722 416566
57526D16566m41o73q33m53M85J034O16PN2M33O82J200K207K839K496J968K004
$$ 416566 416125 415452 414619 414166 414651 415685 416301 416308 416360 416793 417475 418675 420882 423721 426217 428185 430189
57509D30189J959J170M80R95K187K662K046R16k44j027r46k65K0j79K24J369J710
$$ 430189 432148 433318 433798 434793 436980 439642 441688 442604 442360 441333 440387 440122 440142 439963 440187 441556 443266
57492D43266N72m30k0M97n15k152k449j452o30k72L60J099J192R81J350K036K110
$$ 443266 443838 443408 443388 443885 443370 441218 438769 437317 436687 436415 436775 437874 439066 440047 441397 443433 445543
57475D45543J652J271P60k30r05m51K91k6j135j943k554l620m342l363j194L09
$$ 445543 447195 448466 449226 448996 448091 447640 447931 447905 446770 444827 442273 438653 434311 430948 429754 430063
57459D30063O50R67J775K370K413K321K037J078q8l83J65M56J56j3J81O0n53q58
$$ 430063 430713 431680 433455 435825 438238 440559 442596 443674 443586 443203 443368 443824 443980 443967 444148 444208 443655 442797
57441D42797l27O44J502K117K492K597K505K144J294L00J46J055J848J618J063
$$ 442797 442470 443114 444616 446733 449225 451822 454327 456471 457765 458065 458211 459266 461114 462732 463795
57426D63795J112J244N81l43n07k84n89r16p8J504K175J549Q44P97R03P62O47
$$ 463795 464907 466151 466732 466389 465882 465598 465009 464093 464015 465519 467694 469243 470087 470884 471787 472549 473196
57409D73196O47N43N69J041J446J085M03L18O48N44J52K78O96M51k94l64M42J072
$$ 473196 473843 474386 474955 475996 477442 478527 478930 479248 479896 480440 480592 480870 481566 482017 481723 481359 481801 482873
57391D82873R83P19P05Q04J163K083L059L304L194L765M889N412N113M859M813
$$ 482873 483856 484575 485280 486084 487247 489330 492389 495693 498887 502652 507541 512953 518066 522925 527738
57376E27738M093K510J072L31k58j047j568j675j941k527k745k297j802j767j953
$$ 527738 531831 534341 535413 535744 535486 534439 532871 531196 529255 526728 523983 521686 519884 518117 516164
57361E16164k103k279k323j857j079o34n70l58P7K88L20P17J475J987K071K088
$$ 516164 514061 511782 509459 507602 506523 505889 505319 504961 505038 505326 505646 506363 507838 509825 511896 513984
57345E13984K086J818J534J746K222K237J712J144O59J82J34P58J136L11r42j004
$$ 513984 516070 517888 519422 521168 523390 525627 527339 528483 529142 529324 529458 530216 531352 531663 530721 529717
57329E29717J32Q88N21j89n96q85r56k78Q06J180O61J64O0j79m87n9J017J574
$$ 529717 529849 530737 531258 531069 530473 529588 528632 528354 529160 530340 531001 531165 531225 531046 530559 530500 531517 533091
57311E33091J260J033J375J531J043N32L70J14k54L2R95J498R92L41K84M40M56
$$ 533091 534351 535384 536759 538290 539333 539865 540235 540349 540095 540127 541122 542620 543612 543953 544237 544677 545133
57294E45133P31J287J285M97p5J91N33K26j99p5K15Q3j74j1M38Q20J112J200Q13
$$ 545133 545864 547151 548436 548933 548858 549049 549582 549808 549609 549534 549749 549832 549658 549647 550085 550905 552017 553217 554030
57275E54030L19O05J620K179J709J039R10R41P81J003J946K812K837K471K438
$$ 554030 554349 554954 556574 558753 560462 561501 562411 563352 564133 565136 567082 569894 572731 575202 577640
57260E77640K577K472K350K478K441J903J330J199J188R21Q24J405K232K461J921
$$ 577640 580217 582689 585039 587517 589958 591861 593191 594390 595578 596499 597323 598728 600960 603421 605342
57245F05342J155O90P10J006R95L72j76L65J841K996L097K566J879R58j8l79M4
$$ 605342 606497 607187 607897 608903 609898 610270 610094 610459 612300 615296 618393 620959 622838 623796 623778 623399 623443
57228F23443O79J219J778J951J036m14p50N28K057K672K747K906K837K269J784
$$ 623443 624122 625341 627119 629070 630106 629692 628942 629470 631527 634199 636946 639852 642689 644958 646742
57213F46742J732J583J194J449K679L590K900J058o00j421j329j71J703L149L474
$$ 646742 648474 650057 651251 652700 655379 658969 661869 662927 662327 660906 659577 659406 661109 664258 667732
57198F67732L333L634M391N249O275P438Q195Q248Q032P945Q025Q602J0096J1861
$$ 667732 671065 674699 679090 684339 690614 698052 706247 714495 722527 730472 738497 747099 757195 769056
57184G69056J2515J1883J1228J1129J0831J0143J0105J0946J1321J0608J0088
$$ 769056 781571 793454 804682 815811 826642 836785 846890 857836 869157 879765 889853
57173H89853J0609J0985J0156R106R069R520R635J0159J1920J3897J4702J4797
$$ 889853 900462 911447 921603 930709 939778 949298 958933 969092 981012 994909 1009611 1024408
57161A024408J5406J6304J6583J6553J7058J7848J8382J9286K1159K2835K2773
$$ 1024408 1039814 1056118 1072701 1089254 1106312 1124160 1142542 1161828 1182987 1205822 1228595
57150A228595K1447K0649K1147K2735K5767L0685L6615M2161M7193N2378N7656
$$ 1228595 1250042 1270691 1291838 1314573 1340340 1371025 1407640 1449801 1496994 1549372 1607028
57139A607028O2599O7515P2790P7956Q2860Q8660R6164J04311J11970J19926J29161
$$ 1607028 1669627 1737142 1809932 1887888 1970748 2059408 2155572 2259883 2371853 2491779 2620940
57128B620940J38370J45284J49613J52794J56313J62288J74137J93241K15174
$$ 2620940 2759310 2904594 3054207 3207001 3363314 3525602 3699739 3892980 4108154
57119D108154K31415K34633K21397J92595J55257J23010J10134J23105J58198
$$ 4108154 4339569 4574202 4795599 4988194 5143451 5266461 5376595 5499700 5657898
57110E657898K05542K53154K89889L10592L20725L33827L63241M16163M92842
$$ 5657898 5863440 6116594 6406483 6717075 7037800 7371627 7734868 8151031 8643873
57101H643873N88315O97103Q21151R73346J169959J420235J726025K088460K508727
$$ 8643873 9232188 9929291 10750442 11723788 12893747 14313982 16040007 18128467 20637194
57092B0637194K982761L500236M047386M604391N141513N626198O034709O350170
$$ 20637194 23619955 27120191 31167577 35771968 40913481 46539679 52574388 58924558
57084E8924558O553696O632559O595449O451423O152001N570394M575368L146417
$$ 58924558 65478254 72110813 78706262 85157685 91309686 96880080 101455448 104601865
57076A04601865J416693l93699k080140l508495m615631n393808n875825o114191
$$ 104601865 106018558 105624859 103544719 100036224 95420593 90026785 84150960 78036769
57068G8036769o159026o050152n822492n509503n139759m735309m314827l895044
$$ 78036769 71877743 65827591 60005099 54495596 49355837 44620528 40305701 36410657
57060C6410657l488414l102625k743516k416328k123687j864905j638143j441624
$$ 36410657 32922243 29819618 27076102 24659774 22536087 20671182 19033039 17591415
57052A7591415j272395j126125r99325q90684p99612p24663o63734o14656n74987
$$ 17591415 16319020 15192895 14193570 13302886 12503274 11778611 11114877 10500221 9925234
57043I925234n42282n15001m92218m71989m51233m27874m02220l75691l49070
$$ 9925234 9382952 8867951 8375733 7903744 7452511 7024637 6622417 6246726 5897656
57034E897656l22669k97098k72787k49264k25844k02702j80462j59102j38062
$$ 5897656 5574987 5277889 5005102 4755838 4529994 4327292 4146830 3987728 3849666
57025C849666j17143r6506p6029n5388l4658j4399M075J7603K1036J0257j3843
$$ 3849666 3732523 3636017 3559988 3504600 3469942 3455543 3459618 3477221 3498257 3508514 3494671
57014C494671m5121p6113j01661j19304j28293j29476j25067j17237j07175r5999
$$ 3494671 3449550 3373437 3271776 3152472 3024179 2894703 2769636 2652399 2545224 2449225
57004B449225q5552p7206p0392o3519n6121m9236m3868m0027l7184l4819l2449
$$ 2449225 2363673 2286467 2216075 2152556 2096435 2047199 2003331 1963304 1926120 1891301 1858852
56993A858852k9911k7622k6008k4580k2239j8560j4285j0433p349m691k050L88
$$ 1858852 1828941 1801319 1775311 1750731 1728492 1709932 1695647 1685214 1677865 1673174 1671124 1671512
56981A671512J550M5m561j1216j8286k4663k9639l2433l2687l1131k8982k6704
$$ 1671512 1673062 1673107 1668546 1657330 1639044 1614381 1584742 1552309 1519622 1488491 1459509 1432805
56969A432805k4016k0839j7443j3827r782n585j845J409M796Q617J2489J6070
$$ 1432805 1408789 1387950 1370507 1356680 1346898 1341313 1339468 1340877 1345673 1354290 1366779 1382849
56957A382849J9435K2346K3534K1209J4420M042p480j7622k5234l0476l3536l4102
$$ 1382849 1402284 1424630 1448164 1469373 1483793 1487835 1480355 1462733 1437499 1407023 1373487 1339385
56945A339385l2234k8891k5011k0762j6192j1904q249m634l86M249Q794J3576
$$ 1339385 1307151 1278260 1253249 1232487 1216295 1204391 1196142 1191508 1191122 1195371 1204165 1217741
56933A217741J9131K5164L0954L5914L8668L6559K7766J3701k046j6764k9378
$$ 1217741 1236872 1262036 1292990 1328904 1367572 1404131 1431897 1445598 1443552 1426788 1397410
56922A397410l8852m3909m4495m2062l8191l3961l0358k7804k5453k2378j9263
$$ 1397410 1358558 1314649 1270154 1228092 1189901 1155940 1125582 1097778 1072325 1049947 1030684
56911A030684j7392j6231j4065j0922q675p901o931m800k975k954l957m357l932
$$ 1030684 1013292 997061 982996 972074 963399 955498 948567 943767 940792 937838 933881 929524 925592
56898I25592l344k535j086O87K198L601N441P806J0548J3688J7030K0064K2661
$$ 925592 922248 919713 918627 919314 921512 925113 930554 938360 948908 962596 979626 999690 1022351
56885A022351K4995K6352K5055K0279J3003M725l727j1527j7316k0322k1168k0723
$$ 1022351 1047346 1073698 1098753 1119032 1132035 1136760 1133033 1121506 1104190 1083868 1062700 1041977
56873A041977j8964j5720j1647p575l511R72N952J1356J7146K2967K8416L4124
$$ 1041977 1023013 1007293 995646 988071 984560 985532 991484 1002840 1019986 1042953 1071369 1105493
56861A105493M1458N0457N8863O3702O2891N5141M0049J9442k531k1815l6397
$$ 1105493 1146951 1197408 1256271 1319973 1382864 1438005 1478054 1497496 1494965 1473150 1436753
56850A436753m5546m8770m6721m1760l6051k9741k2112j3567n186K922J1485K0862
$$ 1436753 1391207 1342437 1295716 1253956 1217905 1188164 1166052 1152485 1147299 1150221 1161706 1182568
56838A182568L1057M2370N4911O8013Q0905R3004J02253J04020R3471O9428L5466
$$ 1182568 1213625 1255995 1310906 1378919 1459824 1552828 1655081 1759101 1852572 1922000 1957466
56827A957466k194l7231o4881q2997r1937r3105q7995p8749o8186n8062m8016
$$ 1957466 1955272 1918041 1853160 1770163 1678226 1585121 1497126 1418377 1350191 1292129 1244113
56816A244113l7193k6024j5345m747O693J8719L0332M1374N2314O2642P0519P3494
$$ 1244113 1206920 1180896 1165551 1160804 1167497 1186216 1216548 1257922 1310236 1372878 1443397 1516891
56804A516891O8781N3938K9212r15k9886n2945o8416p6353p7631p4073o7768n9934
$$ 1516891 1585672 1639610 1668822 1667907 1638021 1585076 1516660 1440307 1362676 1288603 1220835 1160901
56792A160901n1138m2301l4311k7029j9762j2463n404J775R455J6921K3193K8507
$$ 1160901 1109763 1067462 1033151 1006122 986360 973897 968493 970268 979723 996644 1019837 1048344
56780A048344L3356L6276L4352K6249J3485j367j6364k9877m0161m6151m8107
$$ 1048344 1081700 1117976 1152328 1178577 1192062 1190695 1174331 1144454 1104293 1058142 1010035
56769A010035m7060m4123m0289l6252l2244k8428k5195k2559j9798j6553j3751
$$ 1010035 962975 918852 878563 842311 810067 781639 756444 733885 714087 697534 683783
56758F83783j2387j1839j0663q739p320p003o995o506n626m543l115j600q90j442
$$ 683783 671396 659557 648894 640155 632835 625832 618837 612331 606705 602162 599047 597447 596557 595115
56744E95115k612l377l303k641j928j612j705j832j843k028k448k633k417k348
$$ 595115 592503 589126 585823 583182 581254 579642 577937 576105 574262 572234 569786 567153 564736 562388
56730E62388k645k528j496m98o39j388j330l37M05L03M2L48J168K054K489J964
$$ 562388 559743 557215 555719 555221 554582 553194 551864 551527 551932 552235 552277 552625 553793 555847 558336 560300
56714E60300N97n87p94n30o11p86m25nn06j652k210j844j252o96J90J156J318
$$ 560300 560897 560310 559516 558986 558375 557589 557164 557159 556653 555001 552791 550947 549695 548999 549189 550345 551663
56697E51663N21n00j363k251k935k802j952j138o26j56O1m52j355j744j446r17
$$ 551663 552184 551684 550321 548070 545135 542333 540381 539243 538617 538461 538522 538070 536715 534971 533525 532608
56681E32608k16P05J086K64q00n63P04J265O19nQ9K45J86N93J431J536N83k25
$$ 532608 532392 533097 534183 534447 533647 533084 533788 535053 535672 535667 535756 536001 536187 536780 538211 539747 540330 540105
56663E40105j24J61K0m7J83q3j017j371m92K74m60j980k556j796o10L54R76R74
$$ 540105 539981 540142 540162 540115 540298 540215 539198 537827 537335 537609 537149 535169 532613 530817 530207 530561 531537 532511
56645E32511J99p23j064j024j268j761j897j547j291j651k522l317l393k607j555
$$ 532511 532710 531987 530923 529899 528631 526870 524973 523426 522135 520484 517962 514645 511252 508645 507090
56630E07090r74q98q15o23o93j028j143r71j098j808k567k834k748k706k687k399
$$ 507090 506116 505218 504403 503780 503087 502059 500916 499945 498847 497039 494472 491638 488890 486184 483497 481098
56614D81098j702q41m38j067k384l094k389j077m51n10l97q0k82q62p75J57Q08
$$ 481098 479396 478555 478117 477050 474666 471572 469183 468106 467655 467145 466748 466668 466386 465524 464749 464906 465714
56597D65714M10m62r61j009r24q69r64j175r86JJ141J323N08k80m36k44L5M46
$$ 465714 466124 465662 464701 463692 462768 461899 460935 459760 458774 458775 459916 461239 461747 461467 461031 460787 460822 461268
56579D61268O62J84o96j163j036o94q1J031K017K022J413J275J661J840J987K880
$$ 461268 461930 462114 461418 460255 459219 458525 458444 459475 461492 463514 464927 466202 467863 469703 471690 474570
56563D74570M120M631M919O635R649J1802J2137J2177J3020J3309J1286P253K777
$$ 474570 478690 483321 488240 494875 504524 516326 528463 540640 553660 566969 578255 585508 588285
56550E88285j189m250n963o436o552o777o604n763m839m155l368k626k830m057
$$ 588285 587096 582846 576883 570447 563895 557118 550514 544751 539912 535757 532389 529763 526933 522876
56536E22876n068n027m448l902l135k154j671j791j597p74k68n98r31o12k31m01
$$ 522876 517808 512781 508333 504431 501296 499142 497471 495680 494083 493309 493041 492443 491512 490900 490669 490268
56520D90268p79j060j625k491k875k535k266k470k593k400k337k264j410j48J01
$$ 490268 489489 488429 486804 484313 481438 478903 476637 474167 471574 469174 466837 464573 463163 463015 463116
56505D63116q31j504j436j907l400m454m104l318k870k036o52j90j210j876p92
$$ 463116 462285 460781 459345 457438 454038 449584 445480 442162 439292 437256 436604 436414 435204 433328 432536
56490D32536O61P00m6p0L40O5o07p57o41q64q95j17P25O52j5o38j370k023j436
$$ 432536 433197 433897 433851 433781 434121 434186 433579 432822 432181 431317 430422 430305 431030 431682 431667 431029 429659 427636 426200
56471D26200M50J622Q32k90J44J276J302O59R53J973K234J507O04m91k066l145
$$ 426200 426650 428272 429104 428814 428958 430234 431536 432195 433148 435121 437355 438862 439466 438975 436909 433764
56455D33764k649j352o54l26N78J464J078j72r02j007j202j048L00K031K492J570
$$ 433764 431115 429763 429109 428783 429361 430825 431903 431731 430829 429822 428620 427572 427872 429903 432395 433965
56439D33965M53m71j488k055j486o02o95j350j237m51j43l56k52j6m65j216j170
$$ 433965 434418 433947 432459 430404 428918 428316 427621 426271 425034 424583 424440 424084 423832 423816 423351 422135 420965
56422D20965m49o2r2K4J6n48q17J16J216Q96k15j13J354K421K252J611R36m9q58
$$ 420965 420516 420454 420362 420386 420402 419854 419037 419153 420369 421265 421050 420937 422291 424712 426964 428575 429511 429462 428604
56403D28604n71L62N88J25J81Q10P77j58p72m48Q4K99N76J101J504J646J633J155
$$ 428604 428033 428395 428983 429108 429289 430099 430876 430718 429946 429498 429582 429881 430457 431558 433062 434708 436341 437496
56385D37496J27m79J78J276J418P35L85M98L60P6K94O74L71l28n34m13o63q91
$$ 437496 437623 437144 437322 438598 440016 440751 441136 441634 441994 442070 442364 443038 443409 443081 442547 442134 441471 440580
56367D40580l30M82N40L34J009K134K285J419O78L37j07l16L50J142R14L11Q25
$$ 440580 440250 440732 441272 441606 442615 444749 447034 448453 449131 449468 449361 449045 449395 450537 451451 451762 452587
56350D52587K085K372J509R00R30O52K3J85J301K186K250K078K034J939K006K562
$$ 452587 454672 457044 458553 459453 460383 461035 461058 461243 462544 464730 466980 469058 471092 473031 475037 477599
56334D77599L090L098L299M419N550N546N027N126N248M364L377L712M542M089
$$ 477599 480689 483787 487086 491505 497055 502601 507628 512754 518002 522366 525743 529455 533997 538086
56320E38086K786K263K089O49j387j807p35m88j638k409k115j971k274j774l79
$$ 538086 540872 543135 545224 545873 544486 542679 541944 541456 539818 537409 535294 533323 531049 529275 528896
56305E28896M45L57O08J512K067K312L412N123N833N365N169N550N377M620M524
$$ 528896 529341 529698 530306 531818 533885 536197 539609 544732 550565 555930 561099 566649 572026 576646 581170
56290E81170N091N051M378M215M439M081L923N549Q000Q694P711P698R355J0592
$$ 581170 586261 591312 595690 599905 604344 608425 612348 617897 625897 634591 642302 650000 659355 669947
56276F69947J0561J0752J1512J1232R930R988J2222J4507J5591J6823J8942K0489
$$ 669947 680508 691260 702772 714004 723934 733922 746144 760651 776242 793065 812007 832496
56264H32496K0850K1740K4109K6470K7811K9464L2562L6261L9882M4349N0226
$$ 832496 853346 875086 899195 925665 953476 982940 1015502 1051763 1091645 1135994 1186220
56253A186220N6629O3197P0846P9754Q8990R8772J10440J23632J36243J47771
$$ 1186220 1242849 1306046 1376892 1456646 1545636 1644408 1754848 1878480 2014723 2162494
56243B162494J59697J71876J81857J88597J93572J97063J96623J90504J79488
$$ 2162494 2322191 2494067 2675924 2864521 3058093 3255156 3451779 3642283 3821771
56234C821771J64205J43707J18124Q9683N9829K8205m442l5461o3548q9670j13604
$$ 3821771 3985976 4129683 4247807 4337490 4397319 4425524 4421082 4385621 4322073 4232403 4118799
56223D118799j32883j46509j56481j64194j68521j68827j66709j63210j57444
$$ 4118799 3985916 3839407 3682926 3518732 3350211 3181384 3014675 2851465 2694021
56214B694021j49442j41218j33608j25216j15797j07411j00820r4182q6696q0060
$$ 2694021 2544579 2403361 2269753 2144537 2028740 1921329 1820509 1726327 1639631 1559571
56204A559571p4790o8856o1618n5505n1725m8063m2917l8042l5062l2714k9697
$$ 1559571 1484781 1415925 1354307 1298802 1247077 1199014 1156097 1118055 1082993 1050279 1020582
56193A020582k7049k5443k3394k0235j7733j6743j5452j2866j0733j0040r074
$$ 1020582 993533 968090 944696 924461 906728 889985 874533 861667 850934 840894 831820
56182H31820o978n675o138o342n089m237m926n200l812k679l103l179j545r0l19
$$ 831820 824842 819167 813029 806687 801598 797361 792435 787235 783423 780744 777641 774462 772917 772827 772508
56167G72508n38P02J855J632J537K561L015K184K456N098P626Q117Q302R686J0521
$$ 772508 771970 772672 774527 776159 777696 780257 783272 785456 787912 793010 800636 808753 817055 826741 837262
56152H37262R697R645J2094J4765J5586J6373J9007K1806K3226K5603L1419L9283
$$ 837262 846959 856604 868698 883463 899049 915422 934429 956235 979461 1005064 1036483 1075766
56140A075766M7018N5437O5646P5954Q4877R3832J03618J11610J15463J16005
$$ 1075766 1122784 1178221 1243867 1319821 1404698 1498530 1602148 1713758 1829221 1945226
56130A945226J13611J05988R2949P9198O8795O0746N3389M8361M6256M2899L4586
$$ 1945226 2058837 2164825 2257774 2336972 2405767 2466513 2519902 2568263 2614519 2657418 2692004
56119B692004K3235J2284J540r729j8991k4417k8957l6102m5235n5111o7543q3094
$$ 2692004 2715239 2727523 2729063 2719334 2700343 2675926 2646969 2610867 2565632 2510521 2442978 2359884
56107B359884r7323j05842j09341j09545j04967r5188q4484p6104o7455n5934
$$ 2359884 2262561 2156719 2047378 1937833 1832866 1737678 1653194 1577090 1509635 1453701
56097A453701m4773l7720l2700k6460k0832j8450j6770j2479p762o054n596l172
$$ 1453701 1408928 1371208 1338508 1312048 1291216 1272766 1255996 1243517 1235755 1229701 1224105 1220933
56085A220933k95L14M47K681N028N017M902P092Q867P584O300Q113R980Q588P155
$$ 1220933 1220638 1220952 1221399 1224080 1229108 1234125 1239027 1246119 1254986 1262570 1268870 1276983 1286963 1295551 1302706
56070A302706R493J2472J1805J0193J2124J5464J5954J5305J6951J8612J7031
$$ 1302706 1312199 1324671 1336476 1346669 1358793 1374257 1390211 1405516 1422467 1441079 1458110
56059A458110J5304J7276J9510J7270J3584J3809J5994J5507J4228J6065J8229
$$ 1458110 1473414 1490690 1510200 1527470 1541054 1554863 1570857 1586364 1600592 1616657 1634886
56048A634886J6442J3937J5747J8962J8395J6813J9318K2774K1496J8534K0189
$$ 1634886 1651328 1665265 1681012 1699974 1718369 1735182 1754500 1777274 1798770 1817304 1837493
56037A837493K4104K4207K2814K6047L1718L3628L3671L7517M2624M2883M1024
$$ 1837493 1861597 1885804 1908618 1934665 1966383 2000011 2033682 2071199 2113823 2156706 2197730
56026B197730M3726M8558M8617M6148M8278N3239N4258N3185N6587O2253O3466
$$ 2197730 2241456 2290014 2338631 2384779 2433057 2486296 2540554 2593739 2650326 2712579 2776045
56015B776045O2734O7008P3465P4605P3245P7268Q3971Q5357Q4496R0131R9380
$$ 2776045 2838779 2905787 2979252 3053857 3127102 3204370 3288341 3373698 3458194 3548325 3647705
56004C647705J02818J02613J08075J17359J21671J23525J32022J44146J50113
$$ 3647705 3750523 3853136 3961211 4078570 4200241 4323766 4455788 4599934 4750047
55995D750047J53191J64107J79930J89358J94837K07714K25701K37821K47398
$$ 4750047 4903238 5067345 5247275 5436633 5631470 5839184 6064885 6302706 6550104
55986F550104K66432K91428L09571L24551L50260L83501M10445M35493M74483
$$ 6550104 6816536 7107964 7417535 7742086 8092346 8475847 8886292 9321785 9796268
55977I796268N23819N67343O09331O68001P40864Q11564Q86369R86366J108123
$$ 9796268 10320087 10887430 11496761 12164762 12905626 13717190 14603559 15589925 16698048
55968A6698048J232535J368242J542761J755486J987471K253610K593381L015063
$$ 16698048 17930583 19298825 20841586 22597072 24584543 26838153 29431534 32446597
55960C2446597L507848M106092M878829N862433P079437Q621029J0624155J3161920
$$ 32446597 35954445 40060537 44939366 50801799 57881236 66502265 77126420 90288340
55952I0288340J6238217J9863746K4003337K8464526L3009599L7515372M1608940
$$ 90288340 106526557 126390303 150393640 178858166 211867765 249383137 290992077
55945B90992077M3914662M2073902L4204914K0642873M115347j1866666k4764022
$$ 290992077 334906739 376980641 411185555 431828428 435943775 424077109 399313087
55938C99313087l3523249l8117568l9093748l7389449l4089480l0089969k5968725
$$ 399313087 365789838 327672270 288578522 251189073 217099593 187009624 161040899
55931A61040899k2088177j8668572j5763927j3304872j1222673r490675q064666
$$ 161040899 138952722 120284150 104520223 91215351 79992678 70502003 62437337
55924F2437337o869765n859852n028211m351954l781472l290612k885682k558277
$$ 62437337 55567572 49707720 44679509 40327555 36546083 33255471 30369789 27811512
55916B7811512k275633k023184j813022j643913j492585j350098j229493j131662
$$ 27811512 25535879 23512695 21699673 20055760 18563175 17213077 15983584 14851922
55908A4851922j038391r44605q64653q01084p38054o70970o13342n68831n24162
$$ 14851922 13813531 12868926 12004273 11203189 10465135 9794165 9180823 8611992 8087830
55899H087830m75148m33419m02176l70179l34801l07069k88949k68619k43091
$$ 8087830 7612682 7179263 6777087 6406908 6072107 5765038 5476089 5207470 4964379
55890D964379k23371k12382j99327j80801j66625j59622j49776j33826j21430
$$ 4964379 4741008 4528626 4329299 4148498 3981873 3822251 3672475 3538649 3417219
55881C417219j16335j09784r7961q8473q4195p7697o7110o1253o3589o6468o6087
$$ 3417219 3300884 3191100 3093139 3004666 2920471 2842774 2775664 2714411 2650822 2584354 2518267
55870B518267o8081p3680p5374p1218o8949p1150p0458o4110n9250n8919n6508
$$ 2518267 2450186 2376506 2301132 2229914 2160965 2089815 2019357 1955247 1895997 1837078 1780570
55859A780570m9142m3399m2534m0720l5047l0976l0856k9053k3519k0610k3327
$$ 1780570 1731428 1688029 1645495 1604775 1569728 1538752 1507896 1478843 1455324 1434714 1411387
55848A411387k6024k5547k6525l0797l2592k9369k6860k8292k8744k5263k2546
$$ 1411387 1385363 1359816 1333291 1302494 1269902 1240533 1213673 1185381 1156637 1131374 1108828
55837A108828k3464k3546k0011j7164j7856j8346j6310j5388j7215j7437j4039
$$ 1108828 1085364 1061818 1041807 1024643 1006787 988441 972131 956743 939528 922091 908052
55826I08052j1346j1628j1049q013p141j0674j4022j4049j3839j5327j5248j2396
$$ 908052 896706 885078 874029 866016 858875 848201 834179 820130 806291 790964 775716 763320
55814G63320j0896j2249j2056q579o542q180q726n211j876k071k445j6K324K279
$$ 763320 752424 740175 728119 719540 712998 704818 696092 690881 689005 686934 684489 684473 686797 689076
55800F89076L048O796R871R333P890P809O341J671k768m455o152r845j2416j1704
$$ 689076 692124 698920 708791 718124 726014 733823 740164 741835 739067 734612 728460 718615 706199 694495
55786F94495j0839j2238j3146j1337r459r543r090o779o074q944j1747j1620j1186
$$ 694495 683656 671418 658272 646935 637476 627933 618843 612064 605990 597046 585299 573679 562493
55773E62493j2618j3016j0203p356p154o771l488QO53K41R83Q86j714l892l165
$$ 562493 549875 536859 526656 519300 512146 505375 501887 501895 502548 502789 503772 504658 502944 499052 495887
55758D95887k162l625n281m252k173j446p03J526K886J275j194k414m172p806
$$ 495887 493725 490100 484819 480567 478394 476948 476245 477771 480657 481932 480738 478324 474152 466346
55744D66346j0411r647q119q616r297p786n860n680n489l474j857k755l885k742
$$ 466346 455935 446288 438169 429553 420256 412470 406610 400930 395441 391967 390110 387355 383470 380728
55730C80728j142j331j576j04O94j466m161m534m360o114p836o785m715m477m740
$$ 380728 379586 378255 376679 376575 377269 375803 371642 367108 362748 356634 348798 342013 337298 332821 328081
55715C28081l005p19m55r51J62J577J097K97J668L713L679K596K865L346J678
$$ 328081 325076 324357 323902 322951 323113 324690 325787 326084 327752 331465 335144 337740 340605 343951 345629
55700C45629r43j959k237l958n929n673m240m329n403n107l832l563l771k611
$$ 345629 344686 342727 340490 336532 330603 324930 320690 316361 310958 305851 302019 298456 294685 292074
55686B92074p13J20M48J729L059K951K543L504M664M272L463L967M512L245J432
$$ 292074 291361 291481 291929 293658 296717 299668 302211 305715 310379 314651 318114 322081 326593 329838 331270
55671C31270R95P57j020k707k109q57j724l685m013l170l166l118j077J410J422
$$ 331270 332265 333022 332002 329295 327186 326329 324605 320920 316907 313737 310571 307453 306376 307786 309208
55656C09208j56j93J292J862J579K452L958L677J825Q47J073P81j56n13q97k736
$$ 309208 309052 308859 310151 312013 313592 316044 320002 323679 325504 326351 327424 328205 328049 327536 326639 323903
55640C23903m895n124m137m475o066o812o678p236p874o535l791k293k478k555
$$ 323903 319008 313884 309747 305272 299206 292394 285716 278480 270606 264071 260280 257987 255509 252954
55626B52954k247k782l592k840r92k79q34q16q8j86j007r47j33j72j000j232j182
$$ 252954 250707 247925 244333 241493 240501 240222 239388 238572 238484 238298 237291 236344 236211 236039 235039 233807 232625
55609B32625k153l250k524p97o36j910k158j189j293k853l569k580j622j548j162
$$ 232625 230472 227222 224698 223901 223265 221355 219197 218008 216715 213862 210293 207713 206091 204543 203381
55594B03381k10j84j328j893j158m92o46o51n6K50J6R8N37L98k14j23O79R82O29
$$ 203381 203171 202987 201659 199766 198608 198116 197470 196819 196763 197013 197029 197127 197664 198062 197848 197725 198404 199386 200015
55575B00015O89J401J936K158K579K936K854L270M963O436N786L975L403L885
$$ 200015 200704 202105 204041 206199 208778 211714 214568 217838 222801 229237 235023 238998 242401 246286
55561B46286L074N46j658k472k861l390l601l778m655n381m434k463j557j833
$$ 246286 249360 249906 248248 245776 242915 239525 235924 232146 227491 222110 217676 215213 213656 211823
55547B11823j616p49o98j367r42P67J802J275M76L22L22L97J121J904J357k37
$$ 211823 210207 209458 208760 207393 206451 207218 209020 210295 210771 211093 211415 211812 212933 214837 216194 215957
55531B15957j202j267j616k202j773o51o65k060l136l207l287l563k977j600q75
$$ 215957 214755 213488 211872 209670 207897 207246 206581 204521 201385 198178 194891 191328 188351 186751 185876
55516A85876j045r65n40p72j297o89N71L85j384k555k276j980k285j970p96k58
$$ 185876 184831 183866 183326 182554 181257 180568 181139 181524 180140 177585 175309 173329 171044 169074 168278 168020
55500A68020o70m57P22J107J42k81Q09J681R46j67j58L89L56k7k58o98j374j379
$$ 168020 167350 166893 167615 168722 168864 168583 169392 171073 172019 171852 171694 172083 172439 172412 172154 171456 170082 168703
55482A68703n78j24m44m79K08N19r6n97l54k47q23j153n44K86O80J005J384J156
$$ 168703 168125 168001 167557 167078 167286 167805 167709 167112 166758 166511 165688 164535 163991 164277 164957 165962 167346 168502
55464A68502K87k95m40j097k336k882k284j650j579j280m19Q1j69k75J71L74L7
$$ 168502 168789 168494 168054 166957 164621 161739 159455 157805 156226 154946 154527 154608 154439 154164 154335 154709 154746
55447A54746l3L46L48p1R9Q57R48K18l1M14J43j036j295J00J349J004O6k46n18
$$ 154746 154713 155059 155407 155336 155435 156292 157240 157458 157427 157841 157984 156948 155653 155753 157102 158106 158172 157926 157408
55428A57408j381j793q56L69N80L00N96J114R51L49J01K45M80R17J455J422O93
$$ 157408 156027 154234 153378 153747 154327 154627 155223 156337 157288 157637 157738 157983 158463 159380 160835 162257 162950
55411A62950R5L9o8n05o59l23j79l93k47K70J69p21j275j080j072j587j600p62
$$ 162950 163045 163084 163016 162511 161852 161529 161350 160957 160710 160980 161149 160428 159153 158073 157001 155414 153814 153052
55393A53052k38o49r80n31j02j87J31J359K410K396J934J614Q90l61r85n00j59
$$ 153052 152814 152165 151185 150654 150552 150365 150496 151855 154265 156661 158595 160209 161099 160738 159753 159253 159094
55376A59094q20j423r47k10k63n73k94R6q5l09k8P8n77j184r18m39n92q24l13
$$ 159094 158274 156851 155904 155694 155431 154858 154564 154660 154575 154266 154238 154316 153739 152555 151637 151198 150606 149782 149469
55357A49469M99Q02P66P51K73q81j673j251m05k48m78j72N99J127J178P87j12
$$ 149469 149968 150770 151536 152287 152560 151679 150006 148755 148350 148102 147624 147452 148051 149178 150356 151143 151031
55340A51031r29n13J071K101J577O27M49L74n40j459j149k09r3o69o50J12N13
$$ 151031 150102 149589 150660 152761 154338 154965 155414 155788 155248 153789 152640 152431 152338 151669 151019 151131 151644
55323A51644J23l04j95K18N60O88M63j06o26p39m98r8L19L81k62j138j286o46
$$ 151644 151767 151463 151268 151486 152046 152734 153197 153091 152465 151726 151228 151130 151449 151830 151568 150430 149144 148498
55305A48498o9K11R36K189K825K112P90j86p59j110r98n49m97j076j635j809j868
$$ 148498 148429 148640 149576 151765 154590 156702 157492 157306 156547 155437 154439 153890 153393 152317 150682 148873 147005
55288A47005j646n74Q31J123J47n34pQ84J345J762K216J836N62k36J9Q9p71j400
$$ 147005 145359 144785 145616 146739 146886 146352 146345 147229 148574 150336 152552 154388 154950 154714 154733 154822 154051 152651
55270A52651q52j40l33p09l06K66R1l52l25j95k85K00J543K356J552J65m08n09
$$ 152651 151799 151659 151326 150617 150311 150577 150668 150316 149991 149796 149511 149711 151254 153610 155162 155327 154919 154410
55252A54410r60j146k93P28O61m6k06Q2R0R3O45J170R26M17L57K08o62j469j241
$$ 154410 153450 152304 152011 152739 153400 153354 153148 153230 153320 153413 154058 155228 156154 156571 156928 157136 156474 155005 153764
55233A53764n98o19r77q38n79q67j081l89N03N16J27M00R24O61J1J25P69Q17K70
$$ 153764 153166 152547 151570 150732 150153 149286 148205 147816 148319 148835 148962 149362 150286 150947 150958 151083 151852 152669 152939
55214A52939J8O2k61p36o10o8J39K0k1k82j036j450p40L21N35J54J00J46l92r68
$$ 152939 152957 153019 152758 152022 151412 151344 151483 151503 151482 151200 150164 148714 147974 148295 148830 148984 149084 149230 148838 147870
55194A47870o43R8J69j04L32J188J315Q17P94J340J560J326J202J035K12q84j306
$$ 147870 147227 147325 147494 147390 147722 148910 150225 151042 151836 153176 154736 156062 157264 158299 158511 157627 156321
55177A56321j066p70k31Q88J673J037k85o63j28j33j022j709j699j521j219k71
$$ 156321 155255 154485 154254 155142 156815 157852 157567 156904 156776 156643 155621 153912 152213 150692 149473 149202
55161A49202R30J286Q33P14J214J433J007O00M96J86l83n74k55n4j50l8M31P98
$$ 149202 150132 151418 152251 152965 154179 155612 156619 157219 157715 157901 157518 156944 156689 156635 156485 156447 156878 157676
55143A57676R01R77R45N66J54J78L54J33k51k47q6l80r78j289j295j198p04K39
$$ 157676 158577 159554 160499 161065 161219 161397 161751 161884 161633 161386 161300 160920 159942 158653 157358 156160 155456 155695
55125A55695O71p0r58o69L09N31p5l67l2J39j88n96q95j061n97O98J797J660Q01
$$ 155695 156366 156296 155338 154669 154978 155509 155434 155067 155035 155174 154986 154390 153495 152434 151837 152535 154332 155992 156793
55106A56793L09R9l82n66K79J270J085K60L35J232J576J123Q00P47M32L35J233
$$ 156793 157102 157201 156819 156253 156532 157802 158887 159147 159482 160714 162290 163413 164213 164960 165392 165727 166960
55089A66960K157J408n10j430q32k75m55l91K61M68q2m11k65m86r95n95O57J163
$$ 166960 169117 170525 170015 168585 167753 167478 167023 166632 166893 167361 167279 166868 166603 166117 165122 164527 165184 166347
55071A66347N09K03R34J371O34j46P3M88Q6o26p70n84n73m89j41q9n19o09J09
$$ 166347 166856 167059 167993 169364 169998 169852 169925 170413 170499 169873 169103 168519 167946 167457 167316 167227 166708 166099 166208
55052A66208P97N31m69j457k007j787o28P06R12j30j160j378j293j271p24O20
$$ 166208 167005 167536 167067 165610 163603 161816 161188 161894 162806 162676 161516 160138 158845 157574 156850 157470
55036A57470J863K099J516P25j8m88l71J28M07M69Q08J279J177N54K28L47K37
$$ 157470 159333 161432 162948 163673 163655 163167 162796 162924 163331 163800 164608 165887 167064 167618 167846 168193 168430
55019A68430k72o07o46p84p70rR67R54J24j50L61L97m38r57n51j91n34q69o92
$$ 168430 168158 167551 166905 166121 165351 165342 166309 167263 167387 167237 167598 167995 167557 166600 166049 165858 165324 164455 163763
55000A63763o47r83q35J48R27P78L63K88O6n65p46O7J063J374J251J160R70P21
$$ 163763 163116 162133 161298 161446 162373 163151 163514 163802 163868 163303 162557 162624 163687 165061 166312 167472 168442 169163
54982A69163R19J353J028r4p19k68L12M08P04J415J382J07r68n89M03O33K94K80
$$ 169163 170082 171435 172463 172369 171650 171382 171694 172102 172806 174221 175603 175710 174742 174153 174556 175189 175483 175763
54964A75763N02N03O70J337J672Q21o34j550j749j627j105j06P76J044R76P34
$$ 175763 176265 176768 177438 178775 180447 181268 180634 179084 177335 175708 174603 174497 175273 176317 177293 178027
54948A78027o2j148j248m6Q19N4j212j138J20R78Q74N29L46J35P6M87R06N96k07
$$ 178027 177965 176817 175569 175523 176342 176396 175184 174046 174166 175144 176018 176547 176893 177028 177104 177591 178497 179093 178886
54929A78886o18l71J10O65J451K330K962L369L813M395N234O491P829Q411P983
$$ 178886 178268 177897 178007 178672 180123 182453 185415 188784 192597 196992 202226 208717 216546 224957 232940
54914B32940P231O698O047M877L337J449j152m140o217o684o399o417o622o464
$$ 232940 240171 246869 252916 257793 261130 262579 261427 257287 251070 244386 237987 231570 224948 218484
54900B18484o005n432m466l200k555k905l239k583j430p73n92l41n8J6J78O20
$$ 218484 212479 207047 202581 199381 196826 193921 190682 188099 186669 185896 185304 184963 184905 184921 185099 185719
54884A85719Q32N94P52J989L569M346M305M152M158M386N212O519P176O392M928
$$ 185719 186551 187145 187897 189886 193455 197801 202106 206258 210416 214802 220014 226533 233709 240101 245029
54869B45029L942L370K531J497O09o47k885n456p053p326o897o181n280m575m356
$$ 245029 248971 252341 254872 256369 256978 256331 253446 247990 240937 233611 226714 220533 215253 210678 206322
54854B06322m197l595k864k512k319j925j763k385l312l564l000k184j410o62
$$ 206322 202125 198530 195666 193154 190835 188910 187147 184762 181450 177886 174886 172702 171292 170630
54840A70630k05k65n03n68o96j131j482j341r55n84N3R47J278O45m4R9N33L25
$$ 170630 170425 170160 169657 169089 168393 167262 165780 164439 163484 162900 162953 163900 165178 165823 165779 165878 166411 166736
54822A66736k19k23J49J22j97o4L75J97p62j564j406m63M86O78o7r91j010o5P64
$$ 166736 166517 166294 166443 166565 166368 166304 166679 166876 166114 164550 163144 162681 163167 163845 163778 162787 161777 161712 162476
54803A62476Q81R46J439J635R45J88L13Q31P74M32O96J382J582J233R72Q20L19
$$ 162476 163357 164303 165742 167377 168322 168510 168823 169654 170428 170860 171556 172938 174520 175753 176725 177545 177864
54786A77864k99l15K80P93Q57N95J02l74k35O75J505J484J019R36J277J682K205
$$ 177864 177565 177250 177530 178323 179180 179775 179877 179503 179268 179943 181448 182932 183951 184887 186164 187846 190051
54769A90051K818K920K413K471M105O564Q299Q854Q750Q314P696P236O683M917
$$ 190051 192869 195789 198202 200673 204778 211342 219641 228495 237245 245559 253255 260491 267174 272091
54755B72091J685j424l057l994n450o750o617n806o053p086p061n701m630m565
$$ 272091 273776 272352 269295 265301 259851 253101 246484 240678 234625 227539 220478 214777 210147 205582
54741B05582m400l475k639k538k517j919j060l72K11O51O45L26J76J59o7j80M84
$$ 205582 201182 197707 195068 192530 190013 188094 187034 186662 186873 187524 188169 188495 188671 188830 188763 188583 189067
54724A89067J768K997M160N574O688O766O408O758P379O735M805L226K554J399
$$ 189067 190835 193832 197992 203566 210254 217020 223428 230186 237565 244300 249105 252331 254885 256284
54710B56284j054l519m616m843n389o227o541o233n788n217m150k736j730j610
$$ 256284 255230 251711 247095 242252 236863 230636 224095 217862 212074 206857 202707 199971 198241 196631
54696A96631k021k147j587q45o82j005r70m42l87j186j622o59O83P12l79r56n40
$$ 196631 194610 192463 190876 190031 189349 188344 187374 186932 186545 185359 183737 183078 183761 184473 184094 183138 182598
54679A82598k35o48j107j149j199j471j512j215j114j338j347r32m99k40K4J75
$$ 182598 182363 181715 180608 179459 178260 176789 175277 174062 172948 171610 170263 169331 168832 168592 168616 168791
54663A68791k1j92J56N77K91l41l16K02P6p57j073l74M57Q10J132J595J505O88
$$ 168791 168770 168578 168734 169311 169602 169261 168945 169147 169223 168466 167393 167019 167476 168286 169418 171013 172518 173206
54645A73206Q2K97O46L74j82k61K90J149J892J937R56l67q27j72O77J003Q88M30
$$ 173206 173288 173585 174231 174605 174423 174162 174452 175601 177493 179430 180386 180019 179192 179020 179697 180700 181588 182018
54627A82018n29j645k145j882j411r19j14P52R28M11jn6k63o95p45l33o6l1L21
$$ 182018 181489 179844 177699 175817 174406 173487 173373 174125 175053 175464 175463 175407 175144 174449 173704 173371 173305 173274 173595
54608A73595Q47O60k92r26o92j87J85P65J467J434N17k46k42r0l17n42n47q68
$$ 173595 174442 175102 174810 173884 173192 173005 173190 173955 175422 176856 177373 177127 176885 176795 176478 175936 175389 174521
54590A74521j583j755q46L81J084J316J265O68k61n87l1M58K39j03j00l30j104
$$ 174521 172938 171183 170337 170718 171802 173118 174383 175051 174790 174203 174172 174630 174869 174766 174666 174336 173232
54573A73232j452n80O57R25K26m94q49j044j031o45j54J63O01J438K241K359J821
$$ 173232 171780 171200 171857 172782 173008 172514 171665 170621 169590 168945 168791 168954 169555 170993 173234 175593 177414
54556A77414J158P65P63J046J124M97n70j184r34k45M64J131J506J237O91O66
$$ 177414 178572 179337 180100 181146 182270 182767 182197 181013 180079 179834 180298 181429 182935 184172 184863 185529
54540A85529J098J124O22M36P90Q19J53l48k0O16R47J072R59J09j233j807j121
$$ 185529 186627 187751 188373 188809 189599 190418 190571 190223 190203 190819 191766 192838 193797 193906 192673 190866 189745
54523A89745l33m79j014j016o85o93r72j114j085p97M9J085J294O14K36N93N76
$$ 189745 189412 188933 187919 186903 186218 185525 184553 183439 182354 181557 181606 182691 183985 184599 184835 185428 186004
54506A86004l71r99l61L49l06j576j792j046p15j023r92m17j32l28j79P07J645
$$ 186004 185633 184634 184273 184622 184316 182740 180948 179902 179187 178164 177172 176755 176623 176295 176116 176823 178468
54489A78468J845J240K99l55l31J07L29L49P81J503J443L91k38N51J724J812J002
$$ 178468 180313 181553 181852 181497 181166 181273 181602 181951 182732 184235 185678 186069 185831 186382 188106 189918 190920
54472A90920L23j87q72j005J82J628J567K31m25L35J144Q47K2k76k8J59Q9m2j15
$$ 190920 191243 191056 190184 189179 189361 190989 192556 192787 192362 192697 193841 194688 194710 194434 194406 194565 194654 194612 194497
54453A94497j76k85l87j97M62J002M09j259k471k065q20k54n07n70m5N24P92Q65
$$ 194497 194321 194036 193649 193452 193914 194916 195325 194066 191595 189530 188710 188456 187949 187379 187334 187858 188650 189515
54435A89515O05j70r43r56l37J60L60O44R51Q12L29Q3J28K0j94nN54Q97R26J194
$$ 189515 190120 189950 189007 188051 187714 187874 188234 188878 189829 190641 190970 191053 191181 191201 191007 191002 191556 192453 193379 194573
54415A94573J912K561K614J987P96o51j657j715j246j058j178r41k01M32O28P78
$$ 194573 196485 199046 201660 203647 204443 203792 202135 200420 199174 198116 196938 195997 195796 196228 196856 197634
54399A97634J226J697J733J204K77o61j024m79N69J343J525J393J233J054P87
$$ 197634 198860 200557 202290 203494 203771 203110 202086 201607 202176 203519 205044 206437 207670 208724 209511
54384B09511M26Qk64j61J50R4m85r93r35o10n12n16k84lK0N2N52J267J479J028
$$ 209511 209937 209945 209681 209520 209670 209764 209279 208286 207351 206741 206229 205713 205429 205426 205446 205498 206050 207317 208796 209824
54364B09824N33O41J413K345K771K571K541L507M959N437M527L409K980K577J395
$$ 209824 210357 210998 212411 214756 217527 220098 222639 226146 231105 236542 241069 244478 247458 250035 251430
54349B51430j8p55j107j858k822l348l633m227m750m531l974l934m054l266j709
$$ 251430 251412 250657 249550 247692 244870 241522 237889 233662 228912 224381 220407 216473 212419 209153 207444
54334B07444o87o40o64j97J18k65q01o66J51R99J272P97o4o49o83n28m21K6R64
$$ 207444 206757 206117 205453 205256 205374 205109 204308 203642 203793 204792 206064 206861 206797 206148 205465 204937 204516 204542 205506
54315B05506J625J341O67M62L69n18j875k434j916j339j306j298q80m61m16m26
$$ 205506 207131 208472 209139 209601 209970 209452 207577 205143 203227 201888 200582 199284 198404 197943 197527 197101
54299A97101p6N13R17P75r1j289j836j150O1O75O49P59J140J214R49J034J571
$$ 197101 197025 197538 198455 199230 199139 197850 196014 194864 194925 195600 196249 197008 198148 199362 200311 201345 202916
54282B02916J779J196L24j99l08j85N6K08R8j6J58L13j4n19n24j18J3j38J72J078
$$ 202916 204695 205891 206215 206016 205708 205523 205579 205787 205885 205869 206027 206340 206326 205807 205283 205165 205178 205040 205212 206290
54262B06290J730J507Q22L69K75L02L46M83Q20J344J696J390N84J50M59P22K82
$$ 206290 208020 209527 210349 210718 210993 211295 211641 212124 212944 214288 215984 217374 217958 218108 218567 219289 219571
54245B19571k15M9N16J25q60j340j361j876k680k392p80N78M94l38o66l20J79
$$ 219571 219356 219405 219921 220046 219186 217846 216485 214609 211929 209537 208757 209335 209829 209491 208825 208505 208684
54228B08684N87Q32P11L51K99P14J080R91O79N21O28R64J299J085J35p22n24M06
$$ 208684 209271 210103 210814 211165 211464 212178 213258 214249 214928 215449 216077 217041 218340 219425 219560 218838 218314 218720
54210B18720Q56M58n4k28l67n63n25m60r20j600j568r16q02j470j687p21M48O58
$$ 218720 219576 220034 219980 219752 219385 218822 218297 217837 216917 215317 213749 212833 212031 210561 208874 208153 208601 209259
54192B09259J79p1Q8L06M83N63K43l80n75J6P94J133J205J321J180M50n29j206
$$ 209259 209438 209367 209455 209761 210244 210807 211050 210670 210095 210111 210905 212038 213243 214564 215744 216194 215665 214459
54174B14459j510j598j404q85l08P8K30L8n34r83o27L56J023R42O30N43N02L08
$$ 214459 212949 211351 209947 209062 208754 208832 209062 209100 208566 207583 206956 207312 208335 209277 209907 210450 210952 211260
54156B11260J08j66p71j342j068j8O98M82Ok1J32l0l60m92l49J66J138J974J745
$$ 211260 211368 211202 210431 209089 208021 208003 208701 209183 209189 209168 209300 209270 208910 208418 208069 208235 209373 211347 213092
54137B13092O34m1L01O83K54m08l89J62O14R21J223J219P66L53J98k68j281j990
$$ 213092 213726 213685 213986 214669 214923 214515 214126 214288 214902 215823 217046 218265 219031 219384 219582 219314 218033 216043
54119B16043j703j004o71l73M76J380J507J091Q57O35j35r23o16N97J273Q01K27
$$ 216043 214340 213336 212665 212292 212768 214148 215655 216746 217603 218238 218103 217180 216564 217161 218434 219235 219462
54102B19462O34J664K183J780J046O90P88Q38M82R7M46J656K892L314L079L052
$$ 219462 220096 221760 223943 225723 226769 227459 228247 229085 229567 229664 230110 231766 234658 237972 241051 244103
54086B44103L765M954N948O184N491M111K371M07j604l206m117m795n753o434
$$ 244103 247868 252822 258770 264954 270445 274556 276927 277334 275730 272524 268407 263612 257859 251425
54072B51425n648l406j281n19o89p39n58o60r94r54l14N93J379J783J588Q92K35
$$ 251425 245777 242371 241090 240571 239882 239143 238585 237925 236931 235977 235663 236256 237635 239418 241006 241898 242133
54055B42133J04M57J023J716K441K883K898K833L147L895M751N308N273M739M257
$$ 242133 242237 242694 243717 245433 247874 250757 253655 256488 259635 263530 268281 273589 278862 283601 287858
54040B87858M253M364L878K787J809J391J413J806K661L602L994L912M088M674
$$ 287858 292111 296475 300353 303140 304949 306340 307753 309559 312220 315822 319816 323728 327816 332490
54026C32490N010M765M392M118L560K627J849J425R65N12O80J341J354K25j096
$$ 332490 337500 342265 346657 350775 354335 356962 358811 360236 361201 361713 362393 363734 365088 365313 364217
54011C64217j780k306l344m480n036n175n325n297m921m654m751m683m217m099
$$ 364217 362437 360131 356787 352307 347271 342096 336771 331474 326553 321899 317148 312465 308248 304149
53997C04149m721n075m232k958k568k850k516j294k88l69j326k422k989k632j615
$$ 304149 299428 294353 290121 287163 284595 281745 279229 277935 277647 277278 275952 273530 270541 267909 266294
53982B66294q29p66r23p17l88l67m31l14l99r42j277p25K05N68L34P5j41m87n51
$$ 266294 265465 264699 263776 263059 262671 262304 261873 261559 261160 260218 258941 258216 258421 258989 259323 259398 259257 258770 258219
53963B58219O1O98M26n35j111r30m54J19J067K318L357L919M068L790L230L021
$$ 258219 258280 258978 259404 258869 257758 256828 256374 256493 257560 259878 263235 267154 271222 275012 278242 281263
53947B81263L617M565N208N693O562P769Q978J0446J2533J4602J5355J4147J1242
$$ 281263 284880 289445 294653 300346 306908 314677 323655 334101 346634 361236 376591 390738 401980
53934D01980P089K258k170n121o462o796o558n876m993m027k673q16R31J989K661
$$ 401980 409069 411327 409157 404036 397574 390778 384220 378344 373351 369324 366651 365835 366766 368755 371416
53919C71416L472M197M360M258M542N209N875O623P629Q409Q382P848P522P393
$$ 371416 374888 379085 383445 387703 392245 397454 403329 409952 417581 425990 434372 442220 449742 457135
53905D57135O914N907M528K801J031j1j38l08j166j905j764j686k979n040o175
$$ 457135 464049 469956 474484 477285 478316 478305 478167 477859 476693 474788 473024 471338 468359 463319 457144
53890D57144o147o188o802p339p626q141q602q111o904o333o824p406p478p456
$$ 457144 450997 444809 438007 430668 423042 414901 406299 398188 391284 384951 378127 370721 363243 355787
53876C55787p347o312m278k564k181k615k931l036l251l530l732l875l805l272
$$ 355787 348440 342128 337850 335286 333105 330490 327559 324523 321272 317742 314010 310135 306330 303058
53862C03058k610k515l022l487l652l743l533k446q54n2o02j645k202k166j778
$$ 303058 300448 297933 294911 291424 287772 284029 280496 278050 277196 277144 276542 274897 272695 270529 268751
53847B68751j101m18j67k26p2J72j83j055j509j234r63j018p15K60J011P10j53
$$ 268751 267650 267232 267065 266839 266767 266939 266756 265701 264192 262958 261995 260977 260262 260522 261533 262243 262090
53830B62090o25n95o32j030j613k000j692m35J219K276K421K189J948J535R67
$$ 262090 261465 260870 260238 259208 257595 255595 253903 253468 254687 256963 259384 261573 263521 265056 266023
53815B66023P05Q70J092J275J692K163K127J713J756K438K979L022L265M219N351
$$ 266023 266728 267598 268690 269965 271657 273820 275947 277660 279416 281854 284833 287855 291120 295339 300690
53800C00690N973O091N948N575N215N249N294M433K824J983K720L860L846K768
$$ 300690 306663 312754 318702 324277 329492 334741 340035 344468 347292 349275 351995 355855 359701 362469
53786C62469J860J698J794J564Q87K8n83p27q23j451k373k844k910l424m465n017
$$ 362469 364329 366027 367821 369385 370272 370300 369717 368990 368167 366716 364343 361499 358589 355165 350700 345683
53770C45683m685m472n050n489m760l476k930l177l286k957k730k878l129l277
$$ 345683 340998 336526 331476 325987 321227 317751 314821 311644 308358 305401 302671 299793 296664 293387
53756B93387l304l086k697k615l047l377l007k250j736j416r54o18q49j235r13
$$ 293387 290083 286997 284300 281685 278638 275261 272254 270004 268268 266852 265898 265280 264431 263196 262283
53741B62283J38J063J326J130P31J44m26n58k16J59K69K49K32J29l5lL08N77N31
$$ 262283 262421 263484 264810 265940 266671 266815 266389 265831 265615 265774 266043 266292 266524 266653 266618 266615 266923 267500 268031
53722B68031L46M19P69R69P37L92M07O49N24L6J05J351L023L849L651L289L208
$$ 268031 268377 268796 269565 270534 271271 271663 272070 272719 273243 273279 273384 274735 277758 281607 285258 288547 291755
53705B91755K986K344J710J447J368J318J581K310L111L516L503L375L460M005
$$ 291755 294741 297085 298795 300242 301610 302928 304509 306819 309930 313446 316949 320324 323784 327789
53691C27789M858N310M827L797K924K092P59o61j017j53P39Q13M50P1o89j891
$$ 327789 332647 337957 342784 346581 349505 351597 352356 351695 350678 350525 351264 352077 352527 352598 351909 350018
53675C50018k524j811m76J56k05q76j305j356r18n1P19Q31K61n84j207j143l11
$$ 350018 347494 345683 345207 345363 345158 344282 342977 341621 340703 340652 341371 342202 342463 341879 340672 339529 339218
53658C39218N53M99l63r23o63l16n94j137j350j389j598j646j012J39J191J780
$$ 339218 339771 340270 339907 338984 338321 338005 337411 336274 334924 333535 331937 330291 329279 329418 330609 332389
53642C32389J876J616J397J541J686J234O03R84K472L553L115J909J252J252J212
$$ 332389 334265 335881 337278 338819 340505 341739 342342 343326 345798 349351 352466 354375 355627 356879 358091
53627C58091R53P77P97J130K070L327L885L360K695K733L035K985L027L786M826
$$ 358091 359044 359821 360618 361748 363818 367145 371030 374390 377085 379818 382853 385838 388865 392651 397477
53612C97477N463N928O526O539N368M104M287N578O146N170L549K338J734J574
$$ 397477 402940 408868 415394 421933 427301 431405 435692 441270 447416 452586 456135 458473 460207 461781
53598D61781J580J171J69m98J09J341J645P29k29m89n31q67j250j367j287j010
$$ 461781 463361 464532 464701 464203 464312 465653 467298 468027 467798 467309 466778 465911 464661 463294 462007 460997
53582D60997m77j40n53j399j825j812k122k871l272k989k628k488k022j024k94
$$ 460997 460520 460380 459827 458428 456603 454791 452669 449798 446526 443537 440909 438421 436399 435375 435081
53567D35081m75r96r77m98k88o06j092j412j474j228o79m4M29O46N73J64m24p46
$$ 435081 434606 433610 432633 432135 431847 431241 430149 428737 427263 426035 425356 425312 425741 426387 426960 427124 426700 425954
53549D25954m76J47N01K53j74LR92K057K397K193K220K584K668K411K644L694
$$ 425954 425478 425625 426126 426379 426205 426208 427200 429257 431654 433847 436067 438651 441319 443730 446374 450068
53533D50068M616M536L985M052M923O134P605R334J0590J0642J0046J0088J1085
$$ 450068 454684 459220 463205 467257 472180 478314 485919 495253 505843 516485 526531 536619 547704
53520E47704J2214J2834J2945J2561J1745J1288J2138J4000J5516J6046J6324
$$ 547704 559918 572752 585697 598258 610003 621291 633429 647429 662945 678991 695315
53509F95315J7126J8265J9290K0296K1595K3110K4476K5362K5554K5138K4556
$$ 695315 712441 730706 749996 770292 791887 814997 839473 864835 890389 915527 940083
53498I40083K4072K3356K2163K1037K0550K0192J9089J7595J6914J7109J6927
$$ 940083 964155 987511 1009674 1030711 1051261 1071453 1090542 1108137 1125051 1142160 1159087
53487A159087J5887J5173J5774J6968J7515J7387J7350J7493J7286J6705J6353
$$ 1159087 1174974 1190147 1205921 1222889 1240404 1257791 1275141 1292634 1309920 1326625 1342978
53476A342978J6499J6746J6609J5932J4720J2981J0811Q388N845L232N60k153
$$ 1342978 1359477 1376223 1392832 1408764 1423484 1436465 1447276 1455664 1461509 1464741 1465301 1463148
53464A463148m789p097q922j0340j1427j2025j2042j1850j1897j2117j2173j2179
$$ 1463148 1458359 1451262 1442340 1432000 1420573 1408548 1396506 1384656 1372759 1360642 1348469 1336290
53452A336290j2667j3829j5328j6793j8017j8704j8643j8193j7985j8061j7867
$$ 1336290 1323623 1309794 1294466 1277673 1259656 1240952 1222309 1204116 1186131 1168070 1150203
53441A150203j7182j6394j5714j4754j3164j1180r163p159n175l523k522k086
$$ 1150203 1133021 1116627 1100913 1086159 1072995 1061815 1052652 1045493 1040318 1036795 1034273 1032187
53429A032187j878j616j127l77M58J216K120L540N390P133Q457R537J0580J1599
$$ 1032187 1030309 1028693 1027566 1027189 1027647 1028863 1030983 1034523 1039913 1047046 1055503 1065040 1075620 1087219
53415A087219J2689J4116J5942J7886J9699K1299K2555K3379K4146K5460K7355
$$ 1087219 1099908 1114024 1129966 1147852 1167551 1188850 1211405 1234784 1258930 1284390 1311745
53404A311745K9184L0510L1654L3099L4767L6249L7505L8906M0735M2839M4779
$$ 1311745 1340929 1371439 1403093 1436192 1470959 1507208 1544713 1583619 1624354 1667193 1711972
53393A711972M6187M7070M7770M8613M9628N0663N1547N2004N1738N0864N0052
$$ 1711972 1758159 1805229 1852999 1901612 1951240 2001903 2053450 2105454 2157192 2208056 2258108
53382B258108M9697M9256M7801M5214M2289L9781L7750L5795L3373K9984K5580
$$ 2258108 2307805 2357061 2404862 2450076 2492365 2532146 2569896 2605691 2639064 2669048 2694628
53371B694628K0824J6488J2566Q413L741j113n910j0955j6589k2708k8943l4881
$$ 2694628 2715452 2731940 2744506 2752919 2756660 2755547 2749637 2738682 2722093 2699385 2670442 2635561
53359B635561l9960m3469m5028m5030m4486m4421m5208m6278m6622m5763m4094
$$ 2635561 2595601 2552132 2507104 2462074 2417588 2373167 2327959 2281681 2235059 2189296 2145202
53348B145202m2183m0224l8418l7295l7058l7105l6876l6750l7345l8185l8019
$$ 2145202 2103019 2062795 2024377 1987082 1950024 1912919 1876043 1839293 1801948 1763763 1725744
53337A725744l6395l4076l1900l0046k8464k7211k6072k4573k2589k0468j8486
$$ 1725744 1689349 1655273 1623373 1593327 1564863 1537652 1511580 1487007 1464418 1443950 1425464
53326A425464j6643j5049j3978j3473j3451j4138j5699j7429j8054j7122j5497
$$ 1425464 1408821 1393772 1379794 1366321 1352870 1338732 1323033 1305604 1287550 1270428 1254931
53315A254931j4231j3428j2528j1230r795q602p642o492m880l255k316j851p23
$$ 1254931 1240700 1227272 1214744 1203514 1193719 1185117 1177475 1170983 1166103 1162848 1160532 1158681 1157958
53302A157958J522L720M600M621N286P070R236J1387J3831J6385J8189J9102K0118
$$ 1157958 1159480 1163200 1167800 1172421 1177707 1184777 1194013 1205400 1219231 1235616 1253805 1272907 1293025
53289A293025K1918K3897K5073K5244K4828K4192K3541K2895K1965K0529J8948
$$ 1293025 1314943 1338840 1363913 1389157 1413985 1438177 1461718 1484613 1506578 1527107 1546055
53278A546055J7697J6411J4200J1006P750M999K413l16k914n222p564j0038j2231
$$ 1546055 1563752 1580163 1594363 1605369 1613119 1618118 1620531 1620215 1617301 1612079 1604515 1594477 1582246
53265A582246j4014j5830j7884j9762k1246k2678k4119k4965k4839k4250k3945
$$ 1582246 1568232 1552402 1534518 1514756 1493510 1470832 1446713 1421748 1396909 1372659 1348714
53254A348714k4165k4801k5623k6101k5734k4831k4234k4014k3350k2039k1137
$$ 1348714 1324549 1299748 1274125 1248024 1222290 1197459 1173225 1149211 1125861 1103822 1082685
53243A082685k1509k2585k3216k3106k2736k2427k2112k1651k0864j9654j8310
$$ 1082685 1061176 1038591 1015375 992269 969533 947106 924994 903343 882479 862825 844515
53232H44515j7291j6522j5496j4164j2955j1848j0370q746p990q379q931q981
$$ 844515 827224 810702 795206 781042 768087 756239 745869 737123 729133 720754 711823 702842
53220G02842r178j0202j1451j2030j2211j2851j3941j4720j4876j4706j4348j3656
$$ 702842 693664 683462 672011 659981 647770 634919 620978 606258 591382 576676 562328 548672
53208E48672j2685j1669j0659r643q843q430q189p828p323o767o217n899o088
$$ 548672 535987 524318 513659 504016 495173 486743 478554 470726 463403 456636 450419 444520 438432
53195D38432o634p096p457p985q311p532n640l909l402l871m526n009n082m353
$$ 438432 431798 424702 417245 409260 400949 393417 387777 383868 380466 376595 372069 367060 361978 357625
53181C57625l098k428k859l439l067j996j228j096j292j665k146k393k270k159
$$ 357625 354527 352099 349240 345801 342734 340738 339510 338414 337122 335457 333311 330918 328648 326489
53167C26489k231k049j471j163j473j643j009j84m4l54m34m41q36j194q43j58
$$ 326489 324258 322209 320738 319575 318102 316459 315450 315266 315222 314868 314434 313993 313157 311963 311120 310962
53151C10962K4k18k33j31m90j083j197r97j190j525j062NK91p55j961k120j471
$$ 310962 310986 310768 310535 310404 309914 308831 307634 306637 305447 303922 302860 302865 303156 302401 300440 298320 296849
53134B96849r69q46o36l1P53J257J236Q87P55J062J429J486J408J490J577J473
$$ 296849 295880 295034 294398 294367 295120 296377 297613 298500 299255 300317 301746 303232 304640 306130 307707 309180
53118C09180J457J707J708J057M95J061K446L176K544J347N73K59r1o68j332j880
$$ 309180 310637 312344 314052 315109 315604 316665 319111 322287 324831 326178 326751 327010 326919 326251 324919 323039
53102C23039k151k160k180k373k447k083j478r60l60N61J301J069k4r47j047o74
$$ 323039 320888 318728 316548 314175 311728 309645 308167 307207 306847 307408 308709 309778 309754 308807 307760 307086
53086C07086m63o03r43j267j368j217j062j032q23j80N30P85O79O73Q10Q16P21
$$ 307086 306623 306020 305077 303810 302442 301225 300163 299131 298308 298128 298658 299443 300122 300795 301605 302421 303142
53069C03142O85M37l53j265j542j203r40r93r90q77j124j758k083j655r13m76
$$ 303142 303827 304264 303911 302646 301104 299901 298961 297968 296978 296101 294977 293219 291136 289481 288568 288092
53053B88092l93l47j67J33M69P04Q19J094J722K325K311J636P70np38j289j264
$$ 288092 287699 287352 287185 287318 287787 288491 289310 290404 292126 294451 296762 298398 299168 299163 298425 297136 295872
53036B95872o41P2M31M43L11J22j28m79r24j249j066l47L97P01O33M34O5l86m22
$$ 295872 295231 295303 295734 296177 296488 296610 296482 296003 295079 293830 292764 292417 292814 293515 294148 294582 294647 294261 293839
53017B93839K22J029J403J508J723J766J163K41k56k28j16ML16N67L76M0R8K99
$$ 293839 294061 295090 296493 298001 299724 301490 302653 302894 302638 302410 302294 302298 302614 303181 303557 303597 303695 303994
52999C03994J14j01M34J346J353J98q51p79j2N92Q67J050J172J298J642K093K204
$$ 303994 304108 304007 304441 305787 307140 307338 306487 305708 305696 306288 307155 308205 309377 310675 312317 314410 316614
52982C16614J919J667J635J607J676K233L037L120K032M10r52j825k183j885j138
$$ 316614 318533 320200 321835 323442 325118 327351 330388 333508 335540 335950 334998 333173 330990 329105 327967
52967C27967m90r4L95R23R81O44O86J284J608J252J010J458J734Q21p50j556j274
$$ 327967 327477 327383 327778 328701 329682 330326 331012 332296 333904 335156 336166 337624 339358 340179 339429 337873 336599
52950C36599q34q33q39m35j04o51k142l667m087l077j520p16j084j851k100j771
$$ 336599 335765 334932 334093 333658 333554 332903 330761 327094 323007 319930 318410 317694 316610 314759 312659 310888
52934C10888j373j181j056p86k87L98J009J217R91O34K87k44r48j318r42j34M15
$$ 310888 309515 308334 307278 306492 306205 306603 307612 308829 309820 310454 310741 310497 309549 308231 307289 307155 307570
52917C07570M67L51L80M97M62J82k26n15n09l25k87n21p24m56K78R40R80M06k96
$$ 307570 308037 308388 308768 309265 309727 309909 309683 309168 308659 308334 308047 307526 306802 306346 306624 307564 308544 308950 308654
52898C08654p24q22n73J33J040J389Q03O1J88R20J075L96r4J53M02J24M8O97J097
$$ 308654 307930 307108 306535 306668 307708 309097 309900 309961 310149 311069 312144 312540 312446 312599 313001 313125 313173 313870 314967
52879C14967J95j297j894j517j218j175o01N77J476J768K072K702L251L582L976
$$ 314967 315162 313865 311971 310454 309236 308061 307460 308037 309513 311281 313353 316055 319306 322888 326864
52864C26864M193L621K570K116K380K237J141j7m27n54j118j934k472k799l211
$$ 326864 331057 334678 337248 339364 341744 343981 345122 345105 344678 344124 343006 341072 338600 335801 332590
52849C32590l584l741l827l865l504k653j838j517j573j736j927k025j880j787
$$ 332590 329006 325265 321438 317573 314069 311416 309578 308061 306488 304752 302825 300800 298920 297133
52835B97133k126k540k228j302q17j154j423q89l2L82M12N15P31R04J039R79L79
$$ 297133 295007 292467 290239 288937 288120 286966 285543 284654 284622 285004 285416 285931 286662 287566 288605 289584 289963
52818B89963o11j295j355j165r15l51L52N01Q3L6Q15J649J842J771J949K073J744
$$ 289963 289352 288057 286702 285537 284622 284271 284623 285124 285207 285243 286058 287707 289549 291320 293269 295342 297086
52801B97086J231P65K1r98j531j340j366k144k681j998q97p85j498j743j150n06
$$ 297086 298317 299082 299103 298105 296574 295234 293868 291724 289043 287045 286148 285363 283865 282122 280972 280466
52785B80466j94J32M41K40l16l12O56J865K372J911R12J20J19P59J155O97j86
$$ 280466 280272 280404 280845 281085 280769 280457 281113 282978 285350 287261 288173 288293 288412 289171 290326 291023 290837
52768B90837p17q23r24j080j045r38j062j235r70k71L34N12M24L71N37R34J296
$$ 290837 290120 289297 288373 287293 286248 285310 284248 283013 282043 281772 282106 282618 283042 283413 283950 284884 286180
52751B86180J253Q40N36N31N07L72N63J163J446R23K15J49N65Q07R04J356K058
$$ 286180 287433 288273 288809 289340 289847 290219 290782 291945 293391 294314 294529 294678 295243 296050 296954 298310 300368
52734C00368K359K042J476R48N18L57O12J031J282J419J564J456Q48R5k18m3K19
$$ 300368 302727 304769 306245 307193 307711 308068 308680 309711 310993 312412 313976 315432 316280 316375 316157 316114 316333
52717C16333L05J32l71j061j580j888k293k632k157q21J65j28r60j017k72L24
$$ 316333 316638 316770 316399 315338 313758 311870 309577 306945 304788 303967 304132 304004 303044 302027 301755 302079
52701C02079L93K95J28k76n62k48L21L59j07l85l47m63o98m52K96Q47Q56O91N65
$$ 302079 302472 302767 302895 302619 302057 301809 302130 302489 302382 301997 301650 301187 300489 300037 300333 301180 302036 302727 303292
52682C03292K43k54m67k99k65o71j118j010j70J160K403K802K044P46j42l68l45
$$ 303292 303535 303281 302814 302515 302250 301579 300461 299451 299281 300441 302844 305646 307690 308436 308294 307926 307581
52665C07581l65m15n20o10k77O08J242P28n14j075l04J034J949K189K017J788
$$ 307581 307216 306801 306281 305671 305394 306002 307244 307972 307458 306383 306079 307113 309062 311251 313268 315056
52649C15056J957K748L610L629K617J289K16o73j526k149k385k320j968j261m61
$$ 315056 317013 319761 323371 327000 329617 330906 331122 330449 328923 326774 324389 322069 320101 318840 318379
52634C18379l8m1r5o2j67l50j65O13J762L044M291M997M546L137J879J585J845
$$ 318379 318341 318300 318205 318143 317976 317626 317461 318074 319836 322880 327171 332168 336714 339851 341730 343315 345160
52617C45160J569J86j873l596m152l494k397j680j464j293r04n45n75j043j632
$$ 345160 346729 346915 345042 341446 337294 333800 331403 329723 328259 326966 326062 325517 324942 323899 322267
52602C22267j886j591j034o83o11m50n9L13N96J025J455J299N57J22N10J110J334
$$ 322267 320381 318790 317756 317073 316462 316012 315953 316266 316862 317887 319342 320641 321198 321320 321830 322940 324274
52585C24274J652K533L235K825J805J382J539J234K80l21m3M56N07K26j1n1K47
$$ 324274 325926 328459 331694 334519 336324 337706 339245 340479 340759 340438 340395 340851 341358 341584 341573 341522 341769
52568C41769Q36J062L19q89j420j093q16j086j326j035o03o01r82j356j510j434
$$ 341769 342605 343667 343986 343097 341677 340584 339768 338682 337356 336321 335718 335117 334135 332779 331269 329835
52552C29835j251j206j289j082m40kk91p92p50m48n93q69m23M13M19m64q73k5
$$ 329835 328584 327378 326089 325007 324567 324565 324274 323482 322732 322284 321691 320822 320399 320812 321231 320767 319894 319869
52534C19869J315K199K520K310J398K62k3P23J421J310Q28M73Jn85n19M63J395
$$ 319869 321184 323383 325903 328213 329611 329873 329850 330573 331994 333304 334132 334605 334606 334021 333502 333965 335360
52517C35360J441J126J290J731J769J424J241J450K069L157M322M643L820K741
$$ 335360 336801 337927 339217 340948 342717 344141 345382 346832 348901 352058 356380 361023 364843 367584
52503C67584K276K086J377J85r51j987l187m270m598m095l306k710k384k183j878
$$ 367584 369860 371946 373323 373508 372557 370570 367383 363113 358515 354420 351114 348404 346020 343837 341959
52488C41959j363q92p58o75j44N15L48o82j303p08K85N34J80M5J80J06k4L24R69
$$ 341959 340596 339704 338946 338271 338127 338642 338990 338308 337005 336297 336582 337116 337296 337341 337521 337627 337603 337927 338896
52469C38896J162Q25O74J081J618J888K139K762L647M304M384L912L073J960O14
$$ 338896 340058 340883 341557 342638 344256 346144 348283 351045 354692 358996 363380 367292 370365 372325 372939
52454C72939p01j535j805k022k634l332l580l573l878m361m308l666l150k994
$$ 372939 372238 370703 368898 366876 364242 360910 357330 353757 349879 345518 341210 337544 334394 331400
52440C31400k579j656r28q76r46m25N39J382J869J855J077k24j110r87l00K72
$$ 331400 328821 327165 326237 325361 324415 323990 324529 325911 327780 329635 330712 330488 329378 328391 328091 328363
52424C28363O34Q35N53k90j026j010m19K22P65J180J280J195J444J977J962J180
$$ 328363 328997 329832 330385 330095 329069 328059 327640 327862 328627 329807 331087 332282 333726 335703 337665 338845
52408C38845P99J878L874N493O371O965P486P995R030J0888J2532J2372J0013
$$ 338845 339644 341522 345396 350889 357260 364225 371711 379706 388736 399624 412156 424528 434541
52395D34541O396K409j737n738q787j0191r915q528o884n706n001m130k773j398
$$ 434541 440937 443346 441609 435871 427084 416893 406978 398450 391566 385860 380859 376729 373956 372558
52381C72558m71K28R62J404J281J080J346J788J935K084K785L791M469M880N463
$$ 372558 372087 372315 373277 374681 375962 377042 378388 380176 382111 384195 386980 390771 395240 400120 405583
52366D05583N990N792M843L682K455R45n96j597k078k493k756k327j306n72o24
$$ 405583 411573 417365 422208 425890 428345 429290 428694 427097 425019 422526 419770 417443 416137 415565 414941
52351D14941r84r31k82O17J171R34J56k49K58J112J525J633K027K586K750K723
$$ 414941 413957 413026 412744 413361 414532 415466 415622 415373 415631 416743 418268 419901 421928 424514 427264 429987
52335D29987L259M369N239N524N801O579P750R104J0627J2056J2965J3494J4244
$$ 429987 433246 437615 442854 448378 454179 460758 468508 477612 488239 500295 513260 526754 540998
52322E40998J5293J6076J6362J6545J6721J6361J5324J4427J4414J4911J4989
$$ 540998 556291 572367 588729 605274 621995 638356 653680 668107 682521 697432 712421
52311G12421J4442J4004J4484J6037J8111J9842K0655K0657K0406K0300K0350
$$ 712421 726863 740867 755351 771388 789499 809341 829996 850653 871059 891359 911709
52300I11709K0424K0397K0084J9364J8418J7538J6677J5422J3433J0712P466M034
$$ 911709 932133 952530 972614 991978 1010396 1027934 1044611 1060033 1073466 1084178 1091644 1095678
52288A095678Q45j816l964n679o826p243p098o819o768p054p446p413o564n201
$$ 1095678 1096523 1094707 1090743 1085064 1078238 1070995 1063897 1057078 1050310 1043256 1035810 1028397 1021833 1016632
52274A016632m028l204k181o91Q56K221L867N997P887Q877R396J0142J0901J1098
$$ 1016632 1012604 1009400 1007219 1006528 1007384 1009605 1013472 1019469 1027356 1036233 1045629 1055771 1066672 1077770
52260A077770J0980J1224J1707J1854J1890J2654J4190J5641J6552J7250J7810
$$ 1077770 1088750 1099974 1111681 1123535 1135425 1148079 1162269 1177910 1194462 1211712 1229522
52249A229522J7703J6709J5317J3914J2198R702O397K702o58k912l935m601n815
$$ 1229522 1247225 1263934 1279251 1293165 1305363 1315065 1321462 1324164 1323506 1320594 1316659 1312058 1306243
52236A306243p385q510r073r583j0056j0016r565r421r801j0181j0335j0596j0997
$$ 1306243 1298858 1290348 1281275 1271692 1261636 1251620 1242055 1232634 1222833 1212652 1202317 1191721 1180724
52223A180724j0973j0228r032p618o093m965m742m879m235k798j794j733j588
$$ 1180724 1169751 1159523 1150491 1142873 1136780 1131815 1127073 1122194 1117959 1115161 1113367 1111634 1110046
52210A110046m76J010J900K267K722L330L924M752N866O489N947M857M449M973
$$ 1110046 1109570 1110580 1112480 1114747 1117469 1120799 1124723 1129475 1135341 1141830 1147777 1152634 1157083 1162056
52196A162056N622N852N963O427P241Q108Q717Q802Q240P252O301N763N642N451
$$ 1162056 1167678 1173530 1179493 1185920 1193161 1201269 1209986 1218788 1227028 1234280 1240581 1246344 1251986 1257437
52182A257437M450K327l70k812m857o932r010j0444j0931j0960j0896j0381r134
$$ 1257437 1261887 1264214 1263844 1261032 1256175 1249243 1240233 1229789 1218858 1207898 1197002 1186621 1177487
52169A177487p729o884o375n399l797k281j425j001l82O99J927K824L289L711
$$ 1177487 1169758 1162874 1156499 1151100 1147303 1145022 1143597 1142596 1142214 1142913 1144840 1147664 1150953 1154664
52155A154664M341M731M137K562R27J00L8R8j62o56r48n58N84J881K578K593K445
$$ 1154664 1159005 1163736 1167873 1170435 1171362 1171462 1171500 1171598 1171436 1170780 1169832 1169274 1169858 1171739 1174317 1176910 1179355
52138A179355K349J909R07k06r15j305j638j680r32O23K450M079N561P322R710
$$ 1179355 1181704 1183613 1184520 1184314 1183399 1182094 1180456 1178776 1177844 1178467 1180917 1184996 1190557 1197879 1207589
52123A207589J2639J5700J8601K1331K3729K5240K5601K5516K5923K6690K6758
$$ 1207589 1220228 1235928 1254529 1275860 1299589 1324829 1350430 1375946 1401869 1428559 1455317
52112A455317K5727K4433K3699K3239K2250K0498J8322J6080J4113J2813J2234
$$ 1455317 1481044 1505477 1529176 1552415 1574665 1595163 1613485 1629565 1643678 1656491 1668725
52101A668725J1952J1726J1860J2494J2960J2522J1363J0141Q781O504L095o76
$$ 1668725 1680677 1692403 1704263 1716757 1729717 1742239 1753602 1763743 1772524 1779028 1782123 1781447
52089A781447m087p359j0953j4507j7139j8694j9944k1251k1699k0238j7344j4678
$$ 1781447 1777360 1770001 1759048 1744541 1727402 1708708 1688764 1667513 1645814 1625576 1608232 1593554
52077A593554j3052j1683r716p588o101m966l305j188M59J342K167L500N154O910
$$ 1593554 1580502 1568819 1559103 1551515 1545414 1540448 1537143 1535955 1536414 1537756 1539923 1543423 1548577 1555487
52063A555487Q881J0882J2306J3007J3623J4631J5624J5990J5760J5387J5049
$$ 1555487 1564368 1575250 1587556 1600563 1614186 1628817 1644441 1660431 1676191 1691578 1706627
52052A706627J4580J3877J2998J1941J0455Q101M699R00k108l978n864r026j3010
$$ 1706627 1721207 1735084 1748082 1760023 1770478 1778579 1783278 1784178 1782070 1778092 1772228 1763202 1750192
52039A750192j6075j7326j7548j7854j8473j9004j9052j8406j7230j6228j5904
$$ 1750192 1734117 1716791 1699243 1681389 1662916 1643912 1624860 1606454 1589224 1572996 1557092
52028A557092j5757j4976j3774j3032j2761j2150j1181j0842j1441j2090j2320
$$ 1557092 1541335 1526359 1512585 1499553 1486792 1474642 1463461 1452619 1441178 1429088 1416768
52017A416768j2737j3533j3744j2872j1869j1532j1176j0008q685q189q164p774
$$ 1416768 1404031 1390498 1376754 1363882 1352013 1340481 1329305 1319297 1310612 1302423 1294259 1286485
52005A286485p404q042r534j0935j2192j4038j6449j8569k0075k1374k2396k2386
$$ 1286485 1279081 1271039 1261505 1250570 1238378 1224340 1207891 1189322 1169247 1147873 1125477 1103091
51993A103091k1095j9214j7436j5835j4346j3157j2430j2110j2120j2397j2836
$$ 1103091 1081996 1062782 1045346 1029511 1015165 1002008 989578 977468 965348 952951 940115
51982I40115j3533j4717j6087j6724j6285j5748j6130j6926j6760j5350j3808
$$ 940115 926582 911865 895778 879054 862769 847021 830891 813965 797205 781855 768047
51971G68047j3126j3190j3280j2713j1017q234n039j983J166M676P781R295R140
$$ 768047 754921 741731 728451 715738 704721 696487 691448 689465 690631 695307 703088 712383 721523
51958G21523Q296P305N853L856J938M67j042l162n790q353j0210j0728r602p339
$$ 721523 729819 737124 742977 746833 748771 749238 748196 745034 739244 730891 720681 709953 700351 693012
51944F93012m910k760n59K052M975P890J0389J1924J2322J2384J3174J4588J5310
$$ 693012 688102 685342 684783 686835 691810 699700 710089 722013 734335 746719 759893 774481 789791
51931G89791J4446J2499J0482Q694O841M849L015J591M87o92k423m828p518j0087
$$ 789791 804237 816736 827218 835912 842753 847602 850617 852208 852695 852003 849580 844752 837234 827147
51917H27147j2665j5578j8591k0966k2245k2466k1681j9931j7659j5448j3251
$$ 827147 814482 798904 780313 759347 737102 714636 692955 673024 655365 639917 626666
51906F26666j0540p361m525k444n27J856M421O390P400P492O708N256L721K433
$$ 626666 616126 608765 604240 601796 601269 603125 607546 613936 621336 628828 635536 640792 644513 646946
51892F46946Q29j986n973r950j2660j3781j3785j3177j2122j0593q635o398m050
$$ 646946 647775 645789 639816 629866 617206 603425 589640 576463 564341 553748 545113 538715 534665
51879E34665j760L49K325M388O587Q549R778J0362J0971J2021J3013J2972J1378
$$ 534665 532905 533254 535579 539967 546554 555103 564881 575243 586214 598235 611248 624220 635598
51866F35598Q568N305K177p06l460n878p256p153o187n488n298m772l350j581
$$ 635598 644166 649471 651648 650942 647482 641604 634348 627195 621008 615520 610222 605450 602100 600519
51852F00519k15P60J606K064J843J280P70j8j530l353m704n624o747q094r004
$$ 600519 600304 601064 602670 604734 606577 607857 608627 608609 607079 603726 599022 593398 586651 578557 569553
51837E69553r174q936q513p783o690n261l359j099O97J365J488K153L263L632
$$ 569553 560379 551443 542930 535147 528457 523196 519837 518738 519435 520800 522288 524441 527704 531336
51823E31336K673R39j037l161m878n190m069k787k295k193j815j307q99j43J277
$$ 531336 534009 534948 533911 530750 525872 520682 516613 513826 511531 509338 507523 506216 505317 505174 506451
51808E06451K648L040K543J911J440Q97J50p83j907k952l294k823k319k341k203
$$ 506451 509099 512139 514682 516593 518033 518930 519080 518297 516390 513438 510144 507321 505002 502661 500458
51793E00458r43J048K308K078R39k37j164j832k156k193k117j766p25Q22J854
$$ 500458 499515 500563 502871 504949 505888 505651 504487 502655 500499 498306 496189 494423 493698 494520 496374
51778D96374J546K80p57q39k37M48J009J651K533L625M915O528Q484J0488J2112
$$ 496374 497920 498200 497443 496604 496367 496815 497824 499475 502008 505633 510548 517076 525560 536048 548160
51763E48160J3095J3382J2974J1827R862P037L544o8l234n876q290j0352j1435
$$ 548160 561255 574637 587611 599438 609300 616337 619881 619813 616579 610703 602413 592061 580626
51750E80626j1408j1141j1350j1476j0531q755p366o777o166n034l979l413k530
$$ 580626 569218 558077 546727 535251 524720 515965 508599 501822 495656 490622 486643 483230 480700
51737D80700m94K098L936M818N758P372R038R834R635Q858P643N794L445J304
$$ 480700 480206 482304 486240 491058 496816 504188 513226 523060 532695 541553 549196 554990 558435 559739
51723E59739K1m04l80j5Q69J960K264J119r00k591l448l849m154m230l898l318
$$ 559739 559760 559356 558976 558961 559830 561790 564054 565173 564273 561682 558234 554385 550231 546001 542103 538785
51707E38785k826k730l238m075m409l678k374j329l43J449L932N689N701M471
$$ 538785 535959 533229 529991 525916 521507 517829 515455 514126 513783 515232 519164 524853 530554 535025
51693E35025L038J761N99k74p23r20p92J08J609K478J745j33k045l618m993n852
$$ 535025 538063 539824 540423 540149 539426 538506 537714 537822 539431 541909 543654 543521 541476 537858 532865 527013
51677E27013n656m610l430k313r96M01J337J663J670J467J006P12J258K667M313
$$ 527013 521357 516747 513317 511004 510008 510409 511746 513409 515079 516546 517552 518264 519522 522189 526502
51662E26502N885P654R704J1514J2477J2220J0438P030K664j447m493o368o963
$$ 526502 532387 540041 549745 561259 573736 585956 596394 603424 606088 604641 600148 593780 586817
51649E86817n976l646r66J298L223M846N325L701K71l586o872r640j2092j3688
$$ 586817 580841 577195 576229 577527 580750 585596 590921 594622 594893 591307 584435 574795 562703 549015
51635E49015j3597j1842r523p769o654n404l608j845q99o69l35M96J390J829J859
$$ 549015 535418 523576 514053 506284 499630 494226 490618 488773 487874 487205 486870 487366 488756 490585 492444
51620D92444J656J017k34j621k383k422k394k766l242l290k901k542k559k859
$$ 492444 494100 495117 494883 493262 490879 488457 486063 483297 480055 476765 473864 471322 468763 465904
51606D65904l115l109k883k686k725k873k766k188j267j74J111K544L822M809
$$ 465904 462789 459680 456797 454111 451386 448513 445747 443559 442292 442118 443229 445773 449595 454404
51592D54404N995Q007J0671J2997J4205J4209J2998J0248O014J309k657n481p285
$$ 454404 460399 468406 479077 492074 506279 520488 533486 543734 549748 551057 548400 542919 535634
51579E35634p765o461l838j215O50K250M331O901R603J2470J5661J8809K1272
$$ 535634 527869 521408 517570 516355 517005 519255 523586 530487 540090 552560 568221 587030 608302
51566F08302K2936K4280K5688K7094K8329K9450L0585L1750L2916L4207L5878
$$ 608302 631238 655518 681206 708300 736629 766079 796664 828414 861330 895537 931415
51555I31415L8077M0556M2572M3188M1700L7751L1100K1683J0113k200j3759k3915
$$ 931415 969492 1010048 1052620 1095808 1137508 1175259 1206359 1228042 1238155 1235955 1222196 1198281
51543A198281l2792m0405m6192m9548n0527m9745m7710m4593m0540l5888l0871
$$ 1198281 1165489 1125084 1078892 1029344 978817 929072 881362 836769 796229 760341 729470
51532G29470k5518k0110j5417j2066r818q019o632o114o221n840m438k940k536
$$ 729470 703952 683842 668425 656359 646541 638522 631890 625776 619555 613715 609277 606337 603801
51519F03801l189m071m945o150p527q313q124p243n974m577l770m288n636o266
$$ 603801 600612 596541 591596 585446 577919 569606 561482 554239 548265 543688 539918 535630 529994 523728
51505E23728n399l931l159l306l805m246m513m517m373m422m567m135k874j548
$$ 523728 518329 514398 511239 507933 504128 499882 495369 490852 486479 482057 477490 473355 470481 468933
51491D68933r00n65K41J404K116K144J988J908J624J114Q32R45R32L17o37j376
$$ 468933 468033 467468 467709 469113 471229 473373 475361 477269 478893 480007 480839 481784 482716 483033 482396 481020
51475D81020j782k058k162j815j111p25j231k386l313l446l032k670k624k728
$$ 481020 479238 477180 475018 473203 472092 471367 470136 467750 464437 460991 457959 455289 452665 449937
51461D49937k678k175j113K2K89n80j552j481o87l90q00q73j74L89K09J19J012
$$ 449937 447259 445084 443971 443993 444282 443702 442150 440669 439982 439592 438792 437919 437745 438134 438343 438462 439474
51444D39474K336L099L618M973P201R367J1256J3590J6355J8048J7148J3669Q929
$$ 439474 441810 444909 448527 453500 460701 470068 481324 494914 511269 529317 546465 560134 569063
51431E69063M413J132n34q82o14k99l38j170k990n179o663p051o884o652o198
$$ 569063 573476 574608 574074 573192 572578 572279 571941 570771 567781 562602 555939 548888 542004 535352 529154
51416E29154n341m494m099l888l253k180j247q36p71p69q05q92q59n48j32Q0Q1
$$ 529154 523813 519319 515220 511332 508079 505899 504652 503816 503045 502276 501471 500579 499720 499172 499040 499120 499201
51399D99201J98N89R62J033J102J823L353N050O190O747P224P940Q849R924J1394
$$ 499201 499399 499988 500950 501983 503085 504908 508261 513311 519501 526248 533472 541412 550261 560185 571579
51384E71579J3529J6315J9543K3163K7457L2693L8633M4584N0104N5342O0362
$$ 571579 585108 601423 620966 644129 671586 704279 742912 787496 837600 892942 953304
51373I53304O4476O6866O7631O7253O4931N8419M6250K9625J1494n811k1384l4843
$$ 953304 1017780 1084646 1152277 1219530 1284461 1342880 1389130 1418755 1430249 1424438 1403054 1368211
51361A368211m5649n3446n8420o1057o1844o1186n9348n6470n2789m8712m4412
$$ 1368211 1322562 1269116 1210696 1149639 1087795 1026609 967261 910791 858002 809290 764878
51350G64878l9678l4452k9265k4752k1048j7989j5593j3789j2072j0132q592q366
$$ 764878 725200 690748 661483 636731 615683 597694 582101 568312 556240 546108 537516 529150
51338E29150r250r922r468q298p307o695n958m705l182k035j708j991k211j982
$$ 529150 519900 509978 500510 492212 484905 478210 472252 467547 464365 462330 460622 458631 456420 454438
51324D54438j538j163n91O00K208L481L899L518K628J568P80N20N24L43m9l13
$$ 454438 452900 451737 451146 451746 453954 457435 461334 464852 467480 469048 469828 470348 470872 471215 471166 470853
51308D70853l39k57n9L42P16P25M71K40j54j106k271k744k300j748j779k213k692
$$ 470853 470514 470257 470198 470540 471256 471981 472452 472692 472538 471432 469161 466417 464117 462369 460590 458377 455685
51291D55685l334m171m598m080l018k236j878j490r15m08J56J375L375N312O255
$$ 455685 452351 448180 443582 439502 436484 434248 432370 430880 429965 429557 429713 431088 434463 439775 446030
51276D46030O322O440P059P576P149N742M024K475J039l37j333j636j321o04M47
$$ 446030 452352 458792 465851 473427 480576 486318 490342 492817 493856 493519 492186 490550 489229 488625 489072
51261D89072J719K891L724M258M368L620J958J96q15j245j910l103m425n579o520
$$ 489072 490791 493682 497406 501664 506032 509652 511610 511806 510991 509746 507836 504733 500308 494729 488209
51246D88209o907o268m912l872l659l693l265k423j649j162r48r87j089r17n00
$$ 488209 481302 475034 470122 466250 462591 458898 455633 453210 451561 450399 449451 448464 447375 446458 445958
51231D45958l69q14j434j683j525j119l48Q76K066K508K088J393J025J104J390
$$ 445958 445589 444775 443341 441658 440133 439014 438666 439542 441608 444116 446204 447597 448622 449726 451116
51216D51116J576J474J117P47O18P75J036J130Q80L97M1J05N77J356K419L516
$$ 451116 452692 454166 455283 456030 456648 457423 458459 459589 460469 460866 460907 461012 461589 462945 465364 468880
51200D68880L993L501K716K700L475L953L418K313J317L83p79j877k451k586k596
$$ 468880 472873 476374 479090 481790 485265 489218 492636 494949 496266 496649 495870 493993 491542 488956 486360
51185D86360k305j335K9R97J251J166J106J060R91R45P02j30j397k317k355j833
$$ 486360 484055 482720 482749 483746 484997 486163 487269 488329 489320 490265 490967 490837 489440 487123 484768 482935
51169D82935j354j066q51q64j258j576j073K75J641K447L008L785M470M432L770
$$ 482935 481581 480515 479664 478800 477542 475966 474893 475168 476809 479256 482264 486049 490519 494951 498721
51154D98721L181K875K349J310J36q52j880l114m086m329m082l819l469k727j886
$$ 498721 501902 504777 507126 508436 508572 507720 505840 502726 498640 494311 490229 486410 482941 480214 478328
51139D78328j608j993k516k776k735k304j411n12k95o71p18J06J217J733J590
$$ 478328 476720 474727 472211 469435 466700 464396 462985 462473 462178 461507 460789 460895 462112 463845 465435
51124D65435J495K026L078M062M492M469M528M826M750L713K144J071Q47R56J050
$$ 465435 466930 468956 472034 476096 480588 485057 489585 494411 499161 502874 505018 506089 506936 507892 508942
51109E08942J306J648J503P48J79M26J047J271J092J006J078R74P27P39J063J275
$$ 508942 510248 511896 513399 514147 514326 514752 515799 517070 518162 519168 520246 521220 521947 522686 523749 525024
51093E25024J086O42J61l63r58j411j402q94l07k17p57j404j545j166p13l68N2
$$ 525024 526110 526752 526913 526550 525592 524181 522779 521885 521578 521361 520604 519200 517655 516489 515776 515408 515460
51076E15460N72R53J208J616K040J868R88K63N66J735K950L773M330M770N143
$$ 515460 516032 516985 518193 519809 521849 523717 524705 524968 525534 527269 530219 533992 538322 543092 548235
51061E48235N732O995R148J1996J5063J7841K0112K2160K4213K5570K4897K1849
$$ 548235 553967 560962 570110 582106 597169 615010 635122 657282 681495 707065 731962 753811
51049G53811J7830J4636J2863J2210J2559J3660J4173J2461Q567M378J290j343
$$ 753811 771641 786277 799140 811350 823909 837569 851742 864203 872770 877148 878438 877095
51037H77095m885r306j3221j5574j6425j6086j4410j1394q012n873n919p686r904
$$ 877095 872210 862904 849683 834109 817684 801598 787188 775794 767782 761909 755990 748304 738400
51024G38400j1586j2447j2472j1600j0015q293o877n499l537j003J265K567L204
$$ 738400 726814 714367 701895 690295 680280 671987 665110 659611 656074 655071 656336 658903 662107
51011F62107M048N464P057Q443R780J1343J2886J3912J4325J4393J4095J3076
$$ 662107 666155 671619 678676 687119 696899 708242 721128 735040 749365 763758 777853 790929
50999G90929J1360R586Q175O780M965L031J595N90o37k314m000n287o211o815
$$ 790929 802289 811875 820050 826830 831795 834826 836421 837011 836374 834060 830060 824773 818562 811747
50985H11747o881o265n116l560j572P77L298O002R066J2358J5430J7984J9982
$$ 811747 804866 798601 793485 789925 788353 789130 792428 798430 807496 819854 835284 853268 873250
50972H73250K1233K1460K0927K0489K0828K1975K3776K6317K9697L3802L8511
$$ 873250 894483 915943 936870 957359 978187 1000162 1023938 1050255 1079952 1113754 1152265
50961A152265M3657M8720N3097N6824O0486O4135O6950O8277O8305O7369O5229
$$ 1152265 1195922 1244642 1297739 1354563 1415049 1479184 1546134 1614411 1682716 1750085 1815314
50950A815314O1644N7121N2373M7458M2052L6301L0801K5854K1253J6815J2835
$$ 1815314 1876958 1934079 1986452 2033910 2075962 2112263 2143064 2168918 2190171 2206986 2219821
50939B219821J0117R453J0668J2098J1673Q828M769O61l521p943j1789j4235j5890
$$ 2219821 2229938 2239391 2250059 2262157 2273830 2282658 2287427 2288088 2284567 2276624 2264835 2250600 2234710
50926B234710j8137k1428k5230k9321l4013l9132m3927m8176n2443n6925o0753
$$ 2234710 2216573 2195145 2169915 2140594 2106581 2067449 2023522 1975346 1922903 1865978 1805225
50915A805225o2898o3231o2341o0672n8177n4723n0586m6457m2829l9413l5571
$$ 1805225 1742327 1679096 1616755 1556083 1497906 1443183 1392597 1346140 1303311 1263898 1228327
50904A228327l1459k8105k6040k4470k2467k0333j8942j8141j6935j5052j3271
$$ 1228327 1196868 1168763 1142723 1118253 1095786 1075453 1056511 1038370 1021435 1006383 993112
50893I93112j2057j0944r478p978o905o146n244l947k306p08J05l23j368j711
$$ 993112 981055 970111 960633 952655 945750 939604 934360 930413 928107 927399 927504 927181 925813 924102
50879I24102p76P41J927K756L736N033O294P162P678Q298R502J1176J2531J3074
$$ 924102 923326 924067 925994 928750 932486 937519 943813 950975 958653 966951 976453 987629 1000160 1013234
50865A013234J3462J4790J7055J9188K0663K2203K4494K7096K9289L1357L4192
$$ 1013234 1026696 1041486 1058541 1077729 1098392 1120595 1145089 1172185 1201474 1232831 1267023
50854A267023L7972M2093M6288N1104N7094O4097P1540P9170Q7246R6105J05662
$$ 1267023 1304995 1347088 1393376 1444480 1501574 1565671 1637211 1716381 1803627 1899732 2005394
50843B005394J15327J24336J32195J38763J44079J48266J51451J53399J53156
$$ 2005394 2120721 2245057 2377252 2516015 2660094 2808360 2959811 3113210 3266366
50834C266366J49442J41634J30174J15962R9612Q1489O2214M2818K4472Q190n368
$$ 3266366 3415808 3557442 3687616 3803578 3903190 3984679 4046893 4089711 4114183 4122373 4117005
50823D117005j5978k3698k8437k9837k7645k2173j4332n392L093R428J2267J1114
$$ 4117005 4101027 4077329 4048892 4019055 3991410 3969237 3954905 3949513 3952606 3962034 3974301 3985415
50811C985415O207k098j3669k8216m4796o2020p8841r4942j10257j24227j35817
$$ 3985415 3991622 3989524 3975855 3947639 3902843 3840823 3761982 3667040 3556783 3432556 3296739
50800C296739j44130j48817j49987j47995j43349j36507j27693j17222j05946
$$ 3296739 3152609 3003792 2853805 2705810 2562461 2425954 2298261 2181039 2075093
50791B075093r4978q4811p5152o5761n6971m9066m1664l4259k7105k1022j6434
$$ 2075093 1980115 1895304 1820152 1754391 1697420 1648354 1606690 1572431 1545326 1524304 1507870
50780A507870j3093j0583q704p394o632o469o846p514q242q982r645j0006j0179
$$ 1507870 1494777 1484194 1475490 1468096 1461464 1454995 1448149 1440635 1432393 1423411 1413766 1403760 1393581
50767A393581j0752j2040j3470j4282j4549j4953j5728j6473j6924j7186j7164
$$ 1393581 1382829 1370789 1357319 1343037 1328488 1313535 1297807 1281334 1264410 1247224 1230060
50756A230060j6411j4801j2906j1369j0263r171p655n617l352j247P26L071O041
$$ 1230060 1213649 1198848 1185942 1174573 1164310 1155139 1147484 1141867 1138515 1137268 1137994 1141065 1147106
50743A147106R098J1631J3979J7127K1446K6310L1087L5877M1042M6485N1700
$$ 1147106 1156204 1167835 1181814 1198941 1220387 1246697 1277784 1313661 1354703 1401188 1452888
50732A452888N6274O0140O3468O6435O8980P0856P2116P3278P4665P5778P5766
$$ 1452888 1509162 1569302 1632770 1699205 1768185 1839041 1911157 1984435 2059100 2134878 2210644
50721B210644P4433P2334O9950O7262O3975N9651N3571M5093L4296K1929Q789
$$ 2210644 2285077 2357411 2427361 2494623 2558598 2618249 2671820 2716913 2751209 2773138 2781927
50710B781927m474j7021k7770l5801m0488m1468l9055l4442k8846k2482j5082
$$ 2781927 2777453 2760432 2732662 2696861 2656373 2614905 2575850 2541408 2512562 2490080 2474998
50699B474998p272n84M077P062Q772Q599N581n12r259k0212l2819m6018n8401
$$ 2474998 2467726 2467142 2471219 2478281 2487053 2495652 2501233 2500721 2491462 2471250 2438431 2392413 2334012
50686B334012o8797p6541q1425q3575q3239q0536p5658o9254o2289n5411m8707
$$ 2334012 2265215 2188674 2107249 2023674 1940435 1859899 1784241 1714987 1652698 1597287 1548580
50675A548580m2039l5278k8245k0901j3641p006j073M475R722J4309J7811J9937
$$ 1548580 1506541 1471263 1443018 1422117 1408476 1401470 1400397 1404872 1414594 1428903 1446714 1466651
50663A466651K0521J9877J8968J8533J8169J6978J5002J3232J2236J1761J1694
$$ 1466651 1487172 1507049 1526017 1544550 1562719 1579697 1594699 1607931 1620167 1631928 1643622
50652A643622J2332J3424J4052J3911J3844J4532J5622J6644J8015K0333K3308
$$ 1643622 1655954 1669378 1683430 1697341 1711185 1725717 1741339 1757983 1775998 1796331 1819639
50641A819639K6199K8823L1551L4603L7858M0994M3474M4911M5708M6736M8051
$$ 1819639 1845838 1874661 1906212 1940815 1978673 2019667 2063141 2108052 2153760 2200496 2248547
50630B248547M8712M8348M7986M8612M9657M9915M9330M8764M8047M5193L7730
$$ 2248547 2297259 2345607 2393593 2442205 2491862 2541777 2591107 2639871 2687918 2733111 2770841
50619B770841K4634P360j0561k5378l5275m0686m2476m0578l4984k7132j9201
$$ 2770841 2795475 2802835 2792274 2766896 2731621 2690935 2648459 2607881 2572897 2545765 2526564
50608B526564j2358o596j983R05J758P58k018o824j3763k2440l2044m1378m9262
$$ 2526564 2514206 2507610 2505627 2506532 2508290 2509048 2507030 2500206 2486443 2464003 2431959 2390581 2341319
50595B341319n5398o0571o5387o9175p0798p0199o8297o5688o2303n8235n3990
$$ 2341319 2285921 2225350 2159963 2090788 2019990 1949791 1881494 1815806 1753503 1695268 1641278
50584A641278m9876m5969m2589m0050l7917l5382l2441k9889k7967k5894k2970
$$ 1641278 1591402 1545433 1502844 1462794 1424877 1389495 1357054 1327165 1299198 1273304 1250334
50573A250334j9438j5917j2661r677o946m267j359J648M308O587Q912J1319J3274
$$ 1250334 1230896 1214979 1202318 1192641 1185695 1181428 1180069 1181717 1186025 1192612 1201524 1212843 1226117
50560A226117J4585J5818J7394J9026K0475K2143K4217K5857K6166K5585K5401
$$ 1226117 1240702 1256520 1273914 1292940 1313415 1335558 1359775 1385632 1411798 1437383 1462784
50549A462784K5976K6369K5865K4909K4218K3656K2671K1414K0721K1110K2314
$$ 1462784 1488760 1515129 1540994 1565903 1590121 1613777 1636448 1657862 1678583 1699693 1722007
50538A722007K3884K5715K7918L0613L4142L9009M5190N1797N7832O3123O8028
$$ 1722007 1745891 1771606 1799524 1830137 1864279 1903288 1948478 2000275 2058107 2121230 2189258
50527B189258P2577P6595Q0564Q5400R1104R6502J00762J04328J07665J09860
$$ 2189258 2261835 2338430 2418994 2504394 2595498 2692000 2792762 2897090 3004755 3114615
50517C114615J09541J06803J02964R8350R1507Q1103O7671N2855L7493K1245L906
$$ 3114615 3224156 3330959 3433923 3532273 3623780 3704883 3772554 3825409 3862902 3884147 3888053
50506C888053j3754l0596m6018n9968p2249q2162q8756r1333q9700q4118p5130
$$ 3888053 3874299 3843703 3797685 3737717 3665468 3583306 3494550 3403217 3313517 3229399 3154269
50495C154269o3368m9411l3860j7568j718J2510K4350L3448L9529M2154M0638
$$ 3154269 3090901 3041490 3007630 2990062 2988344 3000854 3025204 3058652 3098181 3140335 3180973
50484C180973L4054K1695L977j7100l8937n9825p9202r6480j10341j19497j23672
$$ 3180973 3215027 3236722 3240699 3223599 3184662 3124837 3045635 2949155 2838814 2719317 2595645
50473B595645j23556j20195j14694j08038j00664r2423q3259p3824o5097n7658
$$ 2595645 2472089 2351894 2237200 2129162 2028498 1936075 1852816 1778992 1713895 1656237
50463A656237n1488m6236m1435l6818l2651k9502k7393k5527k3172k0311j7163
$$ 1656237 1604749 1558513 1517078 1480260 1447609 1418107 1390714 1365187 1342015 1321704 1304541
50452A304541j3539r285m940j267J703M553P539J0323J2636J4682J6822J9231
$$ 1304541 1291002 1281717 1276777 1275510 1277213 1281766 1289305 1299628 1312264 1326946 1343768 1362999
50440A362999K1879K4480K6417K7028K6077K3820K0706J7171J3613J0301P407
$$ 1362999 1384878 1409358 1435775 1462803 1488880 1512700 1533406 1550577 1564190 1574491 1581898
50429A581898N169L775K994K291J523J089J183J319J053O89P97J428K290L461
$$ 1581898 1587067 1590842 1593836 1596127 1597650 1598739 1599922 1601241 1602294 1602983 1603780 1605208 1607498 1610959
50415A610959N384Q349J2349J7186K2321K7058L1352L5976M1318M6476N0248N2579
$$ 1610959 1616343 1624692 1637041 1654227 1676548 1703606 1734958 1770934 1812252 1858728 1908976 1961555
50403A961555N4152N4986N4427N2446M9800M6862M3237L8731L3747K8298K1499
$$ 1961555 2015707 2070693 2125120 2177566 2227366 2274228 2317465 2356196 2389943 2418241 2439740
50392B439740J2551J824r506k0540l1035m0941m9946n7378o2452o4736o4352o1705
$$ 2439740 2452291 2454115 2444609 2424069 2393034 2352093 2302147 2244769 2182317 2117581 2053229 1991524
50380A991524n7143n1041m3906l6043k7383j7983q467L69Q018J3953J7370J7908
$$ 1991524 1934381 1883340 1839434 1803391 1776008 1758025 1749558 1749927 1757945 1771898 1789268 1807176
50368A807176J6206J2999Q045Q33q025j7117k5784l4220m2049m8007n1304n2310
$$ 1807176 1823382 1836381 1844426 1845259 1837234 1820117 1794333 1760113 1718064 1670057 1618753 1566443
50356A566443n1632m9520m6480m3465m0865l8129l4846l1374k7936k4016j9296
$$ 1566443 1514811 1465291 1418811 1375346 1334481 1296352 1261506 1230132 1202196 1178180 1158884
50345A158884j4459j0249o466k694M38J685N95k189n772r359j2012j2951j2329
$$ 1158884 1144425 1134176 1127710 1125016 1125454 1127139 1127734 1125545 1119773 1110414 1098402 1085451 1073122
50332A073122j1131j0092r084p624n600l355j299L82J764L098M607O327P992R135
$$ 1073122 1061991 1051899 1042815 1035191 1029591 1026236 1024937 1025319 1027083 1030181 1034788 1041115 1049107 1058242
50318A058242R489R343R316R558R490Q611P289O171N150L658J951J176J862L094
$$ 1058242 1067731 1077074 1086390 1095948 1105438 1114049 1121338 1127509 1132659 1136317 1138268 1139444 1141306 1144400
50304A144400L637L385L194L772N183P174R454J1781J4103J6652J9815K3957K9202
$$ 1144400 1148037 1151422 1154616 1158388 1163571 1170745 1180199 1191980 1206083 1222735 1242550 1266507 1295709
50291A295709L5035M0353M4567M8354N2270N4278M9982L6437J5461p448k7046
$$ 1295709 1330744 1371097 1415664 1464018 1516288 1570566 1620548 1656985 1672446 1664998 1637952
50280A637952m0723m8013m9502m6645m1547l5943l0394k4684j8865j3662r901
$$ 1637952 1597229 1549216 1499714 1453069 1411522 1375579 1345185 1320501 1301636 1287974 1278073
50269A278073p658o083m276k324j173j315k014k168j676j338j563j750j170J19
$$ 1278073 1270415 1264332 1260056 1257732 1256559 1255244 1253230 1251062 1249386 1248048 1246485 1244735 1243565 1243684
50255A243684J600L205N297P774R776J0619J0715J1076J2076J3099J3488J3259
$$ 1243684 1245284 1248489 1253786 1261560 1271336 1281955 1292670 1303746 1315822 1328921 1342409 1355668
50243A355668J2772J2166J1580J1450J2007J2727J2742J1759J0077P870N012J524
$$ 1355668 1368440 1380606 1392186 1403636 1415643 1428370 1441112 1452871 1462948 1470818 1475830 1477354
50231A477354k277o105r775j2936j5099j5936j5225j2817r184n782m112m509o509
$$ 1477354 1475077 1468972 1459197 1446261 1431162 1415226 1400001 1387184 1378000 1372218 1368106 1363597 1357088
50218A357088j0169j5927k3010k9155l2571l3498l3331l2803l1668k9583k6643
$$ 1357088 1346919 1330992 1307982 1278827 1246256 1212758 1179427 1146624 1114956 1085373 1058730
50207A058730k3328k0356j8334j7055j5591j3404j1030r260q129p251o674o665
$$ 1058730 1035402 1015046 996712 979657 964066 950662 939632 930372 922243 914992 908318 901653
50195I01653o881o581n660m815m512m432m199m126m766n906o526n962m745l996
$$ 901653 894772 888191 882531 877716 873204 868772 864573 860447 855681 849775 843249 837287 832542 828546
50181H28546m078m274l865l085k681k852l146l179l022k914k981l215l385l088
$$ 828546 824468 820194 816329 813244 810563 807711 804565 801386 798364 795450 792469 789254 785869 782781
50167G82781k212j160l04M69J276J736J667J814K910M273M475L429K673L243M494
$$ 782781 780569 779409 779105 779574 780850 782586 784253 786067 788977 793250 797725 801154 803827 807070 811564
50152H11564N409O094P241Q892J0427J1354J1522J1070J0455J0158J0047R633
$$ 811564 816973 823067 830308 839200 849627 860981 872503 883573 894028 904186 914233 923866
50140I23866R116R453J1087J3322J5386J7386J9802K2750K6173K9994L3590L5878
$$ 923866 932982 942435 953522 966844 982230 999616 1019418 1042168 1068341 1098335 1131925 1167803
50128A167803L6528L6412L6390L6349L5959L5426L4816L3497L1007K7721K3878
$$ 1167803 1204331 1240743 1277133 1313482 1349441 1384867 1419683 1453180 1484187 1511908 1535786
50117A535786J8773J1868L939l789j1017j7870k3787k8066l0990l3217l4480l4072
$$ 1535786 1554559 1566427 1570366 1566577 1555560 1537690 1513903 1485837 1454847 1421630 1387150 1353078
50105A353078l2243k9922k7326k4070k0502j7779j6499j6207j6211j6174j6024
$$ 1353078 1320835 1290913 1263587 1239517 1219015 1201236 1184737 1168530 1152319 1136145 1120121
50094A120121j6077j6918j8396j9112j7963j5659j3641j1971r682o849m628l294
$$ 1120121 1104044 1087126 1068730 1049618 1031655 1015996 1002355 990384 980702 973853 969225 965931
50082I65931j907k04Q78J036J335K468L668M217M728N927P183P375O471N275M202
$$ 965931 964024 963820 964698 965734 967069 969537 973205 977422 982150 988077 995260 1002635 1009106 1014381 1018583
50067A018583L248K613K459K410K044J589J377J054N9j407k647l495m328n195
$$ 1018583 1021831 1024444 1026903 1029313 1031357 1032946 1034323 1035377 1035436 1034029 1031382 1027887 1023559 1018364
50053A018364n673n630n470n466n351m748l692k547j614r27l12M72J570K989M644
$$ 1018364 1012691 1007061 1001591 996125 990774 986026 982334 979787 978173 977246 976934 977406 978976 981965 986609
50038I86609O380Q009R448J0856J2434J4062J5335J5989J6129J6060J6107J6479
$$ 986609 992989 1000998 1010446 1021302 1033736 1047798 1063133 1079122 1095251 1111311 1127418 1143897
50026A143897J7036J7211J6501J5087J3610J2354J1068R717Q852Q979R870J0916
$$ 1143897 1160933 1178144 1194645 1209732 1223342 1235696 1246764 1256481 1265333 1274312 1284182 1295098
50014A295098J1893J3000J4145J4515J3122R854N925L053K007K102K241K191K406
$$ 1295098 1306991 1319991 1334136 1348651 1361773 1371627 1377552 1380605 1382612 1384714 1386955 1389146 1391552
50001A391552K974L249K648J212p96l354o485r877j3016j5630j7797j9670k1193
$$ 1391552 1394526 1397775 1400423 1401635 1400839 1397485 1391000 1381123 1368107 1352477 1334680 1315010 1293817
49988A293817k2105k2279k1993k1680k1473k1204k0957k1144k1833k2492k2735
$$ 1293817 1271712 1249433 1227440 1205760 1184287 1163083 1142126 1120982 1099149 1076657 1053922
49977A053922k2812k2910k2498k1082j9154j7533j6107j4181j1889j0236r589
$$ 1053922 1031110 1008200 985702 964620 945466 927933 911826 897645 885756 875520 865931
49966H65931r209q425p455o691o035n352m859m618m262l584k838k074q58R37K678
$$ 865931 856722 848297 840842 834151 828116 822764 817905 813287 809025 805441 802603 800529 799671 800608 803286
49951H03286L889N061O911R289J1418J2870J3693J3830J3121J1708J0010Q293
$$ 803286 807175 812236 819147 828436 839854 852724 866417 880247 893368 905076 915086 923379
49939I23379O614N055L628K097K63j713l615n593p921j0485j2883j4922j6630
$$ 923379 929993 935048 938676 940773 941036 939323 935708 930115 922194 911709 898826 883904 867274
49926H67274j7851j8278j7861j6865j5481j3697j1679r809q210o459m158j634
$$ 867274 849423 831145 813284 796419 780938 767241 755562 745753 737543 731084 726926 725292
$$ [...]
##END NTUPLES=NMR SPECTRUM
##END=
