##TITLE=AC1591_HPIAH13321_8314084_4xiVm4rMRG
##JCAMPDX= 6.0         $$ Bruker NMR JCAMP-DX V2.0
##DATA TYPE= NMR SPECTRUM
##DATA CLASS= NTUPLES
##ORIGIN= BRUKER
##OWNER= Administrator
$$ 1.72 TOPSPIN		Version 2.1
$$ 2013-11-09 14:51:58.418 -0800  Administrator@X
$$ Compression mode = diff/dup
##.OBSERVE FREQUENCY= 400.02188249412
##.OBSERVE NUCLEUS= ^1H
##.ACQUISITION MODE= SIMULTANEOUS (DQD)
##.ACQUISITION SCHEME= undefined
##.AVERAGES= 8
##.DIGITISER RES= 22
##SPECTROMETER/DATA SYSTEM= spect
##.PULSE SEQUENCE= zg30
##.SOLVENT NAME= COFFEE_meoh
##.SHIFT REFERENCE= INTERNAL, COFFEE_meoh, 1, 14.98509
##AUDIT TRAIL= $$ (NUMBER, WHEN, WHO, WHERE, PROCESS, VERSION, WHAT)
$$ ##TITLE= Audit trail, TOPSPIN		Version 2.1
$$ ##JCAMPDX= 5.01
$$ ##ORIGIN= Bruker BioSpin GmbH
$$ ##OWNER= Administrator
$$ $$ E:\/data/COFFEE/nmr/AC1591_HPIAH13321_8314084_4xiVm4rMRG/10/pdata/1/auditp.txt
$$ ##AUDIT TRAIL=  $$ (NUMBER, WHEN, WHO, WHERE, PROCESS, VERSION, WHAT)
(   1,<2013-11-09 14:51:51.751 -0800>,<Administrator>,<X>,<go>,<TOPSPIN 2.1>,
      <created by zg
	started at 2013-11-09 14:50:45.282 -0800,
	POWCHK enabled, PULCHK disabled,
       configuration hash MD5:
       C8 4E 4E 5D D3 5C D8 9E 9F 52 82 E0 59 8A DE 15
       data hash MD5: 64K
       98 1E 00 D4 FC 69 CD EF C0 19 C0 E5 93 0E 1A DD>)
(   2,<2013-11-09 14:51:54.605 -0800>,<Administrator>,<X>,<proc1d>,<TOPSPIN 2.1>,
      <Start of raw data processing
       efp LB = 0 FT_mod = 6 PKNL = 1 PHC0 = 0 PHC1 = 0 SI = 32K 
       data hash MD5: 32K
       2B A8 F0 4E 32 D6 DD F4 56 E8 B3 2A AA B3 01 22>)
(   3,<2013-11-09 14:51:54.911 -0800>,<Administrator>,<X>,<proc1d>,<TOPSPIN 2.1>,
      <pk PHC0 = 90.12085 PHC1 = 0 
       data hash MD5: 32K
       07 8E 3C E6 8C FD BC FC 69 1E FA 2C 65 8D 0B CF>)
(   4,<2013-11-09 14:51:55.003 -0800>,<Administrator>,<X>,<proc1d>,<TOPSPIN 2.1>,
      <abs ABSG = 1 
       data hash MD5: 32K
       3B 72 55 29 1A 0B A2 31 7F DF E6 D3 FC 62 F9 0C>)
(   5,<2013-11-09 14:51:55.095 -0800>,<Administrator>,<X>,<proc1d>,<TOPSPIN 2.1>,
      <abs ABSG = 2 
       data hash MD5: 32K
       54 BE 2A F5 FF A8 9B 0F 03 B8 61 1A 8D 94 A1 FE>)
(   6,<2013-11-09 14:51:55.156 -0800>,<Administrator>,<X>,<proc1d>,<TOPSPIN 2.1>,
      <abs ABSG = 3 
       data hash MD5: 32K
       45 1F 71 57 98 D9 DE A7 11 F1 22 C0 D9 4E A1 27>)
(   7,<2013-11-09 14:51:55.233 -0800>,<Administrator>,<X>,<proc1d>,<TOPSPIN 2.1>,
      <abs ABSG = 4 
       data hash MD5: 32K
       83 3B D4 71 B4 3E B8 95 41 A9 14 69 EE 63 00 4D>)
(   8,<2013-11-09 14:51:55.294 -0800>,<Administrator>,<X>,<proc1d>,<TOPSPIN 2.1>,
      <abs ABSG = 5 
       data hash MD5: 32K
       9D F6 86 65 30 50 EC F7 DD EF FD B5 04 97 B5 DF>)
$$ ##END=
$$ 
$$ $$ hash MD5
$$ $$ E9 E7 DA E0 3A 44 76 05 D2 8B 5D 9B 49 4F BA 5A
##$RELAX= 
##$RELAX= 
##$RELAX= 
##$RELAX= 
##$RELAX= 
##$RELAX= 
##$RELAX= 
$$ Bruker specific parameters
$$ --------------------------
##$DU= <E:\>
##$EXPNO= 10
##$NAME= <AC1591_HPIAH13321_8314084_4xiVm4rMRG>
$$ [...]
##$TP= (0..7)
150 150 150 150 150 150 150 150
##$TP07= 0
##$TPNAME0= <>
##$TPNAME1= <>
##$TPNAME2= <>
##$TPNAME3= <>
##$TPNAME4= <>
##$TPNAME5= <>
##$TPNAME6= <>
##$TPNAME7= <>
##$TPOAL= (0..7)
0.5 0.5 0.5 0.5 0.5 0.5 0.5 0.5
##$TPOFFS= (0..7)
0 0 0 0 0 0 0 0
##$TUNHIN= 0
##$TUNHOUT= 0
##$TUNXOUT= 0
##$USERA1= <user>
##$USERA2= <user>
##$USERA3= <user>
##$USERA4= <user>
##$USERA5= <user>
##$V9= 5
##$VALIST= <valist>
##$VCLIST= <CCCCCCCCCCCCCCC>
##$VD= 0
##$VDLIST= <DDDDDDDDDDDDDDD>
##$VPLIST= <PPPPPPPPPPPPPPP>
##$VTLIST= <TTTTTTTTTTTTTTT>
##$WBST= 1024
##$WBSW= 4
##$XGAIN= (0..3)
0 0 0 0
##$XL= 0
##$YL= 0
##$YMAX_a= 596667
##$YMIN_a= -515994
##$ZGOPTNS= <>
##$ZL1= 120
##$ZL2= 120
##$ZL3= 120
##$ZL4= 120
##$ABSF1= 14.98509
##$ABSF2= -5.573092
##$ABSG= 5
##$ABSL= 3
##$ALPHA= 0
##$AQORDER= 0
##$ASSFAC= 0
##$ASSFACI= 0
##$ASSFACX= 0
##$ASSWID= 0
##$AUNMP= <proc_prof1d_extract_pilot.lims>
##$AXLEFT= 0
##$AXNAME= <>
##$AXNUC= <1H>
##$AXRIGHT= 0
##$AXTYPE= 0
##$AXUNIT= <>
##$AZFE= 0.1
##$AZFW= 0.1
##$BCFW= 0
##$BC_mod= 0
##$BYTORDP= 0
##$COROFFS= 0
##$CY= 15
##$DATMOD= 1
##$DC= 0
##$DFILT= <>
##$DTYPP= 0
##$F1P= 0
##$F2P= 0
##$FCOR= 0.5
##$FTSIZE= 32768
##$FT_mod= 6
##$GAMMA= 0
##$GB= 0
##$INTBC= 1
##$INTSCL= 1
##$ISEN= 128
##$LB= 0
##$LEV0= 0
##$LPBIN= 0
##$MAXI= 10000
##$MC2= 0
##$MEAN= 0
##$ME_mod= 0
##$MI= 0
##$NCOEF= 0
##$NC_proc= -8
##$NLEV= 6
##$NOISF1= 0
##$NOISF2= 0
##$NSP= 0
##$NTH_PI= 0
##$NZP= 0
##$OFFSET= 14.98509
##$PC= 1
##$PHC0= 90.12085
##$PHC1= 0
##$PH_mod= 1
##$PKNL= yes
##$PPARMOD= 0
##$PPDIAG= 0
##$PPIPTYP= 0
##$PPMPNUM= 2147483647
##$PPRESOL= 1
##$PSCAL= 4
##$PSIGN= 0
##$PYNMP= <proc.py>
##$REVERSE= no
##$SF= 400.02
##$SI= 32768
##$SIGF1= 0
##$SIGF2= 0
##$SINO= 400
##$SIOLD= 32768
##$SPECTYP= <>
##$SREGLST= <1H.CDCl3>
##$SSB= 0
##$STSI= 32768
##$STSR= 0
##$SW_p= 8223.68421052631
##$SYMM= 0
##$S_DEV= 0
##$TDeff= 65536
##$TDoff= 0
##$TI= <>
##$TILT= no
##$TM1= 0
##$TM2= 0
##$TOPLEV= 0
##$USERP1= <user>
##$USERP2= <user>
##$USERP3= <user>
##$USERP4= <user>
##$USERP5= <user>
##$WDW= 1
##$XDIM= 32768
##$YMAX_p= 436234593
##$YMIN_p= -737603
##$CURPLOT= <Network HP LaserJet P1505>
##$CURPRIN= <$Network HP LaserJet P1505>
##$DFORMAT= <normdp>
##$LAYOUT= <+/1D_H.xwp>
##$LFORMAT= <normlp>
##$PFORMAT= <normpl>
##$SURQMSG= 1
$$ End of Bruker specific parameters
$$ ---------------------------------
##NTUPLES= NMR SPECTRUM
##VAR_NAME=  FREQUENCY,     SPECTRUM/REAL,   SPECTRUM/IMAG
##SYMBOL=    X,             R,               I
##VAR_TYPE=  INDEPENDENT,   DEPENDENT,       DEPENDENT
##VAR_FORM=  AFFN,          ASDF,            ASDF
##VAR_DIM=   32768,         32768,           32768
##UNITS=     HZ,            ARBITRARY UNITS, ARBITRARY UNITS
##FACTOR=    0.250966925370066, 1,           1
##FIRST=     8223.43324360094, -17932,       -264085
##LAST=      0,             44674,           -7357
##MIN=       0,             -737603,         0
##MAX=       8223.43324360094, 436234593,    0
$$ Real data points
##PAGE= N=1
##DATA TABLE= (X++(R..R)), XYDATA
$$ [...]
19589b10460j61809b2272k7034k96360J45499M5694j12777a21940M1161k02890
19579b83669A6043f5426A6055a26941J3519a3055j56815d8515q8297O3143A27512
19567A43313b3822k56827g8486p9186C24848a92655j02417h8464C17018j9825
19557B97193B7464J23338a33653j24270h7347c4425C66656A36947N192F0823j5654
19546D5169a45161D5791B2099i6411j82749A80578k2844a56028I3276a29556A25734
19534A9285a96361A13381C5604b46066g5711C80366r1869j1199a59941D648b52351
19522H6964a24771A5960K16075A14170e0982j64187G1430a87547B93248a11784
19511h3880A52943k2161a15738L507j25361h607m1894A718J84379d9313o6723
$$ plain form
19589 -210460 -372269 -22272 -49306 -345666 -200167 -154473 -267250 -121940 -80779 -283669
19579 -283669 16043 -65426 16055 -126941 -113422 -13055 -169870 -48515 -136812 -73669 127512
19567 143313 -23822 -280649 -78486 -157672 324848 -192655 -295072 -88464 317018 297193
19557 297193 27464 150802 -133653 -257923 -87347 -34425 366656 136947 142139 60823 45169
19546 45169 -145161 45791 22099 -96411 -279160 180578 157734 -156028 93276 -129556 125734
19534 19285 -196361 113381 35604 -246066 -75711 380366 288497 277298 -159941 4648 -252351
19522 86964 -124771 15960 232035 114170 -50982 -215169 71430 -187547 293248 -111784
19511 -83880 152943 130782 -115738 -112231 -237592 -8607 -50501 1718 186097 -49313 -116036
19500a16036o3738A21791b28729a11661N4147j51418i8006L6005C31104a26464
19489A48287a11914A6284f6229K3121q8016C76448I9357b65139A70597a26391
19478G4746a1057k1935B20128a48070A4711J23247o7346B1184J33121g2207j10238
19467a82445j49239J32751n8092a04070k6918A90471F5322g3600A70555j3674
19457A56881A0171b0313j3623j6830l8327j59767C6396d5462j82893M3899a9786
19445a64526j18447O8082H1831f8407J3038r3830P3788K269n1169e1448l25599
19434c77047J16124j53544e3441A04518b41802G4490c73325a61289A1775a30078
19423i6952A91048D7804a23290a9991m8861n8520j6388a5218k44331A46245b98005
$$ plain form
19500 -116036 -179774 121791 -228729 -111661 -57514 -208932 -98006 -62001 331104 -126464
19489 148287 -111914 16284 -66229 -43108 -131124 376448 99357 -265139 170597 -126391
19478 74746 -11057 -32992 220128 -148070 14711 137958 70612 21184 154305 -72207 -182445
19467 -182445 -331684 -198933 -257025 -104070 -130988 190471 65322 -73600 170555 156881
19457 156881 10171 -20313 -33936 -50766 -89093 -248860 36396 -45462 -228355 -184456 -19786
19445 -164526 -282973 -214891 81831 -68407 -55369 -149199 -75411 -73142 -124311 -51448 -377047
19434 -377047 -260923 -414467 -53441 104518 -241802 74490 -373325 -161289 11775 -130078
19423 -96952 191048 47804 -123290 -19991 -68852 -127372 -143760 -15218 -259549 146245 -298005
19411A07208h5683p0240d472C11045A7916K1331o957P7470h6361j72773l3686
19400b92820N8854A37031a16033j06258O6290D0991e670A8039c67924D4929J92059
19389B36988b83876i6904k84140J81056G1855a42888A99695c65497E0159b93207
19378d2405A54255b01938B8732N6978Q4125M2380q5060c00019B3214J06177a2156
19366f3374B02112G8874f0790j56372R9749j65328g0525H5937c3630k36086J17215
19355a52501e9334k31498a15434G8138a23562c175F1931b49505j01175a27397
19344C4266h5742e537k19880B5187a10914i248B06814J24891a67824B63425A4666
19332a49582O060A07905a51435E551M85406e8990A08590a83415q5718f5694j35729
$$ plain form
19411 107208 -85683 -155923 -4472 311045 17916 39247 32290 109760 -86361 -259134 -292820
19400 -292820 -233966 137031 -116033 -222291 -156001 40991 -5670 18039 -367924 44929 236988
19389 236988 -283876 -96904 -381044 -199988 71855 -142888 199695 -365497 50159 -293207
19378 -42405 154255 -201938 28732 85710 169835 212215 127155 -300019 23214 129391 -12156
19366 -63374 202112 78874 -60790 -217162 -117413 -282741 -70525 85937 -33630 -269716 -152501
19355 -152501 -59334 -290832 -115434 78138 -123562 -3175 61931 -249505 -350680 -127397
19344 34266 -85742 -5537 -225417 25187 -110914 -9248 206814 331705 -167824 263425 14666
19332 -149582 -143522 107905 -151435 5551 490957 -58990 108590 -183415 -269133 -65694 -201423
19321b01423q7830r1961a27396q711B16894c44693D1701J74702a56302A28885
19310A14002e1837o2677l4329k4463A69912p7193a67952j9413B06137g6777B50837
19298B4214R8051R7059d0522r43k70644H942K38270d1977p7425A50396b93282
19286a2973k74794g4765l34962D1332e2521E4130R9514E2464J5132B6789i6574
19274b21512J10743q7323B9249b39262N8140D0392O7261N1740h4949j60922L3462
19263b12409B46886c85697C8183K574a46430M977b020q8860A63802B3215J05321
19252A28536d3111j99931J6597N5529A24412J17047f6271m10369C2296R4851c283
19240B27062h8575k89470G7951B3645l744Q1402a19413b1119p419k24327B13231
$$ plain form
19321 -201423 -289253 -381214 -127396 -136107 216894 -344693 41701 216403 -156302 128885
19310 114002 -51837 -114514 -148843 -173306 169912 92719 -167952 -187365 206137 -76777 250837
19298 24214 122265 219324 -40522 -41465 -312109 8942 247212 -41977 -119402 150396 -293282
19286 -12973 -287767 -74765 -409727 41332 -52521 54130 153644 52464 67596 26789 -96574
19274 -221512 -110769 -198092 29249 -239262 -181122 40392 107653 159393 -84949 -245871 -212409
19263 -212409 246886 -385697 38183 40757 -146430 -141453 -2020 -90880 163802 23215 128536
19252 128536 -43111 -243042 -226445 -170916 124412 241459 -66271 -476640 32296 127147 -3283
19240 227062 -88575 -378045 77951 23645 19901 101303 -119413 -21119 -28538 -252865 213231
19228b76896A15300i9882l440B44308b39621g5996b3956A46255b61369n7350a34614
19216c3349j32614k1487d7768b1495m9785A88601K96887a46267A74695C4362j2893
19205B1469a46056m17303F3931c37815j4758G9116C1609G024a77685E9090a90606
19193f7577j85961a6235k75464L7903r1908J58606O9405E0430b15772n3974B66184
19181a88921a3527p8203G0412J74959a3397k80687J21573A04171b18391B3814
19170a30778F5846e64356E2518J84249a32562G9292a01865C3559P5247E1759g8484
19158A7029i1576A52119c60054G4882B8473A3901K0831h5376G6750h1550b3795
19146f3356l05569L7398P1679a24442r6267D0235N7808a62795d0766A93314d3236
$$ plain form
19228 -276896 115300 -99882 -103322 244308 -239621 -75996 -23956 146255 -261369 -318719 -134614
19216 -33349 -165963 -187450 -47768 -21495 -71280 188601 485488 -146267 174695 34362 21469
19205 21469 -146056 -563359 63931 -337815 -352573 79116 31609 7024 -177685 59090 -190606
19193 -67577 -253538 -16235 -291699 -253796 -345704 -187098 -117693 50430 -215772 -269746 266184
19181 -188921 -13527 -91730 70412 245371 -13397 -294084 -172511 104171 -218391 23814
19170 -130778 65846 -564356 52518 236767 -132562 79292 -101865 33559 108806 51759 -78484
19158 17029 -91576 152119 -360054 74882 28473 13901 34732 -85376 76750 -81550 -23795
19146 -63356 -368925 -331527 -259848 -124442 -220709 40235 98043 -162795 -40766 193314 -43236
19134F4299J6744a9372m1560K5712j15564r4326k03879a65098j54440C7935f4139
19122E5106a64884A32938L7589b01997G3197C4524a10429G0954L4702a3754A14552
19110h6572A3586e19111a72904j04240A39618F4772k4179k0126a0262k854n7130
19099g0246G2734a07945k16372J59199o3290J08333j77101B09910C7094b15747
19088a43439P327A97175o4511o2343a78434g283A35288b83805g7397A20893R3968
19077B14861a75239B69694r9555a76647l8091h8967A12872i9227E6676a10133
19066c6341q9192k348A80470b22753G5554I193c00177O1938B55389j15977l944
19055A35468b12396a04518p0874o6900c0878q9112c5552B13390b46379f8261q8312
$$ plain form
19134 64299 81043 -19372 -60932 -35220 -150784 -245110 -448989 -165098 -319538 37935 -64139
19122 55106 -164884 132938 170527 -201997 73197 34524 -110429 70954 105656 -13754 114552
19110 -86572 13586 -519111 -172904 -277144 139618 64772 40593 20467 -10262 -13116 -70246
19099 -70246 72734 -107945 -324317 -165118 -228408 -120075 -297176 209910 37094 -215747
19088 -143439 -136112 197175 132664 70321 -178434 -7283 135288 -283805 -77397 120893 214861
19077 214861 -175239 269694 170139 -176647 -214738 -88967 112872 -99227 56676 -110133
19066 -36341 -125533 -127881 180470 -222753 75554 9193 -300177 -238239 255389 139412 135468
19055 135468 -212396 -104518 -175392 -242292 -30878 -119990 -35552 213390 -246379 -68261 -156573
19044a56573m6656a1444N01p4580A93829r6734a97652g9755c116n2239B19305
19032g4047K0623A10992b2659A21138c1622l768H7233O0439L318a68909j16132
19021b85041D36244B03229A7720L7824K45990H6661M860O7699C8275h4483B32245
19009A20342h7965A01a83345N3477d3111a500A1768b07979B9568a74317I8888
18997a81759l262I3307l6444a63465o7751i0414j54933L5419d8535B2093c07840
18985B64724C0523F424N7676a9681A642b68213j03267f5673o6428d3953P060j63306
18973b00199Q1236F1363b48510D2731c99622c6444k26203P5173n9727c3192l3656
18962f6848B9357b07088B47587i1744B34278F9727N1384J72675G0115a9917C3344
$$ plain form
19044 -156573 -203229 -11444 -10943 -85523 193829 97095 -197652 -79755 -3116 -55355 219305
19032 -74047 -53424 110992 -22659 121138 -31622 -35390 87233 147672 150990 -168909 -285041
19021 -285041 436244 203229 17720 55544 301534 86661 91521 159220 38275 -84483 232245
19009 120342 -87965 101 -183345 -129868 -43111 -1500 11768 -207979 29568 -174317 98888
18997 -181759 -185021 93307 56863 -163465 -231216 -90414 -245347 -209928 -48535 22093 -307840
18985 264724 30523 6424 64100 -19681 1642 -268213 -371480 -65673 -132101 -43953 -36893 -200199
18973 -200199 -118963 61363 -248510 42731 -399622 -36444 -262647 -187474 -247201 -33192 -66848
18962 -66848 29357 -207088 247587 -91744 234278 69727 121111 293786 70115 -19917 33344
18950a6366r2571B05790d47615J25799f5091p7949r3754e9784f818C0501J5224
18939D5725b03783l106i3657C539b14722k82790A75555B8134J77893C2341K08637
18928B40978I6600A4008c11989a36254B13678b68200A23888d6862a0152J425k86040
18917b94767C23611f886A20109E1133h6804p2827A82117a34091B69047a35341
18906H1765D853b49847J03343q0987R0422E486J48130D14J74838a19463M9614
18895f9849k2696J2730G5217R8898f2251k16600i3707C07295f9955D2273a78635
18883A68057A7270a92892j44655c5357j69562a02233j03709k48862D243M863B326
18871b49845B2571a91724B00262H2224a22773F788K6204Q815J16256b65228i4095
$$ plain form
18950 -16366 -108937 205790 -447615 -321816 -65091 -143040 -236794 -59784 -6818 30501 45725
18939 45725 -203783 -206889 -93657 3539 -214722 -497512 175555 28134 206027 32341 240978
18928 240978 96600 14008 -311989 -136254 213678 -268200 123888 -46862 -10152 -8727 -294767
18917 -294767 323611 -6886 120109 51133 -86804 -159631 182117 -134091 269047 -135341
18906 81765 4853 -249847 -146504 -227491 -137069 5486 153616 414 175252 -119463 -69849
18895 -69849 -92545 -79815 75217 174115 -62251 -278851 -93707 307295 -69955 42273 -178635
18883 168057 17270 -192892 -337547 -35357 -204919 -102233 -205942 -454804 4243 9106 2326
18871 -249845 22571 -191724 200262 82224 -122773 6788 32992 41807 158063 -265228 -94095
18859c5380m9293o9973B50207B2111O63b8826r3812j58228h8569j30737B55881
18847A68114m0985h1196G2849K87840g5927r1570a8429n1298m8773m1500k8104
18836a88104O6390L9980B67265a12653a8009l4832k9103i098k2864l1977J5260
18825d8679H3963k8992B424Q1018K4312g8419A38062L1176a79016b4421A14973
18813a32013C87998k3823E2527b6125n9905B49357j24501i4497A52003B5545J32577
18802A58122b70593Q6883K4988b9209D1839Q8177g3079Q509k44902H4189b30812
18790c24607B4301j0282d2172o5069J6922C5831e6874p4129A6705d49894B54387
18778c89982a72588P8688o3437Q326K5118j02805A85898a02602B18129c10786
$$ plain form
18859 -35380 -84673 -154646 250207 22111 22774 -28826 -122638 -280866 -88569 -219306 255881
18847 168114 127129 -81196 72849 360689 -75927 -167497 -18429 -69727 -118500 -160000 -188104
18836 -188104 -121714 -81734 267265 -112653 -18009 -52841 -81944 -9098 -31962 -63939 -48679
18825 -48679 83963 54971 2424 83442 107754 -78419 138062 169238 -179016 -24421 114973
18813 -132013 387998 364175 52527 -26125 -86030 249357 124856 -94497 152003 25545 158122
18802 158122 -270593 -183710 -158722 -29209 41839 130016 -73079 -64570 -309472 84189 -230812
18790 -324607 24301 14019 -42172 -107241 -90319 35831 -56874 -131003 16705 -449894 254387
18778 -389982 -172588 -93900 -157337 -149011 -123893 -226698 185898 -102602 218129 -310786
18767a39432q7822A8217J64469E2957a07174N192j22037a05642b8042A03951a9329
18755A34175a18989I7021j0744b8712m4272k57278a44009F2287a60849e8261j50956
18744b09217C74639A977a9290B65648b52001B6674K16458A6988J13310N528a70279
18732H3949M2517d5112l2088A15962b6596j5041F8837g8353j90859b8370C3075
18720b36878F1354k4697J3834K05898b40570J09974l3743k6981A83827b86425
18709A26464b59714e1903J3234B8369b7985e476A68106a28395m2157A62361a76879
18697E3763e6787A6904b37351A79123a19182A787b80496I4173A2585d8593j50945
18686a99538P4577E1048J93789K822b33949n1940o31C98924A06574C1534h7558
$$ plain form
18767 -139432 -227254 18217 182686 52957 -107174 -101982 -224019 -105642 -28042 103951 -19329
18755 134175 -118989 97021 86277 -28712 -72984 -330262 -144009 62287 -160849 -58261 -209217
18744 -209217 374639 1977 -19290 265648 -252001 26674 243132 16988 130298 135826 -170279
18732 83949 126466 -45112 -77200 115962 -26596 -41637 68837 -78353 -269212 -28370 33075
18720 -236878 61354 36657 50491 256389 -240570 -130596 -164339 -191320 183827 -286425
18709 126464 -259714 -51903 -38669 28369 -27985 -5476 168106 -128395 -170552 162361 -176879
18697 53763 -56787 16904 -237351 179123 -119182 1787 -280496 94173 12585 -48593 -199538
18686 -199538 -124961 51048 244837 247659 -233949 -285889 -286520 398924 106574 31534 -87558
18674g5937O442n8947G2139b73260B7591c08517A78767a61553D0331K58602a79276
18662g1035j53187B0787d8775C4269h8691O318A70364b86439A23863L3369h196
18650C72042j43101n0945c40659j72927D5457R7531l2114a7290o1481j81665A32016
18638a29723J4958r6263F4255h3467j88194A39180c72317F520h0962j36458A66199
18626a22679e9088j28759j42069J28068A33322c47643e2506C8778k128a5046q8791
18615a03837r7799D7826b57265a24123d3999k04509a17504d7071A2726a58607
18604d7633j7894k59273a4813p0626k38k4179H5750c31395A7059a74025A11470
18592b0900k12305G9896C2917a13305B93728B4655c29190i407j32969M3049C0963
$$ plain form
18674 -75937 -69495 -128442 72139 -273260 27591 -308517 178767 -161553 40331 298933 -179276
18662 -71035 -224222 20787 -48775 34269 -88691 -82373 170364 -286439 123863 157232 -8196
18650 372042 228941 177996 -340659 -513586 45457 142988 110874 -17290 -78771 -260436 132016
18638 -129723 -114765 -211028 64255 -83467 -271661 139180 -372317 6520 -80962 -217420 166199
18626 -122679 -59088 -187847 -329916 -201848 133322 -347643 -52506 38778 36650 -15046 -103837
18615 -103837 -201636 47826 -257265 -124123 -43999 -248508 -117504 -47071 12726 -158607
18604 -47633 -65527 -324800 -14813 -85439 -85677 -109856 85750 -331395 17059 -174025 111470
18592 -20900 -233205 79896 32917 -113305 293728 24655 -329190 -9407 -142376 -99327 30963
18580i6805A52727C5656M2323a05941k0982k64179a40233K5634e3130I08b53753
18568A48087C3722B218I49K35349G6559a56056j818f0020A16980a25211B23542
18556g7838m5725j22584A1607b64300J32084H9007a63148p8658d6874B3005e0840
18544h001H1695K6018d34225A02923B2481c42473C7941a89228A07794R3864b64054
18532b22738B28751B4231c50608J73744D5342b27450h6630b9922j61985B43840
18521A00667c4264a0195C72236g4947I287c7712j31445O9789C0164h3316k20311
18510c03627J8910R3827p6113d5295n9235p7886B15316a4787k01714i0542K9118
18499f1424k6548A95463a35628b4394m11184C01225a23560d6449B958b89446A7243
$$ plain form
18580 -96805 152727 35656 77979 -105941 -126923 -391102 -140233 -114599 -53130 908 -253753
18568 148087 33722 2218 949 236298 76559 -156056 -157874 -60020 116980 -125211 223542
18556 -77838 -123563 -246147 11607 -264300 -132216 89007 -163148 -241806 -46874 23005 -50840
18544 -8001 81695 107713 -434225 102923 22481 -342473 37941 -189228 107794 201658 -264054
18532 -222738 228751 24231 -350608 -176864 45342 -227450 -86630 -29922 -191907 243840
18521 100667 -34264 -10195 372236 -74947 9287 -37712 -169157 -99368 30164 -83316 -303627
18510 -303627 -284717 -190890 -267003 -45295 -104530 -182416 215316 -14787 -216501 -90542 -61424
18499 -61424 -87972 195463 -135628 -24394 -435578 301225 -123560 -46449 2958 -289446 17243
18487a8577j37079m63007A97360b4502q3208B6090b63079m7343B4102J26968b22273
18475b27632J03870j4127A24492J62440D5453O6126b4918o9490B55954h7658l1825
18464a19483b0010j48652n6165m9454a03119e387j68667G9215a36243f7732D0676
18452c51794a25967f1482l9947L5096A62247e1769j35702a1820A6144c70547P9067
18441b91480A01639b67350b1046I2640K0029B0686h1706A51698o5251d05444a893
18429C4944a05557F4628h6235n173l01397C05688i1000a0310B7677J6157b50236
18417A38135b97448k8123G902a15940K7422I3346A6960O6530e196l10859F6309
18405G6292R9606b00712A9549K6083f6231l21631f24H8828a10109B48570E7358
$$ plain form
18487 -18577 -155656 -618663 197360 -24502 -107710 26090 -263079 -310422 24102 151070 -222273
18475 -227632 -123762 -137889 124492 286932 45453 111579 -24918 -94408 255954 -87658 -119483
18464 -119483 -20010 -168662 -224827 -274281 -103119 -5387 -174054 79215 -136243 -67732 40676
18452 -351794 -125967 -61482 -101429 -66333 162247 -51769 -187471 -11820 16144 -370547 -291480
18441 -291480 101639 -267350 -21046 92640 112669 20686 -81706 151698 86447 -405444 -1893
18429 34944 -105557 64628 -86235 -91408 -392805 305688 -91000 -10310 27677 43834 -250236
18417 138135 -297448 -325571 7902 -115940 -88518 93346 16960 83490 -5196 -316055 66309
18405 76292 175898 -200712 19549 45632 -66231 -387862 -624 88828 -110109 248570 57358
18393B7082G774J04306Q2016a28175p3194A8248M3604K7876f8156B97813H9296
18381d9938j87596M5996N7138A05986m4469a10820M1240H0725b9314n42111G7502
18369a95831D1798N1107l52b3367A45943J9488K8263F259a6252E2566b70808k12000
18357d82808b28673j4414c4066C12064b44495R3609L5872n8918M7135A87034a57845
18345a15514k0632k6451j5684d2283A01740J43582A00985a20320a7094j52073
18335a69167C1730a37287b9712H3927b40413j40363J77525l1074D92258a01969
18324a07194Q388j9121B7064g443k02840L4911P1475d2273I322a58898a7533k89471
18312c07004h0924I7603k5664b9541O561j10691j28782I8935a18512I8074J91242
$$ plain form
18393 27082 7774 112080 194096 -128175 -201369 18248 61852 89728 -68156 297813 89296
18381 -49938 -237534 -191538 -134400 105986 61517 -110820 -69580 80725 -29314 -571425 77502
18369 -195831 41798 92905 92553 -23367 145943 165431 193694 6259 -16252 52566 -270808 -482808
18357 -482808 -228673 -243087 -34066 312064 -244495 -150886 -115014 -173932 -126797 187034 -157845
18345 -115514 -136146 -162597 -178281 -42283 101740 245322 100985 -120320 -17094 -169167
18335 -169167 31730 -137287 -29712 83927 -240413 -380776 -203251 -234325 492258 -101969
18324 -107194 -98806 -117927 27064 -7443 -210283 -175372 -103897 -42273 9322 -158898 -17533 -307004
18312 -307004 -80924 97603 71939 -29541 -22980 -133671 -262453 98935 -118512 98074 289316
18301B89316e281A94276a09055A17277a11063A05700j1314A7196b28541j23696
18291c52237M5499i4958N40B1754J08181b74920A6767J01760o209K6786J40824
18280B79928A01599K7003b0423k3037e841A2349b71763a31689O0834A82700r911
18269A72789b95140a35833K5486B4896g7469A69354a1850I1157J41837h7278j01674
18258a88952j2393P2783K4883b2261j36148A54310b85546D11336a2931C26504
18247c23483a18043c8122A17053a58637e738k60126B6713Q2795c3720j83940f5188
18235a218q9946j52273C10941d3460B23522o6572k4966a31260M3115j69330B62150
18223A71417a98549j46733E8926h5084K3844b7057D7146R9211c1884m5611m0629
$$ plain form
18301 289316 -5281 194276 -109055 117277 -111063 105700 94386 17196 -228541 -352237
18291 -352237 -306738 -94958 -94418 21754 129935 -274920 16767 118527 112318 139104 279928
18280 279928 101599 128602 -20423 -43460 -5841 12349 -271763 -131689 -70855 182700 172789
18269 172789 -295140 -135833 -110347 24896 -77469 169354 -11850 91157 232994 -87278 -188952
18258 -188952 -201345 -128562 -103679 -22261 -158409 154310 -285546 411336 -12931 326504
18247 -323483 -118043 -38122 117053 -158637 -5738 -265864 26713 109508 -33720 -217660 -65188
18235 -1218 -91164 -243437 310941 -43460 223522 156950 131984 -131260 -88145 -257475 262150
18223 171417 -198549 -345282 58926 -85084 -61240 -27057 47146 146357 -31884 -77495 -118124
18212a18124r1009B66321p9042p4573c8198R039j1172n4313A22095a2638j78437
18201a91075B38173I8083d20098J23225B99471d1848j00665m1360B30490a3244
18190a2437k14074b7286m279A65434D6341b41396G4497D027L22042A0223P5281
18179H5504a14989r9222A16486f5457l54637a0978A31686b79157A57184b71820
18168H6306B2336J20218l4948J5722b34615A96789g7946m3175a863B42476c7039
18156i9187B03448L289b7882j75469g3019g921A00816a41171O6698G7689e8670
18144B0627L8469c8232j96658g462C61239a45178j65386a22420A32897c73j30592
18133a30965B43949D2644O5426a39736k21106e997q2237E2488a76288G7900a61310
$$ plain form
18212 -118124 -209133 266321 187279 112706 -38198 -29159 -40331 -94644 122095 -12638 -191075
18201 -191075 238173 98083 -420098 -296873 299471 -41848 -142513 -183873 230490 -13244
18190 -12437 -226511 -27286 -31565 165434 46341 -241396 74497 4027 326069 10223 85504
18179 85504 -114989 -214211 116486 -65457 -420094 -10978 131686 -279157 157184 -271820
18168 86306 22336 142554 107606 123328 -234615 196789 -77946 -121121 -1863 242476 -37039
18156 -99187 203448 206737 -27882 -203351 -73019 -7921 100816 -141171 -74473 77689 -58670
18144 20627 59096 -38232 -234890 -7462 361239 -145178 -310564 -122420 132897 -373 -130965
18133 -130965 243949 42644 108070 -139736 -360842 -5997 -88234 52488 -176288 77900 -161310
18121c9754A7638c97809a64167A03780P2213a87533A98152D4996K4781L04001
18111C73778e5130E3843J52895A3784c2334j60190h6389C55038I916R7936a32607
18099a01547B30024d7207H9447c59525A82108c18114a27028k76904B24624C2423
18088a03034I9741O6826F671a55515m1414p4119B12330c6961A23373p316b62349
18076C6268J20403a33229b8085l21278J34565c4435I5799e0784b4086l6546A76232
18064I7981N3885a61110H65b64449i6446j26497A25759g0501A69598c7586d98
18052b16981O3210B23090N8003a02008l054g705D9480O5313a53463J5024p7020
18041b15459j73650L0644h4958A46925O1264a02637j5413A51143C7540b35057
$$ plain form
18121 -39754 17638 -397809 -164167 103780 175993 -187533 198152 44996 69777 373778
18111 373778 -55130 53843 206738 13784 -32334 -192524 -86389 355038 9916 107852 -132607
18099 -101547 230024 -47207 89447 -359525 182108 -318114 -127028 -403932 224624 32423
18088 -103034 99741 166567 6671 -155515 -196929 -271048 212330 -36961 123373 116057 -262349
18076 36268 156671 -133229 -28085 -349363 -214798 -34435 95799 -50784 -24086 -60632 176232
18064 97981 151866 -161110 865 -264449 -96446 -222943 125759 -70501 169598 -37586 -498
18052 -216981 -153771 223090 281093 -102008 -105062 -7705 49480 114793 -153463 -138439 -215459
18041 -215459 -389109 -358465 -84958 146925 208189 -102637 -118050 151143 37540 -235057
18030a15849K5348j72463P2939b6458k30439P4888A00145A1937g4872C96544a16219
18018F6158a80969H7045P5550b08327d1144A55601o208d2086j39368j24092o2461
18007c68007D834a38317A04819C4342b15442B01608r4145a10518C3831a49845
17996F528L5045J05791p2146b69523B45048D8617J74119D7100b27573e5124B3753
17984B16462a34890A2902c16400O9025L2273Q9316A36689o6643K22622R350H1720
17972c38662C94920a35280A39955c3202m2246A25257a74932J380j2794H9657a14445
17960b19647N0227C85978F5870b52079K9656B62842E8418a18083j44623e6712
17949A99527a74996D9965J73785b70815l6981J53890A08506O1564N5735e8667
$$ plain form
18030 -115849 -90501 -262964 -190025 -26458 -256897 -182009 100145 11937 -74872 396544 -116219
18018 66158 -180969 87045 162595 -208327 -41144 155601 149393 -42086 -181454 -305546 -368007
18007 -368007 4834 -138317 104819 34342 -215442 201608 107463 -110518 33831 -149845
17996 6528 41573 147364 75218 -269523 245048 48617 222736 47100 -227573 -55124 23753
17984 216462 -134890 12902 -316400 -247375 -215102 -125786 136689 70046 292668 302018 81720
17972 -338662 394920 -135280 139955 -33202 -75448 125257 -174932 -173552 -186346 89657 -114445
17960 -219647 -169420 385978 65870 -252079 -222423 262842 58418 -118083 -262706 -56712
17949 199527 -174996 49965 223750 -270815 -307796 -153906 108506 170070 225805 -58667
17938A64854o8366J30747a01709j26533g9848C1363a53p1868C9134a86274I0418
17926A60139O1692G365K20630a01588j4127c8365A1518b44936e0661C19230a18650
17914A60702g0957l2305A73673G1140L16322A03125d91A6086K29083a5779f899
17902g3358K0041A39980g5748j873C88673o4725A02223A3165b46297A78136Q2739
17891B60875h0095G3086i5234k36209a0162B55776j20934a02476K4020r6107B6096
17879A85254d49227a85474A08468C3617c2647e895k10580i3477k13255G3198k1819
17868E1379c46529C17621e0926A68083e890k51745A76233H0518l9875I401a47754
17856c04420A05681M120k083R1638b07408g7619C8901K63995G2941a64571e8428
$$ plain form
17938 164854 96488 227235 -101709 -228242 -79848 31363 -153 -72021 39134 -186274 90418
17926 160139 221831 7365 227995 -101588 -115715 -38365 11518 -244936 -50661 319230 -118650
17914 160702 -70957 -103262 173673 71140 387462 103125 -491 16086 245169 -15779 -6899
17902 -73358 -53317 139980 -75748 -77621 388673 323948 102223 13165 -246297 178136 260875
17891 260875 -80095 73086 -95234 -331443 -10162 255776 134842 -102476 -78456 -174563 26096
17879 185254 -449227 -185474 108468 33617 -32647 -5895 -216475 -93477 -306732 73198 51379
17868 51379 -346529 317621 -50926 168083 -5890 -257635 176233 80518 40643 9401 -147754
17856 -304420 105681 109801 107718 199356 -207408 -77619 38901 302896 72941 -164571 -58428
17844B32182H7306b79199B34435a81695Q9367C0690J06059a44855F590a46773
17833i9834p0134b9214q3775j0858C22235L5387a52118A38934K01412B0591h3615
17821f3688B4567h0749L4558j78443h50p1316l8954n6224K0369j37880B76794
17809A05900M2896o8225h8806B8783a73563I3773J47683j473I1204d1558j02914
17798a44472A30131i249k93995e1813G1968j3493c5156A71187g1449J3446B99526
17786H6288a62012A85188a03051A11920b21272B61057a03285l4801B83143g219
17775e1113A41204a28955j50783F8488A4489J33050K4969J36981j02275a13910
17764c34743a17942B16531F9773a68624q8268j7280A56279b6266p1462C4106N458
$$ plain form
17844 232182 87306 -279199 234435 -181695 -92328 30690 136749 -144855 6590 -146773
17833 -99834 -169968 -29214 -112989 -123847 322235 357622 -152118 138934 340346 20591 -83615
17821 -63688 24567 -80749 -46191 -224634 -850 -72166 -111120 -167344 -146975 -284855 276794
17809 105900 148796 80571 -88806 28783 -173563 93773 241456 239983 91204 -41558 -144472
17798 -144472 130131 -9249 -303244 -51813 71968 58475 -35156 171187 -71449 -58003 299526
17786 86288 -162012 185188 -103051 111920 -221272 261057 -103285 -138086 283143 -7219
17775 -51113 141204 -128955 -279738 68488 14489 147539 172508 309489 207214 -113910
17764 -334743 -117942 216531 69773 -168624 -256892 -274172 156279 -26266 -97728 34106 39564
17753C9564b5935B56574a62775b8303j92875A99493f5335B5692a50724A72059
17742b8867j2244o1668m1322J4627j22644H8840i7843p9242f3822B29396a24213
17730c12963i4879j02618o436i3502I6317O3337J71316a13299A13430J35168H4467
17718A5752J46617e8102q8343e8711j60215d7865B15362k8167a24799B52666h7985
17706b6584n1059B14790F7124b2717A71722a30584e3359A4407a17606A6943d5480
17694i8502D02840A77562f7824A07169a64072H9086J48247C011K00541k8383b19734
17682d3422G9738P8263n1808k6257a15239k7280B16447b45627i8364A40289k0157
17671A20132C4707J78851c22350B00679J2913d0596H0717b37190K363A38263m5501
$$ plain form
17753 39564 -25935 256574 -162775 -28303 -221178 199493 -65335 25692 -150724 172059
17742 -28867 -41111 -102779 -144101 -129474 -252118 88840 -97843 -177085 -63822 229396 -124213
17730 -312963 -94879 -197497 -203933 -93502 96317 159654 330970 -113299 113430 248598 84467
17718 15752 162369 -58102 -146445 -58711 -218926 -47865 215362 187195 -124799 252666 -87985
17706 -26584 -77643 214790 67124 -22717 171722 -130584 -53359 14407 -117606 16943 -45480
17694 -98502 402840 177562 -67824 107169 -164072 89086 237333 3011 203552 175169 -219734
17682 -43422 79738 158001 106193 79936 -115239 -142519 216447 -245627 -98364 140289 120132
17671 120132 34707 213558 -322350 200679 213592 -40596 80717 -237190 -234827 138263 92762
17660I2762a71206H8675b19572O4998d7173B31988b28182M350A65144b05779O2874
17649a42905j08894C13722a94405K5849A2532a05742A25930a33955A36245P6837
17639B13082m9911j3976i2368j5020n4717j41193B14935b25454D03489e5446f842
17627B7150a5661A36543f7842j0816n6606j62949A95570d1849J1499j18494B20295
17615E1103J55932a8937m9617A92066k3964o492m8621b02597c1559P298j68723
17604a92984A93015G0068J04619E4120K64367F4563a48402d4386J8048B52444
17593C7834L5322o907a30528D1472b25489M9974B87678D4246a36393A06934a73548
17581C08555j51329J67400M4430j18428c47692J04255A40825O3641P3602B3727
$$ plain form
17660 92762 -171206 88675 -219572 -154574 -47173 231988 -228182 -223832 165144 -205779 -142905
17649 -142905 -251799 313722 -194405 -168556 12532 -105742 125930 -133955 136245 213082
17639 213082 163171 149195 -92368 -107388 -162105 -303298 214935 -225454 403489 -55446 -6842
17627 27150 -15661 136543 -67842 -78658 -135264 -298213 195570 -41849 -30350 -148844 220295
17615 51103 207035 -18937 -68554 192066 168102 161610 112989 -202597 -31559 -24261 -192984
17604 -192984 193015 70068 174687 54120 318487 64563 -148402 -44386 -26338 252444
17593 37834 73156 66249 -130528 41472 -225489 -175515 287678 44246 -136393 106934 -173548
17581 308555 157226 324626 369056 250628 -347692 -243437 140825 204466 278068 23727
17570a45444e4921l682A86270k6379J73719I2515a80214D86415A25343q478J68420
17559B85285l0169a04355B03878g6934F3791a27301l0071C8420J09016a34242
17548e4658l7453C77797A50897R6111f3340B57040a7762j91192B13190k9347J56113
17537C39956A3808J64875a86380g9749q0602f8362J442B47404b70559F444J8501
17526B4945a40187d8185F3507c84980F2796K31509m4493A8085O0410O3799e5975
17514B90850c1683j63453B82171f8246B72740A35604R1225B490i2964L6584b2945
17502b19127A88900J3692P7948q5057b42847B10568J5416a98121A00118c32022
17491A98197K65897C8695q047c4048B51731a65691A61153d4786A3089M7017a97648
$$ plain form
17570 -145444 -54921 -58603 186270 159891 333610 92515 -180214 486415 125343 116865 285285
17559 285285 255116 -104355 203878 -76934 63791 -127301 -157372 38420 147436 -134242
17548 -54658 -92111 377797 150897 247008 -63340 257040 -17762 -208954 213190 183843 339956
17537 339956 13808 178683 -186380 -79749 -160351 -68362 -66920 247404 -270559 6444 24945
17526 24945 -140187 -48185 63507 -384980 62796 294305 249812 18085 78495 142294 -55975
17514 290850 -31683 -195136 282171 -68246 272740 135604 226829 2490 -92964 -56380 -22945
17502 -219127 188900 202592 280540 195483 -242847 210568 225984 -198121 100118 -332022
17491 198197 464094 38695 30648 -34048 251731 -165691 161153 -44786 13089 60106 -197648
17479G1346f2722E3131A3139J9212L41381a2422D56099A81941D8851a1051D19351
17467C6827c02022J40068A73321K3932J48312j25082d5188C03529m7620o3873
17457A92036K18871A06669C8381J13702L39239k04407j2850b8157B32581P5838
17447C08419J00266l0786A38387D1608R3638h534B952L12940e148C17799K9904
17436C47703O512k8516p757g9238j51804I5160Q9703K8075b53982H4382L03726
17425C88108R214M904q8542j32895K43197A81513L6262j24p5055K4153J51644
17414C18393O57A41393E319a93677A58874C993L9083M25742b89210E23g8538I5198
17401A7122D010g2140r0339j9411G0284M6021K18094j63023n7582a28611B78352
$$ plain form
17479 71346 -62722 53131 13139 32351 373732 -12422 456099 181941 48851 -11051 419351
17467 36827 -302022 -161954 173321 197253 345565 220483 -45188 303529 255909 192036
17457 192036 410907 106669 38381 152083 491322 286915 274065 -28157 232581 308419
17447 308419 408685 377899 138387 41608 135246 -8534 2952 315892 -5148 317799 347703
17436 347703 354215 325699 317942 -79238 -231042 95160 184863 212938 -253982 84382 388108
17425 388108 397322 402226 313684 180789 423986 181513 217775 217651 142596 166749 318393
17414 318393 319050 141393 5319 -193677 158874 3993 43076 468818 -289210 523 -78538 95198
17401 17122 4010 -72140 -162479 -181890 70284 116305 334399 171376 113794 -128611 278352
17389A97957a39556F3519J41972j3310r5166b23416B26414c9333C51714A17195
17378C3856a0404E47646j12049d5737q694A12933K45607j74193b73957J29153
17368a44804K1164E51055G311a18964B8961A2860a5107A70671a54909D56886h931
17356a74473A0909J15748L08049A94895L7009B2863b5180C88536A70575m9720
17346A20855p34J8230d4938J3438F920L96707k00334K17291f86A38318J54665
17335B92983i8957E5143L77745A15317J905J64696L8217j25211K944B1312c33781
17323E576K05240a15982B06741d734E1942a6724C81716A82430f3081l4649G1414
17311A42927J52974l7389A9160Q0330f4848l0337D78399a19225A52030j9662J27126
$$ plain form
17389 197957 -139556 63519 205491 192181 97015 -223416 226414 -39333 351714 117195
17378 33856 -10404 547646 435597 -45737 -54431 112933 358540 184347 -273957 -144804
17368 -144804 -123640 551055 7311 -118964 28961 12860 -15107 170671 -154909 456886 -8931
17356 -174473 10909 126657 434706 194895 231904 22863 -25180 388536 170575 120855
17346 120855 120121 138351 -44938 -31500 6920 403627 203293 420584 -686 138318 292983
17335 292983 -98957 55143 432888 115317 117222 281918 320135 194924 197868 21312 -333781
17323 5576 210816 -115982 206741 -4734 51942 -16724 381716 182430 -63081 -97730 71414
17311 142927 295901 258512 19160 99490 -64848 -95185 478399 -119225 152030 132368 259494
17300B59494G2052J29270K56938D258R9487K14013E6598b22053C99580G2283K79431
17289C51714H1311P6965K5186K57217j42158n7997e9059B72120J75216F7161I293
17277B49405H8847f3437G4562a76329G8042q774a24490H6612M14203I5072i3316
17265i8338C29115A57076J7060r270K594K9192N2670j16433J5028Q4110b27439
17253F7663a6116E9065J83246A11352J34940l7784m6568l8490R215J7945G2997
17241A3129J13607a87856B52284A04083N29908B64238A31346J4304h4070B62346
17230B97988O7814A31466J20303h9202F6154J65852K79695k21152K40294G2413
17219C1633J8805K08057K7917A11151J49429j5996i190F496R4318J39967J79633
$$ plain form
17300 259494 72052 201322 458260 4258 103745 317758 56598 -222053 399580 72283 351714
17289 351714 81311 158276 183462 440679 298521 240524 -59059 272120 447336 67161 9293
17277 249405 88847 -63437 74562 -176329 78042 69268 -124490 86612 500815 95072 -93316
17265 -98338 329115 157076 174136 164866 167460 196652 249322 132889 147917 232027 -227439
17253 67663 -16116 59065 242311 111352 246292 208508 161940 123450 132665 150610 72997
17241 13129 126736 -187856 252284 104083 633991 264238 131346 145650 -84070 262346
17230 297988 365802 131466 251769 -89202 66154 232006 511701 290549 530843 72413
17219 31633 50438 258495 286412 111151 260580 244584 -9190 6496 100814 240781 420414
17208D20414j07616p3446J42694A03207D6175K99950j57737J84090h6487A26807
17197B17652j0715L9765c5765I8504K17615K43377A85136K8926M2258K1654F9744
17185I0504a75736B4890K48537N8547O1216j45179o8379E0392L4237K21456o1616
17174B44469J08225j33025E1397M06589A43536J04256F5836K85834R7938j34587
17164C15021J71836j31167b63048M6931E33461j53551J80767k46686N0676J83623
17154E48290c05619E6565j1284K92147r2963A6996K69553j05874a28648b7681
17143A74919J09654j06352K18950j93773J98088j28341q4957R4112k5534J05929
17133C62695o5235J64340J39575j35689K5134A00598P8288K33871j69738J582
$$ plain form
17208 420414 312798 239352 382046 103207 46175 346125 188388 372478 -86487 126807
17197 217652 206937 246702 -35765 98504 316119 559496 185136 214062 256320 277974 69744
17185 90504 -175736 24890 273427 331974 393190 248011 179632 50392 84629 306085 244469
17174 244469 352694 219669 51397 457986 143536 247792 65836 351670 449608 315021
17164 315021 486857 355690 -263048 -216117 533461 379910 560677 313991 364667 548290
17154 548290 -305619 56565 45281 337428 244465 16996 286549 180675 -128648 -27681
17143 174919 284573 178221 397171 203398 401486 273145 188188 282300 256766 362695
17133 362695 297460 461800 601375 465686 490820 100598 178886 412757 243019 244601
17123B44601a43277I4416J29290p6379K17581l4882O7069j59014J08592J52524
17113D99197k22506K37322j15862P5208j96922l5117c466G13667j84334J4805
17103E44138j13166P3512k01938K7974j48410P8127p4085P6760p1735J89130L03570
17092F83877B94788J3850j47724N1673K87151L43802l55595j16008F3553J55808
17082B19361K50000J23255B81977K65282h629B38257R2583L4698J27545p8606
17072D14477N0514q465A77047L07149K7279B45350J73334K8271j52264J31162
17062D25853l2444K37574k11891j0433J56980G6855J61639L6006J71338L08819
17052G54657l22014L7458j0397K13851r9638J54297C63073M29850k60869j23346
$$ plain form
17123 244601 -143277 94416 223706 147327 364908 330026 397095 238081 346673 499197
17113 499197 276691 514013 398151 473359 276437 241320 -3466 713667 529333 544138
17103 544138 430972 504484 302546 330520 182110 260237 186152 262912 191177 380307 683877
17092 683877 294788 308638 160914 212587 499738 843540 487945 371937 63553 219361
17082 219361 469361 592616 281977 547259 -8629 238257 330840 365538 493083 414477
17072 414477 464991 456526 177047 484196 511475 245350 418684 446955 294691 425853
17062 425853 393409 630983 419092 408659 565639 76855 238494 274500 445838 754657
17052 754657 432643 470101 459704 673555 573917 728214 363073 792923 532054 408708
17042D08708N3270B13764J93393F2626M57590J888A16681O24332l33982A23852
17031H19864k56056r2973J81324k75831K12641k6017j71270J40776L4800o5100
17021E02158K01117l28310K7138J25873K38249m3706j62199N5459l2194B87125
17010G16210k27418Q6645j66654L9134K19119j03642k9921k28641J05374M75388
17000H85594l74002j61829N83272q5673D21683J29327J79892J04761j65465k08615
16990D61583L40613p3003m6732o410k72994K42857Q3847o5311J3574J42177k77514
16979E42687J88127L4687j18694O4891o6381K64241J0088j1244j23993L44016
16969A128425D63993K01745K37439j17007N4345J65047k18902J51858J38983n0328
$$ plain form
17042 408708 461978 213764 407157 62626 520216 522104 116681 741013 407031 123852
17031 819864 563808 470835 652159 376328 588969 562952 391682 532458 567258 502158
17021 502158 703275 374965 402103 527976 766225 722519 560320 615779 583585 287125
17010 716210 488792 575437 408783 447917 667036 563394 533473 304832 410206 885594
17000 885594 511592 349763 933035 847362 421683 551010 730902 835663 670198 461583
16990 461583 802196 729193 682461 676051 403057 645914 729761 664450 678024 820201 542687
16979 542687 730814 765501 646807 711698 645317 909558 919646 908402 784409 1128425
16969 1128425 463993 665738 903177 786170 840515 1005562 786660 938518 1077501 1027173
16959A027173m22919J49478M96846k51406n4879j41628j81559o36L29939j95245
16949G55164K13938o7947p6499K73997k93588K1320K40043L5916k24150J54967
16939A033161k01024J93117R314N5766M6428R9420j93828L831q8335K82413j3790
16928A226473j46517l1599k00265K65792o0250J68285J68831J74939m51282n3829
16918A060578K87851q8212M3124J7362j97746N19675o20991N03769k99465K06686
16908A432631J29623k92197J2445j11275K63301j81630K46937j04342K75624j1849
16898A659268k37455J10662Q4395j47922m6511J22258q8569L76737k44417l24242
16888A264204M46044J04193J39049k87645J80331j43911l190k38323M54290k92182
$$ plain form
16959 1027173 604254 753732 1250578 999172 944293 802665 621106 620470 950409 755164
16949 755164 969102 901155 824656 1098653 805065 826385 1066428 1102344 878194 1033161
16939 1033161 832137 1025254 1034568 1090334 1136762 1236182 1042354 1046185 957850 1240263 1226473
16928 1226473 1079956 1048357 848092 1113884 1053634 1221919 1390750 1565689 1114407 1060578
16918 1060578 1348429 1260217 1303341 1320703 1122957 1642632 1021641 1525410 1225945 1432631
16908 1432631 1562254 1270057 1282502 1171227 1434528 1252898 1499835 1395493 1671117 1659268
16898 1659268 1421813 1532475 1616870 1468948 1422437 1544695 1456126 1832863 1588446 1264204
16888 1264204 1710248 1814441 1953490 1665845 1846176 1702265 1699075 1460752 1915042 1622860
16878A622860N95086r8334J67531j83976l00625k3647K62622J11798m7129L21066
16868B427252k33848J76802k18162j48464K83587K50571Q3278R0783j75853l07865
16858B228081J55730K13596K8863j01014j27272Q4387J89890L42153m15650M69155
16848C067919k63235K24164J02124J04452q815m675m4713J98397j30732J95154
16838C440040o5243m9323M3563K13179J70061O6300L64802m13673P0658k49710
16828C590654M17583R9039l92736L26929L93502j63074n9325M69005k9676k00520
16818D451381J48140L27073l30699N74825j21118K38926K9898M74614j52490l30795
16808E309755M17410K17194J35191k25906r133N37331J11300J10572J74665j8951
$$ plain form
16878 1622860 2217946 2119612 2287143 2103167 1802542 1778895 2041517 2153315 2106186 2427252
16868 2427252 2193404 2370206 2152044 2003580 2287167 2537738 2621016 2711799 2535946 2228081
16858 2228081 2383811 2597407 2626270 2525256 2397984 2482371 2672261 3014414 2598764 3067919
16848 3067919 2804684 3028848 3130972 3235424 3226609 3221934 3177221 3375618 3244886 3440040
16838 3440040 3374797 3325474 3369037 3582216 3752277 3818577 4183379 3769706 3840364 3590654
16828 3590654 4008237 4107276 3714540 4041469 4434971 4271897 4212572 4681577 4651901 4451381
16818 4451381 4599521 4926594 4595895 5170720 5049602 5288528 5318426 5793040 5640550 5309755
16808 5309755 5727165 5944359 6079550 5853644 5844511 6381842 6493142 6603714 6778379 6759428
16798F759428J94969M93029k61218N85066j16595K74226L67558K62083J19430
16789H677976K03110K30904M37948M4312n4800M63173M92561J92961K43720M66454
16779A1398319N48016J69687J4124N15814J64475N61374P29833M60670K71238
16770A4833550L44834O13409M64781Q21224K77683R52407M13489Q26973O53835
16761B0202185O14600R94525J079373O45799J274656Q42790J165964Q27690J529415
16752B9176997J291199J289329J747128J465696J740705J556474J864383K415184
16744D2547095J998327K105365K655081K707265K808622L249193L462204L798637
16736F5331789L523534L774933M596477N149908N022845N123629N777815O037927
$$ plain form
16798 6759428 6954397 7447426 7186208 7771274 7654679 7928905 8296463 8558546 8677976
16789 8677976 8881086 9111990 9549938 9594250 9539450 10002623 10495184 10688145 10931865 11398319
16779 11398319 11946335 12116022 12130146 12645960 12810435 13371809 14101642 14562312 14833550
16770 14833550 15178384 15791793 16256574 17077798 17355481 18307888 18721377 19548350 20202185
16761 20202185 20816785 21811310 22890683 23536482 24811138 25653928 26819892 27647582 29176997
16752 29176997 30468196 31757525 33504653 34970349 36711054 38267528 40131911 42547095
16744 42547095 44545422 46650787 49305868 52013133 54821755 58070948 61533152 65331789
16736 65331789 68855323 72630256 77226733 82376641 87399486 92523115 98300930 104338857
16728A04338857O429893O699450O776230P212433P399607P001359P326864O937131
16720A60121824O788354N723633M834585M775529L017440J432955J029456n79322
16712A87144454j742430l379438m062480n693046n590902o422686p391930p149590
16704A45711952p562453p682199p358462p318868o452831o624695n990973n893911
16696I0827560n971172n248778m333106m562007m367880l673825l232996l796229
16688E5641567k913745k705922k817204k592452k109540k149830k021713j959858
16680C6371303j927832j540178j581827j495376j081114j335627j465189r06262
16672B5037898q16393j434100n83141r01181j070944l05369j285211l97826j000589
$$ plain form
16728 104338857 110768750 117468200 124244430 131456863 138856470 145857829 153184693 160121824
16720 160121824 166910178 172633811 177468396 182243925 185261365 186694320 187723776 187144454
16712 187144454 185402024 182022586 177960106 172267060 166676158 160253472 152861542 145711952
16704 145711952 138149499 130467300 123108838 115789970 109337139 102712444 96721471 90827560
16696 90827560 84856388 79607610 75274504 70712497 66344617 62670792 59437796 55641567
16688 55641567 52727822 50021900 47204696 44612244 42502704 40352874 38331161 36371303
16680 36371303 34443471 32903293 31321466 29826090 28744976 27409349 25944160 25037898
16672 25037898 24221505 22787405 22204264 21303083 20232139 19926770 18641559 18243733 17243144
16663A7243144n15814p49507m50271n48596j87532o32421n92870l71046n63776
16654A2631311n28092p0490m26432l57284m22110l85049k79836k49373L9792n74747
16644I377690k12384n65373m13380M70181m54916l70039l4915q1282k29471l89488
16634G096623r9688m33523L15720n49185J38198n24323R8667Q3760k65568m15028
16624E445653L0305j95986J04512m71645K29329j26028m01360l6142k03145J44456
16614D519949k7251j03905M5338j93430o647p2084k32939j02183M42623p14781
16604C554690K87888l23546p5034K38219j29849k86286J86478l07921p5391K90630
16594C359878l74720R6200l36222J60182l24113L88560k52233J26492j43217k32937
$$ plain form
16663 17243144 16727330 15977823 15527552 14978956 14791424 14159003 13566133 13195087 12631311
16654 12631311 12103219 12032729 11606297 11249013 10826903 10441854 10162018 9912645 9952437 9377690
16644 9377690 9165306 8599933 8186553 8656734 8201818 7831779 7796864 7715582 7486111 7096623
16634 7096623 6996935 6563412 6879132 6329947 6468145 5943822 6042489 6126249 5860681 5445653
16624 5445653 5475958 5279972 5384484 4912839 5142168 5016140 4614780 4578638 4375493 4519949
16614 4519949 4492698 4388793 4434131 4240701 4234054 4161970 3929031 3826848 4269471 3554690
16604 3554690 3842578 3519032 3443998 3682217 3552368 3266082 3452560 3144639 3069248 3359878
16594 3359878 2985158 3081358 2745136 2905318 2581205 2969765 2717532 2844024 2700807 2467870
16584B467870K1294m7924R1835J11151l09035P0201k95095N75210l00602J81914
16574B566819m2045k57516k08527K18204n13790N24790l40503j54112L09838j91383
16564A911775q0776o9110k3436r309J95443k61474J5955j66937J75800l2177k97839
16553A357915J28782K85887m39517K37871m12870L73530K47585n36373O8868L12913
16543A624591l61194K91881l77230k0491J64261M4225l0452J51232J02296l03409
16533A285710J98181L4318m51416K90439k61330j6809L74025n04900J11617J55405
16523A215240j30205o3252O7764j27410K55869j50185J02206r4313r8316J10537
16513A087935K2179P6715k96251K48561j56935m32758K99066N2247J24056n3012
$$ plain form
16584 2467870 2489164 2441240 2533075 2644226 2335191 2405392 2110297 2685507 2384905 2566819
16574 2566819 2524774 2267258 2058731 2276935 1763145 2287935 1947432 1793320 2103158 1911775
16564 1911775 1830999 1761889 1738453 1729144 1924587 1663113 1679068 1512131 1687931 1655754 1357915
16553 1357915 1486697 1772584 1333067 1570938 1158068 1531598 1779183 1242810 1311678 1624591
16543 1624591 1263397 1555278 1178048 1157557 1321818 1366043 1335591 1486823 1589119 1285710
16533 1285710 1483891 1518209 1066793 1357232 1095902 1079093 1453118 948218 1059835 1215240
16523 1215240 1085035 1021783 1089547 962137 1218006 1067821 1170027 1075714 977398 1087935
16513 1087935 1110114 1186829 890578 1139139 982204 549446 848512 900759 1024815 971803
16503I71803K56926l47237l03359l4211L50663r8171O7857k64885N4427p60K52471
16492I05524l15445M44322k15103Q8793k11512k8602N3968j95910K56055J61845
16482I43935j15984j40553l1962q3515j87790L66386J36205k10196B97741M81676
16472G79417J89069j43471C93353M39933k76994p3456j04765p6792J42613K6848
16462D70740K01140N3935K9591j14530K57066k41866j42416K9451j58651K14145
16452E98605N4032p2837k58876P1249r6256O9522K91077k02146j4938r6632L92495
16441G35295o8603J5640C11017L74787q2136j15031j37782R4076K14936J06448
16431G66315k11828n6568L8599j78097J79931J36996l05967J85968p4733j02385
$$ plain form
16503 971803 1228729 881492 578133 543922 894585 796414 864271 599386 653813 653053 905524
16492 905524 590079 1034401 819298 908091 696579 667977 721945 526035 782090 943935
16482 943935 827951 687398 655436 571921 384131 750517 886722 676526 297741 779417
16472 779417 968486 825015 393353 833286 556292 482836 378071 301279 443892 470740
16462 470740 671880 725815 755406 640876 897942 656076 513660 543111 384460 598605
16452 598605 652637 579800 320924 392173 295917 365439 656516 454370 439432 342800 735295
16441 735295 666692 682332 311017 685804 603668 488637 350855 444931 659867 766315
16431 766315 554487 497919 536518 358421 538352 675348 369381 555349 480616 378231
16421C78231P1839A15637J53289E5994L89751n0053K76749j09720k05902J87583
16411E44402a56892C27086j31971q7096K66643n5813J15875l5772K98249B38752
16400D53523j73990K79783B62257p7327K13065Q402M0140J51142F7697L13016
16390C80713A54319L71805B12682n8332k6022K14480A29619A7895M91330k42228
16380B66997j00915b2608C02085P1770E7168N5701K07417O1555A08218J28465
16370B36683m143Q7679F0818L72121E2772k0315J70308n2860p1860L2903K31076
16359C42024A31818d8128D54969j02177G4539b20784D29623A6407a0095A5290
16348A43046F0744M4421L11641A15290K74476D5174a9083B4299N3770Q7387K47862
$$ plain form
16421 378231 450070 115637 268926 55994 445745 395692 672441 562721 356819 544402
16411 544402 -156892 327086 195115 108019 374662 318849 434724 398952 697201 238752
16400 453523 279533 559316 262257 184930 397995 406397 446537 597679 67697 380713
16390 380713 154319 526124 212682 154350 128328 342808 129619 17895 509225 266997
16380 266997 166082 -22608 302085 373855 57168 112869 320286 381841 108218 236683
16370 236683 232540 320219 60818 432939 52772 32457 202765 149905 78045 110948 342024
16359 342024 131818 -48128 454969 352792 74539 -220784 429623 16407 -10095 15290
16348 143046 60744 105165 416806 115290 389766 45174 -19083 24299 78069 165456 413318
16337D13318p9332D3846K53293B1121M69226k842A24560m0711q078K09948j18619
16326A67100L4629a95892A98304D0461N9150c9455C38307A55815k0944E7434J2688
16315G0122e8458I8996c6918B30447G3496K80695o6062A42237R6509D059a06270
16303I5786P859a79898A10310a08397Q73D1397M3730B748Q4990J74126j0559j14467
16291A36838C0405p818K84261f6279B70942N4799F6609K90392a15385L7746D86065
16279f6884C8665K36423n5565a11383A61702L45213j69453A15666b1759k730G3147
16267D1731L57296j60197O3979I6299h433A64792k3436L1348i7507A82064G4816
16255D717J03889J52634p0047J10246j37517Q2225J52911F0330J61970G2919d02677
$$ plain form
16337 413318 333986 43846 297139 21121 490347 487505 124560 83849 75771 285719 167100
16326 167100 201729 -195892 198304 40461 99611 -39455 338307 155815 134871 57434 70122
16315 70122 -58458 98996 -36918 230447 73496 354191 288129 142237 238746 4059 -106270
16303 95786 103645 -179898 110310 -108397 -107524 41397 85127 2748 87738 261864 251305 136838
16291 136838 30405 22587 306848 -66279 270942 325741 66609 357001 -115385 -77639 486065
16279 -66884 38665 275088 219523 -111383 161702 506915 337462 115666 -21759 -24489 73147
16267 41731 399027 238830 302809 96299 -8433 164792 141356 172704 -97507 182064 74816
16255 4717 108606 261240 191193 301439 163922 246147 399058 60330 222300 72919 -402677
16243a07074D9213J14785B8995R1045K86762K5062A84578b7252G6651g5990n0915
16232a26905B30330K9143C9189l228e2019I0026B3705f0511I7962M2331b26321
16220A46197a73504C07326C56g2324C71124j13050N1837G1724J43184J71941H6955
16208c37752N5126J05642P9635d5351l9304K8634A25622a53490A36599B8934P2369
16197A01303a0565C86150R8115a06933j43263F5267k3086J02417I972L55699e6433
16185A58297g8601B70718R4767A82482K49649d949A11796I076J26872C0169a27974
16173B7224J57112a3544A21742r926K47874F2560a00109k08637a45491j6703A49388
16161a95225C15351a01972F9078i4578A0967J88658d41957A45504F5152K18865
$$ plain form
16243 -107074 49213 163998 28995 120040 406802 431864 184578 -27252 76651 -75990 -126905
16232 -126905 230330 259473 39189 35961 -52019 90026 23705 -60511 97962 140293 -226321
16220 146197 -173504 307326 356 -72324 371124 258074 309911 71724 214908 386849 86955
16208 -337752 -282626 -176984 -97349 -45351 -84655 -56021 125622 -153490 136599 28934 101303
16197 101303 -10565 386150 484265 -106933 -250196 65267 42181 144598 9972 365671 -56433
16185 158297 -78601 270718 365485 182482 432131 -4949 111796 9076 135948 30169 -127974
16173 27224 184336 -13544 121742 111816 359690 62560 -100109 -308746 -145491 -162194 149388
16161 -195225 315351 -101972 69078 -94578 10967 199625 -441957 145504 65152 284017
16151B84017C3617b5210C7787K94583A22566A2126g9429p8845k7456D0483O6580
16140A07063K91287G6527P340O8616J13309a27951A53836B80a71518a6574j89174
16129b05748Q7872e3241j30570H4492K18614b36467C8824b13589B10375f9457
16118a72874P8944G5111L2033b26502k0276d4584j28591A68013b25449A63614
16107d3597e347j62811O4121n6775f2602E9373b0948A40088K05120E5632j056
16096E4576c7972k98664B48362D0635R5022B5453e6618I1975c0566p8154B83693
16084E8556a94290H6234Q286i8619A42393h8302k64391a0276j60346Q4283B38238
16072d98A61586a51889f5559D25996b40334M4562A73051b5151B660K84192c16793
$$ plain form
16151 284017 33617 -25210 37787 332370 122566 12126 -79429 -158274 -185730 40483 107063
16140 107063 398350 76527 83867 152483 265792 -127951 153836 280 -171518 -16574 -205748
16129 -205748 -117876 -53241 -183811 84492 303106 -236467 38824 -213589 210375 -69457
16118 -172874 -93930 75111 107144 -226502 -246778 -44584 -173175 168013 -225449 163614
16107 -43597 -5347 -168158 -104037 -160812 -62602 59373 -20948 140088 345208 55632 54576
16096 54576 -37972 -336636 248362 40635 135657 25453 -56618 91975 -30566 -108720 283693
16084 58556 -194290 86234 94520 -98619 142393 -88302 -352693 -10276 -170622 -86339 238238
16072 -498 161586 -151889 -65559 425996 -240334 -195772 173051 -25151 2660 286852 -316793
16060c58527J78335g9281A41142a27592L1215A20884E1597a16489j91408I6287
16049a54613O8024I5601D1716b90690a7092I796i2168B28246f4925A17527a25261
16037a97921Q6843A54648a21545A40410C2684J53528A5729O1102P5798J2425b01421
16025H1503h9777A82140c4573m41988i8416b2616B47304D5541a00356E8569k8014
16014C0555q11J46423b231l618n5216E9921b4005j05685B23328f007H3865g8749
16001A92430I2600J57031b23279B45410a46549K3411n1678A36912a15068B6396
15990b03091A0767b72338C55284a14076n0615I6007P8229b5234E54654h6118B59332
15978a95412D29041i2498l11496a74403k6561A90672p4404n6024c27344F1487
$$ plain form
16060 -358527 -180192 -79281 141142 -127592 -96377 120884 51597 -116489 -307897 96287
16049 -154613 -86589 95601 41716 -290690 -17092 9796 -92168 228246 -64925 117527 -125261
16037 -197921 -111078 154648 -121545 140410 32684 186212 15729 76831 152629 165054 -201421
16025 81503 -89777 182140 -34573 -476561 -98416 -22616 247304 45541 -100356 58569 30555
16014 30555 29744 176167 -2231 -5849 -61065 59921 -24005 -129690 223328 -6007 83865 -78749
16001 192430 92600 249631 -223279 245410 -146549 -123138 -174816 136912 -115068 26396
15990 -203091 10767 -272338 355284 -114076 -164691 96007 174236 -25234 554654 -86118 259332
15978 -195412 429041 -92498 -403994 -174403 -200964 190672 116268 60244 -327344 61487
15967a75468b452l0983B5712b0316k1050l9318c0777l91111a83263n139k07602
15956c96004d6372D9848J08266c41080Q9181C05551a02212o7075G588b88179F7405
15944a29115K2887E9260N9605E0980N9389b27324B23764F1033j0548a62053A81660
15932I1962b4919l6984j0367b2009k07855C10596b8652l5747j54708j29896A7532
15920A92038l5609n1768d39510A66584b1805k34668B96327j01517C0352b7004
15909b1125F0936g4013A14304d78759A95738b55690b8252p9668A52603a22748
15898A04469K92187I0570k5088N6178B7983K12928e62822b01859L2170N9485d2300
15886e4918F0925h6521C662b18854n3570O2895B56433b05358R0386p0015Q0537
$$ plain form
15967 -175468 -2452 -33435 25712 -20316 -41366 -80684 -30777 -421888 -183263 -188402 -396004
15956 -396004 -46372 49848 158114 -341080 -251899 305551 -102212 -169287 7588 -288179 67405
15944 -129115 -106228 59260 118865 50980 110369 -227324 223764 61033 50485 -162053 181660
15932 91962 -24919 -61903 -72270 -22009 -229864 310596 -28652 -64399 -219107 -349003 17532
15920 192038 156429 104661 -439510 166584 -21805 -256473 296327 194810 30352 -27004
15909 -21125 60936 -74013 114304 -478759 195738 -255690 -28252 -107920 152603 -122748
15898 104469 396656 90570 65482 121660 27983 240911 -562822 -201859 -169689 -110204 -42300
15886 -54918 60925 -86521 3662 -218854 -272424 -209529 256433 -205358 -114972 -184987 -104450
15875a04450q248n562G2869e09653g4797k64180h2355m88071a76070B17856I830
15863B55551g5557A26125m2221a37692C2718b10781B94560j26693a72147M4504
15853a27643N7095G2413a64722g7370B8808i1227G3730a06742B32084E9322p211
15842E2111c505l04517A9072c16853E7851a67514a9191k76542m2726a16582B18642
15830D6963b2889q2679G1115a42778c8801H5601B3418c39105A3366K16257d5970
15818E7170Q8552b49280a21351C97536d6970j40326C52555d11208J27687c5038
15807f5602B42654a25580b6301e300l26473f8189j13124J9868H5314Q5235G9823
15795A70786J7504b90461e3337m8633L7191A28777J27442d2157j84073A96288
$$ plain form
15875 -104450 -112698 -118260 72869 -509653 -74797 -338977 -82355 -570426 -176070 217856 9830
15863 255551 -75557 126125 83904 -137692 32718 -210781 294560 167867 -172147 -127643
15853 -127643 -70548 72413 -164722 -77370 28808 -91227 73730 -106742 232084 59322 52111
15842 52111 -3505 -308022 19072 -316853 57851 -167514 -19191 -295733 -338459 -116582 218642
15830 46963 -22889 -105568 71115 -142778 -38801 85601 23418 -339105 13366 229623 -45970
15818 57170 145722 -249280 -121351 397536 -46970 -187296 352555 -411208 -283521 -35038
15807 -65602 242654 -125580 -26301 -5300 -331773 -68189 -181313 -161445 85314 170549 79823
15795 170786 188290 -290461 -53337 -101970 -64779 128777 256219 -42157 -226230 196288
15784F4386K05862G9353b34687K7330O6709j5849k4427l12144B47239i2821j63504
15773b56325P1898A5041J3001m948a58863A01642b75682A72922a10325A7579a6394
15761a26869d8055C32185c71988D9850a52o2338C75111D2957G154J39652a44349
15749b94605A21077J52117O2899b27656B03643C8858c46263a9635B78125c0573
15738F7971h7375F6447J49238r3730a25087B2383e062j65009k7015G5246c2183
15726h6334c5557G6961L6770J19469A10029J18761d28850a14785R229M4539A30385
15714b62991F0119K8561J20324q6827B6422A2616f8339j13026r7734B50070F9747
15702H3773r168a77821c6340G1767B94c60096h1362j39174D42902a92786a6315
$$ plain form
15784 64386 270248 79353 -234687 -207357 -140648 -156497 -180924 -493068 247239 -92821 -256325
15773 -256325 -184427 15041 28042 23094 -158863 101642 -275682 172922 -110325 17579 -16394
15761 -126869 -48055 332185 -371988 49850 -152 -62490 375111 42957 7154 146806 -144349
15749 -294605 121077 273194 336093 -227656 203643 38858 -346263 -19635 278125 -30573
15738 67971 -87375 66447 215685 121955 -125087 22383 -5062 -170071 -197086 75246 -32183
15726 -86334 -35557 76961 113731 233200 110029 228790 -428850 -114785 -105556 -61017 130385
15714 -262991 60119 88680 209004 122177 26422 12616 -68339 -181365 -279099 250070 69747
15702 83773 74605 -177821 -36340 71767 294 -360096 -81362 -220536 442902 -192786 -16315
15690e329A16519C0212a27108B80714A20113a20302A19564b56206l20296a15521
15679c89A05051k986g166n12483H7671K02465a13164b3654n4340q2242L5120A43886
15666g9060J7885L683C4004P6545b55641A53740e19746B72023c64842C40306a81922
15654D4045e5157O569k55368e6075j51177A87015J16899j29699H4236b9599B38293
15642D44539f5335B37543C3204c14815A07776f6513G9175l6515g8534E2406J65577
15631B17983m3434c0265C50186b32114a0325C1116J4754a08109f872F3934J48614
15620B12548n0721A9511a17377M5729k33014A5816J63715a7308k02471f4416p1436
15609a35852O2954j73342A49157a39405A0628c97613A07080a43841J5218J6032
$$ plain form
15690 -5329 116519 30212 -127108 280714 120113 -120302 119564 -256206 -576502 -115521
15679 -389 105051 102065 -7166 -519649 87671 290136 -113164 -23654 -77994 -160236 -125116 143886
15666 -79060 -61175 -57492 34004 110549 -255641 153740 -519746 272023 -364842 340306 -181922
15654 44045 -55157 -48588 -303956 -56075 -207252 187015 303914 174215 84236 -29599 238293
15642 444539 -65335 237543 33204 -314815 107776 -66513 79175 42660 -78534 52406 217983
15631 217983 174549 -30265 350186 -232114 -10325 31116 45870 -108109 -6872 63934 212548
15620 212548 161827 19511 -117377 -71648 -304662 15816 179531 -17308 -219779 -64416 -135852
15609 -135852 -72898 -246240 149157 -139405 10628 -397613 107080 -143841 -128623 -112591
15599a12591d757j727L06F6274k1935c04538A19974f2525j13600N9061J1409I1
15586c76602J02335d0389A43202a00957A20942A0398K56174D6554a01935A13375
15575G3796a40794C79944D1858J12626f4172J095C62244C335J25932i1201j803
15564i3004A36010d46083b10864M0210F4278a40888b3719r8461A4759a99081I0986
15552c32538E4256a57736M6580M4487k11566C5781c32905a28790b9045r1205A23545
15540A56381a61908C5530b86883a03685A98265c04738I6571J47469j14015a07345
15529A67008a7129I3755a78773P63C42270G9727c82740l7473D3468c54535A55782
15517a25536b6887k44426a03186B31911A10995b3097A33240A3502O497R1597R4289
$$ plain form
15599 -112591 -4757 -6484 -6178 66274 44339 -304538 119974 -62525 -176125 -117064 -105655 91
15586 -376602 -274267 -40389 143202 -100957 120942 10398 266572 46554 -101935 113375
15575 73796 -140794 379944 41858 154484 -64172 -63077 362244 3335 129267 -91201 -93004
15564 -93004 136010 -446083 -210864 -170654 64278 -140888 -23719 -122180 14759 -199081 90986
15552 -332538 54256 -157736 -111156 -66669 -278235 35781 -332905 -128790 -29045 -120250 123545
15540 156381 -161908 35530 -286883 -103685 198265 -304738 96571 244040 130025 -107345
15529 167008 -17129 93755 -178773 -178010 342270 79727 -382740 -420213 43468 -354535 155782
15517 -125536 -26887 -271313 -103186 231911 110995 -23097 133240 13502 19999 111596 205885
15506B05885o3522P8948j5147n9888e0941I5373d7105A16697e8736j26346a3907
15494g5240b5182O22A84462D6071a06513E3631H718i132D2218b87403C33683a07590
15481f9406A02835l5725J10272m4095E8170h2562b9580C1588b0040j27212A96111
15469a29643K4722A58823E0908b36604k66193d3983j05383d7844A33971a11892
15458B0585a23524j07489e193k78442A3527c00637a39071B55346j25775C6061
15447A37140i0709j40143A14247E1019J77172a17532k05268C2983O0039i7049
15436a38919J7636B87214c01262A86455a59664A5349d9126A98819R148k8227a29261
15424f3526k06936B61860A03868c25670D16985A42329a85827g4597j74245c8453
$$ plain form
15506 205885 142363 221311 206164 146276 -50941 95373 -47105 116697 -58736 -185082 -13907
15494 -75240 -25182 -24560 184462 46071 -106513 53631 8718 -9132 42218 -287403 333683 -107590
15481 -69406 102835 67110 177382 133287 58170 -82562 -29580 31588 -20040 -147252 196111
15469 -129643 -104921 158823 50908 -236604 -502797 -43983 -149366 -47844 133971 -111892
15458 20585 -123524 -231013 -5193 -283635 13527 -300637 -139071 255346 129571 36061
15447 137140 -90709 -230852 114247 51019 228191 -117532 -322800 32983 93022 -97049
15436 -138919 -121283 287214 -301262 186455 -159664 15349 -49126 198819 207967 179740 -129261
15424 -63526 -270462 261860 103868 -325670 416985 142329 -185827 -74597 -248842 -38453
15413a39271f8507I7935d6689m0048j67849A0868K274b61487A20749d8416C04037
15401A04246J6022J57002a20770A6498b92537H5732e4465B49222a25830b6628
15390D7766a53724E1026A8533K8353c299p7401o570G5623R5404B8412J81951D9835
15377A25867a11525B7782c1781e147p8845D3079i7448b6559q5112B82910H6971
15365E1412J07816a9503k24406F9813i170C8089c62643C11906b6408A115g6443
15353B09088n0683J00403G7480J28685b53666a0583k34007A89675m1674b28596
15342b88559I3843b04470A07898b56279G4643b27888L85b9324A12988R3277I006
15330e7770C4827c06488Q7136A38050a06810H2950Q0088j5843b09051A71595G9083
$$ plain form
15413 -139271 -68507 97935 -46689 -86737 -254586 10868 13142 -261487 120749 -48416 304037
15401 104246 120268 277270 -120770 16498 -292537 85732 -54465 249222 -125830 -26628
15390 47766 -153724 51026 18533 46886 -3299 -80700 -87270 75623 171027 28412 210363 49835
15377 125867 -111525 27782 -31781 -5147 -83992 43079 -97448 -26559 -111671 282910 86971
15365 51412 159228 -19503 -243909 69813 -9170 38089 -362643 311906 -26408 1115 -76443
15353 209088 158405 258808 77480 206165 -253666 -10583 -244590 189675 148001 -228596
15342 -288559 93843 -204470 107898 -256279 74643 -227888 -227503 -29324 112988 206265 9006
15330 -57770 34827 -306488 -219352 138050 -106810 82950 163038 147195 -209051 171595 79083
15318b95656A25836J10026n9989K61063E3504j9994a12145C7026A4520K70202
15308B84722a33482E6945a67690d7385I153a68960A98335D181K77815A5154K4191
15297C9345J53310a1176p0968j21540A58674a11948b5355j6082C2771c8664A58569
15285a53266A50077a0038G8108Q5616J12349n5575A115J46114Q5156a6483C00602
15273C8617R6274A0098b38170B49134b53153B31747p4035E42i7818B40355N0687
15262B91042I9047b00348I8483e7111A50177B3806a79731A4977K00566J8131b35221
15250B473N80496L39683M91107k77165J69467j73778E00755M1881E8149Q4320
15240A42469J73389i7770A54863E2676a65335O1084A55905g1152B09932b34206
$$ plain form
15318 -295656 125836 235862 175873 436936 53504 33510 -112145 37026 14520 284722
15308 284722 -133482 56945 -167690 -47385 9153 -168960 198335 4181 281996 15154 39345
15297 39345 192655 -11176 -82144 -203684 158674 -111948 -25355 -41437 32771 -38664 158569
15285 -153266 150077 -10038 78108 163724 276073 220498 1115 147229 232385 -16483 300602
15273 38617 134891 10098 -238170 249134 -253153 231747 157712 542 -97818 240355 291042
15262 291042 99047 -200348 98483 -57111 150177 23806 -179731 14977 215543 233674 -235221
15250 2473 582969 922652 1413759 1136594 1306061 1132283 500755 542636 58149 142469
15240 142469 315858 -97770 154863 52676 -165335 -104251 155905 -71152 209932 -234206
15229A72772d8224A90524n0202b6470c250A26271C3403a6824j49880K7044B20589
15217H8762A1942J83842E7584A1176a93227A94745e9893C76895d8549D31523a00267
15205a82860B07258C8601b4988B62598G3839L08605A7051J73670B1543b96450
15194A94835J89826a14354A30712N5376a22492A44082m2259a55444A38228R2945
15184B31173G0861Q9175n9667d383B77806a12055A31599d02133G7045a03281B97722
15172g2678K55j17630F9321e2993C4155K83926H8320j4216h9608A07055J08046
15161B15101q1652J59961a5758I7041a88180A18614Q768k1175J357g6479C94320
15149b79773B41915I7927a20454j343F4811A4846K39045c1707j96504G75M78161
$$ plain form
15229 172772 -48224 190524 140322 -26470 -3250 126271 33403 -16824 -166704 -139660 220589
15217 88762 11942 195784 57584 11176 -193227 194745 -59893 376895 -48549 431523 -100267
15205 -182860 207258 38601 -24988 262598 73839 382444 17051 190721 21543 -296450
15194 194835 384661 -114354 130712 186088 -122492 144082 101823 -155444 138228 231173
15184 231173 70861 160036 100369 -4383 277806 -112055 131599 -402133 77045 -103281 297722
15172 -72678 -72423 -190053 69321 -52993 34155 318081 88320 74104 -89608 107055 215101
15161 215101 133449 293410 -15758 97041 -188180 118614 127382 106207 107564 -76479 394320
15149 -279773 241915 97927 -120454 -121797 64811 14846 253891 -31707 -228211 775 478936
15138D78936a68069F6802c2667C85432e7838C12653h6699b020A18590b90469A25594
15126A42943L4623A9595M3612a9373B78672b62023B78992l286h3869B69406l2026
15115B37380k4752b9261B07667D5476A0435K886b04907D77366h3350q5807B15489
15103B8573L21002I5125f8956a328C93580A91697n0825d0713o7351b7101h27B16121
15090F3340J42554J3926p9147a17525I6614K9940M1063J71851m7480P849R9928
15079C99765h7612I2450b49538O9935B76692b77273A47210L15838E5640h6737
15068f6509j60439F3628J95647h290l0386B39098a49348C99895A56887J0004Q8981
15057B55872i9029A35952a11082C74594o940j71639c179B62303A03143J80630
$$ plain form
15138 478936 -168069 66802 -32667 385432 -57838 312653 -86699 -2020 118590 -290469 125594
15126 142943 177566 19595 63207 -19373 278672 -262023 278992 275706 -83869 269406 237380
15115 237380 212628 -29261 207667 45476 10435 13321 -204907 477366 -83350 -169157 215489
15103 28573 349575 95125 -68956 -1328 393580 191697 140872 -40713 -108064 -27101 -827 216121
15090 63340 205894 219820 140673 -117525 96614 126554 167617 339468 291988 299837 399765
15079 399765 -87612 92450 -249538 -179603 276692 -277273 147210 463048 55640 -86737
15068 -66509 -226948 63628 259275 -8290 -38676 239098 -149348 399895 156887 166891 255872
15057 255872 -99029 135952 -111082 374594 367654 196015 -3179 262303 103143 283773
15047B83773J27906j30631A19720J52274c69528J31562D8630f9022A48975g7621
15036a75799D48791r1952j61251R7531A00659L42290k13810K7849G9944L4179
15026A14123l4923L7468K35241b4216D0116L96200J03170k5779G0019K03129M61476
15015G34624B29762J4669r4599Q4677K2252K1085q2093q4690A3546m85J99325
15004B12386E6318J79581m5263h7712B87508m5259k3314J00095A6153N3614Q5543
14993A55310F7933n919M0310J74659G8156J44407J72224j73845B5986J99342K2072
14982B47400b646C9516R1701R1832J76100k3465F9726J82223F1161L86690A69774
14970B45336J18747f8061B26714j76q1384h2427C36783G778L74031j76604r8304
$$ plain form
15047 283773 411679 281048 119720 271994 -369528 -237966 48630 -69022 148975 -77621
15036 -175799 448791 356839 195588 293119 100659 442949 229139 256988 79944 114123
15026 114123 79200 116668 351909 -24216 40116 436316 539486 513707 70019 273148 734624
15015 734624 229762 244431 149832 234509 256761 277846 195753 111063 13546 13061 212386
15004 212386 56318 235899 190636 -87712 287508 242249 218935 319030 16153 69767 155310
14993 155310 67933 62014 102324 276983 78156 222563 394787 220942 25986 225328 247400
14982 247400 -2646 39516 131217 223049 399149 375684 69726 251949 61161 447851 169774
14970 245336 364083 -68061 226714 226538 145154 -82427 336783 7778 381809 205205 106901
14959A06901J21267J50202j36936g3656A20383J62800b04263B21002I5877C8783
14948C48353j07010K16879B12366J85632K6656m2962M2476c6335C88948j44665
14938B44283J403q9804N5529J37825M6644j01652A05128K70068B1994K16349J07787
14927C46130a07431C85345j42671j4424M4413F0727J90649H7362K5744L9243J11835
14916B64184a28696A83766J30247Q9044K4857o3504Q3352j56481J12923F9748
14905C90301A71441J74465k7087J24374J70157k03164j31719E4213K9876R2024
14895A76113J22286K6528P7750j53618O5974C8441L21853A21182O1C1725K02753
14884B34478K44710b0789F07674k29692J31823A62443J60218J44225p5959p0777
$$ plain form
14959 106901 228168 378370 241434 -73656 120383 283183 -204263 221002 95877 38783
14948 348353 241343 458222 212366 397998 424654 381692 424168 -36335 388948 244283
14938 244283 245686 155882 211411 349236 395880 294228 105128 375196 21994 238343 346130
14927 346130 -107431 385345 242674 228250 272663 60727 251376 87362 113106 152349 264184
14916 264184 -128696 183766 314013 403057 427914 364410 447762 291281 404204 69748
14905 390301 171441 345906 318819 443193 613350 410186 278467 54213 84089 176113
14895 176113 298399 324927 402677 249059 315033 38441 360294 121182 121243 31725 234478
14884 234478 479188 -20789 607674 377982 509805 162443 322661 466886 390927 320150
14874C20150J50492A44149L69662j65411o6410M04247B17786J84937E7143N50169
14864F07312j89530j20885J64217K0699J31825j49455H8746L59474K9637j45138
14854C32719Q266J1746j10554P8952Q6871j61125N8633R3384A24333O4984K51490
14843D40807D6707K62461K563J3632n5855k252K53774B02263K37780l5500R3447
14832D97990k31109J30422J99261q0663j13480j97388J7726J79327A71688K76060
14822D47748p6100K29716k39230j2485A65996N07911B81471K39206j29623R9757
14812D90811L1714j39777K44301B25383M82280j39368m7313J68519j00871B59396
14801E17200A49228L16183Q1616j08141K39704B91043K54350p5888R4908k9275
$$ plain form
14874 320150 470642 144149 513811 348400 281990 686237 217786 402723 57143 607312
14864 607312 417782 296897 461114 481813 613638 464183 88746 448220 477857 332719
14854 332719 340985 352731 242177 321129 408000 246875 305508 398892 124333 189317 440807
14843 440807 46707 309168 311731 325363 269508 267256 521030 202263 440043 404543 497990
14832 497990 266881 397303 596564 515901 402421 205033 222759 402086 171688 447748
14822 447748 371648 601364 362134 349649 165996 673907 281471 520677 391054 490811
14812 490811 522525 382748 627049 225383 707663 568295 520982 689501 588630 259396
14801 517200 149228 465411 547027 438886 678590 291043 545393 469505 564413 535138
14791E35138p4852K77532k87937O050P6460K30761l53787J67895p1939j01651
14781D03670J22050N5808k14038K81252k85678M17720j69309o0189R3475j89392
14771D55369O2836j88802K42035q8177j89076M43148l22450L91577l47559j43080
14761C15821J99963J41040j01959R6267l11794N07351I3139M35204J48106j3824
14751F62625O1792j39455L15563l79328K23267B93418M89002j26034k51061L07698
14741G13023p6225k2427Q7080k8671l14689O40848k44804m9157j83376M49217
14731I70819n721j96334p8387J16646k87729r979o6795J20066P6349K11335q7101
14720G63169K44127k05725j5730L02026m48418L17521j44303J32904j80957J14838
$$ plain form
14791 535138 460286 737818 449881 455931 532391 763152 409365 577260 505321 403670
14781 403670 525720 581528 367490 648742 363064 780784 611475 551286 644761 455369
14771 455369 518205 329403 571438 483261 294185 737333 414883 806460 458901 315821
14761 315821 515784 656824 554865 651132 339338 846689 93139 528343 676449 662625
14751 662625 724417 584962 900525 521197 744464 293418 782420 656386 405325 713023
14741 713023 636798 614371 701451 672780 358091 998939 754135 704978 521602 970819
14731 970819 965098 768764 690377 807023 519294 509315 442520 562586 638935 850270 763169
14720 763169 1007296 801571 785841 1087867 639449 956970 812667 945571 764614 879452
14710H79452m35006J74616Q0498J24508M3415K2879J03874m02714R056J55328
14700G55906L3430J96662N2799D21377J92756K11532K736J63026l31711K08199
14690H67915M0240K39514m6772l83881M15388m85396K48386k72155M13772C99397
14679G62938j53328o5910O09232m91575N03426p0152K1379j33351k0332k39272
14669G23055L86686m57554M66499j39997K01959k13487m2767J87022o410l75437
14659G29569N26133j14151l13636L0858J47201l3698J66682L04856n79079K77090
14649A141825j00589R9530k2917n8854k78975N69067l44261j01565M34404O9563
14639A407228l82245l0255L55795J14377o52093P32148l43048J82384k38013J40406
$$ plain form
14710 879452 444446 619062 699560 824068 867483 890362 994236 591522 600578 755906
14700 755906 789336 985998 1038797 421377 614133 825665 828401 991427 659716 867915
14690 867915 908155 1147669 1100897 717016 1132404 647008 895394 623239 1037011 399397
14679 762938 609610 543700 1152932 661357 1164783 1094631 1116010 982659 962327 723055
14669 723055 1109741 652187 1118686 978689 1180648 967161 924394 1111416 1105006 729569
14659 729569 1255702 1141551 827915 858773 1005974 972276 1138958 1443814 864735 1141825
14649 1141825 1041236 1140766 1117849 1058995 780020 1349087 1004826 903261 1337665 1407228
14639 1407228 1024983 994728 1350523 1464900 812807 1544955 1201907 1384291 1146278 1286684
14629A286684J0614k79272L50661N7051J8383M4537l41806k5702M47982q1975
14619A487157k64611m7326P6405L6384J95139k0813l76071O14109k91122l50552
14609A058699L38028L84123l27022K68097m14299K79009n0644K33371p3828J2012
14599A707546K66246m93738k64019J40110K00912N8441J99732m65440K63247l4041
14589A578996J60156J26473J86642l34553j14248L67116k54457q2795J99653J26866
14579A959849j170n4002k51699L64242j11710M07776l85129L2996K14816K094
14569B178063k17843K39684J37557k09417J62316J11991k0682J83092J82981k00684
14559B547058R5504J20364K62101K21020K4165k01729P68459K33176O21972J271812
$$ plain form
14629 1286684 1297298 1018026 1368687 1425738 1444121 1488658 1146852 1121150 1569132 1487157
14619 1487157 1222546 1175220 1251625 1288009 1483148 1462335 1086264 1700373 1409251 1058699
14609 1058699 1396727 1780850 1453828 1721925 1307626 1586635 1535991 1769362 1695534 1707546
14599 1707546 1973792 1480054 1216035 1356145 1557057 1615498 1815230 1349790 1613037 1578996
14589 1578996 1739152 1865625 2052267 1717714 1603466 1970582 1716125 1633330 1832983 1959849
14579 1959849 1958679 1904677 1652978 2017220 1905510 2313286 1928157 1961153 2175969 2178063
14569 2178063 1960220 2199904 2337461 2128044 2290360 2402351 2381669 2564761 2747742 2547058
14559 2547058 2642562 2762926 3025027 3246047 3270212 3068483 3836942 4070118 4692090 5963902
14549E963902K315801M486379R095324J4780191M186195B0059589G785163l165026
14541D620137j856764n32363l46393J03174J86820l78503k04838L65109l40119
14532A616260O31737M9022n35111J72436K99510p4891m3337M48524k81324k33470
14522B049356J44649K26764q9757j30797J14479M12443k64432j75634N2606M75676
14512B815353l94325Q1224L03533K42336q47033M73381K62577n4205k68930j11697
14502B502214M83799R1490j0198j54811J21878K9540J33114l17031M80550N4439
14492C414984J05091m47115j6812L18283k2593q652m0909k4839K04270Q8904K23256
14481C793868j30409P752J6331N6392K7322J23325M75286m40523R5944j31671
$$ plain form
14549 5963902 8279703 12766082 21861406 36641597 40827792 20059589 7785163 4620137
14541 4620137 2763373 2231010 1884617 1987791 2174611 1796108 1591270 1956379 1616260
14532 1616260 2247997 2297019 1761908 1934344 2233854 2158963 2115626 2564150 2282826 2049356
14522 2049356 2194005 2420769 2331012 2200215 2314694 2727137 2462705 2287071 2339677 2815353
14512 2815353 2421028 2502252 2805785 3048121 2201088 2674469 2937046 2882841 2613911 2502214
14502 2502214 2986013 3077503 3067305 2912494 3034372 3063912 3197026 2879995 3360545 3414984
14492 3414984 3520075 3072960 3056148 3374431 3351838 3343186 3302277 3277438 3481708 3570612 3793868
14481 3793868 3663459 3671211 3687542 3743934 3771256 3894581 4369867 3929344 4025288 3893617
14471C893617J12803N6417L64155k06055K69001m70602L84388J38904m11231m7452
14461D083945N89281J65867q08602N20327K98216l00769N6391L73387k72479K53566
14451D959130R5925j11727J24310j7115L62199L7409K9680J35266l17551M66632
14441E764158P4258p4418L6813p2453M8093J41879L13023L0470P0674L2953K9175
14430F394625M54958J72115m62118J0990K89465o8057K40936N6607Q2983K6022
14420G198526J65697M19497J60923l76909J47114K51693k88101O68040p0028K37463
14410H513915j60511O15453k3024J67614j48309L05947K51905R2596m1874L11627
14400I885339M33195L98274l94722K68540K70403L65240O1449O339J99750K19638
$$ plain form
14471 3893617 4006420 4062837 4426992 4220937 4489938 4019336 4403724 4542628 4131397 4083945
14461 4083945 4673226 4839093 4030491 4550818 4849034 4548265 4604656 4978043 4705564 4959130
14451 4959130 5055055 4943328 5067638 5050523 5412722 5450131 5479811 5615077 5297526 5764158
14441 5764158 5838416 5763998 5800811 5728358 5776451 5918330 6231353 6261823 6332497 6365450 6394625
14430 6394625 6849583 7021698 6559580 6570570 6860035 6791978 7032914 7089521 7172504 7198526
14420 7198526 7364223 7783720 7944643 7567734 7714848 7966541 7678440 8346480 8276452 8513915
14410 8513915 8353404 8968857 8945833 9113447 8965138 9271085 9522990 9615586 9573712 9885339
14400 9885339 10318534 10716808 10322086 10590626 10861029 11226269 11287718 11294057 11493807 11713445
14390A1713445J57092j6074M88359j0919N17099Q9638p9546O39634R3617L7856
14380A3630201L61054K67316L15010M45887L27968L0589L79528N45003j63969
14371A6138587P85881M00043K28835M02204J13548N47871L32061N68969K20917
14362A9738916L63818P30782J19598P11437N12535K92816O79861N72501N90446
14353B4312710L07483Q20095M32369P36028O67430O66467O91776O94217Q74578
14344C0203153Q25259O63042J007623O12224J175112Q50718J415131N15366J051223
14335C8318851J347477J047309J338068J506498P92444J613502J446430J249924
14327D8660503J807569J914559J608125K012186J473502K255193K221956K397055
$$ plain form
14390 11713445 11870537 11854463 12342822 12331903 12849002 12938640 12859094 13498728 13592345 13630201
14380 13630201 13991255 14258571 14573581 15019468 15347436 15378025 15757553 16302556 16138587
14371 16138587 16924468 17324511 17553346 17955550 18069098 18616969 18949030 19517999 19738916
14362 19738916 20102734 20833516 20953114 21664551 22177086 22469902 23149763 23722264 24312710
14353 24312710 24620193 25440288 25872657 26608685 27276115 27942582 28634358 29328575 30203153
14344 30203153 31028412 31691454 32699077 33311301 34486413 35337131 36752262 37267628 38318851
14335 38318851 39666328 40713637 42051705 43558203 44350647 45964149 47410579 48660503
14327 48660503 50468072 52382631 53990756 56002942 57476444 59731637 61953593 64350648
14319F4350648K375811K271738K723139K787294L014215K912463L806383K913941
14311H7155632L583868M376655L646315M405342M379862M385556N248058N386525
14303A22567813N450460N838980O636049O855453P070143P710740Q263906Q315928
14295A78709472Q762450R670327R621916J0973805J0971836J1755303J2134823
14288B52599932J2426289J3011037J3793522J4022649J4075756J4585538J3721131
14281C48235854J4401500J3515371J3343937J2019762J0744973Q933129P762612
14274D28957138N263357K014098j394151j237212j300525j627682k899336o004071
14266D21771616q594213j0087005j0894766j2847187j3673216j4234186j5051753
$$ plain form
14319 64350648 66726459 68998197 71721336 74508630 77522845 80435308 84241691 87155632
14311 87155632 90739500 95116155 98762470 103167812 107547674 111933230 117181288 122567813
14303 122567813 128018273 133857253 140493302 147348755 154418898 162129638 170393544 178709472
14295 178709472 187471922 197142249 206764165 217737970 228709806 240465109 252599932
14288 252599932 265026221 278037258 291830780 305853429 319929185 334514723 348235854
14281 348235854 362637354 376152725 389496662 401516424 412261397 421194526 428957138
14274 428957138 434220495 436234593 434840442 433603230 432302705 430675023 427775687 421771616
14266 421771616 413177403 403090398 392195632 379348445 365675229 351441043 336389290
14259C36389290j4755850j4680860j4505690j4042983j3164020j2644475j2384983
14252B40210429j1755437j1660955j0608057j0431074r716845q757732q545520
14245A68734809q089792p368731o966108o875315o408310o075319n312353n006113
14237A16632768n358680m803862m332431m367443m117300l194549l346413l459147
14229H3652943l132937l349151k870782k904791k736117k539045k353211k106912
14221F1659997j881825k064731j493997k264396j885238j692335j321431j226243
14213D7829801j403645j485947j453029j497601j073360r76324j102720p82232
14205C8054943j473658j322484m79212j092235o39816p39804q25317r54400o47779
$$ plain form
14259 336389290 321633440 306952580 292446890 278403907 265239887 252595412 240210429
14252 240210429 228454992 216794037 206185980 195754906 186038061 177280329 168734809
14245 168734809 160645017 153276286 146310178 139434863 133026553 126951234 121638881 116632768
14237 116632768 111274088 106470226 102137795 97770352 93653052 90458503 87112090 83652943
14229 83652943 80520006 77170855 74300073 71395282 68659165 66120120 63766909 61659997
14221 61659997 59778172 57713441 56219444 53955048 52069810 50377475 49056044 47829801
14213 47829801 46426156 44940209 43487180 41989579 40916219 39939895 38837175 38054943
14205 38054943 36581285 35258801 34779589 33687354 33047538 32307734 31482417 30528017 29880238
14196B9880238j189096p20219m28765l33648r95293m72835r02737k83855p86456
14187B3767334l72535n36680o88287n88091k34605n63927m37928l99071n82385
14178A9363825j72206o67591k71328k43874o81889r0492q2424l73790k76119l60440
14168A6143672k46214p14328j5129m65978p5462k44848l15382m67546j67064K2098
14158A3453819p36223O8875l13565N84o0558n92197K11681k25183k10200j39017
14148A1458016m69277j31513l64022j2705p4466M5467k03184m99826r5243l46853
14138I306394J41754j22230k28172n4212j0628k13098l04493O9376j02264J21449
14128H603876l11810l9987l46105J44519n940j53827j34025j40826R1820o14186
$$ plain form
14196 29880238 28691142 27970923 27542158 27208510 26213217 25740382 24837645 24553790 23767334
14187 23767334 23394799 22858119 22169832 21581741 21347136 20783209 20345281 19946210 19363825
14178 19363825 19191619 18524028 18252700 18008826 17326937 17236445 17154021 16780231 16504112 16143672
14168 16143672 15897458 15183130 15168001 14702023 14626561 14381713 14066331 13598785 13431721 13453819
14158 13453819 12717596 12786471 12472906 12473490 12412932 11820735 12032416 11807233 11597033 11458016
14148 11458016 10988739 10857226 10493204 10480499 10406033 10451500 10248316 9748490 9653247 9306394
14138 9306394 9448148 9325918 9097746 9043534 9032906 8819808 8515315 8584691 8482427 8603876
14128 8603876 8292066 8252079 7905974 8050493 8044553 7890726 7756701 7615875 7707695 7093509
14118G093509k483j69819J01746J03302j12884l62173J95748J0668l25540k13748
14108F318326K16236j93009O5012j79541k31127J7679j06073k18647J11868l0770
14098E769954N3421j50764m53220K17271k20819L05178n9348l99389J10034K13081
14088E385399n72024J17862j48285L8719K18396m53886N9613J06987J03051l33260
14078D522572j47205L15886n69330n2444K06642J32863j57678J94168l32850K48233
14068D360857j88107N3760l60514J15020k22996K1999o9090L57301K69575l25209
14058D012596R7372k53417J37634k68399k619L63457m31389j60267K6326j45557
14048C375737L5470j27469l32301L41698P3447j76504q0872K6204j25976L34973
$$ plain form
14118 7093509 7091026 6921207 7022953 7126255 7013371 6651198 6846946 6857614 6532074 6318326
14108 6318326 6534562 6341553 6406565 6227024 5995897 6013576 5907503 5688856 5800724 5769954
14098 5769954 5823375 5672611 5219391 5436662 5215843 5521021 5461673 5062284 5172318 5385399
14088 5385399 4813375 4931237 4782952 4821671 5040067 4586181 4645794 4752781 4855832 4522572
14078 4522572 4375367 4691253 4121923 4069479 4276121 4408984 4251306 4445474 4112624 4360857
14068 4360857 4172750 4226510 3865996 3981016 3758020 3780019 3710929 4068230 4337805 4012596
14058 4012596 4109968 3856551 3994185 3725786 3723167 4086624 3655235 3494968 3521294 3375737
14048 3375737 3411207 3283738 2951437 3293135 3366582 3190078 3109206 3135410 3009434 3344407
14038C344407l44662L06844j57665k48362j13412L81963l63266J18281j56099
14029B768029J78475o0784k44546Q3642l5182k7373l49725N98611o28197K41899
14019B524849j01126Q3553J8428J04488m3852k60764K88107K68269o80849L5967
14009B237070j44082K11174k58295O1280N2356J26901P6667l79647k37400L61899
13999B107923R0542n3075k0271O501r5692K95325l29928J51311L43741L96176
13989B892553J662703L047359P834160J4975563J1270877j7964847A1767291m730164
13981G037127j752025q28292q44820k05268Q3854l51666l23164q3341k18152j22270
13971B391983m2528m0913o1959M2139j03488j79327K84518q0322k0761L55320
$$ plain form
14038 3344407 2999745 3306589 3148924 2900562 2787150 3169113 2805847 2924128 2768029
14029 2768029 2946504 2885720 2641174 2724816 2689634 2662261 2312536 2911147 2282950 2524849
14019 2524849 2423723 2507276 2525704 2630192 2586340 2325576 2613683 2881952 2201103 2237070
14009 2237070 2092988 2304162 2045867 2107147 2159503 2286404 2363071 1983424 1746024 2107923
13999 2107923 2198465 2145390 2125119 2131620 2035928 2331253 2001325 2152636 2496377 2892553
13989 2892553 4555256 7602615 15436775 30412338 41683215 23718368 11767291 7037127
13981 7037127 5285102 4456810 3611990 3406722 3490576 3138910 2815746 2732405 2514253 2391983
13971 2391983 2349455 2308542 2246583 2288722 2185234 2005907 2290425 2210103 2189342 2544662
13961B544662o23874L03645j61770k1882r2955j46897k8487K70282o7673N8568
13951B033619J95675l27193o9183K83822k51961K69125m40883L36982k46272J3514
13941A797245j00646K78296l92038J40165M73o99979N82408J02510J98555l61418
13931A545571J11538p1073Q8475o1211J96488l06066L6427P3302K95327n56489
13921A352289K28779M7395Q7099n02084Q8752J25597M74162o08556J20288R5436
13911A509157k90211K89277j06804m9346K68310j16193k6413j05683K33346q8252
13901A517188j35513J53040m82193M16851n0178k33925L03278k45838N6530j9575
13891A279665m9907J59419l98872L70498P3513j75701j90522k9213k14173M43068
$$ plain form
13961 2544662 1920788 2224433 2062663 2040781 1947826 1800929 1772442 2042724 1975051 2033619
13951 2033619 2229294 1902101 1832918 2116740 1864779 2133904 1693021 2030003 1783731 1797245
13941 1797245 1696599 1974895 1582857 1723022 1723495 1023516 1605924 1708434 1906989 1545571
13931 1545571 1657109 1586036 1674511 1613300 1809788 1503722 1540149 1613451 1908778 1352289
13921 1352289 1581068 1628463 1715562 1213478 1302230 1427827 1901989 1293433 1413721 1509157
13911 1509157 1218946 1508223 1401419 1352073 1620383 1504190 1477777 1372094 1605440 1517188
13901 1517188 1381675 1534715 1052522 1469373 1419195 1185270 1488548 1242710 1299240 1279665
13891 1279665 1229758 1389177 990305 1360803 1434316 1258615 1068093 1038880 824707 1267775
13881A267775l9901R9186l04698J16858j66130k06203N14036j04496L3681k64434
13871I45674k24176j64881N37485k06357R6897j11144L1952L18864l39007K25741
13861A111048K10341n10737K76237k42850l42K67212j5463k59721l13930P08331
13851A230126m18771K938J82762j11460k9819M62231k58468K69133k59152j81422
13841H88098J11860J33109o2366j11250K22289j17709k96372J52783q5316r154
13831H25972K34812m74874J20317L3318o2262J25984Q6916p3806K77601l70750
13821G23228K33450J15533k61350n4458K33348m00833L23080j92032M7393K4114
13811G91473J16582k0694L1710K3961k05656j84925L28352K4033k25494J97542
$$ plain form
13881 1267775 1227874 1327060 1022362 1139220 973090 766887 1280923 1176427 1210108 945674
13871 945674 721498 556617 1094102 887745 984642 873498 905450 1224314 885307 1111048
13861 1111048 1321389 810652 1086889 844039 843697 1110909 1095446 835725 521795 1230126
13851 1230126 811355 814293 997055 885595 855776 1318007 1059539 1328672 1069520 888098
13841 888098 999958 1133067 1070701 959451 1181740 1064031 767659 920442 835126 825972
13831 825972 1060784 585910 706227 739545 677283 803267 890183 816377 1093978 723228
13821 723228 956678 1072211 810861 756403 989751 588918 911998 719966 767359 791473
13811 791473 908055 887361 919071 943032 737376 552451 880803 904836 679342 876884
13801H76884j51666J61214k5409o9889J00627K3244k42588J52387r6063k90382
13791D38359L88898K27231l72381q8085J87158o1209L43794m42453K01033R8066
13781I20411m14226K85494M3944k05905j0475n16n6899J42575J60246l39114K48685
13770G74220M4344p5917l43579L70623j02811J6644M81654j28803k32048C75320
13759F18784j85993Q2789M00546D19483M30279C74114K47294L6421K52211j68231
13749G41809k88221N6125j85988L8680J95152L6989M48Q1744j6846j44712J65159
13738F80339L7916j01844L33106k87790J14440k81484K5660I8398Q06948k62764
13728F42582j39626k309J45967j98307L05601l30504P5859N287l558N1692J21816
$$ plain form
13801 876884 725218 886432 861023 791134 891761 915005 672417 824804 728741 438359
13791 438359 827257 1054488 682107 594022 781180 719971 1063765 621312 822345 920411
13781 920411 506185 791679 835623 629718 619243 618727 561828 704403 864649 525535 774220
13770 774220 818564 742647 399068 769691 666880 683524 1165178 1036375 804327 375320
13759 618784 432791 515580 916126 419483 849762 374114 621408 657829 910040 741809
13749 741809 453588 509713 323725 362405 557557 594546 594994 676738 659892 515180 680339
13738 680339 718255 616411 949517 661727 776167 494683 520343 98398 905346 642582
13728 642582 502956 500647 646614 448307 753908 423404 499263 504550 500992 552684 674500
13717F74500r3540A81966N01011j40805o2620L44194J4676l62388j79332K57177
13707E53879K5800j10310J68552J17843k26732j91640j29573j2491J66829K83907
13697F46064m8917M1461k46928M65591B29455K81146j83258L46908C20313K39212
13687E59525k36686p8463L47590j34384r5333Q3581K03923l19129J2451R632J55401
13676E08108k10390K12116J29970o4083N7576j39672l4378J13685B12488K13162
13666D25650j6079J62814n6791B31603L15631j12974p5206r6958J49157Q663L406
13655D23322O5726j10071N6502n2160d4443B37546L74584o9246O0556p6783J04
13644E26761q898B54353L43013j81661R7740k0493j11259K41332k3613B42785
$$ plain form
13717 674500 580960 181966 682977 542172 479552 823746 838422 476034 296702 553879
13707 553879 579679 469369 637921 755764 529032 337392 207819 195328 362157 646064
13697 646064 597147 638608 391680 857271 229455 510601 327343 674251 320313 559525
13687 559525 322839 244376 591966 457582 362249 445830 649753 330624 343075 352707 508108
13676 508108 297718 509834 639804 575721 633297 493625 459247 572932 212488 425650
13666 425650 409571 572385 515594 231603 547234 434260 359054 262096 411253 419916 423322
13655 423322 489048 378977 435479 383319 -44443 237546 612130 542884 603440 526657 526761
13644 526761 517863 254353 597366 415705 513445 492952 381693 623025 599412 242785
13633B99766J63502D1597M11809n7070A91667L01951l6487j26108J25942k0573
13623D36392L9036j56417j19288J81281b8765F14433B98413J26234n2865J6336
13613C88118j49709K320J78457j0945O4676Q3604p5048K5373A74955J92585j22226
13602B45314j19349M60239B85600J22181J80501k42137O9125j47833L6602q2119
13592B21920O6870j27146J73465j07477q8294L28724q2867A45282L6816J55922
13582C38020l010J73706N9981N5075g2167D72974B13066L43858j16447A61734
13571A44631a5522A80040K67721j80473L11523A59787L23627n1228i513D40154
13560B33475J88750j95367J018B6688M58646E7140k3855J2949J77880j8477l7132
$$ plain form
13633 299766 463268 41597 453406 396336 191667 493618 457131 331023 456965 436392
13623 436392 475428 319011 199723 381004 -28765 614433 298413 424647 371782 388118
13613 388118 238409 240729 419186 408241 472917 556521 481473 506846 174955 367540 245314
13602 245314 125965 586204 285600 407781 588282 346145 415270 267437 304039 221920
13592 221920 288790 161644 335109 227632 139338 468062 385195 145282 182098 338020
13582 338020 335010 508716 568697 623772 -72167 472974 213066 556924 440477 161734
13571 144631 -15522 180040 447761 267288 578811 159787 483414 432186 -9513 440154
13560 233475 422225 226858 227876 26688 485334 57140 33285 46234 224114 205637 168505
13549A68505K72431j71719J35244B0139L03497K37711K0719k71249J19345B05049
13538C38254N8258k6805j0867A01704R2553J03499N0066N6826j19057K28826B10769
13526E0474J60537R1641K33736k36878E7501K08694J22556A85291P09578k84187
13516F10682D0283L10677q865K0329m4048F6374J58550n0438J33335K59634k59186
13505C08269j7490a03321C78184o1568M0368h055B8235K7188J6324L56546A98780
13493B36966J83077A97795J02368B0270J90953P9036A4783K29519J62913A94594
13482B54160O2424J02397A22026K932J13684L15376j93281L6423d5611E2449B0816
13470d46p7778D74008A53279J70776j32511K59888a12893A78129K74985D2519
$$ plain form
13549 168505 440936 269217 404461 20139 323636 561347 582066 310817 430162 205049
13538 338254 396512 369707 358840 101704 194257 297756 347822 404648 285591 514417 210769
13526 50474 211011 302652 536388 299510 57501 266195 388751 185291 894869 610682
13516 610682 40283 350960 342095 362424 318376 66374 224924 174486 307821 567455 308269
13505 308269 290779 -103321 378184 316616 356984 -8055 28235 55423 71747 428293 198780
13493 236966 420043 197795 300163 20270 211223 290259 14783 244302 407215 194594
13482 254160 316584 418981 122026 124958 238642 554018 360737 397160 -45611 52449 20816
13470 -446 -78224 474008 153279 324055 191544 451432 -112893 178129 453114 42519
13459B69040R3726k2666M1498A74478p3752J48376f8247C71326q9838m773b3178
13447B53399o4584Q6773H0501O7778L28040j47291A47037K06823j10747L05489
13437E48602k24309j56704J34369J21737j90693M5930Q9830m1378A42000A7597
13426A29745K75014a80870D05037L2440e8614B97483e554B98497o5957J40022
13416C72562o3815A11068K76878k9876J68153A99858J94253j48788B7455L33216
13406C60671A49922e6337n4427E21362A44107J40795L71812A25680m9986L9054
13396A14748j1474K75735A16781K39808j73684p4169P8492N3220K11392j10919
13386C40921j66341D2895a3887A91293K10494j89483H5302L8489L2925l6843a2355
$$ plain form
13459 269040 362766 340100 381598 174478 100726 249102 -68247 371326 281488 276715 -23178
13447 253399 188815 275588 80501 148279 476319 329028 147037 353860 243113 548602
13437 548602 324293 167589 301958 423695 233002 278932 368762 327384 142000 17597
13426 129745 404759 -180870 405037 437477 -58614 297483 -5554 298497 232540 372562
13416 372562 308747 111068 387946 358070 526223 199858 394111 245323 27455 360671
13406 360671 149922 -56337 -110764 521362 144107 284902 656714 125680 75694 114748
13396 114748 103274 379009 116781 356589 182905 108736 187228 240448 451840 340921
13386 340921 174580 42895 -13887 191293 401787 212304 85302 123791 156716 119873 -12355
13374C08779K67128k11636j28191q6664N5788m7431i9826C59970j07092q4945
13364A67933F1527K14171I5832B8657L55634j59061j07989C3795K84201D5784
13353f9470D41495K8594B07038M82530g8859E4888L56481j17080J16656O399A78864
13341F10557C6442L10861k7627E3605K0752J22263K4827A03374l9626J09517K10937
13330C84202c3437A62878J32365P1280J8056L6515J22006A31520d8919A05499
13319B58046R7854f9512A95167a7961A62166b68461B03184L225J1017j1158C7867
13307B90126r9986q4249K19800j58989f5501D87197A43876E0287A3569K3514L3629
13296G0712J90433k052K328f423A54800E5335M67478c5565B05045M671l696j4191
$$ plain form
13374 308779 575907 364271 236080 149416 205204 157773 -99826 359970 252878 167933
13364 167933 61527 275698 95832 28657 384291 225230 117241 33795 317996 45784
13353 -69470 441495 470089 207038 689568 -78859 54888 411369 294289 410945 417344 178864
13341 610557 36442 347303 319676 53605 74357 196620 221447 103374 63748 173265 384202
13330 384202 -33437 162878 295243 366523 384579 421094 543100 131520 -48919 105499
13319 258046 355900 -69512 195167 -17961 162166 -268461 203184 206409 217426 206268 37867
13307 290126 190140 105891 325691 166702 -65501 487197 143876 50287 13569 37083 70712
13296 70712 261145 259093 261421 -6423 154800 55335 522813 -35565 205045 209716 206020 191829
13284A91829L944R2914P7998A78128o1500J3830A9075J78481a5896A41435f918
13272c9280B20437K91631A618R7047J03466F328O6766g9881c9666A65000B3895
13260e8676K7847F0228P012K12840J13510E5651N946c5927B30406H9244O9297
13249A58541j7192L34375A49880B9565J51806n9769D7400J9928g3007b2651A79988
13237A26465A3057D386J79015p0492f913D16268E0498J37105b34184b1502n4952
13226g6454r815D04832A26406J77831J98286A95253c90169B2074N44727G0453
13215g6949A97895p2927Q8109b5975A8718K69879a14063b8434A01629K7087C2107
13203E5224Q4516i8093A57587K9857L96638A3372b10798a7847A24940a3263B36911
$$ plain form
13284 191829 195773 288687 366685 178128 116628 130458 19075 197556 -15896 141435 -6918
13272 -39280 220437 512068 1618 98665 202131 6328 73094 -79881 -39666 165000 23895
13260 -58676 -30829 60228 67240 280080 393590 55651 61597 -35927 230406 89244 158541
13249 158541 141349 475724 149880 29565 181371 121602 47400 67328 -73007 -22651 179988
13237 126465 13057 4386 183401 112909 -6913 416268 50498 187603 -234184 -21502 -76454
13226 -76454 -86269 404832 126406 304237 502523 195253 -390169 22074 566801 70453
13215 -76949 197895 124968 213077 -25975 18718 288597 -114063 -28434 101629 128716 32107
13203 55224 139740 -98093 157587 187444 584082 13372 -210798 -17847 124940 -13263 236911
13191a36135A589f0129H8111J81558A5073e59781A67116K9554A1153c4225B22870
13179f7978A13960K09782A4726J540K11593c9802A71879M9765A271a13799a425
13167A48074Q0578F1312K2126f8226A32624e4867j63832C43625I1441L06031A71118
13155A69832j6932o5925b5745j03371G8010C4864J11967l2788a31640e3794C63247
13143f6340E6353d6805j95167A72036C1866L32350A04856l840e7027I1797J64893
13132B56690M4602A32187M617N6866k498C3045c8664D18851A70313C7379J28960
13121A66339e0973o7800A56345E8936N7216J76756H7306b04730C70203a80158
13110B57258a38720k77427A02770g5597C9661J14147J23606n8366c8858A00595
$$ plain form
13191 -136135 1589 -60129 88111 269669 15073 -559781 167116 196670 11153 -34225 222870
13179 -67978 113960 323742 14726 16266 227859 -39802 171879 221644 1271 -113799 -1425
13167 148074 228652 61312 83438 -68226 132624 -54867 -218699 343625 91441 397472 171118
13155 169832 152900 86975 -25745 -129116 78010 34864 146831 114043 -131640 -53794 363247
13143 -66340 56353 -46805 -241972 172036 31866 364216 104856 101016 -57027 91797 256690
13132 256690 301292 132187 136804 193670 191172 33045 -38664 418851 170313 37379 166339
13121 166339 -50973 -118773 156345 58936 116152 292908 87306 -204730 370203 -180158
13110 257258 -138720 -416147 102770 -75597 39661 153808 277414 219048 -38858 100595
13099I5491M86579b60238a28375D3651J16278R5897A18213a82209C18023F4414
13088b43682H9070L40460a80948Q8882C2172K06044j08212J58453p5125g4447
13077F9366L57723D2781P2918c4706j08027A35037k1181B9490a67504I1174A6952
13065f4481B69461a8894D24636H3884J20061K1561L1425g8196A07306E1967K8854
13054H0821K59924G5246J09923L3933b5338D14913h66A79881J14533b343l219
13043e562C66106H1741b69317G8752M16781A49618o9815d2773H510a21736C33706
13031B16321r6763d8557A37224b03162e2517G4047J40920b46830c5747B08R812
13020A0020K31688F3812O7550M9522g1746B05183f2811D3916a25076c0432E2029
$$ plain form
13099 95491 582070 -260238 -128375 43651 159929 255826 118213 -182209 318023 64414
13088 -243682 89070 429530 -180948 -92066 32172 238216 130004 288457 213332 -74447
13077 69366 427089 42781 115699 -34706 -142733 135037 113856 29490 -167504 91174 16952
13065 -64481 269461 -18894 424636 83884 203945 225506 256931 -78196 107306 51967 80821
13054 80821 340745 75246 185169 219102 -25338 414913 -866 179881 294414 -2343 -5562
13043 -5562 366106 81741 -269317 78752 495533 149618 79803 -42773 8510 -121736 333706
13031 216321 119558 -48557 137224 -203162 -52517 74047 214967 -246830 -35747 208 10020
13020 10020 241708 63812 131362 180884 -71746 205183 -62811 43916 -125076 -30432 52029
13008B48379a26037B69987l6864a04087B80084A01022K7373J23312H282a96406
12997i2253k0470j09031C9285b59541G5104B6581K67408b4899A24640I557c76981
12985D01842F1933Q9024J70782E2525L2473q626L3532a86812B3875a98054A15033
12973h8108m17731a57966C2076a25213A07975c6738A33564J77753j36284N2915
12963B27948G9166P5919M17623a08853B42506A03198a01783A29939i7558g587
12952a91489E4417J97424r6630p7564J288j9143k3059K817e1282B28334q7588
12941A40746b9345k48241I9847l079B9880M3822g7280A94508a25071J4710A37331
12929c20888a3188j43495B52079G731L38023G1148a64069D09798a60968F7949
$$ plain form
13008 248379 -126037 269987 233123 -104087 280084 101022 128395 251707 8282 -196406
12997 -92253 -112723 -221754 39285 -259541 75104 26581 293989 -24899 124640 9557 -376981
12985 401842 61933 150957 321739 52525 84998 76372 109904 -186812 23875 -198054 115033
12973 -88108 -505839 -157966 32076 -125213 107975 -36738 133564 311317 175033 227948
12963 227948 79166 155085 572708 -108853 242506 103198 -101783 129939 -97558 -7587
12952 -191489 54417 251841 155211 77647 78935 59792 36733 39550 -51282 228334 140746
12941 140746 -29345 -277586 99847 96768 29880 73702 -77280 194508 -125071 -110361 137331
12929 -320888 -13188 -156683 252079 7731 345754 71148 -164069 409798 -160968 67949
12918a6141n9496A51528A3452J72626E5949J50014I3667a98669B28923c71473
12907a97234B85889P031J8726a03891C1857J7395J96831B2329M9273a78365E0735
12895A83092q4054d00286F3878K6910b77116C0544J98819i1764C13352E9719B3873
12883c42068J17475h035l6299A05610R4197r8704C7606K2163f2709I7181P692
12872A04873a36462A53602m4027a55732j0163C4069M1123a76321B49204A07147
12861I8869K20872i6077E7563J8834a59558F1799L05962a19731G3578e7617C3582
12849d63785A75456j4052J59266a89439c6573l0982B14637k9213f0125K4261A43626
12837A9472J64510f7229b5076k1171B26728B0716J8540M6713C2969J057a75179
$$ plain form
12918 -16141 -75637 151528 13452 186078 55949 205963 93667 -198669 228923 -371473
12907 -197234 285889 292920 311646 -103891 31857 49252 246083 22329 71602 -178365 50735
12895 183092 99038 -400286 63878 90788 -277116 30544 229363 -91764 313352 59719 23873
12883 -342068 -224593 -8035 -44334 105610 199807 101103 37606 59769 -62709 97181 104873
12872 104873 -136462 153602 109575 -155732 -165895 34069 75192 -176321 249204 107147
12861 98869 319741 -96077 57563 76397 -159558 61799 367761 -119731 73578 -57617 33582
12849 -463785 175456 161404 320670 -189439 -36573 -67555 214637 185424 -60125 -35864 143626
12837 19472 183982 -67229 -25076 -46247 226728 20716 39256 85969 32969 34026 -175179
12825F4419b3542A33183K7081a21979j43380J23740e8019A12893h8757G7454J35177
12814B12631a35950b1894n2329A09140c92999C3535e1644A34760J62192C2352
12803a09655B14233R5043A28177a60424A46008J50303b24175N675A33858h3859
12792i6261a8316j88005F9908L70222A88159g3878a7447j44147o5693l9380e0232
12780D3623A9404J64871b27285E6144c2232C14976a1472B84784I7291J17439c0361
12768C63206f2604j29139d5294i750j11071B20218J74533b13384r6003I4511R9658
12757A94169e6515A7315a9822I6896B9868b19150A68720k4278L0655g1545B2365
12745A24474l9898E145e0896j68521A37116E2948h9976B61002a4265A03497a27088
$$ plain form
12825 64419 -23542 133183 160264 -121979 -265359 -141619 -58019 112893 -88757 77454 212631
12814 212631 -135950 -21894 -74223 109140 -392999 33535 -51644 134760 296952 32352
12803 -109655 214233 309276 128177 -160424 146008 296311 -224175 -218500 133858 -83859
12792 -96261 -18316 -206321 69908 440130 188159 -73878 -17447 -161594 -227287 -266667 -50232
12780 43623 19404 184275 -227285 56144 -32232 314976 -11472 284784 97291 214730 -30361
12768 363206 -62604 -191743 -45294 -9750 -120821 220218 394751 -213384 -309387 94511 194169
12757 194169 -56515 17315 -19822 96896 29868 -219150 168720 144442 175097 -71545 22365
12745 124474 84576 5145 -50896 -219417 137116 52948 -89976 261002 -14265 103497 -127088
12733H1642O7391a80151c5259B56280B9525L79398I6738L2873J14992F8516n185
12722F3331h2533A58965g7397R211j33303A71503p2961K03015a32384q5457A45687
12710a22562A70813E5512L2622A2759L08499j25698b2371C51296K17014j76922
12700C91388A32832A776a62221A10412b8366H0121k7017D263i6704c2070A24730
12688f8003N349K4927C32288g2494r7458b4179A4868a63192E8968j9089c5457
12676A0121i026D7936Q0526J31862a55538A41491R7791b0926D47597A48498J42173
12665B90671G7819c36104K1736B94361c04620j51665J67130i3511H6J90676n2715
12654A38047L7894l8891O1090o2463J82834a12436B85066a09017j71943H7534
$$ plain form
12733 81642 149033 -180151 -35259 256280 29525 408923 96738 129611 244603 68516 63331
12722 63331 -82533 158965 -77397 -68186 -201489 171503 98542 301557 -132384 -217841 145687
12710 -122562 170813 55512 88134 12759 321258 195560 -22371 351296 568310 391388
12700 391388 132832 1776 -162221 110412 -28366 80121 53104 4263 -96704 -32070 124730
12688 -68003 -62654 -37727 332288 -72494 -169952 -24179 14868 -163192 58968 39879 -35457
12676 10121 -9026 47936 128462 260324 -155538 141491 239282 -20926 447597 148498 290671
12665 290671 77819 -336104 -314368 294361 -304620 -456285 -289155 -93511 86 190762 138047
12654 138047 175941 137050 198140 135677 318511 -112436 285066 -109017 -280960 87534
12643G3616J74098b8337B74533A6370J3568J24065F6595f6533b9793p713A59555
12631d3465H9721J84931A07648J23046l3694p3014J90039E3450f7459A48783a66597
12619B57192J0850K66214A66262n7999J68302A05508g2245k2070r5552G8272d15275
12607B5509J53888P2917H546c75866H8077p675a34779B07943i8222j0107A1405
12595F9864i5600d26A43698g9374A40235J0635a25171F0467Q3996C8677b58553
12583A42673B2102h8275C2400J15370J63182D0685a38544A7266c32077c8422j66104
12572b04526F843K83168q1591n6614F1518A1399a18099G3706J4497c0065r2495
12561a22560C23357B8546L53143A62485a3169k32093A38903a88045a2631G2202
$$ plain form
12643 73616 247714 -28337 274533 16370 29938 154003 66595 -66533 -29793 -37506 159555
12631 -43465 89721 274652 107648 230694 197000 123986 314025 53450 -67459 148783 -166597
12619 257192 268042 534256 166262 108263 276565 105508 -72245 -94315 -189867 78272 -415275
12607 25509 179397 252314 8546 -375866 88077 80402 -134779 207943 -98222 -108329 11405
12595 69864 -95600 -426 143698 -79374 140235 150870 -125171 60467 144463 38677 -258553
12583 142673 22102 -88275 32400 147770 310952 40685 -138544 17266 -332077 -38422 -204526
12572 -204526 6843 290011 208420 151806 61518 11399 -118099 73706 88203 -30065 -122560
12561 -122560 323357 28546 381689 162485 -13169 -245262 138903 -188045 -12631 72202
12550a3360C525J46753A902J61075a76345N5329j14555d3295j49007F3110b53948
12538A10733b12745e1750q2299B21035c23072a20906A02833i719H3216l6834K00377
12527B46759H6530a11181D86331A73900a23303j14105d1233I9049M215E1545j2862
12516C8683K38917J4685h4107b8505j83473E4484J53872c7322D5096K85343m6269
12505B84170a62742E4327K24823j37117J6229J285g8521B76571i8799r3018a5564
12493a63287q9328C0372e4078A73474g9134c1674n1015j94223a12289a9489B29606
12481C19320B7898a7891B79649c2582j40170C9382a40024D0637b02618F7330R402
12470G6732a0310l78144b3665A04212A809O4495O868O4400f0119C56091F2224
$$ plain form
12550 -13360 3525 150278 1902 162977 -176345 -121016 -235571 -43295 -192302 63110 -253948
12538 110733 -212745 -51750 -134049 221035 -323072 -120906 102833 -9719 83216 46382 246759
12527 246759 86530 -111181 486331 173900 -123303 -237408 -41233 99049 103264 51545 38683
12516 38683 277600 292285 -84107 -28505 -211978 54484 208356 -37322 45096 330439 284170
12505 284170 -162742 54327 279150 142033 158262 159547 -78521 276571 -98799 -191817 -15564
12493 -163287 -252615 30372 -54078 173474 -79134 -31674 -82689 -276912 -112289 -19489 229606
12481 319320 27898 -17891 279649 -32582 -172752 39382 -140024 40637 -202618 67330 76732
12470 76732 -10310 -388454 -23665 104212 1809 66304 73172 137572 -60119 356091 62224
12458B9201A109c1491I0641Q3899L7642i9102A1310N1533j3445a86364A35273
12446C06370a41610B01838a02286H9793A0554a6910A55283E6824b8139j01967
12436a30106N1631n5958A77423K08140A06717b74666A79526H638M8309k5392b963
12424a06679b1988j70036P6120p462b4916n0498H3559A0440K7645k658J21944
12413A57371E9900L1880f3269a7963E0626M54470B1086a5082k12687N3209P6607
12402i7953A90187b01201h377j68290a1003n7110A65771e5919G9940K84087H3830
12390F8685L1137b59161A94268a18976a2241I681b8782n2566C33161a38078k0043
12379a58121P0758l83388E59026a52725I5119c26012B8748L2010L3663J09250
$$ plain form
12458 29201 1109 -31491 90641 174540 212182 -99102 11310 62843 49398 -186364 135273
12446 306370 -141610 201838 -102286 89793 10554 -16910 155283 56824 -28139 -130106
12436 -130106 -78475 -134433 177423 385563 106717 -274666 179526 8638 56947 31555 -2963
12424 -106679 -21988 -192024 -115904 -123366 -24916 -75414 83559 10440 38085 35427 157371
12413 157371 59900 91780 -63269 -17963 50626 505096 21086 -15082 -227769 -174560 -97953
12402 -97953 190187 -201201 -8377 -176667 -11003 -68113 165771 -55919 79940 364027 83830
12390 68685 99822 -259161 194268 -118976 -12241 9681 -28782 -81348 333161 -138078 -158121
12379 -158121 -87363 -470751 559026 -152725 95119 -326012 28748 60758 94421 203671
12369B03671n1781a70316o1818C45986A34956e6526l33550g4328C28655g2524
12358b03281i8471A25167b43088R4321A35150J2683B6742Q6394D3186P3762i6664
12346B08735a3443j4363A99776L4370o9916e6944A33636i6572B327a02927d5057
12334B70710a13165A0383f8894a9022B09924a28874H8931J00937a45119j13013
12324b58132A25591n6219e177l6262D81195A33020K69782b62538J17457C47327
12313B10811f6126e247q0514B26842d5077A9967J4946g8761c2658A30096i9617
12301b6978H4160J00876R4930R653a25498N9134H598i7156k29529f1988B45897
12289A12079b73898A94605K39092A14235f7795D7298I082K34083G5619k2504J1418
$$ plain form
12369 203671 151890 -170316 -232134 345986 134956 -56526 -390076 -74328 328655 -72524
12358 -203281 -98471 125167 -243088 -148767 135150 147833 26742 113136 43186 116948 -96664
12346 208735 -13443 -27806 199776 234146 164230 -56944 133636 -96572 2327 -102927 -45057
12334 270710 -113165 10383 -68894 -19022 209924 -128874 88931 189868 -145119 -258132
12324 -258132 125591 69372 -5177 -41439 481195 133020 402802 -262538 -145081 347327
12313 210811 -66126 -5247 -85761 226842 -45077 19967 34913 -78761 -32658 130096 -99617
12301 -26978 84160 185036 279966 289619 -125498 -66364 8598 -97156 -326685 -61988 245897
12289 112079 -273898 194605 433697 114235 -67795 47298 9082 243165 75619 53115 64533
12278F4533k8920a04801n0677e224B14295I8574L7723a81978g0744A95996E9341
12266F1303O1844a00141J6271a4012B37485C5854K8654L21099A35016F1256j2630
12255D8626N7853l0396K47304d0475G5628A6404O4098a2617A98090A3193J28701
12244A41894K8847H2098J55975g5203a063n7404C5697K45863b52662D9088b0195
12232C8172Q775a84B17427D9949J01164n5327K08840A30316P6221l5106P5844
12221B47275j05730L39408j90774I8796J24647A05902m1900J14963L56176e1098
12210g304A39139b0381r7613A17442L08457a7504B37627L11580A64332K92142
12200D56474j88401J27480A69988f3152b4917G9310j2934M48982j82842A36129
$$ plain form
12278 64533 35613 -104801 -155478 -5224 214295 98574 136297 -181978 -70744 195996 59341
12266 61303 123147 -100141 -83870 -14012 237485 35854 64508 385607 135016 61256 48626
12255 48626 106479 76083 323387 -40475 75628 16404 80502 -12617 198090 13193 141894
12244 141894 170741 82098 238073 -75203 -1063 -58467 35697 281560 -252662 49088 -20195
12232 38172 46947 -184 217427 49949 151113 95786 304626 130316 206537 171431 247275
12221 247275 141545 480953 290179 98796 223443 105902 64002 178965 535141 -51098
12210 -7304 139139 -20381 -117994 117442 425899 -17504 237627 549207 164332 456474
12200 456474 268073 395553 169988 -63152 -24917 79310 66376 515358 332516 136129
12189B72626E3282L1507c0950C52414J31713k11680I0705L3641C7936f6150L1581
12178c4569B42198e7592A03395K369j1619a81491C4733J17318o3190K2760i4487
12166A47328C4769L9823J45134E7542J26850h0380A54506J89568a05292H2705
12155A36338a68267A77187J10393q4362E6556h5926D3197L38639I7872c2514A66481
12143I4189J72705o5492d8304I8726A1933J5646L54317B1032L6894N32144E7718
12131B09310a7598D7259a03471n2325O1260a2480A02276a03157C43037e9655E1294
12119E90255j71714a76664L273b9891I6108a53790j9742E3401f3775B27055m2296
12108A84759b64895C51251A58182a54284f9789n3848A62289K9834J681a80505
$$ plain form
12189 272626 53282 84789 -30950 352414 484127 272447 90705 124346 37936 -66150 -34569
12178 -34569 242198 -57592 103395 105764 94145 -181491 34733 152051 88861 111621 -94487
12166 147328 34769 74592 219726 57542 184392 -80380 154506 344074 -105292 82705
12155 136338 -168267 177187 287580 203218 56556 -85926 43197 381836 97872 -32514 166481
12143 94189 266894 201402 -48304 98726 11933 27579 381896 21032 57926 590070 57718
12131 209310 -17598 47259 -103471 -155796 -94536 -12480 102276 -103157 343037 -59655 51294
12119 590255 418541 -176664 -173391 -29891 96108 -153790 -173532 53401 -63775 227055 184759
12108 184759 -264895 351251 158182 -154284 -69789 -123637 162289 192123 193804 -180505
12097a39435B61325J39214A07757i4561r6302c2749F5160c9626j07146M941A53084
12085C4552b67045f8859j04016C46176c2629l07542A10993i1383A47009O41522
12075G88531P45386D02810A47390a24290B34950K61589f5447m7254B97865j36969
12065A60896a41508q807j9234b1637A7426a51066L9577C2595f3894K192O394D4349
12052h2083A40772C3354J07378m7289a55482B57323A24627c814A69008a63938
12041c0950p7944J0479D9549a37414A2398c1171A84402c450j07839j81125a22778
12029C91059A88266G301b60885A10936D3443f5002G9573a88804H9746a44944j1617
12018a56561B45918p9162j5458b956r1096C3005A5444b05212L0991E0726a88643
$$ plain form
12097 -139435 261325 400539 107757 -94561 -190863 -32749 65160 -39626 -146772 -141831 153084
12085 34552 -267045 -68859 -172875 346176 -32629 -340171 110993 -91383 147009 788531
12075 788531 1533917 402810 147390 -124290 234950 496539 -65447 -112701 297865 160896
12065 160896 -141508 -150315 -169549 -21637 17426 -151066 -111489 32595 -63894 -61702 -55308 44349
12052 -82083 140772 33354 140732 93443 -155482 257323 124627 -3814 169008 -163938
12041 -30950 -108894 -98415 49549 -137414 12398 -31171 184402 -3450 -111289 -292414 -122778
12029 391059 188266 7301 -260885 110936 43443 -65002 79573 -188804 89746 -144944 -156561
12018 -156561 245918 166756 151298 -2956 -94052 33005 15444 -205212 -174221 50726 -188643
12006h6125k7928k21723C02792A29996J03515r30i6228A4110b8778j08085c4065
11994b80101O8588R1944C09790a66745A83584c62595B6047J57792R215a79529
11983a47069A30870J5759i7449A56809l1559R0388b18324R9305H1783l4336a72550
11971b19718i1544I9580b631m093D549M9528a28242e2167B09832G789a3910l8439
11959e2349m6383d4737A46600R3245a04486K5149A28285J91133b91063A49897
11948A53881a22795A13569k7314a18258j68105B32575a2307B68004E0575a19603
11937B24329n9592b1480A11704B0631O5457a77699B13995B7526L08255c45785
11926a80605i0018B04142r6119f0009A2135a13984j38137E6643a9718r3151F0049
$$ plain form
12006 -86125 -114053 -335776 302792 129996 233511 232581 -96228 14110 -28778 -136863 -34065
11994 -280101 -211513 -119569 309790 -166745 183584 -362595 26047 183839 193054 -179529
11983 -147069 130870 146629 -97449 156809 125250 215638 -218324 -119019 81783 47447 -172550
11971 -219718 -91544 99580 -2631 -6724 4549 54077 -128242 -52167 209832 7789 -13910 -52349
11959 -52349 -98732 -44737 146600 239845 -104486 -79337 128285 319418 -291063 149897
11948 153881 -122795 113569 86255 -118258 -286363 232575 -12307 268004 50575 -119603
11937 224329 164737 -21480 111704 20631 86088 -177699 213995 27526 335781 -345785
11926 -180605 -90018 204142 108023 -60009 12135 -113984 -252121 56643 -19718 -112869 60049
11914c73708d0650g258j568j6743C03091B2183g9619j18349g7040A44551a60866
11902C9800c47973B76231a16493a1879G7930P2479J34802L8169a08415B2538J02209
11891A24747K8392J08138B278L5627a18379k01480a06334A11225P0738p8924a48618
11879a08139A34646h030G3407K2026g2982A820a23471m65883f8893B92410f4792
11867A24930a14802A64556E9754Q7445E1171a78394e4202B35254b57336D0150
11856b04302K6758B27952c70216C4527R8346a74885k04849A10213d31713a47153
11845a14141E2469h926F1867J59908a61489C66880A01831C9736L9701d2940j80429
11834b23369L8106j00585b0780I8355b24536i8377c5796d681A06197b97729A26292
$$ plain form
11914 -373708 -40650 -7258 -8826 -25569 303091 22183 -79619 -197968 -77040 144551 -160866
11902 39800 -347973 276231 -116493 -11879 77930 150409 285211 323380 -108415 22538 124747
11891 124747 153139 261277 2278 37905 -118379 -319859 -106334 111225 181963 103039 -148618
11879 -108139 134646 -8030 73407 95433 -72982 1820 -123471 -589354 -68893 292410 -64792
11867 124930 -114802 164556 59754 147199 51171 -178394 -54202 235254 -257336 40150
11856 -204302 -177544 227952 -370216 34527 132873 -174885 -379734 110213 -431713 -147153
11845 -114141 52469 -8926 61867 221775 -161489 366880 101831 39736 79437 -42940 -223369
11834 -223369 -185263 -285848 -20780 98355 -224536 -98377 -35796 -4681 106197 -297729 126292
11822e36481B7289J42241F4839b189l7676n4015o2309e6237l9243K4606j67218
11811b38092A37655J32880h1553I5371c24746J40696O8555k7093L2416B7680a85943
11799a28208l37017A41390J23533a7514k14489F7335b52325o6891D46529j49337
11789B97192j19721g0351M311a8129A30049b01593H1505d7642B03302d45250K16694
11778b28556o096c3324A90793b4761A07708b49670A95815O3085i6948j39183C0715
11766a23729A27594f8876o8347k25568A81932b1565A58887n0964a9015A97524
11755A22671c88710E8021J73014b44684a13246H1335J2348c08138H4803b38868
11744D8325K56920c5660F437d01145C6126L32378m24A41620J77546b52825B46398
$$ plain form
11822 -536481 27289 169530 64839 -2189 -39865 -93880 -156189 -56237 -95480 -70874 -238092
11811 -238092 137655 270535 -81553 95371 -324746 -184050 -115495 -142588 -110172 27680 -185943
11799 -128208 -465225 141390 264923 -17514 -232003 67335 -252325 -319216 446529 297192
11789 297192 177471 -70351 -66040 -18129 130049 -201593 81505 -47642 203302 -445250 -228556
11778 -228556 -234652 -33324 190793 -24761 107708 -249670 195815 258900 -96948 -236131 30715
11766 -123729 127594 -68876 -137223 -362791 181932 -21565 158887 107923 -19015 197524
11755 122671 -388710 58021 231035 -244684 -113246 81335 93683 -308138 84803 -238868
11744 48325 305245 -35660 6437 -401145 36126 368504 368080 141620 319166 -252825 246398
11732a49843A74275p7772B9194J57574a44749B16821h0594A12075J32990c1773
11721b72778c2218B89287e2134H9560c1521G0985k6240a07201a9267B7888L33903
11710C61791A07868J04205a19515a7652d245C4744J18737O750h0149A09700a6984
11698a31072A13L65643A66798p9058j833P7618p0648K92984g8733e117E7950B8774
11685a34956k2673M1959A33051c26017B5866R5676d3346I8253J43774A08478b8514
11673B90914j39160b69178e3537a5648q0034G5720q169a65378j118A58501h4212
11661h3359k45422d2246j43936n7021g9321D3510L0485a77457k9988i2086A4071
11649A08134i6435C7273b9510A16340f5207A05768R0037b43063M8062e0293C06084
$$ plain form
11732 -149843 174275 96503 29194 186768 -144749 216821 -80594 112075 245065 -31773
11721 -272778 -32218 289287 -52134 89560 -31521 70985 44745 -107201 -19267 27888 361791
11710 361791 107868 212073 -119515 -17652 -4245 34744 153481 160231 -80149 109700 -16984
11698 -131072 113 365756 166798 87740 85907 163525 92877 385861 -78733 -5117 57950 28774
11685 -134956 -157629 -115670 133051 -326017 25866 121542 -43346 98253 242027 108478 -28514
11673 290914 151754 -269178 -53537 -15648 -95682 75720 67551 -165378 -166496 158501 -84212
11661 -83359 -328781 -42246 -186182 -243203 -79321 43510 73995 -177457 -207445 -92086 14071
11649 108134 -96435 37273 -29510 116340 -65207 105768 195805 -243063 -195001 -50293 306084
11637D9441O5097a33044C9776J79589a75206C53158p5163a08413B97216a2120
11626c0097A02829K69191E4491A6398J25963o3527B4193K7281Q7008i1989F6400
11614F1882c99238A09530a09291B68508A10179h5373B13459B9506J07458e8019
11603A2974L0926M3493f4967J2845j4290A24055b0577E4665J14447J28979a99112
11591A37489J79649C2821J19563J00516a1213A80539A1518K12721I6323A4586
11580G5477L460a19985j5188A73018J00654A10332J54856F892K89749b78313D8382
11568H2568J00448J50180D8490c5385j29474b134A13134Q2707E5660a37756O1268
11557g6488D34690F4341B0622P0889C938K47037c7766M085D9358K28033O807j26147
$$ plain form
11637 49441 114538 -133044 39776 219365 -175206 353158 277995 -108413 297216 -12120
11626 -30097 102829 372020 54491 16398 142361 78834 24193 51474 138482 -91989 66400
11614 61882 -399238 109530 -109291 268508 110179 -85373 213459 29506 136964 -58019
11603 12974 43900 87393 -64967 -52122 -66412 124055 -20577 54665 169112 298091 -199112
11591 137489 317138 32821 152384 252900 -11213 180539 11518 224239 96323 14586
11580 75477 78937 -119985 -135173 173018 273672 110332 265188 6892 296641 -278313 48382
11568 82568 183016 333196 48490 -35385 -164859 -2134 113134 195841 55660 -137756 -76488
11557 -76488 434690 64341 20622 91511 3938 250975 -37766 -33681 49358 277391 284198 158051
11545A58051a20530B06802n7382R4598K0812e9377B92053J33102j85359r6421
11535A43375l7020e8154B57970A10432i4258B14761c06397e222j18403A85965
11524D1902b6188A60175o3348J05025a13546A19068c1660l15734d2144A36821
11513C53738j64286b74608f1064K9139C51877A9703L0584K46375j09548B5688
11502A02144D6871L17474C9118d0322j37384A90657E2630O8242J89995A47287
11491a14349H2419M3441K55019H5202g8318A9883c3483E53017a16399M0638B29013
11479A65567M6431f7607A57539a0569F5974J23769D6590R9775h3658j3895G2612
11467C59761i0119C9464K46767r0097C4599c6639A09665a8125k6812A95840j8669
$$ plain form
11545 158051 -120530 206802 149420 244018 264830 -59377 292053 425155 239796 143375
11535 143375 106355 -58154 257970 110432 -94258 214761 -306397 -5222 -123625 185965
11524 41902 -26188 160175 96827 201852 -113546 119068 -31660 -347394 -42144 136821
11513 353738 189452 -274608 -61064 -31925 351877 19703 50287 296662 187114 25688
11502 102144 46871 364345 39118 -40322 -177706 190657 52630 120872 310867 147287
11491 -114349 82419 125860 380879 85202 -78318 19883 -33483 553017 -116399 -75761 229013
11479 165567 211998 -67607 157539 -10569 65974 189743 46590 146365 -83658 -97553 72612
11467 359761 -90119 39464 286231 196134 34599 -36639 109665 -18125 -44937 195840 177171
11456A77171L7140p7190b98994A41129a59513A81341p8985m332O2821c51415O5194
11445b86221A88076J28537a34336j01661B27248j11713b93381D583d5633A82732
11434c6796E2199L40681I9550L44500j16239c83412c9093B34472e8176J6027j06080
11423a48229A31529E7926b13973d7859l09543a08153J8297A2076a06738I8960
11412F5799J57318b45541D7926g294A03777a03255A97506a1255B1327c24464J60011
11401a64453b2146k93979H119a33787C31502a5386A59217K0164c6568k0115l3393
11390i0076c1915B68755b00375A98119a52940a8122j57922A57442l2131G868Q2153
11379I0021a59567A39634N5334J08993c12099A75759F5308J00963a65705H8231
$$ plain form
11456 177171 214311 137121 -298994 141129 -159513 181341 102356 98024 160845 -351415 -286221
11445 -286221 188076 316613 -134336 -235997 227248 115535 -293381 4583 -45633 182732
11434 -36796 52199 392880 99550 444050 327811 -383412 -39093 234472 -58176 -42149 -148229
11423 -148229 131529 57926 -213973 -47859 -357402 -108153 -89856 12076 -106738 98960
11412 65799 223117 -245541 47926 -7294 103777 -103255 197506 -11255 21327 -324464 -164453
11401 -164453 -22146 -316125 8119 -133787 331502 -15386 159217 179381 -36568 -56683 -90076
11390 -90076 -31915 268755 -200375 198119 -152940 -18122 -176044 157442 125311 7868 90021
11379 90021 -159567 139634 194968 303961 -312099 175759 65308 166271 -165705 88231
11368a20118A85149q0571a67242A39141a96414O8654j50885h66H3387c493j05668
11357a09161d1387I7098c5339p7358d8365A70821j4812o7856J9254a6175j65677
11346a81852K2278E2404J54519o6546C4822i0236M56A43917d0751j62453Q0528
11335a22676G485M556K22474b98677G6797j2252J78688e3368j49202a4998k61215
11324b76213B15204a63545A21513l4980a14461j26607A61164c4054A65701a38062
11313B37587c6249k05714D71185a42883O8155E8300L8554P189e1879A23692c4202
11301A63670b35120a00521k9121r401F6647f2390h036l6558H881J55683a01706
11289d6053B5886f61427a93833b3069j08100H5553a39765A93214a42732c775j45100
$$ plain form
11368 -120118 185149 104578 -167242 139141 -196414 -127760 -278645 -866 83387 -3493 -109161
11357 -109161 -41387 97098 -35339 -112697 -48365 170821 156009 88153 107407 -16175 -181852
11346 -181852 -159574 52404 206923 140377 34822 -90236 -89780 143917 -40751 -203204 -122676
11335 -122676 7485 12041 234515 -298677 76797 64545 243233 -53368 -202570 -14998 -276213
11324 -276213 215204 -163545 121513 86533 -114461 -241068 161164 -34054 165701 -138062
11313 237587 -36249 -241963 471185 -142883 -74728 58300 96854 104043 -51879 123692 -34202
11301 163670 -235120 -100521 -129642 -139043 66647 -62390 -8036 -44594 8881 164564 -101706
11289 -46053 25886 -661427 -193833 -23069 -131169 85553 -139765 193214 -142732 -3775 -148875
11278a48875k0940g5196J5770E462a10046j08484f8426B43988C0704e8668I3788
11266B60064c49791a01369k04331A64878b57814j2850D3543j5353a89289m0531
11256b29820a0176B1971e707k70093G7812b66296B17160F4420e66502F4810Q6489
11245A51299R4921a50082A464K8020b10065B8179a75645j04256D876J5137M830
11234B4843J82298e9017F6420g210C59763b02809i1600I5164a94064A06857a1354
11222b1948l61629a70770m9831e4142j47911D9845O8153m2719g6766k31395a28238
11210b4790j41464j11357a11092F9471A4721b48679g011m50989A8028b85167C14760
11198d4403n928I1034a0656k61098h740A90976a84686l1409A35940C8338a13485
$$ plain form
11278 -148875 -169815 -75196 -59426 5462 -110046 -218530 -68426 243988 30704 -58668 93788
11266 260064 -349791 -101369 -305700 164878 -257814 -270664 43543 28190 -189289 -229820
11256 -229820 -10176 21971 -5707 -275800 77812 -266296 217160 64420 -566502 64810 151299
11245 151299 246220 -150082 1464 29484 -210065 28179 -175645 -279901 4876 20013 24843
11234 24843 207141 -59017 66420 -7210 359763 -202809 -91600 95164 -194064 106857 -11354
11222 -21948 -383577 -170770 -220601 -54142 -202053 49845 117998 75279 -76766 -308161 -128238
11210 -24790 -166254 -277611 -111092 69471 14721 -248679 -7011 -458000 18028 -285167 314760
11198 -44403 -50331 91034 -10656 -271754 -8740 190976 -184686 -216095 135940 38338 -113485
11186a39740n7764D5759a6109q8712k74424g3470b2121o0731n0608c769q5321
11175h9090m7083N7965E10755I0035a75287C51766I8711J30805o4883b46261E8588
11163a48300l2A58500R717a162j9463k3982C48643b2009j23671A05566m526c72433
11150a16889C84496b97214E3045Q1403K0358O0014a759k84046A22158J71826a64887
11138G9709a91180D3433a71084B4697e810k3438C46062a06583M7457p645A31746
11126I9087f7145j20583m8558D15312e1187l0883M0092I4966a19463B49598A19349
11114A89418e448A8630K2996J12570i0039j28350A53647O882p2333B4225L15208
11103C39433A10595N9714m30G5606M5496K94194j74339E0844b02623G7081l1232
$$ plain form
11186 -139740 -197504 45759 -16109 -104821 -379245 -73470 -22121 -82852 -133460 -3769 -89090
11175 -89090 -136173 -78208 510755 90035 -175287 351766 98711 229516 164633 -246261 58588
11163 -148300 -148332 158500 168217 -1162 -20625 -44607 348643 -22009 -145680 105566 101040 -372433
11150 -116889 384496 -297214 53045 134448 154806 214820 -1759 -285805 122158 293984 -164887
11138 79709 -191180 43433 -171084 24697 -5810 -29248 346062 -106583 -59126 -66771 131746
11126 99087 -67145 -187728 -236286 415312 -51187 -82070 -41978 94966 -119463 249598 119349
11114 189418 -5448 18630 41626 154196 -90039 -218389 153647 160529 88196 24225 339433
11103 339433 110595 170309 169879 75606 121102 415296 240957 50844 -202623 77081 45849
11092D5849d35033B90839B2055c912B32458i836A46097k8873J03686j09669O8507
11081A79748r108A4714J87036J7646K75565N4280n826A96914a15820G7769J66570
11070B44339k4038K90561j89228A02576K65681n4007R5234P887q6698M37202k78543
11059D89332j46761L52765j10367r1132j29458J73851J07764k5089k52j2309j22350
11048D85994J58797j58404K2650J82194j48154J00825k0195J0387k59997O3707
11038D37804M24084l79285L37053A04106M39578j10739J25501Q0875r603J28278
11028G57996j75793j072p9622L14904j34780K83273C22608L19082C03275M48432
11018G51707j94404k4677L09549D08753j68020L68321k49876K32706B06600M61221
$$ plain form
11092 45849 -435033 290839 22055 -3912 232458 -9836 146097 117224 220910 111241 179748
11081 179748 170640 14714 201750 219396 494961 549241 543415 196914 -115820 77769 244339
11070 244339 220301 510862 321634 102576 368257 314250 409484 417371 330673 767875 489332
11059 489332 342571 695336 584969 493837 364379 538230 645994 620905 620653 608344 485994
11048 485994 644791 486387 509037 691231 543077 643902 623707 634094 374097 437804
11038 437804 861888 482603 819656 104106 543684 432945 558446 639321 629718 757996
11028 757996 582203 581131 501509 816413 681633 964906 322608 641690 303275 751707
11018 751707 557303 532626 842175 408753 240733 609054 359178 591884 206600 667821
11008F67821C08783j049K48753J45473C34870K62187R2875j28398m1834L5351
10998E55051J25982j03892L4700N4101k40862J54366k54155L89834C42282K8637
10988C70919M85439j68839j82887M79807J04720n10197O55654k82474j31365L38534
10978A159311Q4000N6433K07017M5802J98584N54388k49594L22552J37483k32996
10968B282980m7316j28594k98231k33917J93305m99153K44145j06705J16552J60100
10958A683166m5073O288P4448l09152n8182j56196k19219J3442k00374l02417
10948D86731O6862k24435M0449p6458K66132j22177h5854L7280A56449J5342J54343
10937C26134h6565l4253G3566b2186C29153A4040J68947n9616L6612a93581a1303
$$ plain form
11008 667821 308783 307734 556487 701960 334870 597057 689932 561534 519700 555051
10998 555051 681033 577141 611841 665942 425080 579446 325291 715125 342282 370919
10988 370919 856358 687519 504632 984439 1089159 578962 1234616 952142 820777 1159311
10978 1159311 1243311 1299744 1506761 1552563 1751147 2305535 2055941 2378493 2515976 2282980
10968 2282980 2235664 2107070 1808839 1574922 1768227 1269074 1513219 1406514 1523066 1683166
10958 1683166 1638093 1644381 1718829 1409677 1351495 1195299 976080 989522 789148 486731
10948 486731 553593 329158 369607 293149 559281 437104 -85854 -48574 156449 171791 326134
10937 326134 -86565 -120818 73566 -22186 329153 14040 182987 123371 159983 -193581 -11303
10925a28180p2060b0186k71064J37231j13090q087A6545c53427A34280a74299
10914E775a03154k1257D70538a4864n5868j31310g906q8983C00719a66017B58707
10902i4810k29133A37354d3584A78257b0464j57413b964j49900m1839C7364a55727
10890a95826A23274D1833J25682p3623R844a6859j05729k56114A42883b16550
10879g5938b272H0919d32084g5795E9695O2472g6294F6673J26709a05905m5886
10868a51791C1375a05780j4357A4951a63076j84166A93724a95248f5728k9270
10858i4998A3637a34094A12690B6378K0489P5098a55882l8236D4368J34520C7525
10846D14945b76682B9641i2387c4332j40775j29177N5941A33757e6970B15452
$$ plain form
10925 -128180 -200240 -20186 -291250 -154019 -267109 -275196 16545 -353427 134280 -174299
10914 5775 -103154 -124411 470538 -14864 -70732 -202042 -7906 -96889 300719 -166017 258707
10902 -94810 -323943 137354 -43584 178257 -20464 -177877 -2964 -152864 -194703 37364 -155727
10890 -195826 123274 41833 167515 93892 103736 -16859 -122588 -378702 142883 -216550
10879 -75938 -2272 80919 -432084 -75795 59695 122167 -76294 66673 193382 -105905 -151791
10868 -151791 31375 -105780 -120137 14951 -163076 -347242 193724 -195248 -65728 -94998
10858 -94998 13637 -134094 112690 26378 46867 121965 -155882 -194118 44368 178888 37525
10846 414945 -276682 29641 -92387 -34332 -175107 -304284 -248343 133757 -56970 215452
10835A11886b07399c9630j09328A15139a06606d2202j00541j21545A00864a90821
10824d2646C7721J8833E742R0412L40278a18612o6660P0710k58907H0235K14223
10813B94458f7547A37628M8933k0637c3099j30423e0628B7627d0416j01207C509
10801B9715N9699a13345N1291C8242a41941j29456B8556J06063N2364h8556J7139
10790g1417j7334k95702A20183b22971A84607F8865f2437J2318F4128K326P4172
10779A40626d4896j9032k09866b8534k45356i1985r4079A0612b66351j71169A05220
10767I0969b1606C55116o6744A14116K0899d2386A99106J06468a865A10723c8775
10755b6833A65086o3281m2366d92083A8476L3597c07918J00337H2909b05190B9912
$$ plain form
10835 111886 -207399 -39630 -148958 115139 -106606 -42202 -142743 -264288 100864 -190821
10824 -42646 37721 56554 5742 96154 436432 -118612 -185272 -114562 -373469 80235 294458
10813 294458 -67547 137628 186561 165924 -33099 -163522 -50628 27627 -40416 -141623 3509
10801 29715 89414 -113345 -62054 38242 -141941 -271397 28556 134619 186983 -88556 -71417
10790 -71417 -88751 -384453 120183 -222971 184607 68865 -62437 -50119 64128 66454 140626
10779 140626 -44896 -63928 -273794 -28534 -273890 -91985 -186064 10612 -266351 -437520 105220
10767 90969 -21606 355116 288372 114116 135015 -42386 199106 305574 -1865 110723 -38775
10755 -26833 165086 101805 59439 -492083 18476 52073 -307918 -207581 82909 -205190 29912
10743E2958L2567a18547D01740b2954j53847B15952O2595a80874B50009a56324
10732b89937a4342j23135A14417J65086a05924K8977O467J6088O221B3225K26641
10721B49866b7622q4345I344K13664b3902d624D28242E8097c30006a52520A14410
10709a8805j01184A47999a16840G1769a78600B00327A5095L48150a95782i7393
10698h2434B81692I643J70430h4939k3396j39430k09857a32140G3611j0556L5534
10687I8589a02670k5271j62537o414B67567a35015o9321A87797G1421N0671g5064
10675g7022l32577C2490J43844n2195e4790A93148I4852n668a45063a2077m55660
10664d67737A17865P5992E9982b23190B78201a27446e8062I5673b57780B51989
$$ plain form
10743 52958 85525 -118547 401740 -22954 -176801 215952 278547 -180874 250009 -156324
10732 -289937 -14342 -137477 114417 279503 -105924 -76947 -70480 -54392 -48171 23225 249866
10721 249866 -27622 -111967 9344 223008 -23902 -4624 428242 58097 -330006 -152520 114410
10709 -18805 -119989 147999 -116840 71769 -178600 200327 15095 363245 -195782 -97393
10698 -82434 281692 9643 180073 -84939 -108335 -247765 -457622 -132140 73611 63055 98589
10687 98589 -102670 -127941 -290478 -296892 267567 -135015 -204336 187797 71421 122092 -75064
10675 -77022 -409599 32490 176334 124139 -54790 193148 94852 89184 -145063 -12077 -467737
10664 -467737 117865 193857 59982 -223190 278201 -127446 -58062 95673 -257780 251989
10653H8413e4113E8084b24890h1688d0829H9807a12068j58801K3466B63462K3760
10642B87222C6809J94951E8139a7040n0065P451p4151d0741D1163J27244p8053
10631I0354c24591G8489g7214h527j00152A12627a29240j78887g453A6327a55325
10619H3518a20707A46145d5825l293D5171e7261C1697c98232D6256a62748k40707
10608d03455k3009f5530k63574A13883a96072q1347J15949K4060A72668o1939
10598A10729e9000M405A4531f4495L1778r2298j4686n6197D5869a57320e388A06877
10585e5729B05885D6471h075G1849d0290k09270j48036A34149a71446G1317b27511
10573A25649b72283G3445A900c11499B94904A1148P9334C2944P7596b14499i8695
$$ plain form
10653 88413 -54113 58084 -224890 -81688 -40829 89807 -112068 -270869 -247403 263462 287222
10642 287222 36809 231760 58139 -17040 -67105 -59654 -133805 -40741 41163 168407 90354
10631 90354 -324591 78489 -77214 -8527 -108679 112627 -129240 -308127 -7453 16327 -155325
10619 83518 -120707 146145 -45825 -49118 45171 -57261 31697 -398232 46256 -162748 -403455
10608 -403455 -426464 -65530 -329104 113883 -196072 -277419 -161470 -137410 172668 110729
10598 110729 -59000 -54595 14531 -64495 -32717 -125015 -139701 -195898 45869 -157320 -5388 106877
10585 -55729 205885 46471 -8075 71849 -40290 -249560 -397596 134149 -171446 71317 -227511
10573 125649 -272283 73445 1900 -311499 294904 11148 90482 32944 110540 -214499 -98695
10561B3786J5761b07917A54263a62719o3367k8220c3278l5026A30543b99681a8730
10549B40633L0726c19260A29353a71190Q3941l59990o4105a57026i562k02393
10539b11955A07909A4899d47986a07493A91556J87318d3113l37191B12017a35671
10528f07431i5833A17957i6132d3823k68569D5897a0082o5963i62j19572a2460
10516b03429A37347R2492k3977p1379a17575d7981A71817D724K3249h5710m9986
10505a35696j09808g657I7838b3864q7382B6410a22212lB3552a67401e7668A15526
10492b95211B75193b59818h7844k7528r887H2932J5061K9271C5060K2644M33088
10481D90792B03707J91415o0005q4695o2244P561R9540a4798B36146p1372l0772
$$ plain form
10561 23786 39547 -207917 154263 -162719 -226086 -254306 -33278 -68304 130543 -299681 -18730
10549 240633 271359 -319260 129353 -171190 -87249 -447239 -511344 -157026 -9562 -211955
10539 -211955 107909 14899 -447986 -107493 191556 378874 -43113 -380304 212017 -135671
10528 -607431 -95833 117957 -96132 -43823 -312392 45897 -10082 -76045 -962 -120534 -12460
10516 -203429 137347 229839 205862 134483 -117575 -47981 171817 4724 27973 -85710 -135696
10505 -135696 -245504 -7657 97838 -23864 -111246 26410 -122212 -122215 23552 -167401 -57668 115526
10492 -295211 275193 -259818 -87844 -115372 -125259 82932 97993 127264 35060 57704 490792
10481 490792 203707 395122 335117 250422 188178 195739 295279 -14798 236146 164774 134002
10470A34002J4424h194a436A10971Q0084O8044h0271I7178a24143r3467p4635
10459b92245F5324N3728K45499I1019J51991a53872j6688D8714J80134L33022
10449E61870A45049P8655H62J0761g7077B7549K70L2214N2311N1082P7692H1889
10436c49245A24383J3626b08404b9882A9507f8469A42498a73236F8167A9783b95845
10424A73336h5988K7301J4739A28056b52685N3846H0008a64228k4295L0715B13883
10412D5673c26928J28678Q4162E9835A1945a46248B38077a76324g4833m7469G6990
10400C1695Q6408b0979A20353e1063B282J51622J62338c6701H1615J39081I3527
10388A90842k8246H0917a88455A44459J89437h6704C66099B3635N6592i3857A05479
$$ plain form
10470 134002 148426 -8194 -1436 110971 191055 259099 -80271 97178 -124143 -217610 -292245
10459 -292245 65324 119052 364551 91019 243010 -153872 -170560 48714 228848 561870
10449 561870 145049 223704 862 11623 -77077 27549 27819 60033 112344 163426 241118 81889
10436 -349245 124383 138009 -208404 -29882 19507 -68469 142498 -173236 68167 19783 -295845
10424 173336 -85988 -58687 -43948 128056 -252685 -198839 80008 -164228 -188523 -157808 213883
10412 45673 -326928 -198250 -114088 59835 11945 -146248 238077 -176324 -74833 -122302 76990
10400 31695 118103 -20979 120353 -51063 2282 153904 316242 -36701 81615 220696 93527
10388 190842 162596 80917 -188455 144459 333896 -86704 366099 23635 80227 -93857 105479
10376b32959Q5175P0584H6793K19635P5611n9430M3736A82766J65585J46718o0923
10365D34146j77450d5959A74850K21559A15253a0971A26717B4866J83518c2041
10354D7787g9009C05471j40036J02446K41422A73808M28356B99365m5094L28518
10344E82789k20743j4527J19713a08677A54385M8080B8856N8443K7780l111K68852
10333C80820A21161K19679a61559a7713I5538J11896O5615b46864b6139B63354
10322C0344h3707B49793D9305e1369B18421a70782C00181b10457B61305m7739
10312B13566b86466A40827a34263j36076E0574a56791A59825h5484H6403J52966
10302B39369A04074b82136F0746B6655a73577H1240a48662B5717J6772J07141
$$ plain form
10376 -232959 -147784 -77200 86793 306428 382039 322609 366345 182766 348351 495069 434146
10365 434146 256696 -45959 174850 396409 115253 -10971 126717 24866 208384 -32041
10354 47787 -79009 305471 165435 267881 509303 173808 602164 299365 254271 582789
10344 582789 362046 347519 467232 -108677 154385 202465 28856 87299 115079 111968 380820
10333 380820 121161 340840 -161559 -17713 95538 207434 273049 -246864 -26139 263354
10322 30344 -83707 249793 49305 -51369 218421 -170782 300181 -210457 261305 213566
10312 213566 -286466 140827 -134263 -270339 50574 -156791 159825 -85484 86403 239369
10302 239369 104074 -282136 60746 26655 -173577 81240 -148662 25717 42489 149630
10292A49630c59855Q3877A30665e71025A34749b60102H762g9990a107r6620o7234
10281a64961A37085A1456a57605F4350J20751H8325j5487b35178I689J33134a81691
10269d6117k4919p0761B23692A06499J43604O5463G8005P2548a78143B18156K61415
10258D79571J8485B04598m1589K5054o0596k8039a3374p4055A44943b48755B52268
10246C1019K35216A5197K86367b9909j74506p6076C95015D4997K19371a38664
10235c2612k88487A37327O3318h1931j16728n1729A59043b42242j21911A20478
10224A98027f1509n3531A73102c19982F358a17485p4823J2843P1405o882B02127
10212I0517a63717o2530B62928i569K323C62805e4222k52613a31962J2133r1258
$$ plain form
10292 149630 -359855 -275978 130665 -571025 134749 -260102 8762 -79990 -1107 -97727 -164961
10281 -164961 137085 11456 -157605 64350 185101 88325 72838 -235178 9689 142823 -181691
10269 -46117 -71036 -141797 223692 106499 250103 315566 78005 150553 -178143 218156 479571
10258 479571 498056 204598 163009 188063 127467 99428 -13374 -87429 144943 -248755 252268
10246 31019 266235 15197 301564 -29909 -204415 -280491 395015 44997 264368 -138664
10235 -32612 -321099 137327 200645 -81931 -198659 -250388 159043 -242242 -364153 120478
10224 198027 -61509 -115040 173102 -319982 6358 -117485 -192308 -179465 -108060 -114942 202127
10212 90517 -163717 -226247 262928 -9569 -7246 362805 -54222 -306835 -131962 -119829 -211087
10201b11087j9601D2830b70988B56257a26851G2123c68216J27572a04001d2525
10190a04883j42587N079d9516l1359k1869d0387Q310l6480A16632a76520B4231
10178c62898F9522a58508k7903A38728f9355k7307i097l1753p4522D61224a81683
10166b87212k17289E0900Q6902b43796g7400k23537L1403k12864f5679C11810
10155i5870A17470a043j6677j04465j50317A051a49788B37001a42123B98253d6991
10143a56159a6663j00222q7607A04380K9438a59238C7813a70004M8337d3854q0070
10132a23924k366d4235L752B46722f180j65458M3678A21890a8218A26985J48675
10121B75660M8176a11582A53966d7570B93363f6902j21599Q6092B3121o62a8472
$$ plain form
10201 -211087 -230688 42830 -270988 256257 -126851 72123 -368216 -240644 -104001 -42525
10190 -104883 -247470 -242391 -49516 -80875 -102744 -40387 -32077 -68557 116632 -176520 24231
10178 -362898 69522 -158508 -186411 138728 -69355 -96662 -9097 -40850 -115372 461224 -181683
10166 -287212 -504501 50900 137802 -243796 -77400 -300937 -269534 -482398 -65679 311810
10155 -95870 117470 -1043 -17720 -122185 -272502 1051 -149788 237001 -142123 298253 -46991
10143 -156159 -16663 -116885 -204492 104380 133818 -159238 37813 -170004 -121667 -43854 -123924
10132 -123924 -126290 -44235 -40483 246722 -6180 -171638 -127960 121890 -18218 126985 275660
10121 275660 323836 -111582 153966 -47570 293363 -66902 -188501 -102409 23121 22459 -18472
10109a62047j21361A53676f5147j5689p985A3270J71384c25120m4980g5315A8901
10097d9196G8549i8220L7700j0081C32406A07541J11717m9664A5567c63419a50248
10085f8442O075k0430j69618A88075d43j73156C3728g4314k32835f0619A035a37161
10072c56828a58029E4770M0112A548a9266D978L36047d23496H3916a90519A00075
10060B09441b00604C13a63557A25977b4484l23342j1262A03385Q2671e6273B04658
10048c1567A87307a7395m9805c2211k6389A10124A7473e41323B9365a32256A88457
10036A22390e7868k99843a21986l24450a73571K0908j64697C75708a37069n4669
10026a91738c0264B04672D646J49693d4146E5000k1907j4001b69933E5310K06885
$$ plain form
10109 -162047 -283408 153676 -65147 -80836 -88821 13270 184654 -325120 -370100 -75315 18901
10097 -49196 78549 -98220 -60520 -70601 332406 107541 219258 169594 15567 -363419 -150248
10085 -68442 -62367 -82797 -252415 188075 -443 -173599 33728 -74314 -307149 -60619 1035 -137161
10072 -356828 -158029 54770 94882 1548 -19266 4978 341025 -423496 83916 -190519 100075
10060 209441 -200604 313 -163557 125977 -24484 -347826 -359088 103385 186056 -56273 204658
10048 -31567 187307 -17395 -67200 -32211 -58600 110124 17473 -541323 29365 -132256 188457
10036 122390 -57868 -357711 -121986 -446436 -173571 -152663 -317360 375708 -137069 -191738
10026 -191738 -30264 204672 4646 154339 -44146 55000 33093 19092 -269933 55310 262195
10015B62195i0053A15437b12767A11917C320P3044c22471M1984o4822a17611b6593
10003G0148K58341c00611k154a13139j76956J03968K0588k8634A24541a6845A74105
9991a01099e348E5077a25602A35018a66558j64355A04384m7643J39598g2338A2351
9979a202G5446c54898c9125C50777b37729f7877k32044j92A70366F1054a66443
9967d60438a73334E2134b70075d4727k18741B0028d3028k37219C918c5733d854
9955a53767A0543a77163A7217K33548b76882D2290a15092j23822A11751b34457
9944b12867f9199b3020k5484g529o5225C951J20065c66904a54925E9268C110a19003
9931b2692H7030a32917b9047m6899c3880j30787A97684a65313E7854c41376A37285
$$ plain form
10015 262195 -90053 115437 -212767 111917 3320 76364 -322471 -280487 -345309 -117611 -26593
10003 70148 328489 -300611 -302765 -113139 -290095 -186127 -165539 -194173 124541 -16845 174105
9991 -101099 -5348 55077 -125602 135018 -166558 -330913 104384 56741 196339 -72338 12351
9979 -1202 75446 -354898 -39125 350777 -237729 -67877 -299921 -300113 170366 61054 -166443
9967 -460438 -173334 52134 -270075 -44727 -263468 20028 -43028 -280247 3918 -35733 -4854
9955 -153767 10543 -177163 17217 250765 -276882 42290 -115092 -238914 111751 -234457
9944 -212867 -69199 -23020 -48504 -7529 -72754 3951 124016 -366904 -154925 59268 3110 -119003
9931 -22692 87030 -132917 -29047 -75946 -33880 -164667 197684 -165313 57854 -341376 137285
9919c28272N9605P2563P46h8348k2428l4537l8814l2259B0556f7522m18841c1300
9906a90843k85190B91070a10910C9117A5543b54133B1075a45139D62544i7925
9895A1918a07515j45110a4479k17190A4103h7631F5469b72208P6239e0682q0694
9884a31376B03657r5976M1941A8754i7120r629C9674a69308e1920B56546a04862
9872i7288d5214A98625r2411b2022H6704A9082e6513J250A1725a20182M177l5382
9860a51387B0906d5045C39196E565a67170M0440M3116B12835b32207A2447J62267
9849A74714j6714o1757b23690N0374C4791j7218O2807N221b10796i2891l2961
9838a25852e5164F7151a11810F2521a09583l27239a48117p1002A26905h7320q1752
$$ plain form
9919 -328272 -268667 -196104 -195358 -88348 -110776 -145313 -184127 -216386 20556 -67522 -486363 -31300
9906 -190843 -476033 291070 -110910 39117 15543 -254133 21075 -145139 462544 -97925
9895 11918 -107515 -252625 -14479 -231669 14103 -87631 65469 -272208 -195969 -50682 -131376
9884 -131376 203657 107681 149622 18754 -97120 -106749 39674 -169308 -51920 256546 -104862
9872 -97288 -45214 198625 106214 -22022 86704 19082 -56513 -55263 11725 -120182 -116005 -151387
9860 -151387 20906 -45045 339196 5565 -167170 -126730 -83614 212835 -232207 12447 174714
9849 174714 158000 96243 -223690 -173316 34791 17573 80380 85601 -210796 -92891 -125852
9838 -125852 -55164 67151 -111810 62521 -109583 -436822 -148117 -219119 126905 -87320 -169072
9827a69072f035j54953r429f5231j0682k49152A35738a73369B59414a95179A34701
9815b5719D5933b62265i9546j1389k872C0745J67435a4050k03236C0517b71887
9803D306J17186b09142g6888B11464E3811c45890A86025m8234a50090B61891a78824
9791a40936G4469a00825B24627a28072C7524c6607k15528B15553J31681j34827
9781B12407b97282J37498K1723b7102o2054B9869e3524A2782a20680J7788B56510
9769b81612B37273a51881k00417A85716a79940j32513O8942a19659M7651m09138
9759d81146i6475A21266b0761l6652j1012b6210A20907a11999A0710a66381j4102
9748a80483H6689d06212e7271o9211J7870q7463B4324P149b62856K7790a11444
$$ plain form
9827 -169072 -6035 -160988 -170417 -65231 -75913 -325065 135738 -173369 259414 -195179 134701
9815 -25719 45933 -262265 -99546 -110935 -113807 30745 198180 -14050 -217286 30517 -271887
9803 4306 121492 -209142 -76888 211464 53811 -345890 186025 137791 -150090 261891 -178824
9791 -140936 74469 -100825 224627 -128072 37524 -36607 -252135 215553 347234 212407
9781 212407 -297282 -159784 -138061 -27102 -89156 29869 -53524 12782 -120680 -102892 256510
9769 -281612 237273 -151881 -352298 185716 -179940 -312453 -243511 -119659 -72008 -481146
9759 -481146 -96475 121266 -20761 -57413 -68425 -26210 120907 -111999 10710 -166381 -180483
9748 -180483 86689 -406212 -57271 -126482 -108612 -196075 24324 31473 -262856 -235066 -111444
9736A2888e636A86588E3220A5413g6975b0199j67851j16994a41619l53594a90406
9724A57325a73715M4123K5357k92661Q1454f3524a2605C48026b16719q8463A45035
9712A36209d88289D4324a03570d8998E0321b10556f3732A79771p3634b06565l4926
9701b41491k3632B3695a29337m7698G6888a79462c2735H6496k1053b68009f9705
9689h5946n5529j96904H9005A4855h5725j479k01738D8613d24138a48257A14091
9677D2275a84633c9669m9355n4175d4842B84666e956k1937B4098d84161P5236
9666d08925I0419B7309L1583g7131d018k02823j1077A4169a45125A1375a09752
9654a30587H1078a79563n4626j34578J40990k035h3271j65584f2201E42383g2736
$$ plain form
9736 12888 -5636 186588 53220 15413 -76975 -20199 -188050 -305044 -141619 -495213 -190406
9724 157325 -173715 -129592 -104235 -396896 -315442 -63524 -12605 348026 -216719 -305182 145035
9712 136209 -488289 44324 -103570 -48998 50321 -210556 -63732 179771 106137 -206565 -241491
9701 -241491 -265123 23695 -129337 -177035 76888 -179462 -32735 86496 65443 -268009 -69705
9689 -85946 -141475 -338379 89005 14855 -85725 -87204 -288942 48613 -424138 -148257 114091
9677 42275 -184633 -39669 -89024 -143199 -44842 284666 -5956 -27893 24098 -484161 -408925
9666 -408925 90419 27309 58892 -77131 -4018 -206841 -217918 14169 -145125 11375 -109752
9654 -130587 81078 -179563 -234189 -368767 -227777 -229812 -83271 -248855 -62201 542383 -72736
9642a41059I7191Q033d7628j8138L2295k50923H7079b85321I9342c4888n6418
9631i1306a2762M11l19972A44812l6079A3765a25760A57097g7375l30472d5897
9619C04321c02898f7687k16090h4208M1031k97357J8308C3632J42590E0250R0902
9608A41152a63159j9021j7437h6996b9126C5988A5353K08696A00873c02219l6639
9597c38858R0J62592j64555Q4398F9242O1522c1512n0275A02318B9617K04867
9586B34484A5777b31059a04097j43710f9093b5021A4685L6614a33009f68G0842
9574a76572I0986c0847k3567j62931b7447A00214m7479a39799A42347d09251J50343
9563b58908J01894J685p8502A81638b0483k3134o2459H7040l6185b21147A86201
$$ plain form
9642 -141059 97191 105224 -47628 -65766 -33471 -284394 87079 -285321 99342 -34888 -91306
9631 -91306 -12762 -12351 -332323 144812 108733 13765 -125760 157097 -77375 -407847 -45897
9619 304321 -302898 -67687 -283777 -84208 -43177 -340534 -322226 33632 176222 50250 141152
9608 141152 -163159 -182180 -199617 -86996 -29126 35988 15353 224049 100873 -302219 -338858
9597 -338858 -338768 -176176 -340731 -256333 69242 130764 -31512 -81787 102318 29617 234484
9586 234484 15777 -231059 -104097 -247807 -69093 -25021 14685 51299 -133009 -668 70842
9574 -176572 90986 -30847 -54414 -217345 -27447 100214 52735 -139799 142347 -409251 -258908
9563 -258908 -157014 -155329 -233831 181638 -20483 -43617 -106076 87040 50855 -221147 186201
9551a29342J7739p0465p2329Q4234A84988b33905F5163J8324P8410C8067O8073
9540A06140m6115a42816A12103c3502C0885b91760i4352k8931j5543m51973a76160
9528E6695a91338j84509q0177a61714B72573b09199A04780d3569j63420I2881
9517e6635j00284b1007B34726i5268D7286h7892A85865a33599B19980a69149j21707
9506b90856a21990A2599b43731A68725f1804p311G3680b3112j25084h244a630
9494a27206A50616f605j28551B76502F5237i5101C41218o8221A16344m2213k7294
9483D6837j0247J5006O3937K207i3172B84163c8700A72861M3482I0115N4040c817
9470a3409k52330E0266a38514C5043R2693b13208Q9176k64266B6998D563J39884
$$ plain form
9551 -129342 -111603 -182068 -254397 -170163 184988 -233905 65163 83487 161897 38067 106140
9540 106140 60025 -142816 112103 -33502 30885 -291760 -94352 -123283 -138826 -590799 -176160
9528 56695 -191338 -375847 -456024 -161714 272573 -209199 104780 -43569 -206989 92881
9517 -56635 -156919 -21007 234726 -95268 47286 -87892 185865 -133599 219980 -169149 -290856
9506 -290856 -121990 12599 -243731 168725 -61804 -69115 73680 -23112 -148196 -8244 -1630
9494 -127206 150616 -6605 -135156 276502 65237 -95101 341218 272997 116344 74131 46837
9483 46837 36590 51596 115533 117740 -93172 284163 -38700 172861 216343 90115 144155 -3817
9470 -13409 -265739 50266 -138514 35043 127736 -213208 -124032 -388298 26998 4563 144447
9459A44447g5699l16596f2712o9991I8777K5888a61751A39962F1706a07322d85
9447b71416h8359c7426A297O7656d8941k79741C73940i891j03156l2286q301H2858
9434a68350k7711G5935O0250J2376c97585g4351j10092b050D81J23249a61075
9422h7868j27796A43224a56203j24793A5979d33323b00818h4085K3670q9476i619
9410b11206i7434d8171n8260E8204K08486a4290A54892c82903i3767K2434K4500
9399d6833P447B65607c05282J16382L3808n3824j25866b9591l10812J58452d5293
9387H7711R5732k4137a39422M4877A09123g03j64312n611H0232P967K0370a24612
9374c44632e9411j0257B10853d03251a62940j2325A07174M4704N9808i6823H9014
$$ plain form
9459 144447 -75699 -392295 -62712 -132703 98777 124665 -161751 139962 61706 -107322 -485
9447 -271416 -88359 -37426 1297 68953 -48941 -328682 373940 -9891 -113047 -145333 -153634 82858
9434 -168350 -196061 75935 136185 148561 -397585 -74351 -184443 -2050 481 123730 -161075
9422 -87868 -215664 143224 -156203 -280996 15979 -433323 -200818 -84085 -60415 -149891 -9619
9410 -211206 -97434 -48171 -106431 58204 266690 -14290 154892 -382903 -93767 -71333 -46833
9399 -46833 -39386 265607 -305282 -188900 -155092 -208916 -334782 -29591 -340403 -181951 -45293
9387 87711 183443 159306 -139422 -94545 109123 -703 -165015 -170626 80232 88199 108569 -124612
9374 -344632 -59411 -69668 210853 -403251 -162940 -175265 107174 151878 211686 -96823 89014
9362a08383j66406B41225a84187A15779K6467J6409b03536I4536B2465g5694b9285
9350D2277b738k46897A62456g4724O314k69016a03280H7463J92705G0660b72358
9338b0013o5339b2701l97739A81436d4351l35426a8535C15263d8487B5093K28911
9327B54004a95959q2172A46145b84328B92975c30240A76696f6889p2271A27699
9316A13826J88878a5185B6226R5758M3001a73496F2325a66952B20563b78197a0732
9304B87030A25605j2898c01533P1133g8336A5228h0941q8804k49894a4598q8678
9293a03276A36722b3924k66679j9929F2182j6880f5334k05886J6547P4543B36838
9281a74648A29627J76347c87124H2109a58225E9394a19989b6138q6342j58587
$$ plain form
9362 -108383 -274789 241225 -184187 115779 142246 158655 -203536 94536 22465 -75694 -29285
9350 42277 -2738 -249635 162456 -74724 -68410 -337426 -103280 87463 280168 70660 -272358
9338 -20013 -85352 -22701 -420440 181436 -44351 -379777 -18535 315263 -48487 25093 254004
9327 254004 -195959 -278131 146145 -284328 292975 -330240 176696 -66889 -139160 127699
9316 113826 302704 -15185 26226 121984 164985 -173496 62325 -166952 220563 -278197 -10732
9304 287030 125605 112707 -301533 -230400 -78336 15228 -80941 -169745 -419639 -14598 -103276
9293 -103276 136722 -23924 -290603 -310532 62182 45302 -65334 -271220 -254673 -180130 236838
9281 -174648 129627 305974 -387124 82109 -158225 59394 -119989 -26138 -112480 -271067
9271b71067O6474K0121n879J1063b9978j67248A07952a98632Q2430M9431f654
9259a47480N9980C5391P3850a23316k9996M2686k8748M1337p6433J4882j10602
9248b70190E9424J20863F2965K8327a92021j33514d7917j22903j36656A05893
9237a96142A39463C2771f9918k40545A1522b4210j24248B08838f2580p7779n6657
9226a97016B4012Q5307K2612K95502A7636e5042D30263A17742l2282j7122N0969
9215A19307e0614H3485g7675l6498k92118a50037D43495b40483m1860B14475F5338
9203b84677k64623G1879b43520h8947A0803J83767H9617g5835A92708A5559c33250
9191i2059A50189m5565a49635h443B09460A03057Q2535f4879E1509g8629I574
$$ plain form
9271 -271067 -204593 -184472 -190351 -179288 -29978 -197226 107952 -198632 -116202 -66771 -6654
9259 -147480 -87500 35391 109241 -123316 -153312 -110626 -139374 -98037 -174470 -159588 -270190
9248 -270190 59424 180287 62965 91292 -192021 -325535 -47917 -170820 -307476 105893
9237 -196142 139463 32771 -69918 -310463 11522 -24210 -148458 208838 -62580 -140359 -197016
9226 -197016 24012 109319 131931 427433 17636 -55042 430263 117742 85460 68338 119307
9215 119307 -50614 83485 -77675 -114173 -406291 -150037 443495 -240483 -282343 214475 65338
9203 -284677 -549300 71879 -243520 -88947 10803 194570 89617 -75835 192708 15559 -333250
9191 -92059 150189 104624 -149635 -8443 209460 103057 185592 -64879 51509 -78629 9574
9179b93675A09206b63408A00622E62a55523o9547A63311J3253b55851F159d8188
9167c3654o3208k23136d0095A36505b95947J24764e8662A14182i3739j8339p5846
9156a87924c5350a0809A44520I73a90834L6014B3275h15C493P1114i2938E2118
9143D1495c14065a16364c2768c689j1176A08804a95196r1596Q5119b5555E9247
9131f6297E8004Q0196a99665n1292C69693a38652c5178q8336A09151j7811f182
9119D13841b69554J05266a1333l98586a26953A26681h7734j91580A11674J30867
9109B42541L64b18992b0225l46031c1526J3882A14262b19056C3191b13103i5071
9097a82309l452N6342A01206b87604J12711A3977b07545c4396B1770b7689q7063
$$ plain form
9179 -293675 109206 -263408 100622 562 -155523 -225070 163311 176564 -255851 6159 -48188
9167 -33654 -96862 -319998 -40095 136505 -295947 -171183 -58662 114182 -93739 -112078 -187924
9156 -187924 -35350 -10809 144520 973 -190834 -154820 23275 -815 3493 74607 -92938 52118
9143 41495 -314065 -116364 -32768 -3689 -14865 108804 -195196 -286792 -201673 -25555 59247
9131 -66297 58004 138200 -199665 -250957 369693 -138652 -35178 -123514 109151 91340 -6182
9119 413841 -269554 -164288 -11333 -409919 -126953 126681 -87734 -279314 111674 242541
9109 242541 242905 -218992 -20225 -366256 -31526 -17644 114262 -219056 33191 -213103 -95071
9097 -182309 -185761 -129419 101206 -287604 -174893 13977 -207545 -34396 21770 -27689 -114752
9086a14752j3858M2667D2714G224a94863A53924a9022k07483i9412A91427d06415
9074a79951G0296a82376j70961B63933E0262K24726a91903F439J73494b27437
9063b0726B164Q0900a75422A42112i7288K8773a9246l69457n4786a8319k62920
9052b81239P6186j13652B06401F8305r762E971d12504a24034B26761A01809i3941
9040I43c21380h5252n85226A1270b66588G4999b87818J24118e9228o1242L893
9029a16577K0886g027A37161J24764j05533K4789D4096i4171n8293m16370D7272
9017D2117g423k7090j41169K385j80239A80990b82839d7245F9968e121j62741
9006a67862e278j88775j96437G1441i4062A0187b58543A04171b38219B08712l8565
$$ plain form
9086 -114752 -128610 -85943 42714 7224 -194863 153924 -19022 -226505 -99412 191427 -406415
9074 -179951 70296 -182376 -353337 263933 50262 274988 -191903 6439 179933 -227437
9063 -20726 2164 83064 -175422 142112 -97288 -68515 -19246 -388703 -443489 -18319 -281239
9052 -281239 -205053 -318705 206401 68305 58543 5971 -412504 -124034 226761 101809 -93941
9040 943 -321380 -85252 -670478 11270 -266588 74999 -287818 -163700 -59228 -120470 -116577
9029 -116577 -95691 -7027 137161 261925 156392 181181 44096 -94171 -152464 -568834 47272
9017 42117 -7423 -34513 -175682 -173297 -353536 180990 -282839 -47245 69968 -5121 -167862
9006 -167862 -5278 -194053 -390490 71441 -94062 10187 -258543 104171 -238219 208712 170147
8995A70147a10451E6193N6360J48259d8183B00525G3754e23036a6046B9205a22040
8983g661I3094J28038c00893C6811J48959a60526A26152c83112B29977C9265d8279
8971D5969i491k41886K2498A9319P2756d6203l2852h764A40301a06430R863j47154
8959b43721a16833A53902c4267j81538G819a30837N792f0194k65678B2772J8483
8948D1255d4029E6408a92370K1902j25579H2920c46065J60690b3186A03216L8603
8937A41819D3293P4039J2031J43097a93534A9761i5985j19266I9170L858J68587
8926B71615P1898L33422J030412J889574O178893N77656B540612F20364A48485
8916A68303k4223e9974l2722F2825A8182K06776d1857m5715E33636c24705j833
$$ plain form
8995 170147 -110451 56193 112553 260812 -48183 200525 73754 -523036 -16046 29205 -122040
8983 -7661 93094 221132 -300893 36811 185770 -160526 126152 -383112 229977 39265 -48279
8971 45969 -9491 -251377 -228879 19319 92075 -46203 -79055 -8764 140301 -106430 -96567 -243721
8959 -243721 -116833 153902 -34267 -215805 7819 -130837 -125045 -60194 -325872 22772 41255
8948 41255 -44029 56408 -192370 -170468 -296047 82920 -346065 -185375 -23186 103216 141819
8937 141819 43293 117332 129363 272460 -193534 19761 -95985 -215251 99170 103028 271615
8926 271615 343513 676935 1707347 3596921 9775814 10353470 2540612 620364 148485
8916 168303 144080 -59974 -92696 62825 18182 224958 -41857 -87572 533636 -324705 -326538
8905c26538A57038C7782a9008j18060A1767d9054j46054C3096b53202J6430B71990
8893f1402D5549O0097b64382a17038C4145a4213E570J57326a3147k44028B00382
8881A82555e8593l64251o7725a67100A63290c0701B82606D8305c13739E9672B785
8869b31624F8641b61341b0629k58200a3546p3268j26134A75725D9961c5622j07792
8858a43414g55B34185a56970j58345a03880F7139b76954a6788k4848j38598D33780
$$ plain form
8905 -326538 157038 37782 -19008 -137068 11767 -49054 -195108 33096 -253202 -236772 271990
8893 -61402 45549 105646 -264382 -117038 34145 -14213 5570 162896 -13147 -257175 200382
8881 182555 -58593 -422844 -490569 -167100 163290 -30701 282606 48305 -313739 59672 2785
8869 -231624 68641 -261341 -20629 -278829 -13546 -86814 -212948 175725 49961 -35622 -143414
8858 -143414 -755 234185 -156970 -315315 -103880 67139 -276954 -16788 -41636 -180234 433780
$$ [...]
##END NTUPLES=NMR SPECTRUM
##END=
