##TITLE=AC1591_HPIAH13321_8314084_4xiVm4rMRG
##JCAMPDX= 6.0         $$ Bruker NMR JCAMP-DX V2.0
##DATA TYPE= NMR SPECTRUM
##DATA CLASS= NTUPLES
##ORIGIN= BRUKER
##OWNER= Administrator
$$ 1.72 TOPSPIN		Version 2.1
$$ 2013-11-12 08:58:28.896 -0800  Administrator@X
$$ Compression mode = diff/dup
##.OBSERVE FREQUENCY= 400.02188249412
##.OBSERVE NUCLEUS= ^1H
##.ACQUISITION MODE= SIMULTANEOUS (DQD)
##.ACQUISITION SCHEME= undefined
##.AVERAGES= 64
##.DIGITISER RES= 22
##SPECTROMETER/DATA SYSTEM= spect
##.PULSE SEQUENCE= noesygpps1d.comp
##.SOLVENT NAME= COFFEE_meoh
##.SHIFT REFERENCE= INTERNAL, COFFEE_meoh, 1, 14.96086
##AUDIT TRAIL= $$ (NUMBER, WHEN, WHO, WHERE, PROCESS, VERSION, WHAT)
$$ ##TITLE= Audit trail, TOPSPIN		Version 2.1
$$ ##JCAMPDX= 5.01
$$ ##ORIGIN= Bruker BioSpin GmbH
$$ ##OWNER= Administrator
$$ $$ E:\/data/COFFEE/nmr/AC1591_HPIAH13321_8314084_4xiVm4rMRG/12/pdata/1/auditp.txt
$$ ##AUDIT TRAIL=  $$ (NUMBER, WHEN, WHO, WHERE, PROCESS, VERSION, WHAT)
(   1,<2013-11-09 15:04:55.756 -0800>,<Administrator>,<X>,<go>,<TOPSPIN 2.1>,
      <created by zg
	started at 2013-11-09 14:53:25.409 -0800,
	POWCHK enabled, PULCHK disabled,
       configuration hash MD5:
       C8 4E 4E 5D D3 5C D8 9E 9F 52 82 E0 59 8A DE 15
       data hash MD5: 64K
       31 2D EC 64 25 82 C6 83 7C F6 04 C8 4B 26 1B 7D>)
(   2,<2013-11-09 15:04:58.896 -0800>,<Administrator>,<X>,<proc1d>,<TOPSPIN 2.1>,
      <Start of raw data processing
       efp LB = 0.3 FT_mod = 6 PKNL = 1 PHC0 = 0 PHC1 = 0 SI = 128K 
       data hash MD5: 128K
       58 EF 71 FD C4 25 F8 94 21 77 3C AC 7B 6F 76 34>)
(   3,<2013-11-09 15:04:59.974 -0800>,<Administrator>,<X>,<proc1d>,<TOPSPIN 2.1>,
      <pk PHC0 = -86.53931 PHC1 = 0 
       data hash MD5: 128K
       B8 14 1D BB 82 3D 3A 6C 73 86 89 82 A1 6F 47 B2>)
(   4,<2013-11-09 15:05:00.615 -0800>,<Administrator>,<X>,<proc1d>,<TOPSPIN 2.1>,
      <abs ABSG = 1 
       data hash MD5: 128K
       6D 71 74 B5 F5 64 4A 1C 9F F3 67 B9 D8 BD 92 CB>)
(   5,<2013-11-09 15:05:00.771 -0800>,<Administrator>,<X>,<proc1d>,<TOPSPIN 2.1>,
      <abs ABSG = 2 
       data hash MD5: 128K
       66 E7 6B BB 9E C0 94 64 97 8A 02 3C F0 D1 6C AB>)
(   6,<2013-11-09 15:05:00.865 -0800>,<Administrator>,<X>,<proc1d>,<TOPSPIN 2.1>,
      <abs ABSG = 3 
       data hash MD5: 128K
       82 36 52 6D D2 A9 D6 12 E7 A8 5B 16 96 48 7A 01>)
(   7,<2013-11-09 15:05:00.943 -0800>,<Administrator>,<X>,<proc1d>,<TOPSPIN 2.1>,
      <abs ABSG = 4 
       data hash MD5: 128K
       84 38 1E EB 42 E0 DE 61 FE 17 C1 BA 91 04 A5 51>)
(   8,<2013-11-09 15:05:01.084 -0800>,<Administrator>,<X>,<proc1d>,<TOPSPIN 2.1>,
      <abs ABSG = 5 
       data hash MD5: 128K
       DB F8 23 82 3E 0E 9C BA 28 F9 E4 D7 2C EC 21 D1>)
(   9,<2013-11-09 15:05:03.974 -0800>,<Administrator>,<X>,<audit>,<TOPSPIN 2.1>,
      <user comment:
       ICON-NMR User ID: COFFEE
       data hash MD5: 128K
       DB F8 23 82 3E 0E 9C BA 28 F9 E4 D7 2C EC 21 D1>)
$$ ##END=
$$ 
$$ $$ hash MD5
$$ [...]
##$TP07= 0
##$TPNAME0= <>
##$TPNAME1= <>
##$TPNAME2= <>
##$TPNAME3= <>
##$TPNAME4= <>
##$TPNAME5= <>
##$TPNAME6= <>
##$TPNAME7= <>
##$TPOAL= (0..7)
0.5 0.5 0.5 0.5 0.5 0.5 0.5 0.5
##$TPOFFS= (0..7)
0 0 0 0 0 0 0 0
##$TUNHIN= 0
##$TUNHOUT= 0
##$TUNXOUT= 0
##$USERA1= <user>
##$USERA2= <user>
##$USERA3= <user>
##$USERA4= <user>
##$USERA5= <user>
##$V9= 5
##$VALIST= <valist>
##$VCLIST= <CCCCCCCCCCCCCCC>
##$VD= 0
##$VDLIST= <DDDDDDDDDDDDDDD>
##$VPLIST= <PPPPPPPPPPPPPPP>
##$VTLIST= <TTTTTTTTTTTTTTT>
##$WBST= 1024
##$WBSW= 4
##$XGAIN= (0..3)
0 0 0 0
##$XL= 0
##$YL= 0
##$YMAX_a= 6014085
##$YMIN_a= -11923938
##$ZGOPTNS= <>
##$ZL1= 120
##$ZL2= 120
##$ZL3= 120
##$ZL4= 120
##$ABSF1= 14.96086
##$ABSF2= -5.597322
##$ABSG= 5
##$ABSL= 3
##$ALPHA= 0
##$AQORDER= 0
##$ASSFAC= 0
##$ASSFACI= 0
##$ASSFACX= 0
##$ASSWID= 0
##$AUNMP= <proc_prof1d_extract.lims>
##$AXLEFT= 0
##$AXNAME= <>
##$AXNUC= <1H>
##$AXRIGHT= 0
##$AXTYPE= 0
##$AXUNIT= <>
##$AZFE= 0.1
##$AZFW= 0.1
##$BCFW= 0
##$BC_mod= 0
##$BYTORDP= 0
##$COROFFS= 0
##$CY= 15
##$DATMOD= 1
##$DC= 0
##$DFILT= <>
##$DTYPP= 0
##$F1P= 0
##$F2P= 0
##$FCOR= 0.5
##$FTSIZE= 131072
##$FT_mod= 6
##$GAMMA= 0
##$GB= 0
##$INTBC= 1
##$INTSCL= 1
##$ISEN= 128
##$LB= 0.3
##$LEV0= 0
##$LPBIN= 0
##$MAXI= 10000
##$MC2= 0
##$MEAN= 0
##$ME_mod= 0
##$MI= 0
##$NCOEF= 0
##$NC_proc= -2
##$NLEV= 6
##$NOISF1= 0
##$NOISF2= 0
##$NSP= 0
##$NTH_PI= 0
##$NZP= 0
##$OFFSET= 14.96086
##$PC= 1
##$PHC0= -86.53931
##$PHC1= 0
##$PH_mod= 1
##$PKNL= yes
##$PPARMOD= 0
##$PPDIAG= 0
##$PPIPTYP= 0
##$PPMPNUM= 2147483647
##$PPRESOL= 1
##$PSCAL= 4
##$PSIGN= 0
##$PYNMP= <proc.py>
##$REVERSE= no
##$SF= 400.020009694574
##$SI= 131072
##$SIGF1= 0
##$SIGF2= 0
##$SINO= 400
##$SIOLD= 131072
##$SPECTYP= <>
##$SREGLST= <1H.CDCl3>
##$SSB= 0
##$STSI= 131072
##$STSR= 0
##$SW_p= 8223.68421052631
##$SYMM= 0
##$S_DEV= 0
##$TDeff= 65536
##$TDoff= 0
##$TI= <>
##$TILT= no
##$TM1= 0
##$TM2= 0
##$TOPLEV= 0
##$USERP1= <user>
##$USERP2= <user>
##$USERP3= <user>
##$USERP4= <user>
##$USERP5= <user>
##$WDW= 1
##$XDIM= 131072
##$YMAX_p= 393637862
##$YMIN_p= -13238
##$CURPLOT= <Network HP LaserJet P1505>
##$CURPRIN= <$Network HP LaserJet P1505>
##$DFORMAT= <normdp>
##$LAYOUT= <+/1D_H.xwp>
##$LFORMAT= <normlp>
##$PFORMAT= <normpl>
##$SURQMSG= 1
$$ End of Bruker specific parameters
$$ ---------------------------------
##NTUPLES= NMR SPECTRUM
##VAR_NAME=  FREQUENCY,     SPECTRUM/REAL,   SPECTRUM/IMAG
##SYMBOL=    X,             R,               I
##VAR_TYPE=  INDEPENDENT,   DEPENDENT,       DEPENDENT
##VAR_FORM=  AFFN,          ASDF,            ASDF
##VAR_DIM=   131072,        131072,          131072
##UNITS=     HZ,            ARBITRARY UNITS, ARBITRARY UNITS
##FACTOR=    0.0627417313425164, 1,          1
##FIRST=     8223.62146879497, 3279,         -58709
##LAST=      0,             5027,            -58224
##MIN=       0,             -13238,          0
##MAX=       8223.62146879497, 393637862,    0
$$ Real data points
##PAGE= N=1
##DATA TABLE= (X++(R..R)), XYDATA
$$ [...]
67959 78613 77207 76192 76224 77242 78504 79306 79389 78795 77764 76748 75994 75026 73107 70462 68467 68151 69016
67942 69016 69846 70283 70866 71818 72641 72964 73046 73245 73614 74266 75502 77149 78279 78130 77103 76395 76746 77874
67924 77874 78992 79468 79018 77711 76050 74842 74678 75443 76398 76854 76787 76742 77159 77935 78681 79133 79090 78253 76621
67905 76621 74908 73979 73780 73426 72545 71876 72084 72553 72115 70660 69238 68587 68327 67827 67220 67161 67962 69331
67887 69331 70718 71621 71774 71362 70928 70820 70863 70791 70828 71450 72672 73926 74763 75338 76040 76845 77290 76987 75976
67868 75976 74628 73444 72962 73625 75420 77652 79233 79383 78108 76014 73737 71617 69825 68553 67946
67853 67946 67898 68104 68359 68669 68985 68944 68121 66553 64810 63416 62362 61396 60664 60688 61592 62678 63084 62757
67835 62757 62507 63068 64330 65566 66244 66478 66777 67540 68832 70520 72464 74531 76566 78505 80451 82462
67819 82462 84247 85346 85734 85932 86283 86371 85561 83947 82275 80893 79386 77442 75514 74195 73396 72723
67803 72723 72348 72678 73253 72812 70853 68439 66932 66350 65646 64327 62975 62103 61284 59896 58193 57055
67787 57055 56833 56983 56845 56375 55960 55856 55963 56002 55751 55277 55034 55544 56832 58324 59419 60015 60366 60686
67769 60686 61200 62350 64469 67145 69294 70071 69624 68869 68674 69285 70289 71009 71121 71015 71386 72354 73223
67752 73223 73284 72647 72045 71969 72269 72526 72468 72041 71327 70510 69756 69047 68235 67270 66261 65330 64497 63676 62696 61405
67732 61405 59904 58584 57721 57143 56543 56085 56342 57552 59175 60351 60634 60262 59915 60253 61356 62469 62546
67715 62546 61271 59365 57753 56656 55711 54674 53670 52877 52365 52214 52466 52918 53264 53484 53881 54576 55209
67698 55209 55319 54923 54507 54466 54712 54918 54973 54985 54849 54178 52920 51776 51543 52115 52636 52695 52781 53311 53856 53890
67678 53890 53811 54403 55505 56087 55763 55410 55932 57077 57984 58434 58994 60129 61752 63558 65373 67092 68631
67661 68631 70037 71404 72593 73238 73102 72322 71281 70324 69654 69402 69718 70727 72265 73673 74150 73529 72587
67644 72587 72256 72603 72918 72844 72925 73749 74884 75208 74229 72611 71301 70561 70151 70105 70778 72142 73461 73856
67626 73856 73025 71436 70042 69797 71028 73066 74755 75547 75844 76113 76120 75439 74405 73912 74356 75321 76416
67609 76416 77767 79464 80996 81683 81482 81010 80857 81102 81444 81571 81385 80961 80348 79437 78164 76781 75740
67592 75740 75209 74859 74179 72908 71185 69439 68061 67012 65763 63930 61896 60483 59979 59908 59796 59684
67576 59684 59745 59882 59989 60156 60323 60156 59640 59379 59819 60534 60779 60472 60014 59411 58270 56635 55200 54552
67558 54552 54688 55318 56143 56749 56785 56451 56365 56719 56929 56371 55195 54133 53740 54063 54845 55767 56567 57112 57432
67539 57432 57663 57979 58468 58956 59101 58883 58793 59196 59639 59295 58082 56793 55988 55363 54490 53629 53276 53291 53030
67520 53030 52270 51457 51012 50806 50488 50028 49762 49932 50396 50776 50875 50784 50551 49955 48870 47730 47234 47509 47910
67501 47910 47805 47243 46690 46422 46421 46609 46869 47058 47247 47804 48947 50384 51646 52595 53336 53802 53849 53703 53912
67482 53912 54755 55912 56763 56854 56154 55065 54150 53623 53121 52200 51018 50279 50495 51552 52957 54173 54706
67465 54706 54194 52723 50905 49487 48883 49045 49628 50249 50765 51374 52280 53190 53391 52543 51276 50782 51727 53629
67447 53629 55290 55815 55288 54585 54536 55199 55942 56214 56152 56304 56798 57042 56465 55410 54935 55543 56425 56312 54958
67428 54958 53380 52613 52653 52841 52871 52980 53308 53522 53200 52343 51419 50971 51180 51714 52032 51861 51321 50572 49624
67409 49624 48681 48379 49223 50854 52263 52807 52742 52692 52964 53460 53931 54065 53639 52878 52494 53023 54170 55105 55398
67390 55398 55377 55503 55681 55411 54472 53227 52283 52013 52373 52919 53046 52502 51787 51710 52366 52926 52835 52833 54057 56266
67370 56266 57815 57725 56956 57051 58115 58926 58759 58146 57803 57661 57340 56971 57021 57500 57821 57427 56347 55154 54525
67351 54525 54836 56045 57762 59361 60209 60147 59839 60280 61703 63264 64078 64193 64131 63864 62999 61758 60921 60730
67333 60730 60638 60404 60641 61802 63264 64023 63904 63495 63210 62971 62686 62479 62442 62522 62623 62613 62377 62088 62220 62975
67313 62975 63901 64377 64252 63660 62562 61035 59802 59771 60968 62476 63473 63839 63680 62977 62008 61570 62219 63570
67295 63570 64730 65214 65077 64426 63390 62522 62634 63891 65360 65837 65115 64142 63872 64215 64319 63721 62889 62538
67277 62538 62733 62968 62972 63080 63761 64989 66248 67015 67106 66605 65675 64615 64005 64514 66264 68489 70117 70779
67259 70779 70992 71303 71553 71243 70263 68955 67646 66535 65874 65867 66362 66956 67434 67847 68219 68501 68741 69016 69195
67240 69195 69127 68987 68982 68719 67476 65321 63438 63005 64115 66097 68405 70700 72465 73189 72929 72186 71261
67223 71261 70179 69161 68625 68619 68722 68714 68888 69475 70155 70576 70994 71859 72866 73046 72050 70826 70601 71412 72139
67204 72139 71991 71439 71431 72101 72776 73104 73565 74653 76016 76836 76898 76848 77379 78447 79393 79627 79052 78042 77232
67185 77232 77252 78357 80150 81763 82495 82272 81437 80255 78880 77795 77807 79232 81238 82460 82349 81642 81378
67168 81378 81824 82532 83138 83696 84298 84794 85023 85105 85342 85865 86442 86599 85996 84789 83661 83360 84118 85508
67150 85508 86862 87742 88083 88045 87904 87991 88541 89506 90579 91468 92096 92509 92710 92768 92997 93724 94787 95519 95447
67131 95447 94862 94487 94733 95503 96517 97528 98282 98687 99011 99595 100333 100875 101360 102442 104412 106799 109112
67114 109112 111456 113938 115902 116484 115788 114873 114549 114712 114997 115485 116420 117590 118419 118669 118754 119301 120489
67097 120489 121927 123160 124124 124891 125133 124333 122741 121615 122011 123625 125312 126595 128016 130117 132715
67082 132715 135306 137508 138905 139089 138290 137491 137485 138136 138910 139724 140842 142338 144200 146679 149870 153092
67066 153092 155375 156607 157612 158991 160470 161607 162565 163730 164956 165752 166069 166435 167228 168232 169058 169727
67050 169727 170609 171922 173579 175510 177806 180406 182843 184589 185597 186297 187127 188336 190174 192793 195754
67035 195754 198075 199139 199350 199522 199899 200250 200745 202049 204413 207284 210055 212740 215579 218344 220499
67020 220499 221892 222934 224220 226246 229288 233135 237012 240160 242553 244786 247275 249889 252385 254776
67006 254776 257160 259451 261496 263241 264635 265653 266569 267951 270129 272887 275897 279190 282876 286657
66992 286657 290065 293077 296062 299136 302041 304726 307565 310862 314515 318328 322226 325982 329223 332062
66978 332062 335301 339503 344199 348496 352247 355991 359918 363611 366936 370508 374999 380391 386170 391959
66964 391959 397716 403598 409787 416246 422574 428413 434056 440163 446770 453112 458686 463984 469757 476070
66950 476070 482574 489249 496204 503076 509454 515779 523046 531543 540560 549466 558416 567777 577494 587343
66936 587343 597291 607265 617055 626890 637640 649899 663127 676248 688941 701811 715372 729435
66924 729435 743578 757770 772279 787207 802368 817517 832650 848133 864538 882221 901014
66913 901014 920400 939969 959649 979584 999996 1021142 1043231 1066279 1090157 1114742 1139929
66902 1139929 1165570 1191578 1218089 1245272 1272935 1300584 1328086 1356083 1385501 1416647 1448975
66891 1448975 1481742 1514675 1548038 1582256 1617673 1654487 1692571 1731364 1770162 1808719 1847423
66880 1847423 1886750 1926701 1966930 2007228 2047560 2087703 2127279 2166283 2205267 2244758 2284624
66869 2284624 2324127 2362432 2398974 2433596 2466610 2498485 2529197 2558073 2584616 2609313 2633173
66858 2633173 2656422 2678053 2696727 2711753 2723143 2731155 2736137 2738482 2738343 2735508 2729805 2721551 2711298
66845 2711298 2699220 2684973 2668117 2648427 2625833 2600336 2572073 2541304 2508331 2473597 2437806
66834 2437806 2401597 2364969 2327328 2288350 2248591 2208966 2169693 2130079 2089360 2047567 2005446
66823 2005446 1963773 1922832 1882381 1841921 1801022 1759649 1718299 1677828 1638981 1601959 1566289
66812 1566289 1531196 1496247 1461666 1427874 1394706 1361393 1327591 1294158 1262478 1232986 1204829
66801 1204829 1177125 1150041 1124224 1099545 1075103 1050462 1026202 1002990 980601 958372 936297
66790 936297 915115 895253 876197 857067 837573 818208 799647 782145 765386 748847 732346
66779 732346 716333 701498 688065 675591 663502 651609 639908 628142 615902 603136 590274
66768 590274 577788 565860 554498 543733 533592 524047 515080 506606 498251 489436 479925 470178 461008
66755 461008 452881 445690 439084 432811 426734 420650 414291 407572 400856 394824 389868 385652 381515 377198
66741 377198 372768 367810 361376 353232 344650 337275 331356 325862 320285 315497 312423 310573 308449 305096
66727 305096 300729 296089 291718 287841 284481 281494 278673 275874 272992 269920 266614 263088 259262 255049
66713 255049 250757 247069 244270 241778 238862 235635 232826 230707 228837 226914 225175 223710 221935 219232
66699 219232 215800 212446 209720 207597 205810 204093 202194 200020 197822 195938 194293 192429 190084 187564
66685 187564 185406 183820 182549 181206 179647 178037 176578 175168 173367 170775 167459 163990 161064 159033
66671 159033 157709 156579 155317 154120 153446 153380 153462 153200 152541 151669 150615 149352 148117 147224 146549 145538 143827
66654 143827 141583 139207 136946 134921 133267 132049 131178 130495 129833 128969 127766 126422 125328 124533 123630 122336
66638 122336 120946 119946 119395 118971 118475 117995 117668 117583 117811 118190 118160 117185 115342 113190 111066 108908 106840
66621 106840 105455 105201 105755 106325 106371 105831 104848 103687 102850 102849 103678 104698 105226 105142 104793 104393 103771 102785 101740
66602 101740 101097 100832 100381 99385 98150 97130 96242 95110 93789 92733 92089 91598 91280 91638 92876 94419
66586 94419 95528 96017 95981 95275 93785 91968 90540 89644 88779 87479 85749 83927 82446 81600 81228 80805 80227
66569 80227 80154 81039 82094 82068 80982 80239 80756 81823 82238 81902 81694 82173 83003 83475 83136 82025 80538 79046
66551 79046 77573 76120 75252 75770 77547 79275 79839 79472 79108 79101 79206 79405 79863 80207 79663 78090 76294 75156
66533 75156 74864 75037 75162 74823 73906 72719 71619 70538 69245 67962 67272 67359 67828 68366 69090 70146 71405
66516 71405 72705 73904 74546 74047 72554 71172 70932 71771 72834 73469 73516 72926 71573 69470 66921 64447
66500 64447 62628 61847 62013 62680 63540 64556 65540 65978 65592 64746 63998 63504 63218 63309 63897 64595 64825 64544 64145
66481 64145 63736 63099 62398 62306 63138 64337 65175 65648 66245 67085 67749 67931 67826 67716 67473 66724 65475 64307
66463 64307 63832 64004 64109 63478 62125 60606 59380 58466 57704 57102 56804 56822 56970 57066 57071 57021 56930 56855 56989 57508
66443 57508 58286 58922 59199 59444 60240 61771 63565 64893 65267 64610 63243 61822 60977 60757 60555 59822 58786
66426 58786 58205 58464 59196 59784 60000 60032 60107 60283 60533 60823 61070 61106 60766 60070 59333 59010 59286 59819 60030 59721
66406 59721 59324 59384 59855 60107 59702 58981 58664 58925 59124 58552 57230 55818 54916 54668 54940 55541 56267 56940 57557
66387 57557 58215 58870 59302 59400 59292 59181 59162 59214 59144 58647 57707 56964 57228 58511 59931 60752 61042 61035 60465 59142
66367 59142 57777 57351 57755 57824 56903 55640 54945 54802 54609 54179 53801 53594 53436 53478 54117 55267 56134 55957 54770
66348 54770 53200 51820 50971 50987 52031 53635 54820 55072 54983 55540 56821 57852 57847 57202 56880 57109 57154 56418
66330 56418 55313 54800 55309 56362 57222 57628 57832 58133 58609 59265 60130 60969 61163 60283 58805 57807 57748 57954
66312 57954 57593 56811 56443 56799 57300 57308 56820 56223 55769 55473 55249 54940 54435 53882 53596 53696 54033 54526 55259 56152
66292 56152 56908 57439 58015 58728 59155 58859 57964 56948 56125 55710 55981 56833 57395 56814 55424 54472 54509 54718 54144
66273 54144 53035 52421 52794 53767 54823 55811 56716 57471 58079 58547 58626 58016 56888 55844 55229 54859 54552 54450
66255 54450 54520 54233 53257 52187 51963 52701 53641 54236 54652 55133 55564 55990 56971 58830 60893 62085 62136 61726
66237 61726 61504 61462 61258 60634 59418 57625 55879 55231 56079 57434 57796 56781 55481 55069 55483 55823 55740 55813
66219 55813 56502 57357 57674 57531 57509 57608 57224 56369 56152 57444 59543 60828 60551 59372 58319 57891 58211 59320
66201 59320 60964 62550 63653 64308 64622 64459 63794 62990 62378 61843 61185 60659 60703 61251 61741 61761 61381 60875 60487
66182 60487 60436 60731 60956 60606 59752 59069 59037 59453 59867 60141 60314 60282 60021 59918 60402 61302 61987 62126 61929 61669
66162 61669 61436 61448 62041 63046 63657 63316 62372 61445 60554 59459 58496 58268 58573 58554 58015 57754 58212 58620 58076
66143 58076 56865 55959 55667 55588 55628 56191 57358 58631 59631 60447 61118 61345 60961 60245 59583 59200 59356 60297
66125 60297 61778 63082 63863 64525 65431 66166 66106 65445 65001 65050 64933 63995 62482 61184 60465 60004 59519 59352
66107 59352 60043 61446 62669 63081 63061 63414 64322 65333 66293 67598 69368 70903 71429 71041 70535 70464 70748 71093
66089 71093 71399 71706 71944 71864 71225 70165 69370 69615 70967 72619 73652 73849 73642 73561 73888 74573 75204 75255 74642
66070 74642 73892 73494 73305 72896 72295 71943 72042 72372 72775 73359 74080 74485 74157 73247 72349 71927 72039 72572 73479
66051 73479 74640 75662 76109 76048 76054 76417 76620 76038 74981 74434 74706 75069 75032 75222 76384 78056 79058 79003 78531
66032 78531 78082 77303 75879 74292 73343 73310 73828 74342 74473 74259 74274 75267 77433 80176 82686 84661 86360
66015 86360 88108 89808 90861 90702 89596 88735 89071 90131 90497 89571 88353 88225 89516 91586 93832 96013
65999 96013 97924 99441 100876 102749 105127 107619 110055 112714 115705 118579 120905 122894 125056 127368
65985 127368 129235 130231 130539 130564 130436 130047 129281 128037 126271 124243 122506 121315 120199 118462 116016 113327
65969 113327 110644 107793 104802 102179 100305 98901 97424 95671 93795 92086 91017 91113 92341 93876 94908
65954 94908 95436 95926 96482 96899 97240 97743 98299 98709 99397 101107 103749 106233 107746 108647 109753 111256 112830
65937 112830 114426 116364 118696 120872 122152 122241 121554 120903 120895 121565 122640 123949 125378 126606 127301 127563 127814
65920 127814 128272 128966 130205 132415 135413 138477 141439 145061 149878 155174 159677 162935 165414 167500 169064
65905 169064 169939 170248 170188 169870 169459 169139 168844 168324 167500 166553 165680 165032 164841 165201 165607 165097 163164 160363
65887 160363 157724 155604 153389 150422 147004 144118 142176 140410 137754 134131 130502 127734 125821 124196
65873 124196 122415 120353 118108 115960 114190 112741 111270 109635 108078 106836 105882 105238 105107 105436 105719
65858 105719 105624 105518 105912 106613 106919 106551 105981 105823 106248 106940 107320 106882 105682 104493 104132 104626 105340 105902
65840 105902 106632 107952 109709 111302 112344 113024 113804 114850 115806 116209 116047 115747 115680 116026 117127 119485 123108
65823 123108 127248 131157 134767 138328 141743 144810 147768 150980 154315 157449 160601 164174 167704 169992
65809 169992 170470 169755 168605 167018 164720 161941 159146 156404 153550 150742 148398 146677 145346 144064 142601
65794 142601 140962 139479 138589 138286 137975 137129 135903 134902 134512 134667 135075 135451 135721 136266 137784 140603 144269
65777 144269 148099 151966 156162 160608 164729 168283 171864 176250 181395 186370 190226 192589 193415 192559 189949
65762 189949 185961 181174 175737 169471 162748 156761 152482 149658 147347 145184 143576 142844 142907 143914 146424
65747 146424 150673 156156 162228 168644 175300 181964 188643 195772 203563 211497 218829 225250 230646 234630
65733 234630 236846 237429 236619 234157 229671 223477 216421 208971 201059 192720 184318 176096 168076 160463 153619
65718 153619 147586 142132 137320 133379 129894 125833 120801 115732 111887 109538 108062 106971 106298 106103 106098
65703 106098 105786 104778 103079 101294 100370 100803 102140 103426 104014 103777 102853 101600 100666 100612 101357 102236 102726
65686 102726 102969 103600 105149 107550 110074 111864 112717 113272 114300 116028 118321 121192 124686 128470 132100
65671 132100 135686 139854 145047 151309 158696 167274 176574 185697 194332 203151 212803 222967 232844 242114
65657 242114 250818 258598 264822 269419 272986 275951 278084 279002 278828 278213 277955 278589 280080 281810 283078
65642 283078 283641 283663 283357 282971 282831 282823 281902 278732 272974 265441 256937 247563 237292 226507 215568 204444
65626 204444 193294 182895 173861 165811 157907 149971 142478 135721 129644 124377 120234 117147 114681 112635
65612 112635 111103 109916 108676 107427 106681 106492 106100 104834 102944 101203 100078 99670 100000 100847 101542 101463
65596 101463 100721 100012 99823 100104 100627 101281 101907 102152 101693 100631 99649 99744 101565 104827 108487 111653 114267
65579 114267 116801 119487 122217 125103 128728 133654 139846 146743 153817 160999 168599 176926 185937 195231
65565 195231 204382 213232 221762 229737 236644 242059 245890 248113 248392 246290 241906 236038 229508 222535
65551 222535 214994 207066 199174 191399 183481 175541 168219 161799 155775 149765 144362 140339 137367 134371
65537 134371 131080 128283 126417 124829 122943 121359 121097 122198 123730 124934 125732 126276 126600 126673 126317 125097
65521 125097 122745 119692 116842 114744 113306 112296 111691 111488 111495 111442 111138 110427 109239 107707 106089 104544
65505 104544 103203 102341 102229 102782 103599 104388 105087 105586 105712 105659 106134 107738 110257 112744 114358 115068 115544
65488 115544 116424 117768 119293 121017 123367 126545 130054 133103 135311 136768 137598 137856 137791 137808 138110 138598
65472 138598 139086 139313 138847 137379 135124 132525 129553 125858 121712 118233 116299 115611 115218 114571 113691 112688
65456 112688 111739 111342 111887 112855 113071 112020 110527 109823 110229 111085 111789 112395 113195 114092 114679 114762 114541 114332
65438 114332 114334 114743 115811 117592 119729 121701 123231 124322 124983 125205 125278 125875 127554 130188 132898 134591
65422 134591 134664 133398 131716 130342 129157 127493 125119 122659 120939 120130 119801 119615 119574 119599 119313 118499 117564
65405 117564 117218 117738 118804 120115 121835 124186 126801 128915 130244 131305 132680 134315 135845 137325 139159
65390 139159 141430 143790 145975 147922 149230 149142 147424 144891 142630 140958 139487 137951 136469 135160 134039
65375 134039 133329 133348 133974 134652 135090 135568 136356 137208 137815 138431 139712 142028 145224 148953 152892 156733 160322
65358 160322 163857 167636 171631 175622 179761 184557 190124 195923 201537 207271 213455 219420 223824 225999
65344 225999 226422 225822 224484 222649 220912 219575 217974 215129 210987 206469 202291 198254 193784 188689 183160
65329 183160 177386 171530 165889 160740 156083 151750 147760 144459 142197 140909 140016 138880 137409 136107
65315 136107 135375 134945 134265 133326 132706 132732 132955 132628 131390 129404 127111 125099 123963 123911 124550 125213 125499 125431
65297 125431 125297 125417 125932 126693 127512 128556 130211 132413 134469 135789 136513 137120 137700 137983 137862 137400 136477
65280 136477 134915 132980 131304 130224 129504 128759 127845 126853 126042 125774 126129 126513 126148 125082 124256 124274 124538
65263 124538 123976 122361 120494 119265 118954 119331 119997 120536 120698 120572 120415 120286 120041 119695 119507 119581 119644 119410
65245 119410 119034 118915 119082 119050 118382 117254 116270 115798 115653 115472 115189 115004 114968 114816 114287 113493 112911 113033 114098
65226 114098 116068 118660 121258 122941 122967 121491 119698 118852 119126 119610 119559 119337 119811 121056 122136 122197 121376
65209 121376 120470 120030 120032 120257 120639 121213 121896 122466 122777 122995 123541 124658 126039 127022 127217 126798 126101 125122 123638
65190 123638 121753 120066 119208 119354 120287 121857 124114 126900 129511 131115 131623 131810 132366 133040 133107 132520 132091
65173 132091 132427 133206 133792 134152 134659 135245 135294 134531 133587 133457 134543 136384 138201 139598 140813 142415 144737
65156 144737 147601 150564 153389 156173 159037 161871 164505 167095 170234 174635 180636 187978 196049 204432
65142 204432 213208 222767 233325 244701 256482 268428 280647 293349 306362 318965 330368 340333
65130 340333 349138 356880 363093 367269 369557 370555 370467 368803 365072 359513 352954 346057 338837 330858 321738
65115 321738 311486 300491 289282 278243 267475 256896 246482 236467 227245 219022 211619 204705
65103 204705 198202 192258 186811 181497 176148 171109 166775 162989 159282 155596 152339 149684 147266 144768
65089 144768 142476 140994 140570 140895 141381 141489 141061 140544 140689 141732 143061 143981 144571 145402 146527 147260 147049
65072 147049 146087 144928 143887 143121 142886 143277 143810 143714 142735 141389 140384 140006 140125 140520 140996 141366 141556 141736
65054 141736 142164 142877 143643 144183 144355 144104 143421 142446 141454 140591 139653 138334 136681 135189 134384 134379 134882 135500
65036 135500 135950 136016 135494 134270 132478 130528 128875 127689 126772 125855 124928 124208 123821 123680 123646 123643 123592 123440 123364
65017 123364 123712 124558 125475 126013 126250 126623 127250 127796 128014 128127 128532 129409 130760 132558 134611 136480 137876
65000 137876 139080 140654 142754 145003 147094 149224 151769 154763 157806 160327 161769 161813 160768 159662 159568
64985 159568 160736 162591 164521 166382 168158 169556 170226 170168 169686 169124 168833 169082 169646 169711 168694 167016 165578
64968 165578 164512 163089 160890 158382 156082 153880 151628 149758 148641 147778 146411 144637 143073 141581
64954 141581 139312 136183 133463 132451 133138 134488 135513 135726 135099 134135 133606 133734 133880 133422 132597 132020 131735
64937 131735 131350 130863 130660 130737 130593 129986 129295 128988 129160 129715 130598 131691 132799 133837 134733 135168 134854 134097
64919 134097 133635 133715 133837 133548 133006 132462 131761 130776 129904 129595 129767 130187 131097 132791 134784 136188 136943 137989
64901 137989 140048 142817 145633 148389 151434 154982 159051 163690 168825 174015 178778 183169 187727 192788
64887 192788 198008 202602 205948 208059 209562 211190 213175 215123 216499 217105 217077 216642 216023 215363 214533 213147
64871 213147 210973 208198 205128 201847 198420 195247 192766 190893 189173 187480 186131 185229 184369 183182 181790
64856 181790 180424 178937 177040 174821 172668 170761 168938 166973 164669 161819 158390 154762 151540 149073
64842 149073 147349 146218 145467 144705 143599 142330 141555 141746 142785 144244 145804 147177 147919 147696 146731 145718
64826 145718 145175 145013 144845 144640 144877 145917 147411 148577 149138 149726 151196 153754 156986 160475 164073 167738
64810 167738 171555 175831 180739 185846 190476 194591 198864 203781 209176 214782 220632 226526 231628 235123
64796 235123 236975 237608 237211 235794 233567 230637 226552 220875 214146 207596 201899 196831 192263 188729 186652
64781 186652 185554 184537 183291 182195 181604 181418 181323 181212 181249 181663 182577 184106 186530 190038 194220 198218
64765 198218 201774 205776 211150 217464 223407 228579 233926 240090 246242 251113 254587 257577 260691 263668
64751 263668 265965 267373 268170 269002 270436 272242 273343 272946 271483 270027 268938 267570 265124 261261 255990
64736 255990 249578 242606 235644 228831 222131 215943 210893 207026 203776 200848 198599 197347 196820 196546 196354
64721 196354 196311 196485 196959 197690 198223 198087 197669 198101 199891 202234 204131 205642 207381 209334 211000 212378
64705 212378 213805 214912 214779 213353 211744 210631 209190 206322 202301 198399 195224 192320 189266 186261
64691 186261 183447 180485 177261 174436 172733 172000 171494 170847 170290 170030 170003 170275 171194 172946 175266 177790
64675 177790 180466 183457 186885 190843 195427 200568 206002 211572 217373 223418 229399 235002 240275 245380
64661 245380 250113 253899 256128 256329 254288 250401 245724 241208 236903 232270 227131 221836 216652 211666
64647 211666 207354 204520 203359 203157 203330 204170 206060 208468 210530 212371 215084 219373 224927 231297 238726
64632 238726 247671 257859 268300 278138 287247 295994 304641 312997 320550 326821 331495 334239 334621 332474
64618 332474 328259 322829 316803 310346 303509 296542 289817 283663 278335 273926 270251 267017 264127 261621
64604 261621 259301 256783 254048 251523 249398 247179 244288 240820 237287 233771 229862 225389 220720 216242
64590 216242 211992 208027 204733 202401 200731 199074 197158 195352 194303 194420 195616 197378 199200 201111
64576 201111 203617 206948 210585 213832 216750 220045 224018 228028 231152 233057 233985 234195 233789 232903 231638
64561 231638 229718 226518 221691 215700 209555 203974 198914 194002 189365 185720 183497 182151 180721 178924
64547 178924 177291 176181 175212 173930 172609 171963 172281 173220 174289 175198 175834 176234 176514 176574 176084 175030 174041
64530 174041 173682 173567 172760 171016 169095 167767 167114 166939 167232 167904 168557 168928 169247 169831 170692 171829 173487
64513 173487 175694 177889 179514 180814 182552 185079 188071 190999 193475 195327 196795 198522 200927 203746
64499 203746 206675 210220 215214 221556 228181 234442 240803 247867 255377 262492 268530 272942 275095 274724
64485 274724 272426 269210 265694 262063 258513 255165 251640 247319 242223 237261 233455 231109 229745 228577
64471 228577 226969 224741 222200 219800 217719 215836 214073 212601 211668 211355 211501 211792 212044 212532 213892 216372
64455 216372 219266 221482 222746 223836 225469 227355 228713 229396 230024 231023 232062 232633 232880 233513 235068 237523
64439 237523 240713 244793 250064 256461 263513 270941 279094 288652 299980 312943 327333 343261 361108
64426 361108 381293 404211 430314 460111 494083 532645 576125 624703 678411 737250 801245
64415 801245 870162 942985 1017648 1091461 1162011 1227863 1288412 1343088 1390759 1429863 1458893
64404 1458893 1476625 1482136 1475078 1456119 1426851 1388994 1343643 1291274 1232318 1167622 1098465 1026393
64392 1026393 953110 880466 810424 744805 684735 630275 580772 535785 495588 460643 430726
64381 430726 404807 381773 361099 342833 327134 313882 302640 292924 284508 277395 271456 266238
64369 266238 261268 256421 251762 247153 242272 237040 231742 226742 222322 218835 216575 215299 214173 212528
64355 212528 210561 209063 208543 208808 209264 209429 209270 209298 210331 212932 217042 222202 227995 234102 240058 245289
64339 245289 249346 251883 252507 251036 247984 244424 241172 238283 235459 232682 230274 228523 227477 226972 226689
64324 226689 226302 225739 225192 224727 224098 223126 222053 221209 220490 219549 218393 217353 216427 215153 213381 211738 211019
64307 211019 211310 211984 212343 212007 210891 209249 207632 206378 205141 203334 201046 199051 197796 196853 195636
64292 195636 194288 193395 193143 193240 193600 194560 196339 198631 200945 203080 205131 207277 209745 212813 216634 221093
64276 221093 225926 230922 235961 240999 246112 251435 256974 262495 267680 272322 276368 279816 282572 284341
64262 284341 284709 283557 281386 279110 277454 276653 276611 277026 277362 277049 275960 274479 272997 271473 269548 266739
64246 266739 262457 256325 248829 241330 235007 230000 225876 222566 220288 218789 217385 215809 214473 213748
64232 213748 213419 213048 212519 212042 211895 212290 213222 214326 215112 215444 215535 215443 214875 213598 211785 209850 208194 207126
64214 207126 206654 206243 205137 203123 200685 198345 196229 194388 193055 192277 191718 191243 191403 192925 195893 199681
64198 199681 203459 206480 208268 208978 209413 210272 211559 213069 215174 218596 223533 229520 236087 243149 250806
64183 250806 259227 268656 279044 289702 299731 308769 316767 323074 326382 325818 321676 314939 306547 297286
64169 297286 287764 278124 268124 257869 248117 239600 232391 226293 221426 217924 215345 212951 210512 208400
64155 208400 206921 205979 205403 205234 205643 206805 208821 211438 213893 215427 216082 216709 218056 220105 222385 224615
64139 224615 226793 228908 230852 232529 233840 234610 234731 234390 233954 233542 232822 231388 229381 227670 227215 228165
64123 228165 229636 230580 230872 231395 233071 236018 239757 243968 248778 254373 260631 267253 274112 281326 289038
64108 289038 297245 305874 314939 324430 334010 342941 350539 356656 361553 365422 368449 371417 375622 381683
64094 381683 388758 395579 402145 409640 418607 427930 436005 442238 446847 449701 450169 447976 443524 437319
64080 437319 429556 420339 409890 398519 386751 375434 365208 355847 346641 337481 329067 321914 315794
64067 315794 310437 306168 303348 301604 300139 298608 297265 296460 296387 297085 298301 299456 300220 301031 302732 305726
64051 305726 309724 314187 318740 323314 328253 334192 341548 350141 359513 369435 379925 391053 403056
64038 403056 416316 430733 445366 459174 471937 483908 494760 503647 510220 514817 517449 517379 514075
64025 514075 508066 500450 491975 483001 474008 465608 458081 451191 444467 437633 430843 424506 418761 413217
64011 413217 407405 401280 394896 387795 379417 370171 361427 354217 348398 343300 338544 333944 329274 324684
63997 324684 320924 318587 317427 316861 316803 317540 319023 320865 322883 325197 327877 330909 334391 338448 343030
63982 343030 348092 353781 360131 366832 373678 381054 389545 399176 409480 420174 431353 443108 455438
63969 455438 468574 482987 499031 516801 536197 556796 577930 599418 622187 647652 676481
63958 676481 708395 743115 780922 822257 867461 917266 973097 1036563 1108913 1191215 1284753
63947 1284753 1390910 1510754 1644862 1793360 1955999 2132307 2321702 2523204 2734953
63938 2734953 2954169 3177649 3402118 3624098 3839640 4044185 4232493 4399004 4538912
63929 4538912 4649240 4728599 4775914 4789826 4769452 4715200 4628563 4511558 4366762 4197612
63919 4197612 4008261 3803245 3587463 3366059 3143759 2924282 2710518 2505081 2310460
63910 2310460 2128800 1961780 1810425 1674752 1553822 1446559 1352360 1270551 1199521 1136998
63900 1136998 1081335 1032093 989251 952221 919751 890543 863724 838961 816270 795643 776703
63889 776703 758800 741417 724308 707262 690022 672614 655586 639657 625181 612095 600384
63878 600384 590439 582921 578250 576270 576420 578237 581652 586742 593348 601135 609973 619991 631099 642698
63864 642698 654125 665346 676869 688900 700789 711534 720637 728268 734642 739610 742989 744983 745945
63851 745945 745870 744346 741028 735866 728883 720037 709496 697764 685304 672083 657681 641802 624600
63838 624600 606608 588455 570503 552526 533858 514111 493763 473843 455028 437232 420098
63827 420098 403555 387750 372674 358206 344516 332135 321415 312073 303475 295382 288150 282075
63815 282075 276758 271472 266106 261333 257611 254379 250693 246561 243153 241544 241610 242355 242989 243331 243395 243131
63799 243131 242647 242263 242002 241237 239163 235668 231530 227718 224620 222006 219528 217085 214699 212251 209509
63784 209509 206456 203503 201295 200214 200072 200296 200459 200552 200787 201223 201668 201895 201825 201519 201106 200745 200574 200654
63766 200654 201008 201696 202714 203774 204357 204164 203479 202928 202860 203076 203187 203052 202791 202481 202027 201350 200558 199875
63748 199875 199441 199281 199425 199943 200744 201429 201563 201255 201324 202657 205323 208473 211111 212844 213892 214664 215549
63731 215549 216848 218608 220551 222447 224469 226874 229414 231497 233053 234789 237366 240710 244418 248384
63717 248384 252548 256316 258970 260627 262193 264208 266250 267627 268148 267920 266899 265117 263110 261586 260766
63702 260766 260317 259899 259503 259337 259661 260611 261964 263175 263935 264581 265651 267136 268568 269830 271454 273948
63686 273948 277186 280687 284218 287842 291419 294380 296137 296681 296653 296696 296802 296437 295324 293840 292493 291308
63670 291308 290070 288936 288389 288642 289451 290582 292031 293719 295236 296025 295612 293748 290637 287059 283824
63655 283824 280981 277951 274474 270972 267806 264769 261660 258865 256851 255451 254171 252969 252176 251819 251584
63640 251584 251403 251532 252041 252763 253786 255510 258059 261044 264066 267102 270267 273619 277380 281944 287359
63625 287359 293126 298832 304745 311442 319063 327262 335700 344249 352872 361699 371209 382031 394484 408567
63611 408567 424292 441751 460816 481120 502452 524938 548703 573507 598828 624126 648900
63600 648900 672551 694206 712666 726705 735755 740343 741613 740333 736653 730848 723841 716652 709590
63587 709590 702256 694065 684364 672274 657069 638875 618684 597632 576495 555823 536084 517465
63575 517465 499932 483759 469631 457933 448203 439774 432820 428291 426680 427227 428548 429903 431608
63562 431608 434415 438710 444340 450914 458083 465634 473576 482158 491657 502070 513219 525221 538633
63549 538633 553883 570805 589093 609121 631860 657887 686794 717590 749140 779931 807835
63538 807835 830670 847096 856920 860783 859838 855459 848821 840695 831778 822998 815056 807705 799814 790244
63524 790244 778421 764075 746804 726208 702364 676001 648220 620075 592332 565443 539624
63513 539624 514930 491343 468945 448020 428901 411725 396434 382934 371101 360729 351736 344317
63501 344317 338498 333632 328860 324169 320328 317574 315030 311929 308811 306864 306486 307177 308445 310029 311440
63486 311440 312176 312356 312458 312489 312161 311826 312293 313589 314775 315330 315896 317253 319262 321348 323435 325769 328188
63469 328188 330095 330923 330287 328056 324678 321119 318083 315494 313063 310923 309314 307989 306479 304778 303295
63454 303295 302280 301711 301605 302078 303146 304807 307242 310614 314716 319061 323337 327683 332677 339062 347202
63439 347202 356609 366368 376208 386881 399296 413702 429980 448212 468437 490165 512547 534680
63427 534680 555351 572954 586469 596400 604252 611256 618177 626035 636074 648879 664210 681912
63415 681912 702461 726333 753274 782399 812664 843017 872303 899210 922298 940225 952272
63404 952272 958598 959821 956568 949797 941208 932576 924506 916294 906991 896004 882614 865699 844474
63391 844474 819185 790733 760014 727987 696032 665513 636864 609501 582891 557612 535120
63380 535120 516424 501157 488112 476559 466682 458796 452750 448408 446147 446294 448431 451973 457166
63367 457166 464721 474464 485208 496153 507719 520700 535279 551286 568846 588238 609456 632438
63355 632438 657454 684809 714211 744758 775455 805539 834410 861472 885904 906460 921795
63344 921795 931249 935200 934527 929999 922468 913232 903628 894120 884096 872638 859285 844058 826978
63331 826978 807744 785885 761250 734414 706577 678974 652361 627036 603228 581334 561732
63320 561732 544511 529556 516932 506975 499658 493874 487656 479326 468323 455009 440187 425015
63308 425015 410780 398106 386615 375857 366207 358198 351305 344323 336980 330257 324936 320688 316956
63295 316956 313911 311922 310711 309673 308630 307667 306610 305298 304089 303398 302846 301474 298926 295902 293326
63280 293326 291429 289801 288106 286483 285299 284669 284390 284370 284853 285918 286975 287294 287056 287250 288322 289521
63264 289521 290010 290076 290702 292310 294579 297269 300531 304386 308410 312120 315344 318244 321257 324964 329714
63249 329714 335328 341364 347638 354289 361470 369276 377853 387261 397361 408184 420232 433945 448900
63236 448900 464057 479026 494664 512095 531365 551386 571150 590709 610833 631880 653300
63225 653300 674338 694943 715640 736602 757344 777457 797139 816710 835987 854567 872438
63214 872438 889808 906387 921258 933463 942421 947801 949288 946561 939438 928111 913319 896024
63202 896024 876707 855299 832110 808501 786127 765751 747266 730713 716633 705412 696881 690820
63190 690820 687467 687364 690890 698018 708241 720739 734892 750638 768107 787038 806969 827845
63178 827845 849880 872746 895500 917428 938535 959002 978696 997438 1015233 1031865 1046651
63167 1046651 1058988 1068801 1076075 1080246 1080514 1076508 1068174 1055233 1037279 1014466 987604 957503 924574
63154 924574 889319 852879 816790 782175 749300 717969 688266 660819 636272 614567 594966
63143 594966 576848 560306 545839 533614 523240 514144 505963 498626 492290 487229 483623 481325 479889
63130 479889 478779 477586 476198 474975 474656 475794 478161 480888 483303 485463 487859 490802 494290 498231
63116 498231 502513 506895 511131 515168 519015 522454 525237 527579 530049 532775 535108 536459 537172 538152 539724
63101 539724 541348 542450 543144 543991 545323 546929 548195 548508 547780 546660 546005 546070 546374 546357 545909 545272 544793
63084 544793 544901 545995 548153 551132 554681 558624 562656 566477 570232 574417 579193 584260 589607 595886
63070 595886 603699 612926 623147 634322 646538 659438 672478 685661 699632 715141 732743 752806
63058 752806 775387 800189 826985 856003 887656 922084 959208 998980 1041242 1085658 1132133
63047 1132133 1180929 1231961 1284338 1337132 1390151 1443330 1495807 1546548 1595678 1644221 1692510
63036 1692510 1739785 1785531 1830195 1874194 1916899 1957072 1993697 2025889 2052467 2072077 2083548
63025 2083548 2085900 2078390 2060904 2034109 1999100 1957120 1909585 1857876 1802987 1745926 1688586 1633602
63013 1633602 1582970 1537207 1496154 1460128 1429991 1406552 1390368 1381748 1380507 1385939 1397404 1414753
63001 1414753 1437947 1466498 1499499 1535842 1574247 1613519 1653159 1693393 1734226 1774861 1814440
62990 1814440 1852961 1890870 1927948 1963083 1995041 2022992 2046329 2064415 2076549 2081946 2079806 2069646
62978 2069646 2051444 2025213 1990557 1946984 1894750 1835250 1770614 1702952 1633808 1564202 1495185
62967 1495185 1428151 1364287 1303865 1246688 1193239 1144665 1101318 1062092 1025758 992274 962095
62956 962095 934748 909053 884465 861267 839506 818643 798349 778815 760058 741623 723282
62945 723282 705422 688377 671884 655613 639857 625267 612177 600581 590519 582043 574886 568586
62933 568586 563000 558423 555074 552660 550602 548601 546803 545397 544249 543095 541985 541262 541066 541086 540935
62918 540935 540503 539729 538184 535277 530971 526121 521939 519075 517160 515186 512372 508670 504496 500143 495731
62903 495731 491569 488159 485698 483866 482222 480540 478660 476383 473765 471269 469385 468292 467943 468185 468602
62888 468602 468655 468208 467654 467298 467000 466624 466354 466244 465939 465280 464722 464665 464814 464791 464913 465635 466592 467007 466858 466742
62868 466742 466705 466083 464574 462644 460745 458919 457311 456313 455922 455699 455640 456366 458030 459707 460415 460225 459861
62851 459861 459692 459672 459891 460506 461284 461710 461474 460541 459005 457254 456077 455987 456496 456477 455329 453469 451645 450112
62833 450112 448618 446948 445229 443778 442796 442270 442048 441914 441573 440835 440005 439920 441258 443803 446667 449227
62817 449227 451594 454200 457253 460630 463960 466773 468916 470896 473449 476715 480300 484191 488969 494845
62803 494845 501114 507113 513250 520460 528878 537746 546555 555709 565944 577573 590445 604340 619238
62790 619238 635369 653145 673026 695549 721488 751694 786472 825323 867644 913624 964097
62779 964097 1019544 1079620 1143671 1211380 1282688 1357252 1434071 1511557 1587921 1661549 1730943
62768 1730943 1794272 1849241 1893733 1926476 1946818 1954080 1947684 1928009 1896573 1855061 1804446 1745346
62756 1745346 1678940 1607229 1532477 1456703 1381566 1308340 1237775 1170130 1105508 1044160 986486
62745 986486 932803 883172 837473 795671 757945 724449 694927 668630 644768 623067 603833
62734 603833 587439 573748 562024 551476 541848 533467 526685 521441 517452 514666 513239 513070 513702 514891
62720 514891 516997 520577 525709 532032 539337 547770 557449 568291 580421 594459 611151 630818 653385
62707 653385 678762 706957 737999 772113 809926 852225 899443 951573 1008493 1070072 1136015
62696 1136015 1206003 1279988 1357844 1438540 1520109 1600724 1679444 1755554 1827541 1893091 1949803
62685 1949803 1995490 2028129 2046250 2049512 2038430 2013516 1975119 1924147 1862462 1792330 1715803
62674 1715803 1634750 1551089 1466674 1383113 1301832 1224144 1151059 1083098 1020307 962332 908595
62663 908595 858727 812877 771305 733685 699222 667600 639336 614912 593868 575068 557607
62652 557607 541158 525732 511538 498929 488045 478434 469323 460370 451984 444822 439053 434105 429114
62639 429114 423695 418304 413684 409953 406502 402935 399789 398002 397848 398686 399626 400140 400141 399841 399596 399565 399414
62622 399414 398587 396944 394972 393341 392498 392730 394340 397439 401646 406240 410742 415285 420356 426165 432423
62607 432423 438823 445690 453911 464103 476001 488797 501973 515745 530810 547905 567482 589517
62595 589517 613605 639456 667323 697717 730677 765507 801342 837643 873905 909113 941850
62584 941850 970924 995557 1014946 1028085 1034298 1033671 1026647 1013387 994036 969509 941476 911257
62572 911257 879150 845111 809765 774361 739971 707156 676254 647474 620711 595722 572617
62561 572617 551833 533558 517490 503257 490791 480165 471360 464271 458613 453732 448871 443852 439183
62548 439183 435357 432347 429965 428302 427462 427204 427227 427615 428625 430185 431971 433846 435880 437991 439906
62533 439906 441471 442798 444152 445919 448581 452473 457617 464001 471875 481565 493085 506215 520858
62520 520858 537079 554982 574880 597399 623015 651624 683004 717599 756175 798612 843622
62509 843622 889933 937212 985404 1033534 1079658 1121861 1158897 1189984 1214459 1231820 1241870
62498 1241870 1244742 1240869 1230919 1215588 1195432 1171104 1143811 1115419 1087969 1063069 1041643 1023993
62486 1023993 1009930 999074 991433 987825 989517 997234 1010581 1028502 1050097 1074798 1101885 1130258
62474 1130258 1158804 1186757 1213486 1237979 1258636 1273679 1281947 1283450 1278908 1268473 1251072 1225525
62462 1225525 1192300 1153645 1111863 1067999 1022430 975974 929751 884333 839880 797054 757147
62451 757147 721196 689489 662071 639155 620770 606364 595056 586191 579511 575035 572925 573208 575440
62438 575440 578770 582557 586851 592128 598612 605917 613177 619372 623587 625181 623867 619712 613071 604497
62424 604497 594578 583807 572519 560917 549145 537425 526111 515480 505458 495690 485978 476509
62412 476509 467662 459803 453280 448263 444325 440512 436159 431462 426958 422707 418436 414312 410983 408798
62398 408798 407443 406487 405893 405794 406064 406396 406720 407373 408846 411319 414387 417312 419621 421357 422713 423752
62382 423752 424768 426555 429820 434446 439735 445264 451022 456918 462872 469460 477706 487968 499489 511308
62368 511308 523166 535295 547912 561366 576340 593390 612518 633563 656803 682782 711727
62357 711727 743505 778058 815559 856157 899702 945589 992716 1039755 1085567 1129096 1168848
62346 1168848 1202956 1230117 1250119 1263187 1269302 1268633 1262143 1250979 1235359 1214770 1189287 1160044
62334 1160044 1128283 1094590 1059470 1024195 990520 959638 931706 906339 883342 862888 845136
62323 845136 829755 815900 802674 789541 776230 762326 747231 730562 712421 693208 673286
62312 673286 652956 632625 612900 594395 577423 561859 547351 533737 521268 510416 501506 494448
62300 494448 488729 483713 479120 475261 472627 471284 470893 471280 472567 474599 476738 478584 480614 483659 487907
62285 487907 492843 498012 503461 509491 516472 524821 534628 545185 555382 564833 574259 584548 595753
62272 595753 607266 618656 629969 641364 652899 664730 677249 690852 705677 721617 738616
62261 738616 756858 776638 798049 821036 845930 873735 905504 941316 980174 1021015 1063539
62250 1063539 1107863 1153596 1199490 1243723 1284214 1318875 1346098 1365239 1376521 1380478 1377612 1368424
62238 1368424 1353257 1331909 1303709 1268322 1226488 1179819 1129989 1078302 1025949 974295 924745
62227 924745 878372 835779 797192 762556 731630 704148 679960 658897 640510 624098 609129
62216 609129 595603 583889 574190 566279 559752 554326 549737 545481 540947 535946 530951 526676 523477 521267
62202 521267 519905 519413 519782 520711 521706 522449 523149 524555 527525 532366 538557 545259 552153 559597 567998 577275
62186 577275 587037 596977 606902 616653 626319 636281 646690 656982 666289 674320 681493 688283 694880 701525
62172 701525 708712 716875 726261 737368 751071 767937 787637 809415 833035 858935 887498 918511
62160 918511 951343 985344 1019869 1053953 1086088 1114435 1137445 1154432 1165516 1171021 1171103 1165987
62148 1165987 1156238 1142506 1125079 1103911 1079140 1051514 1022339 992987 964290 936421 909569
62137 909569 884661 862945 844732 829115 815297 803696 795107 789163 784415 779811 775302 770928 766192
62124 766192 760728 754953 749526 744565 739921 735938 733400 732748 733685 735421 737034 737654 736688 733947 729504
62109 729504 723607 716877 710357 704925 700597 696535 691733 685587 677999 669257 659840 650203 640807 632337
62095 632337 625608 620917 617743 615446 614095 614185 615656 617771 620030 622734 626499 631598 637933 645263 653306
62080 653306 661987 671747 683180 696140 709678 723196 737237 752697 769605 787192 804856 822521
62068 822521 840301 858421 877344 897336 917903 938246 958390 979286 1001698 1025371 1049274
62057 1049274 1072057 1092177 1108321 1120115 1128043 1132439 1133036 1129616 1122458 1111716 1096974 1077962
62045 1077962 1055181 1029267 1000175 967731 932690 896503 860135 823813 787821 752866 719581
62034 719581 688234 659043 632341 608314 586963 568320 552363 538734 526951 516793 508069 500161
62022 500161 492381 484768 477898 471908 466326 460935 456071 451856 447831 443726 440002 437169 435050 433129
62008 433129 431234 429467 427829 426386 425528 425631 426631 428240 430341 432906 435813 439068 442940 447446 451843
61993 451843 455032 456465 456494 455897 455150 454005 451698 447788 442765 437479 432035 425740 418281 410328 402733
61978 402733 395756 389416 383897 379113 374496 369838 365805 362914 360536 357694 354398 351316 348494 345508
61964 345508 342726 341238 341309 341799 341536 340564 339767 339866 341055 342986 344774 345530 345314 345245 346407 349016 352725
61947 352725 357222 362197 367240 372278 377811 384290 391495 398925 406710 415687 426494 438816 451649
61934 451649 464205 476376 488295 499665 509906 519017 527753 536607 545013 552094 557821 562731 566660
61921 566660 568598 567963 565305 561554 557139 552105 546587 540864 535362 530807 527956 526969 527470 529397 533209
61906 533209 539002 545965 553111 560123 567182 574366 581573 588511 594359 597941 598779 597612 595385 592134
61892 592134 587413 581392 574744 567702 560100 552345 545471 539930 534966 529592 523790 518303 513392 508256
61878 508256 501747 493523 484437 475862 468693 462948 458120 453629 449012 444052 438969 434341 430686 428239
61864 428239 427193 427754 429813 432831 436356 440423 445242 450744 456827 463823 472327 482570 494247 506941
61850 506941 520477 534904 550321 566605 583192 599309 614630 629507 644339 658882 672481
61839 672481 684621 694877 702524 706804 707630 705677 701772 696597 690897 685402 680341 675427 670624 666724
61825 666724 664916 665893 669530 675241 682434 690566 698940 706625 712736 716757 718492 717712 714087 707525 698357
61810 698357 687026 673862 659322 644190 629188 614602 600517 587224 575003 563751 553174
61799 553174 543235 534002 525206 516488 508038 500512 494172 488579 483239 478209 473808 470047 466553 462958
61785 462958 459275 455965 453572 452096 450822 449006 446643 444270 442208 440418 438967 438105 437844 438004 438649
61770 438649 439881 441121 441372 440539 439818 440266 441558 442717 443549 444643 446300 448326 450708 453632 456702
61755 456702 458930 459910 460423 461470 463073 464483 465374 466250 467628 469177 469955 469387 467794 465897 463995 461794
61739 461794 458945 455451 451506 447327 443382 440459 439025 438625 438338 437870 437757 438419 439478 440285 440782 441430
61723 441430 442485 443707 444758 445576 446337 447296 448706 450686 453051 455361 457151 458099 458088 457330 456329 455475
61707 455475 454591 453107 450690 447521 443952 440203 436505 433207 430482 428105 425756 423305 420610 417292
61693 417292 413153 408720 404898 402019 399545 396790 393593 390253 387093 384294 381893 379752 377678 375694
61679 375694 374026 372760 371687 370554 369215 367489 365215 362674 360594 359438 358860 358137 356949 355546 354357
61664 354357 353743 353880 354513 354972 354895 354844 355767 357812 360134 361917 363188 364434 365827 367130 368135 368855 369378
61647 369378 369780 370166 370616 371095 371499 371813 372195 372881 374008 375461 376921 378173 379306 380458 381407 381668 381159
61630 381159 380524 380557 381261 381669 380635 377828 374021 370506 368210 367129 366460 365274 363237 360814 358733 357254
61614 357254 355987 354420 352421 350159 347796 345514 343615 342137 340455 337810 334340 331055 328521 326105
61600 326105 322936 319123 315420 311992 308323 304362 300952 298822 297605 296249 294155 291625 289379 287863
61586 287863 287007 286502 286284 286676 287878 289410 290297 289858 288116 285511 282578 279904 277991 276829 275910 274910
61570 274910 274163 274170 274878 275789 276699 277857 279329 280635 281339 281805 282882 284793 286673 287476 287148 286635 286853
61553 286853 287933 289424 290773 291564 291716 291706 292240 293469 294784 295626 296112 296588 297055 297482 298261 299627 300913
61536 300913 301217 300697 300445 301031 301958 302700 303418 304320 305078 305347 305293 305109 304545 303444 302257 301367 300380 298754
61518 298754 296890 295794 295746 296004 295901 295566 295396 295310 294859 293837 292553 291623 291543 292287 293296 294038 294546 295195
61500 295195 295993 296382 295842 294483 292988 292099 292159 292929 293761 294113 293996 293917 294406 295658 297475 299411 301073
61483 301073 302460 303926 305595 306960 307367 306837 306107 305867 306275 307233 308728 310655 312613 314205 315380 316301
61467 316301 316977 317300 317396 317667 318403 319477 320513 321242 321638 321750 321545 321007 320349 319969 320083 320420 320399 319622 318122
61448 318122 316232 314354 312903 312243 312410 313003 313504 313799 314193 314903 315726 316407 317118 318306 320038 321848 323342
61431 323342 324705 326351 328233 329811 330641 330734 330326 329621 328899 328588 328944 329719 330432 331029 332091 334208 337210
61414 337210 340185 342343 343685 344673 345400 345524 345096 344989 346099 348203 349962 350115 348560 346391 344970 344775
61398 344775 344948 344147 342015 339534 337756 336679 335846 335495 336207 337663 338791 339214 339617 340468 341403 342270 343743
61381 343743 346156 348577 349969 350679 351821 353634 355457 357073 358972 361290 363520 365473 367626 370206
61367 370206 372692 374624 376284 378141 380139 382016 383935 386312 389209 392223 394868 396881 398406 400121
61353 400121 402871 406873 411453 415834 419952 424181 428448 432074 434529 436008 437116 438130 438781 438787 438524
61338 438524 438879 440248 441857 442513 442108 441877 442925 444910 446611 447450 447849 448252 448545 448625 448826 449276 449289 448089
61320 448089 446065 444691 445161 447580 451591 457117 464026 471551 478785 485709 493247 502294 513090 525484
61306 525484 539175 553493 567565 581125 594795 609099 623386 636127 646156 653319 658106 661028
61294 661028 662365 662174 660447 657324 653049 647628 640753 632322 622820 612913 602901 592889 583252 574443
61280 574443 566413 558700 551103 543863 537206 531144 525817 521584 518603 516657 515485 515020 515180 515809 516974
61265 516974 518987 521867 525054 527897 530275 532540 535031 537840 540907 544133 547441 550760 553947 556653
61251 556653 558484 559377 559723 560035 560571 561322 562177 563018 563680 563923 563542 562659 561910 562059 563168 564376 564840 564739
61233 564739 564957 565943 567400 569044 571021 573427 576036 578886 582666 588067 594966 602588 610320 618097 626212
61218 626212 635031 644775 655244 665872 676241 686390 696431 706076 714876 722782 730094 736882 742808
61205 742808 747610 751638 755789 760943 767344 774450 781470 788150 794935 802341 810437 819137 828694 839426
61191 839426 851007 862418 872697 881408 888302 892903 894828 894371 892396 889580 885986 881448 876076 870052
61177 870052 863127 854782 845030 834718 824822 815627 806785 797855 788526 778541 767823 756591 745065
61164 745065 733238 721282 709920 699786 690524 681146 671378 661997 653696 646242 639054 631998 625216
61151 625216 618749 612871 608395 606004 605405 605600 605801 605667 604825 602775 599347 594884 589888 584674 579368
61136 579368 574047 568913 564471 561348 559762 559409 560163 562620 567507 574658 583043 591846 601135 611476
61122 611476 623268 636614 651489 667837 685617 704890 725733 748008 771339 795368 819954
61111 819954 845088 870703 896553 922223 947273 971393 994410 1016128 1036280 1054648 1071066
61100 1071066 1085253 1096781 1105333 1110812 1113150 1112239 1108222 1101630 1092959 1082215 1069070 1053454 1035943
61087 1035943 1017657 999762 982819 966508 950228 934030 918713 904949 892682 881520 871325
61076 871325 862233 854502 848573 844758 842578 840972 839657 839803 842721 848229 854944 861844 868873 876278
61062 876278 884249 893221 903768 916046 929765 944690 960608 976935 993138 1009619 1027445 1046962
61050 1046962 1067296 1087462 1107376 1127505 1148141 1169415 1191525 1214373 1237339 1259944 1282603
61039 1282603 1306281 1331386 1357353 1383383 1409394 1436044 1463917 1493012 1523248 1555218 1589865
61028 1589865 1627379 1667019 1708216 1751090 1795496 1840552 1886134 1934221 1987744 2048547 2117638
61017 2117638 2196978 2289454 2397131 2521125 2663668 2829183 3023201 3251609 3521215 3839462
61007 3839462 4212971 4647870 5152282 5737385 6416357 7205143 8124939 9199824 10448737
60998 10448737 11881793 13503588 15305137 17228902 19131432 20797195 22022700 22716946
60990 22716946 22938198 22845237 22617522 22405778 22314832 22380260 22531806 22589535 22331217 21600595
60980 21600595 20378819 18773033 16948310 15062154 13233621 11539481 10019872 8687210
60972 8687210 7537158 6557287 5730594 5037167 4457138 3972952 3568743 3229248 2941038
60963 2941038 2694201 2481605 2296967 2134598 1990352 1861490 1745679 1641008 1546739 1463012
60953 1463012 1389674 1325917 1270759 1223006 1180762 1141785 1104580 1068781 1034549 1002144 971913
60942 971913 943959 917682 892217 867507 844417 823573 804492 786029 767398 748633 730412
60931 730412 713599 698633 685140 672257 659450 646857 634909 623846 613658 604182 595243 586913
60919 586913 579659 573895 569332 565083 560515 555726 551092 546725 542608 538965 536141 534180 532760 531527
60905 531527 530366 529407 528888 528918 529247 529332 528742 527571 526416 525945 526394 527323 527867 527418 526074 524236 521823
60888 521823 518305 513701 509059 505400 502303 498112 491688 483587 475347 467972 461417 455211 449059 442900
60874 442900 436876 431394 426937 423601 421045 419046 417800 417480 417733 418041 418411 419345 421182 423854 427221
60859 427221 431184 435436 439573 443611 447824 451833 454476 455148 454923 455712 458435 462491 466723 470232 472369
60844 472369 472808 471971 470764 469558 467843 465177 461989 458953 455988 452343 447514 441631 435151 428615 422624
60829 422624 417559 413259 409320 405678 402618 400215 398186 396321 394621 392861 390397 386729 382094 377285
60815 377285 373022 369595 366864 364346 361521 358361 355478 353475 352166 350751 348792 346699 345102 344000
60801 344000 342802 341128 339216 337511 336069 334604 333040 331781 331349 331825 332758 333585 334090 334496 335207 336461
60785 336461 338130 339752 340783 340979 340627 340386 340774 341790 343094 344487 345991 347439 348304 348294 347915 348041
60769 348041 348918 350064 351180 352644 354768 357084 358855 359953 360683 361033 360785 360267 360169 360513 360548 359959 359408
60752 359408 359423 359451 358742 357622 357051 357255 357660 358019 358609 359261 359233 358424 357794 357945 357955 356363 352889 348465 343912
60733 343912 339450 335378 332251 330056 327854 324767 320990 317537 315189 313948 313344 312984 312842 313103 313698
60718 313698 314079 313760 313072 313029 314241 316292 318349 320042 321434 322525 323323 324200 325575 327221 328375 328686
60702 328686 328610 328732 329080 329391 329716 330424 331748 333592 335703 337806 339642 341041 341912 342135 341697 341073 341153
60685 341153 342414 344280 345626 345929 345681 345770 346766 348741 351387 354143 356483 358205 359368 360002 360168 360281
60669 360281 360953 362296 363645 364185 363701 362567 361176 359513 357194 353828 349610 345560 342833 341576 340847
60654 340847 339850 338824 338346 338319 338345 338742 340329 343154 346266 348906 351234 353532 355473 356641 357223 357527
60638 357527 357245 355885 353685 351378 349172 346648 343693 340832 338491 336591 335128 334567 335173 336340 337127
60623 337127 337275 337270 337507 337837 337944 337799 337668 337849 338456 339269 339834 339841 339441 339126 339358 340358 341980 343580 344278
60604 344278 343816 343054 343228 344678 346682 348413 349583 350143 350052 349664 349799 350985 352992 355380 358098 361071
60588 361071 363688 365339 366164 366693 366952 366579 365638 364512 363119 361109 358919 357698 357913 358915 360320 362926
60572 362926 367550 373682 380164 386735 394025 402338 411324 420734 430581 440525 449882 458331 465915 472222
60558 472222 476341 477910 477546 475907 472927 468474 463191 458138 453865 450348 447672 446283 446620 448759 452362
60543 452362 456803 461567 466753 473023 480854 490030 500073 510878 522663 535617 549892 565599 582230
60530 582230 598270 611947 622445 629985 634807 636591 634947 630036 622567 613574 604268 595612 587731
60517 587731 580065 572345 565128 559142 554506 550981 548655 547816 548283 549462 551185 554032 558634 565027 573044
60502 573044 583054 595913 612226 631968 654900 681087 710883 744472 781472 820885 861350
60491 861350 901498 940160 976376 1009419 1038960 1064938 1086946 1103784 1114040 1117173 1113585 1103444
60479 1103444 1085957 1060293 1026967 987836 944919 899721 853496 807460 762577 719691 679923
60468 679923 644324 612853 584337 557910 534060 513810 497246 483383 471217 460307 450499 441683
60456 441683 433872 427059 420964 415206 409769 404907 400659 396738 392941 389351 386220 383897 382737 382621
60442 382621 382722 382211 381176 380279 379614 378591 377053 375671 374870 374074 372582 370669 369169 368353 367888 367615
60426 367615 367614 367594 366970 365713 364540 364047 364119 364423 364995 365988 367131 367898 368158 368362 369088 370595 372796 375487
60408 375487 378443 381343 383749 385331 386232 387074 388386 390037 391448 392398 393342 394773 396563 398267 399882
60393 399882 401912 404645 407772 410888 414047 417518 421258 424945 428422 431696 434563 436710 438272 439899
60379 439899 442043 444563 447285 450541 454692 459373 463760 467543 471131 474884 478599 481927 484846 487516
60365 487516 489941 492025 493755 495189 496450 497828 499687 502211 505404 509364 514203 519682 525399 531566
60351 531566 539155 548863 560180 571793 582652 592342 600654 607207 611468 612919 611361 607230 601350
60338 601350 594195 585752 576346 567021 558484 550145 541035 531548 523439 517997 514874 512790 510707 508089
60324 508089 504658 500381 495494 490397 485725 482316 480531 479660 478771 478199 479397 483045 488244 494056 500983
60309 500983 510113 521524 534387 548171 562731 577463 591410 604185 615878 625943 633021 636141
60297 636141 635448 631501 624504 614551 602085 587606 571325 553604 535562 518856 504807 493840
60285 493840 485600 479422 474748 471243 468585 466338 464275 462659 461770 461158 459792 457166 453887 451004 449023
60270 449023 447750 446752 445716 444511 443145 441552 439398 436348 432606 428892 425754 423178 420987 419246
60256 419246 418063 417345 417037 417256 417879 418344 418237 417851 417777 418206 419000 420199 421894 423716 425010 425573 425836
60239 425836 426305 427103 428084 429009 429590 429718 429696 429948 430498 431026 431359 431573 431618 431374 431125 431535 432905 434859 436976
60220 436976 439371 442374 445941 449731 453622 457874 462795 468426 474478 480525 486416 492528 499417 507159
60206 507159 515265 523284 531204 539160 547165 555317 563913 573002 582047 590388 597851 604557 610357 614853
60192 614853 617940 619942 621195 621739 621473 620391 618608 616251 613288 609517 604955 600314 596662 594240 591897
60177 591897 588152 582715 576552 570625 565140 559996 555305 551146 547275 543400 539564 536053 533121 530920
60163 530920 529418 528228 526803 524968 522961 520860 518380 515539 513123 512003 512169 512874 513539 514064 514362
60148 514362 514202 513677 513328 513567 514254 515048 515913 517020 518395 519959 521813 524197 527227 530851 535016 539653
60132 539653 544537 549372 554053 558639 563093 567226 571011 574724 578606 582507 586053 589052 591632 594004
60118 594004 596349 599000 602435 606862 611818 616412 620118 623294 626780 630925 635100 638210 639710 640025
60104 640025 640046 640387 641144 642155 643189 643883 643685 642047 638721 633971 628599 623663 619926 617413 615499 613457
60088 613457 610937 608022 605028 602220 599623 597053 594440 592004 589892 587690 584619 580383 575610 571252
60074 571252 567731 564804 561967 558755 554819 550136 545102 540118 535091 529599 523543 517344 511444 505926
60060 505926 500732 495995 491940 488627 485906 483530 481174 478513 475501 472503 470034 468399 467724 468215 470108
60045 470108 473234 476875 480338 483719 487846 493314 499664 505731 510755 514869 518512 521745 524435 526779
60031 526779 529203 531782 534099 535694 536340 535840 533965 530765 526681 522047 516673 510151 502548 494588 487049
60016 487049 480021 472821 464734 455897 447380 440258 434733 430292 426535 423431 420810 418133 415068 411985
60002 411985 409575 408160 407566 407483 407633 407715 407497 407004 406505 406338 406795 407926 409322 410367 411015 412129 414669
59985 414669 418608 423002 427079 430805 434304 437155 438647 438568 437477 436171 435051 433996 432772 431437 430220
59970 430220 429072 427560 425373 422735 420107 417655 415352 413497 412664 413040 414218 415790 417778 420136 422130
59955 422130 422735 421693 419893 418524 418065 418181 418457 418892 419643 420535 421199 421661 422419 423717 425045 425714 425744
59938 425744 425775 426155 426588 426705 426558 426394 426378 426746 427775 429351 430938 432317 433989 436536 439929 443865 448244
59921 448244 452680 455984 457079 456371 455346 454754 454086 452957 451942 451526 451174 450318 449623 450246 452159 454171
59905 454171 455560 456784 458489 460618 462760 464712 466387 467696 468821 470208 472009 473988 476221 479340
59891 479340 483658 488482 492849 496654 500543 504912 509608 514526 519902 525889 532266 538686 544918 550799
59877 550799 556308 561723 567296 572658 576930 579663 581302 582516 583372 583475 582585 580696 577723 573672 569100
59862 569100 564915 561562 558735 556030 553548 551567 549965 548374 546771 545541 545008 545316 546828 550163 555616
59847 555616 562788 570978 579537 587546 593639 596827 597468 596847 595773 594128 591844 589585 588051 587058 585787
59832 585787 583612 580280 575632 569791 563584 558235 554476 552187 550853 550001 549219 548151 546626 544571 541792
59817 541792 538102 533726 529260 525083 520950 516320 510964 505280 500119 496221 493620 491569 489187 486122
59803 486122 482530 478661 474782 471314 468591 466500 464662 462924 461325 459727 457948 456191 454804 453675
59789 453675 452479 451510 451507 452484 453548 454234 455166 456831 458448 458904 458282 457578 457248 456965 456630 456672 457239 457979
59771 457979 458861 460464 463158 466547 470058 473571 477135 480521 483474 486083 488557 490962 493568 497073
59757 497073 501998 507946 513929 519346 524261 528837 533086 537299 542198 548215 554824 561001 566269 570988
59743 570988 575649 580261 584611 588752 592886 596894 600329 602888 604653 605879 606877 608132 610137 612860
59729 612860 615617 617740 619167 620147 620608 620176 618758 616771 614779 613183 612259 612157 612719 613411 613628 613049
59713 613049 611757 610103 608423 606771 604969 603025 601409 600748 601208 602243 602937 602622 601409 600228 600099
59698 600099 601066 602055 602055 601274 600795 601314 602698 604632 606979 609301 610702 610586 609318 607729 606192 604524
59682 604524 602590 600536 598452 596160 593453 590344 586979 583423 579610 575397 570647 565348 559750 554335
59668 554335 549554 545497 541828 538161 534534 531431 529251 527871 526960 526546 526914 527899 528717 528841 528781 529628
59652 529628 531889 535091 538487 541749 544874 547813 550538 553232 556036 558575 560071 559957 558220 555191
59638 555191 551293 546997 542590 537840 532295 526208 520727 516727 513825 511098 508466 506522 505143 503249
59624 503249 500238 496729 493401 489885 485571 480942 477208 474780 472872 470532 467472 463937 460358 457173
59610 457173 454520 452114 449853 448418 448696 450660 453355 456007 458489 460689 462131 462501 462097 461488 461159
59595 461159 461517 462700 464172 465106 465447 466054 467485 469202 470380 470961 471400 471777 471767 471185 470031 468240 465881
59578 465881 463435 461322 459315 456894 454089 451486 449451 447878 446683 446030 445912 445967 445954 446150 447040 448725
59562 448725 450758 452481 453480 453779 453601 452953 451642 449777 448023 447037 446777 446698 446620 447025 448428 450744 453444
59545 453444 456197 459196 462988 468028 474322 481493 489279 497961 508131 520144 533909 549075 564860
59532 564860 579513 590445 595633 595066 590570 584160 576901 569408 562752 558084 555461 553774 552061 550349
59518 550349 548883 547224 544796 541938 539498 537409 534546 530216 525083 520150 515397 509992 503523 496493
59504 496493 489761 483893 478974 474665 470412 465849 461032 456260 451854 448201 445665 444187 443194 442198 441310
59489 441310 440929 441180 441928 443110 444705 446590 448792 451687 455544 459954 464151 467813 471218 474729 478544
59474 478544 482841 487690 492734 497387 501401 504924 508033 510644 512912 515192 517475 519323 520628 521994
59460 521994 524032 526612 529189 531653 534396 537666 541242 544822 548419 552300 556734 561890 567778 574078
59446 574078 580148 585403 589716 593257 595886 596924 595744 592481 587952 582939 577856 573013 568703 564802
59432 564802 560738 556273 552066 549115 547801 547822 548853 550814 553573 556956 561157 566785 574329 583825 595049
59417 595049 607770 621816 637234 654424 673718 694766 716750 739297 762558 785882 806726
59406 806726 821459 827422 824316 814123 800232 786298 775014 767371 763146 762078 764229 768979 773986
59393 773986 775698 771180 759643 742453 722027 700757 680611 663093 649062 638438 630354 623919
59381 623919 618954 615851 614659 614562 614449 613822 612864 611750 610385 608924 608083 608484 609910 611557 612923 614076
59365 614076 615208 616362 617685 619537 622185 625567 629413 633401 637242 640948 645087 650427 657209 665030
59351 665030 673482 682578 692454 703023 714092 725574 737449 749789 762792 776394 789769 801770
59339 801770 811954 820672 827948 833022 835447 835922 835357 833530 829417 822590 813634 803346 792179 780377
59325 780377 768050 755117 741621 728020 714802 701989 689461 677490 666389 655874 645530
59314 645530 635838 627883 621952 617062 612070 606657 601136 595970 591831 589532 589514 591652 595742 601727 609302
59299 609302 617812 626891 636667 646831 655717 660815 660310 654084 643464 630261 615990 601714 588333
59286 588333 576693 567239 559794 554005 549881 547578 546861 547233 548576 551155 555003 559833 565642 572886
59272 572886 581845 592221 603560 615663 628403 641465 654488 667175 679102 689684 698470 705299
59260 705299 710136 712989 713936 712928 709671 704153 697209 690076 683376 677028 671085 665996 661971 658758
59246 658758 656194 654364 653032 651679 650394 650024 651041 652938 655186 658076 661998 666451 670480 673695
59232 673695 676243 678100 679061 679162 678497 676762 673559 668974 663372 656756 648874 639901 630516 621340 612697
59217 612697 604844 597919 591571 585069 578024 570873 564548 559685 556070 552868 549516 546349 544071 542670
59203 542670 541409 540006 539167 539521 540536 541166 541254 541611 542811 544545 546280 548075 550452 553682 557352 560670
59187 560670 563173 565111 567035 569140 571322 573709 576600 579834 582836 585496 588382 591727 594820 596904
59173 596904 598206 599514 601095 602584 603642 604257 604679 605453 607212 609886 612452 613938 614417 614539 614501 614056
59157 614056 613158 611901 610011 607071 603098 598315 592578 585651 577875 569905 561942 553831 545717 537950
59143 537950 530530 523401 517090 512190 508236 504042 499283 494926 491848 489833 488262 487126 486833 487416 488330
59128 488330 488837 488498 487620 487236 488257 490603 493592 497061 501553 507347 513989 520966 528285 536160 544631
59113 544631 553668 563120 572369 580553 587409 593471 599273 604764 609628 613661 616639 618397 619310 620196 621469
59098 621469 622801 623798 624404 624369 623037 620231 616873 614148 612346 610988 609749 608734 608087 607805 607745 607446
59082 607446 606199 603755 600696 597610 594156 589566 583978 578511 573875 569501 564412 558508 552561 547192
59068 547192 542356 537774 533402 529278 525262 521329 517943 515658 514259 512681 510054 506594 503249 500694
59054 500694 498924 497617 496522 495600 495072 495240 496016 496713 496613 495636 494293 493176 492738 493186 494145 494682 494207
59037 494207 493205 492571 492481 492505 492564 493021 493888 494740 495475 496489 498057 500254 503470 508170 514005 520067 526269
59020 526269 533549 542335 551712 560652 569183 577682 585755 592617 597992 601874 603935 604069 603147 602337 601869
59005 601869 601179 600079 599029 598377 598144 598556 600060 602713 606144 610123 614536 618774 621872 623568 624710
58990 624710 626282 628441 630735 632787 634363 635157 635085 634745 635089 636499 638471 640404 642495 645544 649961
58975 649961 655329 661154 667714 675859 686045 697957 710977 724718 739019 753778 768869 783966
58963 783966 798410 811558 823326 834057 843835 852292 859123 864306 867697 868905 867781 864539 859094
58950 859094 850807 839319 825249 809683 793317 776542 760001 744527 730622 718386 707739 698356
58938 698356 689655 681274 673466 666647 660838 655889 651932 649099 646999 645054 643226 641926 641300 641133 641399
58923 641399 642311 643798 645436 646952 648302 649145 648868 647456 645911 645376 645981 646870 647254 647244 647684 649381 652512
58906 652512 656618 661111 665822 671240 678240 687429 698550 710556 722519 734418 746816 759885 773131
58893 773131 786114 798858 811431 823726 836040 849298 864127 880010 895974 911808 927898
58882 927898 944031 959114 972194 983089 991762 997699 1000389 1000153 998073 995067 991215 985961 978826
58869 978826 969924 959903 949503 939276 929601 920643 912189 903769 895143 886500 878050 869691 861248
58856 861248 852747 844139 835027 825084 814523 803826 793168 782468 771817 761410 751167 740912
58844 740912 730916 721767 713667 706232 698979 691614 683870 675580 667003 658631 650591 642674 635076 628515
58830 628515 623273 618620 613691 608674 604621 602242 601344 601407 602224 603839 606245 609379 613269 617989 623499
58815 623499 629555 635716 641482 646616 651380 656183 660936 665051 668310 671313 674601 677563 678806 677677
58801 677677 674840 671257 667197 662472 656982 650611 643110 634658 626118 618198 610724 603284 596097 589538
58787 589538 583321 577103 571592 567944 566179 565279 564852 565542 567620 570414 573472 577128 581277 584666 586182
58772 586182 586031 584928 582864 579371 574311 567731 559672 550888 543003 537013 532191 527289 522209 517606
58758 517606 513521 509594 506192 504064 503079 502382 501763 501855 503002 504876 507263 510339 514052 518002 521967
58743 521967 525927 529619 532837 536079 540078 544694 549147 553375 558253 564323 571137 578071 584926 591438
58729 591438 597032 601568 605697 609993 614224 617930 621316 625038 629254 633293 636336 638318 640143 642896
58715 642896 646826 651386 656389 662540 670353 678973 686788 692919 697432 700363 701420 700595 698205 694181
58701 694181 688062 679779 669776 658205 644716 629305 612794 596171 579929 564253 549526 536389
58689 536389 525476 516998 510342 504328 498228 492269 486822 481595 476240 471186 466942 463090 459076 455673
58675 455673 454264 454662 454980 453936 452079 450445 449319 448903 450043 453416 458721 465315 472980 481517 490245
58660 490245 498498 506031 512439 516797 518470 517785 515412 511637 506684 501158 495542 489741 483697 478053
58646 478053 473596 470329 467601 464952 462410 460139 458175 456460 455044 454265 454568 455813 456972 457177 456951
58631 456951 457660 459753 462342 464608 466641 468611 470078 470638 470524 470092 469367 468505 468037 468167 468446 468582 468986
58614 468986 470128 472011 474646 478332 482927 487592 491745 495676 499672 503232 505763 507431 508758 509973
58600 509973 511316 513326 516120 518912 520871 522031 522811 523191 522986 522474 522107 522062 522577 524214 527222 531197
58584 531197 535934 542015 549869 558834 567874 576784 585940 595319 604538 613500 622240 630450 637867 644937
58570 644937 652471 660869 670139 680380 691720 704174 718047 734048 752459 772628 793814 815970
58558 815970 839024 861953 883378 902714 919927 934539 945672 952879 956232 955830 951966 945591 937968
58545 937968 929895 921705 913719 906156 898813 891231 882868 872804 859933 844043 826230 807638 788337
58532 788337 768087 747587 728095 710289 694312 680466 668917 659066 650160 642317 636160 631702
58520 631702 628352 625707 623442 620787 617110 612880 609133 606067 603053 599937 597391 595867 594979 594052 592720
58505 592720 590982 589259 588306 588506 589242 589435 588617 587097 585418 584154 583867 584590 585574 586188 586814 588287 590827
58488 590827 594123 598122 602987 608636 615025 622496 631127 640204 649217 658966 670641 684101 698026
58475 698026 711604 725049 738525 751547 763412 773349 780258 783201 782328 778645 772948 765648 757502
58462 757502 749631 742779 737226 733397 731829 732570 735284 739919 746610 754959 764113 773489 782901 791993
58448 791993 800026 806164 809678 810257 808491 805465 801311 794809 785172 773626 762313 752210 743124 735139
58434 735139 728839 724373 721402 719883 719946 721205 723138 725875 729779 734608 740082 746737 755089 764274 772750
58419 772750 780052 786607 792021 794968 794794 792153 787988 782908 777466 771991 766163 759678 753175 747532
58405 747532 742476 736977 730828 724788 719425 714881 711518 709608 708629 708005 708252 710207 713450 716765 719858
58390 719858 723231 726692 729467 731699 734322 737538 740747 743860 747304 750905 754203 757695 762232 767341
58376 767341 771760 775539 780059 785985 792755 799983 807742 815600 823085 831043 840751 851729 862262 872084
58362 872084 882587 894306 906176 917540 928830 939962 950080 959323 968899 978903 987951 995384
58350 995384 1001861 1007356 1010737 1012107 1013524 1016484 1020468 1024729 1029679 1035659 1042069 1048667 1056184 1064974
58336 1064974 1074580 1085221 1097916 1112510 1127384 1141804 1156792 1172973 1189430 1205440 1221431
58325 1221431 1237341 1251912 1264501 1275801 1285927 1293668 1298615 1302253 1306043 1310100 1314585 1320389 1327523
58312 1327523 1334707 1341571 1349426 1358942 1369026 1378981 1389825 1402361 1415882 1429815 1444705 1460553
58300 1460553 1476165 1491310 1507520 1525666 1544645 1563492 1582746 1602759 1622850 1643203 1665278
58289 1665278 1689152 1712836 1735543 1759261 1785712 1814167 1843745 1875375 1909770 1945686 1981890
58278 1981890 2018843 2057089 2096277 2137068 2181343 2228889 2276401 2321515 2365364 2409656 2454069
58267 2454069 2498411 2544425 2593269 2643837 2695642 2750733 2810600 2873834 2938960 3006932 3078699
58256 3078699 3153037 3228952 3307419 3388648 3470561 3552230 3635848 3723125 3812999 3905138 4002183
58245 4002183 4105950 4214944 4328374 4448932 4578730 4716260 4860456 5013940 5178956
58236 5178956 5353928 5537543 5732397 5941067 6162493 6395903 6644384 6911006 7195611
58227 7195611 7499051 7826002 8179775 8559340 8965586 9405308 9884590 10403979 10965145
58218 10965145 11576508 12247112 12981333 13785632 14674325 15662638 16761037 17983424 19354441
58209 19354441 20902543 22654739 24647191 26934291 29581001 32657805 36254469 40488578
58201 40488578 45486718 51362560 58220349 66166756 75309170 85761681 97675341 111256469
58193 111256469 126745870 144395687 164466330 187191082 212687420 240887929 271474813
58186 271474813 303606819 335383422 363539712 384055375 393637862 391077281 377467414
58179 377467414 355320946 327470915 296467432 264442485 233088783 203617813 176773348
58172 176773348 152917058 132116992 114222078 98953134 85991928 75023489 65743370
58165 65743370 57872454 51176861 45464606 40568727 36346425 32687607 29507902 26733133
58157 26733133 24298188 22154154 20263531 18589741 17098920 15767149 14576434 13506730
58149 13506730 12539699 11666094 10880819 10173678 9532306 8950379 8424951 7948771 7512882
58140 7512882 7114053 6752025 6421473 6113622 5823975 5552002 5295245 5050282 4818018
58131 4818018 4601772 4401075 4212604 4035739 3871747 3718871 3573557 3435542 3306750
58122 3306750 3186236 3070975 2960660 2857183 2760338 2668363 2581659 2501592 2426520 2353328
58112 2353328 2282078 2215134 2152521 2092222 2034253 1980454 1930612 1882412 1834802 1788169 1742010
58101 1742010 1695784 1651260 1610665 1573178 1536446 1500675 1467866 1437873 1408732 1380307 1354147
58090 1354147 1330137 1306556 1283235 1261648 1242059 1223344 1205212 1187899 1170098 1149917 1127595
58079 1127595 1104870 1082289 1059488 1037218 1016424 996136 974976 953963 935033 917616 899605
58068 899605 880977 863496 847447 831678 816361 802725 790443 778208 766507 756854 748660 739834
58056 739834 730167 721121 712513 702604 691469 681119 672091 662888 653112 644211 636693 629452 622370 616837
58042 616837 613004 609021 603681 597567 591054 583604 575636 568785 563572 558815 553811 548960 543794 536718
58028 536718 527435 517543 508003 498018 487210 476892 468229 460817 453923 447634 442085 436954 432333 428741
58014 428741 425878 422723 419142 415962 413302 410343 406940 403802 400911 397502 393805 391071 389542 388188
58000 388188 386752 386280 387150 388251 388635 388436 387860 386890 386280 387087 388787 389519 388602 387140 385818 383925 380992
57983 380992 377614 374084 369988 365651 362178 359457 356000 351357 346885 343410 340086 336453 333679 332565
57969 332565 332036 330881 329478 328618 328050 327465 327637 329198 331299 332692 333244 333400 333082 332166 331218 330756 330486
57952 330486 329967 329249 328240 326420 323878 321682 320491 319771 318999 318649 319226 320325 321499 323193 325999 329756
57936 329756 334049 338884 344260 349883 355776 362273 368941 374449 378022 379996 380490 378797 374783 369703
57922 369703 364676 359345 352965 345917 339189 333104 327385 321816 316200 310343 304642 299934 296245 292649
57908 292649 288858 285890 284416 283557 282245 280795 280213 280702 281782 283129 284432 285078 284843 284338 284160 284283
57892 284283 284792 286267 288703 291006 292490 294059 296935 301010 305351 309558 313583 316909 319081 320605
57878 320605 322235 323643 323787 322401 320367 318696 317714 317065 316121 314613 313107 312339 311955 310645 307877 304664
57862 304664 302173 300508 299382 299020 299569 300468 301239 302259 304011 306269 308716 311639 315246 319014 322422
57847 322422 325539 328136 329206 328341 326782 326006 325984 325903 325829 326330 327034 326990 326238 325752 325889 325995 325551 324829 324379
57828 324379 324612 325777 327631 329283 330080 330448 331200 332244 332690 332111 331013 330198 330165 330910 331697 331333 329236
57811 329236 326012 322491 318572 313608 307474 300511 292739 284001 274772 266131 258882 253017 247909 242740
57797 242740 237138 231726 227618 225053 223075 220951 219161 218475 218806 219707 221310 223902 227049 230015 232627
57782 232627 235039 237159 239114 241749 245777 250831 256075 261279 266490 271254 275186 278820 282819 286676
57768 286676 289223 290153 290053 289234 287599 285513 283710 282299 280728 278698 276380 273893 271422 269657 269260
57753 269260 269942 270839 271632 272567 273661 274844 276597 279390 282573 284886 286073 286957 287880 288128 287190 285608
57737 285608 284244 283362 282689 281862 280647 279285 278543 278845 279453 279291 278490 278197 278786 279289 278873 278039 277830 278511
57719 278511 279513 280234 280479 280388 280267 280343 280557 280685 280601 280264 279655 279015 278841 279281 279747 279559 278724 277681 276582
57700 276582 275375 274189 273102 271852 270437 269585 269842 270533 270485 269487 268182 266779 264946 262815 260983 259430
57684 259430 257532 255405 254292 255188 257882 261738 266784 273688 283185 295830 311840 330942 352760
57671 352760 377503 405896 438490 475543 517443 564331 614701 664440 707331 736585 746865
57660 746865 736290 707242 664987 615271 562950 511859 464630 422406 385435 354086 328747
57649 328747 308809 292608 278650 266468 256242 248145 242158 237982 235025 232795 231236 230312 229553
57636 229553 228555 227658 227401 227511 227179 226218 225182 224430 223807 223127 222236 220703 218218 215185 212192 209155 205853
57619 205853 202968 201413 200785 199698 197697 195594 193864 192058 190090 188681 187982 187051 185353 183660 182692
57604 182692 181932 180635 179100 177999 177194 176196 175180 174568 173949 172433 169900 167109 164619 162270 159743
57589 159743 157051 154349 151632 148851 146209 144159 142957 142218 141198 139710 138435 137928 137737 137068 136004
57574 136004 135280 135092 134968 134747 134716 134800 134538 133960 133535 133110 131884 129713 127448 125686 124161 122760 122098
57557 122098 122467 123109 123209 122890 122616 122347 121983 121987 122802 124079 125118 125645 125639 124889 123334 121545 120255 119648
57539 119648 119472 119548 119855 120421 121425 123004 124684 125499 124993 123771 122743 122219 121923 121525 120907 120290 120224 121078
57521 121078 122549 124128 125857 127960 129884 130697 130459 130200 130423 130676 130767 131203 132054 132607 132653 132992 134012
57504 134012 134933 135122 135055 135195 134992 133919 132512 131392 130137 128102 125564 123056 120371 117239 114285 112250
57488 112250 110992 110187 110210 111175 111949 111475 110474 110419 111292 111803 111450 110872 110308 109244 107677 106409 105812 105393
57470 105393 104777 104159 103553 102519 100889 99033 97335 96119 96013 97438 99649 101166 101368 100941 100613 100243
57454 100243 99380 98070 96815 96180 96484 97405 97911 97161 95480 93980 93315 93392 94058 95294 96753 97872 98526
57437 98526 98944 99072 98722 98294 98514 99317 99776 99307 98274 97302 96695 96698 97581 99101 100472 101180 101430 101642 102000
57418 102000 102617 103532 104349 104451 103803 103084 102793 102767 102820 103255 104325 105599 106366 106476 106387 106521 106873 107244 107533
57399 107533 107697 107505 106550 104694 102457 100714 99939 99961 100521 101636 103239 104908 106336 107769 109600 111806
57383 111806 114122 116449 118726 120718 122360 123969 125678 126999 127433 127119 126453 125492 124294 123360 123037 122873
57367 122873 122310 121696 121808 122614 123298 123300 122597 121214 119367 117892 117647 118465 119429 120105 120710 121268 121536 121736
57349 121736 122395 123394 124048 124207 124429 124945 125329 125331 125150 124757 123878 122896 122845 124100 125874 127364 128621 129835
57331 129835 130593 130467 129776 129199 129035 129345 130376 132331 134932 137597 139934 141927 143814 145854 147980 149787
57315 149787 151182 152895 155789 159719 163646 166817 169282 171317 173041 174634 176291 177941 179637 182101
57301 182101 186057 191061 195887 200124 204401 208965 213213 216982 221078 225965 230968 235469 239891 244676
57287 244676 249207 252824 256277 261027 267352 274111 280320 286208 292697 300389 309144 318288 327306 336459
57273 336459 346506 357634 369067 379993 390461 401003 411830 422837 434025 445435 456929
57262 456929 468523 480703 494023 508509 523730 539235 554744 570266 586370 603980 623516
57251 623516 644442 665887 687510 709563 732504 756773 782552 809405 836496 863435 890448
57240 890448 917450 943454 967428 989315 1009666 1028452 1044778 1057625 1066535 1071712 1073945 1074428
57228 1074428 1074446 1075223 1078028 1084053 1093893 1107459 1124603 1145502 1170120 1197581 1226484 1255722 1284778
57215 1284778 1313412 1341333 1368071 1393014 1415700 1436177 1454977 1472835 1490704 1509923 1531766
57204 1531766 1556646 1584139 1613859 1645845 1680014 1715894 1753230 1792389 1833832 1877490 1922810
57193 1922810 1969003 2015026 2059765 2102519 2143032 2181063 2216435 2249484 2280807 2310390 2337705
57182 2337705 2362906 2387206 2411760 2436923 2462933 2490420 2519616 2549862 2580646 2612571 2646479
57171 2646479 2682020 2717818 2752742 2786313 2818141 2847715 2874724 2899177 2921294 2941591 2960751
57160 2960751 2979083 2996358 3012444 3027685 3042329 3056047 3068438 3079549 3089429 3097610 3103660 3108052
57148 3108052 3112111 3117223 3124193 3132907 3142360 3151538 3160597 3170677 3182418 3195290 3208564 3222046 3235431
57135 3235431 3247994 3259544 3270844 3282402 3293809 3305174 3318284 3335267 3356781 3382585 3413329
57124 3413329 3450681 3496359 3552269 3621078 3705120 3804680 3918273 4044413 4182077 4329661
57114 4329661 4484519 4643554 4803720 4962753 5120878 5281806 5451095 5633734 5834232
57105 5834232 6058563 6314783 6611987 6959766 7368249 7847306 8406210 9056069 9813196
57096 9813196 10699330 11738902 12956985 14378316 16024753 17911835 20047931 22435611
57088 22435611 25071589 27945816 31043345 34347285 37837675 41487950 45263989 49118362
57080 49118362 52964784 56640735 59898741 62458242 64095553 64709503 64323126 63038691
57072 63038691 60990423 58319153 55163820 51658112 47928608 44094096 40263392 36530480
57064 36530480 32970003 29635997 26563233 23769125 21255965 19014181 17026170 15269601
57056 15269601 13719885 12352150 11142917 10071380 9120068 8274590 7522543 6852540 6254339
57047 6254339 5719667 5242272 4816814 4437890 4100276 3799642 3532467 3295338 3084748
57038 3084748 2897534 2731132 2583412 2452668 2337810 2238146 2152828 2080851 2021578 1974777
57028 1974777 1940113 1917298 1906865 1909500 1922980 1939556 1947270 1934877 1896441 1832673 1749245 1653903
57016 1653903 1553870 1454531 1359663 1272140 1193788 1124705 1063517 1008783 960090 917725 881646
57005 881646 850965 824338 800778 780219 763177 749705 738864 729493 721312 714827 710330 707548
56993 707548 706257 706578 708489 711545 715353 719919 725336 731555 738736 747350 757469 768065 777276 783183
56979 783183 784269 779595 769119 753805 735089 714228 692305 670552 650172 631753 615183 600372
56967 600372 587846 578429 572412 569218 567985 568313 570396 574585 581066 589916 601043 613723 626234
56954 626234 636131 641019 639318 630672 615954 596793 574924 551946 529510 509265 492282 478725
56942 478725 468275 460735 456057 454119 454844 458435 465197 475214 488376 504548 523508 544842 567928
56929 567928 591527 612991 628363 634084 628838 613705 590967 563204 533076 502935 474247 447694
56917 447694 423825 403184 385822 371213 358757 348033 338552 329731 321341 313681 307177 301994 298061
56904 298061 295230 293366 292461 292655 294026 296427 299683 303764 308628 314208 320767 328883 338679 349462
56890 349462 360563 372249 385351 400347 417308 436162 456023 474380 488002 494914 495101 489548
56878 489548 479469 466519 452762 439960 429221 421318 416724 415314 416734 421190 429305 441267 456878
56865 456878 476497 500946 530270 563465 599810 639556 682646 727147 769231 804112 826979
56854 826979 834326 825742 804399 775273 742802 710101 679466 652746 631349 616342 608400 607541
56842 607541 613351 625857 645831 674015 710439 754800 806969 866659 932932 1004149 1077551 1147940
56830 1147940 1207163 1246190 1258734 1243627 1204558 1148058 1081182 1009985 939315 873380 815779
56819 815779 768655 732193 705395 687219 676958 674083 678369 690075 709578 736796 771126 811725
56807 811725 857495 906537 955343 998224 1027896 1037852 1025374 992699 945336 889288 829465 769678
56795 769678 713115 662407 619227 583883 555586 533461 517320 507192 502472 502120 505665 513412
56783 513412 525685 542427 563383 587645 612688 634563 649437 654638 648502 630602 602743 568768
56771 568768 532412 495610 459202 424363 392513 364334 339691 318309 299901 283979 270172
56760 270172 258576 249338 242084 236037 230433 224616 218313 212149 207281 204006 201323 198317 195326 193073
56746 193073 191341 189424 187403 185982 185286 184707 183852 182889 182029 181325 180960 181115 181574 181911 181952 181687 181040 180263
56728 180263 180185 181406 183422 185173 186250 186997 187702 188428 189419 190851 192235 192770 192385 191872 192015 193095 194970
56711 194970 196988 198020 197478 196314 196191 197504 199046 199782 200114 201012 202624 204278 205351 205532 204611 202639
56695 202639 200246 198314 197232 196682 196215 195829 195848 196355 197037 197657 198424 199580 200869 201867 202762 204084 205651
56678 205651 206527 206466 206609 208129 210676 212877 213933 214007 213335 211827 209561 207017 204754 203226 202771 203282
56662 203282 204023 204314 204280 204488 204989 205310 205290 205312 205678 206264 206809 207166 207262 207212 207381 207954 208562 208762 208733 209031 209754
56641 209754 210438 210699 210507 209945 209183 208632 208640 209096 209691 210405 211269 211933 212090 212146 212763 213742 214079 213251 211827
56622 211827 210642 209940 209515 209219 209006 208781 208449 207956 207213 206165 204897 203571 202355 201544 201457 201915 202123
56605 202123 201424 199991 198456 197183 196266 195827 195785 195661 195156 194702 194927 195863 197155 198638 200076 200816 200538
56588 200538 200049 200447 201705 202897 203598 204169 204823 205422 206191 207661 209705 211444 212265 212271 211849 211627 212722
56571 212722 215938 220529 224802 228149 231544 235800 240516 245268 250742 257801 266152 274856 283805 293895
56557 293895 305814 319063 332057 342941 350569 355065 357421 358568 359055 359361 359917 360692 361241 361275 360786
56542 360786 359686 357833 355445 352927 350292 347286 343974 340458 336138 330174 322870 315674 309520 303999
56528 303999 298477 293125 288320 283858 279440 275351 271976 269084 266194 263363 261030 259327 257970 256700
56514 256700 255501 254495 253820 253362 252537 250619 247471 243737 240285 237716 236325 236013 236201 236285 236248 236445 236914
56497 236914 237430 238097 239119 240050 240096 239253 238333 237699 236875 235628 234516 233976 233742 233602 233881 234693 235477 235858
56479 235858 236236 236932 237437 237184 236514 236193 236413 236863 237364 237912 238461 239152 240319 241855 243065 243559 243776 244147
56461 244147 244395 244213 243995 244143 244151 243283 241903 241324 242395 244782 247449 249319 249726 248890 247914 247791 248477 249293
56443 249293 249967 250729 251525 251801 251160 249786 248140 246548 245250 244535 244617 245342 246152 246527 246625 247225 248727 250343
56425 250343 250807 249908 248763 248455 248920 249365 249286 248820 248471 248704 249476 250112 250000 249458 249403 250190 251370 252591
56407 252591 253979 255436 256417 256691 256668 256585 256130 255305 254956 255860 257785 259907 261682 262955 263793 264606 265881
56390 265881 267375 268190 268027 267751 268220 269268 270406 271787 273670 275535 276601 276940 277281 277848 278165 277936
56374 277936 277572 277798 279055 281244 283787 285966 287358 287892 287688 287187 287245 288419 290183 291521 292284 293138
56358 293138 294197 294806 294915 295519 297189 299152 300476 301266 302048 302855 303637 304785 306434 307960 308948 309997
56342 309997 311834 314249 316651 319039 321695 324562 327654 331369 335581 339122 341089 342148 343738 346486
56328 346486 350042 353797 357010 359031 360293 362279 365560 368684 370175 370785 372351 374994 377136 378042 378733
56313 378733 380251 382358 384305 385881 387324 388937 390974 393374 395626 397482 399623 402954 407453 412386
56299 412386 417469 423019 429140 435545 442090 448815 455451 461537 466951 471926 476769 482014 488446 496378
56285 496378 505282 514599 524381 534579 544558 554210 564802 577524 591683 605629 619202 633917
56273 633917 650798 669193 687937 706726 726212 747482 771562 798757 828463 860125 894201
56262 894201 931644 972864 1017964 1067678 1123137 1184932 1253223 1328612 1412129 1504603 1606819
56251 1606819 1720094 1845699 1983802 2133693 2294999 2467920 2652345 2847197 3050358
56242 3050358 3258666 3468361 3676174 3879589 4075437 4258816 4424059 4566157 4680647
56233 4680647 4763242 4811049 4823695 4802200 4747366 4660496 4545016 4405799 4247206 4073111
56223 4073111 3888293 3697868 3505185 3311777 3119593 2931851 2751364 2579258 2415814
56214 2415814 2261622 2117503 1984015 1861278 1748779 1645417 1550267 1463111 1383717 1311178
56204 1311178 1244737 1184620 1131009 1082795 1038482 997771 961032 927787 897164 869368 845122
56193 845122 823828 803855 784590 766830 751149 737240 724875 714185 704904 696466 688857 682371
56181 682371 676721 671405 666629 662797 659535 656409 654014 652994 652602 651800 651160 651944 653877 655736 657629
56166 657629 660590 664281 667412 670361 675041 681992 689822 697776 706690 716968 727757 738788 751116
56153 751116 765482 781669 799891 820990 844807 870305 897815 929385 966386 1008609 1056146
56142 1056146 1110134 1171068 1238327 1311991 1392955 1480271 1570154 1658441 1742332 1819223 1886235
56131 1886235 1942375 1989608 2030686 2067172 2100052 2130117 2156458 2176274 2187480 2190304 2185665 2173755
56119 2173755 2155238 2132001 2105208 2073699 2035237 1988128 1931133 1863715 1787663 1707047 1625482
56108 1625482 1544636 1466054 1392570 1326696 1269058 1219509 1178236 1144617 1116539 1092275 1071965
56097 1071965 1056207 1044416 1035574 1029447 1025989 1024578 1024638 1026072 1028537 1031432 1034963 1039825 1045584 1051015
56083 1051015 1056344 1063172 1071721 1080257 1087921 1095990 1105478 1115661 1125933 1137017 1149238 1161655 1173989
56070 1173989 1187302 1201763 1215952 1229588 1244651 1262299 1280815 1298152 1314512 1330961 1347493
56059 1347493 1364079 1381723 1400843 1420260 1439161 1458343 1478340 1498180 1517233 1536348 1556000
56048 1556000 1575352 1594316 1614343 1636015 1658150 1680485 1704730 1731623 1759560 1787599 1817205
56037 1817205 1849544 1883739 1919369 1957791 1999179 2041177 2082433 2124639 2169233 2215080 2261404
56026 2261404 2309739 2360643 2411703 2461417 2511988 2565704 2621601 2678461 2737989 2802021 2869416
56015 2869416 2938673 3010846 3087046 3165998 3246977 3332160 3423114 3517972 3615033 3716016 3822757
56004 3822757 3934089 4049166 4170407 4299824 4435975 4577981 4728776 4890676 5061589
55995 5061589 5239576 5427383 5628392 5842006 6067249 6306928 6563859 6837083 7126329
55986 7126329 7436079 7770756 8130484 8516293 8934538 9391028 9886030 10420571 11002400
55977 11002400 11640077 12337135 13098467 13936586 14865283 15894082 17036477 18316983 19762868
55968 19762868 21397586 23252292 25377155 27833915 30688930 34026697 37961025 42617840
55960 42617840 48111466 54545253 62021306 70635926 80483521 91690788 104443853 118972295
55952 118972295 135524614 154366430 175750037 199821579 226543140 255648767 286431617
55945 286431617 317229542 345003467 365727070 375752071 373324419 359169791 335880289
55938 335880289 306766610 274946509 242906076 212377804 184388897 159421025 137596099
55931 137596099 118803748 102779543 89184596 77677994 67944993 59696043 52676234
55924 52676234 46679549 41540595 37115417 33280323 29940682 27024522 24468066 22215635
55916 22215635 20227114 18472654 16921361 15542972 14316234 13226003 12254467 11382930
55908 11382930 10599173 9895339 9260999 8685012 8161278 7685873 7251114 6848721 6476188
55899 6476188 6133830 5818147 5524011 5250664 4999397 4767452 4550132 4346932 4159830
55890 4159830 3987230 3825106 3672697 3531845 3401983 3280686 3167993 3065442 2971690 2883246
55880 2883246 2798401 2716503 2634774 2550113 2463273 2377651 2295003 2215558 2140656 2071367 2005646
55869 2005646 1940554 1876312 1815007 1756723 1700260 1646223 1595804 1547852 1500673 1455448 1414363
55858 1414363 1376546 1339456 1303249 1270137 1240278 1211856 1184590 1159751 1137176 1115407 1094287
55847 1094287 1074403 1054556 1032808 1009624 987128 965761 944347 922836 902222 882340 862391
55836 862391 843027 825334 808490 791101 774056 759303 746578 734149 721992 711252 701268 690327
55824 690327 678887 668848 659913 649815 638146 626823 616559 605893 594160 582732 572681 563576
55812 563576 555111 547743 541314 535052 529307 525389 523485 522491 521944 522285 523348 524497 526191 529512 534259
55797 534259 539286 544416 549999 555030 557990 559371 561003 562937 563305 561277 557794 553313 547348 540572
55783 540572 534864 530508 525446 517994 508502 497858 486308 474363 463188 453447 445277 439599 437691
55770 437691 439157 442121 445714 450431 455634 458744 457719 452657 444437 433663 421692 410800 402160
55757 402160 394933 388157 382207 377591 373663 369433 364625 359273 353285 346962 340929 335123 328890 322389
55743 322389 316680 312042 307483 302428 297653 294002 291323 289176 287479 285836 283335 279637 275425 271374
55729 271374 267445 263485 259536 255345 250541 245499 240991 236916 232578 228383 225875 225660 226513 226995 226855
55714 226855 226494 226290 226832 228734 231717 234913 238253 242376 246967 250598 252631 253843 254572 253713 250354
55699 250354 245140 239173 232676 225595 218547 212249 206860 202554 199881 198791 198195 197249 196384 196404 197297 198555
55683 198555 199935 201296 202369 203293 204765 207181 210244 213698 217613 221595 224602 226061 226382 226009 224831
55668 224831 222989 221271 220148 219285 218473 218083 218064 217575 216353 215493 216000 217396 218639 219671 221123 223089
55652 223089 225112 226971 228682 230020 230709 230809 230526 230011 229624 229806 230274 230006 228445 226056 223238 219469
55636 219469 214172 207757 201076 194394 187593 180974 175180 170599 167225 164723 162351 159423 156269 154079
55622 154079 153326 152974 151880 150339 149523 149822 150434 150336 149107 146993 144578 142213 139589 136188 132290 128997
55606 128997 127082 126311 126006 125629 124688 122923 120890 119552 118898 117821 115757 113588 112382 112067 111937 111687
55590 111687 111291 110582 109582 108655 107800 106577 105248 105057 106630 108951 110774 112242 114252 116996 120150
55575 120150 123807 128042 132090 135122 137521 140358 143935 147809 151822 155987 159607 161731 162428 162556 162290
55560 162290 160881 157973 154145 150001 145607 141105 137013 133518 130139 126524 123188 121076 120630 121434 122568
55545 122568 123230 123281 123214 123452 123812 123830 123404 122757 122027 121278 120755 120717 121145 122013 123587 125952 128400 129898 130221
55526 130221 130117 130227 130281 129577 127911 125779 123718 121664 119094 115803 112372 109606 107615 105817 103830
55511 103830 101887 100276 98807 97070 94861 92235 89610 87899 87876 89112 90104 89839 88761 87877 87563 87702
55495 87702 88304 89297 90142 90355 90130 89890 89587 88992 88282 87758 87328 86896 86857 87451 87967 87398 85793 84202 83372
55476 83372 83190 83354 83859 84683 85552 86174 86403 86203 85857 86020 86986 87959 87613 85527 82648 80250 78847 78195
55458 78195 77921 77864 77961 78030 77786 77198 76707 76775 77184 77216 76706 76415 77059 78455 79991 81402 82590 83188 83003
55439 83003 82596 82741 83504 84377 85085 85650 85935 85828 85709 86080 86807 87391 87861 88709 89972 91128 91904 92518
55421 92518 92974 92843 92048 91250 91114 91573 92118 92450 92521 92205 91379 90277 89447 89243 89423 89408 88978 88549 88574 88824
55401 88824 88655 87912 87059 86345 85493 84429 83605 83191 82605 81482 80554 80757 81818 82528 82287 81668 81507 82083
55383 82083 83143 84247 85048 85628 86417 87448 88043 87740 87138 87115 87503 87356 86329 84902 83342 81412 79265
55366 79265 77688 77092 76987 76875 77104 78329 80513 82867 84577 85324 85254 84672 83745 82472 80954 79497 78311
55349 78311 77387 76922 77412 78886 80406 81037 81088 81696 83259 85011 86131 86545 86567 86400 86148 85755 84803 82944
55331 82944 80607 78692 77482 76478 75475 75043 75640 76899 78209 79458 80786 82003 82709 82715 82055 80882
55315 80882 79657 79092 79516 80460 81140 81238 81050 81055 81476 82098 82363 81834 80658 79450 78720 78583 78939 79564 80033
55296 80033 79963 79475 79095 79180 79677 80467 81488 82442 82817 82445 81716 81108 80784 80768 81125 81755 82349 82790 83357 84266
55276 84266 85213 85641 85407 85005 85121 85999 87183 87870 87608 86649 85666 85271 85785 87084 88439 88854 87976 86452
55258 86452 85120 84164 83407 83075 83614 84962 86588 88125 89399 90029 89735 88981 88624 88864 89201 89390 89700
55241 89700 90091 89933 88909 87615 86885 86990 87722 88782 89768 90184 89827 88922 87793 86684 85936 85794 85861 85231
55223 85231 83473 81187 79454 79024 80019 81946 83927 85356 86473 87853 89341 90079 89696 88868 88424 88447
55207 88447 88491 88177 87336 86054 84830 84208 84084 83811 83162 82621 82587 82979 83828 85457 87605 89107 89101 88126 87526
55188 87526 88109 89781 91952 93766 94365 93604 92310 91416 91075 90970 91107 91761 92913 94208 95301 95953 96000
55171 96000 95623 95333 95354 95283 94691 93781 93108 92920 93113 93608 94403 95459 96730 98037 98876 98789 98124 97774 97883
55152 97883 97514 96137 94696 94474 95427 96554 97498 98736 100288 101303 101180 100320 99414 98518 97252 95575
55136 95575 93966 92923 92493 92374 92361 92574 93118 93724 94061 94296 94914 95913 96729 97063 97231 97470 97522 97240 96976
55117 96976 96927 96704 96085 95607 95746 96054 95857 95338 95081 94932 94286 93342 93062 93836 95046 96155 97372 98946
55099 98946 100429 101126 100934 100397 100135 100415 101166 102240 103650 105411 107159 108265 108507 108316 108127 107895 107589
55082 107589 107602 108143 108673 108641 108386 108576 109044 109115 108874 109147 110176 111222 111662 111583 111154 110232 108977 108070 107840
55063 107840 107778 107375 106922 106965 107402 107733 107908 108346 109172 109885 109878 109054 107882 106956 106502 106290 105977 105441 104692 103657
55043 103657 102296 100802 99477 98498 97994 98104 98658 99086 99037 98874 99093 99503 99582 99392 99417 99620 99533 99289 99679
55024 99679 100936 102275 102958 103081 102956 102492 101698 101075 100866 100522 99601 98708 98733 99512 100047 99892 99501 99308 99279
55005 99279 99465 100260 101754 103403 104686 105658 106538 107135 107102 106583 106142 106103 106288 106429 106500 106520 106311 105751 105090
54986 105090 104785 104984 105411 105766 105996 106118 106108 106147 106733 108152 109902 110984 110842 109837 108776 108142 107833 107505
54968 107505 107040 106683 106734 107183 107789 108505 109540 110888 112102 112764 112962 113070 113277 113576 113941 114184 113954 113309
54950 113309 113004 113642 114670 114848 113695 111896 110267 109012 108099 107744 108093 108839 109511 109932 110271 110902 112222
54933 112222 114184 115983 116723 116577 116714 117832 119290 120122 120379 120940 122324 124286 126439 128761 131500 134905
54917 134905 139071 143862 149060 154729 161187 168334 175158 180245 182797 183043 181842 179980 177617 174173
54903 174173 169005 162422 155748 150152 145685 141789 138320 135520 133235 130923 128504 126596 125687 125529 125545
54888 125545 125476 125308 124885 123989 122733 121597 121005 121062 121723 123114 125503 128991 133389 138480 144213 150403
54872 150403 156394 161538 166137 171314 177453 183107 186141 185963 183953 181578 178767 174578 168963 163099
54858 163099 158096 154000 150232 146532 143154 140414 138296 136355 133830 130107 125391 120735 117070 114343
54844 114343 111951 109873 108745 108734 108991 108612 107639 106688 105998 105421 105071 105238 105742 106058 106179 106765 108181 109902
54826 109902 111162 111748 111866 111612 110975 110147 109420 108893 108524 108348 108377 108435 108358 108299 108613 109442 110572 111620 112283
54807 112283 112509 112537 112630 112735 112600 112338 112505 113342 114279 114607 114500 114839 116025 117442 118250 118345 118275 118484 118959
54788 118959 119508 120105 120801 121427 121554 120836 119454 118119 117556 117948 118898 119912 120840 121876 123290 125194 127445
54771 127445 129695 131603 133207 135129 138233 142894 148554 154166 159088 163499 167923 172570 177253 181757
54757 181757 185997 189830 192932 194905 195392 194099 190922 186131 180302 173983 167488 161005 154805 149245
54743 149245 144628 141051 138369 136337 134804 133734 132947 132068 130916 129855 129501 130055 131141 132271 133258
54728 133258 134186 135218 136485 137991 139567 141081 142764 145118 148469 152718 157543 162610 167563 172065
54714 172065 176022 179620 182947 185609 186822 185949 182975 178559 173538 168308 162761 156862 151049 145864
54700 145864 141448 137749 135063 133896 134228 135277 136033 135787 134236 131554 128478 125855 123947 122423 121106
54685 121106 120264 120000 119849 119309 118434 117571 116711 115509 113875 112263 111285 111097 111201 110978 110556 110889 112644
54668 112644 115179 117129 117888 117913 117571 116552 114726 112838 111764 111579 111870 112470 113282 113782 113507 112862 112771
54651 112771 113516 114497 115160 115578 115992 116161 115478 113619 111056 108973 108521 109869 112058 113950 115196 116181
54635 116181 117305 118637 119999 120982 121057 120058 118512 117177 116290 115588 114841 114010 113045 112020 111440 111887 113202
54618 113202 114386 114510 113605 112619 112569 113681 115165 115886 115436 114449 113841 113978 114733 115935 117327 118437 118988
54601 118988 119363 120095 121013 121364 120788 119726 118869 118634 119100 119924 120293 119565 118111 117029 116867 117134 117217 117165
54583 117165 117210 117061 116296 115158 114372 114261 114505 114815 115361 116351 117516 118303 118486 118385 118462 118830 119238 119363 119041
54564 119041 118331 117574 117337 118013 119382 120737 121521 121669 121387 120976 120942 121782 123353 124850 125748 126412 127381 128492
54546 128492 129246 129676 130144 130507 130301 129727 129686 130636 132063 133265 134018 134264 133818 132817 131978 131846 132073 131866
54528 131866 130931 129607 128286 127103 126116 125338 124564 123466 121977 120443 119294 118670 118489 118786 119782 121415
54512 121415 122991 123645 123252 122514 121979 121409 120439 119431 119098 119512 120131 120714 121594 123001 124661 126160 127259
54495 127259 127832 127956 128062 128472 128799 128438 127642 127365 127916 128577 128850 129226 130187 131193 131352 130580 129453 128358
54477 128358 127429 126962 127134 127577 127927 128574 130159 132403 134183 134851 134861 134972 135369 135791 136136 136607 137414 138520
54459 138520 139630 140448 140999 141561 142179 142495 142248 141654 141044 140409 139674 139106 138928 138745 137973 136743 135711 134972
54441 134972 133839 132003 130255 129605 130014 130460 130109 129109 128297 128370 129304 130464 131278 131843 132762 134371 136334
54424 136334 138074 139371 140397 141351 142267 143056 143528 143450 142840 142224 142345 143416 144754 145371 144944 144055 143455
54407 143455 143330 143404 143456 143388 142954 141953 140749 140086 140147 140203 139532 138362 137510 137367 137725 138403 139502 141037 142830
54388 142830 144851 147203 149570 151097 151140 149978 148568 147742 147794 148611 149883 151173 152045 152307 152163 152102 152561
54371 152561 153668 155286 157251 159447 161674 163751 165921 168867 172985 177735 182064 185443 188105 190292
54357 190292 191703 191956 191287 190358 189396 187784 184737 180359 175841 172396 170043 167708 164629 161244 158445
54342 158445 156344 154312 152068 149995 148358 146883 145423 144455 144419 144897 145024 144582 144205 144484 145218 145676 145363
54325 145363 144444 143509 143008 142922 142992 143177 143593 144067 144151 143826 143822 144781 146278 147122 146634 145251 143863 142963 142525
54306 142525 142300 141945 141091 139602 137789 136253 135492 135619 136281 136836 136771 136110 135338 134953 135153 135903 136997 138036
54288 138036 138653 138928 139389 140437 141930 143446 144745 145799 146637 147416 148397 149490 150031 149461 148150 147073
54272 147073 146669 146482 146001 145319 144727 144202 143738 143847 145127 147379 149667 151314 152479 153603 154643 155125
54256 155125 154850 154288 154285 155411 157541 159935 161749 162594 162764 162922 163461 164074 163996 162778 160830 159081 158124
54239 158124 157832 157765 157657 157366 156623 155152 152999 150575 148428 147063 146794 147507 148578 149266 149259 148755 148146 147750
54221 147750 147801 148382 149316 150228 150777 150790 150264 149378 148449 147758 147429 147486 147835 148121 147900 147237 146858 147306 148050 147917
54201 147917 146437 144365 142841 142444 143138 144687 146746 148781 150224 150786 150594 150122 149918 150180 150629 150971
54185 150971 151397 152329 153737 155129 156169 156873 157153 156714 155640 154645 154457 155222 156682 158528 160304 161417
54169 161417 161605 161128 160216 158736 156776 155120 154592 155163 156180 157218 158159 158681 158403 157575 157005 157113 157475
54152 157475 157431 156764 155669 154455 153417 152699 152108 151306 150317 149616 149624 150313 151304 152119 152309 151716 150699 149833
54134 149833 149274 148724 148099 147809 148098 148513 148409 147814 147393 147649 148493 149551 150529 151257 151679 151973 152467 153267
54116 153267 154064 154475 154533 154758 155719 157572 159965 162294 164021 164883 164976 164755 164830 165642 167224 169296 171511
54099 171511 173590 175334 176777 178425 181084 185111 189771 193609 195605 195854 195053 193651 191744 189588 187657
54084 187657 186154 184874 183743 183042 182852 182671 182029 181197 180822 181035 181438 181850 182508 183510 184634 185850 187468
54067 187468 189560 191656 193263 194311 194921 195172 195319 195744 196370 196598 196195 195743 195677 195392 194072 192178 191266
54050 191266 192269 194614 197147 199363 201505 204012 207226 211276 215871 220351 224251 227757 231481 235812
54036 235812 240641 245685 250921 256607 262823 269139 274942 280046 284722 289088 292874 296031 299134 302703
54022 302703 306344 309057 310345 310560 310240 309595 308700 307701 306573 304994 302629 299309 294889 289302 282987
54007 282987 276944 271968 267897 263807 258966 253507 248276 244137 241355 239459 237675 235569 233332 231454
53993 231454 230142 229092 227845 226282 224633 223023 221285 219363 217618 216356 215268 213843 212225 211028
53979 211028 210254 209180 207599 206420 206476 207404 208330 209143 210236 211441 212231 212872 214366 217085 220303 223356
53963 223356 226603 230840 236319 242688 249504 256441 263188 269291 273942 276031 274967 271565 267644 264472
53949 264472 261938 259381 256726 254494 253074 252434 252435 253099 254559 256867 259882 263291 266793 270221 273453
53934 273453 276454 279546 283294 287827 292511 296670 300367 304013 307573 310832 314215 318525 323914 329851
53920 329851 336095 342913 350247 357542 364606 371853 379492 387241 395093 403426 411959 419509 425409 430372
53906 430372 435246 439559 442134 442680 442003 440894 439490 437494 434442 430019 424587 419103 414020 408662 402253
53891 402253 395184 388516 382425 375899 367969 358680 348877 339491 331007 323234 315631 308107 301326 295859
53877 295859 291354 287010 282610 278540 274969 271594 268123 264537 260914 257451 254563 252519 250980 249283
53863 249283 247100 244517 241647 238617 235785 233497 231661 229889 227956 225828 223442 220848 218369 216255
53849 216255 214433 212955 212284 212569 213033 212809 212075 211639 211579 211193 210204 209110 208277 207544 206938 206932 207667 208591 209214
53830 209214 209580 209710 209241 208094 206973 206618 206845 206853 206300 205722 205989 207559 210119 212754 214617 215628 216464
53813 216464 217891 220218 223261 226541 229579 232346 235414 239261 243510 247327 250611 254239 259039 264972
53799 264972 271442 277882 283849 289068 293733 298362 303084 307355 310648 313126 315402 317912 320660 323245
53785 323245 324994 325446 324896 324074 323123 321340 318178 314045 309764 305602 301209 296245 290717 284922 279364
53770 279364 274497 270301 266317 262282 258468 255184 252280 249383 246320 243085 239747 236636 234209 232384
53756 232384 230403 227775 225008 222968 221832 221121 220453 219711 218717 217360 215955 214947 214299 213632 212851 212188
53740 212188 211747 211548 211878 212948 214203 214700 214358 214166 214836 215901 216587 217009 217817 219032 220013 220570 221348
53723 221348 222836 224532 225559 225778 225841 226244 226809 227126 227112 226990 227090 227854 229680 232368 235008 236863 238261
53706 238261 240154 242836 245590 247709 249349 251161 253506 256353 259562 262899 266019 268804 271571 274608
53692 274608 277665 280263 282397 284524 286810 288728 289554 289081 287769 286302 285119 284294 283757 283545 283735 284170
53676 284170 284441 284212 283492 282592 281945 281923 282582 283488 284074 284270 284456 284678 284306 282857 280816 279160 278172 277209
53658 277209 275700 273988 272992 273209 274218 275086 275266 275098 275403 276493 277789 278559 278872 279550 281179 283450
53642 283450 285535 286946 287917 288983 290310 291524 292323 293135 294911 298134 302287 306417 309973 312917 315407
53627 315407 317788 320614 324143 327812 330729 332773 334718 337066 339221 340252 340268 340566 342342 345553 349179
53612 349179 352349 354979 357475 360157 363136 366414 369835 373038 375797 378431 381524 385155 388624 391124
53598 391124 392483 393120 393479 393739 393902 393942 393813 393439 392682 391412 389686 387820 386043 384215 382214 380524
53582 380524 379901 380301 380710 380305 379322 378393 377535 376351 374863 373466 372250 370977 369663 368578 367648 366377
53566 366377 364480 362200 359958 358082 356853 356434 356695 357465 358860 360944 363144 364564 364916 364632 364056 363206
53550 363206 362438 362579 363978 366021 368018 370091 372689 375646 378342 380571 382699 385083 387814 390973 394706
53535 394706 399054 404043 409857 416616 424061 431863 440157 449350 459369 469560 479536 489738 500993
53522 500993 513671 527483 541840 556205 570264 584107 598273 613508 630399 649203 669803
53511 669803 691649 713917 736030 758112 780740 804193 828132 852072 875916 899812 923646
53500 923646 947001 969548 991187 1011819 1031392 1050256 1069064 1088006 1106484 1123883 1140488
53489 1140488 1157260 1174820 1193013 1211319 1229269 1246525 1263087 1279484 1296332 1313566 1330536
53478 1330536 1346936 1363059 1378838 1393178 1404758 1413234 1419170 1422983 1424435 1423124 1418997 1412429 1404116
53465 1404116 1394837 1384917 1373910 1361205 1347067 1332654 1318877 1305539 1291745 1276825 1260629 1243276
53453 1243276 1225031 1206340 1187678 1169261 1151063 1133025 1115092 1097095 1078900 1060744 1043316
53442 1043316 1027396 1013457 1001542 991424 982836 975618 969710 964977 961144 958020 955720 954518 954463
53429 954463 955333 956989 959566 963233 967973 973797 980992 989916 1000616 1012884 1026671 1042177 1059511
53416 1059511 1078494 1098881 1120543 1143309 1166879 1191196 1216796 1244515 1274711 1306924 1340320
53405 1340320 1374397 1409255 1445389 1483371 1523648 1566303 1610883 1656618 1703138 1750946 1800878
53394 1800878 1852888 1905686 1957884 2009388 2061292 2114431 2168379 2221931 2274179 2324925 2374333
53383 2374333 2422443 2468888 2512849 2553430 2590207 2623335 2653059 2679333 2702012 2721045 2736169
53372 2736169 2746702 2751989 2751941 2746756 2736237 2719807 2697231 2668979 2635833 2598438 2557314 2513016
53360 2513016 2466142 2417389 2367651 2317839 2268499 2219707 2171398 2123661 2076733 2030901 1986406
53349 1986406 1943290 1901389 1860624 1821137 1782786 1744665 1705678 1665741 1626017 1587864 1551946
53338 1551946 1518456 1487513 1458841 1431621 1405338 1380637 1358665 1339586 1322359 1306045 1290706
53327 1290706 1276642 1263238 1249164 1233665 1217244 1200963 1185410 1170496 1156068 1142363 1129781
53316 1129781 1118414 1108046 1098591 1090360 1083807 1079183 1076523 1075835 1077046 1079775 1083378 1087398 1091968 1097782
53302 1097782 1105657 1116060 1128862 1143468 1159256 1175999 1193944 1213470 1234703 1257368 1280907
53291 1280907 1304740 1328556 1352467 1376809 1401611 1426253 1449782 1471535 1491352 1509204 1524888
53280 1524888 1538233 1549339 1558364 1565146 1569321 1570716 1569322 1564945 1557292 1546570 1533647 1519348 1503816
53267 1503816 1486734 1467942 1447561 1425730 1402584 1378457 1353813 1328926 1303845 1278602 1253310
53256 1253310 1228061 1202883 1177706 1152236 1126040 1099079 1072050 1045905 1020981 996854 973009
53245 973009 949334 925927 902755 879722 856913 834628 813250 793046 773918 755391 737050
53234 737050 719035 701965 686369 672427 660179 649570 640184 631200 621858 611826 601112 589860
53222 589860 578363 566998 555894 544761 533165 520904 508043 494803 481510 468536 456098
53211 456098 444181 432756 421997 412208 403581 396007 389075 382321 375625 369218 363125 356786 349691
53198 349691 342340 336012 331373 327705 323784 319163 314256 309559 305233 301292 297722 294339 290894 287345
53184 287345 283863 280561 277413 274403 271535 268711 265836 263075 260821 259317 258395 257613 256589 255190 253438
53169 253438 251333 248862 246199 243783 242016 240912 240231 239919 240127 240722 241078 240567 239146 237386 236046 235677
53153 235677 236354 237538 238362 238262 237323 235986 234591 233255 231951 230489 228713 226935 225931 226221 227490
53138 227490 228997 230421 231952 233629 235029 235701 235698 235542 235786 236642 237890 239059 239813 240200 240466 240695 240764
53121 240764 240701 240876 241684 243055 244415 245252 245675 246231 247145 247958 248116 247729 247414 247533 247885 248113 247968 247138
53103 247138 245314 242678 240003 238007 236803 236126 235767 235569 235286 234790 234287 234114 234391 234941 235407 235451 235110
53086 235110 234947 235457 236271 236466 235758 234791 233989 232844 230860 228543 226752 225552 224480 223614 223495 224119 224787
53069 224787 224987 224768 224241 223359 222306 221492 221057 220822 220764 221017 221413 221587 221601 221886 222499 223023 223357 223995 225233
53050 225233 226648 227644 228104 228196 227997 227623 227375 227484 227919 228621 229569 230468 230791 230428 229936 229856 230068 230024 229345
53031 229345 228034 226449 225274 225099 225790 226569 226927 227064 227318 227705 228323 229604 231618 233646 235049 236178
53015 236178 237754 239624 240888 241132 240782 240274 239604 238835 238353 238334 238428 238285 237972 237620 237047 236068 234899 233897
52997 233897 233133 232521 232182 232342 232961 233760 234563 235344 235989 236337 236462 236668 237135 237778 238522 239399 240301 240989 241589
52978 241589 242764 244980 247749 250043 251463 252591 254143 256149 258090 259423 259817 259298 258462 258171 258658
52963 258658 259212 259101 258508 258150 258195 258201 257981 257926 258327 258884 259035 258497 257348 255832 254128 252096 249317 245707
52945 245707 242034 239441 238408 238456 238843 239165 239366 239618 240227 241229 242052 242026 241223 240337 239760 239321 238877 238484
52927 238484 237905 236724 235184 234144 233872 233694 233248 233272 234487 236362 237764 238308 238288 237797 236777 235704 235285
52910 235285 235514 235718 235458 234750 233573 231911 230290 229477 229518 229672 229439 229090 229043 229294 229660 230125 230759 231622
52892 231622 232810 234194 235160 235203 234865 235397 237190 239112 239779 239031 237797 236947 236780 237320 238477 239926 241217
52875 241217 242107 242587 242698 242533 242381 242567 243082 243580 243804 243926 244333 245107 245828 246052 245978 246426 247956 250121
52857 250121 251848 252514 252421 252208 252042 251530 250224 248021 245155 241913 238409 234651 230751 226996 223690 221041
52841 221041 219185 218131 217583 217038 216197 215097 213813 212368 211096 210581 210903 211364 211439 211611 212623 214242
52825 214242 215544 216288 217151 218534 219910 220623 220585 219955 218797 217436 216571 216526 216855 217130 217660 219009 221111
52808 221111 223322 225049 225952 225937 225403 225177 225688 226406 226567 226143 225576 224888 223745 222302 221241 220888 220900 220955
52790 220955 221156 221490 221450 220633 219390 218513 218430 219006 219995 221366 223178 225314 227392 228899 229499 229336 228968
52773 228968 228913 229224 229488 229147 227828 225574 222927 220700 219402 218809 218232 217305 216378 215975 216021 215924 215440 215047
52755 215047 215250 215830 216236 216503 217202 218487 219795 220705 221561 222858 224449 225869 227185 228959 231421 234184
52739 234184 236840 239460 242300 245333 248167 250359 251753 252631 253480 254437 255039 254762 253748 252731 252294 252487
52723 252487 253111 253941 254521 254134 252290 249168 245466 241968 239286 237708 237035 236701 236245 235642 235155 235083 235686
52706 235686 236977 238370 238898 238193 237076 236716 237302 237951 237960 237586 237395 237326 236899 236120 235666 236050 236991 237833 238366
52687 238366 238893 239498 239615 238614 236731 235051 234392 234450 234294 233584 232918 232953 233535 233917 233601 232712 231669 230763
52669 230763 230055 229490 229092 229110 229931 231623 233644 235153 235669 235370 234871 234878 235947 238231 241385 244820 248051
52652 248051 250679 252360 253200 253996 255469 257201 257976 257378 256351 255787 255216 253601 250922 248143 245915 244196
52636 244196 243092 243082 244221 245906 247743 249925 252386 254287 254964 254941 255342 256662 258633 260995 263664 266236
52620 266236 267963 268386 267568 265726 263069 260054 257303 255068 253112 251294 249925 249305 249162 248864 248072 247012
52604 247012 246163 245822 245857 245719 244797 242985 240963 239737 239840 240945 242203 242880 242798 242344 242163 242671 243709
52587 243709 244663 244979 244601 243878 243166 242638 242413 242648 243418 244675 246412 248622 250940 252576 252952 252343 251587
52570 251587 251154 250790 250090 249083 248166 247713 247861 248433 248941 248861 248062 246882 245758 244972 244704 244984 245504 245791
52552 245791 245761 245779 246010 246046 245445 244360 243389 243051 243612 245025 246675 247542 247138 246115 245588 245986 246972 248187
52534 248187 249542 250832 251708 252106 252344 252709 253234 253820 254209 253966 252934 251671 250949 250860 250937 251095 251773 253065
52516 253065 254448 255628 256981 258731 260348 261313 262018 263289 265355 267886 270760 274066 277474 280303 282317
52501 282317 283827 284787 284373 281886 277820 273566 270103 267296 264540 261780 259594 258361 257681 256832 255601
52486 255601 254352 253420 252793 252460 252656 253540 254815 255878 256250 255859 255115 254748 255288 256599 258139 259663 261287
52469 261287 262861 263870 264281 264879 266362 268536 270877 273398 276243 278855 280450 281219 282183 283709 284962
52454 284962 285016 283840 281841 279126 275744 272211 269245 267110 265577 264360 263299 262301 261378 260701 260439 260570
52438 260570 260928 261229 261050 260129 258781 257664 256899 255809 253845 251460 249658 248880 248708 248523 248113 247714 247799
52421 247799 248727 250352 252087 253645 255456 258012 261006 263624 265572 267289 269213 271402 273970 277241
52407 277241 281252 285675 290518 296405 303678 311622 319028 325212 330018 333136 334138 333113 330624 326911
52393 326911 321770 315434 309018 303651 299452 295792 292355 289503 287653 286788 286677 287236 288450 290156 292130
52378 292130 294311 296698 299116 301331 303450 305985 309413 313712 318430 323108 327502 331582 335498 339558
52364 339558 343953 348405 352250 355022 356783 357774 357923 357050 355452 353897 352894 352310 351866 351712 352112 352812
52348 352812 353199 353146 353278 354194 355803 357616 359449 361532 364192 367766 372630 378832 385720 392445 398990
52333 398990 406286 415086 425111 435620 446488 458255 471285 485405 500358 516109 532515 549160
52321 549160 565862 583112 601631 621515 642002 662058 680981 698600 715181 731281 747459
52310 747459 763923 780464 796708 812392 827430 841920 856138 870333 884315 897391 908927
52299 908927 919003 928284 937209 945424 952111 956692 959083 959490 958183 955466 951546 946353 939651 931426
52285 931426 922128 912551 903625 896227 890838 887245 884803 883148 882492 883075 884689 887105 890745 896474 904684
52270 904684 914931 926494 938855 951559 964054 975979 987442 998800 1010270 1021927 1033872
52259 1033872 1046170 1058735 1071440 1084227 1096932 1109095 1120146 1129787 1138122 1145523 1152373 1158742
52247 1158742 1164124 1167665 1168851 1167917 1165439 1161632 1156194 1148764 1139396 1128743 1117879 1107714 1098321
52234 1098321 1088989 1079128 1068954 1059087 1049837 1041310 1033869 1027796 1022563 1017170 1011404 1006189 1002429 1000027
52220 1000027 998408 997511 997739 999191 1001482 1004187 1007072 1010021 1013178 1017131 1022452 1028906 1035463 1041254
52206 1041254 1046312 1051261 1056502 1061916 1067135 1071849 1075887 1079251 1082258 1085537 1089713 1094969 1100867 1106660
52192 1106660 1111781 1116091 1119799 1123266 1126848 1130731 1134776 1138552 1141530 1143272 1143551 1142513 1140597 1138007
52178 1138007 1134208 1128308 1120108 1110507 1100664 1090985 1081274 1071653 1062909 1055902 1050936 1047697 1045562 1043948
52164 1043948 1042659 1041987 1042292 1043496 1045173 1047077 1049212 1051370 1053071 1054186 1055219 1056584 1057905 1058524 1058529
52149 1058529 1058706 1059383 1059903 1059526 1058474 1057674 1057713 1058457 1059552 1060738 1061631 1061778 1061264 1060960 1061782 1063829 1066501
52132 1066501 1069387 1072758 1077318 1083793 1092708 1104164 1117757 1132969 1149754 1168548 1189650 1212845
52120 1212845 1237650 1263581 1290079 1316513 1342526 1368188 1393566 1418341 1441964 1463961 1483886
52109 1483886 1501355 1516425 1529705 1541663 1551975 1559951 1565395 1568636 1569879 1569164 1567024 1564537 1562430
52096 1562430 1560468 1557984 1554576 1549996 1543726 1535192 1524412 1512098 1499075 1485789 1472263 1458268
52084 1458268 1443495 1427943 1412369 1398182 1386683 1378326 1372828 1369830 1369220 1370805 1374105 1378770 1385056
52071 1385056 1393445 1403847 1415534 1427900 1440877 1454466 1468341 1482223 1496218 1510297 1523737
52060 1523737 1535618 1545778 1554831 1563263 1570910 1577238 1581772 1584338 1585316 1585455 1584970 1582939 1578304 1571325
52046 1571325 1563248 1554457 1543830 1530201 1513572 1494423 1472819 1449071 1424618 1401185 1379312 1358527
52034 1358527 1338673 1320153 1303025 1286874 1271674 1257933 1245763 1234568 1223931 1214066 1205056 1196310
52022 1196310 1187280 1178154 1169289 1160407 1150912 1140723 1130245 1119733 1109196 1098786 1088709 1078794
52010 1078794 1068627 1058120 1047446 1036348 1023954 1009514 993023 974995 955935 936278 916546
51999 916546 897180 878260 859614 841176 823093 805567 788815 773229 759363 747575 737663 728937
51987 728937 720618 712162 703265 693723 683416 672426 661062 649698 638610 627884 617360 606611
51975 606611 595228 583318 571640 560995 551525 542817 534693 527596 522145 518595 516984 517459 520044
51962 520044 524192 529011 534071 539619 545835 552137 557474 561128 563047 563530 562874 561263 558730 555206 550842
51947 550842 546372 542977 541570 542229 544388 547585 552003 558279 566823 577392 589363 602393 616637
51934 616637 632274 648986 666023 682586 697882 710898 720420 725400 725143 719278 707861 691686
51922 691686 672185 650805 628575 606258 584580 563996 544467 525836 508434 493032 480180
51911 480180 469783 461327 454279 448238 443012 438729 435723 434148 433802 434515 436582 440462 445992 452110
51897 452110 457606 462114 466115 469926 472862 473590 471309 466419 460027 452976 445493 437710 430225 423940
51883 423940 419378 416381 414541 413731 413991 415086 416586 418496 421434 425972 432017 439076 446787 454821 462424
51868 462424 468610 472889 475468 476733 476879 476093 474645 472607 469803 466223 462191 458047 454047 450750 449019
51853 449019 449241 450876 453108 455689 458700 461816 464281 465501 465225 463315 459835 455323 450499 445671 440773
51838 440773 435898 431338 427112 422919 418675 414673 411216 408523 406994 406942 407908 408796 408968 408693 408293 407437
51822 407437 405751 403593 401575 399682 397543 395350 393794 393059 392483 391418 389986 388873 388711 389765 391821
51807 391821 394186 396119 397455 398589 399741 400573 400690 400240 399726 399419 399292 399382 399881 400774 401585 401586 400239 397525
51789 397525 393981 390397 387352 384953 383029 381516 380620 380610 381544 383150 384965 386632 388133 389680 391377
51774 391377 393070 394598 396074 397807 399977 402545 405466 408880 413108 418501 425224 433034 441277 449265
51760 449265 456628 463128 468172 470854 470708 468171 464093 458930 452696 445501 437725 429667 421472 413522
51746 413522 406468 400609 395583 391031 387260 384766 383326 382204 381346 381697 384056 388126 393116 398851 405640
51731 405640 413191 420366 426147 430368 433346 435288 436360 436985 437696 438855 440687 443197 445655 446509 444525
51716 444525 440047 434710 429859 425759 422316 419785 418271 417008 414843 411375 407252 403387 400241 397786
51702 397786 395856 394519 394304 395858 398992 402221 403834 403524 402558 402192 402419 402478 402062 401507 401079 400647 400094
51685 400094 399618 399435 399331 398701 397056 394531 391872 389810 388434 387321 386322 385958 386949 389503 393234 397559
51669 397559 402009 406386 410871 415897 421687 428024 434612 441449 448524 455271 460633 463672 463966 461523
51655 461523 456648 449964 442419 435281 430031 427810 428585 431096 434072 437361 441351 445424 447714 446603
51641 446603 442014 435133 427383 419906 413404 407934 403104 398851 395757 394267 393913 393810 393659 393681 393675 392878
51625 392878 390953 388560 386620 385341 384323 383243 381953 380032 376872 372484 367943 364595 362802 361596
51611 361596 359684 356724 353586 351406 350444 349943 349113 348098 347759 348533 349869 351035 352191 354190 357445
51596 357445 361541 366084 371329 377669 384967 392840 401114 409351 416233 420191 420778 418893 415629 411482
51582 411482 406782 402211 398512 396094 395206 396115 398803 402867 408151 415188 424652 436514 450011 464301
51568 464301 478869 493533 508403 523733 539557 555636 571908 588754 606519 625123 644510
51557 644510 665205 687927 712777 739226 766661 794183 819881 841067 855688 863289 864398 859388
51545 859388 848271 831320 809514 784391 757562 730226 702943 675891 649421 624290 601381
51534 601381 581320 564443 550849 540313 532180 525452 519024 511963 503872 495098 486404 478293 470691
51521 470691 463285 455915 448537 441048 433400 425849 418868 412800 407624 403055 398764 394585 390593 386995
51507 386995 383893 381185 378713 376406 374270 372379 371019 370645 371374 372471 372661 371245 368897 367163 367115
51492 367115 368542 370451 372115 373478 374697 375708 376362 376753 377138 377601 377972 378043 377725 376976 375722 373949
51476 373949 371798 369507 367257 365109 363110 361448 360325 359557 358411 356191 353045 349870 347265 344888
51462 344888 342069 338734 335330 332139 329184 326738 325284 324880 325022 325333 325959 327095 328612 330475 333111
51447 333111 336920 341735 347191 353355 360428 368015 375458 382971 391673 402081 412999 422467 429534 434635
51433 434635 438454 441099 442500 443032 443271 443327 442673 440524 436249 429717 421623 413396 406342 400731 395930
51418 395930 391421 387383 384188 381696 379375 376959 374702 373046 372231 372201 372645 373117 373359 373614 374498 376393
51402 376393 378900 381006 381931 381927 382151 383627 386368 389683 393168 397005 401326 405831 410401 415697 422710
51387 422710 431897 443110 456180 471147 488089 507204 528986 553762 581074 610090 640786 674209
51375 674209 711315 751939 795042 839329 883079 923667 957926 983220 998232 1003050 998773 986784
51363 986784 967943 942480 910715 873689 832899 789840 746160 703804 664228 627405 592310
51352 592310 558676 527792 501230 479153 460304 443515 428746 416658 407536 400816 395417 390354
51340 390354 385116 379803 375020 371521 369692 369257 369506 369816 369955 369956 369881 369760 369600 369363 368997 368586 368347 368347 368277
51321 368277 367629 366040 363451 360075 356399 353079 350520 348592 346937 345534 344678 344380 344164 343669 343150 343057
51305 343057 343300 343294 342700 341766 340854 340023 339271 338844 338991 339508 339878 339835 339510 339078 338601 338327 338673 339673 340675
51286 340675 340969 340613 340348 340839 342310 344890 348829 354147 360318 366529 372192 377111 381277 384649 387140
51271 387140 388742 389664 390247 390656 390768 390594 390737 392011 394512 397322 399354 400208 400025 398828 396450 393038
51255 393038 389181 385447 382018 378810 375699 372518 369055 365256 361343 357574 353974 350443 347127 344516
51241 344516 343032 342613 342783 343112 343461 343774 343842 343467 342778 342152 341891 342121 342946 344354 345928 346912 346827 345881
51223 345881 344669 343629 342933 342699 343017 343705 344299 344435 344237 344234 344825 345842 346754 347343 347985 349059 350325 351290
51205 351290 352134 353719 356463 359655 362223 363941 365521 367663 370369 373133 375475 377256 378654 379865
51191 379865 380846 381358 381287 380753 379927 378957 378031 377120 375649 372976 369434 366372 364760 364194 363719 363131 362850
51174 362850 362985 363352 364201 365959 368215 369890 370606 371108 372056 373112 373651 373707 373687 373656 373481 373333 373485 373778
51156 373778 373782 373409 372916 372432 371775 370686 368945 366396 363215 360098 357898 357010 357143 357587 357609 356805 355417
51139 355417 354171 353620 353695 354005 354374 354879 355591 356560 357886 359500 361090 362498 363994 365770 367367 368106
51123 368106 368037 367927 368257 368789 369325 370356 372472 375360 377889 379229 379602 379815 380325 381014 381766 382867 384612
51106 384612 386712 388523 389916 391534 393971 396925 399495 401158 402156 403021 404032 405129 406090 406725 407054
51091 407054 407298 407579 407772 407830 408080 408882 410097 411221 411994 412578 413116 413517 413710 413823 414052 414652 416047 418505
51073 418505 421562 424188 425788 426798 428142 430445 433944 438714 444505 450675 456841 463661 472523 484388
51059 484388 499117 515960 534360 554098 574750 595144 613491 628246 639091 647187 654446 662470
51047 662470 671880 682154 691879 699445 703953 705553 704791 701766 696077 687522 676601 664380 652105
51034 652105 640900 631521 624069 617856 611601 603945 594109 582293 569386 556207 543123 530453 518979
51021 518979 509744 503445 500117 499254 499986 501450 503431 506639 511969 519419 528038 536936 545983 555477 565513
51006 565513 575865 586153 595934 604895 613147 621068 628668 635307 640255 643315 644749 644783 643506 641141
50992 641141 638214 635452 633539 632782 632904 633384 634109 635530 638147 642214 648123 656524 667609 680656 694850
50977 694850 710332 727754 746916 766550 785678 804573 824189 845206 868021 893227 921516
50966 921516 953167 988066 1026227 1068060 1114060 1164289 1218157 1274694 1333131 1393149 1454395
50955 1454395 1515811 1575824 1633328 1688083 1739938 1788098 1831526 1869862 1903530 1933053 1958668
50944 1958668 1980520 1998882 2014145 2026925 2038142 2048682 2058866 2068351 2076454 2082325 2085041 2084082
50932 2084082 2079749 2072702 2062924 2049553 2031879 2010029 1984390 1954735 1920358 1880800 1836042 1786195
50920 1786195 1731619 1673376 1613111 1552251 1491588 1431703 1373477 1317864 1265378 1216072 1169992
50909 1169992 1127421 1088655 1053685 1022180 993752 968172 945296 924763 905833 887690 870023
50898 870023 853259 838098 824848 813316 803305 795020 788799 784552 781637 779331 777291 775512 774036
50885 774036 772904 772337 772749 774449 777340 780937 784672 788251 791863 796083 801493 808337 816544 825972 836452
50870 836452 847678 859367 871685 885249 900510 917295 935295 954869 977027 1002526 1031265
50859 1031265 1062646 1096302 1132362 1171253 1213570 1260083 1311688 1369226 1433394 1504721 1583547
50848 1583547 1670007 1764035 1865370 1973550 2088018 2208172 2333228 2462101 2593672 2727148
50838 2727148 2861686 2995453 3125347 3247966 3360633 3461271 3547851 3618854 3674321 3715815
50828 3715815 3745140 3763576 3772472 3773834 3769883 3762545 3753935 3746812 3743719 3745726 3752551 3763660 3778282
50815 3778282 3794130 3806976 3812189 3806494 3787989 3755044 3705983 3639839 3556874 3458169 3345087
50804 3345087 3219272 3082927 2938797 2789913 2639490 2490987 2347903 2213066 2087924
50795 2087924 1972624 1866979 1771321 1686365 1612341 1548614 1494125 1447895 1409009 1376430 1349144
50784 1349144 1326391 1307586 1292116 1279353 1268704 1259487 1250880 1242274 1233598 1225111 1216898 1208751 1200458
50771 1200458 1191971 1183292 1174360 1165018 1154945 1143700 1131051 1117321 1103208 1089257 1075591 1062167
50759 1062167 1049125 1036849 1025741 1015911 1007066 998916 991841 987002 985488 987424 992155 999175 1008494
50746 1008494 1020227 1034361 1051146 1071275 1095368 1123491 1155320 1190528 1228834 1270012 1314174
50735 1314174 1361794 1413175 1468065 1526031 1586914 1650489 1715925 1782105 1848443 1914832 1980722
50724 1980722 2044859 2106283 2165196 2222327 2277543 2329448 2376379 2417410 2452153 2479766 2498595
50713 2498595 2507093 2505069 2493903 2475646 2452260 2425836 2398978 2374320 2353565 2337390 2326340 2321226
50701 2321226 2322336 2328566 2337734 2347657 2356589 2362793 2364158 2358410 2343523 2317910 2280562 2231329 2171109
50688 2171109 2101748 2025609 1945091 1862366 1779558 1699101 1623570 1554800 1493276 1438677 1390965
50677 1390965 1350535 1317362 1290661 1269695 1254481 1245290 1241770 1243090 1248715 1258439 1271642 1287028
50665 1287028 1303234 1319386 1334996 1349772 1363744 1377248 1390525 1403455 1415877 1428002 1440451
50654 1440451 1454020 1469388 1486759 1505722 1525749 1546936 1569947 1595172 1622438 1651684 1683317
50643 1683317 1717545 1753916 1792037 1832235 1874819 1919131 1964204 2010095 2057526 2106132 2154148
50632 2154148 2200191 2244426 2287469 2328987 2368290 2405812 2443030 2480832 2518369 2553122 2581342
50621 2581342 2598718 2601923 2590569 2567736 2538336 2506830 2476093 2447719 2422775 2402230 2386809
50610 2386809 2376485 2370134 2365848 2361767 2356649 2349697 2339931 2325815 2305536 2277623 2241380 2196860
50598 2196860 2144685 2086074 2022850 1956950 1889679 1821601 1753247 1685656 1620013 1557035 1497039
50587 1497039 1440423 1387739 1339305 1295100 1255042 1219103 1187130 1158785 1133734 1111747 1092679
50576 1092679 1076529 1063488 1053752 1047346 1044290 1044713 1048416 1054477 1061832 1070382 1081034 1094423 1109941
50563 1109941 1126307 1142798 1159637 1177441 1196655 1217476 1239970 1264149 1289926 1316862 1344000
50552 1344000 1370160 1394608 1417283 1438397 1458191 1477277 1496708 1517187 1538379 1559493 1580489
50541 1580489 1602371 1626414 1653542 1684373 1719346 1758690 1802692 1852100 1907858 1970295 2038947
50530 2038947 2113289 2193175 2278286 2367683 2460414 2556331 2655757 2758430 2863172 2968515 3073114
50519 3073114 3175445 3273500 3365076 3448262 3521511 3583341 3632110 3666176 3684440 3686799 3673936
50508 3673936 3646545 3605032 3550287 3484543 3411033 3332786 3252176 3171645 3094310 3023501 2961928
50497 2961928 2911472 2873448 2848668 2837276 2838647 2851317 2872998 2900929 2932359 2964319 2992756
50486 2992756 3012422 3018227 3006756 2976447 2926880 2858605 2773508 2674675 2565737 2450593 2333451
50475 2333451 2218183 2107235 2001567 1901860 1809372 1725366 1650110 1582759 1521977 1466517 1415608
50464 1415608 1369213 1327771 1291467 1259910 1232610 1209399 1190141 1174519 1162532 1154878 1152240 1154285
50452 1154285 1159870 1168233 1179458 1193712 1210481 1228822 1248176 1268691 1290792 1314509 1339194 1363974
50440 1363974 1388457 1412740 1436548 1458617 1477319 1491738 1501829 1507783 1509809 1508528 1504963 1499930
50428 1499930 1493836 1487176 1480720 1474966 1469822 1465254 1461955 1461033 1463214 1468661 1477380 1489471 1505089 1524505
50414 1524505 1548131 1576276 1608906 1645868 1687166 1732708 1781848 1833502 1886664 1940476 1993793
50403 1993793 2045131 2093209 2137287 2176822 2211115 2239453 2261292 2275936 2282213 2278994 2266133 2244574
50391 2244574 2215230 2177963 2132073 2077957 2018071 1956059 1894967 1836435 1781401 1731058 1686870
50380 1686870 1649998 1621110 1600571 1588345 1583579 1584764 1590567 1600322 1613396 1628160 1641809 1651229
50368 1651229 1654010 1648896 1635622 1614491 1585965 1550531 1508948 1462587 1413469 1363950 1316196 1271635
50356 1271635 1230682 1193107 1158869 1128492 1102438 1080336 1061187 1044314 1029630 1016831 1004680
50345 1004680 991484 976184 958941 940903 923619 908428 896031 886498 879743 875814 874693 876046
50333 876046 879437 884626 891428 899465 908351 918029 928553 939601 950545 961011 971101 981010 990731
50320 990731 1000272 1009812 1019440 1028784 1036988 1043084 1046569 1047772 1047558 1046431 1044114 1040309 1035640 1031322
50306 1031322 1027981 1025365 1023299 1022292 1022991 1025558 1029855 1035794 1043158 1051591 1061177 1072660 1086646 1102947
50292 1102947 1121188 1141656 1164932 1190901 1218853 1248525 1280224 1313503 1345842 1372815 1389579
50281 1389579 1392785 1382033 1360065 1331425 1300489 1270279 1242465 1217808 1196500 1178393 1163118
50270 1163118 1150052 1138466 1128052 1119222 1112554 1108069 1105233 1103517 1102586 1102193 1102434 1104067 1108016 1114420
50256 1114420 1122575 1131802 1141883 1152543 1163158 1173300 1183221 1193478 1204341 1215763 1227599 1239518
50244 1239518 1250941 1261326 1270354 1277571 1282066 1282879 1279749 1273369 1264974 1255674 1246019 1236007 1225591
50231 1225591 1215165 1205386 1196476 1187840 1178361 1166758 1151689 1132065 1107675 1079415 1048699 1016783
50219 1016783 984724 953636 924544 897982 873964 852349 833078 816075 801068 787653 775540
50208 775540 764776 755560 747784 740981 734893 729810 725975 722850 719536 715842 712404 709717 707651 706030
50194 706030 704989 704395 703553 701964 699899 697715 695075 691489 687267 683176 679265 674748 669158 663042 657326
50179 657326 652434 648250 644549 641188 637987 634779 631601 628765 626675 625476 624922 624629 624472 624603 625217
50164 625217 626613 629366 633864 639433 644477 647990 650677 654192 659507 666430 674413 683269 693214 704701
50150 704701 718218 733773 750597 767761 785150 803461 823292 844692 867589 892047 917847
50139 917847 944237 970528 996732 1023301 1050341 1077342 1103705 1129330 1154634 1180016 1205368
50128 1205368 1230090 1253383 1274281 1291437 1303281 1308697 1307463 1299956 1286688 1268331 1245811 1220021
50116 1220021 1191640 1161554 1131236 1102221 1075315 1050708 1028646 1009453 992874 977967 963810
50105 963810 949974 936284 922533 908611 894643 880881 867682 855557 844955 835919 828264 821966
50093 821966 817011 812953 809248 806122 804537 805078 807362 810866 815847 822895 831826 841561 851173 860735
50079 860735 870947 881968 892723 901573 907762 912069 915743 919065 921345 922181 922071 921650 920933 919576
50065 919576 917447 914539 910718 905912 900396 894589 888730 882919 877284 871978 867271 863738 861940 861721
50051 861721 862194 862677 863287 864462 866463 869709 874941 882364 890989 899585 908106 917472 928090 939398
50037 939398 950869 962644 974837 986930 998311 1009017 1019464 1029692 1039342 1048305 1057036 1066166
50025 1066166 1075901 1085855 1095413 1104354 1113150 1122547 1132825 1143512 1153808 1163099 1171102 1177743 1183041
50012 1183041 1186974 1189375 1190052 1189074 1186744 1183222 1178284 1171482 1162257 1149835 1133386 1112732 1088863
49999 1088863 1063434 1037741 1012416 988046 965623 946043 929358 914848 901752 889653 878227
49988 878227 867030 855837 844969 834928 825705 816649 807075 796768 785788 773977 760986 746845
49976 746845 732343 718590 706158 694751 683806 673319 663843 655764 648856 642707 637201 632326 627708
49963 627708 622809 617569 612515 608163 604668 602111 600724 600552 601193 602264 603956 606797 610924 615926 621454
49948 621454 627680 634983 643385 652460 661659 670522 678659 685776 691880 697318 702435 707156 710963 713232
49934 713232 713492 711444 706987 700325 691892 682011 670836 658735 646528 635088 624772 615404 606746
49921 606746 598823 591949 586651 583442 582380 582877 584134 585664 587222 588515 589406 590322 591935 594425 597464
49906 597464 600937 605156 610239 615800 621501 627579 634578 642842 652423 663112 674334 685335 695624
49893 695624 704970 712901 718786 722657 725339 727302 727860 726053 721928 716286 709435 700945 690623 679069
49879 679069 667137 655322 643865 633100 623416 614918 607184 599425 591161 582943 576140 571718 569434
49866 569434 568451 568361 569142 570511 572070 574006 576929 580974 585705 591029 597574 605865 615623 626180 637129
49851 637129 648284 659352 670032 680206 689712 698092 704759 709315 711650 712042 711232 710004 708413 705742
49837 705742 701384 695446 688233 679608 669409 658263 647451 637964 630068 623727 618933 615523 613082
49824 613082 611352 610501 610763 611909 613390 615048 617511 621675 627772 635082 642681 650369 658649 667852 677572
49809 677572 687003 695531 702816 708611 712860 715871 718084 719590 720113 719408 717476 714327 709822 703864 696578
49794 696578 688253 679212 669856 660676 652033 643946 636096 628052 619531 610691 602227 594989 589324 584896
49780 584896 581271 578492 576828 576122 575727 575128 574304 573482 572913 573050 574553 577737 582186 587209 592608 598692
49764 598692 605618 613033 620395 627347 633720 639371 644095 647653 649929 651205 652138 653182 654057 653965 652242
49749 652242 648585 642922 635538 627279 619137 611564 604583 598491 593871 590864 589050 588178 588355 589245 589829
49734 589829 589494 588806 588702 589501 591250 594387 599145 604595 609258 612667 615665 619234 623708 629107 635496
49719 635496 642848 651071 660257 670467 681326 692314 703338 714400 724732 732941 738013 739654 737823
49706 737823 732908 726384 720197 715024 709933 704148 698287 693345 689392 686129 683972 683475 683940 683600 681251
49691 681251 677048 671776 666099 660636 656184 653447 652648 653505 655593 658833 663689 670543 678797 687130 695012
49676 695012 703538 714282 727698 743154 760006 777732 795113 810185 821294 827819 829960 828494
49664 828494 824826 820680 817360 815488 815353 817056 820347 824787 830035 835341 838675 837218 829287 815487
49650 815487 797822 778211 758099 738775 721232 705873 692798 682196 674151 668310 664197 661639
49638 661639 660464 660066 659816 659750 660249 661071 661326 660536 659148 657732 656064 653332 648940 642928 635860 628592
49622 628592 621892 616014 610723 605905 601839 598660 595851 592749 589428 586635 584879 583991 583609 583619 583957
49607 583957 584406 584907 585813 587432 589459 591145 592049 592403 592777 593545 594576 595322 595279 594541 593814 593735 594278 594940
49589 594940 595307 595195 594492 593331 592363 592339 593296 594487 595262 595717 596374 597568 599369 601787 604745 607988 611273
49572 611273 614559 617870 621149 624426 627994 632261 637537 644053 651945 660988 670481 679601 687799 694727
49558 694727 700012 703376 704817 704474 702416 698808 694112 688849 683343 677951 673332 670074 668153 667207 667286
49543 667286 668765 671447 674346 676646 678472 680383 682470 684446 686337 688575 691467 695064 699604 705618
49529 705618 713404 722749 733386 745444 759142 774264 790338 807206 824890 842720 859063 872322
49517 872322 882122 889273 894790 899321 903413 907716 912623 918034 923844 930550 938976 949280 960358 970263
49503 970263 977183 980046 978419 972120 961152 946071 928217 909274 890543 872706 856118 840957
49491 840957 827074 814201 802563 792924 785649 780061 775155 770748 767399 765360 764297 764058 764998 767141
49477 767141 769572 771233 772040 772723 773716 774767 775620 776514 777761 779279 780858 782687 785235 788646 792501
49462 792501 796207 799474 802362 805022 807476 809627 811439 812996 814282 814911 814336 812511 810165 808141 806601
49447 806601 805164 803694 802422 801294 799799 797772 795891 794984 795189 796211 798045 800873 804463 808333 812487
49432 812487 817355 822979 828878 834919 841835 850573 861450 874196 888519 904419 922134 941850 963233
49419 963233 985348 1007393 1029263 1050558 1068933 1080427 1082183 1074623 1060796 1044401 1028788 1016719
49407 1016719 1009574 1006814 1007138 1010229 1016720 1026610 1038667 1051605 1065004 1078755 1092287 1104910 1116559
49394 1116559 1127754 1138920 1149990 1160482 1169718 1177070 1182173 1184993 1185702 1184520 1181471 1176218 1168371
49381 1168371 1158180 1146690 1134879 1122895 1110527 1098149 1086667 1076664 1068179 1061263 1056073 1052365
49369 1052365 1049532 1047365 1046269 1046485 1047565 1048814 1049784 1050124 1049429 1047567 1044794 1041276 1036824 1031284 1024841
49354 1024841 1017715 1009971 1001887 994050 986791 979924 973418 967905 964056 961756 960293 959069 957652 955463
49340 955463 952018 947495 942587 937819 933288 928890 924436 919666 914629 910000 906659 904983 904935 906725 910872
49325 910872 917590 926574 937570 950716 966042 982857 999868 1015717 1029266 1039524 1045619 1046974
49313 1046974 1043608 1036297 1026314 1014781 1002242 988884 974983 960883 946699 932511 918957 907239
49301 907239 898268 891961 887560 884520 882878 882930 884743 887979 892020 896302 900685 905488 910914 916374 920613
49286 920613 922718 922950 922386 921797 921114 919998 918583 917353 916487 915691 914751 913965 913948 915224 918118 922798 929070
49269 929070 936048 942313 946701 949126 950517 951788 952898 953143 952279 950959 949923 949278 948937 949350 951222
49254 951222 954839 960325 968297 979415 993214 1008316 1023946 1040327 1057004 1071650 1081369 1084859
49242 1084859 1082693 1075947 1065433 1052083 1037220 1022156 1007886 995132 984221 974927 966896 960336
49230 960336 956009 954522 955847 959357 964003 968635 972685 976575 981070 986246 991475 996361 1001229 1006654
49216 1006654 1012962 1020272 1028556 1037532 1046853 1056577 1067089 1078431 1090044 1101345 1112280 1123197
49204 1123197 1134478 1146440 1159284 1172966 1187335 1202470 1218522 1235140 1251410 1266610 1280692
49193 1280692 1293840 1305897 1316639 1326412 1336097 1346348 1357068 1367648 1377590 1386932 1396079 1405313
49181 1405313 1414657 1424418 1435594 1449274 1465571 1483625 1502872 1523963 1548141 1575965 1606928 1640218
49169 1640218 1675616 1713588 1754415 1796867 1837599 1872072 1896479 1909161 1910892 1904549 1894332 1884192
49157 1884192 1876122 1870006 1865204 1861825 1860273 1860307 1861287 1862992 1865530 1868631 1871742 1874814 1878455 1883316 1889770
49142 1889770 1898069 1908265 1919900 1932308 1945316 1959257 1974273 1990128 2006776 2024473 2043112
49131 2043112 2061975 2080542 2099142 2118400 2138381 2158736 2179448 2200883 2223120 2245675 2268106
49120 2268106 2290677 2314259 2339621 2366925 2395938 2426694 2459833 2496286 2536836 2582218 2633440
49109 2633440 2691567 2757251 2831038 2914404 3009771 3118310 3237029 3358161 3472424 3574409
49099 3574409 3665937 3753649 3841311 3922708 3982309 4004569 3984398 3929778 3855011 3771363 3682508
49088 3682508 3586427 3480289 3364358 3243034 3123266 3011769 2912960 2828533 2758122 2700116
49078 2700116 2652354 2612833 2580114 2553179 2531037 2512667 2497231 2484104 2472675 2462302 2452485
49067 2452485 2442937 2433512 2424193 2415171 2406816 2399517 2393590 2389261 2386513 2384985 2384177 2383811 2383791 2383853 2383566 2382860
49051 2382860 2382297 2382536 2383666 2385241 2386878 2388574 2390529 2392962 2396169 2400487 2406047 2412592 2419446 2425475
49037 2425475 2429243 2429694 2426966 2422420 2417668 2413613 2410404 2407937 2406180 2405212 2405183 2406094 2407371 2407959 2407202 2405520
49021 2405520 2403771 2402075 2399818 2396902 2394407 2393665 2395026 2397903 2401694 2406273 2411706 2417957 2424829 2431926
49007 2431926 2438737 2445033 2451112 2457389 2463785 2469797 2475068 2479579 2483425 2486846 2490369 2494347 2498158 2500490
48993 2500490 2500650 2499101 2496423 2492363 2486526 2479441 2472082 2464508 2455920 2446167 2436365 2427673 2420174 2413458
48979 2413458 2407725 2403562 2400905 2398990 2397408 2396614 2397203 2399033 2401321 2403344 2404896 2406204 2407610 2409263
48965 2409263 2411032 2412792 2414764 2417426 2420976 2425172 2429830 2435298 2442137 2450378 2459393 2468570 2477931 2488008
48951 2488008 2499307 2512065 2526447 2542735 2561239 2582138 2605455 2631140 2659052 2688853 2719971
48940 2719971 2751728 2783605 2815536 2848037 2881984 2918105 2956600 2997260 3040033 3085366 3133875
48929 3133875 3185650 3240039 3296253 3354041 3413567 3474658 3536506 3598305 3659969 3721950 3784464
48918 3784464 3847173 3909596 3971490 4032718 4092954 4151629 4207943 4260924 4309827 4354781 4396762
48907 4396762 4436610 4474252 4509193 4541538 4571976 4600795 4627531 4651805 4673996 4694726 4714038
48896 4714038 4731496 4746849 4760006 4770452 4777301 4780191 4779762 4776908 4771787 4763902 4753016 4739567 4724063
48883 4724063 4706405 4686047 4662751 4636978 4609631 4581456 4552581 4522406 4490011 4454873 4417152
48872 4417152 4377033 4333919 4286805 4235603 4181669 4126675 4071307 4015405 3959040 3902838 3847399
48861 3847399 3793070 3740387 3690173 3642910 3598401 3556292 3516689 3480088 3446997 3417761 3392347
48850 3392347 3370060 3349789 3330914 3313758 3298943 3286648 3276820 3269677 3265417 3263590 3263430 3264855 3268632
48837 3268632 3275422 3285137 3297415 3312204 3329442 3348426 3368008 3387522 3407246 3427802 3449204 3470616
48825 3470616 3491068 3510311 3528954 3547802 3567199 3586957 3606689 3626021 3644633 3662371 3679412
48814 3679412 3696213 3713226 3730588 3748029 3765137 3781800 3798404 3815454 3833010 3850730 3868491
48803 3868491 3886671 3905683 3925490 3945831 3966681 3988203 4010412 4033058 4055661 4077421 4097445
48792 4097445 4115445 4131993 4147667 4162098 4174381 4184256 4192338 4199203 4204835 4209036 4211702 4212423 4210276
48779 4210276 4204379 4194323 4179887 4160753 4136750 4108052 4074841 4037142 3995295 3950218 3902889
48768 3902889 3853858 3803586 3752834 3702275 3652007 3601987 3552726 3504987 3458925 3414091 3370256
48757 3370256 3327718 3286789 3247580 3210456 3176095 3144807 3116228 3090040 3066627 3046553 3029575
48746 3029575 3014668 3001061 2988938 2978989 2971481 2965967 2961907 2959463 2959457 2962433 2967821 2974295 2980903 2987532
$$ [...]
##END NTUPLES=NMR SPECTRUM
##END=
