##TITLE=AC1592_HPIAH13322_8314191_3PV7P7SrwD
##JCAMPDX= 6.0         $$ Bruker NMR JCAMP-DX V2.0
##DATA TYPE= NMR SPECTRUM
##DATA CLASS= NTUPLES
##ORIGIN= BRUKER
##OWNER= Administrator
$$ 1.72 TOPSPIN		Version 2.1
$$ 2013-11-09 20:23:41.524 -0800  Administrator@X
$$ Compression mode = diff/dup
##.OBSERVE FREQUENCY= 400.02188249412
##.OBSERVE NUCLEUS= ^1H
##.ACQUISITION MODE= SIMULTANEOUS (DQD)
##.ACQUISITION SCHEME= undefined
##.AVERAGES= 8
##.DIGITISER RES= 22
##SPECTROMETER/DATA SYSTEM= spect
##.PULSE SEQUENCE= zg30
##.SOLVENT NAME= COFFEE_meoh
##.SHIFT REFERENCE= INTERNAL, COFFEE_meoh, 1, 14.98509
##AUDIT TRAIL= $$ (NUMBER, WHEN, WHO, WHERE, PROCESS, VERSION, WHAT)
$$ ##TITLE= Audit trail, TOPSPIN		Version 2.1
$$ ##JCAMPDX= 5.01
$$ ##ORIGIN= Bruker BioSpin GmbH
$$ ##OWNER= Administrator
$$ $$ E:\/data/COFFEE/nmr/AC1592_HPIAH13322_8314191_3PV7P7SrwD/20/pdata/1/auditp.txt
$$ ##AUDIT TRAIL=  $$ (NUMBER, WHEN, WHO, WHERE, PROCESS, VERSION, WHAT)
(   1,<2013-11-09 20:23:34.774 -0800>,<Administrator>,<X>,<go>,<TOPSPIN 2.1>,
      <created by zg
	started at 2013-11-09 20:22:28.961 -0800,
	POWCHK enabled, PULCHK disabled,
       configuration hash MD5:
       C8 4E 4E 5D D3 5C D8 9E 9F 52 82 E0 59 8A DE 15
       data hash MD5: 64K
       3C 01 93 BC 31 17 4D 72 BF A1 80 FC 19 18 F3 44>)
(   2,<2013-11-09 20:23:37.665 -0800>,<Administrator>,<X>,<proc1d>,<TOPSPIN 2.1>,
      <Start of raw data processing
       efp LB = 0 FT_mod = 6 PKNL = 1 PHC0 = 0 PHC1 = 0 SI = 32K 
       data hash MD5: 32K
       BB DA 12 18 5D B1 21 36 1D A7 6D A2 F7 9F 39 BE>)
(   3,<2013-11-09 20:23:38.008 -0800>,<Administrator>,<X>,<proc1d>,<TOPSPIN 2.1>,
      <pk PHC0 = 91.4502 PHC1 = 0 
       data hash MD5: 32K
       7A 74 77 A7 A5 8B 3F 06 9F 40 37 2C EE 9B 64 B1>)
(   4,<2013-11-09 20:23:38.133 -0800>,<Administrator>,<X>,<proc1d>,<TOPSPIN 2.1>,
      <abs ABSG = 1 
       data hash MD5: 32K
       91 4A 7B A5 08 CF B5 86 EA B5 F4 79 9D C8 C3 E8>)
(   5,<2013-11-09 20:23:38.211 -0800>,<Administrator>,<X>,<proc1d>,<TOPSPIN 2.1>,
      <abs ABSG = 2 
       data hash MD5: 32K
       E1 AB B2 90 BC C3 B0 20 5B 36 24 DE 75 99 28 66>)
(   6,<2013-11-09 20:23:38.290 -0800>,<Administrator>,<X>,<proc1d>,<TOPSPIN 2.1>,
      <abs ABSG = 3 
       data hash MD5: 32K
       61 D5 5E 9F A2 17 3B E8 37 A6 56 82 7B 06 DA C0>)
(   7,<2013-11-09 20:23:38.352 -0800>,<Administrator>,<X>,<proc1d>,<TOPSPIN 2.1>,
      <abs ABSG = 4 
       data hash MD5: 32K
       84 D8 67 FF 67 02 C0 46 5C 4E 6F 20 62 20 C1 D1>)
(   8,<2013-11-09 20:23:38.415 -0800>,<Administrator>,<X>,<proc1d>,<TOPSPIN 2.1>,
      <abs ABSG = 5 
       data hash MD5: 32K
       7B D7 47 A3 B9 CF B1 4E 21 82 B5 F8 39 72 34 0F>)
$$ ##END=
$$ 
$$ $$ hash MD5
$$ $$ E5 19 CD 75 ED 2D 0F 96 E6 2C 81 9D 5D 7E 1F C9
##$RELAX= 
##$RELAX= 
##$RELAX= 
##$RELAX= 
##$RELAX= 
##$RELAX= 
##$RELAX= 
$$ Bruker specific parameters
$$ --------------------------
##$DU= <E:\>
##$EXPNO= 20
##$NAME= <AC1592_HPIAH13322_8314191_3PV7P7SrwD>
$$ [...]
##$TP= (0..7)
150 150 150 150 150 150 150 150
##$TP07= 0
##$TPNAME0= <>
##$TPNAME1= <>
##$TPNAME2= <>
##$TPNAME3= <>
##$TPNAME4= <>
##$TPNAME5= <>
##$TPNAME6= <>
##$TPNAME7= <>
##$TPOAL= (0..7)
0.5 0.5 0.5 0.5 0.5 0.5 0.5 0.5
##$TPOFFS= (0..7)
0 0 0 0 0 0 0 0
##$TUNHIN= 0
##$TUNHOUT= 0
##$TUNXOUT= 0
##$USERA1= <user>
##$USERA2= <user>
##$USERA3= <user>
##$USERA4= <user>
##$USERA5= <user>
##$V9= 5
##$VALIST= <valist>
##$VCLIST= <CCCCCCCCCCCCCCC>
##$VD= 0
##$VDLIST= <DDDDDDDDDDDDDDD>
##$VPLIST= <PPPPPPPPPPPPPPP>
##$VTLIST= <TTTTTTTTTTTTTTT>
##$WBST= 1024
##$WBSW= 4
##$XGAIN= (0..3)
0 0 0 0
##$XL= 0
##$YL= 0
##$YMAX_a= 625858
##$YMIN_a= -537240
##$ZGOPTNS= <>
##$ZL1= 120
##$ZL2= 120
##$ZL3= 120
##$ZL4= 120
##$ABSF1= 14.98509
##$ABSF2= -5.573092
##$ABSG= 5
##$ABSL= 3
##$ALPHA= 0
##$AQORDER= 0
##$ASSFAC= 0
##$ASSFACI= 0
##$ASSFACX= 0
##$ASSWID= 0
##$AUNMP= <proc_prof1d_extract_pilot.lims>
##$AXLEFT= 0
##$AXNAME= <>
##$AXNUC= <1H>
##$AXRIGHT= 0
##$AXTYPE= 0
##$AXUNIT= <>
##$AZFE= 0.1
##$AZFW= 0.1
##$BCFW= 0
##$BC_mod= 0
##$BYTORDP= 0
##$COROFFS= 0
##$CY= 15
##$DATMOD= 1
##$DC= 0
##$DFILT= <>
##$DTYPP= 0
##$F1P= 0
##$F2P= 0
##$FCOR= 0.5
##$FTSIZE= 32768
##$FT_mod= 6
##$GAMMA= 0
##$GB= 0
##$INTBC= 1
##$INTSCL= 1
##$ISEN= 128
##$LB= 0
##$LEV0= 0
##$LPBIN= 0
##$MAXI= 10000
##$MC2= 0
##$MEAN= 0
##$ME_mod= 0
##$MI= 0
##$NCOEF= 0
##$NC_proc= -8
##$NLEV= 6
##$NOISF1= 0
##$NOISF2= 0
##$NSP= 0
##$NTH_PI= 0
##$NZP= 0
##$OFFSET= 14.98509
##$PC= 1
##$PHC0= 91.4502
##$PHC1= 0
##$PH_mod= 1
##$PKNL= yes
##$PPARMOD= 0
##$PPDIAG= 0
##$PPIPTYP= 0
##$PPMPNUM= 2147483647
##$PPRESOL= 1
##$PSCAL= 4
##$PSIGN= 0
##$PYNMP= <proc.py>
##$REVERSE= no
##$SF= 400.02
##$SI= 32768
##$SIGF1= 0
##$SIGF2= 0
##$SINO= 400
##$SIOLD= 32768
##$SPECTYP= <>
##$SREGLST= <1H.CDCl3>
##$SSB= 0
##$STSI= 32768
##$STSR= 0
##$SW_p= 8223.68421052631
##$SYMM= 0
##$S_DEV= 0
##$TDeff= 65536
##$TDoff= 0
##$TI= <>
##$TILT= no
##$TM1= 0
##$TM2= 0
##$TOPLEV= 0
##$USERP1= <user>
##$USERP2= <user>
##$USERP3= <user>
##$USERP4= <user>
##$USERP5= <user>
##$WDW= 1
##$XDIM= 32768
##$YMAX_p= 463412223
##$YMIN_p= -735280
##$CURPLOT= <Network HP LaserJet P1505>
##$CURPRIN= <$Network HP LaserJet P1505>
##$DFORMAT= <normdp>
##$LAYOUT= <+/1D_H.xwp>
##$LFORMAT= <normlp>
##$PFORMAT= <normpl>
##$SURQMSG= 1
$$ End of Bruker specific parameters
$$ ---------------------------------
##NTUPLES= NMR SPECTRUM
##VAR_NAME=  FREQUENCY,     SPECTRUM/REAL,   SPECTRUM/IMAG
##SYMBOL=    X,             R,               I
##VAR_TYPE=  INDEPENDENT,   DEPENDENT,       DEPENDENT
##VAR_FORM=  AFFN,          ASDF,            ASDF
##VAR_DIM=   32768,         32768,           32768
##UNITS=     HZ,            ARBITRARY UNITS, ARBITRARY UNITS
##FACTOR=    0.250966925370066, 1,           1
##FIRST=     8223.43324360094, -204276,      4802
##LAST=      0,             40136,           63368
##MIN=       0,             -735280,         0
##MAX=       8223.43324360094, 463412223,    0
$$ Real data points
##PAGE= N=1
##DATA TABLE= (X++(R..R)), XYDATA
$$ [...]
19567g2764K3199G9760c34535I4919g6417j75268A45852K84683d2747J6593h054
19555b07683E2339J5822b7919g612j23321I7666A5460P3088c22669C3305b65374
19543b6761A49835a05631H2852b3716k27512B12868b1332O750j14338H1467b72071
19531b17517n6393A04014b75312F3783d4540F088c4898A46537d49974a56529P2865
19520h3664j33906f0078F6473f0629k2902J1506M878a6333F6227c47601a70370
19508G1796D760b18747J7863j383M0280K8550q108B39858o0804H395b19674O9847
19496a49827k3508j14958A24577c04447b1687A19319e8030A73659b68019A18161
19485b46055D4542a83774Q8607h367H1225a10552n356B36777m9794p7247g8561
$$ plain form
19567 -72764 -49565 79760 -334535 94919 -76417 -251685 145852 430535 -42747 -26154 -8054
19555 -207683 52339 68161 -27919 -7612 -130933 97666 15460 88548 -322669 33305 -265374
19543 -26761 149835 -105631 82852 -23716 -251228 212868 -21332 -14582 -128920 81467 -272071
19531 -217517 -273910 104014 -275312 63783 -44540 6088 -34898 146537 -449974 -156529 -83664
19520 -83664 -217570 -60078 66473 -60629 -83531 -72025 -67147 -16333 66227 -347601 -170370
19508 71796 4760 -218747 -200884 -202267 -161987 -133437 -141545 239858 179054 8395 -219674 -149827
19496 -149827 -173335 -288293 124577 -304447 -21687 119319 -58030 173659 -268019 118161
19485 -246055 44542 -183774 -95167 -8367 81225 -110552 -115908 236777 186983 109736 -78561
19473a55534B6585b8108E9369a09882J4148j20526L4961j39634B5479K0263a77910
19461A99153a89067e3716p3208o050L65H3744a7389l52275L3705a38k02336D4519
19448I4258h1656L7018C6256c06090I3733J6641J49291b92532B48617o1113c4704
19436a7892F0041L0225g5310o1301A08225A4950a56812e0974p0119M0487D42260
19424b71187a02121A30498d00079J40731G879b05591c5580k0160B22620I8517
19413a32244l456A27491b02256O7973k1722B04191K5843d86109a31539A1697J6626
19402B8323b95854a12137j04914c2416A47655B1657b7436k32062L0943C16645
19391a96767R5613c8317j59044A38796a85835B1786e5475k47997F7276a84438
$$ plain form
19473 -155534 26585 -28108 59369 -109882 -95734 -216260 -181299 -320933 25479 45742 -177910
19461 199153 -189067 -53716 -126924 -132974 -132609 83744 -17389 -369664 -335959 -138 -202474 44519
19448 94258 -81656 -44638 36256 -306090 93733 110374 259665 -292532 248617 187504 -34704
19436 -17892 60041 90266 -75310 -136611 108225 14950 -156812 -50974 -121093 -80606 442260
19424 -271187 -102121 130498 -400079 -259348 7879 -205591 -35580 -55740 222620 98517
19413 -132244 -135700 127491 -202256 -134283 -156005 204191 230034 -486109 -131539 11697 28323
19402 28323 -295854 -112137 -217051 -32416 147655 21657 -27436 -259498 -228555 316645
19391 -196767 -101154 -38317 -197361 138796 -185835 21786 -55475 -303472 67276 -184438
19380A50449C4318K41282j25935a28613O1095p1047j16326M8867P1385H0294d3272
19368B3933P5490b01651A92211f4219k38738A21491c56045L8686a4870j1399k34545
19357b60814D2258M9108l7210a33831j12952a422m46390H5998a97211E6023a65898
19345A74776q5614M0377C2351R6257a52866P3863k09486L3985a7496p8315q9880
19334a85691h0422j05788C30802E4019M2929f2012K7688p7857A05905b08108C7181
19322A16236a46562m0313B29231N9322a3114k13960J08488E656J7063J59058c5892
19310B32745a13759A30996g9267b2545C4113K0046c92087a52283A7882b01718
19299B96454b12343A38860b36611O9217j9274G2590A2243k566P2648A2417b87975
$$ plain form
19380 150449 34318 275600 149665 -128613 -67518 -138565 -254891 -206024 -134639 80294 -43272
19368 23933 99423 -201651 192211 -64219 -302957 121491 -356045 -317359 -14870 -26269 -260814
19357 -260814 42258 91366 54156 -133831 -246783 -1422 -447812 85998 -197211 56023 -165898
19345 174776 89162 129539 32351 128608 -152866 -79003 -288489 -254504 -17496 -95811 -185691
19334 -185691 -80422 -186210 330802 54019 96948 -62012 -34324 -112181 105905 -208108 37181
19322 116236 -146562 -186875 229231 288553 -13114 -227074 -118586 5656 22719 181777 -35892
19310 232745 -113759 130996 -79267 -22545 34113 54159 -392087 -152283 17882 -201718
19299 296454 -212343 138860 -236611 -167394 -186668 72590 12243 9677 82325 12417 -287975
19287e8497C7889e6185l43175f8213q776A77469B022a85242e6172H8922L0578
19276A19500a3203p718B92403a8974j64189q0987f6660j38805N6559D9338a02177
19264a79828j07808Q6880j4885a1414A06864J7333B3200e0346k00762d3760j44839
19253a88599N1164f5197k18432H827i0797m471E1287e1922k62905Q1244A21259
19241c85634a59783O5149A80523i3111j91165l6126A01388K62120J7954b61175
19230a83482B08964a42462j30004f0904m1576C8078c52767R7123L1638e6328a216
19218b41594j7044A71334J02603a83000l01605e9085A8620f3850k36476b5670
19207a3420l0734E4711h9895L0348j83660i7084j04583e2534j56341G3371B6028
$$ plain form
19287 -58497 37889 -56185 -399360 -68213 -76989 177469 2022 -185242 -56172 88922 119500
19276 119500 -13203 -20921 292403 -18974 -183163 -264150 -66660 -205465 -148906 49338 -102177
19264 -179828 -287636 -200756 -215641 -11414 106864 124197 23200 -50346 -251108 -43760 -188599
19253 -188599 -137435 -65197 -283629 8827 -90797 -95268 51287 -51922 -314827 -233583 121259
19241 -385634 -159783 -94634 180523 -93111 -284276 -320402 101388 363508 381462 -261175
19230 -183482 208964 -142462 -272466 -60904 -102480 38078 -352767 -255644 -224006 -56328 -1216
19218 -241594 -258638 171334 273937 -183000 -484605 -59085 18620 -63850 -300326 -25670
19207 -13420 -44154 54711 -89895 -59547 -243207 -97084 -201667 -52534 -208875 73371 26028
19195b82172A78419a2918A21672A1099i3615k1320L843c7752B96888j3760D112
19183a30178O3143j50575a03213o3172A45857L289a17319a6820j3139j67803a0964
19171a85667A35906D1140L8732a1026j79260Q0753B75302f6396A46735b78771
19160b45915B69435d4392C96065b48070c3615R81j35496a9799j0703J4891n5116
19149g0727l63297a83033A83058a33507B6163b81461j74703a65967n2591A46013
19138B1020a19785l1767P3258H297d05859i5185k8517l6691j2909A2970J1116
19127B4086d6215J0134A619M39514e7328o4431j22214l5180B4355d1486k00208
19116b41694d726A4741c00291J17199E4594a89069h9681H1200g3609A91981q1505
$$ plain form
19195 -282172 178419 -12918 121672 11099 -93615 -114935 -111092 -37752 296888 283128 4112
19183 -130178 -67035 -217610 -103213 -166385 145857 149146 -117319 -16820 -29959 -197762 -10964
19171 -185667 135906 41140 79872 -11026 -190286 -109533 275302 -66396 146735 -278771
19160 -245915 269435 -44392 396065 -248070 -33615 -32634 -168130 -19799 -30502 -15611 -70727
19149 -70727 -434024 -183033 183058 -133507 26163 -281461 -456164 -165967 -218558 146013
19138 21020 -119785 -151552 -78294 8297 -405859 -95185 -123702 -160393 -173302 12970 24086
19127 24086 -46215 -36081 1619 441133 -57328 -121759 -243973 -279153 24355 -41486 -241694
19116 -241694 -4726 14741 -300291 -183092 54594 -189069 -89681 81200 -73609 191981 110476
19105A10476m1345b57884D6860a51225H0611i4494j95297J26181J0101A41582
19094A42992f0351A35135b82413I6415c29978D10223a53203A98594a68354B79081
19083b7335j28303k76492K11066L7138a9133B57952a38253a6913j73945i1195
19072b57005A34598k5575g8416E4866K40674b16454a4618j29515B37814a17741
19061B7714c51222F1299L2125f1138j47139I7079d66489A0342a66719I8945J7637
19050A16582K624a25700j7871e15B35003a024l5255j35776g3342A56071b6826
19038I7936b15809B3414b59433l7085A1021c24411A66465d4011G081L53553c4040
19026i4833B77213l9845o5470d71637a37615G9621l5271J68876b25823i8178H4897
$$ plain form
19105 110476 69131 -257884 46860 -151225 80611 -94494 -289791 -163610 -153509 141582
19094 142992 -60351 135135 -282413 96415 -329978 410223 -153203 198594 -168354 279081
19083 -27335 -155638 -432130 -221064 -183926 -19133 257952 -138253 -16913 -190858 -91195
19072 -257005 134598 109023 -78416 54866 295540 -216454 -14618 -144133 237814 -117741
19061 27714 -351222 61299 93424 -61138 -208277 97079 -466489 10342 -166719 98945 116582
19050 116582 119206 -125700 -143571 -515 235003 -1024 -36279 -172055 -73342 156071 -26826
19038 97936 -215809 23414 -259433 -296518 11021 -324411 166465 -44011 7081 360634 -34040
19026 -94833 277213 237368 171898 -471637 -137615 79621 44350 213226 -225823 -98178 84897
19014a73325K6151n6031B68898e4467B9338J11704N5238J9624b12559h7942A1781
19002A81992p9606K0218a53858l7927j95274B59884i9625l436L020I1996g8226
18990b73543E6918i5072a7239G3449J45680k3199D5883b97932j71667a50708j31401
18979b82109h7082A9373i6338r906J592k39986F4623B3372J05261k2788a4255
18967b69074I6669a04930B723a53791L8340c8093q3882J7353j96388a7179m5457
18956f2636A72282f8061P567I4609b39303E1760M3226f4647j80525J11839d5311
18944c2488A31517L902a64272j16748a35386O641o2842C236K15710a7971p9994
18933i7965M552l52456C11914b75445G4169f8600j5872A09025k6698L7926a16970
$$ plain form
19014 -173325 -147174 -203205 268898 -54467 29338 141042 196280 215904 -212559 -87942 11781
19002 181992 102386 122604 -153858 -191785 -387059 259884 -99625 -103061 -100041 91996 -78226
18990 -273543 56918 -95072 -17239 73449 219129 195930 45883 -297932 -469599 -150708 -282109
18979 -282109 -87082 19373 -96338 -106244 -104652 -344638 64623 23372 128633 105845 -14255
18967 -269074 96669 -104930 2723 -153791 -115451 -38093 -121975 -104622 -301010 -17179 -62636
18956 -62636 172282 -68061 -60494 94609 -239303 51760 94986 -64647 -245172 -133333 -45311
18944 -32488 131517 135419 -164272 -281020 -135386 -128745 -191587 3236 218946 -17971 -97965
18933 -97965 -93413 -445869 311914 -275445 74169 -68600 -84472 109025 82327 120253 -116970
18921C6469i0365B02951b66700B42034A13251a86650Q9220A2553b27849Q1410
18911a46439A02731e2961l0134j50494d7602D8923K455h9152k56043c3309r5115
18900a28424A2872a29384C02855c2240C16946j01734a53839j30082a00883M299
18890i6584a4397p5441F2866B3190b04331h0354L1522C44816a49820I3538A7968
18878d6800I4256a28928I006a57060A150h6427E2730J6037J31860C8762c06338
18866A27547a85856l3791A35679a08724A23895a13895G0310a11514o6787O6387
18856a11914B18171o632c1442r964k0976E2144a39276o1634F1404a2101l180q3516
18844i8797r5442D33011a42715N2416j16382A96505h9148B5633c0359j24170A0346
$$ plain form
18921 36469 -90365 202951 -266700 242034 113251 -186650 -97430 12553 -227849 -146439
18911 -146439 102731 -52961 -83095 -233589 -47602 48923 51378 -89152 -345195 -33309 -128424
18900 -128424 12872 -129384 302855 -32240 316946 215212 -153839 -283921 -100883 -96584
18890 -96584 -14397 -89838 62866 23190 -204331 -80354 -48832 344816 -149820 93538 17968
18878 -46800 94256 -128928 9006 -157060 1150 -86427 52730 68767 200627 38762 -306338
18866 127547 -185856 -219647 135679 -108724 123895 -113895 70310 -111514 -178301 -111914
18856 -111914 218171 211539 -31442 -41406 -62382 52144 -139276 -200910 61404 -12101 -15281 -98797
18844 -98797 -194239 433011 -142715 -90299 -206681 196505 -89148 25633 -30359 -154529 10346
18832d4602A14746a38216r6480b1653C18093e3427l7930o8808G2838K2b40033
18820a28502C0841I370a07485m1459b8385H0091d9389j13717B3806b0207j44056
18809a64263C47631A3529a58288H955O6717b13361A17758b51070c7210B52867
18798A7129c47667J08301a5821P470j90381n3381A74999b10183B16616F6720O6487
18787A33207i3126c8978j19806C12196f4482j9169D0117e4830G2199a10470A06798
18775a03457D8500J09551c92200J56114D40676a12752m1626B71560a57762P8270
18765g9492H4288J749b4084m1744j61849e2477G8214J28764h8648j44005A5595
18753A1021b41180a09527j55014L3557C1507J53054C9787b44961h0816A20073
$$ plain form
18832 -44602 114746 -138216 -234696 -21653 318093 -53427 -91357 -160165 72838 72860 -240033
18820 -128502 30841 9370 -107485 -148944 -28385 80091 -49389 -163106 23806 -20207 -164263
18809 -164263 347631 13529 -158288 8955 75672 -213361 117758 -251070 -37210 252867
18798 17129 -347667 -239366 -15821 -8351 -198732 -252113 174999 -210183 216616 66720 133207
18787 133207 -93126 -38978 -158784 312196 -64482 -83651 40117 -54830 72199 -110470 106798
18775 -103457 48500 158051 -392200 -236086 440676 -112752 -154378 271560 -157762 -79492
18765 -79492 84288 86037 -24084 -65828 -227677 -52477 78214 206978 -88648 -232653 15595
18753 11021 -241180 -109527 -264541 -230984 31507 184561 39787 -244961 -80816 120073
18742H0763B0509h3188a9693k8394B05628C9081a88272E1152i6265A69407h3381
18730A74087B7007a98175B33663b42571k67264a06108A99842J13100H8525j1021
18720G7504a4136k46315i2746P3C3582f6336o3389e9902D2725b8323C62945b02064
18707b68959B31005b93837G8937h0348a1094I9429f5339m0395H045a00180A53022
18695i6483d6206A41806b00868k14458a22546K7318J6698r147b3067j80873g2274
18683a36968C11675C2206a8267o7595G4363a78145D47359c47022B39141G8761
18672a00682g453I680i5527k48712B43592a0312C8093j4696b25562p9249a01021
18660H0672b30456h1174K3458H1224C9313b17262C3194a8853j88502a5225k55461
$$ plain form
18742 80763 20509 -83188 -19693 -48087 205628 39081 -188272 51152 -96265 169407 -83381
18730 174087 27007 -198175 233663 -242571 -509835 -106108 199842 312942 88525 77504
18720 77504 -14136 -260451 -92746 -92673 33582 -66336 -129725 -59902 42725 -28323 362945 -202064
18707 -268959 231005 -293837 78937 -80348 -11094 99429 -65339 -105734 8045 -100180 153022
18695 -96483 -46206 141806 -200868 -415326 -122546 -95228 -78530 -87677 -23067 -203940 -72274
18683 -136968 311675 32206 -18267 -85862 74363 -178145 447359 -347022 239141 78761
18672 -100682 -7453 9680 -95527 -344239 243592 -10312 38093 23397 -225562 -304811 -101021
18660 80672 -230456 -81174 -57716 81224 39313 -217262 33194 -18853 -207355 -15225 -270686
18649b70686B4136K53947m7405h2803b4796j5609a8637k9901l1255A76842b97899
18637D4128d47695D6304f4773J2317j29299m56157b00650A51782d3826H2584d2744
18625a72762H0163b83088B32244b98596d250p4585A2805L77373b81372J05159
18615a76213j56670C58079i6813A97446l4190G9348b7341A24965c81520a05387
18604B28410j06081L9440a81831N4614p9251A14450b88886H5280J67990a5953
18593B884R6069h5929B7667N1800b39629B96557I1574e3114B27826a81395C2947
18581a54778A8354c32452B6099A0399a29612o1451A09785b57708H5413a9656A46665
18569A1171C023b12064R3087e1570D0470O2750O4658a37582O5085j64881e9947
$$ plain form
18649 -270686 24136 278083 230678 -82803 -24796 -40405 -18637 -48538 -79793 176842 -297899
18637 44128 -447695 46304 -64773 -52456 -181755 -637912 -200650 151782 -43826 82584 -42744
18625 -172762 80163 -283088 232244 -298596 -4250 -78835 12805 390178 -281372 -176213
18615 -176213 -332883 358079 -96813 197446 163256 79348 -27341 124965 -381520 -105387
18604 228410 122329 161769 -181831 -127217 -206468 114450 -288886 85280 253270 -15953
18593 2884 98953 -85929 27667 79467 -239629 296557 91574 -53114 227826 -181395 32947
18581 -154778 18354 -332452 26099 10399 -129612 -191063 109785 -257708 85413 -19656 146665
18569 11171 3023 -212064 -118977 -51570 40470 103220 167878 -137582 -72497 -237378 -59947
18557c14329a50398K5782C62179a45944r1919o0251Q4015l4165N1384a9057k89557
18546c08614h7089A38590d45715h1319A13669C4249e2803G5120o834h2795m4095
18535a26890h735A3829M7485P5783b5987l1323B0606f5529H776J19930N7254e7399
18522D04249a9187j80313j31170B25976H973b0268A29346a56359H084b02931B12653
18510a77488B6523g0772L0651p4347a6447k31367A55466c12739P8577H166c23621
18498b48934a14675d9048j6601k24935A3657a80537f5061C63787e8423o5714B22270
18486C2881J3299a2411B40829G8791J03649a48627B81630b16571B47110a12726
18475b44127n3452k15422k2419b26158R9017r388l1764B18952r4329c22543C8961
$$ plain form
18557 -314329 -150398 -124616 362179 -145944 -237863 -298114 -214099 -248264 -196880 -19057 -308614
18546 -308614 -87089 138590 -445715 -81319 113669 34249 -52803 75120 68286 -82795 -126890
18535 -126890 -8735 13829 61314 137097 -25987 -57310 20606 -65529 8776 128706 185960 -57399
18522 404249 -19187 -199500 -330670 225976 8973 -20268 129346 -156359 8084 -202931 212653
18510 -177488 26523 -70772 -40121 -114468 -16447 -247814 155466 -312739 -234162 8166 -323621
18498 -248934 -114675 -49048 -65649 -290584 13657 -180537 -65061 363787 -58423 -124137 222270
18486 32881 46180 -12411 240829 78791 182440 -148627 281630 -216571 247110 -112726
18475 -244127 -297579 -513001 -535420 -226158 -127141 -136529 -168293 218952 124623 -322543 38961
18463D41105I4363h4719J9602J6046j9297j04299A60148e1343G4423C5088i2962
18451A61079b62600C01676A48339K8978F0012H373K14938g8735j30206A18431
18440b4274m0103H8813A6297c43589B28086g7695a5895n1362A39699a5656j65494
18429a81150j89988B65481a55942k3422q2782a05120E6110h5086A65676p686D0317
18417D7783J0958a32430l0137A5628a44434A9229a12263r0829A78699Q071a69953
18405b28245C96324b76448c0937b084r7091B64660D6146i7756d0036A8289O3939
18394H2228b0739j50161j31357B15011d29035a29618j2883B9722c2892A18583
18383e65B89647b29786H576f1367j20953N4856B2100b9602B8640d8530k09391
$$ plain form
18463 441105 94363 -84719 -65117 -49071 -68368 -172667 160148 -51343 74423 35088 -92962
18451 161079 -262600 301676 148339 177317 60012 8373 223311 -78735 -208941 118431
18440 -24274 -64377 88813 16297 -343589 228086 -77695 -15895 -67257 139699 -15656 -181150
18429 -181150 -371138 265481 -155942 -179364 -262146 -105120 56110 -85086 165676 157990 40317
18417 47783 58741 -132430 -162567 15628 -144434 19229 -112263 -203092 178699 186770 -169953
18405 -228245 396324 -276448 -30937 -2084 -99175 264660 46146 -97756 -40036 18289 82228
18394 82228 -20739 -170900 -302257 215011 -429035 -129618 -142501 29722 -32892 118583
18383 -565 289647 -229786 8576 -61367 -182320 -127464 22100 -29602 28640 -48530 -257921
18372b57921D2822J20746K78875A72369G9054e5771B07329o7477f0661p1202A26877
18360b8137k18548A43298d6179D6559g0684I7247a81205A07974c39388f5024l1474
18349i6498d1927l34257A44016h1652J8494H8145h4777q782b3189k78287J45878
18338a55598l4160f107r1235q197c7065Q016j95631A4365b25939C2547a40015
18326A83339b59369J21196H1738l5991N1094b0256j95301o1880B2760b37839a06758
18314c88209E56474D9521b52801B3470i4617I98R4280a84766c2628a2253j06880
18303a19133O620o3643P5569K0782I3832e14192K45579f2140k7199C0916b02411
18291a91650Q6867q2764j10220E8551h2707j6341c5051q5873o6424A5044a08435
$$ plain form
18372 -257921 42822 163568 442443 172369 79054 -55771 207329 139852 -60661 -131863 126877
18360 -28137 -246685 143298 -46179 46559 -70684 97247 -181205 107974 -339388 -65024 -96498
18349 -96498 -41927 -376184 144016 -81652 -63158 88145 -84777 -93559 -23189 -301476 -155598
18338 -155598 -189758 -6107 -97342 -105539 -37065 -29049 -224680 14365 -225939 32547 -140015
18326 183339 -259369 -138173 81738 45747 96841 -20256 -215557 -277437 22760 -237839 -106758
18314 -388209 556474 49521 -252801 23470 -94617 998 95278 -184766 -32628 -12253 -119133
18303 -119133 -112513 -176156 -100587 -79805 93832 -514192 -268613 -62140 -89339 30916 -202411
18291 -191650 -104783 -187547 -297767 58551 -82707 -99048 -35051 -120924 -187348 15044 -108435
18279B0860a84947A85926n1338d8921o6990M7918H080a62773A16232C7070c4429
18267E3665b8717G2909c62208a76902A65126b37625F1863R145a02658L8773j8693
18256h2578n9958A5388i1153m2072n8061B04558k1275a11736o3714f3885o1187
18245a25072F9277M3896a60882D742J34609D6591c6548j51155B52973E4188b97722
18233A15543d02535C71862A38064F0196e1184B16641H6286e826o3275k1223l53029
18222d43353g191H3956b83470c2737I8168J6113a30332A06638e7391A04216b06062
18210I6890K9940J4308c24976f8922A584J14691D6803a28723b2819F0452a61426
18198c19981I6553a4262G281R2217a59490A27832E817J1709K77477a13417B90748
$$ plain form
18279 20860 -184947 185926 134588 -48921 -115911 -67993 8080 -162773 116232 37070 -34429
18267 53665 -28717 72909 -362208 -176902 165126 -237625 61863 71008 -102658 -63885 -82578
18256 -82578 -142536 15388 -91153 -133225 -191286 204558 183283 -111736 -175450 -63885 -125072
18245 -125072 69277 113173 -160882 4742 139351 46591 -36548 -187703 252973 54188 -297722
18233 115543 -402535 371862 138064 60196 -51184 216641 86286 -5826 -69101 -90324 -443353
18222 -443353 -7191 83956 -283470 -32737 98168 114281 -130332 106638 -57391 104216 -206062
18210 96890 126830 141138 -324976 -68922 1584 116275 46803 -128723 -22819 60452 -161426
18198 -319981 96553 -14262 7281 99498 -159490 127832 5817 17526 295003 -113417 290748
18186b11392A5527J84731h4148g603k64583a2023p2488b2077j82566C71158a13712
18174A1854J42339a07014C06350r5647b80993A41768a5916k36507J08600c8029
18163F6739b4418r2991J3427m4960k7687A43139d9003k19850A06696l9839b3538
18151d0440l4167A21852l5176j6367a43190A58411a72232D0285a76617l2337J1407
18140a97547Q3615J3442l4705b2958p5190G8912J11658A8807g4228A69039C6260
18128b3715F5371J65127f2920A2303a41462m0321B504P5795q783a72463O4699
18117a07764K3730I6095k2284J5759a22034H3549N1688a42235A80804g5346D754
18105F8642i3774k2753J66i866A55484d29220d8667j99588J0106F3254a79959
$$ plain form
18186 -211392 15527 200258 -84148 -7603 -272186 -12023 -84511 -22077 -204643 371158 -113712
18174 11854 154193 -107014 306350 210703 -280993 141768 -15916 -252423 -143823 -38029
18163 66739 -24418 -117409 -103982 -148942 -176629 143139 -49003 -268853 106696 66857 -23538
18151 -40440 -74607 121852 86676 70309 -143190 158411 -172232 40285 -176617 -208954 -197547
18140 -197547 -113932 -100490 -135195 -22958 -98148 78912 190570 18807 -74228 169039 36260
18128 -23715 65371 230498 -62920 12303 -141462 -181783 2504 78299 69516 -172463 -107764
18117 -107764 -84034 96095 73811 89570 -122034 83549 135237 -142235 180804 -75346 4754
18105 68642 -93774 -116527 -116361 -9866 155484 -429220 -48667 -248255 -238149 63254 -179959
18093b69637A33626g2171B44426j12098c2242A44822b50948A72116a46271a9809
18082c23536G8798d06438c9117j89133O6954O0381B35104a47770D0199d4676j02130
18071a46806j11304J21561B33730l1218H6952a09433A34415h1690K9809j8791
18061g0672J139A17215a20390A65063J88368a84185P0528k49895J28990A80869
18050d6068n7436D8326A4341b80845A56581a82590f0656B11843B2275a25675B6424
18038a15817k2008B0708c04575A08911L00723b2615j02390E8039c77178F2119
18027h3230o3741F581a48992A39080J27977H2681f38k40118G8531a3906I8061
18015a07235c4989J1134k02141L1174L601E9705K21945I9315i9552D2781J48666
$$ plain form
18093 -269637 133626 -72171 244426 132328 -32242 144822 -250948 172116 -146271 -19809
18082 -323536 78798 -406438 -39117 -228250 -161296 -100915 235104 -147770 40199 -44676 -146806
18071 -146806 -258110 -136549 233730 202512 86952 -109433 134415 -81690 -51881 -70672
18061 -70672 -69533 117215 -120390 165063 353431 -184185 -113657 -363552 -234562 180869
18050 -46068 -103504 48326 14341 -280845 156581 -182590 -60656 211843 22275 -125675 26424
18038 -115817 -137825 20708 -304575 108911 409634 -22615 -125005 58039 -377178 62119
18027 -83230 -146971 6581 -148992 139080 267057 82681 -638 -240756 78531 -13906 98061
18015 -107235 -34989 -23855 -225996 -194822 -191221 59705 281650 99315 -99552 42781 191447
18004A91447e55347f0919B37180a13384a0903B3504R039a50764d0717o6398B77203
17992a10670j834h810C0691i6775r9582C82033i9126j04666j54296a02914E0832
17980A74078a62221B28795G5959K56672A36488D3388b44540J07901H5300l4422
17970E0878i4371E0134K00298o6517i084l22343J33643A09244c28367I5698A6707
17958a46377p3503P2341r8132A65830f4313K8632j07409l09857G9543R7033a07853
17946b78266c508j92230h8465B19851i9089h347j01074j03909g9577C20259a90778
17934b06206L3942k8324A9823a84124h9887A54924D858b9581A05185b96373g4533
17922b24537p1372L9594I3027d6957A06594c85716d5144q198E2279b12730I7497
$$ plain form
18004 191447 -555347 -60919 237180 -113384 -10903 23504 32543 -150764 -40717 -107115 277203
17992 -110670 -112504 -8810 30691 -96775 -196357 382033 -99126 -203792 -358088 -102914 50832
17980 174078 -162221 228795 75959 332631 136488 43388 -244540 -136639 85300 50878
17970 50878 -94371 50134 250432 183915 -9084 -331427 -197784 109244 -328367 95698 16707
17958 -146377 -219880 -147539 -245671 165830 -64313 -35681 -143090 -452947 79543 176576 -107853
17946 -278266 -3508 -195738 -88465 219851 -99089 -8347 -109421 -213330 -79577 320259 -190778
17934 -206206 -172264 -200588 19823 -184124 -89887 154924 4858 -29581 105185 -296373 -74533
17922 -224537 -295909 -256315 93027 -46957 106594 -385716 -45144 -53342 52279 -212730 97497
17910G0775b51468O2443Q6737j75770d6035A86945o3734A7288a09799o5693h703
17898B86736a24493B86272b16590F6696k100a74230P6414c873k12688c5225j49642
17887a84867j15940B0469b98715k9597Q1880a079A25177h1886A03089a51867I6797
17875A10854b89670H3506a12844p3984f5392B44958R3592a93634G3761L1592m6663
17864E8690b47588A68175h5159K3359C70110B2782R9650H612J72708a72965q1649
17853b54614H5665f9720m8816I5157g2103I9734J24728b44131E0051J04821m7974
17842A06898i6611Q453N721D4368K59820r5390b32742o4367A56210a51706J624
17831a50082L2978B71146b49285R1555B05579k3754A5598D591K62804e0516a876
$$ plain form
17910 70775 -251468 -189025 -102288 -278058 -46035 186945 123211 17288 -109799 -175492 -8703
17898 286736 -124493 286272 -216590 66696 64596 -174230 -97816 -3873 -216561 -35225 -184867
17887 -184867 -300807 20469 -298715 -328312 -246432 -1079 125177 -81886 103089 -151867 96797
17875 110854 -289670 83506 -112844 -186828 -65392 244958 338550 -193634 73761 105353 58690
17864 58690 -247588 168175 -85159 -61800 370110 22782 122432 8612 181320 -172965 -254614
17853 -254614 85665 -69720 -118536 95157 -72103 99734 224462 -244131 50051 154872 106898
17842 106898 -96611 -88158 -82437 44368 304188 208798 -232742 -297109 156210 -151706 -150082
17831 -150082 -117104 271146 -249285 -157730 205579 181825 15598 4591 267395 -50516 -1876
17819a04226A13032a625j19364F6493K24652d2262B0837h8248E0231R57h7280
17807a2391k19039a7223j5790I2766B3466c6777A74685Q074a72080l0486a1571
17795a33886A01127d2970D0807J01200b4556o176C56127c12434a31353Q299j2771
17784a35825N6048l3972e4257j35267g2431m5679c4839j29133B60935b20619e1725
17772B22865a16020F2538B9142b68204g3129B60191a40950B97658I7533a16688
17761A49499P2370D6974a47663G1660d5785o4765j6739L1004m981C73611l9593
17750C34018A1086M50781A97968a28333k7451n1519i4067e748A70654l67M9609
17739B19896b1757h969G8713b14826A46993J5900C4245a18018q2699Q2680C897
$$ plain form
17819 -104226 113032 -1625 -120989 66493 291145 -42262 20837 -88248 50231 51188 -87280
17807 -12391 -231430 -17223 -33013 92766 23466 -36777 174685 182759 -172080 -202566 -11571
17795 -133886 101127 -42970 40807 142007 -24556 -30732 356127 -312434 -131353 -123054 -135825
17784 -135825 -79777 -113749 -54257 -189524 -72431 -118110 -34839 -163972 260935 -220619 -51725
17772 222865 -116020 62538 29142 -268204 -73129 260191 -140950 297658 97533 -116688
17761 149499 221869 46974 -147663 71660 -45785 -110550 -127289 -96285 -101266 373611 334018
17750 334018 11086 461867 197968 -128333 -155784 -207303 -94067 -5748 170654 170287 219896
17739 219896 -21757 -8969 78713 -214826 146993 162893 34245 -118018 -200717 -118037 3897
17727E4043k568b46424C9567b84929E6454K38639b44858R5981k6824f1228A71077
17715f7491K5390C56026A52585p0221a67730h2188J4430A23421b27966F6733J33719
17704B00452l7993D7993h7303a433j11615o22A6760M5616j2657e3263E1869a33599
17691a25586A21798b95078D8476A3270J70527E6001c36023J63014k0001g912j4704
17680b2616j32776j51518Q8415m9614D877K06505E6023a29864J2345e535H5L666
17668C751J25604o549a29480A08182A0950i920l9214A27886m1473R4352D4138
17656B90528j40233e369A21956b88622D14359n989j8457A42050b01486A3760a90153
17644i3382o6762D9334B0247M4284a79431l21038B58537j04037j347R6708K8439
$$ plain form
17727 54043 51475 -246424 39567 -284929 56454 295093 -244858 -148877 -175701 -61228 171077
17715 -67491 -42101 356026 152585 82364 -167730 -82188 -67758 123421 -227966 66733 200452
17704 200452 162459 47993 -87303 -1433 -113048 -113670 16760 62376 49719 -53263 51869 -133599
17691 -125586 121798 -295078 48476 13270 183797 56001 -336023 -173009 -193010 -7912 -22616
17680 -22616 -155392 -306910 -218495 -268109 4877 211382 56023 -129864 -117519 -5535 85 3751
17668 3751 129355 122806 -129480 108182 10950 -9920 -49134 127886 86413 180765 44138
17656 290528 150295 -5369 121956 -288622 414359 408370 389913 142050 -201486 13760 -190153
17644 -93382 -160144 49334 20247 64531 -179431 -500469 258537 154500 153153 249861 278300
17633B78300j02958f1363m0878a7039j47781D49449j64572q8462c77169g602l68245
17622c75847h069A59157C1745d40049a70308J6133I5443a2729k7777j3314D05384
17610B21600a92720d846C26586B5189M8286L08606A57256e7830A48297a66448
17599A42587c9755A33285i780l1947q1807H6233M1537K63401j73235k3204F0161
17587a90002G0366J23390D578b91563A10745B9738h0512a5904N990B17408p5061
17576A42347J04863a63869A4419a41762A63159p4293b79746B66090J42374A33878
17565D38633o4683a03586A18962b14984A21423C4340L07782A01481a26140I0925
17554F5598K50358A1463a54200E6123b0255A62731a6117o588j28460B96797A4014
$$ plain form
17633 278300 175342 -61363 -102241 -17039 -164820 449449 284877 196415 -377169 -7602 -375847
17622 -375847 -8069 159157 31745 -440049 -170308 -154175 95443 -12729 -40506 -53820 405384
17610 221600 -192720 -4846 326586 25189 73475 382081 157256 -57830 148297 -166448
17599 142587 -39755 133285 -9780 -41727 -123534 86233 127770 391171 217936 194732 60161
17587 -190002 70366 193756 4578 -291563 110745 29738 -80512 -15904 -9914 217408 142347
17576 142347 247210 -163869 14419 -141762 163159 88866 -279746 266090 408464 133878
17565 438633 373950 -103586 118962 -214984 121423 34340 342122 101481 -126140 90925
17554 65598 315956 11463 -154200 56123 -20255 162731 -16117 -22705 -151165 296797 14014
17542A39877E1957a07996K9000o2629E7759O6759D8826c3695C2810L0307J21984
17531A85101Q1061c3088o7087B32734c89541a4910A04871K33593j02882B0404
17520g6255o0270G2557a46686B19473A04607O7538J54559E6649K20842C7448b4245
17508b1785A82682f700H9344b23541B08813E9166P3777R0357K8431I9174a44263
17496a2670A20744P4331o8269l4951L64668c8680j06819B74725g4799c6285r0950
17485a27235A39722M3022K64640e3432B10334r1199E6506J70230R219F4545c1392
17473b07925B12361d90B69916G7196J28054f622F7726L27751g5656D1874J66299
17462B08173J05057G1833J20813P1642p0139o0783L3960e6122F30491C0642R4185
$$ plain form
17542 139877 51957 -107996 -78996 -141625 57759 124518 48826 -33695 32810 63117 185101
17531 185101 266162 -33088 -100175 232734 -389541 -14910 104871 338464 235582 20404
17520 -76255 -136525 72557 -146686 219473 104607 172145 326704 56649 277491 37448 -24245
17508 -21785 182682 -6700 89344 -223541 208813 59166 132943 223300 251731 99174 -144263
17496 -12670 120744 195075 126806 91855 456523 -38680 -145499 274725 -74799 -36285 -127235
17485 -127235 139722 182744 447384 -53432 210334 119135 56506 226736 235955 64545 -31392
17473 -207925 212361 -490 269916 77196 205250 -6622 67726 395477 -75656 41874 208173
17462 208173 313230 71833 192646 264288 194149 133366 167326 -56122 630491 30642 124827
17451A24827M6320L0129p8932K64769q8641a6691E51718A01251Q9804A6856L08943
17440C25799J71897A60925J06282r8748b9674A19681D9469K79575L2140r7692
17430B63492H0140a68102A39755o8527j682B4876a33243A89691r539J09905K39125
17419E29182k29559J2419f0922j30215A29375j7934L1557G0526J01891e1884E8815
17407a18003L7197B22544n8298K19226j20082G8219O0647d3754A68195F4051J3068
17396G7119K8978a04101C15722A31214M0629L761a9852n0608a389B23452B7032
17384A83555a7521J474A28005Q6296D9831K85595I2925N6181m2807K8826J1453
17373A46578l0129b43131J674D6618M6223K13236K3832K03965B18118J99906E089
$$ plain form
17451 124827 171147 201276 122344 387113 298472 -16691 551718 101251 191055 16856 325799
17440 325799 497696 160925 267207 168459 -29674 119681 49469 329044 361184 263492
17430 263492 80140 -168102 139755 71228 69546 24876 -133243 189691 180152 290057 529182
17419 529182 299623 312042 -60922 -191137 129375 111441 142998 70526 172417 -51884 58815
17407 -118003 -80806 222544 164246 383472 263390 78219 138866 -43754 168195 64051 77119
17396 77119 106097 -104101 315722 131214 171843 175604 -19852 -70460 -1389 223452 27032
17384 183555 -17521 -16047 128005 214301 49831 335426 92925 149106 106299 135125 146578
17373 146578 116449 -243131 -241457 46618 92841 306077 329909 533874 218118 418024 5089
17361e4103D28202A85039a3558A12228p520i1033B60368E9273K15271l0160c73880
17349C49865l5100k9826m0011r9755L34487A80609b69137B32595J3276d3360A29901
17337F3236a52140k8530o2215l982b3630B81500J84181A45208J36214G0596N2297
17326A22893k7604M0246K30531m0604C1080R7193C0457J71251K1255b20693f7055
17314A64708o5949l4181J80169L2853A3529c9224l13381D76601r9739A19256J70809
17303B90065c5445n5878I4950k7727N4998g2553B51003J29194j86364f1075A23728
17291D905K82329j32747K8331J68249c1453A50270I041K78090C7699O0220h7111
17279h4555A95828R4015c460A68949R8628k4347A07699J6005N1056L9101K3724
$$ plain form
17361 -54103 428202 185039 -13558 112228 104708 -91033 260368 59273 274544 244384 -373880
17349 349865 314765 284939 244928 145173 479660 180609 -269137 232595 245871 -43360 129901
17337 63236 -152140 -180670 -242885 -246867 -23630 281500 465681 145208 281422 70596 122893
17326 122893 95289 135535 366066 325462 31080 128273 30457 201708 222963 -220693 -67055
17314 164708 98759 64578 244747 277600 13529 -39224 -352605 476601 376862 119256 290065
17303 290065 -35445 -91323 94950 67223 122221 -72553 251003 380197 193833 -61075 123728
17291 4905 287234 154487 182818 351067 -31453 150270 9041 287131 37699 97919 -87111
17279 -84555 195828 289843 -3460 168949 267577 243230 107699 123704 174760 213861 237585
17268B37585b6532B72787G3970L25119H9379a39872C25306k951c3827C12969K520
17257C15489l5475J37942j14264k5683a2547D66791D5896A1231K95945J3829E7901
17245A96158k5593R0969K27713A40896J65736j08749M55376A34910a07558e1590
17234D68194k07354K06317B03286J62306D6870h1941B38115H2339L72537k2265
17224D32611j31338G3454L19166A27052N8420L03737A72740J98220E6800a66434
17213A41147K03556E3136j8243K36207c11106C6245J93588b92557H6258a1664
17202a06407A06731a40975C62098B2065h1945B03871M7480K54631n5274A55340
17191A35421J13756j2500A13371K30686G0817J08393J44809J15788j08574j11482
$$ plain form
17268 237585 -26532 272787 73970 399089 89379 -139872 325306 322355 -33827 312969 315489
17257 315489 280014 417956 303692 278009 -12547 466791 45896 11231 307176 321005 57901
17245 196158 170565 261534 489247 140896 306632 197883 653259 134910 -107558 -51590
17234 468194 260840 467157 203286 365592 46870 -81941 238115 82339 454876 432611
17224 432611 301273 73454 392620 127052 185472 489209 172740 370960 56800 -166434
17213 141147 344703 53136 34893 271100 -311106 36245 229833 -292557 86258 -11664
17202 -106407 106731 -140975 362098 22065 -81945 203871 251351 505982 450708 155340
17191 135421 249177 236677 113371 344057 70817 179210 324019 439807 331233 219751
17181B19751J6553M00195B59923A23282N9712K14420A007J73053k9963K81305
17171D25402r8623A17837b47772A2445M22538j78976K23679I8536a0272F9629
17160D27359J46884B69155a228E0588K49839R9780A71631N17997B77458j34076
17150A43382A8829L34563c6812k5173E85286o6531k17852A06852J71525J29272
17140D07649k02526J56122j72309K02027A88487K4398m9095L06873j67871A33003
17129B44116M1969J10819k8318K07509C6899P7456J02101O8312M3529m1491A2112
17117C21448N1530j63333p2051A1423J32237L61996k16038J73820q2009p2918
17107C08511A23531K40342A00794J00061L4114J66246N3993B06821M6629j2997
$$ plain form
17181 219751 236304 636499 259923 123282 182994 397414 1007 174060 144097 425402
17171 425402 326779 117837 -247772 12445 434983 256007 479686 98536 -10272 69629
17160 427359 574243 269155 -1228 50588 300427 400207 171631 689628 277458 143382
17150 143382 18829 353392 -36812 -61985 585286 518755 300903 106852 278377 407649
17140 407649 205123 361245 188936 390963 188487 212885 163790 470663 302792 133003
17129 244116 286085 396904 368586 576095 36899 114355 216456 284768 328297 286806 12112
17117 321448 372978 209645 137594 11423 143660 505656 289618 463438 381429 308511
17107 308511 123531 363873 100794 200855 234969 401215 455208 206821 253450 240453
17097B40453J57002Q1268R2648j61931J66017j22991D7646L54458l4571J80310
17087E47843m6350F0719M73738k55849K32097k36406J23733A48202N81265j74973
17077E54494L8787B32726K03040K9707j75572J31990K28951k38680J25093p8633
17067D58622j81134K62699B41776j511M79570l01502N1247J94532B70864n0910
17057B19954P6989D8583K52608J5459J81577L428L69868D33252O3293j49468J7986
17046C65063K76094j56556J43113r8602M9270M5622j16301r7852J92520o8113
17036E34258A49115M76865o610B94676L71832k42458J18978J30903j53227j52312
17026C68392M39730k84382J85206Q3133j19460j21968K13079J00623l29133J39993
$$ plain form
17097 240453 397455 478723 571371 409440 575457 452466 47646 402104 367533 547843
17087 547843 501493 60719 534457 278608 510705 274299 398032 148202 729467 554494
17077 554494 593281 232726 435766 465473 289901 421891 650842 412162 537255 458622
17067 458622 277488 540187 241776 240265 719835 418333 469580 664112 270864 219954
17057 219954 296943 48583 301191 316650 498227 501655 871523 433252 496545 347077 365063
17046 365063 641157 484601 627714 529112 578382 624004 507703 409851 602371 534258
17036 534258 149115 625980 619370 294676 666508 424050 543028 673931 520704 368392
17026 368392 808122 523740 708946 792079 672619 550651 763730 864353 535220 675213
17016F75213j96863m6277J86312P1136L0699j49185J78701J70978k34473n9513
17006F26728l6777o4874N2560J62717k47549K86705j04273n9269o8969J28858
16996F75857k33033J47742j31044O250j04622N52842k51672J26995P0734P9740
16986I39789l52993K40942j00202o1933L0231J88942k53866L21185n7132j2464
16976H82499r0032l9802J09197p2400O0815L41497k72182j40324K51803L244k45008
16965G89307J23142l14144J72099k80259L19291L71314n43990K26092K46078j52887
16955I56043R7075J90687n01885J93120R3206j57520J44608j55308J3726K46818
16945A120570K60072n36179J38870j75388L8015L42246n12132M70503l9709J07052
$$ plain form
17016 675213 478350 432073 618385 689521 720220 571035 749736 920714 686241 626728
17006 626728 589951 525077 577637 740354 492805 779510 675237 615968 546999 675857
16996 675857 442824 590566 459522 465772 361150 913992 662320 789315 860049 939789
16986 939789 586796 827738 727536 665603 695834 884776 630910 952095 894963 882499
16976 882499 792467 752665 861862 789462 850277 1191774 919592 779268 1031071 1034315 789307
16965 789307 912449 598305 770404 490145 809436 1180750 636760 862852 1108930 956043
16955 956043 1053118 1243805 741920 935040 1028246 870726 1015334 860026 873752 1120570
16945 1120570 1380642 844463 983333 807945 845960 1188206 676074 1146577 1106868 1213920
16935A213920k38550m6504J74162Q3603l8558j29788L89479k83013k56639J32733
16925A000845L57080j08557j9327K10163J42814l92845K04549j4138L17796k48441
16915A449939l8912J24480j27367r1902m6586K57959l06644J02631j52524K78895
16905A449969L00354k07582k75226L12260J19208p6971J92493j16249j39687J07133
16895A665702k7989l1739j41175J11232J30493O3794n1094K54824k82442k4281
16885A667325L18787j31819J03715j37928J08950J48827j82069L04298l46177
16876A853909M54873j64033l5899J63421M3662p0001K14908j36894j17121O9108
16866B275933j91588j02451K73754j71139M13000J89510j73470j26020J03971
$$ plain form
16935 1213920 975370 928866 1103028 1186631 1148073 1018285 1407764 1124751 868112 1000845
16925 1000845 1357925 1249368 1230041 1440204 1583018 1190173 1394722 1380584 1698380 1449939
16915 1449939 1411027 1535507 1408140 1316238 1269652 1527611 1220967 1323598 1171074 1449969
16905 1449969 1750323 1542741 1267515 1579775 1698983 1622012 1814505 1698256 1558569 1665702
16895 1665702 1637713 1605974 1464799 1576031 1706524 1770318 1719224 1974048 1691606 1667325
16885 1667325 1986112 1854293 1958008 1820080 1929030 2077857 1895788 2200086 1853909
16876 1853909 2308782 2144749 2108850 2272271 2315933 2245932 2460840 2323946 2206825 2275933
16866 2275933 2084345 1981894 2255648 2084509 2497509 2687019 2513549 2387529 2491500
16857B491500P4236j8345N4752J70609K2994M7138j54360L03578m3636o9787K05254
16846C083933j9373M4672M9148K2270M53905k66175j56227K69141p9595j75792
16836C225907M50050Q1567n90188N78140M992K06956k07576R0020K68728k15768
16826C892828K8265J48257J70322J45343j51257Q00728m47747K21112K39936K60041
16816E307828n99297O24163j29454L59517r9570j27310P054N08006m7107J67512
16806E971342J98134J27346J90535j53990K29759K14683L57669J28436K95387
16797G559301j52590K86983L09115J3624K48246n7205N73649K40232P9122O6368
16787I166845M84532J55741J6710N7326P34724J68636L09775K90038M61419P34480
$$ plain form
16857 2491500 2565736 2547391 2602143 2772752 2795746 2842884 2688524 2992102 2948466 2878679 3083933
16846 3083933 3064560 3109232 3158380 3180650 3634555 3368380 3212153 3481294 3401699 3225907
16836 3225907 3675957 3757524 3167336 3745476 3750468 3957424 3749848 3839868 4108596 3892828
16826 3892828 3921093 4069350 4239672 4385015 4233758 5034486 4586739 4807851 5047787 5307828
16816 5307828 4708531 5332694 5203240 5562757 5463187 5335877 5342931 5850937 5803830 5971342
16806 5971342 6169476 6296822 6487357 6333367 6563126 6777809 7135478 7263914 7559301
16797 7559301 7406711 7693694 8002809 8016433 8264679 8207474 8781123 9021355 9100477 9166845
16787 9166845 9651377 9807118 9823828 9881154 10615878 10784514 11094289 11384327 11845746 12580226
16777A2580226p9532K01213L81202P88524N63184N25413L36157K64483M17133
16768A5978003P44625L73299O01076R00276L88886O70524R43696J038344O75742
16759B2314471M96268J112924J406092M97486J516962R81956J275186J379668
16751C0981013J137523J882910J600275J689716J750010J928923K129853K731679
16743D5831902J958140K799792K402532L380444L130355L520401L959961L821954
16735G0805481M405726M723062M697021N511612N633027O599933O384573O412683
16727A15173118P620505P357371P938679P971493Q265291P872359Q243381P156069
16719A77598266O785552N979924M706195L933801K099273J254173o92268k398828
$$ plain form
16777 12580226 12500694 12701907 13083109 13871633 14434817 14960230 15296387 15560870 15978003
16768 15978003 16722628 17095927 17697003 18597279 18986165 19656689 20600385 21638729 22314471
16759 22314471 22810739 23923663 25329755 25827241 27344203 28326159 29601345 30981013
16751 30981013 32118536 34001446 35601721 37291437 39041447 40970370 43100223 45831902
16743 45831902 47790042 50589834 52992366 56372810 59503165 63023566 66983527 70805481
16735 70805481 75211207 79934269 84631290 90142902 95775929 102375862 108760435 115173118
16727 115173118 122793623 130150994 138089673 146061166 154326457 162198816 170442197 177598266
16719 177598266 184383818 190363742 195069937 199003738 201103011 202357184 201664916 199266088
16711A99266088l265330m963811n863528o884347p502868p757200q286727q129784
16703A46612493q537850p935663p766382p517360p292374o733124o313950n711565
16695H8804225n449080n210365n101456m167061m185260l766420l082556l792207
16687E4049820k876238k884893k535759k466229k410482k210927j943222j432268
16679C5289802j939797j369623j564276j256262j306336j531901q26612j126584
16671B4368411q02771j275240j025861q50054o67311p29026q47248n34416j063091
16662A6573393J95647j082815n74925m54860m41146n27334l43628m29504l82076
16653A2532752m70715j82194p25135o00359K25874l96676m81826j69488k54287
$$ plain form
16711 199266088 196000758 191036947 185173419 178289072 170786204 163029004 154742277 146612493
16703 146612493 138074643 130138980 122372598 114855238 107562864 100829740 94515790 88804225
16695 88804225 83355145 78144780 73043324 68876263 64691003 60924583 57842027 54049820
16687 54049820 51173582 48288689 45752930 43286701 40876219 38665292 36722070 35289802
16679 35289802 33350005 31980382 30416106 29159844 27853508 26321607 25494995 24368411
16671 24368411 23565640 22290400 21264539 20414485 19747174 19018148 18170900 17636484 16573393
16662 16573393 16769040 15686225 15111300 14656440 14215294 13687960 13344332 12914828 12532752
16653 12532752 12062037 11879843 11154708 10554349 10780223 10383547 9901721 9732233 9477946
16644I477946m06689l01216j34998m19129J06304m24551l54698J59609m68108
16635G234470J27109l34606m49937K65205k86895p3889k65775m63059L08083k09190
16625E851516k83921j13918J55175l20374m62080j0393o5532j02467o9217l2707
16615D546082R1306k95721j11069N1688m94709J66912j74784L23675j76600k87270
16605C639510J75358j48360k64813R239K23453N6030l86176o289r1075k87622
16595B919255J70294j0034l50886K16057k041n28328J67345J40631R647j78416
16585B553524J81940K02763o57972n795J39759l5582l8495M1793o7390J23036
16575B437581l93406J0352K191n637L51125o4027k79948k11235O8277q2604J11695
$$ plain form
16644 9477946 9071257 8770041 8635043 8215914 8322218 7897667 7542969 7702578 7234470
16635 7234470 7361579 7026973 6577036 6842241 6555346 6481457 6215682 5752623 6060706 5851516
16625 5851516 5567595 5453677 5608852 5288478 4826398 4816005 4750473 4648006 4578789 4546082
16615 4546082 4637388 4341667 4230598 4282286 3787577 3954489 3779705 4103380 3926780 3639510
16605 3639510 3814868 3666508 3401695 3410934 3634387 3690417 3304241 3297952 3206877 2919255
16595 2919255 3089549 3079515 2728629 2944686 2942645 2414317 2581662 2722293 2731940 2553524
16585 2553524 2735464 2938227 2280255 2274460 2414219 2378637 2340142 2381935 2314545 2437581
16575 2437581 2044175 2054527 2056718 2051081 2402206 2338179 2058231 1846996 1915273 1832669 1944364
16564A944364m89025J93383M7627j85407L68228k54505J14996K81313m62158J83942
16554A742758j80938k81475N04860o2436l79278M00599m00597k00413J23255M16113
16544A682448l86962Q3331j03417M22714m3454n76729K68447k50019N26345j84982
16534A437722l83728K89431j07695q8653k2210O6655m22657Q0242r1023O59195
16524A417279m93571L4241J4971J50245m4518k48837L73773j46569L74322o70697
16514G60639k0113J66773o5708J35558j48932K4592J66644K36994n38268L1395
16504G49574J5789J20050J28990k52139k3609L9976m8962n7107M6226j29023J25907
16493G15672K2635l02070O6807L74933j1302l23851o0499L18193r3922j9901o5811
$$ plain form
16564 1944364 1455339 1648722 1696349 1510942 1879170 1624665 1739661 2020974 1558816 1742758
16554 1742758 1561820 1280345 1785205 1722769 1343491 1744090 1343493 1143080 1266335 1682448
16544 1682448 1295486 1378817 1275400 1698114 1654660 1077931 1346378 1096359 1622704 1437722
16534 1437722 1053994 1343425 1235730 1147077 1124867 1191522 768865 849107 758084 1417279
16524 1417279 923708 957949 972920 1123165 1078647 829810 1203583 1057014 1431336 760639
16514 760639 740526 907299 841591 977149 828217 852809 1019453 1256447 718179 749574
16504 749574 765363 885413 1014403 762264 738655 778631 729669 672562 718788 589765 715672
16493 715672 738307 436237 503044 877977 866675 542824 482325 800518 706596 686695 620884
16482F20884p7849J32410n0903J13931n8225K2580L8519J54189J11688C07131
16471E63541p9516j37845K50132q1335j1993K12474l09652M22056J2368j77700
16461F62530G5974L69821K42508r4050j541M9409k74784L51888L31755B99567
16450F71031k87025J75362j8143k25727J0706K83268j53430Q6857j61272L2944
16440D14571J88478A91435j2373k4691O88986l43139j56027p5815K18641K2655
16430E09672R4157k12156K83388j48034j6309J10250k85023K3570J53003j33906
16420C78612R3893L13102B40604a40790C63045P9685j93641j1056A638N69252
16410E70890j35289n7972A39066L54013k37036L337J81538M4386O1119k09785
$$ plain form
16482 620884 543035 675445 624542 738473 680248 702828 741347 895536 1007224 307131
16471 563541 484025 346180 596312 514977 502984 715458 405806 827862 840230 662530
16461 662530 75974 445795 688303 594253 592712 642121 367337 719225 1050980 299567
16450 671031 384006 559368 541225 315498 326204 609472 456042 542899 381627 414571
16440 414571 603049 191435 179062 154371 843357 500218 344191 268376 487017 509672
16430 509672 603829 391673 675061 527027 510718 620968 335945 359515 512518 378612
16420 378612 472505 785607 240604 -140790 363045 442730 249089 238033 1638 570890
16410 570890 435601 377629 139066 493079 256043 259380 440918 485304 546423 336638
16400C36638j44455L7436N2022R155K18389j19683o624r0418I0363M91575B72962
16388B465K70495J2297J47323B04529E8991K22506J19425j10735K18147j57574
16378C50760J43792A95371a3331B18754K41440A32632M96385j80902J860A85793
16367C73194A61318B6936K06836P8461j40810L2450K00893A91119P5647R8466
16357C65232n904G0808c6723C86587A13383k375J9950J36372K1918L7216J35509
16346D61973B07029i835C08290c228A84426j1080d1748A14711q769J51644R1710
16335C49296j3391r2761N2701k372J10225F9512J13253d6362F6990O4481Q0180
16324B11651a654I9610R260b31127A12744a50173B02825b78635C85973b02770
$$ plain form
16400 336638 192183 229619 281641 290796 509185 389502 382878 292460 90363 581938 272962
16388 2465 272960 285257 432580 204529 58991 281497 400922 290187 508334 350760
16378 350760 494552 195371 -13331 218754 460194 132632 629017 448115 449975 185793
16367 373194 161318 26936 233772 312233 171423 203873 404766 191119 266766 365232
16357 365232 359328 70808 -36723 386587 113383 111008 130958 267330 289248 326464 461973
16346 461973 207029 -9835 308290 -3228 184426 173346 -41748 114711 105942 257586 349296
16335 349296 335905 243144 295845 293473 403698 69512 182765 -46362 66990 131471 211651
16324 211651 -1654 99610 108870 -231127 112744 -150173 202825 -278635 385973 -202770
16313A58730P6622b36l8490j36537G5038b57168A83881K6270b27680C50544A20132
16301C28008q0838o7096J42362b32840F1611M2734b25778B16279h6880p0994F3786
16289b28842B18522H9060J7482a5683A10940b08584B6021J13779b62171g0601
16278a37194c9097A57465k1228q00k8100a34080A93191K91436C4237h8568A50784
16266A58423E752P7689R4562Q6995C6158f7999J1651n3320A27297a404A82517
16254B80255j15927l1608N7084J09857I8455M1607L24312A23103L40305B400b89537
16242b18968d2745C54913G4165b2404q7010A92617J34222J4529r3830j00895e76477
16230B77758l0784a6916G1237h3771B91716d9515C04864a07282A49855O5046b10065
$$ plain form
16313 158730 235352 -236 -38726 -175263 75038 -257168 183881 210151 -227680 350544 120132
16301 328008 247170 180074 322436 -232840 61611 104345 -225778 216279 -86880 -157874 63786
16289 -228842 218522 89060 106542 -15683 110940 -208584 26021 139800 -262171 -70601
16278 -137194 -39097 157465 136237 135437 107337 -134080 193191 484627 34237 -88568 150784
16266 158423 5752 83441 178003 264998 36158 -67999 -56348 -109668 127297 -1404 182517
16254 280255 164328 132720 189804 299661 98455 140062 464374 123103 463408 2400 -289537
16242 -218968 -42745 354913 74165 -22404 -109414 192617 326839 341368 247538 146643 -576477
16230 277758 246974 -16916 71237 -83771 291716 -49515 304864 -107282 149855 214901 -210065
16218A42903k460a57619q9961d0781k7580B52165c1187j03205B22670c3234A09983
16206A63750E290K49399a87839A40654a90813C1838K61175a44957c9563C7069
16195b8312A76068F4596c13638f3792J9260B08592b16964g6845j28213B3261K55407
16184B78668O2525l7477h0232K5638j19876B04076a62167H9424J1936m8321I041
16172A41606K6725N1089o1173e8203C56958a41828D202c28063A59332n9964a10068
16160d21957J15844A21140C4604a26301B81650J59102a54182E280a23722A01293
16149c9652D3069f4778G7322K37822d5196k70486a05628B77082a12089j23990
16139b36079f6538k57057b8858m340H9738P5965a24415B04136a57519o8846A50785
$$ plain form
16218 142903 140443 -157619 -247580 -40781 -68361 252165 -31187 -134392 222670 -33234 109983
16206 163750 5290 254689 -187839 140654 -190813 31838 293013 -144957 -39563 37069
16195 -28312 176068 64596 -313638 -63792 -44532 208592 -216964 -76845 -205058 23261 278668
16184 278668 341193 303716 -80232 -54594 -174470 204076 -162167 89424 101360 53039 9041
16172 141606 168331 219420 158247 -58203 356958 -141828 4202 -328063 159332 99368 -110068
16160 -421957 -306113 121140 34604 -126301 281650 440752 -154182 5280 -123722 101293
16149 -39652 43069 -64778 77322 315144 -45196 -315682 -105628 277082 -112089 -236079
16139 -236079 -66538 -323595 -28858 -33198 89738 165703 -124415 204136 -157519 -226365 150785
16127C9523d05864B2892c7587C25315j40904e2573j82092b8783k25014a08799
16116C3363c28260F7128h4332r6526A15508K26248b58355B72502A5799b44104
16105d0206j05405D1134P9130C3657L69990j24873B6370K8607c2194B51267e5692
16093A69337g2511b6173A73971a62619P4680A50288E5533d5008k29144B98351
16082e7488H0708a57092f4042D0135M5885o385P8458C6546b9912k62647a17792
16070H2681a70540d6267j6530A5933c7468A00029J09061b26139L1580E9084a70155
16058A7222a07017r2152L3916A34747k4390a42962r237j12934F3309K63984A10276
16046H3978c80514J85164B33305n2551b19044B90029g505D5946a30788n530j05144
$$ plain form
16127 39523 -405864 22892 -37587 325315 184411 -52573 -234665 -28783 -253797 -108799
16116 33363 -328260 67128 -84332 -180858 115508 341756 -258355 272502 15799 -244104
16105 -40206 -145611 41134 120264 33657 403647 278774 26370 54977 -32194 251267 -55692
16093 169337 -72511 -26173 173971 -162619 -87939 150288 55533 -45008 -274152 298351
16082 -57488 80708 -157092 -64042 40135 86020 79635 158093 36546 -29912 -292559 -117792
16070 82681 -170540 -46267 -62797 15933 -37468 100029 209090 -226139 -194559 59084 -170155
16058 17222 -107017 -199169 -165253 134747 110357 -142962 -152199 -265133 63309 327293 110276
16046 83978 -380514 -195350 233305 180754 -219044 290029 -7505 45946 -130788 -136318 -241462
16035b41462i3595A85491J08213I0822l5333j0585a55869D2789K1806K21758j30825
16024A55528C8571M8158a63840L2505B33514a32141j91841a28886p0944g3046
16013a5162j6074j27221D8770b29026a8624j82377b1998A4024e2894F3572n774
16002E7798Q3264c41390E3900a97896B27041a28923B927J05325B8121m803J50481
15991A73799b098o8966j65114B8924O0646a6663B69954j22564n0262g0663E4632
15979F08K1311J20360I365J43755O7716b6184k95766c845F7882K2274A5147J38822
15967A53969R3061b30726i9640d938E7253K08889A4886a213j71772E1147M4479
15956I5626c25474J29934l51881g3168C6623d1803B8170b19511a04286A40803
$$ plain form
16035 -241462 -93595 185491 293704 90822 55489 44904 -155869 42789 64595 286353 155528
16024 155528 38571 86729 -163840 -131335 233514 -132141 -323982 -128886 -199830 -73046
16013 -15162 -31236 -158457 48770 -229026 -18624 -201001 -21998 14024 -52894 63572 57798
16002 57798 141062 -341390 53900 -197896 227041 -128923 2927 108252 28121 23318 173799
15991 173799 -2098 -71064 -236178 28924 89570 -16663 269954 147390 97128 -70663 54632
15979 608 21919 142279 9365 153120 220836 -26184 -321950 -3845 67882 90156 15147 153969
15967 153969 247030 -230726 -99640 -4938 57253 266142 14886 -1213 -172985 51147 95626
15956 95626 -325474 -195540 -547421 -73168 36623 -41803 28170 -219511 -104286 140803
15945a34180m3595B11403k3772b8250J1152A44488a28569L1164O233j42634a09422
15933A09241k0850a66887N5521D06738a66428A25084a59483B6095a0942j53285
15923a64227O1403B73357E2381a18118M7662J8204I7469b63811j26233J47124
15913b42920e9958k2567I2940D4115b7166j21579k72358e8177C24475c1106d534
15901a15465p3465L6973C7458b37889j99069a63450E9316k0987d52010F8429c72742
15889b28625R6155c1818j70186A8955a2884m4188A65411g6137G0238g6437C04120
15877b57775a05656A23874d79213K16410b2469B580e5679m2444A618a90253c052
15865D50682A2783a34534Q500j03927Q5728A87274d20980A2080a40983B48337
$$ plain form
15945 -134180 -177775 211403 187631 -28250 -17098 144488 -128569 -97405 -91172 -233806 -109422
15933 109241 88391 -166887 -111366 406738 -166428 125084 -159483 26095 -10942 -164227
15923 -164227 -102824 273357 52381 -118118 -70456 -52252 97469 -263811 -390044 -242920
15913 -242920 -59958 -82525 92940 44115 -27166 -148745 -421103 -58177 324475 -31106 -4534
15901 -115465 -188930 -151957 37458 -237889 -436958 -163450 59316 38329 -452010 68429 -372742
15889 -228625 -132470 -31818 -202004 18955 -12884 -57072 165411 -76137 70238 -76437 304120
15877 -257775 -105656 123874 -479213 -262803 -22469 2580 -55679 -98123 1618 -190253 -3052
15865 450682 12783 -134534 -126034 -229961 -144233 187274 -420980 12080 -140983 248337
15854b6441k2165D4784A2118e3623K435a7126j19617d0871a4002j8904j09853
15843a42759o9508d0849a1004l3432k20181B34774a10816a7548A25519D8696J0149
15832E8845A2244c8463I3301g0501A3841Q1513L04838C0587J0073h3123n6018
15821a39141j58336a2831p3425D9315J21238b66959e6600k16732B55920C8274
15810b27448C4188b31218O4919C8137A7773a6926H0456J85853e5263j27722B3607
15798a12609j79146a37549I4948a73520M2428B6828L0649Q5956c20624J13155
15788b07469C29901A07774j4057O173K55927a37836b7572k50270g0388L4552m4119
15777g9955l18792A84658c01094A30299J2660k1695a07831j02320g5563c5746
$$ plain form
15854 -26441 -48606 44784 12118 -53623 -51188 -17126 -136743 -40871 -14002 -32906 -142759
15843 -142759 -212267 -40849 -11004 -44436 -264617 234774 -110816 -17548 125519 48696 58845
15832 58845 12244 -38463 93301 -70501 13841 95354 400192 30587 40660 -83123 -139141
15821 -139141 -297477 -12831 -86256 49315 170553 -266959 -56600 -273332 255920 38274
15810 -227448 34188 -231218 -166299 38137 17773 -16926 80456 266309 -55263 -182985 23607
15798 -112609 -291755 -137549 94948 -173520 -131092 26828 57477 143433 -320624 -207469
15788 -207469 329901 107774 93717 99890 355817 -137836 -27572 -277842 -70388 -35836 -79955
15777 -79955 -398747 184658 -301094 130299 142959 121264 -107831 -210151 -75563 -35746
15766a89680C8295j6752J71976a64974f9332A01160b38023E2335e030C46812j3827
15755C32985E1842a47448A84201a05814j33799H001c344k95599a5310j00474D4644
15743B24723a11313A60365a27867n9175A63235h2715A23916j8405D8637a70495
15732a69957B11932A1466J80611k6352b25115l0569A40551b02517A41730a42518
15721b5987J398m1418A17959a62677L4865l8947B8267J1745e9985E9857b17699
15709A42367B4962P7499p173b5996j67623h484A13089P7137o2664n817c95951
15697a70920a6841o4240k45205d6283j21109A87679G8534J5608k9174e6349B15604
15685H3749b17123M9971A5799K51625a88505I804M8601e2440a1152B78865D7250
$$ plain form
15766 -189680 38295 21543 193519 -164974 -69332 101160 -238023 52335 -5030 346812 332985
15755 332985 51842 -147448 184201 -105814 -239613 8001 -3344 -298943 -15310 -115784 44644
15743 224723 -111313 160365 -127867 -187042 163235 -82715 123916 105511 48637 -170495
15732 -169957 211932 11466 192077 165725 -225115 -255684 140551 -202517 141730 -142518
15721 -25987 -24589 -66007 117959 -162677 -127812 -166759 28267 40012 -59985 59857 -217699
15709 142367 24962 102461 95288 -25996 -193619 -8484 113089 190226 127562 121745 -395951
15697 -170920 -16841 -81081 -326286 -46283 -167392 187679 78534 94142 64968 -56349 215604
15685 83749 -217123 -167152 15799 267424 -188505 9804 58405 -52440 -11152 278865 47250
15673C10093c57542B41998K8628A9002J68974d4999k23982H1473C9129g79o0218
15662f0997j38923G9604g1476j62578o0730c8074B3390P8934a18914H9472b04464
15650G5822f7138R586A27984E1701c30299H6230D961L67597b24020k6746I0063
15638a4085m16294a28832E4717a65873o724E0507b38529j7786J13380A42433j1017
15627A31416K0928a53619B12811L7432N1828G4283J51941a9002j14162M1811k07913
15616b99266D4742J68364L9158a63233d1820o9957a5553m0235B6637c61424J55628
15605b05796A09758A2548b83628Q1097j870A16941h7180n0888o808E957g8047
15593a83767J7068j08912i6833K892k9331A19622K27804a64775B07746B6804J5162
$$ plain form
15673 310093 -357542 241998 270626 19002 187976 -44999 -268981 81473 39129 -779 -60997
15662 -60997 -199920 79604 -71476 -234054 -294784 -38074 23390 102324 -118914 89472 -204464
15650 75822 -67138 -57552 127984 51701 -330299 86230 4961 372558 -224020 -250766 90063
15638 -14085 -430379 -128832 54717 -165873 -172597 50507 -238529 -256315 -142935 142433 131416
15627 131416 152344 -153619 212811 250243 302071 74283 226224 -19002 -133164 -91353 -299266
15616 -299266 44742 213106 252264 -163233 -41820 -111777 -15553 -55788 26637 -361424 -205796
15605 -205796 109758 12548 -283628 -202531 -204401 116941 -87180 -138068 -144876 5957 -78047
15593 -183767 -166699 -275611 -96833 -93941 -123272 119622 347426 -164775 207746 26804 41966
15582D1966a51169k5848B8027d048A46646i6496r5046D9388a50094A06626a71352
15570b44241N1225e1995p1489c0943D49352e2045q4833j65956A13489g9773C1144
15558G2705a16878M8744A9908a41735C11693g3817q0870b1401D8269a49533d9004
15546h3779B20397b06432d6651j680j74976A75375d3789I3654D0398f053G2858
15534F1309g0954A38738g2368K9392j45861B44260C6007b1593j44556A22564c8036
15522A4288b76122P2481h3929k9182l64091a21068F8841f7136b8540A52980b49130
15510A63831a78535f1579n6530A44904c2066A8257b37868H0388a57976f8626C11860
15498h5997A00887J07487a37304C09916A756a29896f2706K5987H7427a96369o2906
$$ plain form
15582 41966 -151169 -177017 28027 -4048 146646 -96496 -191542 49388 -150094 106626 -171352
15570 -244241 -193016 -51995 -123484 -30943 449352 -52045 -136878 -302834 113489 -79773 31144
15558 72705 -116878 -68134 19908 -141735 311693 -73817 -154687 -21401 48269 -149533 -49004
15546 -83779 220397 -206432 -46651 -48331 -223307 175375 -43789 93654 40398 -6053 72858
15534 61309 -70954 138738 -72368 -42976 -188837 244260 36007 -21593 -166149 122564 -38036
15522 14288 -276122 -203641 -83929 -113111 -477202 -121068 68841 -67136 -28540 152980 -249130
15510 163831 -178535 -61579 -118109 144904 -32066 18257 -237868 80388 -157976 -68626 311860
15498 -85997 100887 208374 -137304 309916 1756 -129896 -62706 -36719 87427 -196369 -259275
15487b59275A765N8342P4598d56245a62279a3884r9847A61583J63852b13488F3760
15475G9838k5805L2269R1453c14085F5843a81702A23869N8866H732e857H7083
15463A40261d9006A1982J02179j3214b10770n2588A58978p5603c831j63430P200
15452a60061F7229a0416l42767C7396J06065Q2773I206K04357d33970J80276H8997
15440H5644J43619a09639N0807J8199B51053P7694a85304P8250H5548a02516L1722
15429g0794j22837c2171k55609f2468A47208a48941R292D0669A3078a55694B81866
15417G8880N0613j9812m6107a43013J492e5366B49394a05629G2607h8996B97246
15405c0468j58891A12553k6732J45363f088m844j9721j94673I7316d7579o5618
$$ plain form
15487 -259275 1765 60107 134705 -456245 -162279 -13884 -113731 161583 325435 -213488 63760
15475 79838 54033 86302 177755 -314085 65843 -181702 123869 182735 8732 -5857 87083
15463 140261 -49006 11982 114161 100947 -210770 -263358 158978 83375 -3831 -167261 -160061
15452 -160061 67229 -10416 -353183 37396 143461 226234 9206 213563 -433970 -253694 88997
15440 85644 229263 -109639 -58832 -40633 251053 328747 -185304 -107054 85548 -102516 -70794
15429 -70794 -193631 -32171 -287780 -62468 147208 -148941 -139649 40669 13078 -155694 281866
15417 78880 129493 109681 63574 -143013 -141521 -55366 249394 -105629 72607 -88996 297246
15405 -30468 -189359 112553 85821 231184 -6088 -10932 -30653 -225326 97316 -47579 -113197
15394a13197E5851A6945d8992A09470b05990A30131M8362L1325F5614k0450a17886
15382i8743l80659K27483A86193c14573F2577A8357J77235a80203A15561J4506
15372A30067C791g6381B14321f6588r2078H0480f4826r9961I2022a42337A02885
15360E3632c2764A47754d4444l65941I2072b34569m8003i6100j09779D2704a157
15348B36283h2619d135B28256G6278N2526a72541A54292F5212b838D9132c94186
15336b92394B19821f5589r6691I6251J6558C491D25Q0054d500N5A91210a21622
15323e4850A32974d71070H0734N6574L1311O9850a54127B26772I0938D4355J45892
15312A90247N4194j15754n0034J2307a14065B45653j583K8705e079A07649k6252
$$ plain form
15394 -113197 55851 16945 -48992 109470 -205990 130131 178493 209818 65614 45164 -117886
15382 -98743 -479402 -251919 186193 -314573 62577 18357 195592 -180203 115561 130067
15372 130067 3791 -76381 214321 -66588 -158666 80480 -64826 -164787 92022 -142337 102885
15360 53632 -32764 147754 -44444 -410385 92072 -234569 -282572 -96100 -205879 42704 -1157
15348 236283 -82619 -4135 228256 76278 128804 -172541 154292 65212 -2838 49132 -394186
15336 -292394 219821 -65589 -162280 96251 112809 3491 425 80479 -4500 -4445 191210 -121622
15323 -54850 132974 -471070 80734 137308 168619 238469 -154127 226772 90938 44355 190247
15312 190247 244441 128687 78653 90960 -114065 245653 244070 272775 -5079 107649 81397
15301H1397B4040h4412A64198m3503a53701K4042m193E5733J11883b3076C62784
15289I0890J08575A8166K18719D9998L14300i0883B45769j21605J66729J0768
15279C01661l5096p5867a22678B12414b39079L5053A19632D5872M0536k0411c48326
15267B53713a0525I8921c5274C2374R2176b58006A44784a432k00589A09968J65149
15256B75117H254K5360K78662A21171m4179R7823M46668j58399N85639J97035
15246A245758j66843K24394F40971A50772E5953k1147J66960n3788J27147o5257
15236B09868m1316g9517L4278C9715J72309a77068A96717o5660D3863h6338c5969
15224A34615M7382p2158J37329B7970J20713J30225q5483O7411c6481A99015c83976
$$ plain form
15301 81397 24040 -84412 164198 120695 -153701 -129659 -133852 55733 167616 -23076 362784
15289 90890 199465 18166 236885 49998 364298 -90883 245769 124164 290893 301661
15279 301661 266565 190698 -122678 212414 -239079 -204026 119632 45872 86408 65997 -348326
15267 253713 -10525 98921 -35274 32374 124550 -258006 144784 -1432 -202021 109968 275117
15256 275117 8254 33614 312276 121171 76992 174815 621483 463084 1048723 1245758
15246 1245758 1078915 1303309 640971 150772 55953 34806 201766 147978 275125 209868
15236 209868 168552 -79517 -45239 39715 212024 -177068 196717 131057 43863 -86338 -35969
15224 134615 181997 109839 247168 27970 148683 278908 193425 260836 -36481 199015 -383976
15212A09499M5683J90413a7648A00118Q8084o4401o817J11464C7368d3196B45960
15200g8521A37549O5946G1160K09504A13826C2253h1828C22201g6357B01013q6747
15189A14266k9661g7602b144F3318K29824j24565o3566Q3570l6627j7877D6146
15177d0786E9524a67158F6736C0456R1597i9516A05974J76511D0251c49108B58263
15165B50136J33852F6891c73124B23371f1961q2007A20220b05820C00363b14609
15154A73741H2484Q2633a15106I6892c35483J29192i4268j24019d7450b3137k79383
15143c02520H8304Q6093B7344M8345L3200M7904M8082l9723J54750A45106e1699
15131B42459l225D7834J55396a65589d1301I1798O2802A7708O6033M83464D0742
$$ plain form
15212 109499 155182 345595 -17648 100118 188202 123801 116984 228448 37368 -43196 245960
15200 -78521 137549 203495 71160 280664 113826 32253 -81828 322201 -76357 201013 114266
15189 114266 84605 -77602 -2144 63318 293142 168577 105011 188581 151954 134077 46146
15177 -40786 59524 -167158 66736 30456 122053 -99516 105974 282485 40251 -349108 258263
15165 250136 383988 66891 -373124 223371 -61961 -143968 120220 -205820 300363 -214609
15154 173741 82484 165117 -115106 96892 -335483 -206291 -94268 -218287 -47450 -23137 -302520
15143 -302520 88304 174397 27344 75689 108889 156793 204875 165152 319902 145106 -51699
15131 242459 239234 47834 203230 -165589 -41301 91798 154600 17708 83741 567205 40742
15119D34909j78831j5898a53299B28048j09149k8092J41641l3028j701B0072a19120
15107B20435I9430p199b7807B89686d4502B58636q4721d2910E7237J6869J1962
15096H6068a53090E7291N3562a44028P421C07281H6471K02543o4091o0044M81749
15085F46628a03330L6066A33340C8383b09797A27129n4290J69329G7169J65890
15075B43059j14520J21471q9193l5282D8035a97907B09207I0391J7717a44105
15064A54015E6340b07926B03695n4643j6288J49458A38418K87993j24863a58254
15053A1063d7665a8002A06185a9707E5973N3661O6998l4868A8683J31807p3936
15042G6554b3681B37319P6799N7258C7770e944A46455A2985J94033p184a4558
$$ plain form
15119 434909 256078 240180 -153299 228048 118899 90807 232448 199420 197719 20072 -119120
15107 220435 99430 92231 -27807 289686 -44502 258636 173915 -42910 57237 74106 86068
15096 86068 -153090 57291 110853 -144028 -136607 307281 86471 289014 224923 164879 646628
15085 646628 -103330 -67264 133340 38383 -209797 127129 72839 242168 77169 243059
15075 243059 128539 250010 160817 125535 48035 -197907 209207 90391 108108 -144105
15064 154015 56340 -207926 203695 149052 132764 282222 138418 426411 301548 -158254
15053 11063 -47665 -18002 106185 -19707 55973 109634 176632 141764 18683 150490 76554
15042 76554 -23681 237319 314118 371376 37770 -5944 146455 12985 207018 199834 -14558
15030I76g535C14572A00366n069j0746F899K15812o4068n1238b50995A58468Q0895
15018B39363J93398j64593G0064K44576J04419H3952l5222O5024J19943o8256
15008A65441E0996K48075L55395I0377e1965B99660c4518B17594M2919q6974K8998
14997B02537M4337R6196j45464J40578O1993i43A08058f1336B51621j01632n4879
14986I5110J09403E7695J30487j7649F9800M26899B27918a27329C29238o7802
14976B61436o30F4425J37570K85459a31405B9815N1822M64418B52837H9855K7150
14965A17005j031k7401L33452D9740R0209E7121J80214q4082l6407E4710j8301
14954C6409J91803K14282r5976I529J71095j5609B6551K26547K41216j91186C9162
$$ plain form
15030 976 -7535 314572 100366 95297 84551 6899 222711 158643 107405 -250995 158468 239363
15018 239363 432761 268168 70064 314640 419059 83952 48730 113754 233697 165441
15008 165441 50996 299071 654466 90377 -51965 299660 -34518 217594 260513 173539 202537
14997 202537 246874 343070 197606 338184 400177 -943 108058 -61336 251621 149989 95110
14986 95110 204513 57695 188182 170533 69800 496699 227918 -127329 329238 261436
14976 261436 260806 64425 201995 487454 -131405 29815 81637 546055 252837 89855 117005
14965 117005 115974 88573 422025 49740 139949 57121 237335 153253 116846 54710 36409
14954 36409 228212 442494 346518 9529 180624 165015 26551 253098 494314 303128 39162
14942e289C70233j55557K24251J0264k08156j12807J43429J82004j74145a2612
14931A53344L1840J4293R9152Q7786p1979A40918Q9306J91148j80634g015j40312
14920a47327C52056K33892L667A82911q0341c2536A30239L62751J4060j33736
14910C73314k4226J19596A95895K83668k31554K01454J62329B55805n6233j9123
14900A80449J64696J34071r8869j23598j07383P5465J4857P7039J56388J38720
14890F11835j45893p1095j23221L7493A14155M86228A64498J37746L9347j45783
14880A95808L22079f4080B59535J3234A23869K40637j10977o7543N3629r2121
14870A47494n8932N3803l3684K82547j17526K08850j67112K85551k76266j22171
$$ plain form
14942 -5289 370233 214676 438927 449191 241035 128228 271657 453661 279516 -12612
14931 153344 185184 199477 298629 386415 314436 140918 230224 421372 240738 -7015 -147327
14920 -147327 352056 585948 589615 182911 102570 -32536 130239 492990 507050 373314
14910 373314 349088 468684 195895 479563 248009 449463 611792 255805 199572 180449
14900 180449 345145 479216 380347 256749 149366 224831 239688 316727 473115 611835
14890 611835 465942 394847 271626 309119 114155 600383 164498 302244 341591 195808
14880 195808 517887 -64080 259535 272769 123869 364506 253529 185986 239615 147494
14870 147494 88562 142365 108681 391228 273702 482552 315440 600991 324725 202554
14860B02554J73580j36554b0304D62542L8861k6856k6932l1461K3095j12863j22470
14849B03916K84292j03770O6367n1368A87204N9027L15736B76349J33752j29579
14839B80522N8613J88577A57805J49959L31938k73678J58342k32691R7002k1503
14829C67174j76880K63238j1440q4432O8423B08804J34532J37294L02394C64037
14818C17345j31015q2314L09573M07072l75355J77804O0636A88192J57382M15568
14808G61142l47839N5830q3648J68540j40113J79271q0917A62719P7289K25123
14798D65131P3806p5551K8160L07655j74389j42318m9482n6927J78795j79663
14788C75217l2842K59730j21947J84302k1881n4116K716k40609j1706L55307J03406
$$ plain form
14860 202554 376134 239580 -20304 462542 501403 474547 447615 416154 439249 326386 203916
14849 203916 488208 384438 450805 399437 187204 246231 561967 276349 410101 280522
14839 280522 339135 527712 157805 307764 639702 366024 524366 291675 388677 367174
14829 367174 190294 453532 442092 357660 426083 208804 343336 480630 783024 364037
14818 317345 186330 104016 413589 820661 445306 623110 683746 188192 345574 761142
14808 761142 413303 469133 385485 554025 413912 593183 512266 162719 240008 465131
14798 465131 538937 463386 491546 799201 624812 482494 433012 376085 554880 375217
14788 375217 342375 602105 480158 664460 642579 588463 591179 350570 338864 694171 797577
14777G97577k37618J00964l14397K01736K85634k11350J09456l10702K18099J68104
14767H07503j98344J03370p7058K41151k88122J02073k39728J70823K6558j334
14757F46892J95239o1331l14012k0193L22046C54276J18064p7552K60279J02952
14747G58019r3398O8298l58021N4785L35055k93089k04678N57011K9493k18177
14737F35298K35182k38635j14636J80633n6028J30494L32256m39184j7830k2166
14727F25384K45506j24598L18551l55261K25433J08874j82991M7272J5161n1123
14717H72208J26828l26866J33904L5559k57965L03048q5063L13456m19302j3972
14707F81835O6561Q2422j49648J45987L3671k85848k9149M99924j76780J32282
$$ plain form
14777 797577 559959 660923 346526 548262 833896 622546 732002 421300 639399 807503
14767 807503 609159 712529 635471 876622 588500 690573 450845 621668 648226 646892
14757 646892 842131 780800 466788 446595 768641 354276 472340 394788 655067 758019
14747 758019 664621 732919 374898 429683 764738 471649 266971 823982 853475 635298
14737 635298 870480 631845 517209 697842 641814 772308 1104564 665380 647550 625384
14727 625384 870890 746292 1064843 709582 935015 1043889 860898 908170 923331 872208
14717 872208 999036 672170 806074 841633 583668 886716 801653 1115109 695807 681835
14707 681835 748396 830818 681170 827157 860828 574980 545831 1045755 868975 1001257
14697A001257k72551C03610Q03524D40864M31075n9470J7170j38573L31306R6038
14687A118410j67952J62035l79709K6159L94405k65524K41462m27936M19810j30529
14677I90631M4097j34719P2955K00669j20729J48598k03259l16912O79299n25244
14667H35386P9085l0767K8253K50174k77867j5997q9860L57188m8989m73061N87424
14656A200969j2083k11227O3250m7633j41035J61953K32569j7408j17848k20233
14646H91274K53306J06092l5216j80100J73078l5801r6940J39295L7112q7462
14636A164638j43599L90188j17526J07068j58117k08290J69549r0097j76365J15413
14626A052862J82000K15062m2742n5853j01370j04213Q7128K18066J8380j30080
$$ plain form
14697 1001257 728706 303610 1107134 440864 871939 812469 829639 691066 1022372 1118410
14687 1118410 950458 1112493 732784 758943 1153348 887824 1129286 701350 1121160 990631
14677 990631 1034728 900009 972964 1173633 1052904 1201502 998243 681331 1360630 835386
14667 835386 914471 883704 911957 1162131 884264 868267 778407 1135595 1086606 613545 1200969
14656 1200969 1188886 977659 1040909 993276 852241 1014194 1246763 1229355 1111507 891274
14646 891274 1144580 1250672 1215456 1035356 1208434 1172633 1075693 1214988 1252100 1164638
14636 1164638 1021039 1411227 1293701 1400769 1242652 1034362 1203911 1113814 937449 1052862
14626 1052862 1234862 1449924 1407182 1351329 1249959 1145746 1232874 1450940 1469320 1339240
14616A339240M60096l01651k6682Q104R7404Q8797k16262J54995j97937M06163
14606A812267o14329K63863K4410K27913j83813O3191j04366j43652J02810J50279
14596A598573k85418M3971J70827K18960k91813J53667Q2658J54409q497j69447
14586A667890K57360L1753j57445k9561j81604K2554L24008k14944P7151k1378
14576A775784M82188p13832L86058K33837p8370l85884M70812R6662l72076M93472
14566B388651L7551j30773q980L04572k00915M51290l95461O08833k49325j88562
14556B616881L97730J48067Q19090l61158P33829L22981J153790K068931N995949
14547A3896090J0205071J4392704j44221j6870083A0141488m888729j853377p25913
$$ plain form
14616 1339240 1799336 1497685 1471003 1479107 1576511 1665308 1449046 1604041 1406104 1812267
14606 1812267 1197938 1461801 1486211 1714124 1530311 1593502 1489136 1345484 1448294 1598573
14596 1598573 1313155 1357126 1527953 1746913 1455100 1608767 1691425 1845834 1837337 1667890
14586 1667890 1925250 1957003 1799558 1769997 1588393 1610947 1934955 1720011 1797162 1775784
14576 1775784 2257972 1544140 1930198 2164035 2085665 1699781 2170593 2267255 1895179 2388651
14566 2388651 2426202 2295429 2286449 2591021 2390106 2841396 2445935 3054768 2805443 2616881
14556 2616881 3014611 3162678 3981768 3620610 4354439 4677420 5831210 7900141 13896090
14547 13896090 24101161 38493865 38349644 21479561 10141488 5252759 3399382 2673469
14539B673469k84816l31425p1075J47085k00576l27645K18414L65741k09819L62699
14529B342052J62905q9434k03437r4739k36820M89763J14839q9057J82740j21673
14519B457139J51023J58952m20122M50502q3238J19600K78219l36042L1449j00079
14509B707403l41978N59914M7922L38686n35909J69398k40522N3543M92813k98703
14499B952567j65968p3089O80198j64552p9431J16377q0492l21907K72392j67585
14489B968510P77216k87199K9285Q4095J97135o6351l73370P22617j83506Q085
14479C876517j12299p0040J9663K48624O6088j04409K59208k85600N26235j95793
14469D228194L83350l88327M71880l35709j11886K83531j57945J81627J29588
$$ plain form
14539 2673469 2388653 2057228 1986153 2133238 1932662 1605017 1823431 2189172 1979353 2342052
14529 2342052 2504957 2415523 2212086 2117347 1880527 2370290 2485129 2396072 2578812 2457139
14519 2457139 2608162 2767114 2346992 2797494 2714256 2833856 3112075 2776033 2807482 2707403
14509 2707403 2365425 2925339 2973261 3311947 2776038 2945436 2704914 2758457 3251270 2952567
14499 2952567 2786599 2713510 3393708 3229156 3149725 3266102 3185610 2863703 3136095 2968510
14489 2968510 3745726 3458527 3487812 3571907 3769042 3702691 3329321 4051938 3868432 3876517
14479 3876517 3764218 3694178 3713841 3962465 4028553 3924144 4183352 3897752 4423987 4228194
14469 4228194 4611544 4223217 4695097 4359388 4247502 4531033 4373088 4554715 4684303
14460D684303k88176Q89446l70409o4222k46211O85213m45268M35893k90230K45658
14450E235997J38338j30905K97047j29554L02588P0741q6887J80699K70229j66305
14440E981988M3458J78041N4886j90517l6698L33124n8989M44307j60057l9300
14430F550243K66781j58956J25684L48246L12674j80346J16331k57805L90317
14421G513169J25712J72164l67800N64963J71883j14447J45864K63102J95804
14412H670414q1094o5584L28460o8582N2013M95007L0318J67093k37969O22567
14402I912643l111L37139M2855P7539M07714m6354J71851L02415Q1522M72846
14392A1757059k07376M21861L65918j35977J63548N02177J19407N27668k45128
$$ plain form
14460 4684303 4396127 5285573 4915164 4850942 4604731 5289944 4844676 5280569 4990339 5235997
14450 5235997 5374335 5243430 5540477 5410923 5713511 5784252 5697365 5878064 6148293 5981988
14440 5981988 6025446 6203487 6258373 6067856 6031158 6364282 6305293 6749600 6589543 6550243
14430 6550243 6817024 6658068 6783752 7131998 7444672 7264326 7380657 7122852 7513169
14421 7513169 7638881 7811045 7443245 8008208 8180091 8065644 8211508 8474610 8670414
14412 8670414 8589320 8523736 8852196 8783614 8835627 9330634 9360952 9528045 9290076 9912643
14402 9912643 9909532 10246671 10289526 10367065 10774779 10728425 10900276 11202691 11284213 11757059
14392 11757059 11549683 11971544 12337462 12201485 12365033 12867210 12986617 13514285 13269157
14383A3269157M07012K39374L85882K60831J09585M1477N96510N24678J59360
14374A5993866J13266K91970N27150J37146P76077K07878M03268M62855J95652
14365A9109128K60433R63215J03366M66571L53970O90040K21237O09238M65042
14356B3242240O14046M24757O05817R11152N5817O43934J081802K75991O33498
14347B8489054R89922N40467Q89404J280380N64968P59699J061418M64875J150511
14338C6190698R12234J114939J210278J203461J017398J252650J640526O83772
14330D5225956J950816J633152J263542J836935J473070K077481J629965K233516
14322E9324433J990795K313092K266210K302171K958614K162565L155077K664773
$$ plain form
14383 13269157 13676169 13915543 14301425 14562256 14671841 14713318 15309828 15834506 15993866
14374 15993866 16107132 16399102 16926252 17063398 17839475 18047353 18450621 18913476 19109128
14365 19109128 19369561 20332776 20436142 20902713 21256683 21946723 22167960 22777198 23242240
14356 23242240 23856286 24281043 24886860 25798012 25853829 26497763 27579565 27855556 28489054
14347 28489054 29478976 30019443 30908847 32189227 32754195 33513894 34575312 35040187 36190698
14338 36190698 37102932 38217871 39428149 40631610 41649008 42901658 44542184 45225956
14330 45225956 47176772 48809924 50073466 51910401 53383471 55460952 57090917 59324433
14322 59324433 61315228 63628320 65894530 68196701 71155315 73317880 76472957 79137730
14314G9137730K985645L742487L187684M033308L582401M204438M176603N406122
14306A10456418M414312N217838N559745N980626O191506O823566P192219P264700
14298A59100930Q122067Q472758Q719658R521198J0186129R964429J0875884J1526599
14290B36489652J2288643J2854594J3251675J3837152J4220758J4638382J4858037
14283C32438893J5214908J5019426J4800970J4841581J3885524J3097687J2592594
14276D31891583J1082029R487095P397786L553730k753450l325148k436026l234283
14268D51663316m659257n996787o240567r058004j1644735j2550010j2994115
14261C88519841j4379671j5556431j6075840j6103746j5808771j5193671j4442523
$$ plain form
14314 79137730 82123375 85865862 89053546 93086854 96669255 100873693 105050296 110456418
14306 110456418 114870730 120088568 125648313 131628939 137820445 144644011 151836230 159100930
14298 159100930 167222997 175695755 184415413 193936611 204122740 214087169 224963053 236489652
14290 236489652 248778295 261632889 274884564 288721716 302942474 317580856 332438893
14283 332438893 347653801 362673227 377474197 392315778 406201302 419298989 431891583
14276 431891583 442973612 452460707 459858493 463412223 460658773 457333625 454897599 451663316
14268 451663316 447004059 441007272 434766705 425708701 414063966 401513956 388519841
14261 388519841 374140170 358583739 342507899 326404153 310595382 295401711 280959188
14254B80959188j3681427j3492842j2960654j2026913j1418283j1151989j0164503
14247A96062577r779990q881888q614438q020430p550319o799518p169266o492417
14239A32754311o183685n038105n403417m999543m843373m224210m523724l443362
14231I4094892l700001l781095l140374l521869k867494k890247k741185k373075
14223F9079552k708857k438679j839284k463786j675030j915324j770114j983250
14215E2285228j570833j297890j276403j782528j499537j503962q83498j274298
14207D1196279p51892j157756j270660j212798j022368j115032p07710n95144
14199C3362919q97021j275224r23075l86555p86116j91575r01238j087535n66940
$$ plain form
14254 280959188 267277761 253784919 240824265 228797352 217379069 206227080 196062577
14247 196062577 186282587 177400699 168786261 160765831 153215512 146415994 139246728 132754311
14239 132754311 126570626 121532521 116129104 111129561 106286188 102061978 97538254 94094892
14231 94094892 90394891 86613796 83473422 79951553 77084059 74193812 71452627 69079552
14223 69079552 66370695 63932016 62092732 59628946 57953916 56038592 54268478 52285228
14215 52285228 50714395 49416505 48140102 46357574 44858037 43354075 42470577 41196279
14207 41196279 40444387 39286631 38015971 36803173 35780805 34665773 33958063 33362919
14199 33362919 32465898 31190674 30267599 29881044 29094928 28903353 28002115 26914580 26347640
14190B6347640m81045q16593n11636o84459n08772l18219n76879m55731p73212
14181B1221094l92367m30111o8745p40361j6049p46700j01796n59412o58515k3615
14171A7483423k20993l78930n67808N6010m38517l33075l23609l78683q1991l46568
14161A4469259m92826p4185j39294k19999j06481m80266k38781J49581m4388p26652
14151A2095968J10444n48494j27998k4766l57199l2203l58722K1358j29200k08755
14141A0440433l0136j02758m53183R541p925k49672l41417K66256m36331J51404
14131I246212l68961k6524R7458l94258P9642J55242n86349j2042k84437j44574
14121G761409K3634j60807p8770K00686l81370K00396l52595J51869m22817o6564
$$ plain form
14190 26347640 25866595 25050002 24538366 23853907 23345135 23026916 22450037 21994306 21221094
14181 21221094 20828727 20398616 20329871 19589510 19573461 18826761 18724965 18165553 17507038 17483423
14171 17483423 17262430 16883500 16315692 16371702 15933185 15600110 15276501 14897818 14815827 14469259
14161 14469259 13976433 13902248 13762954 13542955 13436474 12956208 12717427 12867008 12822620 12095968
14151 12095968 12206412 11657918 11529920 11505154 11147955 11115752 10757030 10778388 10649188 10440433
14141 10440433 10410297 10307539 9854356 9863897 9855972 9606300 9264883 9531139 9094808 9246212
14131 9246212 8877251 8850727 8948185 8553927 8633569 8788811 8202462 8190420 7905983 7761409
14121 7761409 7785043 7624236 7545466 7746152 7364782 7565178 7212583 7364452 6941635 6875071
14111F875071J45251k10294k05970l54088M6936N846L0092J52706M4048l56759
14101F172839m04575L61211l44071N89N9031l34240J06097K64806k85071J2970
14091E609586j0741k04413m57253L48226n1541l93159l1394N6746k28704j32973
14081D504380O40120o42149L08575j42477M745k97269J63408l2937P8208j21013
14071D463591m93434J45178P5830p1233R1346j92526o4541J59511k93437J64513
14061C984798J97789k27368J57425l2722L71292o11674J74688j67873k108n75818
14051C268429L79424k06762k33690K65781r7139J53817n8764n36972K36468K09465
14041C380057m07152l3197M54104n1440j46973j15135J35708l72552J45227j41021
$$ plain form
14111 6875071 7020322 6810028 6604058 6249970 6296906 6302752 6332844 6485550 6529598 6172839
14101 6172839 5768264 6129475 5785404 5785993 5845024 5510784 5616881 5881687 5596616 5609586
14091 5609586 5598845 5394432 4937179 5285405 5233864 4840705 4809311 4866057 4637353 4504380
14081 4504380 5144500 4502351 4810926 4668449 4673194 4375925 4539333 4506396 4584604 4463591
14071 4463591 3970157 4115335 4191165 4119932 4211278 4018752 3954211 4113722 3820285 3984798
14061 3984798 4182587 3955219 4112644 4079922 4451214 3839540 4014228 3846355 3844247 3268429
14051 3268429 3647853 3441091 3207401 3473182 3376043 3529860 3471096 2934124 3170592 3380057
14041 3380057 2972905 2939708 3393812 3342372 3195399 3080264 3215972 2843420 2988647 2847626
14031B847626j38817K46461j89781j29722K12530M890m0028l6614j63899o1627
14021B551019L8727J87695J30217k4899l61119P1139k34705P9457k9406k91984
14011B116141J93129K17672p5664k49825m5250L35802k53480J46670j00483k05653
14001B079059K01204j75899l94292K60337N7856M2849L29303n34016L83541k02491
13991B047451M24312O09000J030836M302480Q680423J5818548N827230j4579940
13983B4160340j0332631n611102k066511j300030o26538o93492k74201j11544
13975C144291j33904J58388o37997J35895j91524j9732k39266P02858p02844P4045
13965B290210p6591J53724l86849K71778J04983l56650l85170Q37356l79072j27896
$$ plain form
14031 2847626 2708809 2955270 2765489 2635767 2848297 2853187 2813159 2776545 2612646 2551019
14021 2551019 2589746 2777441 2907658 2882759 2521640 2592779 2358074 2437531 2408125 2116141
14011 2116141 2309270 2526942 2451278 2201453 2156203 2492005 2238525 2385195 2284712 2079059
14001 2079059 2280263 2104364 1710072 1970409 2028265 2071114 2400417 1866401 2249942 2047451
13991 2047451 2471763 3080763 4111599 8414079 17094502 32913050 38740280 24160340
13983 24160340 13827709 8216607 6150096 4850066 4223528 3530036 3255835 3144291
13975 3144291 3010387 3168775 2530778 2666673 2475149 2455417 2216151 2919009 2216165 2290210
13965 2290210 2213619 2367343 1980494 2252272 2357255 2000605 1615435 2452791 2073719 1945823
13955A945823m899k75561L38345n6525J87957l72945K44176J1621J53000j14174
13945B056818J07282r0672j86853r0621L50339l50456j10616J10598J75625m32115
13935A539329K66557l20172L04448m23240K68551j34976K82233n44936M50318
13926A688112k49702J22198r5884K47144J10762k233m78662J21236m7807K08105
13916A623269L965n9422l18629M35547k35029j46050r7434K53915l09602M9858
13906A200388M76021l33206J3157J9331O0887n0951J79119k84426K03156k0751
13896A462725j04325K76461k28967j87306j1648m0658J56826r1038j42460J42980
13886A232590J53785k48953M64708N8533n80513K25367p6037m8490L3291k9968
$$ plain form
13955 1945823 1940924 1665363 2003708 1947183 2135140 1762195 2006371 2017992 2170992 2056818
13945 2056818 2164100 2073428 1886575 1795954 2146293 1795837 1685221 1795819 1971444 1539329
13935 1539329 1805886 1485714 1790162 1366922 1635473 1500497 1782730 1237794 1688112
13926 1688112 1438410 1560608 1464724 1711868 1822630 1820397 1341735 1462971 1415164 1623269
13916 1623269 1627234 1567812 1249183 1684730 1449701 1303651 1206217 1460132 1150530 1200388
13906 1200388 1676409 1343203 1356360 1375691 1436578 1385627 1564746 1280320 1483476 1462725
13896 1462725 1358400 1634861 1405894 1218588 1206940 1166282 1323108 1232070 1089610 1232590
13886 1232590 1386375 1137422 1602130 1660663 1080150 1305517 1229480 1180990 1214281 1184313
13876A184313j52296J55414j7899k50667L58331j67490p8735L6449k29195L56783
13866A195008J14109j75127N8221m6077k13684Q4634n6481l96573P97894k23903
13856A138021m5857l43871K59903j37701O7446J71872K56159o19241M54733j33287
13846A068177j00784K8022n4886J56978J29262m24816L57093l49344K33317j69826
13836H73193N31547l47567O4339K0189K14128K4893n85602m3047N06361m3535
13826A214899n42378P5575L18977J20735n77998N98664k07606k83692M9092J82805
13816I49073j87455K88183l64804L02910p8275j14865K53660l51462J09232K5741
13806H31938Q2078l40125K73122j07147m1563J18622L6051j94257J42201N227
$$ plain form
13876 1184313 1032017 1187431 1169532 918865 1277196 1109706 1030971 1067420 838225 1195008
13866 1195008 1309117 1133990 1192211 1146134 932450 1017084 960603 564030 1361924 1138021
13856 1138021 1092164 748293 1008196 870495 937941 1109813 1365972 746731 1201464 1068177
13846 1068177 967393 995415 940529 1097507 1226769 801953 1159046 809702 1043019 873193
13836 873193 1404740 1057173 1121512 1141701 1355829 1380722 795120 752073 1258434 1214899
13826 1214899 672521 748096 1067073 1187808 609810 1208474 1000868 717176 766268 949073
13816 949073 761618 1049801 684997 987907 909632 794767 1048427 696965 806197 831938
13806 831938 914016 573891 847013 739866 698303 816925 852976 658719 800920 806147
13796H06147O1850k07679l4068K53929j51711n2275K46157k16849k049K72769
13786I76221J24711m38551N82252m91714C10993M94612m9440Q5106k23218K32646
13776H50699P6117p7932N0041k53419K18607j67206O8953j50197K88734l75425
13766E28972Q8839K34369j88052k67514n0699L72910o8255j53950K0488K09848
13756G26956O1212l50904J74962L05291C32365M34100k65853L87127l91396K66203
13746G62546k09211O3790p7459L4360r4052r841K06855B85736K14876L1101K47089
13735G78802q9599L5486o0736J21333k94152K4302K66851C04369N09036k25474
13725E87931j70253J25581J69801j20665L5857j84300K67476l37789K10894j38994
$$ plain form
13796 806147 867997 660318 626250 880179 728468 676193 922350 705501 703452 976221
13786 976221 1100932 662381 1244633 752919 310993 805605 756165 841271 618053 850699
13776 850699 926816 848884 898925 645506 864113 696907 765860 615663 904397 528972
13766 528972 617811 852180 664128 396614 345915 718825 650570 496620 517108 726956
13756 726956 788168 437264 612226 917517 332365 766465 500612 887739 496343 762546
13746 762546 553335 617125 539666 574026 479974 470133 676988 285736 500612 531713 778802
13735 778802 689203 724689 663953 785286 491134 515436 782287 304369 813405 587931
13725 587931 417678 543259 713060 592395 628252 443952 711428 373639 584533 445539
13715D45539Q8755o7221R6605L62789j53012B68497K73823r6020J4850p1947K61291
13704F50494l17093K55857A64123M44563Q8947A53424L06418N2826j9682K63856
13694G56842C32318K75511N82j62789j07667K32184k54643L11999Q9043o6085
13684F50453j0580k86522L39943q9353j33345J10780O174j53413j3514L57401
13674G78024l55731P5697m8127J52574J99095j78958j25400J79046l36606K89162
13664F28776K2033K5129N1095k19386Q0386j92400l228q6234J7204L69733p8419
13653F14689C04245J00282j86386M96749j40502A29955L81882l3435r7553N3142
13643D33991R0812B24655J74574K1010j23911b7176D88845l4650B03273K06262
$$ plain form
13715 445539 534294 467073 563678 926467 773455 268497 542320 446300 461150 389203 650494
13704 650494 333401 589258 164123 608686 697633 153424 459842 512668 492986 756842
13694 756842 332318 607829 608411 445622 337955 570139 315496 627495 716538 650453
13684 650453 639873 353351 693294 603941 470596 581376 587550 434137 420623 778024
13674 778024 422293 497990 449863 602437 801532 622574 497174 676220 339614 628776
13664 628776 650809 675938 727033 507647 588033 395633 392405 306171 323375 693108 614689
13653 614689 304245 404527 218141 714890 574388 129955 511837 478402 380849 433991
13643 433991 524803 224655 399229 420239 296328 -27176 488845 454195 203273 409535
13633D09535J15060m1349j10530J46108J66704C05922J35399G1959M09321A94815
13622i0242A83213L58338j75347K78213B29046M90440d9242D41284R7968R9759
13612F39011p6311j30979J35729k74122k7652K67244j02009A86338J36957K62331
13602E85626k54562J62904K37379C63615O6688q7905j8451J09285j42184I7856
13591B92064J58901j10030j13683R9153K60006n1610k27483A32520J14749J21617
13581C68886j42072J54994M5198E2196K43624K27209Q7458B47505J354J08683
13571C57542m9170C7989N88210j17013J53653B59200r6812M56246E2368L10361
13561C62729j06786K77297A02352P8284K2848K46050A68803h4509C80718g2344
$$ plain form
13633 409535 524595 483246 372716 518824 685528 305922 441321 71959 481280 194815
13622 -90242 183213 541551 366204 644417 229046 719486 -49242 441284 539252 639011
13612 639011 562700 431721 567450 293328 265676 532920 430911 186338 323295 585626
13602 585626 331064 493968 731347 363615 430303 342398 323947 433232 291048 97856
13591 292064 450965 340935 227252 326405 586411 534801 307318 132520 247269 368886
13581 368886 226814 381808 427006 52196 295820 523029 610487 247505 248859 357542
13571 357542 308372 37989 626199 509186 662839 259200 162388 618634 52368 362729
13561 362729 255943 533240 102352 180636 203484 449534 168803 -84509 380718 -72344
13550a4417C89001j77865I1116J00738O858N3546K27746j6681j35761K89455k42382
13539C74635j68420d3310D54127j19459C6319L69879p1452l2307J25391j62250
13529B65580A29870R2867j1288L3225e8207A84606H8559f6381B86234H4455K45026
13518C29481m3549p3811e7124C46785I5668K87589j88187K16780b9406B40353
13507E01970Q2810B71988J37702l5051A79327J68808J8457j20876j6932N0882
13497B79666P4790r2721h1882F33179B16892M0673Q4772E932L00653J64869j76387
13486B95067A39963K1354i8995A86575R7418h1244B99761r539J57807A59101j4035
13475A45066K95675p1438r2409q7300n2565M06790m9141l8083i3550B07257O323
$$ plain form
13550 -14417 389001 211136 91116 191854 198712 252258 480004 463323 327562 617017 374635
13539 374635 206215 -43310 454127 334668 36319 406198 334746 302439 427830 265580
13529 265580 129870 222737 211449 244674 -58207 184606 88559 -66381 286234 84455 329481
13518 329481 285932 212121 -57124 346785 95668 383257 195070 411850 -29406 240353
13507 501970 584780 271988 409690 374639 179327 348135 366592 245716 228784 279666
13497 279666 354456 261735 -81882 633179 216892 257565 342337 5932 306585 471454 295067
13486 295067 139963 161317 -98995 186575 283993 -81244 299761 290222 448029 159101 145066
13475 145066 440741 369303 276894 189594 137029 543819 494678 456595 -93550 207257 213580
13464B13580g306B65600K57467B7894Q5109J08628J24140p0H2663R9494J19879
13453C02036I7540J64394J5558h8822A4262a48258I179L66661r103E6313L04498
13442C60811q7144P1169P2884q5595o2106N8935D1732J50564P6480j0018j4794
13431B43964A06731L78138k00576l8710j9371K13286G1081M5113M04383d6376
13420G5500J00770a52466B77867P1365A3900J85006k4249J46557l4172I2894k5519
13409F7375K60137A62027G9100J33168n520D6018M32319B17119J40854I1591l1426
13398F0165J8161L16614D0210J93877j2465L2800L32298r3651A40413o7136Q7948
13387A61225E4253j5377J37008m0039O5865F5538P2349L44190j95440i5558E6135
$$ plain form
13464 213580 -7306 265600 523067 27894 113003 221631 345771 345701 82663 182157 302036
13453 302036 97540 261934 277492 -88822 14262 -148258 9179 375840 366737 56313 360811
13442 360811 273667 344836 417720 332125 270019 328954 41732 192296 268776 258758 243964
13431 243964 106731 484869 284293 245583 226212 439498 71081 116194 520577 -46376
13420 75500 176270 -152466 277867 349232 13900 198906 174657 321214 287042 92894 67375
13409 67375 327512 162027 79100 212268 206748 46018 478337 217119 357973 91591 60165
13398 60165 78326 394940 40210 234087 221622 254422 586720 493069 140413 73277 161225
13387 161225 54253 38876 175884 135845 201710 65538 137887 482077 286637 -95558 56135
13375A92671J85707H2242J49555n1892l4304M9836n5145L49721G0900O1875P4473
13364B07248K075C463Q6455J69534j7239o7363M05181B57531D7621K70808j15982
13353B02447H5203J73169j2836J88990C0505A4350R6452L76048r8850K12275A58884
13341E02764J34801C14521j08823c4576A42431Q658K11594k9943o2177J29764
13331D00327m2908Q6795A12275n5489a11233A63522p538c0042H0083b45944b8775
13319C93991A45560o1466J60362R4084R3720j73776n0389o274L39817A35156j9001
13308A16155J22071b5909C87468j48046j16452G576Q4641J55491i0745C1766J35835
13297A67601q0349J39011E9239J71081R2508M885j01977J46571j04468K2030Q3526
$$ plain form
13375 192671 378378 82242 231797 179905 145601 195437 140292 490013 70900 132775 207248
13364 207248 209323 3463 89918 259452 242213 174850 580031 257531 47621 318429 202447
13353 202447 85203 258372 245536 434526 30505 14350 110802 486850 388000 600275 158884
13341 502764 637565 314521 205698 -34576 142431 151089 362683 332740 270563 400327
13331 400327 357419 444214 112275 56786 -111233 163522 155984 -30042 80083 -245944 -28775
13319 393991 145560 84094 244456 338540 432260 258484 208095 201821 541638 135156 116155
13308 116155 238226 -25909 387468 239422 122970 7576 92217 247708 -90745 31766 167601
13297 167601 87252 226263 59239 230320 322828 327713 225736 372307 267839 289869 373395
13286C73395j15515b9229P415F0597f8287C7298J81558j00385C3863R6993J80551
13275C11407N1159a05786B7949l610A1119R0019J41727K5476G1802l025a6690
13263A8794L51048d7033C26494d7780A78138k5028M7095b35097C63773p3021E4866
13251D80169d9903B03910a78649f7409A30822F1471i1593A59391d3656C06428
13240e4846A70968G5263M1479K5627c0986m999j86512P5930B8876K09554j13383
13229A25047c1320A92365P4732B9907c5252A97975o9516a54808D170J34913i8796
13217H8840K43254A4220L86506j59728a1971C0655H533a0675A90764Q2328A03233
13205E2004J02771E9307Q2086O0513e0139K0335B14141L48649f2016B14991f6442
$$ plain form
13286 373395 257880 -29229 -21814 60597 -68287 37298 218856 118471 33863 130856 311407
13275 311407 362566 -105786 27949 24339 11119 101138 242865 268341 71802 68777 -16690
13263 18794 369842 -47033 326494 -47780 178138 153110 200205 -235097 363773 290752 54866
13251 480169 -49903 203910 -178649 -67409 130822 61471 -91593 159391 -43656 306428
13240 -54846 170968 75263 116742 142369 -30986 -35985 -222497 -146567 28876 238430 125047
13229 125047 -31320 192365 267097 29907 -35252 197975 128459 -154808 4170 139083 -98796
13217 88840 332094 14220 400726 240998 -11971 30655 8533 -10675 190764 273092 103233
13205 52004 154775 59307 141393 201906 -50139 -29804 214141 562790 -62016 214991 -66442
13193C9628a24542A13860D8850R4281k1565M22681H37R7109L12020A91897G9024
13181A70766H4571J41870p3941R4211c8517k5512A74887g1386G2726P9828E2125
13169A84176a20306A31379k3839J21083J27317b359D3278J12332f2838F1334L93476
13158D54810j94755a10159k9642G1893c4719A99935j6497a04658C71145a04709
13147H8045C7443a62378b1318A57761L714a45384a9731C47681j70547a57460k09598
13136c67058B3693J44434j4268d4087A40197F2344B0273L3966J48679a02623B19554
13124B04J4225K57099J1400E5260J20892m0881A5112c7711F3662P0875K1170F5934
13111C90335B0437J26189A5321J34711b847A93418H3897a91702M989D0155O8220
$$ plain form
13193 39628 -124542 113860 48850 143131 121566 544247 837 97946 409966 191897 79024
13181 170766 84571 226441 152500 246711 -38517 -64029 174887 -71386 72726 152554 52125
13169 184176 -120306 131379 107540 228623 355940 -2359 43278 155610 -62838 61334 454810
13158 454810 260055 -110159 -139801 71893 -34719 199935 183438 -104658 371145 -104709
13147 88045 37443 -162378 -21318 157761 161475 -145384 -19731 347681 177134 -157460 -367058
13136 -367058 23693 168127 153859 -44087 140197 62344 20273 54239 202918 -102623 219554
13124 204 14429 271528 282928 55260 176152 135271 15112 -37711 63662 134537 155707 65934
13111 390335 20437 146626 15321 150032 -2847 193418 83897 -191702 -186713 40155 108375
13100A08375H516a65500D896J90386H4108B6026J54262N0970D54b24150a6378
13088h963B69404b0527B44016b6670B56242j20704K30387j02840g3657B65955
13077B49843e882A54595a37257G3585A3684C941c8802p0681j7567C0515f3827
13065A53725J5597K16226a22028r3041B05586L07081a6604j03919C26354a28430
13054D16613D4696A0569J48538B2582L0403a20305B0472N2314B7582L64461a06333
13042B50955a86205C4627O0429e5469C85677j91659H4036M3465K22096A49117
13031D18451A93319K36249j06899b8027C58115H5375L6498d7944A41531J94005
13021C35536h0739B10256E3202K50152j17561Q2663a83839f1698B38566F2796
$$ plain form
13100 108375 8516 -165500 4896 195282 84108 26026 180288 231258 454 -224150 -16378
13088 -8963 269404 -20527 244016 -26670 256242 135538 365925 263085 -73657 265955
13077 249843 -5882 154595 -137257 73585 13684 3941 -38802 -109483 -127050 30515 -63827
13065 153725 169322 385548 -122028 -215069 205586 512667 -16604 -120523 326354 -128430
13054 416613 44696 10569 159107 22582 52985 -120305 20472 72786 27582 392043 -106333
13042 250955 -186205 34627 95056 -55469 385677 194018 84036 127501 349597 149117
13031 418451 193319 429568 322669 -28027 358115 85375 121873 -47944 141531 335536
13021 335536 -80739 210256 53202 303354 185793 268456 -183839 -61698 238566 62796
13010C0974O8J3836J11070M56117k92680a41012A24137N9814K7036b09266E167
12998E4414J72087k7405o0918a4524A72382n4553C7972d5175A1952e0947A19592
12986A72345g5402B48085c09317Q1359g4118C12508h2208A01827b9150D1068j6331
12975B4737J77197e7984A399a36186B22055k9537A387K74904a14701A85506g0986
12963E5055K42318a19902D8000Q5440b44467A86721H3998A7607L37763A71315
12952B67239A32959F1907a79060C6708K46352a08529A4073J28037L474g5680A21973
12940c1889Q42A48761a40902A11521J58466h0087m4373C23367a79704D1906J59852
12929B01758a12816B27913e6653k5243j3250m9660H7034h564A17329a98426C32404
$$ plain form
13010 30974 31042 44878 155948 612065 319385 -141012 124137 183951 210987 -209266 5167
12998 54414 226501 199096 138178 -14524 172382 117829 37972 -45175 11952 -50947 119592
12986 172345 -75402 248085 -309317 -227958 -74118 312508 -82208 101827 -29150 41068 24737
12975 24737 201934 -57984 1399 -136186 222055 192518 1387 276291 -114701 185506 -70986
12963 55055 297373 -119902 48000 133440 -244467 186721 83998 17607 355370 171315
12952 267239 132959 61907 -179060 36708 283060 -108529 14073 142110 145584 -75680 121973
12940 -31889 -31047 148761 -140902 111521 269987 -80087 -124460 323367 -179704 41906 201758
12929 201758 -112816 227913 -56653 -81896 -95146 -144806 87034 -8564 117329 -198426 332404
12917a69774A43072n5170L61091a65879A85363a21865D0296a62905e8397q0001
12907a38398H9295c9104B5614a15489M3331H3763m0110j6283i8524B81423i1364
12895d4867p6818d3593j62784n2990F5947K31172c95281a8015n5508H9604f868
12883D7670J87425C7207P0459N40275A41622n099o2093K66163C9072J2657K4761
12872G6490J49019o4991A1565a28886A97958a00016D5222a64971A20225P526b43816
12860B05444a68467B76144A2609L3069e2484q2700A72175a77855E3607J67902
12850B21509E6356B0856b1411A02894e2329M457A87238a73041D9821b02942m2897
12839b45839A78965k0062D6395m958M0139C9770g8747D29712i3922C62577H4366
$$ plain form
12917 -169774 143072 87902 448993 -165879 185363 -121865 40296 -162905 -58397 -138398
12907 -138398 89295 -39104 25614 -115489 -72158 83763 43653 27370 -98524 281423 -91364
12895 -44867 -121685 -43593 -206377 -259367 65947 297119 -395281 -18015 -73523 89604 -6868
12883 47670 235095 37207 107666 647941 141622 136523 74430 340593 39072 51729 76490
12872 76490 225509 160518 11565 -128886 197958 -100016 45222 -164971 120225 127751 -243816
12860 205444 -168467 276144 12609 45678 -52484 -135184 172175 -177855 53607 221509
12850 221509 56356 20856 -21411 102894 -52329 -47872 187238 -173041 49821 -202942 -245839
12839 -245839 178965 158903 46395 41437 81576 39770 -78747 429712 -93922 362577 84366
12827c51717A15151a91702A18288J83701A9672J90438r3108L90357b37695B60270
12816I0101b87981G5417N4235b12357i9690A69480a55676B42757k2660b50802
12805F999R9992M1078o5350J4726h2125l08951A94020B3116e3327j9465q770D3982
12792B0600c724B7357J0318J15626N7280a62919A63720L0562a36575B69943j4035
12781B55908b40496B82133O9544F8649J68117l1757A7692a95890G6425g6044A11154
12769E8751a31977L0802K0924m5432J4942B56907d25447B77746a08560K892k32586
12758c38254J57817G5940R2889a33894c5552q1711A15635C9303K57623D0200A9419
12746I7547b58889F032J32155N1258D9672J90819D8652J60142b9378F2306M3089
$$ plain form
12827 -351717 115151 -191702 118288 301989 19672 210110 117002 507359 -237695 260270
12816 90101 -287981 75417 129652 -212357 -99690 169480 -155676 242757 220097 -250802
12805 6999 106991 148069 82719 97445 -82125 -391076 194020 23116 -53327 -72792 -81562 43982
12792 20600 -3724 27357 37675 153301 210581 -162919 163720 194282 -136575 269943 255908
12781 255908 -240496 282133 351677 68649 236766 205009 17692 -195890 76425 -76044 111154
12769 58751 -131977 -101175 -80251 -125683 -110741 256907 -425447 277746 -108560 -105668 -338254
12758 -338254 -180437 75940 168829 -133894 -35552 -117263 115635 39303 296926 40200 19419
12746 97547 -258889 6032 138187 189445 49672 240491 48652 208794 -29378 62306 105395
12735A05395K5156K2325K62105A07762J7202E4904j1114j2148J15143i2046j45525
12724b37571R9251A61474b20543I4184d8916B31a59677G6624J21367b58434f9018
12712D5176i8454A47225o1645R1184p1566M9204B0763O14862A61440J06782c2341
12700I5350L41256A06279J46703j16441c4426j50416B15543a61295A85414b27628
12689A14864c20078h9933p1674C82967d0188B88868A24747a03128B97227o2930
12679B34297P1580F560J32352a41966C31312k8998b1870H3144a16008B92652i1257
12667B18886b93060a0415r3481j5664e735B45716J6494K15867A32350m5351K74612
12656C61611m069c93513A2265K16244k9938q406m1808K04805j58587J32464b2940
$$ plain form
12735 105395 130551 152876 414981 107762 124964 54904 43790 31642 146785 -92046 -237571
12724 -237571 -138320 161474 -220543 94184 -48916 231 -159677 76624 197991 -258434 -69018
12712 45176 -98454 147225 85580 176764 105198 154402 20763 635625 161440 268222 -32341
12700 95350 436606 106279 252982 136541 -34426 -184842 215543 -161295 185414 -227628
12689 114864 -320078 -89933 -161607 382967 -40188 288868 124747 -103128 297227 234297
12679 234297 305877 6560 138912 -141966 331312 302314 -21870 83144 -116008 292652 -91257
12667 218886 -293060 -10415 -103896 -119560 -5735 245716 262210 478077 132350 86999 361611
12656 361611 357542 -393513 12265 228509 198571 190165 148357 353162 194575 327039 -22940
12644F2514d2396B50210E9355b22119B22223b42392g0370C26858c0469A03877
12633C22357a15584F8251c2563A7275J81830A6428L2614L45606A12680b1981A33823
12621B02041m6740F8219j1381K81726a8153A16191b24488B11523d8447l0575o8180
12610a47202D58414A39330k4136O569i2724F2243L49284G8712A4700K71043K20842
12599E06585a93937A78661c677B17295C1445L64363i688j81501B75756K68539
12589E44295A56306E4665Q2465B3300J76010F2515d7364k03578a24859F5765J69163
12578B34928J77731b99801E1335a3654j15517A65674J8885c9863D4992c04307
12567h664A86315d3225p8461I7213m5168M7201J03398e4436D10702o0063j27054
$$ plain form
12644 62514 -42396 250210 59355 -222119 222223 -242392 -70370 326858 -30469 103877
12633 322357 -115584 68251 -32563 17275 199105 16428 49042 394648 112680 -21981 133823
12621 202041 155301 68219 56838 338564 -18153 116191 -224488 211523 -48447 -79022 -147202
12610 -147202 458414 139330 115194 121763 -92724 62243 411527 78712 14700 285743 506585
12599 506585 -193937 178661 -3677 217295 31445 395808 -9688 -191189 275756 544295
12589 544295 156306 54665 137130 23300 199310 62515 -47364 -250942 -124859 65765 234928
12578 234928 412659 -299801 51335 -13654 -129171 165674 184559 -39863 44992 -304307
12567 -8664 186315 -43225 -121686 97213 52045 99246 202644 -54436 410702 350639 223585
12556B23585d9650H8035P9078B6683J60155L2521B1401J09455K0255O2624m2060
12545A71675K3761G8404h3448j1933G1984b08828A09353b76692g5407a7923j88467
12534b06390N9520j73971h4217A03919e9551A43b37995B34527A15980a62624b0029
12522b12872e8873C66273A02455e9321B24086M7432f1240J2768l1298l7785L5140
12511h2415K6062e726q0117H4703M0260K69420j92857e1195A9320a97365A3398
12499G9058K666b87749B07071c581o0450b8029A24948n7086i1480D9686J75723
12488B25409P039A00264N3383E8437f4954I6700a86640A1698b88952C25796A30919
12476b43522g4156l7582A74144L1897E2737J66653o1450G5273J42486d4710r741
$$ plain form
12556 223585 -49650 88035 167113 26683 186838 219359 21401 130856 151111 213735 171675
12545 171675 195436 78404 -83448 -95381 71984 -208828 109353 -276692 -75407 -17923 -206390
12534 -206390 -146870 -320841 -84217 103919 -59551 143 -237995 234527 115980 -162624 -20029
12522 -212872 -58873 366273 102455 -59321 224086 271518 -61240 -48472 -79770 -117555 -82415
12511 -82415 -56353 -5726 -85843 84703 124963 394383 201526 -51195 19320 -197365 13398
12499 79058 81724 -287749 207071 -3581 -64031 -28029 124948 67862 -91480 49686 225409
12488 225409 232448 100264 153647 58437 -64954 96700 -186640 11698 -288952 325796 130919
12476 -243522 -74156 -111738 174144 206041 52737 219390 157940 75273 217759 -44710 -54451
12465e4451C4023J69418j01069c37288b4278B0992a10568L8161A71648a00027
12454c57032a72533M7797J6253a5198j41905A21717a4267B1600g0269l196k0092
12443i3557A78305J35159j46879C2416c056r9003A05938L5633n9401c17713J28558
12432a89155i547k8459l9094k0157H9307C5481q919d69903b25022f1116K6725
12421c4391k74839E5878P5501i3097D9069c41066F3325N5287E4725J74222r5628
12410A33319K2679a46954F5970J32981E713b57688J27561m4343B03585H0551L7379
12399A17930b83894A06993J82931e1797j45902A47963b48754B06218f9606B89237
12388A08764e131A127J45493C4999a11226b6282l5877D08754i3368a8680B34594
$$ plain form
12465 -54451 34023 203441 102372 -337288 -24278 20992 -110568 -72407 171648 -100027
12454 -357032 -172533 -124736 -108483 -15198 -157103 121717 -14267 21600 -70269 -73465 -93557
12443 -93557 178305 313464 166585 32416 -3056 -102059 105938 141571 82170 -317713 -189155
12432 -189155 -9547 -38006 -77100 -97257 89307 35481 26562 -469903 -225022 -61116 -34391
12421 -34391 -309230 55878 131379 -93097 49069 -341066 63325 118612 54725 228947 133319
12410 133319 155998 -146954 65970 198951 5713 -257688 -130127 -174470 203585 80551 117930
12399 117930 -283894 106993 289924 -51797 -197699 147963 -248754 206218 -69606 289237
12388 108764 -5131 1127 146620 34999 -111226 -26282 -62159 408754 -93368 -18680 234594
12376g1064A47151J0567i1359D4689M5003c6901A13599c92274J93378n9751F5577
12364A94694i222A78760J5863o9424B5404a19330L3843B14749a9223k0490A19973
12352a32816A83189J7186b40180I1527c05353b4474A23199m3907J03674m1709
12342A41257i5649c2051k00790R8365L9276A79876n2815a18993b3433A02544L22715
12331D25259P2931A48409a78645G5282c7080m9912L9549k3800A74222J875J35425
12320C11522a3627B6695a33023O6317C6007J7091b62801d0507F4345g8537k50574
12309c29111C7675d3158m1436A03809J13617g291A51116R711o2468c09234B97853
12297F2730B2465b0770C172P1838J57777O6037a71639C86682J0405A71673C5781
$$ plain form
12376 -71064 147151 157718 -91359 44689 89692 -36901 113599 -392274 -198896 -258647 65577
12364 194694 -9222 178760 194623 125199 25404 -119330 -85487 214749 -19223 -39713 119973
12352 -132816 183189 200375 -240180 91527 -305353 -24474 123199 79292 182966 141257
12342 141257 -95649 -32051 -232841 -134476 -95200 179876 127061 -118993 -23433 102544 425259
12331 425259 498190 148409 -178645 75282 -37080 -86992 -47443 -71243 174222 176097 311522
12320 311522 -13627 26695 -133023 -66706 36007 53098 -262801 -40507 64345 -78537 -329111
12309 -329111 37675 -43158 -84594 103809 217426 -7291 151116 160827 98359 -309234 297853
12297 62730 22465 -20770 3172 75010 232787 298824 -171639 386682 397087 171673 35781
12285A58341F2039R5949b7732H356a14590B68647b64439a126I1394O9861L5634
12274A96889E0730J0870J35734g6104A45040E6312g11j21223A85971E5464R654
12263F5118b29857A05747O0673d2206B35969m7000g1506A18378e5011k59976D08249
12251a90682A62663J34884a62735E545J75004k2735Q760F6052b1433A99094F8002
12239H6268p282b99941c0558N511C0110L30820A37062K9959R5407A21816R0373
12228B12189l9219a00539B26882K15859A97329a97493A21540O9139J53751j4774
12218C29656B2058L54872j21263P265K59480A27018B887R0137a10972G7841d8561
12206G1622J97816E2823J22701k5285a77002A44715K04438b04525D56101j94252
$$ plain form
12285 158341 62039 157988 -27732 8356 -114590 268647 -264439 -1126 91394 161255 196889
12274 196889 50730 61600 197334 -76104 145040 56312 -711 -121934 185971 55464 65118
12263 65118 -229857 105747 166420 -42206 235969 188969 -71506 118378 -55011 -314987 408249
12251 -190682 162663 297547 -162735 5545 180549 157814 166574 66052 -21433 199094 68002
12239 86268 78986 -299941 -30558 -25047 30110 360930 137062 167021 262428 121816 212189
12228 212189 172970 -100539 226882 442741 197329 -197493 121540 190679 344430 329656
12218 329656 22058 376930 255667 262932 522412 127018 2887 93024 -110972 77841 -48561
12206 71622 269438 52823 175524 150239 -177002 144715 349153 -204525 456101 261849
12196B61849P2122a41805B22863R466O2140b05240C65283A58735a01241B65925
12185I7743b24027B6975d5459C13213A23807N4854b11193R2209A52294K43587
12175C95881A67033b39545h5725B70283p7610B0209L06600j11518m1642a07474
12164E7782A6638P1507a2029I7580P0950G8682A8042J10753R3348a59553O9356
12153i0197c2001C87263C6064J0693a644m4769B72274m6294c28070A08288a32824
12141A38841d7976n2598m0540B50699b4661m7232a2852J346A30750O2468I4286
12129b09707C74839C3833J82340R1388A32078J63564d0350A34507R3988i5484
12118a18576A83896J25168a13934M2328a595l62379d4232E3518a45352B1118a86857
$$ plain form
12196 261849 333971 -141805 222863 232329 294469 -205240 365283 158735 -101241 265925
12185 97743 -224027 26975 -45459 313213 123807 178661 -211193 -118984 152294 395881
12175 395881 167033 -239545 -85725 270283 192673 20209 326809 215291 173649 -107474
12164 57782 16638 88145 -12029 97580 168530 78682 18042 128795 222143 -159553 -90197
12153 -90197 -32001 387263 36064 46757 -1644 -46413 272274 225980 -328070 108288 -132824
12141 138841 -47976 -100574 -141114 250699 -24661 -71893 -12852 -11506 130750 193218 94286
12129 -209707 374839 33833 216173 307561 132078 295642 -40350 134507 228495 -95484
12118 -118576 183896 309064 -113934 -71606 -1595 -363974 -44232 53518 -145352 21118 -186857
12106A92211b3128m2985K1886k49399J39546O9636I288O9411h3293k61849e0291
12094b54196A61086n398a30425L3270m6481m9838j76564A10119a60394D6660g2139
12082D6647K27369o639a50027B6263E668M88686O89050K05332o66389A30854K77325
12071D08179P3624i4372K4646A02047h6879g953m14583a59780E1716K960K62941
12060C17617a19956H2865a32084k5992B11301a35685A16740E7298a2655j54050
12050a66705A3675a604A82913c32402J13576e5881q7866O7388j45031M8576D2091
12038A36150o7521O5929R0433a49814J7086B12572b13161e9715A63515l9275b7822
12026A57357D0264d5460a5121F8760C0760J68117a81252B31M6933P5123c67071
$$ plain form
12106 192211 -23128 -66113 -44227 -293626 -154080 -84444 9288 78699 -83293 -345142 -50291
12094 -254196 161086 155688 -130425 -97155 -143636 -193474 -370038 110119 -160394 46660 -72139
12082 46647 274016 267377 -150027 26263 5668 494354 1183404 1388736 722347 130854 408179
12071 408179 481803 -94372 -69726 102047 -86879 -7953 -422536 -159780 51716 54676 317617
12060 317617 -119956 82865 -132084 -158076 211301 -135685 116740 57298 -12655 -166705
12050 -166705 13675 -1604 182913 -332402 -218826 -55881 -143747 -76359 -221390 -172814 42091
12038 136150 68629 134558 224991 -149814 -132728 212572 -213161 -59715 163515 124240 -27822
12026 157357 40264 -45460 -15121 68760 30760 198877 -181252 231 47164 122287 -367071
12014B03379h3951c249k75440B10239a98329E5967a1578k9959j56622C51090j35505
12003B15585a73511M2152M0761k04185J13765C59555b6558j3601B6333b06837
11992B3527J00641L2142J49200a23031j08248A71199a71602A5738a57558a9388
11981b37269b5865E3518f2680B08465c19562a52792A24588a73180G203K4239b67577
11969A82578c0533j16888K1604j4333f6298j85365C522b72469i2297r8459A70288
11957a132j93964a1320B07264i7472C03198a85267C9192h1191G680K12010C779
11945A55568k9466C9928K96060A7987J53797p2445a62296C4272o475g9657p6326
11934a55983A87256m4020a72900H9203b05143e1393C3216a22943j35584B77659
$$ plain form
12014 203379 -83951 -3249 -278689 210239 -198329 55967 -11578 -41537 -198159 351090 215585
12003 215585 -173511 -131359 -90598 -294783 -181018 359555 -26558 -40159 26333 -206837
11992 23527 124168 156310 305510 -123031 -231279 171199 -171602 15738 -157558 -19388
11981 -237269 -25865 53518 -62680 208465 -319562 -152792 124588 -173180 7203 31442 -267577
11969 182578 -30533 -147421 -125817 -140150 -66298 -251663 3522 -272469 -92297 -190756 170288
11957 -1132 -195096 -11320 207264 -97472 303198 -185267 39192 -81191 7680 219690 3779
11945 155568 126102 39928 335988 17987 171784 99339 -162296 34272 27797 -79657 -155983
11934 -155983 187256 143236 -172900 89203 -205143 -51393 33216 -122943 -258527 277659
11923c7017l30421A75548o4584b40763D8393b00210G6158J9986g8304b3461j4477
11912c7938j26122N1559c2456o4532R776K3535A54455d7617A29618Q165D509b696
11899H254a04475d8949F0310k6179b5002h598A29720r95k9004J60139A23131a87464
11886A75518a00604k03288A4398b15505A3265Q3971D4870K0434L09798D2148O641
11875D8789a55230M4347a316k79003F3659a46445o5830H7044c3923k67205h8954
11863B71069h3357A082O7085b7438j31175M9276F9459N5193a85333B24759l1074
11852A93685i3498G8782K2360l651a35736j12735J13845M4704b9228j96690b2333
11840A09953J2812n1748h9722n7283K2114a1427A66303a03965j62055B0078c6762
$$ plain form
11923 -37017 -367438 175548 110964 -240763 48393 -200210 76158 96144 -78304 -23461 -37938
11912 -37938 -164060 -112501 -32456 -96988 -87212 -63677 154455 -47617 129618 137783 4509 -2696
11899 8254 -104475 -48949 60310 34131 -25002 -8598 129720 128725 99721 259860 123131 -187464
11886 175518 -100604 -303892 14398 -215505 13265 97236 44870 65304 375102 42148 48789
11875 48789 -155230 -110883 -1316 -280319 63659 -146445 -212275 87044 -33923 -301128 -88954
11863 271069 -83357 1082 68167 -27438 -158613 -109337 69459 124652 -185333 224759 193685
11852 193685 -93498 78782 101142 97491 -135736 -248471 -134626 -89922 -29228 -225918 -22333
11840 109953 122765 71017 -89722 -147005 -124891 -11427 166303 -103965 -266020 20078 -36762
11828C21484D6472M7275Q5361m3939O1314f7578A39243a29136k08990A7384a13424
11816b88184f4043A07406J48827i3846K9035k2098n9501k06914a43631K5328B7822
11804C512g6903B01243b85441B11053b63147A02866b21935A43711c2535C43760
11793D0730a82973F1780K10663A11142m2616b13296J00277N269A8668O4738b38757
11781c57267J37570B67722c02698N8332Q3551M4282Q736B4148g4446B31280a62829
11769D7945J46249b81914I6427g2359i409B661a72994H8310K3853d56731J93135
11758b63596C0384a322F5834a13108C6470K08932f1279p1514E2778J90882a68996
11746b46648C39419A56349g3453D0244J79325C9464f3282b3293E8508A4934M6940
$$ plain form
11828 321484 46472 93747 179108 135169 196483 -67578 139243 -129136 -338126 17384 -113424
11816 -288184 -64043 107406 256233 -93846 -64811 -86909 -146410 -353324 -143631 -118303 27822
11804 3512 -76903 201243 -285441 211053 -263147 102866 -221935 143711 -32535 343760
11793 40730 -182973 61780 272443 111142 68526 -213296 -113019 -107750 18668 83406 -238757
11781 -357267 -219697 267722 -302698 -244366 -160815 -116533 -107797 24148 -74446 231280 -162829
11769 47945 194194 -281914 96427 -72359 -9409 2661 -172994 88310 112163 -456731 -263596
11758 -263596 30384 -1322 65834 -113108 36470 245402 -61279 -132793 52778 243660 -168996
11746 -246648 339419 156349 -73453 40244 219569 39464 -63282 -23293 58508 14934 61874
11735F1874P3800f0376m2113B54454j21133a3389r4115D7279J74726G9135j3511
11724F5624R503J87207E3139J3313a25530B70600d735A18567k7220J7111f2423
11712I8147g884l15550b5814F4144b4409A37419F6296b48217A88443b6351k87876
11701c14227B19401q7542J05711n5073B9453g1474j28646A46326M2498a02427
11690b73071h7829B5220d47509A17862N007m482m5049J63522c1081B80822O9648
11679C50470j26336p0248J86446f9647j297B93966D0333J965i0708A51660A2860
11667a71951j6169L7503d7291I6958P1513b05110k1537P6815B6772f40475c15764
11655H9829J76970j25356c1799C4608N7078O824h7661o8555m179B6021J0891j0007
$$ plain form
11735 61874 135674 -60376 -102489 254454 133321 -13389 -107504 47279 222005 79135 65624
11724 65624 75127 262334 53139 66452 -125530 270600 -4735 118567 91347 108458 -62423
11712 98147 -7884 -323434 -25814 64144 -24409 137419 66296 -248217 188443 -26351 -314227
11701 -314227 219401 131859 237570 182497 29453 -71474 -200120 146326 188824 -102427
11690 -273071 -87829 25220 -447509 117862 122869 118387 73338 236860 -31081 280822 350470
11679 350470 224134 153886 340332 -69647 -70944 293966 40333 42298 -90708 151660 12860
11667 -171951 -188120 -150617 -47291 96958 168471 -205110 -226647 -149832 26772 -640475 -315764
11655 89829 266799 141443 -31799 34608 91686 98510 -87661 -156216 -160395 26021 36912 26905
11643B6905i3244j47249H4385d90048I8566b3123A41887i1574G4332J23928b4158
11631B3411J12015i898A21423a53837a1009j10766a6489H8319A9489J68405j7751
11620A70143B5567K20241M2053b8929B0633b9397G8311c11168B98041q433m1766
11609B47842g4678C50806A43309A9329e9074J583F4109g1053A35860J6739a90108
11597E8659j6377a91971A5336Q6256L678K56686A3361e2281B00279M894b52172
11585A37629L93563A96849G3361h9911B82716a17086N0378B0223a38486A19498
11574A63469a15946C07166A0751a88656C43995a58036A4367O5851c5868H1845
11563C34139a06506E1372b59971A22872b4357d185C025J8772b84680C741J12353
$$ plain form
11643 26905 -93244 -240493 84385 -490048 98566 -23123 141887 -91574 74332 198260 -24158
11631 23411 135426 -9898 121423 -153837 -11009 -121775 -16489 88319 19489 187894 170143
11620 170143 25567 245808 287861 -28929 20633 -29397 78311 -311168 298041 289608 247842
11609 247842 -74678 350806 143309 19329 -59074 -57491 64109 -71053 135860 152599 -190108
11597 58659 42282 -191971 15336 101592 105270 361956 13361 -52281 200279 205173 -252172
11585 137629 531192 196849 73361 -89911 282716 -117086 -66708 20223 -138486 119498
11574 163469 -115946 307166 10751 -188656 343995 -158036 14367 80218 -35868 81845
11563 334139 -106506 51372 -259971 122872 -24357 -4185 3025 21797 -284680 3741 116094
11552A16094l8163B977a41944j4756B31314b16097C97053B2837h4292K2068K8421
11541c3803F285J74837e925j17638H3993J4186h9330D06202a01917A28995J23136
11530B52131F9026L19226H4210N781R7981G6212R4700p4285f9393B00761B2666
11518a80916C61730j74023q5888c71362A7171b4943l04523A08692B7987f7097
11507A07440M6514K17426A3641N19731A42094j948J8625n3502b7653P688A93063
11495B38709b0384A86599C2233K6658j178M9338R6628q0909J92294O0913a25670
11483B92117F3115J863i1872I3297b78720B98580b45733A09665J64031j7122A01043
11471A82314k422b89769B42649b4590A09890A0528K75356j26541G0995M1716K30823
$$ plain form
11552 116094 77931 2977 -141944 -156700 231314 -216097 397053 22837 -84292 -62224 -33803
11541 -33803 6285 181122 -5925 -123563 83993 98179 -89330 406202 -101917 128995 252131
11530 252131 69026 388252 84210 89991 187972 76212 170912 96627 -69393 200761 22666
11518 -180916 361730 187707 101819 -371362 17171 -24943 -329466 108692 27987 -67097
11507 107440 153954 371380 13641 533372 142094 140146 158771 105269 -27653 -19965 193063
11495 238709 -20384 186599 32233 58891 57713 107051 203679 122770 315064 375977 -125670
11483 292117 63115 64978 -91872 93297 -278720 298580 -245733 109665 273696 256574 101043
11471 182314 179892 -289769 242649 -24590 109890 10528 285884 159343 70995 112711 343534
11460C43534H6429m183Q5604a6461A93850r2998P0771h231A37804R8038n85L327
11448B38584j269p7599O4639a49454A8858a23007E69J36632M0918q1650K470K24535
11436C23474N729b23415C5559O8844a16991L6442l02845B25600b8935m00809B83557
11424B60072c8067m1029F090d9489G4184a07881o8216B15773b1523P801C13143
11412B36217A02879b3518A66078D4351b07925k1091j5668g4791j57992D4084g2212
11400a74767e2958A14321i1886H3089a87686A72251L2559n5673b17622i1006n4661
11389a45667O7347C18797j14520c4349C06427b3653l86354a56048A73009A0028
11378E6370a87237A75311d8351A25255l8444a5752j63050c7539A59943l5609K92347
$$ plain form
11460 343534 86429 82246 167850 -16461 193850 100852 171623 -8231 137804 235842 235257 238584
11448 238584 237315 159716 224355 -149454 18858 -123007 569 137201 178119 96469 98939 323474
11436 323474 329203 -223415 35559 104403 -116991 -80549 -383394 225600 -28935 -429744 283557
11424 260072 -38067 -79096 6090 -49489 74184 -107881 -176097 215773 -21523 -13722 313143
11412 236217 102879 -23518 166078 44351 -207925 -229016 -244684 -74791 -232783 44084 -72212
11400 -174767 -52958 114321 -91886 83089 -187686 172251 204810 149137 -217622 -91006 -145667
11389 -145667 -78320 318797 204277 -34349 306427 -23653 -410007 -156048 173009 10028
11378 56370 -187237 175311 -48351 125255 86811 -15752 -178802 -37539 159943 124334 416681
11367D16681f1046F2280k4605o093c62689d8292R048j8760o195B66085j23148
11356A42937k0731P7880A9186L21214a55177j9379A04351b5497D205J1301c5942
11344A35475e3114D0614a23831A80879c76413J88172A24630a41074l6208O6991
11334a10291A63120b63696E1744A6251J80178G1071J68058E5083c4915r6630B3121
11322A61507e1861F41650i5455q053c57l6113B38651b77681e0715B3378J04683
11311A28061E2129R6364c38343A10856a65645P1603B18385a97693K5193p1718
11301b44218A10848a58062K0620c7180j63561E5827B29c04963F0617H176c20339
11289A16701c8483p1600B4419b48375F7648L9662n2450P577d2978B78410Q817
$$ plain form
11367 416681 -61046 62280 37675 31582 -362689 -48292 -39244 -58004 -64199 266085 142937
11356 142937 122206 200086 19186 340400 -155177 -174556 104351 -25497 4205 15506 -35942
11344 135475 -53114 40614 -123831 180879 -376413 -188241 124630 -141074 -177282 -110291
11334 -110291 163120 -263696 51744 16251 196429 71071 239129 55083 -34915 -131545 23121
11322 161507 -51861 641650 -95455 -103508 -357 -36470 238651 -277681 -50715 23378 128061
11311 128061 52129 148493 -338343 110856 -165645 -94042 218385 -197693 -172500 -244218
11301 -244218 110848 -158062 -137442 -37180 -200741 55827 229 -304963 60617 8176 -320339
11289 116701 -38483 -110083 24419 -248375 67648 107310 54860 62437 -42978 278410 287227
11278B87227I0155g0j1856j30910o5024f4995a1944B15760A2370h0484l9612p4670
11266a94766P5811H2600d8483k06233A79960a24245H2500c20394E3993e2776a8231
11254A3888P6114b60140b1886l2577o4059L491A75653c15103a07581d6755A22559
11242a13904A0578J97989r8231J29680m7786M8195A11051d0408o1692A29832n6249
11231G3583R3936f1438B58736b657n372k87G0176c13013B1729J23329D2317K46156
11219B88473b07378O9085m9639k62458D6745d3351n126j554D9190f3337k3011
11208h6348m5850b928j60336O5904K9065k0900D293c53793a28077J4271J5967
11197i7839k27978e5290o0915B91321j42904e50014A99127H7212b96813p1529
$$ plain form
11278 287227 90155 -70 -11926 -142836 -207860 -64995 -11944 215760 12370 -80484 -120096 -194766
11266 -194766 -118955 82600 -48483 -254716 179960 -124245 82500 -320394 53993 -52776 -18231
11254 13888 90002 -260140 -21886 -54463 -118522 -115031 175653 -315103 -107581 -46755 122559
11242 -113904 10578 208567 110336 240016 192230 240425 111051 -40408 -102100 129832 73583
11231 73583 167519 -61438 258736 -2657 -8029 -8316 70176 -313013 21729 145058 42317 288473
11219 288473 -207378 -138293 -187932 -450390 46745 -43351 -48477 -50031 49190 -63337 -86348
11208 -86348 -132198 -2928 -163264 -97360 -68295 -89195 4293 -353793 -128077 -113806 -97839
11197 -97839 -325817 -55290 -116205 291321 148417 -550014 199127 87212 -296813 -368342
11187c68342a27254A13677K561i1697B34684a23958K9728H3845d5877m3756J1631
11176g8002k94487D2690O9995f5554G8331a87370L8789C93373a37286e8442B45603
11164C11137j19961C5940b01351k8957A08179f5805B67839a84025O3118j85284
11154c06191a24386r2581H5403a70852A20394B107M90572b16004G1671G871a58023
11142a94151d1254A8661Q6196J95328d87099J10891D2150K8935b7632B33429a65912
11130a75431A55800a87826g037n6741j77945B55545A02633N9027J3975h3076a8078
11118C21872O791b97620A05982m3572N8460E8460P1017m4336b9328D48104A13399
11106C26063j60099J572C0775J37090O0169m9682o0938C0599p739J66498p3370
$$ plain form
11187 -368342 -127254 113677 116238 -91697 234684 -123958 -94230 83845 -45877 -89633 -78002
11176 -78002 -372489 42690 112685 -65554 78331 -187370 -148581 393373 -137286 -58442 245603
11164 311137 191176 35940 -201351 -230308 108179 -65805 267839 -184025 -120907 -306191
11154 -306191 -124386 -216967 85403 -170852 120394 2107 492679 -216004 71671 7871 -158023
11142 -194151 -41254 18661 104857 300185 -487099 -376208 42150 71085 -27632 233429 -165912
11130 -175431 155800 -187826 -7037 -63778 -241723 255545 102633 161660 175635 -83076 -18078
11118 321872 328663 -297620 105982 62410 120870 58460 129477 85141 -29328 448104 113399
11106 326063 165964 167536 30775 167865 228034 178352 117414 30599 22860 189358 115988
11095A15988J2050n3987M1905J54918D5777O3390B3500O3198e7350I0995q970
11084H2025m0K19616d571B58357j25325J85165j49071M583J99426J00616B01634
11072B56214M349j20433L54206B9520J02861J15937a02668F81519l09803J39479
11062E11195k28687m3490L44062J4522B08406N12847k9547k65008l0190j60641
11052B35867P07151m64733J03564K11558P1369k40573m0168L2091J41049k97858
11042D59317j98975r4853Q21426D72963K76789j90877O0569j64635k5250J43000
11032E72559j11540J33243B58899L34147J17291j06267J81152K07832j27295k49483
11022F16276m7545J12485j03735L19762B97624L55918j83650K56111l29573L08939
$$ plain form
11095 115988 128038 74051 115956 270874 45777 109167 23500 86698 -57350 90995 82025
11084 82025 81985 301601 -4571 258357 133032 318197 169126 173709 373135 473751 201634
11072 256214 260563 140130 494336 29520 132381 248318 -102668 681519 371716 511195
11062 511195 282508 239018 583080 597602 208406 721253 691706 426698 396508 235867
11052 235867 943018 478285 581849 793407 864776 624203 584035 616126 757175 459317
11042 459317 260342 165489 986915 472963 749752 558875 619444 454809 429559 572559
11032 572559 461019 594262 258899 593046 710337 604070 785222 993054 865759 616276
11022 616276 568731 681216 577481 897243 297624 653542 469892 726003 396430 705369
11012G05369l13803N7834p6215M5922J08761k2432J53764O1089k33885k2601n9150
11001D04653J55303J10512K0036j92879J02413q1628j66842M99321l56864O8528
10991E62553R2867r8433R5901L47286j69409C23500L23391K41998J60430j27870
10981I21449L81450k27630K68022K39141K5861p8166L26878K60563J57479J84971
10971B460018K91825k00925j33460l68448k45257p5713l9212R6501m25681M2849
10961A402497n0376K69284n0879M71879m54410j10088j1342n44983J3892m12758
10951E22716M09066j1812C68506j11209R1089J2536E5880J68662J32453p9653
10941B77342A09515K36862A37701f8190B35622D8320K27568Q8953j70372E3265
$$ plain form
11012 705369 391566 449400 373185 419107 527868 505436 659200 720289 486404 463803 404653
11001 404653 559956 670468 690504 497625 600038 518410 351568 850889 494025 562553
10991 562553 655420 556987 652888 1000174 830765 323500 646891 888889 1049319 921449
10981 921449 1302899 1075269 1343291 1582432 1608293 1530127 1857005 2117568 2275047 2460018
10971 2460018 2751843 2550918 2417458 2049010 1803753 1728040 1688828 1785329 1359648 1402497
10961 1402497 1352121 1621405 1570526 2042405 1587995 1477907 1466565 921582 935474 522716
10951 522716 931782 919970 368506 257297 348386 360922 55880 224542 356995 277342
10941 277342 109515 346377 137701 -68190 235622 48320 275888 364841 194469 53265
10930b72142A23921l3307J04157A7078J21104J67656a54192B19021e7108A62632
10919I519a50820A67114B2294L9728b28390B1767L10959c8893j30854j51686a19777
10907a96811A46876h8788A55404a88173L1160c9807p4930e0645B12447a3201D08155
10895b0168A22907K6568d6011k03893F2252M84l345f2390o1819l3863B31342j08388
10883A22954P1449K6543j07297k5462j6662j6176f4274m8691D2052K886j4140
10872C0798B511i6799I847N9513a41353j28212O3595j48573B85751j18718N3753
10861B20786C9480K18129d3406j18761L1564k69979a49888B67894j7735E9304
10850b5603B33662G1459D369h2336H4679a46324O6533b6625E3503A2998a1291
$$ plain form
10930 -272142 123921 90614 194771 17078 138182 305838 -154192 219021 -57108 162632
10919 9519 -150820 167114 22294 62022 -228390 21767 332726 -38893 -169747 -321433 -119777
10907 -196811 146876 -88788 155404 -188173 -157013 -39807 -114737 -50645 212447 -13201 408155
10895 -20168 122907 149475 -46011 -249904 62252 62736 59391 -62390 -124209 -158072 231342 122954
10883 122954 194403 220946 113649 88187 71525 55349 -64274 -112965 42052 44938 30798
10872 30798 2511 -96799 9847 69360 -141353 -269565 -205970 -354543 285751 167033 220786
10861 220786 39480 257609 -43406 -162167 -130603 -400582 -149888 267894 250159 59304
10850 -25603 233662 71459 4369 -82336 84679 -146324 -79791 -26625 53503 12998 -11291
10838D4255b30476G7359O7226b24365a04560k4528B40990b71009c9676j44434
10828a84110C28968a44796o0970m1639g5387j43512c2150E3506J04935i7732B08741
10816a20055J2633A1312c94758e1833o0312n9427G4375K0657b66147A78526c70701
10804H809a05605A67897p0626e9740F781g8905j16904C5077a51259f9106G9107
10792b56509R0257q6207O3814D8291L0428M0105b49982a18482k34512D6563a43672
10780a10375o28r5188A68547O0563j05357a12502C17722e1627j28356A51528B4043
10768A31567a06787B7617g0320B6070e33212b1924j27004A12089d4104r8144D0978
10756c3703k25795K4467F7950a63117A97342J09900d8849G0522b2294A91156a21391
$$ plain form
10838 44255 -230476 77359 144585 -224365 -104560 -129088 240990 -271009 -39676 -184110
10828 -184110 328968 -144796 -205766 -247405 -75387 -218899 -32150 53506 158441 -97732 208741
10816 -120055 -107422 11312 -394758 -51833 -112145 -171572 74375 95032 -266147 178526 -370701
10804 8809 -105605 167897 97271 -59740 6781 -78905 -195809 35077 -151259 -69106 79107
10792 -256509 -166252 -252459 -188645 48291 78719 118824 -249982 -118482 -352994 46563 -143672
10780 -110375 -111003 -206191 168547 229110 123753 -112502 317722 -51627 -179983 151528 24043
10768 131567 -106787 27617 -70320 26070 -533212 -21924 -148928 112089 -44104 -142248 40978
10756 -33703 -259498 -235031 67950 -163117 197342 307242 -48849 70522 -22294 191156 -121391
10744e02857C00969m1916a3430j12881A66031p6966a31095O5194A72889o3978
10734A08911c0392p7781j03962r058A23910e3873r0706I6184a16858d5207B53136
10722a08981I9303a178j10327A7647c57756a18291A2916Q5075b12609P7181B29294
10710a49572j78980f2266K4523k97475b9109J1337Q587A96191d0176m9566A00566
10698e8161l7876l56529a48398F8642K13434a92600L5446N8567H5238L986c79530
10686a90958g8677o1031B61244a73266Q1997c5651j38016c4448J0546A3810a27523
10674a12217A04525L15173B08998H7080J83672b25303h0826k13732N4884a13796
10663f4063j73498A04030P1000a18570A18991O1954i4926A1754a07160D0902J83584
$$ plain form
10744 -502857 300969 259053 -13430 -126311 166031 89065 -131095 -65901 172889 108911
10734 108911 -30392 -108173 -212135 -221193 123910 -53873 -144579 96184 -116858 -45207 253136
10722 -108981 99303 -1178 -111505 17647 -357756 -118291 12916 97991 -212609 -135428 229294
10710 -149572 -328552 -62266 -37743 -335218 -29109 -17772 -9185 196191 -40176 -89742 100566
10698 -58161 -96037 -452566 -148398 68642 282076 -192600 -157154 -98587 85238 89224 -379530
10686 -190958 -78677 -139708 261244 -173266 -91269 -35651 -173667 -34448 -23902 13810 -127523
10674 -112217 104525 419698 208998 87080 270752 -225303 -80826 -294558 -239674 -113796
10663 -64063 -237561 104030 175030 -118570 118991 180945 -94926 11754 -107160 40902 224486
10652B24486m4254b98337a18557r2126O0914k03307A67444a71411M2701a1541
10641A26096b93397G8878A9106d55348d5130A07840R3878a68308A56214P4702
10631B30916b49642J14264k1106L8602A31311b57395O7089j85734A91827d3896
10620A13878D1304Q4043M4018d51184K18173h9745k56285d8799B27612c1669j6107
10609d7776j45360p3007i1664K3391j48479A09293J42361E6362b99586J03168
10599a96418A51012d10797h3011k06506a24050q549l4189R298G7693l6394J19940
10588A61239g838H1682a33252k63243g6810k6620l31769D6919L42533A7178J35961
10577A53139b76765A0969a51449B01643a87035B25013b20664L551j76577O8110
$$ plain form
10652 224486 180232 -298337 -118557 -210683 -149769 -353076 167444 -171411 -128710 -11541
10641 126096 -293397 78878 19106 -455348 -45130 107840 201718 -168308 156214 230916
10631 230916 -249642 -135378 -156484 -117882 131311 -257395 -190306 -376040 191827 -43896
10620 113878 41304 125347 169365 -451184 -233011 -89745 -346030 -48799 227612 -31669 -47776
10609 -47776 -193136 -266143 -91664 -68273 -216752 109293 251654 56362 -299586 -196418
10599 -196418 151012 -410797 -83011 -289517 -124050 -132599 -166788 -157490 77693 41299 161239
10588 161239 -7838 81682 -133252 -396495 -76810 -103430 -435199 46919 389452 17178 153139
10577 153139 -276765 10969 -151449 201643 -187035 225013 -220664 -217113 -393690 -325580
10567c25580n0420B25650r8589a31782J6979I5824j8130b94358H4977j7802J9842
10556H7017A776J10552L8837P4633G0555b72249k80755I686a62185j91325B60091
10544I5891k5854K41213c9170B09462b2008C31720C6076J81977a17320b3409A75140
10532F2129a19014B20707G9457a30745B89718c1782k83281A99830i592A75155
10521b1516G8736R0449a65145O1602f869J331A52063j2856J6973E5747J9544K32401
10509C07692a27809I449i4184q3306k58092H8333d475k95303M7790a00117b8472
10497h7634q2074B41640e7030D6075q517a95921A74672Q6593G6179K23742r7189
10486B02732j7854e7807C85977j54394l2483j7715L8539J30851P7329b6121C4509
$$ plain form
10567 -325580 -376000 225650 127061 -131782 -114803 95824 77694 -294358 84977 67175 87017
10556 87017 1776 112328 151165 225798 70555 -272249 -553004 9686 -162185 -353510 260091
10544 95891 70037 311250 -39170 209462 -22008 331720 36076 218053 -117320 -23409 175140
10532 62129 -119014 220707 79457 -130745 289718 -31782 -315063 199830 -9592 175155
10521 -21516 78736 169185 -165145 -103543 -6869 -5538 152063 139207 156180 55747 75291 307692
10509 307692 -127809 9449 -94184 -177490 -435582 88333 -4475 -299778 -251988 -100117 -28472
10497 -87634 -169708 241640 -57030 46075 37558 -195921 174672 261265 76179 299921 202732
10486 202732 184878 -57807 385977 231583 199100 181385 219924 350775 428104 -26121 34509
10474g9625A22020E6833g5194j1750C82870a27075j09994a16822k05449A6944
10463a78313f69A35824c11881J35935L8780B24862q8783J01487d7684B23750G0636
10451h2425k8857N2885j9099j5683L283H3765d42466B02195b99523B57735p7927
10440A79808a02980A65421K41091b15410a06256H942b2320C5965j040N0429O7760
10429A53114G2980C0568d6108J3142k27940O3749A13997N2149d5368I5848f348
10417B1114K00981b775A2806a50852r2618a9563k2696A61449b65914I4823a32262
10405a37318A99539c95854E6930b10466A44022a56325I8119p399b11837d4395
10394c5566A93068k1642G6250J38731B9052N35859H3816R4000o7662G34J50213
$$ plain form
10474 -79625 122020 56833 -75194 -86944 382870 -127075 -237069 -116822 -322271 16944
10463 -178313 -669 135824 -311881 -175946 -137166 224862 136079 237566 -47684 223750 70636
10451 -82425 -111282 -58397 -77496 -93179 -89896 83765 -442466 202195 -299523 257735 179808
10440 179808 -102980 165421 406512 -215410 -106256 8942 -22320 35965 34925 85354 153114
10429 153114 72980 30568 -46108 -32966 -260906 -197157 113997 166146 -45368 95848 -6348
10417 21114 222095 -2775 12806 -150852 -243470 -19563 -42259 161449 -265914 94823 -132262
10405 -137318 199539 -395854 56930 -210466 144022 -156325 98119 90720 -211837 -44395
10394 -35566 193068 171426 76250 214981 29052 564911 83816 177816 110154 734 150947
10383A50947L2113K17528o989A94628K00363c4110l0427A32064a5747o7935B37443
10371a26116C58493d3892C04679J93630j24882J13515j46835L1530A26071c10582
10360B7508L33636j47861J40533r5986j01881a07993C94614b76177E15332O5736
10350E81068j36913O7940k39202M7744j50669K62776A84903J6721J94625A17006
10339C77120j12703A30920l6806d2230g2k50713J8013B5417A2574f015A92979
10327I2877J15988A00425J80914l66j29503g706C23289H3996B3613K31635A05119
10315e9086B94699D6508b50343d4769j65684g7968B177K41252D0241K27306f120
10303B67621H9192B8014b77965A43624c642E713J81406q1646k1108N2339j1911
$$ plain form
10383 150947 183060 400588 393599 194628 394991 -34110 -64537 132064 -15747 -83682 237443
10371 -126116 358493 -43892 304679 498309 373427 486942 340107 371637 126071 -310582
10360 27508 361144 213283 353816 257830 155949 -107993 394614 -276177 515332 581068
10350 581068 444155 512095 272893 320637 169968 432744 184903 201624 396249 117006
10339 377120 264417 130920 94114 -42230 -72 -250785 -232772 25417 12574 -6015 192979
10327 92877 208865 100425 281339 280973 151470 -7706 323289 83996 23613 255248 105119
10315 -59086 294699 46508 -250343 -44769 -210453 -77968 2177 243429 40241 267547 -6120
10303 267621 89192 28014 -277965 143624 -3642 5713 187119 105473 84365 136704 124793
10292A24793N671b07859F3606h2022a9111j56120j06368B04492A2480a41852c5930
10280a25857b3204L337k03035a10506B79354K9445c485H0658J92550K9322b43490
10268A28975K9884J07982F1769J19585j2850D2863J86144a99558B75253J82513
10258D57766A24176K29929A54803M4684Q9734e7407F569N0937k0781Q111e2416
10246A78617b3427q3234A6229R8818c28201A44326c8560j79142e8065D4919M6814
10235I1733P544g3278B51463c00449G1098k0193a43017R403F6894a44290p7480
10224b21770A89822e4428j95725e2941o2293B67458b43983A75191B4809a43136
10213h5787b9458A27922b27417E2476A8360a51622m7938f5915A09768a89986A57512
$$ plain form
10292 124793 130464 -207859 63606 -82022 -19111 -175231 -281599 204492 12480 -141852 -35930
10280 -125857 -23204 -19867 -222902 -110506 279354 308799 -3485 80658 273208 302530 -243490
10268 128975 158859 266841 61769 181354 168504 42863 229007 -199558 275253 457766
10258 457766 124176 354105 154803 199487 289221 -57407 6569 57506 36725 44836 -52416
10246 178617 -23427 -106661 16229 115047 -328201 144326 -38560 -217702 -58065 44919 91733
10235 91733 99277 -73278 251463 -300449 71098 50905 -143017 -133614 66894 -144290 -221770
10224 -221770 189822 -54428 -250153 -52941 -115234 267458 -243983 175191 24809 -143136
10213 -85787 -29458 127922 -227417 52476 18360 -151622 -199560 -65915 109768 -189986 157512
10201i5235k36332I0729b1652j19238d2487G9402e2926j19278n2610f2345E0731
10189b30747a5246k08546c6751k10826j45834N3009P6515L213A0050K93710C2032
10177a48987g1851j63582l450a01859j0543P951j62093B3996a35779n3393j59944
10166c49116I4746Q2343b11655M544B75558B4711b01819A4225a46217r3388b005
10154A02798f4338J9368j56790J00095m1832I6971J45265d71976D3871k82g0611
10142c9393j11697e120k50786A63858a90687n995P3406A96653a84975n2762I1640
10130a71147C58000c02409B67407n6431a22538E672i8326B01354a96316b6518
10119F9302Q616K08608B721b10325m0489C7060I365b06111g51q3791n4289c6936
$$ plain form
10201 -95235 -331567 90729 -21652 -140890 -42487 79402 -52926 -172204 -224814 -62345 50731
10189 -230747 -15246 -223792 -36751 -247577 -393411 -340402 -263887 -260674 10050 303760 32032
10177 -148987 -71851 -235433 -238883 -101859 -112402 -104451 -266544 23996 -135779 -189172 -349116
10166 -349116 94746 177089 -211655 -207111 275558 24711 -201819 14225 -146217 -239605 -2005
10154 102798 -64338 -44970 -201760 -101665 -143497 96971 242236 -471976 43871 43589 -70611
10142 -39393 -151090 -5120 -255906 163858 -190687 -196682 -123276 196653 -184975 -237737 91640
10130 -171147 358000 -302409 267407 210976 -122538 5672 -98326 201354 -196316 -26518
10119 69302 77918 286526 2721 -210325 -250814 37060 9365 -206111 -751 -84542 -138831 -36936
10106b50398M378D2438d9578E0038b43761m1255E7221c55971B35991a47585B88145
10094B957J76946p1655i6246j03970M9770J4662J4925N3082B15009c93623A42664
10082B31930g8165I7637b5259A17807a32779J963I2895L5158i3579j77104e9752
10070a30202j10k99892B15991a23737M0775j4354l6862B05723a90186B8646h1226
10058A57260c14747b8887j41448A74992C965c4904j71699I4155a64781A54479
10047a9372D56015E3758b04230e3626p6104I4671A5753a24320L6416j70176O9940
10036a88140j03274D8905O8891O2738a48509r2513J00522A95356l3183b22445
10025c47130R7165N2274A53110R0434j21418a09459j75047J30859i013j65010
$$ plain form
10106 -250398 -246020 42438 -49578 50038 -243761 -285016 57221 -355971 235991 -147585 288145
10094 2957 179903 108248 -96246 -200216 -150446 -135784 -120859 -67777 215009 -393623 142664
10082 231930 -78165 97637 -25259 117807 -132779 -130816 92895 128053 -93579 -270683 -59752
10070 -130202 -130312 -430204 215991 -123737 -82962 -97316 -134178 205723 -190186 28646 -81226
10058 157260 -314747 -28887 -170335 174992 3965 -34904 -206603 94155 -164781 154479
10047 -19372 456015 53758 -204230 -53626 -129730 94671 15753 -124320 -87904 -258080 -188140
10036 -188140 -291414 48905 117796 180534 -148509 -241022 -140500 195356 162173 -222445
10025 -347130 -249965 -197691 153110 243544 122126 -109459 -284506 -153647 -9013 -174023
10015a74023j99310K3124A21386b68889H6808L14173d70040A70434a85569B76616
10004C5904a79012H8938e5579m2231I6928J51024G2523b78196a33905p4185b9893
9992c78660b9745F2786a81540f7631A22583e4725k66259a10202A49145f9448l00885
9981c70333d5693k37380B40872j1820E5708a83697h9144B09655b18624F4253e2798
9969A22000a54314k38475J40618K1784e7301J1631l9881J5839n5831q2035N6325
9958a51253b781m23468A46448a22295A27577E658d7400o7704c306A37841m8121
9947H9720Q4069C0384a71976q0088k8324M8800R7065J2910j8113o8831A62477
9935A21194a99138h790k13579J5834j75772h1914a3812k35223j88637A40280D0763
$$ plain form
10015 -174023 -373333 -350209 121386 -268889 86808 400981 -470040 170434 -185569 276616
10004 35904 -179012 88938 -55579 -97810 96928 247952 72523 -278196 -133905 -208090 -29893
9992 -378660 -29745 62786 -181540 -67631 122583 -54725 -320984 -110202 149145 -69448 -370333
9981 -370333 -45693 -283073 240872 229052 55708 -183697 -89144 209655 -218624 64253 -52798
9969 122000 -154314 -392789 -252171 -230387 -57301 -45670 -85551 -69712 -125543 -207578 -151253
9958 -151253 -2781 -426249 146448 -122295 127577 5658 -47400 -115104 -3306 137841 89720
9947 89720 173789 30384 -171976 -252064 -280388 -231588 -134523 -121613 -139726 -208557 162477
9935 121194 -199138 -8790 -222369 -206535 -382307 -81914 -13812 -249035 -437672 140280 40763
9923c25125M4611A31651b41615K7567G878b2159B52355I2326a27431j66089B05536
9911g235B19786e8887A03062b43966j41308l2463P7350P4061j59914I1288b0716
9899F1926g0475a0489B2561J588e2846A55665m340c4924p8884d2901k35269C6301
9886g4464K7201b2817l34954N5894i1782j00664f6198A55590b69244f4056A82504
9874c61495h3487j95179r3878E8654J51417F5882d4756p2515A1056K81653a22431
9862I5385O10c61902a29612D9136b96762h217q6138j22182j37641A65847F3800
9850E9611N2499d31565J05311d4358A33935a13448A19976b00232h3713j90197
9840b73910h6949G2400J46877d3564n6186J4772p371l16393a26722d3065n5273
$$ plain form
9923 -325125 -280514 131651 -241615 -214048 7878 -22159 252355 92326 -127431 -293520 205536
9911 -7235 219786 -58887 103062 -243966 -385274 -417737 -340387 -266326 -426240 91288 -20716
9899 61926 -70475 -10489 22561 24149 -52846 155665 151325 -34924 -113808 -42901 -278170 36301
9886 -74464 -47263 -22817 -357771 -301877 -91782 -192446 -66198 155590 -269244 -64056 182504
9874 -361495 -83487 -278666 -372544 58654 210071 65882 -44756 -117271 11056 292709 -122431
9862 95385 95995 -361902 -129612 49136 -296762 -8217 -94355 -216537 -354178 165847 63800
9850 59611 112110 -431565 -326254 -44358 133935 -113448 119976 -200232 -83713 -273910
9840 -273910 -86949 72400 219277 -43564 -99750 -84978 -92349 -408742 -126722 -43065 -98338
9829i8338B9523a1441B99883b99818A20590l9435C8821A0523a19977c8755I6737
9817c6056o856G6608e8415K2521B06472c7271j53130A70223b14765C9916K4795
9806F4711c21568k7226a68861k7464L9325j62016B20929c668A13899i3471Q456
9795h5015D7957L9933b04689j38319N9744A3191b68150e8264K2419k62936a8243
9783c14247a53223p9704F638a40597j3513e6785B20538C1206g3757j92944a24492
9771d15607c4227o1233j10467A25881a11212M5727n6357E6773a91211B9037a74848
9759A7453d43800e0529l12584A36284k3096a97268F4035J4484a23305L9859c097
9747d16037C538J32213m4547a72102j35057H9638b29071P3508o2173m4700A22084
$$ plain form
9829 -98338 29523 -11441 299883 -299818 120590 81155 38821 10523 -119977 -38755 96737
9817 -36056 -42912 76608 -58415 -35894 206472 -37271 -190401 170223 -214765 39916 64711
9806 64711 -321568 -348794 -168861 -196325 -157000 -319016 220929 -3668 113899 -93471 -85015
9795 -85015 47957 87890 -204689 -343008 -283264 13191 -268150 -58264 -35845 -298781 -18243
9783 -314247 -153223 -232927 6638 -140597 -154110 -56785 220538 31206 -73757 -266701 -124492
9771 -415607 -34227 -95460 -205927 125881 -111212 -65485 -121842 56773 -191211 29037 -174848
9759 17453 -443800 -50529 -363113 136284 113188 -197268 64035 78519 -123305 -83446 -3097
9747 -416037 3538 135751 91204 -172102 -307159 89638 -229071 -155563 -217736 -262436 122084
9735d07744a08997D26021k10215a19149E1967i4995l54A20648c28677b9599A39067
9723E9001B0249f1385l48299A50225J77387b59560g0603E0512b98738g158m3564
9712e0722I5623b22651D8457b02862A37693F172b25859h7875Q532n5418n4271
9701a89032b0388B09216B4961K73722B6266a56404A64712g6163r2371A00260c12265
9689H1581a34059L0623L1952k47868k7622R2734i1241K9205j61271j40742B7951
9677a41135j38058R4154h4229j3442A18252c43835C6302b35243I1044K38165a87124
9665e2610B96223A24930k675A9070b99937P7782L5521j8297I4932l3386K4458
9654H6004a77178C16054c69495C5463b30102h8766J3167b30p035A10605g1695
$$ plain form
9735 -407744 -108997 426021 215806 -119149 51967 -94995 -95349 120648 -328677 -29599 139067
9723 59001 20249 -61385 -409684 150225 327612 -259560 -70603 50512 -298738 -7158 -50722
9712 -50722 95623 -222651 48457 -202862 137693 6172 -225859 -87875 -79343 -134761 -189032
9701 -189032 -20388 209216 24961 298683 26266 -156404 164712 -76163 -168534 100260 -312265
9689 81581 -134059 -103436 -71484 -319352 -346974 -254240 -91241 -62036 -223307 -364049 27951
9677 -141135 -279193 -185039 -84229 -97671 118252 -343835 36302 -235243 91044 329209 -187124
9665 -52610 296223 124930 122255 19070 -299937 -222155 -186634 -204931 94932 61546 86004
9654 86004 -177178 316054 -369495 35463 -230102 -88766 -75599 -230 -7265 110605 -71695
9642g0423k22056A52071f24345B34249N991b64035r7380A38326A3368c8699A37954
9630c4259k6255E2226b35743h3521G0346c5277j49614M8728f0236E3915a13290
9618c13477c8103C56577l6637b73153B14623D9641e0308A2184f5184k68522J46287
9607a87419A57544d3432I2624B7840i7964A63782e1969j03429N6929m3463E9559
9595g7021j75847D2424a81433D1899b37455j3001j84655E6728g8414E871h6596
9583H9584b40785d7268r9131B8071N2028K33278a90525j04976a21463A8091b99937
9571A3831a16733k93103C70548a9770D8779Q0808N620A781c75980A42207J77651
9560C19858C9312c12408b9468j27260n3343E8421c1394G3412a60372F9260a84437
$$ plain form
9642 -70423 -292479 152071 -624345 234249 240240 -264035 -361415 138326 13368 -38699 137954
9630 -34259 -60514 52226 -235743 -83521 70346 -35277 -184891 -136163 -60236 53915 -113290
9618 -313477 -38103 356577 319940 -273153 214623 49641 -50308 12184 -65184 -333706 -187419
9607 -187419 157544 -43432 92624 27840 -97964 163782 -51969 -155398 -98469 -141932 59559
9595 -77021 -252868 42424 -181433 41899 -237455 -250456 -435111 56728 -78414 5871 -86596
9583 89584 -240785 -47268 -146399 28071 80099 313377 -190525 -295501 -121463 18091 -299937
9571 13831 -116733 -409836 370548 -19770 48779 129587 135207 1781 -375980 142207 319858
9560 319858 39312 -312408 -29468 -156728 -210071 58421 -31394 73412 -160372 69260 -184437
9548a36937e5170k32753m8868e5185b5237j40527A4785J04661c49653A8430e7109
9536C0460K9943a3857A63627i419m45674B6144c6973D7206b33656A21779d31663
9524d9134j39296C4780J23632a49553B35973a01321k74153A0742J17987a5033
9513A88894i2965l70765i9113A02444d268B48405R0586B1356L0279d4999r5082
9502a40081j36226P1799r3496f2395b8750H6081i8633c8815k62310O8927C5260
9490D3994a97288g5290j02015F7901d23r8357G1737C1311b62476R7281K6088j63171
9478c02278f2241b3461j7696j67081n9673E7337Q1357g8898A72978K8429C7957
9466d63322D19559A51760D9554a24946N322k14802E5989K49863d32822H3574N2558
$$ plain form
9548 -136937 -55170 -287923 -336791 -55185 -25237 -165764 14785 119446 -349653 18430 -57109
9536 30460 60403 -13857 163627 -9419 -455093 26144 -36973 47206 -233656 121779 -431663
9524 -49134 -188430 34780 158412 -149553 235973 -101321 -375474 10742 128729 -15033
9513 188894 -92965 -463730 -99113 102444 -4268 248405 338991 21356 51635 -44999 -140081
9502 -140081 -276307 -204508 -298004 -62395 -28750 86081 -98633 -38815 -301125 -232198 35260
9490 43994 -197288 -75290 -177305 67901 -423 -98780 71737 31311 -262476 -165195 -139107 -302278
9478 -302278 -62241 -23461 -41157 -208238 -267911 57337 138694 -78898 172978 201407 37957
9466 -463322 419559 151760 49554 -124946 -119624 -334426 55989 305852 -432822 83574 136132
9455A36132e1022A55055p1677a28725l4400L6189A70582c989A68597c15991B4827
9443A68746b89938g5613C0603b36061B59484A14065a20949I5454b37458H664g8858
9431B18599g1993l5157L4593i250B8596J88078I67M5793J75551f423D9789K9332
9419G9121g9881j91558a2950A673K6478D71a22974j55914h1291b272k80689I4407
9406c07048i6913j79285A12212j1447c0543l36247C5524a53355c2507A43170c7197
9394a59130a4080A23762a73446J5081j45473A9427N361c15959A73175b05512i4610
9382A32141C545a13009A42891A3588a57514A05196g3196B6531b4644j28257K1037
9371a31864N3775j65122J15770o0622A23065b24404A02973k1905B8525K29512
$$ plain form
9455 136132 -51022 155055 83378 -128725 -163125 -126936 170582 -3989 168597 -315991 24827
9443 168746 -289938 -75613 30603 -236061 259484 114065 -120949 95454 -237458 8664 -78858
9431 218599 -71993 -107150 -72557 -9250 28596 216674 967 46760 222311 -6423 49789 79121
9419 79121 -79881 -271439 -12950 1673 28151 471 -122974 -278888 -81291 -2272 -282961 94407
9406 -307048 -96913 -276198 112212 100765 -30543 -366790 35524 -153355 -32507 143170 -37197
9394 -159130 -14080 123762 -173446 -158365 -303838 19427 24788 -315959 173175 -205512 -94610
9382 132141 3545 -113009 142891 13588 -157514 105196 -73196 26531 -24644 -152901 -131864
9371 -131864 -78089 -243211 -127441 -188063 123065 -224404 102973 81068 28525 258037
9361B58037e8879F482a6628C160b8805I2231k8557K6279a03184k64297k6470A07050
9348d05308J12610B18466D7598j8302a65112o0697Q0364E6661b04985o4263a09654
9336b151p8786C72071A1651b8798l69169h9455b0895o5053A88141a18679I5571
9324b65600b9581r1173M71j30752j1121j46614a0873j12741B08594b88038a40478
9312a01193K9252A74583a27773R734l02178a05666E1279a44264j39088N4141B8123
9300A54633E5122b28332M9200m09675D2854a47824O6026l6175j58887Q1733e8966
9288G5135b53093a15149k08779H7572J93929b70025c4345k64305N0318H3886a78521
9276G3088c09995a25379A60626c4874C5491d844k22769h2598j4B789b13525B9605
$$ plain form
9361 258037 -58879 6482 -16628 3160 -28805 92231 63674 89953 -103184 -367481 -393951 107050
9348 -405308 -292698 218466 47598 29296 -165112 -225809 -145445 56661 -204985 -269248 -109654
9336 -2151 -80937 372071 11651 -28798 -397967 -89455 -20895 -85948 188141 -118679 95571
9324 -265600 -29581 -120754 -120283 -251035 -262156 -408770 -10873 -123614 208594 -288038 -140478
9312 -101193 -71941 174583 -127773 -118039 -420217 -105666 51279 -144264 -283352 -229211 28123
9300 154633 55122 -228332 -179132 -588807 42854 -147824 -81798 -117973 -276860 -195127 -58966
9288 75135 -253093 -115149 -323928 87572 281501 -270025 -34345 -298650 -248332 83886 -178521
9276 73088 -309995 -125379 160626 -34874 35491 -4844 -227613 -82598 -82612 2789 -213525 29605
9263B7304c81348a58452A5341c0212A62601E3075g5020l2015j4620A4828m912
9252I916N0550d5427G7061c89701F136J3439j910a31686A65324c87218A85700
9240a12714j89086G242b03179i4473j46559e9618D3010P2943K0641b60011M453
9229b55558A26075h9113k2334j67795a34800e5268m648D4710J95106a67180A72519
9217G3320J22384a75412n0104Q8010A30833l1314a14140H308b09002p2091a24665
9205a60154Q0045k20948a16225A94093i2916d4431n1778c6468j24307o125B73191
9193a12307q5433j94475g3777O011l90693J00216b1665j5894j26239A69132b45311
9181b82540N3763f3075o5087r6841j43927A0998b3604o9506c0389A69055i7013
$$ plain form
9263 27304 -381348 -158452 15341 -30212 162601 53075 -75020 -107035 -121655 14828 9916
9252 9916 60466 -45427 77061 -389701 6136 19575 17665 -131686 165324 -387218 185700
9240 -112714 -301800 7242 -203179 -94473 -241032 -59618 43010 115953 136594 -260011 -255558
9229 -255558 126075 -89113 -111447 -279242 -134800 -55268 -59916 44710 239816 -167180 172519
9217 73320 195704 -175412 -225516 -137506 130833 99519 -114140 8308 -209002 -281093 -124665
9205 -160154 -80109 -301057 -116225 194093 -92916 -44431 -96209 -36468 -160775 -166900 273191
9193 -112307 -197740 -392215 -73777 -67766 -458459 -358243 -21665 -37559 -163798 169132 -245311
9181 -282540 -228777 -63075 -128162 -225003 -368930 10998 -23604 -93110 -30389 169055 -97013
9169b18789B4380d8429C51972D8458b10480M3825A01159b878m194p9170D5093
9157B1011b00440c9003j7018j21011Q1249a6582r305l0268j35696K3427e5954
9145a1060B8651d26227Q1685a7758B696b21962d3330A05976N0395P3106j03345
9134A26132a64724K7327D6010a8937j42237e4551C394a4889m8414F1888e1309
9122A51944B2826e91l85k62452B55207p7945a33913D7134b12000B59388b40043
9110b93860A95316A7437a11521G2448f3145K8989D61077b47463f1417B01469b66635
9098c3787G4703l4534a89865A96663m1249O3437q1200l9180G516b78732a00297
9086E6783f2829A8030a86116g6111k1423K0904A69693C5021a71052L5243F1590
$$ plain form
9169 -218789 24380 -48429 351972 48458 -210480 -166655 101159 -2878 -7072 -86242 45093
9157 21011 -200440 -39003 -56021 -177032 -95783 -16582 -25887 -56155 -191851 -168424 -55954
9145 -11060 28651 -426227 -344542 -17758 2696 -221962 -43330 105976 156371 229477 126132
9134 126132 -164724 -137397 46010 -18937 -161174 -54551 3394 -14889 -63303 61888 -51309
9122 151944 22826 -591 -976 -263428 255207 177262 -133913 47134 -212000 259388 -240043
9110 -293860 195316 17437 -111521 72448 -63145 -34156 461077 -247463 -61417 201469 -266635
9098 -33787 74703 40169 -189865 196663 155414 218851 137651 98471 7516 -278732 -100297
9086 56783 -62829 18030 -186116 -76111 -97534 -76630 169693 35021 -171052 -135809 61590
9074a07306j13139a04311l17867B21527c9708p9966B91584H4676J02681e5158
9063A49764N7806c68122A88680a70200j58542E3196f9292C11777a83864p4417
9053b58281B24325a60938o5184E6656J5049K460B7937a33284A96075b05811i3816
9041c6539m2225A71795a77685O4374N2986l88143c3745A89811b7842p7475a5262
9029b23454N1998d565j37849d9149j3531J244J5765A36988a94448r8367f74n4440
9017e5114K0146k96511F6257d5222B05609b17110j59051D2658a40298j3754l51256
9006e05308A39350b30333A12304i3679B46175a15838l4675A54153c02691A21689
8995A3182b48314I2299h9165l63533i6125L9585E9705b09355L403B1367b22590
$$ plain form
9074 -107306 -220445 -104311 -422178 221527 -39708 -119674 291584 84676 187357 -55158
9063 149764 207570 -368122 188680 -170200 -328742 53196 -69292 311777 -183864 -258281
9053 -258281 224325 -160938 -226122 56656 71705 74165 27937 -133284 196075 -205811 -93816
9041 -36539 -78764 171795 -177685 -113311 -60325 -448468 -33745 189811 -27842 -105317 -15262
9029 -223454 -171456 -4565 -142414 -49149 -62680 -61436 -45671 136988 -194448 -292815 -674 -55114
9017 -55114 -34968 -331479 66257 -45222 205609 -217110 -376161 42658 -140298 -154052 -505308
9006 -505308 139350 -230333 112304 -93679 246175 -115838 -150513 154153 -302691 121689
8995 13182 -248314 92299 -89165 -452698 -96125 -56540 59705 -209355 -205952 21367 -222590
8983b21649J06558k22085H9356e8827m42773b18921L3227I7018A2095b02352B3754
8971d5992a7336j31049D1681g1595G5025K1047a46896K3044A31090a27915D23931
8959h7050f965m13524e4588M712j56299c2381j5073B56132H6698b81041a6656
8947A46809B3580e01839b3139j24335C03120b55542E9124d4215i091A35639k0008
8936A15631k0226J97025c6959B63314m9901K98977B607b28061A85647a71936B08836
8924E23884J319099L112379N691749j964285B847003H37955k80566K9475k70714
8915C16150g1079j44247G9304c33644g4664o6223A12697K98098a30197E4711R0450
8904A45161a49400B3971N4353a6840b390A0241c8006B60422l7364g6833n6884
$$ plain form
8983 -221649 -115091 -337176 89356 -58827 -501600 -218921 -185694 97018 12095 -202352 23754
8971 -45992 -17336 -148385 41681 -71595 75025 96072 -146896 -123852 131090 -127915 423931
8959 -87050 -6965 -420489 -54588 -49876 -206175 -32381 -47454 256132 86698 -281041 -16656
8947 146809 23580 -501839 -23139 -147474 303120 -255542 59124 -44215 -9091 135639 115631
8936 115631 95405 292430 -36959 263314 213413 512390 2607 -228061 185647 -171936 208836
8924 523884 1842983 4955362 10647111 8682826 2847003 837955 557389 586864 316150
8915 316150 -71079 -215326 79304 -333644 -74664 -140887 112697 410795 -130197 54711 145161
8904 145161 -149400 23971 78324 -16840 -2390 10241 -38006 260422 223058 -76833 -133717
8893a33717d1330I3037N8198A5972c45840A19350a65319F0342d7620j7242K7871
8882c6991F903b55728A57825E58d12591a09582q8857A93521A6002L32077B308
8870f7696D68412a24044N0243n1509A38179a06410F048K00785G5199h233B70133
8858b10188B54993a4446q4245r8764O5719F7481b16197A05076J52351h2445G7434
8846D0915b09716I6035c58184c1358A15912b30935r2120c6359l6799l34518A1368
$$ plain form
8893 -133717 -41330 93037 151235 15972 -345840 119350 -165319 60342 -47620 -64862 -36991
8882 -36991 6903 -255728 157825 558 -412591 -109582 -198439 193521 16002 348079 2308
8870 -67696 468412 -124044 -73801 -125310 138179 -106410 6048 206833 75199 -8233 270133
8858 -210188 254993 -14446 -98691 -197455 -131736 67481 -216197 105076 257427 -82445 77434
8846 40915 -209716 96035 -358184 -31358 115912 -230935 -323055 -36359 -73158 -407676 11368
$$ [...]
##END NTUPLES=NMR SPECTRUM
##END=
