##TITLE=AC1592_HPIAH13322_8314191_3PV7P7SrwD
##JCAMPDX= 6.0         $$ Bruker NMR JCAMP-DX V2.0
##DATA TYPE= NMR SPECTRUM
##DATA CLASS= NTUPLES
##ORIGIN= BRUKER
##OWNER= Administrator
$$ 1.72 TOPSPIN		Version 2.1
$$ 2013-11-09 20:36:42.514 -0800  Administrator@X
$$ Compression mode = diff/dup
##.OBSERVE FREQUENCY= 400.02188249412
##.OBSERVE NUCLEUS= ^1H
##.ACQUISITION MODE= SIMULTANEOUS (DQD)
##.ACQUISITION SCHEME= undefined
##.AVERAGES= 64
##.DIGITISER RES= 22
##SPECTROMETER/DATA SYSTEM= spect
##.PULSE SEQUENCE= noesygpps1d.comp
##.SOLVENT NAME= COFFEE_meoh
##.SHIFT REFERENCE= INTERNAL, COFFEE_meoh, 1, 14.96081
##AUDIT TRAIL= $$ (NUMBER, WHEN, WHO, WHERE, PROCESS, VERSION, WHAT)
$$ ##TITLE= Audit trail, TOPSPIN		Version 2.1
$$ ##JCAMPDX= 5.01
$$ ##ORIGIN= Bruker BioSpin GmbH
$$ ##OWNER= Administrator
$$ $$ E:\/data/COFFEE/nmr/AC1592_HPIAH13322_8314191_3PV7P7SrwD/22/pdata/1/auditp.txt
$$ ##AUDIT TRAIL=  $$ (NUMBER, WHEN, WHO, WHERE, PROCESS, VERSION, WHAT)
(   1,<2013-11-09 20:36:37.283 -0800>,<Administrator>,<X>,<go>,<TOPSPIN 2.1>,
      <created by zg
	started at 2013-11-09 20:25:06.524 -0800,
	POWCHK enabled, PULCHK disabled,
       configuration hash MD5:
       C8 4E 4E 5D D3 5C D8 9E 9F 52 82 E0 59 8A DE 15
       data hash MD5: 64K
       61 3F 6A F4 60 9A 22 66 D1 41 EB 48 18 E6 5B B1>)
(   2,<2013-11-09 20:36:40.240 -0800>,<Administrator>,<X>,<proc1d>,<TOPSPIN 2.1>,
      <Start of raw data processing
       efp LB = 0.3 FT_mod = 6 PKNL = 1 PHC0 = 0 PHC1 = 0 SI = 128K 
       data hash MD5: 128K
       89 21 F4 2D 58 F9 28 5A 28 14 07 18 26 3F 8C CD>)
(   3,<2013-11-09 20:36:41.361 -0800>,<Administrator>,<X>,<proc1d>,<TOPSPIN 2.1>,
      <pk PHC0 = -85.64392 PHC1 = 0 
       data hash MD5: 128K
       EC D0 A1 33 F4 D1 A6 49 F0 CF 88 3C 32 F5 13 81>)
(   4,<2013-11-09 20:36:41.801 -0800>,<Administrator>,<X>,<proc1d>,<TOPSPIN 2.1>,
      <abs ABSG = 1 
       data hash MD5: 128K
       EE FD FC 00 D2 8A A5 7B BD 05 A4 77 ED AB B9 A3>)
(   5,<2013-11-09 20:36:42.074 -0800>,<Administrator>,<X>,<proc1d>,<TOPSPIN 2.1>,
      <abs ABSG = 2 
       data hash MD5: 128K
       C3 A3 B2 81 04 B5 47 EB B8 03 4B 8C 29 29 FE 42>)
(   6,<2013-11-09 20:36:42.165 -0800>,<Administrator>,<X>,<proc1d>,<TOPSPIN 2.1>,
      <abs ABSG = 3 
       data hash MD5: 128K
       72 18 9A 3F 6C 76 DD A3 C9 64 70 A1 67 2F 3A 68>)
(   7,<2013-11-09 20:36:42.241 -0800>,<Administrator>,<X>,<proc1d>,<TOPSPIN 2.1>,
      <abs ABSG = 4 
       data hash MD5: 128K
       E5 8B 2C AA D8 A6 21 3C B1 0B A6 B3 40 2F 11 14>)
(   8,<2013-11-09 20:36:42.317 -0800>,<Administrator>,<X>,<proc1d>,<TOPSPIN 2.1>,
      <abs ABSG = 5 
       data hash MD5: 128K
       38 3D 38 5A 94 BD 50 C6 97 AF 1A C4 E7 A8 7A 46>)
$$ ##END=
$$ 
$$ $$ hash MD5
$$ $$ 35 5E DE 31 47 24 98 CE 58 0B 14 DC 5F FF A0 6E
##$RELAX= 
##$RELAX= 
##$RELAX= 
##$RELAX= 
##$RELAX= 
##$RELAX= 
##$RELAX= 
##$RELAX= 
$$ Bruker specific parameters
$$ --------------------------
##$DU= <E:\>
##$EXPNO= 22
$$ [...]
150 150 150 150 150 150 150 150
##$TP07= 0
##$TPNAME0= <>
##$TPNAME1= <>
##$TPNAME2= <>
##$TPNAME3= <>
##$TPNAME4= <>
##$TPNAME5= <>
##$TPNAME6= <>
##$TPNAME7= <>
##$TPOAL= (0..7)
0.5 0.5 0.5 0.5 0.5 0.5 0.5 0.5
##$TPOFFS= (0..7)
0 0 0 0 0 0 0 0
##$TUNHIN= 0
##$TUNHOUT= 0
##$TUNXOUT= 0
##$USERA1= <user>
##$USERA2= <user>
##$USERA3= <user>
##$USERA4= <user>
##$USERA5= <user>
##$V9= 5
##$VALIST= <valist>
##$VCLIST= <CCCCCCCCCCCCCCC>
##$VD= 0
##$VDLIST= <DDDDDDDDDDDDDDD>
##$VPLIST= <PPPPPPPPPPPPPPP>
##$VTLIST= <TTTTTTTTTTTTTTT>
##$WBST= 1024
##$WBSW= 4
##$XGAIN= (0..3)
0 0 0 0
##$XL= 0
##$YL= 0
##$YMAX_a= 5816742
##$YMIN_a= -11936874
##$ZGOPTNS= <>
##$ZL1= 120
##$ZL2= 120
##$ZL3= 120
##$ZL4= 120
##$ABSF1= 14.96081
##$ABSF2= -5.597372
##$ABSG= 5
##$ABSL= 3
##$ALPHA= 0
##$AQORDER= 0
##$ASSFAC= 0
##$ASSFACI= 0
##$ASSFACX= 0
##$ASSWID= 0
##$AUNMP= <proc_prof1d_extract.lims>
##$AXLEFT= 0
##$AXNAME= <>
##$AXNUC= <1H>
##$AXRIGHT= 0
##$AXTYPE= 0
##$AXUNIT= <>
##$AZFE= 0.1
##$AZFW= 0.1
##$BCFW= 0
##$BC_mod= 0
##$BYTORDP= 0
##$COROFFS= 0
##$CY= 15
##$DATMOD= 1
##$DC= 0
##$DFILT= <>
##$DTYPP= 0
##$F1P= 0
##$F2P= 0
##$FCOR= 0.5
##$FTSIZE= 131072
##$FT_mod= 6
##$GAMMA= 0
##$GB= 0
##$INTBC= 1
##$INTSCL= 1
##$ISEN= 128
##$LB= 0.3
##$LEV0= 0
##$LPBIN= 0
##$MAXI= 10000
##$MC2= 0
##$MEAN= 0
##$ME_mod= 0
##$MI= 0
##$NCOEF= 0
##$NC_proc= -2
##$NLEV= 6
##$NOISF1= 0
##$NOISF2= 0
##$NSP= 0
##$NTH_PI= 0
##$NZP= 0
##$OFFSET= 14.96081
##$PC= 1
##$PHC0= -85.64392
##$PHC1= 0
##$PH_mod= 1
##$PKNL= yes
##$PPARMOD= 0
##$PPDIAG= 0
##$PPIPTYP= 0
##$PPMPNUM= 2147483647
##$PPRESOL= 1
##$PSCAL= 4
##$PSIGN= 0
##$PYNMP= <proc.py>
##$REVERSE= no
##$SF= 400.02000971124
##$SI= 131072
##$SIGF1= 0
##$SIGF2= 0
##$SINO= 400
##$SIOLD= 131072
##$SPECTYP= <>
##$SREGLST= <1H.CDCl3>
##$SSB= 0
##$STSI= 131072
##$STSR= 0
##$SW_p= 8223.68421052631
##$SYMM= 0
##$S_DEV= 0
##$TDeff= 65536
##$TDoff= 0
##$TI= <>
##$TILT= no
##$TM1= 0
##$TM2= 0
##$TOPLEV= 0
##$USERP1= <user>
##$USERP2= <user>
##$USERP3= <user>
##$USERP4= <user>
##$USERP5= <user>
##$WDW= 1
##$XDIM= 131072
##$YMAX_p= 365653031
##$YMIN_p= -11122
##$CURPLOT= <Network HP LaserJet P1505>
##$CURPRIN= <$Network HP LaserJet P1505>
##$DFORMAT= <normdp>
##$LAYOUT= <+/1D_H.xwp>
##$LFORMAT= <normlp>
##$PFORMAT= <normpl>
##$SURQMSG= 1
$$ End of Bruker specific parameters
$$ ---------------------------------
##NTUPLES= NMR SPECTRUM
##VAR_NAME=  FREQUENCY,     SPECTRUM/REAL,   SPECTRUM/IMAG
##SYMBOL=    X,             R,               I
##VAR_TYPE=  INDEPENDENT,   DEPENDENT,       DEPENDENT
##VAR_FORM=  AFFN,          ASDF,            ASDF
##VAR_DIM=   131072,        131072,          131072
##UNITS=     HZ,            ARBITRARY UNITS, ARBITRARY UNITS
##FACTOR=    0.0627417313425164, 1,          1
##FIRST=     8223.62146879497, -2084,        -60789
##LAST=      0,             283,             -61362
##MIN=       0,             -11122,          0
##MAX=       8223.62146879497, 365653031,    0
$$ Real data points
##PAGE= N=1
##DATA TABLE= (X++(R..R)), XYDATA
$$ [...]
$$ plain form
61692 419463 418305 417082 414877 412259 410452 409537 408230 405517 401821 398228 395122 392116 389037 386312
61678 386312 384278 382619 380781 378679 376658 374895 373253 371745 370737 370456 370598 370732 370899 371414 372213 372815
61662 372815 372974 372967 373121 373408 373721 374206 375049 376155 377316 378520 379804 380973 381800 382414 383209 384389 385849
61645 385849 387462 389166 390793 392099 393072 393988 395038 396050 396645 396541 395727 394510 393454 393052 393294 393663
61629 393663 393649 393207 392617 391978 390990 389304 387051 384917 383520 382673 381462 379233 376349 373741 371819 370197
61613 370197 368489 366955 366049 365566 364628 362586 359700 356750 354061 351085 347136 342446 338191 335321 333554
61598 333554 331811 329446 326718 324134 321880 319976 318538 317559 316714 315683 314484 313244 311867 310214 308513
61583 308513 307258 306746 306860 307186 307184 306374 304666 302466 300334 298650 297731 297917 299095 300345 300662 300075 299623
$$ packed form
61692D19463j158j223k205k618j807r15j307k713l696l593l106l006l079k725
61678C86312k034j659j838k102k021j763j642j508j008k81J42J34J67N15P99O02
61662C72815J59pJ54K87L13M85Q43J106J161J204J284J169Q27O14P95J180J460
61645C85849J613J704J627J306R73R16J050J012N95j04q14j217j056m02K42L69
61629C93663j4m42n90o39r88j686k253k134j397q47j211k229k884k608j922j622
61613C70197j708j534r06m83r38k042k886k950k689k976l949m690m255k870j767
61598C33554j743k365k728k584k254j904j438r79q45j031j199j240j377j653j701
61583C08513j255n12J14L26kq10j708k200k132j684r19J86J178J250L17n87m52
$$ plain form
61566 299623 300114 301319 302577 303716 305033 306580 307884 308402 308120 307717 308086 309526 311394 312716 313143 313034
61550 313034 312752 312352 312103 312673 314388 316646 318604 320165 321850 323797 325434 326124 325712 324426 322717 321298
61534 321298 320915 321738 323139 324243 324548 324026 322932 321700 320860 320785 321495 322677 323827 324432 324312 323794 323331
61517 323331 322852 321764 319725 317176 314975 313680 313359 313755 314421 314902 315099 315386 316113 317138 318062 318697 319016
61500 319016 318786 317769 316278 315091 314612 314470 314147 313685 313476 313543 313425 312796 311970 311692 312522 314433 316882
61483 316882 319202 320945 322015 322640 323304 324565 326723 329630 332872 336096 338999 341177 342307 342588 342657
61468 342657 342909 343183 343296 343558 344352 345407 346026 345985 345760 345734 345658 345158 344408 343886 343698 343497 343018 342306 341454
61449 341454 340480 339599 339276 339797 340937 342208 343325 344262 344967 345310 345329 345331 345576 345975 346221 346240 346338 346811 347547
$$ packed form
61566B99623M91J205J258J139J317J547J304N18k82m03L69J440J868J322M27j09
61550C13034k82m00k49N70J715K258J958J561J685J947J637O90m12j286j709j419
61534C21298l83Q23J401J104L05n22j094j232q40p5P10J182J150O05j20n18m63
61517C23331m79j088k039k549k201j295l21L96O66M81J97K87P27J025R24O35L19
61500C19016k30j017j491j187m79j42l23m62k09O7j18o29q26k78Q30J911K449
61483C16882K320J743J070O25O64J261K158K907L242L224K903K178J130K81O9
61468C42657K52K74J13K62P94J055O19m1k25k6p6n00p50n22j88k01m79p12q52
61449C41454r74q81l23N21J140J271J117R37P05L43J9KK45L99K46J9R8M73P36
$$ plain form
61430 347547 348257 349010 350234 351990 353570 354209 354073 354130 355011 356392 357625 358558 359410 360213 360853 361532 362701
61413 362701 364478 366444 368111 369284 369947 370091 369842 369489 369173 368717 367930 366911 365860 364751 363435 361978
61397 361978 360673 359748 359204 358860 358377 357401 355997 354943 355218 357021 359516 361688 363237 364494 365710 366798
61381 366798 367721 368790 370415 372706 375394 377989 380033 381403 382505 383989 386088 388338 390156 391516
61367 391516 392839 394297 395611 396640 397801 399682 402411 405649 409012 412253 415152 417582 419739 422035
61353 422035 424666 427457 430180 432870 435766 439100 442984 447345 451850 455989 459368 461934 464002 466121
61339 466121 468716 471570 473739 474418 473944 473575 474106 475099 475691 475706 475557 475388 474890 473905 472701 471656 471052
61322 471052 471156 472059 473401 474740 476314 478956 483044 487985 493122 498753 505766 514363 523681 532765 541691
$$ packed form
61430C47547P10P53J224J756J580O39j36N7Q81J381J233R33Q52Q03O40O79J169
61413C62701J777J966J667J173O63J44k49l53l16m56p87j019j051j109j316j457
61397C61978j305r25n44l44m83r76j404j054K75J803K495K172J549J257J216J088
61381C66798R23J069J625K291K688K595K044J370J102J484K099K250J818J360
61367C91516J323J458J314J029J161J881K729L238L363L241K899K430K157K296
61353D22035K631K791K723K690K896L334L884M361M505M139L379K566K068K119
61339D66121K595K854K169O79m74l69N31R93N92J5j49j69m98r85j204j045o04
61322D71052J04R03J342J339J574K642M088M941N137N631P013Q597R318R084Q926
$$ plain form
61307 541691 551544 563374 577203 591997 606578 620486 633887 646784 658624 668689 676532 681907
61295 681907 684687 685146 683964 681621 677972 672813 666587 659989 652944 644624 634657 623844 613436 604048
61281 604048 595567 587748 580513 573841 567757 562416 557988 554441 551644 549579 548224 547273 546240 544960
61267 544960 543799 543281 543606 544650 546260 548323 550535 552447 554049 556166 559886 565340 571272 576066 579091
61252 579091 580815 581861 582441 582746 583254 584283 585496 586246 586283 585912 585644 585922 587005 588701 590320 591268 591668
61235 591668 592088 592746 593395 593997 594984 596639 598672 600793 603427 607439 613240 620477 628540 637106 646139
61220 646139 655625 665346 674828 683623 691827 700249 709728 720204 730660 740037 748023 754917 761081 766756
61206 766756 772237 777797 783377 788631 793480 798471 804384 811461 819202 826991 834756 842905 851761 861291
$$ packed form
61307E41691R853J1830J3829J4794J4581J3908J3401J2897J1840J0065P843N375
61295F81907K780M59j182k343l649n159o226o598p045q320r967j0813j0408r388
61281F04048q481p819p235o672o084n341m428l547k797k065j355r51j033j280
61267E44960j161n18L25J044J610K063K212J912J602K117L720N454N932M794L025
61252E79091J724J046N80L05N08J029J213P50L7l71k68K78J083J696J619R48M00
61235E91668M20O58O49O02R87J655K033K121K634M012N801P237Q063Q566R033
61220F46139R486R721R482Q795Q204Q422R479J0476J0456R377P986O894O164N675
61206G66756N481N560N580N254M849M991N913P077P741P789P765Q149Q856R530
$$ plain form
61192 861291 871335 881761 892276 902280 911070 918149 923247 926274 927418 927128 925794 923510 920302
61179 920302 916440 912237 907631 902234 895772 888232 879662 870199 860301 850538 840955 831002 820297 809164
61165 809164 798133 787186 775866 764002 751968 740284 729207 718658 708281 697658 686793
61154 686793 676359 667178 659480 652934 647372 643031 639929 637437 634806 631937 629275 627069 624982 622464
61140 622464 619368 616154 613493 611557 609650 606825 603073 599735 598462 599824 603160 607593 612831 619014
61126 619014 626316 634915 645062 656855 670115 684704 700822 718703 738134 758640 780163 803196
61114 803196 828076 854398 881369 908530 935838 963127 989908 1015881 1041278 1066336 1090442
61103 1090442 1112182 1130390 1145033 1156982 1167030 1175220 1180928 1183323 1181850 1176597 1168347 1158134
$$ packed form
61192H61291J0044J0426J0515J0004Q790P079N098L027J144k90j334k284l208
61179I20302l862m203m606n397o462p540q570r463r898r763r583r953j0705j1133
61165H09164j1031j0947j1320j1864j2034j1684j1077j0549j0377j0623j0865
61154F86793j0434r181p698o546n562m341l102k492k631k869k662k206k087k518
61140F22464l096l214k661j936j907k825l752l338j273J362L336M433N238O183
61126F19014P302Q599J0147J1793J3260J4589J6118J7881J9431K0506K1523K3033
61114H03196K4880K6322K6971K7161K7308K7289K6781K5973K5397K5058K4106
61103A090442K1740J8208J4643J1949J0048Q190N708K395j473n253q250j0213
$$ plain form
61091 1158134 1146564 1133570 1118853 1102474 1085017 1067330 1050132 1033748 1018076 1002867 988147
61080 988147 974294 961659 950209 939710 930191 922116 916092 912449 911075 911525 913368 916543 921376
61067 921376 928109 936415 945518 954855 964535 975143 987124 1000367 1014353 1028721 1043682 1059706
61055 1059706 1076757 1094022 1110652 1126630 1142684 1159424 1176864 1194719 1212731 1230608 1248040
61044 1248040 1265064 1282207 1300038 1318602 1337435 1356022 1374218 1392450 1411578 1432295 1454459
61033 1454459 1477276 1500340 1524194 1549568 1576335 1603682 1631285 1659882 1690523 1723525 1758351
61022 1758351 1794468 1832229 1872954 1918284 1969655 2028543 2096966 2177251 2271281 2380666 2508254
61011 2508254 2659565 2842916 3068679 3348370 3693002 4110703 4605622 5179587 5834647
$$ packed form
61091A158134j1570j2994j4717j6379j7457j7687j7198j6384j5672j5209j4720
61080I88147j3853j2635j1450j0499r519q075o024l643j374M50J843L175M833
61067I21376O733Q306R103R337R680J0608J1981J3243J3986J4368J4961J6024
61055A059706J7051J7265J6630J5978J6054J6740J7440J7855J8012J7877J7432
61044A248040J7024J7143J7831J8564J8833J8587J8196J8232J9128K0717K2164
61033A454459K2817K3064K3854K5374K6767K7347K7603K8597L0641L3002L4826
61022A758351L6117L7761M0725M5330N1371N8888O8423Q0285R4030J09385J27588
61011B508254J51311J83351K25763K79691L44632M17701M94919N73965O55060
$$ plain form
61002 5834647 6573821 7401286 8325332 9362662 10536921 11866530 13346130 14931938 16538954
60993 16538954 18051970 19348477 20329213 20948148 21229646 21261889 21165337 21048377 20969592
60984 20969592 20921232 20836253 20612588 20146993 19370545 18274239 16912611 15383423 13795887
60975 13795887 12244358 10795637 9487440 8332816 7327719 6459545 5713622 5075863
60967 5075863 4532772 4071099 3678180 3342642 3054842 2806685 2591147 2402236 2235398
60958 2235398 2087498 1956051 1838745 1733863 1640537 1557913 1484430 1418553 1359745 1307793
60948 1307793 1261371 1218308 1177370 1138830 1103087 1069712 1038302 1009254 982884 958380 934461
60937 934461 910758 887868 866186 845391 825034 805093 785840 767579 750572 734948 720559
$$ packed form
61002E834647P39174Q27465R24046J037330J174259J329609J479600J585808J607016
60993A6538954J513016J296507R80736O18935K81498L2243r6552j16960p8785
60984B0969592m8360q4979k23665m65595p76448j096306j361628j529188j587536
60975A3795887j551529j448721j308197j154624j005097q68174p45923o37759
60967E075863n43091m61673l92919l35538k87800k48157k15538j88911j66838
60958B235398j47900j31447j17306j04882r3326q2624p3483o5877n8808n1952
60948A307793m6422m3063m0938l8540l5743l3375l1410k9048k6370k4504k3919
60937I34461k3703k2890k1682k0795k0357j9941j9253j8261j7007j5624j4389
$$ plain form
60926 720559 707159 694784 683804 674449 666371 658725 650794 642633 635024 628645 623317 618288 613237
60913 613237 608674 605236 602865 600850 598546 595932 593541 591955 591269 591035 590787 590477 590223 589929 589514 589323
60897 589323 589728 590361 590326 589252 587534 585441 582611 578691 573871 568521 562831 557123 551818 546689 540767
60882 540767 533602 526039 519098 512619 505796 498621 491940 486216 481095 476160 471425 467087 463396 460711
60868 460711 459089 457959 456859 456371 457471 459991 462643 464712 466841 469841 473548 477320 480861 484032
60854 484032 486518 488402 490547 493658 497297 500445 502821 504970 507239 509374 511069 512242 512665 511935 510090
60839 510090 507803 505631 503347 500281 496113 491092 485661 480197 475118 470896 467705 465085 462185 458479
60825 458479 454274 450416 447516 445441 443471 440819 437092 432440 427392 422454 417836 413565 409707 406232
$$ packed form
60926G20559j3400j2375j0980r355q078p646p931q161p609o379n328n029n051
60913F13237m563l438k371k015k304k614k391j586o86k34k48l10k54k94m15j91
60897E89323M05O33l5j074j718k093k830l920m820n350n690n708n305n129n922
60882E40767p165p563o941o479o823p175o681n724n121m935m735m338l691k685
60868D60711j622j130j100m88J100K520K652K069K129L000L707L772L541L171
60854D84032K486J884K145L111L639L148K376K149K269K135J695J173M23p30j845
60839E10090k287k172k284l066m168n021n431n464n079m222l191k620k900l706
60825D58479m205l858k900k075j970k652l727m652n048m938m618m271l858l475
$$ plain form
60811 406232 402747 398776 394461 390643 387918 385823 383296 379909 376279 373250 371041 369387 368207 367742
60797 367742 368067 368824 369591 370260 370861 371185 370969 370460 370427 371363 372915 374355 375446 376552 377949 379358 380239
60780 380239 380362 380095 380274 381656 384173 386710 388012 387922 387506 387850 389067 390618 392193 393852 395453 396477
60764 396477 396571 396050 395645 395800 396248 396274 395391 393755 391927 390326 389090 388348 388291 388815 389366 389381 388791 387891 386879
60745 386879 385778 384719 383967 383607 383455 383323 383114 382582 381235 378725 375241 371317 367352 363520 360026 357157
60729 357157 354955 353133 351503 350305 349846 349873 349643 348742 347617 347129 347623 348555 348993 348448 347258 346242 345949
60712 345949 346271 346841 347655 349022 350932 352854 354344 355551 356864 358319 359698 361056 362734 364866 367120
60697 367120 368967 370020 370191 369808 369551 369978 371021 372080 372633 372643 372492 372675 373434 374437 374953 374617 373944
$$ packed form
60811D06232l485l971m315l818k725k095k527l387l630l029k209j654j180m65
60797C67742L25P57P67O69O01L24k16n09l3R36J552J440J091J106J397J409Q81
60780C80239J23k67J79J382K517K537J302r0m16L44J217J551J575J659J601J024
60764C96477R4n21m05J55M48K6q83j636j828j601j236p42n7N24N51J5n90r00j012
60745C86879j101j059p52l60j52j32k09n32j347k510l484l924l965l832l494k869
60729C57157k202j822j630j198m59K7k30r01j125m88M94R32M38n45j190j016k93
60712C45949L22N70Q14J367J910J922J490J207J313J455J379J358J678K132K254
60697C67120J847J053J71l83k57M27J043J059N53J0j51J83P59J003N16l36o73
$$ plain form
60680 373944 373854 374775 376474 378555 380685 382557 384144 385994 388669 391822 394345 395545 395643 395025 393603 391236
60664 391236 388259 385182 382235 379530 377286 375557 374056 372653 371758 371809 372641 373707 374761 375962 377485
60649 377485 379322 381340 383303 384991 386507 388203 390102 391672 392393 392195 391125 389043 386099 383070 380705
60634 380705 378988 377516 376212 375124 373903 372264 370782 370377 371042 371795 372009 372018 372269 372594 372703 372791 373199
60617 373199 373887 374626 375448 376486 377625 378648 379609 380730 381947 382796 382774 381796 380354 379201 378850 379312 380331
60600 380331 381636 382887 383706 384148 384902 386511 388502 389814 390041 389722 389354 388828 388018 387337 387319 388088 389579
60583 389579 391755 394179 395816 395959 395201 394949 396006 398094 400686 403761 407525 411861 416512 421632 427749
60568 427749 435063 443054 451087 459279 468401 478742 489369 498766 506025 511134 514314 515551 514788 512180
$$ packed form
60680C73944r0R21J699K081K130J872J587J850K675L153K523J200R8o18j422k367
60664C91236k977l077k947k705k244j729j501j403q95N1Q32J066J054J201J523
60649C77485J837K018J963J688J516J696J899J570P21j98j070k082k944l029k365
60634C80705j717j472j304j088j221j639j482m05O65P53K14RK51L25J09Q8M08
60617C73199O88P39Q22J038J139J023R61J121J217Q49k2r78j442j153l51M62J019
60600C80331J305J251Q19M42P54J609J991J312K27l19l68n26q10o81j8P69J491
60583C89579K176K424J637J43p58k52J057K088K592L075L764M336M651N120O117
60568D27749P314P991Q033Q192R122J0341J0627R397P259N109L180J237p63k608
$$ plain form
60554 512180 508063 502975 497681 492819 488477 484462 481046 479012 478901 480558 483530 487497 492284 497938
60540 497938 504898 513532 523341 533300 543281 554460 567823 582856 598288 613466 628208 641774
60528 641774 652998 661383 667253 670814 671780 670035 666037 660402 653587 645994 637891 629203 619987 611167
60514 611167 604153 599441 596153 593238 590650 589084 589030 590505 593367 597539 603241 611314 622939 638620
60500 638620 657693 679160 702810 729166 758596 790885 825516 861885 899266 936827 973673
60489 973673 1008631 1040224 1067262 1089427 1106949 1119784 1127458 1129585 1126029 1116520 1100617 1078262
60477 1078262 1050036 1016750 979204 938550 896439 854394 813206 773268 735208 699820 667517
60466 667517 638333 612397 589928 570672 553766 538383 524282 511626 500511 490854 482477 475083
$$ packed form
60554E12180m117n088n294m862m342m015l416k034j11J657K972L967M787N654
60540D97938O960Q634R809R959R981J1179J3363J5033J5432J5178J4742J3566
60528F41774J1224Q385N870L561R66j745l998n635o815p593q103q688r216q820
60514F11167p014m712l288k915k588j566n4J475K862M172N702Q073J1625J5681
60500F38620J9073K1467K3650K6356K9430L2289L4631L6369L7381L7561L6846
60489I73673L4958L1593K7038K2165J7522J2835P674K127l556r509j5903k2355
60477A078262k8226l3286l7546m0654m2111m2045m1188l9938l8060l5388l2303
60466F67517k9184k5936k2469j9256j6906j5383j4101j2656j1115r657q377p394
$$ plain form
60454 475083 468368 462344 457329 453326 449594 445219 440104 435067 430945 427880 425507 423485 421619 419660
60440 419660 417273 414245 410775 407574 405575 405212 405916 406508 406237 405275 404134 402913 401440 399916 399001 399118
60424 399118 399927 400650 400805 400465 399904 399262 398697 398690 399818 402103 404827 407238 409281 411358 413532 415404 416778
60407 416778 417989 419442 421263 423582 426656 430295 433541 435522 436445 437279 438507 439749 440673 441679 443394
60392 443394 445831 448451 450864 453151 455524 457978 460392 462872 465731 469036 472263 474707 476361 478120
60378 478120 480829 484248 487297 489287 490575 491999 494072 496865 500285 504105 507878 511129 513654 515538
60364 515538 516954 518128 519439 521339 524093 527668 531930 536890 542778 549851 558093 567068 576147 584947
60350 584947 593590 602475 611771 621033 629347 635872 640268 642560 642676 640361 635612 628965 621126 612499
$$ packed form
60454D75083o715o024n015m003l732m375n115n037m122l065k373k022j866j959
60440D19660k387l028l470l201j999l63P04N92k71r62j141j221j473j524r15J17
60424C99118Q09P23J55l40n61o42n65pJ128K285K724K411K043K077K174J872J374
60407D16778J211J453J821K319L074L639L246J981R23Q34J228J242R24J006J715
60392D43394K437K620K413K287K373K454K414K480K859L305L227K444J654J759
60378D78120K709L419L049J990J288J424K073K793L420L820L773L251K525J884
60364E15538J416J174J311J900K754L575M262M960N888P073Q242Q975R079Q800
60350E84947Q643Q885R296R262Q314O525M396K292J16k315m749o647p839q627
$$ plain form
60336 612499 603267 593786 584554 575853 567744 560403 554146 549087 545041 541770 538985 536046 532179 527334
60322 527334 522539 519051 517186 516210 515270 514230 513735 514712 517836 523192 530421 539159 549326 560954 573918
60307 573918 587924 602576 617294 631355 644236 655804 665975 674310 680128 682918 682456 678668 671773
60294 671773 662483 651657 639637 626183 611246 595582 580451 566844 555167 545499 537828 531953
60282 531953 527349 523365 519670 516426 513953 512251 510926 509554 507913 505843 503152 499862 496381 493180
60268 493180 490332 487587 484830 482238 479973 477933 475876 473620 471134 468575 466296 464579 463288 461998
60254 461998 460562 459329 458671 458466 458364 458431 459223 461078 463575 465894 467651 469181 470927 472796 474278 475135
60238 475135 475682 476309 476930 477119 476693 475990 475577 475805 476605 477577 478306 478723 479149 479908 480997 482291 483938 486226
$$ packed form
60336F12499r232r481r232q701q109p341o257n059m046l271k785k939l867m845
60322E27334m795l488j865r76r40j040m95R77L124N356P229Q738J0167J1628J2964
60307E73918J4006J4652J4718J4061J2881J1568J0171Q335N818K790m62l788o895
60294F71773r290j0826j2020j3454j4937j5664j5131j3607j1677r668p671n875
60282E31953m604l984l695l244k473j702j325j372j641k070k691l290l481l201
60268D93180k848k745k757k592k265k040k057k256k486k559k279j717j291j290
60254D61998j436j233o58k05j02O7P92J855K497K319J757J530J746J869J482Q57
60238D75135N47O27O21J89m26p03m13K28Q00R72P29M17M26P59J089J294J647K288
$$ plain form
60220 486226 489006 491592 493434 494817 496797 500497 506420 514167 522705 531068 538939 546551 554137 561752
60206 561752 569563 577859 586525 594875 602329 609066 615695 622474 629213 635756 642121 648168 653602 658393
60192 658393 662835 667037 670659 673306 674902 675465 674739 672356 668290 663038 657371 651976 647113 642435 637253
60177 637253 631178 624496 617847 611630 605842 600341 595026 589834 584741 579813 575214 571189 568060 566028
60163 566028 564787 563552 561818 560053 559222 559546 560093 559791 558574 557229 556363 555921 555674 555742 556398 557608 559035
60146 559035 560484 562071 563894 565692 567009 567749 568438 569880 572591 576588 581540 586924 592129 596786 601181
60131 601181 606102 611983 618258 623822 628176 631889 635845 640220 644370 647635 650057 652299 655020 658424
60117 658424 662355 666652 671249 675916 680116 683356 685723 687889 690503 693639 696835 699521 701263 701774
$$ packed form
60220D86226K780K586J842J383J980L700N923P747Q538Q363P871P612P586P615
60206E61752P811Q296Q666Q350P454O737O629O779O739O543O365O047N434M791
60192F58393M442M202L622K647J596N63p26k383m066n252n667n395m863m678n182
60177F37253o075o682o649o217n788n501n315n192n093m928m599m025l129k032
60163E66028j241j235j734j765q31L24N47l02j217j345q66m42k47O8O56J210J427
60146E59035J449J587J823J798J317P40O89J442K711L997M952N384N205M657M395
60131F01181M921N881O275N564M354L713L956M375M150L265K422K242K721L404
60117F58424L931M297M597M667M200L240K367K166K614L136L196K686J742N11
$$ plain form
60103 701774 700988 699122 696496 693213 689132 684297 679314 675154 672417 670681 668674 665306 660696 656107
60089 656107 652735 650670 649113 647406 645516 643692 642060 640658 639433 638036 635963 633207 630414 628064
60075 628064 625754 622721 618899 614964 611340 607686 603438 598402 592627 586112 578980 571656 564573 557857
60061 557857 551550 545941 541389 537894 535086 532572 530141 527768 525641 524085 523247 522967 523139 524009 525796
60046 525796 528157 530483 532730 535522 539309 543792 548366 552875 557657 562969 568562 573778 577986 580997
60032 580997 583135 584804 586020 586527 586290 585523 584215 582051 578977 575360 571191 565600 557783 548321 538909
60017 538909 530686 523373 516230 509245 502860 496934 490684 483735 476720 470675 466108 462839 460461 458601
60003 458601 456933 455272 453726 452508 451610 450899 450573 451153 452764 454650 455817 456078 456166 456802 457990 459317
$$ packed form
60103G01774p86j866k626l283m081m835m983m160k737j736k007l368m610m589
60089F56107l372k065j557j707j890j824j632j402j225j397k073k756k793k350
60075F28064k310l033l822l935l624l654m248n036n775o515p132p324p083o716
60061E57857o307n609m552l495k808k514k431k373k127j556q38k80J72Q70J787
60046E25796K361K326K247K792L787M483M574M509M782N312N593N216M208L011
60032E80997K138J669J216N07k37p67j308k164l074l617m169n591p817r462r412
60017E38909q223p313p143o985o385n926o250o949p015o045m567l269k378j860
60003D58601j668j661j546j218q98p11l26N80J611J886J167K61Q8O36J188J327
$$ plain form
59987 459317 460641 462196 464168 466408 468600 470590 472464 474295 475829 476587 476447 475966 475779 475712 474905 472906
59971 472906 470215 467500 464740 461592 458259 455436 453492 452275 451688 451876 452704 453590 454152 454653 455526 456779
59955 456779 458193 459797 461710 463705 465331 466452 467291 467987 468508 469055 470096 471778 473603 474957 475728
59940 475728 476132 476182 475781 475220 475011 475080 474630 473145 471197 469805 469249 469113 469400 470873 473943 477785 481155
59923 481155 483794 486430 489451 492274 494240 495501 496469 496740 495356 492242 488780 486566 485982 486406 487507
59908 487507 489558 492498 495490 497842 499852 502198 504915 507605 510283 513194 515895 517458 517807 518046 519146
59893 519146 521080 523636 527225 532107 537467 542225 546423 550962 556277 562209 568966 577018 585848 593876
59879 593876 600154 605346 610571 615977 621050 625701 630230 634516 637948 640109 640998 640642 638927 635869 631745
$$ packed form
59987D59317J324J555J972K240K192J990J874J831J534P58j40m81j87o7q07j999
59971D72906k691k715k760l148l333k823j944j217n87J88Q28Q86N62N01Q73J253
59955D56779J414J604J913J995J626J121Q39O96N21N47J041J682J825J354P71
59940D75728M04N0m01n61k09O9m50j485j948j392n56j36K87J473L070L842L370
59923D81155K639K636L021K823J966J261R68K71j384l114l462k214n84M24J101
59908D87507K051K940K992K352K010K346K717K690K678K911K701J563L49K39J100
59893E19146J934K556L589M882N360M758M198M539N315N932O757Q052Q830Q028
59879E93876O278N192N225N406N073M651M529M286L432K161Q89l56j715l058m124
$$ plain form
59864 631745 626914 621689 616338 611061 606021 601504 597860 595146 593036 591235 589761 588668 587870 587561 588514
59849 588514 591527 596660 603298 610757 618455 625665 631584 635751 638200 639281 639541 639592 639771 640000 640183 640493
59833 640493 640963 641136 640585 639493 638124 636006 632506 628236 624920 623485 622961 621745 619353 616346 613039
59818 613039 609071 604128 598435 592484 586637 581076 575775 570506 565111 559830 555168 551467 548751 546868
59804 546868 545514 544218 542592 540606 538371 535780 532741 529686 527285 525462 523201 519739 515592 511992
59790 511992 509513 507797 506439 505492 504987 504604 504175 504085 504699 505644 506156 506019 505722 505767 506333 507628 509929 512982
59772 512982 515784 517433 518054 518611 519932 522182 525063 528164 531122 533774 536219 538618 540969 543246 545682
59757 545682 548671 552398 556697 561283 565958 570644 575355 580182 585212 590531 596324 602785 609743 616574
$$ packed form
59864F31745m831n225n351n277n040m517l644k714k110j801j474j093p98l09R53
59849E88514L013N133O638P459P698P210N919M167K449J081K60N1J79K29J83L10
59833F40493M70J73n51j092j369k118l500m270l316j435n24j216k392l007l307
59818F13039l968m943n693n951n847n561n301n269n395n281m662l701k716j883
59804E46868j354j296j626j986k235k591l039l055k401j823k261l462m147l600
59790E11992k479j716j358r47n05l83m29r0O14R45N12j37k97M5N66J295K301L053
59772E12982K802J649O21N57J321K250K881L101K958K652K445K399K351K277K436
59757E45682K989L727M299M586M675M686M711M827N030N319N793O461O958O831
$$ plain form
59743 616574 622733 628204 633173 637488 640871 643561 646195 648983 651504 653476 655307 657552 660082 662117
59729 662117 662938 662439 661148 659924 659450 659760 660300 660551 660507 660466 660518 660438 659978 659134 658136 657213 656335 655198 653539
59710 653539 651439 649126 646590 643705 640732 638321 636882 636242 636040 636085 636137 635774 634876 633978 633787 634494 635873
59693 635873 637773 640074 642335 643988 644969 645747 646636 647342 647221 645789 643033 639503 636042 633127 630472
59678 630472 627527 624257 621009 617751 614054 609899 605841 602049 597853 592806 587739 583987 581704 579712
59664 579712 577032 573900 571032 568566 566273 564373 563447 563600 564307 565225 566699 569196 572489 575692 578022
59649 578022 579406 580476 582121 584801 588004 590467 591180 590176 588180 585688 582719 579322 575761 572096
59635 572096 568096 563845 560016 557134 554864 552437 549643 546989 544952 543487 542274 541058 539651 537893
$$ packed form
59743F16574O159N471M969M315L383K690K634K788K521J972J831K245K530K035
59729F62117Q21m99j291j224m74L10N40K51m4m1N2q0m60q44r98r23q78j137j659
59710F53539k100k313k536k885k973k411j439o40k02M5N2l63q98q98j91P07J379
59693F35873J900K301K261J653R81P78Q89P06j21j432k756l530l461k915k655
59678F30472k945l270l248l258l697m155m058l792m196n047n067l752k283j992
59664E79712k680l132k868k466k293j900r26J53P07R18J474K497L293L203K330
59649E78022J384J070J645K680L203K463P13j004j996k492k969l397l561l665
59635E72096m000m251l829k882k270k427k794k654k037j465j213j216j407j758
$$ plain form
59621 537893 535782 533441 530901 528089 525142 522463 520309 518435 516338 513791 511093 508834 507477 507127
59607 507127 507607 508706 510265 512049 513715 515039 516083 516998 517754 518231 518420 518391 518219 518200 518872 520435 522253
59590 522253 523400 523687 523700 523875 524140 524530 525436 526814 527796 527654 526738 525834 524930 523337 520924 518497 516840
59573 516840 515931 515264 514477 513504 512539 511983 512007 512034 511161 509383 507913 507882 509073 510406 511387 512415 513712 514598
59555 514598 514166 512381 510210 508744 508335 508561 508925 509550 511151 514278 518681 523524 528168 532646 537449
59540 537449 543054 549741 557708 567182 578351 591086 604678 617841 629095 637212 641498 641922 639157
59527 639157 634383 628806 623310 618512 614896 612660 611587 611343 611799 612746 613403 612705 610266 606747 603040
59512 603040 599319 595121 590150 584710 579399 574501 569680 564227 557762 550757 544209 538732 534167 530110
$$ packed form
59621E37893k111k341k540k812k947k679k154j874k097k547k698k259j357l50
59607E07127M80J099J559J784J666J324J044R15P56M77J89k9j72j9O72J563J818
59590E22253J147K87J3J75K65L90R06J378R82j42r16r04r04j593k413k427j657
59573E16840r09o67p87r73r65n56K4K7q73j778j470l1J191J333R81J028J297Q86
59555E14598m32j785k171j466m09K26L64O25J601L127M403M843M644M478M803
59540E37449N605O687P967R474J1169J2735J3592J3163J1254Q117M286M24k765
59527F39157m774n577n496m798l616k236j073k44M56R47O57o98k439l519l707
59512F03040l721m198m971n440n311m898m821n453o465p005o548n477m565m057
$$ plain form
59498 530110 526509 523540 521222 519487 518392 517892 517569 517021 516413 516225 516523 516957 517511 518703 520792 523279
59482 523279 525585 527981 531391 536364 542558 549206 555773 562081 568082 573798 579414 585204 591134 596644
59468 596644 601053 604241 606751 609055 610959 612025 612379 612716 613570 614999 617021 619858 623572 627924 632881
59453 632881 638854 646035 653794 661166 667776 673881 679674 685034 689859 694140 697593 699682 700179 699305 697121
59438 697121 693182 687222 679962 672807 666679 661423 656439 651636 647623 645037 643870 643502 643362 643527 644714
59423 644714 647699 652765 659714 668338 678796 691437 706286 722830 740417 758818 778350 799425
59411 799425 822015 845422 868376 889313 906743 919498 926715 927760 922540 912101 898880 886077
59399 886077 876497 871566 871007 873214 876009 877310 875342 868682 856647 839912 820471 800632 781905
$$ packed form
59498E30110l601k969k318j735j095n00l23n48o08j88K98M34N54J192K089K487
59482E23279K306K396L410M973O194O648O567O308O001N716N616N790N930N510
59468E96644M409L188K510K304J904J066L54L37Q54J429K022K837L714M352M957
59453F32881N973P181P759P372O610O105N793N360M825M281L453K089M97q74k184
59438F97121l939n960p260p155o128n256m984m803m013k586j167l68j40J65J187
59423F44714K985N066O949Q624J0458J2641J4849J6544J7587J8401J9532K1075
59411G99425K2590K3407K2954K0937J7430J2755P217J045n220j0439j3221j2803
59399H86077r580m931n59K207K795J301j968o660j2035j6735j9441j9839j8727
$$ plain form
59386 781905 764738 749033 734689 721814 710664 701400 693799 687346 681705 677001 673442 670855 668836
59373 668836 667228 666156 665620 665369 665226 665328 665977 667390 669613 672509 675852 679578 683904 688999 694602
59358 694602 700238 705810 711678 718105 724982 732279 740473 750125 761153 772830 784583 796527 809047
59345 809047 822005 834614 846196 856894 867435 878130 888243 896413 901618 903701 903176 900665 896482
59332 896482 890563 882786 873354 862720 851096 838257 824018 808723 793096 777779 763200 749652
59320 749652 737157 725386 714064 703411 693865 685446 677691 670142 662596 655024 647752 641621 637432
59307 637432 635120 633974 633714 634790 637450 641184 645502 650717 657425 665502 674086 682249 689158 693729
59293 693729 694777 691634 684481 674237 662421 650868 640939 632785 625662 619048 613264 609061 606879
$$ packed form
59386G81905j7167j5705j4344j2875j1150r264p601o453n641m704l559k587k019
59373F68836j608j072n36k51j43J02O49J413K223K896L343L726M326N095N603
59358F94602N636N572N868O427O877P297Q194R652J1028J1677J1753J1944J2520
59345H09047J2958J2609J1582J0698J0541J0695J0113Q170N205K083n25k511m183
59332H96482n919p777r432j0634j1624j2839j4239j5295j5627j5317j4579j3548
59320G49652j2495j1771j1322j0653r546q419p755p549p546p572p272o131m189
59307F37432k312j146k60J076K660L734M318N215O708Q077Q584Q163O909M571
59293F93729J048l143p153j0244j1816j1553r929q154p123o614n784m203k182
$$ plain form
59280 606879 606609 607836 610185 613575 618211 624309 631858 640721 650854 662281 674935 688632 703050
59267 703050 717567 731266 743392 753716 762311 769100 773942 777093 779209 780729 781341 780141 776335
59254 776335 770054 762602 755636 749770 744220 738146 732108 727665 725647 725399 725751 726184 726823 727839 729199
59239 729199 730721 732139 733368 734817 737079 740046 742690 744043 744134 743602 742602 740522 736769 731522 725608
59224 725608 719682 713525 706164 696929 686412 676057 666729 658069 649459 641091 633624 627202 621466 616410
59210 616410 612463 609673 607385 604978 602455 600120 598072 596322 595156 595032 596170 598349 600945 603194
59196 603194 604701 605839 607414 609771 612467 614900 616930 618600 619673 619919 619718 619929 621095 623065 625298
59181 625298 627234 628412 628716 628654 629125 630698 633198 636001 638532 640504 641968 643235 644551 645764 646609
$$ packed form
59280F06879k70J227K349L390M636O098P549Q863J0133J1427J2654J3697J4418
59267G03050J4517J3699J2126J0324Q595O789M842L151K116J520O12j200l806
59254G76335o281p452o966n866n550o074o038m443k018k48L52M33O39J016J360
59239G29199J522J418J229J449K262K967K644J353R1n32j000k080l753n247n914
59224G25608n926o157p361r235j0517j0355r328q660q610q368p467o422n736n056
59210F16410l947k790k288k407k523k335k048j750j166j24J138K179K596K249
59196F03194J507J138J575K357K696K433K030J670J073K46k01K11J166J970K233
59181F25298J936J178L04o2M71J573K500K803K531J972J464J267J316J213Q45
$$ plain form
59166 646609 647350 648768 651261 654355 657394 660381 663619 666724 668616 668551 666681 663523 659376 654428 648927
59151 648927 642825 635579 626836 617202 607884 599609 592227 585399 579189 573760 568832 563843 558584 553385
59137 553385 548707 544733 541400 538603 536210 534004 531775 529540 527588 526274 525784 526036 526829 528138 530340
59122 530340 534077 539642 546485 553511 560086 566663 574221 583183 593098 603291 613404 623173 632089 639721
59108 639721 646224 652087 657399 661743 664912 667328 669551 671676 673545 675233 676916 678358 679043 678900 678471
59093 678471 678179 677788 676868 675518 674243 673282 672394 671249 669733 667915 665999 664245 662575 660277 656560
59078 656560 651510 646149 641320 636853 632042 626606 620865 615215 609825 604695 599633 594308 588650 583106
59064 583106 578226 574103 570571 567746 565869 564680 563520 562130 560818 559681 558263 556338 554499 553463
$$ packed form
59166F46609P41J418K493L094L039K987L238L105J892o5j870l158m147m948n501
59151F48927o102p246q743r634r318q275p382o828o210n429m928m989n259n199
59137E53385m678l974l333k797k393k206k229k235j952j314m90K52P93J309K202
59122E30340L737N565O843P026O575O577P558Q962R915J0193J0113R769Q916P632
59108F39721O503N863N312M344L169K416K223K125J869J688J683J442O85j43m29
59093F78471k92l91r20j350j275r61q88j145j516j818j916j754j670k298l717
59078F56560n050n361m829m467m811n436n741n650n390n130n062n325n658n544
59064E83106m880m123l532k825j877j189j160j390j312j137j418j925j839j036
$$ plain form
59050 553463 553104 552726 552056 551373 550754 549912 548944 548634 549556 551208 552449 552667 552099 551109 549684 547852 546169
59033 546169 545394 545821 547236 549326 551753 553996 555808 557997 562052 568533 576252 583630 590500 597967 606741
59018 606741 616416 626330 636232 645767 654054 660310 664559 667341 669000 669485 668565 666060 662269 658330 655695
59003 655695 654914 655339 656277 657830 660269 663274 666464 670170 674867 680189 685309 690067 694867 699636 703755
58988 703755 707060 710057 713049 715779 718079 720068 721547 722029 721740 721877 723415 726241 729851 734244 739618
58973 739618 745854 752979 761670 772594 785465 799379 813829 828808 844172 859501 874474 888791
58961 888791 901904 913413 923567 932695 940200 944884 946360 945355 942428 937160 929067 918625 906677
58948 906677 893284 877932 860808 843125 826112 810199 795382 781851 769869 759304 749714 740924
$$ packed form
59050E53463l59l78o70o83o19q42r68l10R22J652J241K18n68r90j425j832j683
59033E46169p75M27J415K090K427K243J812K189M055O481P719P378O870P467Q774
59018F06741R675R914R902R535Q287O256M249K782J659M85r20k505l791l939k635
59003F55695p81M25R38J553K439L005L190L706M697N322N120M758M800M769M119
58988G03755L305K997K992K730K300J989J479M82k89J37J538K826L610M393N374
58973G39618O236P125Q691J0924J2871J3914J4450J4979J5364J5329J4973J4317
58961H88791J3113J1509J0154R128P505M684J476j005k927n268q093j0442j1948
58948I06677j3393j5352j7124j7683j7013j5913j4817j3531j1982j0565r590q790
$$ plain form
58936 740924 733194 726778 721550 717185 713518 710528 708097 706025 704295 703047 702212 701378 700243 699102 698670
58921 698670 699345 700768 702117 702793 702833 702766 703130 704102 705521 707195 709107 711365 714079 717325 721092 725305
58905 725305 730043 735797 743221 752416 762645 773086 783838 795881 809983 825832 842262 858165
58893 858165 873134 887517 901975 916922 932271 947739 963352 979480 996367 1013817 1031379
58882 1031379 1048568 1064754 1079073 1090706 1099245 1104690 1107293 1107483 1105678 1101866 1095497 1086144 1074197
58869 1074197 1060673 1046464 1032169 1018494 1006202 995427 985511 975819 966371 957375 948487 939009
58857 939009 928634 917612 906292 894924 883724 872716 861546 849916 838217 827221 817081
58846 817081 807171 797076 787190 777954 768993 759552 749562 739732 730650 722242 714176 706381 698949 691775
$$ packed form
58936G40924p730o416n228m365l667k990k431k072j730j248q35q34j135j141m32
58921F98670O75J423J349O76M0o7L64R72J419J674J912K258K714L246L767M213
58905G25305M738N754P424R195J0229J0441J0752J2043J4102J5849J6430J5903
58893H58165J4969J4383J4458J4947J5349J5468J5613J6128J6887J7450J7562
58882A031379J7189J6186J4319J1633Q539N445K603J90j805l812o369r353j1947
58869A074197j3524j4209j4295j3675j2292j0775r916r692r448q996q888r478
58857I39009j0375j1022j1320j1368j1200j1008j1170j1630j1699j0996j0140
58846H17081r910j0095r886r236q961r441r990r830r082q408q066p795p432p174
$$ plain form
58832 691775 684650 677733 671742 667436 664764 662747 660410 657811 655898 655438 656422 658556 661779 666090 671265
58817 671265 677069 683499 690487 697627 704492 710939 716827 721755 725482 728295 730498 731828 731857 730754 729077
58802 729077 726938 723957 719923 714922 708979 702211 695307 689031 683149 676577 668866 660883 653694 647380
58788 647380 641361 635363 629588 624363 620124 617437 616568 617163 618634 620632 622917 625133 627060 628775 630168
58773 630168 630637 629661 627477 624665 621275 616874 611385 605414 599643 594243 588989 583696 578462 573594 569400
58758 569400 566056 563691 562445 562192 562286 562128 562080 563260 566088 569535 572369 574689 577598 581595 586027 590094
58742 590094 593699 597212 600937 605077 609762 614901 620244 625715 631368 636999 642192 646988 652114 658198
58728 658198 664923 671270 676585 681159 685720 690590 695557 700508 705839 711979 718707 725424 732108 739491
$$ packed form
58832F91775p125o917n991m306k672k017k337k599j913m60R84K134L223M311N175
58817F71265N804O430O988P140O865O447N888M928L727K813K203J330K9j103j677
58802G29077k139k981m034n001n943o768o904o276n882o572p711p983p189o314
58788F47380o019n998n775n225m239k687q69N95J471J998K285K216J927J715J393
58773F30168M69r76k184k812l390m401n489n971n771n400n254n293n234m868m194
58758E69400l344k365j246k53R4j58m8J180K828L447K834K320K909L997M432M067
58742E90094L605L513L725M140M685N139N343N471N653N631N193M796N126O084
58728F58198O725O347N315M574M561M870M967M951N331O140O728O717O684P383
$$ plain form
58714 739491 748002 756961 765267 772586 779329 785582 790615 793523 793953 792131 788563 783781 778039 770961
58700 770961 761702 749644 734970 718555 701402 684140 667003 650261 634605 620793 608795 597684
58688 597684 586746 576397 567583 560563 554806 549886 545682 541699 537036 531418 525680 520845 517201 514647
58674 514647 513388 513591 514700 515879 517136 519353 523033 527620 532381 537431 543390 550292 557420 564226
58660 564226 570823 577332 583175 587389 589385 589077 586598 582460 577811 573753 570172 565839 560038 553585
58646 553585 547830 543151 539033 535326 532604 531153 530227 528658 526033 523064 520944 520384 521180 522666 524466
58631 524466 526621 529019 531162 532745 534095 535615 537075 537934 538153 538210 538326 538234 537715 537019 536685 537278 539253
58614 539253 542733 547338 552537 558120 564101 570261 576131 581330 585609 588741 590766 592243 593750 595210
$$ packed form
58714G39491Q511Q959Q306P319O743O253N033K908M30j822l568m782n742p078
58700G70961r259j2058j4674j6415j7153j7262j7137j6742j5656j3812j1998j1111
58688E97684j0938j0349q814p020n757m920m204l983m663n618n738m835l644k554
58674E14647j259K03J109J179J257K217L680M587M761N050N959O902P128O806
58660E64226O597O509N843M214J996l08k479m138m649m058l581m333n801o453
58646E53585n755m679m118l707k722j451r26j569k625k969k120n60P96J486J800
58631E24466K155K398K143J583J350J520J460Q59K19N7J16r2n19o96l34N93J975
58614E39253L480M605N199N583N981O160N870N199M279L132K025J477J507J460
$$ plain form
58600 595210 596156 596486 596426 595830 594248 591771 589202 587175 585703 584754 584718 585950 588348 591663 595899 601161
58584 601161 607417 614572 622486 630841 639394 648358 657983 667702 676396 683782 690878 698704 707141 715575
58570 715575 724104 733439 744002 755859 769402 785394 804213 825372 847921 871111 894743 918934
58558 918934 943409 966938 987817 1005141 1019288 1030874 1039556 1044316 1044718 1041449 1035710 1028512 1020582
58545 1020582 1012545 1004888 997704 990534 982515 972897 961464 948430 933967 918088 900954 882994
58533 882994 864588 845832 826780 807776 789526 772926 758713 747034 737429 729411 722899 717768
58521 717768 713360 709021 704868 701334 698161 694718 691276 688861 687625 686394 684316 681934 680036 678350
58507 678350 676222 673819 671758 670103 668595 667458 667039 666983 666631 666062 665951 666495 667218 667705 667898 667805 667609
$$ packed form
58600E95210R46L30o0n96j582k477k569k027j472r49l6J232K398L315M236N262
58584F01161O256P155P914Q355Q553Q964R625R719Q694P386P096P826Q437Q434
58570G15575Q529R335J0563J1857J3543J5992J8819K1159K2549K3190K3632K4191
58558I18934K4475K3529K0879J7324J4147J1586Q682M760M02l269n739p198p930
58545A020582q037p657p184p170q019r618j1433j3034j4463j5879j7134j7960
58533H82994j8406j8756j9052j9004j8250j6600j4213j1679r605q018o512n131
58521G17768m408m339m153l534l173l443l442k415j236j231k078k382j898j686
58507F78350k128k403k061j655j508j137m19n6l52n69j11N44P23M87J93r3j96
$$ plain form
58490 667609 667997 669678 672619 676297 680600 685871 692185 699296 707299 716659 727472 739246 751584 764576
58476 764576 778385 792801 807232 820785 832355 841104 846948 850323 851540 850654 847783 843170 837076
58463 837076 830070 823282 817922 814579 813342 814258 817147 821233 825731 830763 837015 844507 852382 859985
58449 859985 867402 874680 881090 885457 886915 885177 880494 873537 865012 855248 844435 833213 822632
58436 822632 813479 806038 800452 796875 795171 794912 795789 797707 800473 803820 807818 812776 818652 824924 831177
58421 831177 837412 843662 849638 854903 859141 862138 863706 863641 861575 857044 850058 841531 832713 824220 815976
58406 815976 807950 800436 793627 787466 782028 777605 774354 772255 771380 771703 772686 773663 774784 776992 780805
58391 780805 785583 790271 794425 798147 801432 804064 806134 808287 811297 815400 820075 824566 828616 832525
$$ packed form
58490F67609L88J681K941L678M303N271O314P111Q003R360J0813J1774J2338J2992
58476G64576J3809J4416J4431J3553J1570Q749N844L375J217q86k871m613o094
58463H37076p006o788n360l343j237R16K889M086M498N032O252P492P875P603
58449H59985P417P278O410M367J458j738m683o957q525r764j0813j1222j0581
58436H22632r153p441n586l577j704k59Q77J918K766L347L998M958N876O272O253
58421H31177O235O250N976N265M238K997J568o5k066m531o986q527q818q493q244
58406H15976q026p514o809o161n438m423l251k099q75L23R83R77J121K208L813
58391G80805M778M688M154L722L285K632K070K153L010M103M675M491M050L909
$$ plain form
58377 832525 836489 840255 843652 847078 851095 855784 860901 866379 872329 878836 886156 894764 904685 915124
58363 915124 925327 935513 946334 957765 969232 980561 992038 1003647 1015012 1025921 1036142
58352 1036142 1044935 1051598 1056442 1060413 1063826 1066353 1068171 1070140 1072813 1076179 1080507 1086453 1094048 1102468
58338 1102468 1111110 1120193 1130110 1140999 1153163 1167018 1182274 1197881 1213146 1228293 1243669 1259054
58326 1259054 1273971 1287951 1300353 1310699 1319435 1327558 1335190 1341376 1345650 1349007 1352825 1357495 1362632
58313 1362632 1368031 1373883 1380409 1387724 1395831 1404653 1414309 1425204 1437397 1450128 1462712 1475666 1490070
58300 1490070 1506001 1522604 1539599 1557520 1576368 1595336 1614163 1633618 1654234 1675627 1697437
58289 1697437 1719844 1742765 1765581 1788193 1811384 1835744 1861182 1887779 1916080 1946082 1976959
$$ packed form
58377H32525L964L766L397L426M017M689N117N478N950O507P320Q608R921J0439
58363I15124J0203J0186J0821J1431J1467J1329J1477J1609J1365J0909J0221
58352A036142Q793O663M844L971L413K527J818J969K673L366M328N946P595Q420
58338A102468Q642R083R917J0889J2164J3855J5256J5607J5265J5147J5376J5385
58326A259054J4917J3980J2402J0346Q736Q123P632O186M274L357L818M670N137
58313A362632N399N852O526P315Q107Q822R656J0895J2193J2731J2584J2954J4404
58300A490070J5931J6603J6995J7921J8848J8968J8827J9455K0616K1393K1810
58289A697437K2407K2921K2816K2612K3191K4360K5438K6597K8301L0002L0877
$$ plain form
58278 1976959 2008257 2040445 2073975 2108772 2144927 2182777 2222020 2261881 2302445 2344639 2388723
58267 2388723 2434182 2481318 2531314 2584268 2638839 2694475 2752355 2813391 2876918 2942160 3009435
58256 3009435 3079000 3150254 3222986 3297897 3375027 3453307 3532611 3614662 3700908 3791140 3885229
58245 3885229 3984429 4089784 4200914 4317610 4441053 4572286 4711214 4858144 5014477 5180718
58235 5180718 5355901 5540273 5736401 5946250 6169490 6406267 6659135 6930311 7219509
58226 7219509 7526715 7854859 8207508 8586362 8993514 9433958 9913255 10434947 11002914
58217 11002914 11624116 12306457 13056296 13880812 14790622 15797798 16914616 18157720 19551270
58208 19551270 21124114 22908939 24949681 27308776 30067602 33330320 37238130 41977570
$$ packed form
58278A976959L1298L2188L3530L4797L6155L7850L9243L9861M0564M2194M4084
58267B388723M5459M7136M9996N2954N4571N5636N7880O1036O3527O5242O7275
58256C009435O9565P1254P2732P4911P7130P8280P9304Q2051Q6246R0232R4089
58245C885229R9200J05355J11130J16696J23443J31233J38928J46930J56333J66241
58235E180718J75183J84372J96128K09849K23240K36777K52868K71176K89198
58226G219509L07206L28144L52649L78854M07152M40444M79297N21692N67967
58217A1002914O21202O82341P49839Q24516R09810J007176J116818J243104J393550
58208A9551270J572844J784825K040742K359095K758826L262718L907810M739440
$$ plain form
58200 41977570 47764755 54814139 63311969 73397590 85149267 98585970 113692230
58193 113692230 130448254 148853495 168961708 190917138 214900188 240898572 268377070
58186 268377070 296057455 321961891 343698338 358886406 365653031 363106563 351602756
58179 351602756 332631462 308359820 281075153 252770859 224957242 198646996 174435991
58172 174435991 152613960 133257762 116294420 101553402 88819625 77870998 68489070
58165 68489070 60459750 53582696 47682571 42608879 38230030 34433301 31126892 28235360
58157 28235360 25693085 23444210 21444878 19660038 18058650 16614467 15308544 14126538
58149 14126538 13054354 12079156 11192691 10389967 9665197 9011308 8421997 7891463 7412985
$$ packed form
58200D1977570N787185P049384Q497830J0085621J1751677J3436703J5106260
58193A13692230J6756024J8405241K0108213K1955430K3983050K5998384K7478498
58186B68377070K7680385K5904436K1736447J5188068O766625k546468j1503807
58179C51602756j8971294k4271642k7284667k8304294k7813617k6310246k4211005
58172A74435991k1822031j9356198j6963342j4741018j2733777j0948627r381928
58165F8489070q029320o877054n900125n073692m378849l796729l306409k891532
58157B8235360k542275k248875j999332j784840j601388j444183j305923j182006
58149A4126538j072184r75198q86465q02724p24770o53889n89311n30534m78478
$$ plain form
58140 7412985 6980130 6588446 6233860 5910363 5611438 5333030 5073364 4830782 4603551
58131 4603551 4390888 4192359 4006899 3833640 3672703 3523765 3384928 3254323 3131643
58122 3131643 3016832 2908610 2805790 2708654 2617435 2530745 2447312 2368089 2294721 2226855 2162675
58111 2162675 2101261 2042749 1987041 1934006 1884161 1837448 1792136 1746548 1701189 1657582 1615836
58100 1615836 1575049 1535402 1497895 1462390 1427671 1393313 1360039 1328438 1298655 1271069 1245969
58089 1245969 1222730 1200422 1178924 1158359 1137924 1116518 1094188 1071823 1049791 1027937 1006463
58078 1006463 985640 965146 944801 925489 908141 892242 876528 860770 845738 831774 818560
58067 818560 805894 793605 781185 768625 757028 747173 738094 728431 718692 710587 704422 698619 691679
$$ packed form
58140G412985m32855l91684l54586l23497k98925k78408k59666k42582k27231
58131D603551k12663j98529j85460j73259j60937j48938j38837j30605j22680
58122C131643j14811j08222j02820r7136r1219q6690q3433p9223p3368o7866o4180
58111B162675o1414n8512n5708n3035m9845m6713m5312m5588m5359m3607m1746
58100A615836m0787l9647l7507l5505l4719l4358l3274l1601k9783k7586k5100
58089A245969k3239k2308k1498k0565k0435k1406k2330k2365k2032k1854k1474
58078A006463k0823k0494k0345j9312j7348j5899j5714j5758j5032j3964j3214
58067H18560j2666j2289j2420j2560j1597r855r079r663r739q105o165n803o940
$$ plain form
58054 691679 683307 673790 663648 653856 645121 636981 628592 620146 612369 605068 597513 589938 583211 577309
58040 577309 571655 566650 563117 560254 556021 549831 543206 537372 531783 525495 518472 510882 502493 493519
58026 493519 484882 476975 469199 461343 454316 448812 444281 439914 435759 432115 428678 425041 421417 418159
58012 418159 415131 412096 409222 406726 404519 402538 400864 399245 397240 395165 394027 394085 394252 393510 392161
57997 392161 391080 390367 389488 388234 386788 385221 383544 382075 381162 380713 380324 379705 378701 377178 375187 373030
57981 373030 371040 369457 368458 367818 366624 364069 360659 357891 356429 355380 353717 351670 350126 349382 349190
57966 349190 349473 350231 351122 351858 352742 354136 355619 356388 356369 356214 356201 355833 354704 353167 351799 350614 349180
57949 349180 347370 345590 344229 343145 341883 340319 338909 338283 338740 340147 342192 344678 347807 352149 358000
$$ packed form
58054F91679q372r517j0142r792q735q140q389q446p777p301p555p575o727n902
58040E77309n654n005l533k863m233o190o625n834n589o288p023p590q389q974
58026D93519q637p907p776p856p027n504m531m367m155l644l437l637l624l258
58012D18159l028l035k874k496k207j981j674j619k005k075j138N8J67p42j349
57997C92161j081p13q79j254j446j567j677j469r13m49l89o19j004j523j991k157
57981C73030j990j583r99o40j194k555l410k768j462j049j663k047j544p44j92
57966C49190K83P58Q91P36Q84J394J483P69j9j55j3l68j129j537j368j185j434
57949C49180j810j780j361j084j262j564j410o26M57J407K045K486L129M342N851
$$ plain form
57934 358000 364713 371107 376764 382385 388534 394588 399451 402762 404665 404838 402739 398631 393437 387653
57920 387653 381248 374577 368342 362522 356332 349583 343179 337885 333419 329202 325265 321858 318883 316287
57906 316287 314486 313760 313675 313592 313366 313026 312253 310770 308989 307694 307257 307547 308347 309453 310599 311732 313197
57889 313197 315307 317926 320766 323848 327314 331016 334593 337778 340356 342164 343448 344950 347133 349463
57875 349463 350887 351023 350588 350664 351721 353289 354395 354339 353146 351264 348951 346301 343733 341896 340831 339655
57859 339655 337513 334674 332483 332335 334747 339074 343876 347823 350503 352389 354086 355935 358181 360950
57845 360950 363847 366119 367503 368478 369412 369945 369583 368527 367418 366563 365792 364935 364067 363425 363338 364030 365240
57828 365240 366241 366486 366109 365675 365636 366132 366988 367740 367969 367763 367512 367226 366485 365232 363985 362924 361348
$$ packed form
57934C58000O713O394N657N621O149O054M863L311J903J73k099m108n194n784
57920C87653o405o671o235n820o190o749o404n294m466m217l937l407k975k596
57906C16287j801p26q5q3k26l40p73j483j781j295m37K90Q00J106J146J133J465
57889C13197K110K619K840L082L466L702L577L185K578J808J284J502K183K330
57875C49463J424J36m35P6J057J568J106n6j193j882k313k650k568j837j065j176
57859C39655k142k839k191j48K412M327M802L947K680J886J697J849K246K769
57845C60950K897K272J384R75R34N33l62j056j109q55p71q57q68o42q7O92J210
57828C65240J001K45l77m34l9M96Q56P52K29k06k51k86p41j253j247j061j576
$$ plain form
57811 361348 358431 354125 348856 342831 336095 328891 321449 313755 305997 298860 292806 287448 282265 277646
57797 277646 274497 272930 272038 270961 269579 268114 266649 265284 264375 264329 265241 266761 268270 269375 270429
57782 270429 272354 275674 279860 283901 287333 290483 293950 298183 303327 309051 314602 319333 323087 325864
57768 325864 327419 327588 326802 325787 324838 323791 322611 321572 320847 320252 319489 318425 317140 315840 314684 313699
57752 313699 313030 313208 314755 317369 320021 322119 324041 326203 328212 329536 330425 331332 331820 331001 329018 327217
57736 327217 326665 327127 327670 327729 327387 327021 326907 326947 326740 326107 325382 324943 324682 324311 323933 323799 323748 323492 323289 323627
57716 323627 324297 324503 323968 323221 322646 321973 321012 320259 320309 321038 321767 321967 321547 320708 319816 319222 319001 318966 319001 319176
57696 319176 319459 319605 319379 318653 317239 314948 311969 308877 306101 303575 301080 298766 297168 296784 297682 299535
$$ packed form
57811C61348k917m306n269o025o736p204p442p694p758p137o054n358n183m619
57797B77646l149j567q92j077j382j465j465j365r09m6R12J520J509J105J054
57782B70429J925L320M186M041L432L150L467M233N144N724N551M731L754K777
57768C25864J555J69p86j015r49j047j180j039p25n95p63j064j285j300j156r85
57752C13699o69J78J547K614K652K098J922K162K009J324Q89R07M88q19j983j801
57736C27217n52M62N43N9l42l66j14M0k07o33p25m39k61l71l78j34n1k56k03L38
57716C23627O70K06n35p47n75o73r61p53N0P29P29K00m20q39q92n94k21l5L5J75
57696C19176K83J46k26p26j414k291k979l092k776k526k495k314j598l84Q98J853
$$ plain form
57680 299535 302127 305934 312054 321436 334265 350240 369095 390598 414442 440697 470196 503915
57668 503915 541899 583053 625605 667081 703886 731792 747367 748928 736422 711151 675757 633822
57656 633822 588986 544396 502668 465575 433514 405819 381862 361503 344449 329884 317151
57645 317151 306372 297956 291799 287270 283694 280570 277598 274858 272816 271863 271901 272390 272600 271912 270271
57630 270271 268424 267232 266586 265476 263397 261123 259638 258752 257343 254780 251534 248481 246127 244582 243805
57615 243805 243563 243319 242459 240751 238506 236190 233895 231399 228826 226928 226409 227115 228209 228998 229191 228645
57599 228645 227467 226320 225918 226050 225667 224174 222086 220216 218778 217554 216362 214965 213032 210686 208656
57584 208656 207387 206402 204967 203043 201033 198981 196669 194349 192728 192227 192640 193442 194012 193699 192231 190030
$$ packed form
57680B99535K592L807O120R382J2829J5975J8855K1503K3844K6255K9499L3719
57668E03915L7984M1154M2552M1476L6805K7906J5575J561j2506k5271l5394m1935
57656F33822m4836m4590m1728l7093l2061k7695k3957k0359j7054j4565j2733
57645C17151j0779q416o157m529l576l124k972k740k042r53L8M89K10o88j641
57630B70271j847j192o46j110k079k274j485q86j409k563l246l053k354j545p77
57615B43805k42k44q60j708k245k316k295k496k573j898n19P06J094P89J93n46
57599B28645j178j147m02J32l83j493k088j870j438j224j192j397j933k346k030
57584B08656j269r85j435j924k010k052k312k320j621n01M13Q02N70l13j468k201
$$ plain form
57568 190030 187742 185468 182946 180356 178360 177219 176387 175186 173545 171884 170660 170262 171007 172836 175148
57553 175148 177204 178728 180026 181599 183736 186297 188714 190242 190501 189856 189192 189142 189551 189714 189126 187946
57537 187946 186749 186000 185878 186473 187895 190082 192629 194949 196678 197931 199115 200435 201569 201978 201589
57522 201589 200958 200658 200740 201002 201494 202359 203355 204068 204565 205339 206511 207577 208151 208478 208917 209288 209137 208421
57504 208421 207580 206998 206643 206153 205164 203656 202139 201280 201198 201248 200680 199326 197528 195617 193670 191563 189096
57487 189096 186225 183382 181364 180666 181001 181684 182339 183064 184029 185134 186030 186395 186298 186300 186916 187872 188170 187173
57469 187173 185346 183671 182539 181579 180425 179227 178389 178104 178248 178540 178744 178845 178996 179244 179385 179203 178754
57452 178754 178272 177914 177749 177862 178229 178588 178718 178853 179555 181054 182914 184428 185220 185330 184935 184282 183930 184685
$$ packed form
57568A90030k288k274k522k590j996j141q32j201j641j661j224l98P45J829K312
57553A75148K056J524J298J573K137K561K417J528K59o45o64n0M09J63n88j180
57537A87946j197p49j22N95J422K187K547K320J729J253J184J320J134M09l89
57522B01589o31l00Q2K62M92Q65R96P13M97P74J172J066N74L27M39L71j51p16
57504B08421q41n82l55m90r89j508j517q59q2N0n68j354j798j911j947k107k467
57487A89096k871k843k018o98L35O83O55P25R65J105Q96L65r7KO16R56K98r97
57469A87173j827j675j132r60j154j198q38k85J44K92K04J01J51K48J41j82m49
57452A78754m82l58j65J13L67L59J30J35P02J499J860J514P92J10l95o53l52P55
$$ plain form
57434 184685 186899 189919 192548 194138 194957 195420 195443 194869 194108 193795 193978 194149 194065 194011 194258 194721 195244 195769
57416 195769 196134 196130 195910 195973 196573 197424 198119 198534 198799 199282 200586 203042 205996 208103 208558 207713 206366 204929
57398 204929 203522 202342 201571 201195 201163 201447 201837 202093 202420 203314 204836 206630 208812 212095 216665 221636
57382 221636 226110 230084 233751 236568 237875 237984 237839 237852 237789 237576 237492 237601 237646 237500 237315 237277 237519 238124 238924
57363 238924 239587 240166 241137 242527 243584 243873 244133 245291 247097 248570 249397 249967 250317 250140 249777 250158 251537
57346 251537 253158 254388 255386 256429 257249 257427 256932 256054 255286 255355 256769 259102 261270 262714 263876 265324
57330 265324 266972 268403 269499 270350 270870 270859 270329 269640 269350 269832 270873 271783 272192 272534 273421 274824 276337
57313 276337 277947 279821 281481 282035 281362 280444 280410 281720 284253 287506 290643 293024 294794 296395 297540
$$ packed form
57434A84685K214L020K629J590Q19M63K3n74p61l13J83J71q4n4K47M63N23N25
57416A95769L65mk20O3O00Q51O95M15K65M83J304K456K954K107M55q45j347j437
57398B04929j407j180p71l76l2K84L90K56L27Q94J522J794K182L283M570M971
57382B21636M474L974L667K817J307J09j45J3o3k13q4J09M5j46j85l8K42O05Q00
57363B38924O63N79R71J390J057K89K60J158J806J473Q27N70L50j77l63L81J379
57346B51537J621J230R98J043Q20J78m95q78p68O9J414K333K168J444J162J448
57330B65324J648J431J096Q51N20j1n30o89k90M82J041R10M09L42Q87J403J513
57313B76337J610J874J660N54o73r18l4J310K533L253L137K381J770J601J145
$$ plain form
57298 297540 297525 296641 296326 297553 299859 302420 305241 308663 312379 315734 318611 321346 324049 326647 329360
57283 329360 332488 335736 338347 340057 341561 343815 346994 350308 352913 354895 357171 360354 364095 367799
57269 367799 371567 375898 380669 385118 388752 391648 393902 395525 396980 399099 402180 405727 409263 412864
57255 412864 416736 420879 425396 430473 435782 440522 444324 447642 451052 454772 459047 464227 470120 475958
57241 475958 481375 486710 492037 496783 500884 505398 511203 517772 524120 530275 536842 543581 549612 554916
57227 554916 560569 567348 574837 582049 588356 593775 598927 604861 612460 621857 632625 644358 656721
57214 656721 669257 681750 694742 709105 724977 741565 758073 774527 791553 809683 829047
57203 829047 849553 871176 894009 918071 943200 969306 996565 1025004 1053954 1082415 1110102
$$ packed form
57298B97540j5q84l15J227K306K561K821L422L716L355K877K735K703K598K713
57283C29360L128L248K611J710J504K254L179L314K605J982K276L183L741L704
57269C67799L768M331M771M449L634K896K254J623J455K119L081L547L536L601
57255D12864L872M143M517N077N309M740L802L318L410L720M275N180N893N838
57241D75958N417N335N327M746M101M514N805O569O348O155O567O739O031N304
57227E54916N653O779P489P212O307N419N152N934P599R397J0768J1733J2363
57214F56721J2536J2493J2992J4363J5872J6588J6508J6454J7026J8130J9364
57203H29047K0506K1623K2833K4062K5129K6106K7259K8439K8950K8461K7687
$$ plain form
57192 1110102 1137671 1165893 1195145 1225844 1258525 1293066 1328557 1364547 1401843 1441434 1483161
57181 1483161 1526184 1570297 1615855 1662657 1709811 1756712 1803469 1850344 1897384 1944733 1992870
57170 1992870 2042533 2094709 2150378 2209702 2271574 2334527 2398049 2462600 2528638 2596290 2665791
57159 2665791 2737457 2811035 2885785 2961382 3038205 3116464 3195421 3273774 3350582 3425697 3499390
57148 3499390 3571681 3641972 3709497 3774204 3836869 3898085 3957388 4013737 4066562 4115954 4162082
57137 4162082 4205036 4245209 4283445 4320713 4357897 4395791 4435126 4476747 4521788 4571295 4625484
57126 4625484 4683856 4746194 4812601 4881997 4951344 5017373 5078698 5135609 5188465 5237630 5284965
57115 5284965 5334348 5390407 5457097 5536976 5630710 5737068 5854261 5981818 6121317 6276162
$$ packed form
57192A110102K7569K8222K9252L0699L2681L4541L5491L5990L7296L9591M1727
57181A483161M3023M4113M5558M6802M7154M6901M6757M6875M7040M7349M8137
57170A992870M9663N2176N5669N9324O1872O2953O3522O4551O6038O7652O9501
57159B665791P1666P3578P4750P5597P6823P8259P8957P8353P6808P5115P3693
57148C499390P2291P0291O7525O4707O2665O1216N9303N6349N2825M9392M6128
57137D162082M2954M0173L8236L7268L7184L7894L9335M1621M5041M9507N4189
57126D625484N8372O2338O6407O9396O9347O6029O1325N6911N2856M9165M7335
57115E284965M9383N6059O6690P9879R3734J06358J17193J27557J39499J54845
$$ plain form
57105 6276162 6451730 6655670 6897246 7186550 7535339 7958999 8477484 9114894 9898666
57096 9898666 10857976 12020409 13408379 15037683 16917934 19053375 21444685 24092474
57088 24092474 26999472 30168298 33597275 37278675 41198068 45330841 49637381 54059376
57080 54059376 58509477 62844890 66838345 70183267 72555374 73705807 73531661 72089051
57072 72089051 69555654 66172508 62190422 57834023 53287199 48695348 44173825 39814289
57064 39814289 35687951 31847919 28330623 25155713 22326121 19830373 17646528 15745784
57056 15745784 14095367 12661520 11412333 10319420 9358186 8507456 7749182 7068505 6453931
57047 6453931 5896965 5390981 4930266 4510041 4126936 3778729 3463473 3179094 2923580
$$ packed form
57105F276162J75568K03940K41576K89304L48789M23660N18485O37410P83772
57096I898666R59310J162433J387970J629304J880251K135441K391310K647789
57088B4092474K906998L168826L428977L681400L919393M132773M306540M421995
57080E4059376M450101M335413L993455L344922K372107J150433j74146j442610
57072G2089051k533397l383146l982086m356399m546824m591851m521523m359536
57064C9814289m126338l840032l517296l174910k829592k495748k183845j900744
57056A5745784j650417j433847j249187j092913r61234q50730p58274o80677o14574
57047F453931n56966n05984m60715m20225l83105l48207l15256k84379k55514
$$ plain form
57038 2923580 2695026 2491573 2311745 2154738 2019707 1904722 1806942 1723961 1654601 1598610
57028 1598610 1556343 1528776 1516609 1518246 1528378 1538626 1539605 1523216 1484860 1424982 1348688 1263223
57016 1263223 1175251 1089733 1009915 937231 871327 811101 756073 706603 662899 624316 589717
57005 589717 558227 529512 503616 480670 460556 442719 426428 411323 397517 385086 373715
56994 373715 363091 353430 345226 338516 332810 327810 323891 321633 321251 322744 326226 331551 337672 342903
56980 342903 345863 345794 342084 334177 322275 307586 291527 275040 258929 244293 232013 222161 214536
56967 214536 209553 207954 209733 213967 219830 227298 236786 248527 262433 278071 294491 310313 324117
56954 324117 334648 340732 341519 336940 327695 314644 298587 280691 262649 246071 231874 220433
$$ packed form
57038B923580k28554k03453j79828j57007j35031j14985r7780q2981o9360n5991
57028A598610m2267k7567j2167J637J0132J0248R79j6389l8356n9878p6294q5465
57016A263223q7972q5518p9818p2684o5904o0226n5028m9470m3704l8583l4599
57005E89717l1490k8715k5896k2946k0114j7837j6291j5105j3806j2431j1371
56994C73715j0624r661q204o710n706n000l919k258l82J493L482N325O121N231
56980C42903K960o9l710p907j1902j4689j6059j6487j6111j4636j2280r852p625
56967B14536m983j599J779M234N863P468R488J1741J3906J5638J6420J5822J3804
56954C24117J0531O084P87m579r245j3051j6057j7896j8042j6578j4197j1441
$$ plain form
56942 220433 211943 206379 203423 202914 205270 211143 220716 233614 249390 267689 287951 309313 330914
56929 330914 351823 370358 383738 389084 385112 372822 354505 332259 307451 281215 254960 230225
56917 230225 208171 189173 172743 157936 144163 131779 121602 113750 107301 101335 95994 92079
56905 92079 89825 88618 87958 88129 89631 92349 95735 99661 104646 111160 118988 127533 136591 146568 157955
56890 157955 170854 185161 200890 218029 236112 254260 271604 287314 300184 308708 311937 310060
56878 310060 304000 294772 283552 272003 261911 254504 250409 250140 254121 262259 274018 289069 307570
56865 307570 329784 355823 385950 420622 459806 502342 546104 588533 626729 657335 676982
56854 676982 683362 676147 657127 629621 597646 565155 535477 510910 492621 481068 476679 479982
$$ packed form
56942B20433q490n564k956n09K356N873R573J2898J5776J8299K0262K1362K1601
56929C30914K0909J8535J3380N346l972j2290j8317k2246k4808k6236k6255k4735
56917B30225k2054j8998j6430j4807j3773j2384j0177p852o449n966n341l915
56905I2079k254j207o60J71J502K718L386L926M985O514P828Q545R058R977J1387
56890A57955J2899J4307J5729J7139J8083J8148J7344J5710J2870Q524L229j877
56878C10060o060r228j1220j1549j0092p407m095k69L981Q138J1759J5051J8501
56865C07570K2214K6039L0127L4672L9184M2536M3762M2429L8196L0606J9647
56854F76982O380p215j9020k7506l1975l2491k9678k4567j8289j1553m389L303
$$ plain form
56842 479982 491036 509095 533325 563732 601012 645526 696908 754566 817741 884491 950759
56831 950759 1010732 1058106 1087360 1094929 1080204 1045635 995674 935568 870901 807152 748564 697278
56819 697278 653931 618990 593041 576099 567569 567071 574742 590449 613325 642342 676854 716126
56807 716126 758634 801973 842853 876735 898208 902917 889560 859916 817348 765864 710085 654640
56795 654640 602749 555744 514237 479190 451380 430466 415365 405444 400808 401548 407324 417704
56783 417704 432340 450587 471286 492957 513781 531207 542082 543697 534885 516197 489407 456998
56771 456998 421664 385737 350834 317978 287828 260625 236236 214573 195876 180288 167302
56760 167302 156026 146011 137391 130096 123346 116320 109115 102640 97594 93857 90919 88483 86401 84343
$$ packed form
56842D79982J1054J8059K4230L0407L7280M4514N1382N7658O3175O6750O6268
56831I50759N9973M7374K9254P569j4725l4569m9961o0106o4667o3749n8588n1286
56819F97278m3347l4941k5949j6942q530m98P671J5707K2876K9017L4512L9272
56807G16126M2508M3339M0880L3882K1473M709j3357k9644m2568n1484n5779n5445
56795F54640n1891m7005m1507l5047k7810k0914j5101r921m636P40N776J0380
56783D17704J4636J8247K0699K1671K0824J7426J0875J615q812j8688k6790l2409
56771D56998l5334l5927l4903l2856l0150k7203k4389k1663j8697j5588j2986
56760A67302j1276j0015q620p295o750p026p205o475n046l737k938k436k082k058
$$ plain form
56746 84343 81988 79495 77403 75944 74818 73759 72977 72756 72898 72948 72794 72668 72595 72275 71524 70548 69713 69321
56728 69321 69576 70432 71423 72047 72341 72734 73233 73330 72922 72783 73647 75220 76650 77679 78699 79802 80460 80332
56710 80332 79886 79899 80649 81796 82904 83896 85107 86953 89453 92043 94009 95107 95608 95766 95518 94808 93972
56693 93972 93599 94047 95185 96561 97782 98818 99931 101276 102648 103791 104830 106103 107577 108773 109429
56678 109429 109897 110632 111563 112308 112856 113610 114745 115888 116574 116693 116374 115657 114539 113185 111882 110842 110173
56661 110173 109925 109948 109902 109689 109778 110720 112316 113655 114098 113864 113470 113018 112389 111850 111920 112696 113688 114358 114515
56642 114515 114205 113514 112578 111582 110694 110157 110329 111355 112812 114048 114871 115612 116456 117078 117060 116386 115411 114591
56624 114591 114338 114794 115581 116029 115865 115429 115116 114852 114350 113612 112874 112225 111617 111192 111357 112363 113840 114839
$$ packed form
56746H4343k355k493k092j459j126j059p82k21J42N0j54j26p3l20p51r76q35l92
56728F9321K55Q56R91O24K94L93M99R7m08j39Q64J573J430J029J020J103O58j28
56710H0332m46J3P50J147J108R92J211J846K500K590J966J098N01J58k48p10q36
56693I3972l73M48J138J376J221J036J113J345J372J143J039J273J474J196O56
56678A09429M68P35R31P45N48P54J135J143O86J19l19p17j118j354j303j040o69
56661A10173k48K3m6k13Q9R42J596J339M43k34l94m52o29n39P0P76R92O70J57
56642A14515l10o91r36r96q88n37J72J026J457J236Q23P41Q44O22j8o74r75q20
56624A14591k53M56P87M48j64m36l13k64n02p38p38o49o08m25J65J006J477R99
$$ plain form
56606 114839 114555 113140 111657 110981 110917 110613 109664 108443 107574 107620 109094 111998 115317 117710 118948 119959
56590 119959 121283 122323 122550 122597 123430 125010 126602 127912 129149 130194 130562 130116 129241 128393 127927 128186 129245
56573 129245 130759 132530 134956 138389 142348 146111 149783 154030 158950 164096 169596 176288 184535 193683
56559 193683 202976 212345 221958 231580 240683 248753 255200 259450 261468 261857 261212 259713 257484 254884 252197
56544 252197 249458 246810 244637 243014 241479 239693 237988 236806 235824 234100 231024 226799 222061 217299
56530 217299 212769 208721 205518 203362 201921 200394 198178 195442 192883 190962 189510 187976 185849 183004
56516 183004 179904 177374 175847 174913 173862 172500 171055 169520 167616 165382 163273 161614 160380 159539 159135
56501 159135 158978 158668 158045 157211 156141 154721 153186 151985 151187 150564 150309 150990 152599 154307 155455 156252
$$ packed form
56606A14839k84j415j483o76o4l04r49j221q69M6J474K904L319K393J238J011
56590A19959J324J040K27M7Q33J580J592J310J237J045L68m46q75q48m66K59J059
56573A29245J514J771K426L433L959L763L672M247M920N146N500O692Q247R148
56559A93683R293R369R613R622R103Q070O447M250K018L89o45j499k229k600k687
56544B52197k739k648k173j623j535j786j705j182r82j724l076m225m738m762
56530B17299m530m048l203k156j441j527k216k736k559j921j452j534k127k845
56516A83004l100k530j527r34j051j362j445j535j904k234k109j659j234q41m04
56501A59135j57l10o23q34j070j420j535j201p98o23k55O81J609J708J148P97
$$ plain form
56485 156252 157171 158251 159358 160544 161659 162067 161337 159896 158541 157563 156814 156318 156268 156550 156796 156937 157330
56468 157330 158301 159814 161575 163239 164544 165404 165879 166076 166135 166195 166172 165681 164598 163648 163886 165460 167402
56451 167402 168851 169959 171244 172578 173385 173534 173503 173779 174460 175364 176173 176582 176529 176225 175803 175190 174498 174270
56433 174270 175024 176665 178563 180079 180850 180778 179945 178444 176284 173703 171558 170880 171779 173212 174080 174281
56417 174281 174482 175266 176786 178816 180720 181733 181698 181314 181341 181866 182681 183930 185824 187960 189516 190096 189953
56400 189953 189553 189292 189530 190435 191751 193057 194251 195529 196986 198500 199964 201389 202822 204284 205655
56385 205655 206539 206498 205653 204828 204861 205898 207476 209026 210112 210562 210609 210629 210552 209973 209130 209201 211061 214150 217157
56366 217157 219530 221656 223743 225313 225902 225729 225504 225874 227082 228880 230755 232418 233972 235472 236630
$$ packed form
56485A56252R19J080J107J186J115M08p30j441j355r78p49m96n0K82K46J41L93
56468A57330R71J513J761J664J305Q60M75J97N9O0k3m91j083r50K38J574J942
56451A67402J449J108J285J334Q07J49l1K76O81R04Q09M09n3l04m22o13o92k28
56433A74270P54J641J898J516P71p2q33j501k160k581k145o78Q99J433Q68K01
56417A74281K01P84J520K030J904J013l5l84K7N25Q15J249J894K136J556N80j43
56400A89953m00k61K38R05J316J306J194J278J457J514J464J425J433J462J371
56385B05655Q84m1q45q25L3J037J578J550J086M50M7K0p7n79q43P1J860L089L007
56366B17157K373K126K087J570N89j73k25L70J208J798J875J663J554J500J158
$$ plain form
56351 236630 237346 238156 239670 241735 243658 245107 246230 247014 247198 246972 247177 248465 250582 252746 254572 256425
56335 256425 258929 262274 266028 269603 272832 275935 278996 281817 284421 287319 290964 295131 299074 302201
56321 302201 304419 305989 307174 307899 307807 306910 306098 306445 308011 309922 311756 314023 316964 319804 321805 323336
56305 323336 325141 327255 329538 332694 337579 343775 349915 355387 360790 366690 372833 378748 384337 389647
56291 389647 394671 399634 404969 410866 417218 424052 431594 439912 448888 458478 468653 479208 490095
56278 490095 501701 514297 527479 540774 554544 569562 585944 603354 622127 643180 666726
56267 666726 692043 718791 747755 779923 815490 854142 895783 940723 989751 1044258 1105822
56256 1105822 1175394 1253310 1340144 1436902 1544214 1662037 1790507 1930427 2082404 2245971
$$ packed form
56351B36630P16Q10J514K065J923J449J123P84J84k26K05J288K117K164J826J853
56335B56425K504L345L754L575L229L103L061K821K604K898L645M167L943L127
56321C02201K218J570J185P25r2q97q12L47J566J911J834K267K941K840K001J531
56305C23336J805K114K283L156M885O196O140N472N403N900O143N915N589N310
56291C89647N024M963N335N897O352O834P542Q318Q976R590J0175J0555J0887
56278D90095J1606J2596J3182J3295J3770J5018J6382J7410J8773K1053K3546
56267F66726K5317K6748K8964L2168L5567L8652M1641M4940M9028N4507O1564
56256A105822O9572P7916Q6834R6758J07312J17823J28470J39920J51977J63567
$$ plain form
56246 2245971 2419951 2603244 2794702 2992431 3193624 3394976 3593024 3784202 3964743
56237 3964743 4130495 4276982 4400030 4496470 4564060 4600936 4605719 4578266 4519955 4433185 4321011
56226 4321011 4187180 4035839 3870908 3696034 3515037 3331711 3148857 2968058 2790722
56217 2790722 2618919 2454868 2299965 2154592 2018581 1891609 1773424 1663992 1563329
56208 1563329 1471157 1386903 1309994 1239845 1175612 1116434 1062006 1012543 968106 928234 892220
56197 892220 859341 828877 800445 774388 751287 730938 712291 694564 677963 663103 650218
56186 650218 639146 629628 621294 613637 606316 599314 592685 586390 580498 575273 570923 567378 564369 561675
56172 561675 559437 558334 559064 561369 564016 566213 568618 572221 576715 580961 584929 590023 597253 606048
$$ packed form
56246B245971J73980J83293J91458J97729K01193K01352J98048J91178J80541
56237C964743J65752J46487J23048R6440O7590L6876M783k7453n8311q6770j12174
56226D321011j33831j51341j64931j74874j80997j83326j82854j80799j77336
56217B790722j71803j64051j54903j45373j36011j26972j18185j09432j00663
56208A563329r2172q4254p6909p0149o4233n9178n4428m9463m4437l9872l6014
56197H92220l2879l0464k8432k6057k3101k0349j8647j7727j6601j4860j2885
56186F50218j1072r518q334p657p321p002o629o295n892n225m350l545l009k694
56172E61675k238j103P30K305K647K197K405L603M494M246L968N094P230Q795
$$ plain form
56158 606048 615244 624443 633954 644125 655349 668291 683556 701230 720985 742532 765958 791940
56146 791940 821604 855781 894447 937264 984564 1037288 1096037 1160664 1230582 1304657 1380703
56135 1380703 1455855 1527695 1594759 1656125 1711234 1760136 1803247 1840739 1872676 1899639 1922449
56124 1922449 1941197 1955027 1962782 1963409 1956186 1941508 1921230 1897152 1869078 1835230 1794413 1746712
56112 1746712 1692281 1630956 1563564 1492588 1421118 1351838 1286970 1227938 1174757 1126736 1084060
56101 1084060 1047725 1017825 993180 972895 956990 945055 935690 927834 921553 916929 913390 910715
56089 910715 909487 909829 910854 912130 914506 918602 923553 928263 932986 938688 945578 953217 961418 970181
56075 970181 979302 988776 999076 1010462 1022570 1035119 1048359 1062395 1076839 1091498 1106616 1122174
$$ packed form
56158F06048R196R199R511J0171J1224J2942J5265J7674J9755K1547K3426K5982
56146G91940K9664L4177L8666M2817M7300N2724N8749O4627O9918P4075P6046
56135A380703P5152P1840O7064O1366N5109M8902M3111L7492L1937K6963K2810
56124A922449J8748J3830P755O27p223j4678k0278k4078k8074l3848m0817m7701
56112A746712n4431o1325o7392p0976p1470o9280o4868n9032n3181m8021m2676
56101A084060l6335k9900k4645k0285j5905j1935r365p856o281m624l539k675
56089I10715j228L42J025J276K376M096M951M710M723N702O890P639Q201Q763
56075I70181R121R474J0300J1386J2108J2549J3240J4036J4444J4659J5118J5558
$$ plain form
56063 1122174 1137866 1154055 1171558 1190178 1208658 1226553 1244795 1263872 1282978 1301601 1320408
56052 1320408 1339587 1357882 1374482 1390524 1407504 1425377 1443463 1462003 1481494 1501499 1521547
56041 1521547 1542378 1565063 1589594 1615388 1642376 1670576 1699527 1729154 1760327 1793625 1828474
56030 1828474 1864379 1901835 1941048 1981051 2021303 2062956 2107249 2153730 2201347 2250250 2301206
56019 2301206 2354234 2409111 2466358 2526626 2589986 2656712 2727569 2802410 2879841 2959280 3041940
56008 3041940 3128823 3219418 3313525 3412506 3517379 3627442 3742246 3863117 3991247 4126191
55998 4126191 4267842 4417846 4577326 4745327 4921445 5107826 5306542 5517212 5739470
55989 5739470 5975588 6228246 6497905 6784912 7092021 7422377 7777318 8158834 8571828
$$ packed form
56063A122174J5692J6189J7503J8620J8480J7895J8242J9077J9106J8623J8807
56052A320408J9179J8295J6600J6042J6980J7873J8086J8540J9491K0005K0048
56041A521547K0831K2685K4531K5794K6988K8200K8951K9627L1173L3298L4849
56030A828474L5905L7456L9213M0003M0252M1653M4293M6481M7617M8903N0956
56019B301206N3028N4877N7247O0268O3360O6726P0857P4841P7431P9439Q2660
56008C041940Q6883R0595R4107R8981J04873J10063J14804J20871J28130J34944
55998D126191J41651J50004J59480J68001J76118J86381J98716K10670K22258
55989E739470K36118K52658K69659K87007L07109L30356L54941L81516M12994
$$ plain form
55980 8571828 9021262 9509612 10039975 10619002 11253897 11949707 12712992 13555061 14488369
55971 14488369 15523717 16675457 17966290 19423635 21077198 22967201 25153033 27712026
55963 27712026 30740619 34370224 38780564 44186165 50803108 58820347 68379711 79558498
55955 79558498 92368121 106781489 122768782 140321195 159483134 180397763 203278595
55948 203278595 228202200 254768848 281838240 307512130 329368604 344873421 351918416
55941 351918416 349388689 337527196 317871472 292777618 264794257 236161657 208544787
55934 208544787 182975896 159946622 139575612 121767064 106313714 92959629 81448671
55927 81448671 71551928 63064396 55792163 49554566 44193899 39574642 35576942 32097883
$$ packed form
55980H571828M49434M88350N30363N79027O34895O95810P63285Q42069R33308
55971A4488369J035348J151740J290833J457345J653563J890003K185832K558993
55963B7712026L028593L629605M410340N405601O616943Q017239R559364J1178787
55955G9558498J2809623J4413368J5987293J7552413J9161939K0914629K2880832
55948B03278595K4923605K6566648K7069392K5673890K1856474J5504817P044995
55941C51918416k529727j1861493j9655724k5093854k7983361k8632600k7616870
55934B08544787k5568891k3029274k0371010j7808548j5453350j3354085j1510958
55927H1448671r896743q487532p272233o237597n360667m619257l997700l479059
$$ plain form
55919 32097883 29055437 26383649 24024835 21929984 20062166 18392708 16895104 15546264
55911 15546264 14330159 13234526 12245436 11349114 10536722 9802554 9139013 8537400 7991961
55902 7991961 7498799 7051819 6643622 6269614 5927745 5615010 5327424 5062629 4819414
55893 4819414 4595262 4387222 4194460 4017227 3853906 3701629 3559152 3426683 3303512
55884 3303512 3188245 3080742 2981420 2888998 2801025 2716161 2634015 2553403 2472901 2392745 2314360
55873 2314360 2238444 2165152 2095378 2029916 1967826 1907482 1848858 1793257 1741277 1692548 1646906
55862 1646906 1604274 1563868 1524927 1487633 1452125 1417456 1382861 1349093 1317050 1286173 1255752
55851 1255752 1226596 1199516 1173228 1145882 1117822 1090701 1064564 1038108 1011374 985856 962025
$$ packed form
55919C2097883l042446k671788k358814k094851j867818j669458j497604j348840
55911A5546264j216105j095633r89090q96322q12392p34168o63541o01613n45439
55902G991961m93162m46980m08197l74008l41869l12735k87586k64795k43215
55893D819414k24152k08040j92762j77233j63321j52277j42477j32469j23171
55884C303512j15267j07503r9322r2422q7973q4864q2146q0612q0502q0156p8385
55873B314360p5916p3292o9774o5462o2090o0344n8624n5601n1980m8729m5642
55862A646906m2632m0406l8941l7294l5508l4669l4595l3768l2043l0877l0421
55851A255752k9156k7080k6288k7346k8060k7121k6137k6456k6734k5518k3831
$$ plain form
55840 962025 938871 915943 893965 873357 853908 835960 820240 806334 792878 779400 766613
55829 766613 754859 743660 732842 722702 713071 703501 694290 685999 678030 669113 659153 649202 639679
55816 639679 630054 620279 611033 602385 593700 585085 577535 571369 565834 560605 556406 553772 552284 551483
55802 551483 551631 553189 556283 560782 566121 571113 574857 577803 580960 584222 586586 587859 588721 589049 587687
55787 587687 584258 579864 575490 570945 565926 560938 556383 551666 546026 539587 533041 526894 521610 517919
55773 517919 516486 517618 521588 528631 538216 548761 558374 565500 568762 566873 559257 546491 529933
55760 529933 511155 491756 473142 456119 440829 427084 414566 402854 391678 381096 371138 361542
55748 361542 352245 343840 336983 331595 327192 323684 321215 319469 317880 316276 314680 312848 310798 309312
$$ packed form
55840I62025k3154k2928k1978k0608j9449j7948j5720j3906j3456j3478j2787
55829G66613j1754j1199j0818j0140r631r570r211q291p969q917r960r951r523
55816F39679r625r775r246q648q685q615p550o166n535n229m199k634j488q01
55802E51483J48J558L094M499N339M992L744K946L157L262K364J273Q62L28j362
55787E87687l429m394m374m545n019m988m555m717n640o439o546o147n284l691
55773E17919j433J132L970P043R585J0545R613P126L262j889p616j2766j6558
55760E29933j8778j9399j8614j7023j5290j3745j2518j1712j1176j0582r958r596
55748C61542r297q405o857n388m403l508k469j746j589j604j596j832k050j486
$$ plain form
55734 309312 308850 308284 305943 301798 297301 293123 288485 283054 278029 274511 271893 268768 264800 260889 257906
55719 257906 255898 254343 252747 251169 250340 251000 253107 256067 259741 264604 270789 277472 283427 287776 290066
55704 290066 290115 288040 284183 278940 272826 266439 260026 253339 246390 239938 234613 229997 225350 220883 217363
55689 217363 214816 212712 211239 211093 212044 212950 213438 214326 216164 218531 221140 224409 228343 231903 234180
55674 234180 235308 235721 235382 234323 233037 231680 229715 227050 224787 224053 224665 225579 226130 226227 225927 225522 225598
55657 225598 226401 227524 228654 230118 232219 234575 236643 238400 240043 241527 242873 244323 245676 246135 245339
55642 245339 243949 242575 240844 238212 235032 231892 228388 223598 217472 210928 204722 199043 193979 189600
55628 189600 185636 181798 178293 175384 172576 168996 164585 160216 156620 153822 151695 150398 150014 150181 150257
$$ packed form
55734C09312m62n66k341m145m497m178m638n431n025l518k618l125l968l911k983
55719B57906k008j555j596j578q29O60K107K960L674M863O185O683N955M349K290
55704B90066M9k075l857n243o114o387o413o687o949o452n325m616m647m467l520
55689B17363k547k104j473j46R51R06M88Q88J838K367K609L269L934L560K277
55674B34180J128M13l39j059j286j357j965k665k263p34O12R14N51R7l00m05P6
55657B25598Q03J123J130J464K101K356K068J757J643J484J346J450J353M59p96
55642B45339j390j374j731k632l180l140l504m790o126o544o206n679n064m379
55628A89600l964l838l505k909k808l580m411m369l596k798k127j297l84J67P6
$$ plain form
55613 150257 149637 147994 145568 143217 141733 141027 140262 138804 136760 134613 132663 130927 129327 127867 126690
55598 126690 125942 125572 125379 125321 125483 125697 125501 124676 123511 122330 121110 119821 118767 118236 118091 118071 118241 118815
55580 118815 119790 121077 122740 124759 126844 128857 131072 133657 136219 138385 140489 143083 145989 148425
55566 148425 149966 150812 151222 151249 151026 150712 150061 148596 146356 143978 141903 139904 137629 135210 133060 131308
55550 131308 129742 128197 126778 125695 125000 124528 124107 123800 123827 124242 124806 125293 125697 126075 126350 126482 126653 126992
55532 126992 127266 127132 126679 126431 126691 127049 126694 125278 123377 121931 121110 120017 117730 114451 111213 108685
55516 108685 106830 105636 105363 105778 105892 104996 103504 102294 101625 101169 100732 100379 100044 99550 98830 97784 96123
55499 96123 93830 91581 90251 90029 90296 90210 89227 87436 85718 85223 86199 87631 88495 88962 89775 90834 91259
$$ packed form
55613A50257o20j643k426k351j484p06p65j458k044k147j950j736j600j460j177
55598A26690p48l70j93n8J62K14j96q25j165j181j220j289j054n31j45k0J70N74
55580A18815R75J287J663K019K085K013K215K585K562K166K104K594K906K436
55566A48425J541Q46M10K7k23l14o51j465k240k378k075j999k275k419k150j752
55550A31308j566j545j419j083o95m72m21l07K7M15N64M87M04L78K75J32J71L39
55532A26992K74j34m53k48K60L58l55j416j901j446q21j093k287l279l238k528
55516A08685j855j194k73M15J14q96j492j210o69m56m37l53l35m94p20j046j661
55499I6123k293k249j330k22K67q6r83j791j718m95R76J432Q64M67Q13J059M25
$$ plain form
55482 91259 90758 90068 89968 90525 91452 92509 93355 93597 93331 93232 93807 94853 95792 96255 96156 95516 94407 92865
55464 92865 90833 88473 86522 85875 86615 87829 88620 88982 89412 89969 90169 89760 89141 88829 88765 88466 87811 87258
55446 87258 87114 86936 86136 85010 84509 84934 85524 85566 85265 85100 84969 84583 84230 84408 85062 85912 87207 89261
55428 89261 91441 92584 92527 92275 92441 92427 91573 90359 89813 90180 90770 90960 90860 91061 92023 93600 95031 95553
55410 95553 95144 94537 94409 94768 95188 95365 95293 95052 94580 93545 91569 88788 86061 84243 83291 82524 81751 81596
55392 81596 82540 84160 85597 86388 86581 86370 85904 85249 84326 83151 82218 82215 83105 83861 83533 82296 81221 81196
55374 81196 82353 84173 85788 86420 86010 85335 85164 85409 85423 84960 84364 83918 83537 83244 83474 84547 86087 87310
55356 87310 87889 88255 88953 89892 90442 90225 89572 89056 88817 88568 88131 87632 87191 86752 86299 85953 85729 85442 84944
$$ packed form
55482I1259n01o90j00N57R27J057Q46K42k66r9N75J046R39M63r9o40j109j542
55464I2865k032k360j951o47P40J214P91L62M30N57K00m09o19l12o4k99o55n53
55446H7258j44j78q00j126n01M25N90M2l01j65j31l86l53J78O54Q50J295K054
55428H9261K180J143n7k52J66j4q54j214n46L67N90J90j00K01R62J577J431N22
55410I5553m09o07j28L59M20J77p2k41m72j035j976k781k727j818r52p67p73j55
55392H1596R44J620J437P91J93k11m66o55r23j175r33lQ90P56l28j237j075k5
55374H1196J157J820J615O32m10o75j71K45J4m63n96m46l81k93K30J073J540J223
55356H7310N79L66O98R39N50k17o53n16k39k49m37m99m41m39m53l46k24k87m98
$$ plain form
55337 84944 84200 83121 81757 80810 81398 83791 86689 88369 88434 87934 87840 88041 88013 87802 87868 88256 88501 88302 87876
55318 87876 87554 87367 87158 86921 86799 86837 86870 86616 85871 84673 83421 82664 82625 82966 83138 82953 82648 82442 82255
55299 82255 81898 81394 81053 81305 82376 83918 85018 84953 84013 83291 83537 84481 85345 85677 85499 85065 84766 84961
55281 84961 85564 86060 86264 86678 87634 88410 87900 86050 84026 82936 82980 83891 85490 87454 89058 89664 89341
55264 89341 88685 88130 87646 86998 86105 85102 84177 83410 82853 82672 82944 83341 83374 83223 83790 85466 87279 87970
55246 87970 87655 87611 88461 89473 89807 89566 89264 89029 88857 89014 89550 89827 89150 87648 86092 85045 84568 84494
55228 84494 84575 84579 84598 85039 85943 86628 86477 85866 85803 86740 88203 89444 90005 89733 88762 87593 86773 86396 86142 85788
55208 85788 85417 85150 84994 84983 85162 85453 85757 86170 86818 87507 87863 87838 87759 87863 88121 88540 89241 90125 90825 91208
$$ packed form
55337H4944p44j079j364r47N88K393K898J680O5n00r4K01k8k11O6L88K45j99m26
55318H7876l22j87k09k37j22L8L3k54p45j198j252p57l9L41J72j85l05k06j87
55299H2255l57n04l41K52J071J542J100o5r40p22K46R44Q64L32j78m34k99J95
55281H4961O03M96K04M14R56P76n10j850k024j090M4R11J599J964J604O06l23
55264H9341o56n55m84o48q93j003r25p67n57j81K72L97L3j51N67J676J813O91
55246H7970l15m4Q50J012L34k41l02k35j72J57N36K77o77j502j556j047m77p4
55228H4494Q1MJ9M41R04O85j51o11o3R37J463J241N61k72r71j169q20l77k54l54
55208H5788l71k67j56j1J79K91L04M13O48O89L56k5p9J04K58M19P01Q84P00L83
$$ plain form
55188 91208 91599 92228 92743 92661 92171 92048 92675 93446 93323 91840 89478 87155 85577 84965 85131 85653 86116 86362
55170 86362 86503 86674 86842 86949 87072 87283 87507 87726 88210 89202 90439 91392 91979 92647 93609 94433 94661 94502 94521
55151 94521 94835 94992 94556 93542 92337 91454 91342 92149 93570 95020 96003 96347 96277 96256 96588 97015 96906 96004
55133 96004 94842 94264 94660 95775 96992 97666 97439 96538 95624 95150 95020 95025 95268 95860 96499 96771 96685 96498 96170
55114 96170 95438 94356 93335 92683 92460 92738 93596 94908 96476 98298 100266 101762 102120 101513 100795 100396 99978
55097 99978 99358 99082 99682 100907 102160 103284 104404 105345 105827 106019 106335 106657 106337 105103 103615 102934 103610
55080 103610 105330 107291 108808 109727 110347 110932 111387 111469 111182 110767 110383 110009 109621 109303 109202 109509 110387 111702
55062 111702 112872 113277 112878 112227 111815 111578 111097 110097 108669 107206 106193 105904 106178 106609 106976 107305 107454
$$ packed form
55188I1208L91O29N15q2m90j23O27P71j23j483k362k323j578o12J66N22M63K46
55170H6362J41J71J68J07J23K11K24K19M84R92J237R53N87O68R62Q24K28j59J9
55151I4521L14J57m36j014j205q83j12Q07J421J450R83L44p0k1L32M27j09r02
55133I6004j162n78L96J115J217O74k27r01r14m74j30NK43N92O39K72q6j87l28
55114I6170p32j082j021o52k23K78Q58J312J568J822J968J496L58o07p18l99m18
55097I9978o20k76O00J225J253J124J120R41M82J92L16L22l20j234j488o81O76
55080A03610J720J961J517R19O20N85M55Q2k87m15l84l74l88l18j01L07Q78J315
55062A11702J170M05l99o51m12k37m81j000j428j463j013k89K74M31L67L29J49
$$ plain form
55045 107454 106988 105721 104179 103168 102962 103199 103491 103807 104140 104205 103732 102939 102480 102894 104137 105558 106303
55028 106303 105919 104716 103520 102972 103115 103589 104018 104162 103957 103616 103497 103654 103674 103182 102369 101739 101490 101494 101815
55009 101815 102729 104109 105202 105394 104928 104562 104598 104564 103974 103160 103171 104785 107712 110846 113318 115090 116444
54992 116444 117189 116784 115198 113240 111858 111348 111353 111392 111254 111037 110993 111248 111647 111983 112319 112769 112993 112427 111184
54973 111184 110228 110252 110738 110661 109878 109241 109436 110297 111313 112238 112930 113108 112703 112177 112050 112163 111843 110903 110071
54954 110071 110179 111091 111800 111588 110778 110201 110167 110220 109801 108845 107772 107146 107321 108157 109074 109643 110070 110819 111847
54935 111847 112709 113403 114449 115870 116849 116873 116728 117649 119776 122150 124044 125615 127303 129313 131828 135093
54919 135093 139019 143076 146829 150306 153774 157489 161736 166618 171564 175418 177297 177196 175626 172991
$$ packed form
55045A07454m66j267j542j011k06K37K92L16L33O5m73p93m59M14J243J421P45
55028A06303l84j203j196n48J43M74M29J44k05l41j19J57K0m92q13o30k49ML21
55009A01815R14J380J093J92m66l66L6l4n90q14J1J614K927L134K472J772J354
54992A16444P45m05j586j958j382n10NL9j38k17m4K55L99L36L36M50K24n66j243
54973A11184r56K4M86p7p83o37J95Q61J016R25O92J78m05n26j27J13l20r40q32
54954A10071J08R12P09k12q10n77l4N3m19r56j073o26J75Q36R17N69M27P49J028
54935A11847Q62O94J046J421R79K4j45R21K127K374J894J571J688K010K515L265
54919A35093L926M057L753L477L468L715M247M882M946L854J879j01j570k635
$$ plain form
54905 172991 169547 165652 161675 157735 153738 149613 145391 141172 137150 133563 130572 128254 126708 125971
54891 125971 125818 125880 126023 126321 126638 126568 125940 125138 124739 125082 126288 128414 131326 134761 138708 143475 149093
54874 149093 154974 160448 165431 170165 174533 178097 180654 182301 182935 182204 180069 176997 173412 169262 164333
54859 164333 158804 153281 148361 144278 140878 137845 134995 132402 130205 128327 126500 124531 122387 120093
54845 120093 117802 115900 114661 113661 111889 108786 105029 102019 100648 100766 101662 102684 103427 103720 103692 103654
54829 103654 103812 104188 104833 105840 107029 107908 108230 108393 108983 110062 111276 112515 113934 115278 115787 115144
54813 115144 114161 114005 114928 116147 116873 116965 116587 115767 114626 113683 113533 114252 115395 116500 117403 118046 118280 118009
54795 118009 117444 117022 117019 117324 117627 117764 117805 117829 117767 117533 117202 116970 116943 117053 117142 117102 116987 117063 117657 118816 120158
$$ packed form
54905A72991l444l895l977l940l997m125m222m219m022l587k991k318j546p37
54891A25971j53O2J43K98L17p0o28q02l99L43J206K126K912L435L947M767N618
54874A49093N881N474M983M734M368L564K557J647O34p31k135l072l585m150m929
54859A64333n529n523m920m083l400l033k850k593k197j878j827j969k144k294
54845A20093k291j902j239j000j772l103l757l010j371J18Q96J022P43K93k8l8
54829A03654J58L76O45J007J189Q79L22J63N90J079J214J239J419J344N09o43
54813A15144r83j56R23J219P26R2l78q20j141r43j50P19J143J105R03O43K34k71
54795A18009n65m22lL05L03J37M1K4o2k34l31k32k7J10Q9m0j15P6N94J159J342
$$ plain form
54774 120158 121279 122293 123789 126142 129048 131952 134879 138553 143581 149634 155654 160847 165305 169680
54760 169680 174463 179690 185020 189840 193405 195281 195654 194898 192891 189151 183704 177325 170719 163940 157032
54745 157032 150786 146202 143311 141097 138683 136144 134053 132639 131632 130682 129712 128916 128546 128675 129203 130169
54729 130169 131915 134665 138001 141037 143192 144595 145775 147241 149380 152425 156264 160418 164374 167875
54715 167875 170895 173408 175248 176095 175679 174157 172222 170554 169122 167209 164159 159904 154821 149396 144114
54700 144114 139413 135560 132666 130716 129405 128052 126142 124050 122742 122568 122662 121890 120113 118163 116773
54685 116773 115863 114893 113597 112255 111346 111024 110997 110930 110905 111279 112127 113017 113402 113130 112577 112340 112721 113346 113453
54666 113453 112840 112292 112639 113545 113860 113198 112424 112396 112945 113529 114159 115047 115836 116067 116118 116768 117880 118298 117323
$$ packed form
54774A20158J121J014J496K353K906K904K927L674N028O053O020N193M458M375
54760A69680M783N227N330M820L565J876L73p56k007l740n447o379o606o779o908
54745A57032o246m584k891k214k414k539k091j414j007r50r70p96l70J29N28R66
54729A30169J746K750L336L036K155J403J180J466K139L045L839M154L956L501
54715A67875L020K513J840Q47m16j522j935j668j432j913l050m255n083n425n282
54700A44114m701l853k894j950j311j353j910k092j308j74R4p72j777j950j390
54685A16773r10r70j296j342r09l22k7o7k5L74Q48Q90L85k72n53k37L81O25J07
54666A13453o13n48L47R06L15o62p74k8N49N84O30Q88P89K31N1O50J112M18r75
$$ plain form
54647 117323 115647 114496 114327 114744 115358 116205 117395 118746 119925 120752 121242 121383 121101 120518 120104 120322 121043
54630 121043 121501 121006 119711 118603 118691 120037 121525 121783 120579 119101 118547 118699 118458 117582 116967 117127 117360
54613 117360 116961 116361 116288 116495 116297 115854 115858 116221 116202 115801 115831 116432 116611 115738 114570 114191 114688 115490 116338 117202
54593 117202 117731 117597 117130 116934 117038 117023 116738 116321 115718 114917 114540 115335 116966 118099 117988 117331 117150 117444
54575 117444 117564 117421 117571 118214 118861 119110 119227 119630 120105 119892 118554 116642 115389 115594 116685 117121 116071
54558 116071 114481 113978 114812 115602 115332 114760 115209 116660 117995 118823 119930 121762 123510 124209 124045 123963 124500
54541 124500 125573 126988 128459 129378 129312 128680 128392 128811 129616 130553 131661 132641 132761 131799 130559 129939 129835
54524 129835 129473 128574 127637 127102 126811 126475 126227 126348 126674 126666 126083 125327 125002 125302 125860 126118 125787 125118 124766
$$ packed form
54647A17323j676j151j69M17O14Q47J190J351J179Q27M90J41k82n83m14K18P21
54630A21043M58m95j295j108Q8J346J488K58j204j478n54J52k41q76o15J60K33
54613A17360l99o00p3K07j98m43ML63j9m01L0O01J79q73j168l79M97Q02Q48Q64
54593A17202N29j34m67j96J04j5k85m17o03q01l77P95J631J133j11o57j81K94
54575A17444J20j43J50O43O47K49J17M03M75k13j338j912j253K05J091M36j050
54558A16071j590n03Q34P90k70n72M49J451J335Q28J107J832J748O99j64q2N37
54541A24500J073J415J471R19o6o32k88M19Q05R37J108R80J20r62j240o20j04
54524A29835l62q99r37n35k91l36k48J21L26qn83p56l25L00N58K58l31o69l52
$$ plain form
54505 124766 125229 126294 127178 127314 126856 126285 125803 125339 124917 124594 124179 123415 122416 121526 120882 120519 120788 121957
54487 121957 123418 124051 123692 123472 124285 125594 126338 126405 126433 126618 126639 126543 126806 127450 127887 127843 127798 128283 129171 129946
54467 129946 130324 130475 130832 131779 133288 134856 135959 136481 136519 136038 135126 134360 134355 135035 135804 136336 136689 136749 136234
54448 136234 135242 134204 133269 132318 131525 131199 131065 130536 129852 129999 131160 132174 132145 131772 132321 133880 135417
54431 135417 136182 136245 135927 135453 135059 134831 134553 134237 134554 136126 138484 140419 141365 141873 142633 143621 144365 144645
54413 144645 144664 144760 145062 145273 144849 143574 141863 140266 138889 137676 136977 137242 138160 138767 138620 138379 138948 140411
54395 140411 142113 143548 144800 146199 147775 149092 149601 149210 148462 148052 148215 148757 149435 150022 150119 149493 148685
54378 148685 148695 149760 150901 151144 150920 151680 154138 157431 160211 162151 164026 166499 169296 171772 173909
$$ packed form
54505A24766M63J065Q84J36m58n71m82m64m22l23m15p64r99q90o44l63K69J169
54487A21957J461O33l59k20Q13J309P44O7K8J85K1r6K63O44M37m4m5M85Q88P75
54467A29946L78J51L57R47J509J568J103N22L8m81r12p66nO80P69N32L53O0n15
54448A36234r92j038r35r51p93l26j34n29o84J47J161J014k9l73N49J559J537
54431A35417P65O3l18m74l94k28k78l16L17J572K358J935R46N08P60R88P44K80
54413A44645J9R6L02K11m24j275j711j597j377j213o99K65R18O07j47k41N69J463
54395A40411J702J435J252J399J576J317N09l91p48m10J63N42O78N87R7o26q08
54378A48685J0J065J141K43k24P60K458L293K780J940J875K473K797K476K137
$$ plain form
54363 173909 176342 179391 182492 184882 186536 187971 189197 189427 188101 185754 183438 181513 179496 177047
54349 177047 174502 172292 170333 168468 167083 166652 166801 166471 165184 163532 162136 160731 158781 156499 154531
54334 154531 152887 150986 148753 146878 145788 145095 144347 143663 143192 142561 141450 140270 139642 139516 139456 139565 140363
54317 140363 141845 143322 144324 144981 145424 145382 144690 143765 143218 143273 143733 144218 144266 143578 142523 142117 143086 145021
54299 145021 146716 147312 146914 146192 145611 145095 144273 142988 141570 140585 140345 140719 141426 142285 143087 143463 143140 142336
54281 142336 141686 141731 142509 143640 144682 145383 145640 145390 144706 144002 143918 144724 145905 146604 146527 146193 146217 146675 147312
54262 147312 148096 149190 150473 151511 152125 152711 153813 155481 157206 158422 158931 158934 158825 158977 159522 160205 160525
54245 160525 160190 159376 158478 157622 156590 155191 153554 152046 151084 151049 152101 153830 155258 155464 154250 152106
$$ packed form
54363A73909K433L049L101K390J654J435J226K30j326k347k316j925k017k449
54349A77047k545k210j959j865j385m31J49l30j287j652j396j405j950k282j968
54334A54531j644j901k233j875j090o93p48o84m71o31j111j180o28j26o0J09P98
54317A40363J482J477J002O57M43m2o92r25n47N5M60M85M8o88j055m06R69J935
54299A45021J695N96l98p22n81n16q22j285j418r85k40L74P07Q59Q02L76l23q04
54281A42336o50M5P78J131J042P01K57k50o84p04q4Q06J181O99p7l34K4M58O37
54262A47312P84J094J283J038O14N86J102J668J725J216N09Lj09J52N45O83L20
54245A60525l35q14q98q56j032j399j637j508r62l5J052J729J428K06j214k144
$$ plain form
54229 152106 149656 147355 145674 145196 146248 148479 150956 152783 153676 153914 153789 153160 151713 149606 147603
54214 147603 146416 146114 146362 146945 147741 148320 148169 147424 146939 147319 148181 148730 148847 149142 149973 150881 151229 151093
54196 151093 151146 151745 152516 152900 152819 152587 152420 152363 152582 153300 154352 155150 155350 155313 155648 156460 157311 157905 158523 159714
54176 159714 161649 163814 165319 165632 165073 164437 164043 163373 161854 159753 157914 156759 155909 154780 153222 151592
54160 151592 150528 150592 151727 153019 153456 153036 152693 153027 153663 154148 154827 156147 157482 157484 155665 152960 150511
54143 150511 148485 146449 144497 143462 144039 145992 148276 149755 149890 149014 148059 147860 148569 149676 150576 151081
54127 151081 151423 151888 152499 153058 153435 153806 154489 155499 156375 156631 156457 156734 158151 160383 162295 162924 162211
54110 162211 160881 159881 159925 161329 164040 167773 172100 176394 179981 182638 184842 187188 189568 191345 192381
$$ packed form
54229A52106k450k301j681m78J052K231K477J827Q93K38j25o29j447k107k003
54214A47603j187l02K48N83P96N79j51p45m85L80Q62N49J17K95Q31R08L48j36
54196A51093N3N99P71L84q1k32j67n7K19P18J052P98K00l7L35Q12Q51N94O18J191
54176A59714J935K165J505L13n59o36l94o70j519k101j839j155q50j129j558j630
54160A51592j064O4J135J292M37m20l43L34O36M85O79J320J335Kj819k705k449
54143A50511k026k036j952j035N77J953K284J479J35q76r55j99P09J107R00N05
54127A51081L42M65O11N59L77L71O83J010Q76K56j74K77J417K232J912O29p13
54110A62211j330j000M4J404K711L733M327M294L587K657K204K346K380J777J036
$$ plain form
54095 192381 193368 194850 196413 197241 197104 196250 194656 192067 188760 185631 183387 182070 181442 181335 181480 181516
54079 181516 181447 181718 182561 183626 184594 185815 187864 190646 193383 195457 196893 197988 198813 199223 199167 198788 198217
54062 198217 197349 195939 194066 192386 191626 191731 191823 191256 190417 190192 190867 191969 193077 194284 195853 197916
54046 197916 200647 204291 208646 212874 216287 219175 222492 226761 231637 236552 241362 246161 250868 255328
54032 255328 259712 264424 269615 274983 280081 284631 288557 291954 295058 297947 300162 300929 300012 298177 296517
54017 296517 295456 294676 293926 293366 292984 292016 289436 285034 279767 274887 270831 267032 262740 257812 252667
54002 252667 247708 243090 238932 235397 232397 229541 226621 223952 221931 220427 218971 217464 216294 215627
53988 215627 214972 213714 211909 210270 209358 209026 208734 208244 207818 207740 207847 207714 207215 206673 206469 206764 207587 208870
$$ packed form
54095A92381R87J482J563Q28j37q54j594k589l307l129k244j317o28j07J45L6
54079A81516o9K71Q43J065R68J221K049K782K737K074J436J095Q25M10n6l79n71
54062A98217q68j410j873j680p60J05R2n67q39k25O75J102J108J207J569K063
54046A97916K731L644M355M228L413K888L317M269M876M915M810M799M707M460
54032B55328M384M712N191N368N098M550L926L397L104K889K215P67r17j835j660
54017B96517j061p80p50n60l82r68k580m402n267m880m056l799m292m928n145
54002B52667m959m618m158l535l000k856k920k669k021j504j456j507j170o67
53988B15627o55j258j805j639r12l32k92m90m26p8J07j33m99n42k04K95Q23J283
$$ plain form
53970 208870 210315 211593 212897 214938 218133 222146 226601 231881 238645 246784 255434 263909 272021 279463
53956 279463 285555 289772 291992 292058 289620 284814 278676 272523 267047 262272 258103 254678 252300 251202 251293
53941 251293 252137 253364 255091 257652 260885 264170 267257 270600 274649 279135 283338 286744 289264 291191
53927 291191 293186 295953 299603 303621 307752 312492 318388 325196 332210 339125 346090 353143 360144 367197
53913 367197 374618 382355 389765 396086 401006 404847 408368 412217 416304 419696 421293 420616 417994 414291
53899 414291 410537 407413 404792 401931 398286 393838 388588 382299 375056 367511 360094 352490 344496 336861
53885 336861 330463 324964 319142 312467 305548 299095 293267 288102 283748 280040 276458 272764 269139 265582
53871 265582 261829 258011 254701 252031 249346 246082 242462 239032 236037 233567 231733 230235 228274 225452
$$ packed form
53970B08870J445J278J304K041L195M013M455N280O764Q139Q650Q475Q112P442
53956B79463O092M217K220O6k438m806o138o153n476m775m169l425k378j098R1
53941B51293Q44J227J727K561L233L285L087L343M049M486M203L406K520J927
53927B91191J995K767L650M018M131M740N896O808P014O915O965P053P001P053
53913C67197P421P737P410O321M920L841L521L849M087L392J597o77k622l703
53899D14291l754l124k621k861l645m448n250o289p243p545p417p604p994p635
53885C36861o398n499n822o675o919o453n828n165m354l708l582l694l625l557
53871B65582l753l818l310k670k685l264l620l430k995k470j834j498j961k822
$$ plain form
53857 225452 222389 219932 218060 216084 213679 211198 209109 207602 206669 206141 205712 205229 204886 204851 204871 204600 204220
53840 204220 204344 205301 206809 208303 209250 209231 208120 206390 204996 204714 205559 206893 208031 208755 209283 209815 210257
53823 210257 210505 210771 211350 212114 212659 212989 213574 214604 215664 216496 217608 219643 222458 225346 228003 230764
53807 230764 233907 237265 240533 243673 246936 250729 255351 260635 265968 271002 276118 281780 287611 292684
53793 292684 296633 299804 302348 303971 304886 306168 308502 311063 312424 312300 311679 311271 310617 308982 306455
53778 306455 303630 300602 296906 292397 287637 283230 279158 275097 271094 267503 264304 260927 256900 252400
53764 252400 247990 244046 240652 237815 235524 233659 232080 230736 229501 228044 226157 224090 222250 220635
53750 220635 218906 217041 215458 214402 213564 212517 211242 210003 208971 208234 207955 208223 208839 209492 210053 210520
$$ packed form
53857B25452l063k457j872j976k405k481k089j507r33n28m29m83l43l5K0k71l80
53840B04220J24R57J508J494R47j9j111j730j394k82Q45J334J138P24N28N32M42
53823B10257K48K66N79P64N45L30N85J030J060Q32J112K035K815K888K657K761
53807B30764L143L358L268L140L263L793M622N284N333N034N116N662N831N073
53793B92684L949L171K544J623R15J282K334K561J361j24o21m08o54j635k527
53778C06455k825l028l696m509m760m407m072m061m003l591l199l377m027m500
53764B52400m410l944l394k837k291j865j579j344j235j457j887k067j840j615
53750B20635j729j865j583j056q38j047j275j239j032p37k79K68O16O53N61M67
$$ plain form
53734 210520 210856 211089 211401 211880 212349 212752 213523 215110 217196 218858 219608 219843 220204 220870 221738 222848 224349
53717 224349 226249 228494 231021 233431 234981 235362 235322 235987 237625 239544 241222 242970 245301 248110 250803
53702 250803 252965 254621 256077 257725 259817 262180 264351 266261 268574 272001 276330 280440 283259 284568
53688 284568 285029 285657 287135 289218 290816 290980 289843 288394 287367 286718 286128 285502 284765 283631 281966 280197
53672 280197 278946 278386 278272 278497 279266 280627 282120 283058 283046 282178 280850 279487 278336 277417 276669 276146 275960
53655 275960 276019 275978 275609 275144 275067 275549 276279 276938 277661 278786 280222 281361 281709 281428 281160 281471 282614 284646
53637 284646 287483 290794 294037 296763 298885 300670 302478 304551 307041 310139 313985 318315 322373 325478
53623 325478 327694 329622 331572 333355 335007 337162 340262 343791 346881 349512 352514 356371 360552 364166
$$ packed form
53734B10520L36K33L12M79M69M03P71J587K086J662P50K35L61O66Q68J110J501
53717B24349J900K245K527K410J550L81m0O65J638J919J678J748K331K809K693
53702B50803K162J656J456J648K092K363K171J910K313L427M329M110K819J309
53688B84568M61O28J478K083J598J64j137j449j027o49n90o26p37j134j665j769
53672B80197j251n60j14K25P69J361J493R38j2q68j328j363j151r19p48n23j86
53655B75960N9m1l69m65p7M82P30O59P23J125J436J139L48k81k68L11J143K032
53637B84646K837L311L243K726K122J785J808K073K490L098L846M330M058L105
53623C25478K216J928J950J783J652K155L100L529L090K631L002L857M181L614
$$ plain form
53609 364166 366861 368918 370835 373049 375796 378940 381999 384424 385883 386428 386602 387204 388556 389991 390420
53594 390420 389452 387657 385760 383985 382232 380408 378445 376447 374960 374664 375446 376215 375948 374658 373090
53579 373090 371743 370491 368883 366581 363757 361247 359975 359951 360219 360041 359644 359475 359295 358679 357986 358017 358866
53562 358866 359868 360634 361375 362091 362266 361727 361233 361670 362935 364081 364494 364537 364969 365924 366691 366586 365895 365747
53544 365747 367021 369668 373126 376972 380848 384216 386783 389049 391926 395850 400700 406481 413458 421531
53530 421531 430046 438519 447169 456505 466680 477502 488815 500643 513059 526068 539530 553178
53518 553178 566900 581041 596219 612801 630671 649429 668665 688139 707992 728725 750665
53507 750665 773511 796725 820234 844272 868609 892522 915621 938141 960261 981716 1002402
$$ packed form
53609C64166K695K057J917K214K747L144L059K425J459N45J74O02J352J435M29
53594C90420r68j795j897j775j753j824j963j998j487k96P82P69k67j290j568
53579C73090j347j252j608k302k824k510j272k4K68j78l97j69j80o16o93L1Q49
53562C58866J002P66P41P16J75n39m94M37J265J146M13M3M32R55P67j05o91j48
53544C65747J274K647L458L846L876L368K567K266K877L924M850N781O977Q073
53530D21531Q515Q473Q650R336J0175J0822J1313J1828J2416J3009J3462J3648
53518E53178J3722J4141J5178J6582J7870J8758J9236J9474J9853K0733K1940
53507G50665K2846K3214K3509K4038K4337K3913K3099K2520K2120K1455K0686
$$ plain form
53496 1002402 1022763 1043105 1062930 1081500 1098837 1115720 1132874 1150579 1168901 1187777 1206787
53485 1206787 1225262 1242776 1259458 1275762 1292043 1308290 1324128 1339082 1352863 1365335 1376228
53474 1376228 1385087 1391612 1395855 1398035 1398338 1397010 1394291 1390106 1384043 1375857 1365771 1354166 1341289
53461 1341289 1327502 1313445 1299553 1285607 1271076 1255766 1239759 1222960 1205149 1186399 1167065
53450 1167065 1147420 1127674 1108306 1089914 1072653 1056166 1040149 1024673 1009934 996071 983451
53439 983451 972783 964611 958732 954311 950563 947290 944821 943499 943256 943757 944973 947389 951468 957024
53425 957024 963401 970227 977742 986386 996342 1007571 1020052 1033898 1049370 1066773 1086180 1107254
53413 1107254 1129624 1153466 1179358 1207362 1236580 1266003 1295704 1326820 1360350 1396324 1434255
$$ packed form
53496A002402K0361K0342J9825J8570J7337J6883J7154J7705J8322J8876J9010
53485A206787J8475J7514J6682J6304J6281J6247J5838J4954J3781J2472J0893
53474A376228Q859O525M243K180L03j328k719m185o063q186j0086j1605j2877
53461A341289j3787j4057j3892j3946j4531j5310j6007j6799j7811j8750j9334
53450A167065j9645j9746j9368j8392j7261j6487j6017j5476j4739j3863j2620
53439I83451j0668q172n879m421l748l273k469j322k43N01J216K416M079N556
53425I57024O377O826P515Q644R956J1229J2481J3846J5472J7403J9407K1074
53413A107254K2370K3842K5892K8004K9218K9423K9701L1116L3530L5974L7931
$$ plain form
53402 1434255 1474077 1516180 1560594 1606588 1653297 1700568 1748908 1798723 1849856 1901783 1953978
53391 1953978 2006107 2058187 2110624 2163684 2216734 2268382 2317643 2364711 2410255 2454250 2495913
53380 2495913 2534592 2570142 2602387 2630751 2654682 2674139 2689417 2700639 2707576 2709820 2707060 2699239
53368 2699239 2686516 2669010 2646576 2618978 2586291 2549036 2508066 2464467 2419449 2373911 2327985
53357 2327985 2281286 2233719 2185871 2138582 2092385 2047453 2003790 1961256 1919606 1878700 1838556
53346 1838556 1799039 1759699 1720224 1680975 1642866 1606645 1572420 1539823 1508456 1478169 1449098
53335 1449098 1421581 1395965 1372361 1350573 1330325 1311591 1294615 1279470 1265651 1252212 1238323
53324 1238323 1223613 1208068 1191926 1175733 1160174 1145585 1131869 1119100 1107872 1098663 1091121 1084537
$$ packed form
53402A434255L9822M2103M4414M5994M6709M7271M8340M9815N1133N1927N2195
53391A953978N2129N2080N2437N3060N3050N1648M9261M7068M5544M3995M1663
53380B495913L8679L5550L2245K8364K3931J9457J5278J1222O937K244k760p821
53368B699239j2723j7506k2434k7598l2687l7255m0970m3599m5018m5538m5926
53357B327985m6699m7567m7848m7289m6197m4932m3663m2534m1650m0906m0144
53346A838556l9517l9340l9475l9249l8109l6221l4225l2597l1367l0287k9071
53335A449098k7517k5616k3604k1788k0248j8734j6976j5145j3819j3439j3889
53324A238323j4710j5545j6142j6193j5559j4589j3716j2769j1228r209p542o584
$$ plain form
53312 1084537 1078940 1075147 1073661 1074027 1075504 1077868 1081364 1086276 1092897 1101569 1112359 1124806 1138268
53299 1138268 1152396 1167194 1182927 1200156 1219480 1240873 1263438 1286176 1308841 1331791 1355204
53288 1355204 1378782 1402074 1424731 1446494 1467183 1486630 1504431 1519979 1532970 1543578 1551798
53277 1551798 1556996 1558701 1557576 1554902 1551089 1545357 1536889 1525563 1511414 1494294 1474582 1453553 1432282
53264 1432282 1410512 1387299 1362595 1337507 1312980 1288869 1264474 1239510 1214214 1188862 1163556
53253 1163556 1138417 1113651 1089259 1064829 1039792 1014064 988330 963515 939948 917253 895051
53242 895051 873393 852256 831065 809286 787447 767015 749008 733090 718159 703534 689335
53231 689335 676028 663974 653300 643786 634845 625885 616733 607489 597921 587346 575386 562655 550339
$$ packed form
53312A084537n597l793j486L66J477K364L496M912O621Q672J0790J2447J3462
53299A138268J4128J4798J5733J7229J9324K1393K2565K2738K2665K2950K3413
53288A355204K3578K3292K2657K1763K0689J9447J7801J5548J2991J0608Q220
53277A551798N198J705j125k674l813n732q468j1326j4149j7120j9712k1029k1271
53264A432282k1770k3213k4704k5088k4527k4111k4395k4964k5296k5352k5306
53253A163556k5139k4766k4392k4430k5037k5728k5734k4815k3567k2695k2202
53242H95051k1658k1137k1191k1779k1839k0432j8007j5918j4931j4625j4199
53231F89335j3307j2054j0674r514q941q960r152r244r568j0575j1960j2731j2316
$$ plain form
53218 550339 539017 528093 516461 503562 489728 475785 462645 451165 441878 434595 428437 422511
53206 422511 416490 410441 404334 398021 391564 385176 378776 371948 364493 356739 349172 342027 335394 329423
53192 329423 324103 319027 313778 308468 303577 299369 295785 292838 290618 288792 286606 283703 280666 278439
53178 278439 277330 276830 276189 274902 272791 270004 267017 264350 262197 260454 259072 258167 257775 257689 257680 257720 257870
53161 257870 258011 257752 256647 254535 251760 248959 246657 245091 244365 244501 245101 245290 244430 242870 241636 241339
53145 241339 241720 242264 242866 243647 244466 244921 244747 244082 243506 243802 245352 247606 249449 250322 250664 251037 251246 250832
53127 250832 250098 249974 250876 252288 253571 254620 255526 256102 256124 255820 255736 256208 257219 258645 260366 262110 263399
53110 263399 263786 263217 262138 261195 260664 260241 259483 258409 257459 256835 256111 254591 251991 248830 246244 245200
$$ packed form
53218E50339j1322j0924j1632j2899j3834j3943j3140j1480r287p283o158n926
53206D22511o021o049o107o313o457o388o400o828p455p754p567p145o633n971
53192C29423n320n076n249n310m891m208l584k947k220j826k186k903l037k227
53178B78439j109n00o41j287k111k787k987k667k153j743j382r05l92q6rM0J50
53161B57870J41k59j105k112k775k801k302j566p26J36O00J89q60j560j234k97
53145B41339L81N44O02P81Q19M55j74o65n76K96J550K254J843Q73L42L73K09m14
53127B50832p34j24R02J412J283J049R06N76K2l04q4M72J011J426J721J744J289
53110B63399L87n69j079r43n31m23p58j074r50o24p24j520k600l161k586j044
$$ plain form
53094 245200 245529 245854 244902 242920 241314 240855 240835 240218 238984 237845 237148 236732 236587 236919 237607 238190 238377 238133
53076 238133 237342 236007 234731 234302 234652 234870 234511 234259 234857 235954 236544 236211 235379 234622 234295 234671 235754
53059 235754 236926 237359 236964 236531 236778 237583 238318 238536 238122 237115 235779 234714 234476 235031 235826 236451 237017
53042 237017 237789 238613 238949 238502 237600 236858 236530 236380 236169 236053 236303 236798 237004 236515 235464 234378 233733 233741 234448
53023 234448 235903 238129 240877 243511 245293 245941 245827 245530 245250 244786 243973 242925 241856 240915 240238 239871
53007 239871 239545 238789 237528 236345 235892 236158 236644 237127 237817 238708 239273 239174 238899 239260 240325 241358 241795 241904
52989 241904 242324 243294 244580 245840 246804 247354 247790 248825 250874 253383 255291 256182 256596 257207 258126 259169
52973 259169 260268 261337 262119 262562 263069 263973 264957 265421 265315 265199 265569 266468 267689 268927 269758 269872 269465
$$ packed form
53094B45200L29L25r52j982j606m59k0o17j234j139o97m16j45L32O88N83J87k44
53076B38133p91j335j276m29L50K18l59k52N98J097N90l33q32p57l27L76J083
53059B35754J172M33l95m33K47Q05P35K18m14j007j336j065k38N55P95O25N66
53042B37017P72Q24L36m47r02p42l28j50k11j16K50M95K06m89j051j086o45QP07
53023B34448J455K226K748K634J782O48j14k97k80m64q13j048j069r41o77l67
53007B39871l26p56j261j183m53K66M86M83O90Q91N65r9k75L61J065J033M37J09
52989B41904M20R70J286J260R64N50M36J035K049K509J908Q91M14O11R19J043
52973B59169J099J069P82M43N07R04R84M64j06j16L70Q99J221J238Q31J14m07
$$ plain form
52956 269465 269014 268630 267910 266483 264407 262001 259667 257909 257031 256646 255870 254291 252376 250720 249311 247855
52940 247855 246396 245124 243867 242324 240661 239380 238672 238322 238175 238220 238124 237285 235634 234040 233540 234257 235269
52923 235269 235556 234976 234342 234564 235688 236871 237371 237413 237800 238785 239697 239808 239299 239069 239720 240880 241545 240982
52905 240982 239406 237804 237061 237200 237488 237267 236588 236035 236064 236596 237194 237550 237766 238136 238672 239002 238816 238277
52887 238277 237841 237748 237861 237909 237696 237187 236637 236576 237372 238774 240172 241383 242850 244951 247356 249319 250490
52870 250490 251248 252253 253724 255144 255678 255069 254093 253963 255181 257154 258895 259864 260086 259809 259314 258830 258316
52853 258316 257366 255573 252980 250030 247091 244184 241141 237928 234782 232096 230126 228844 228091 227802 227916
52838 227916 228101 227888 227154 226197 225247 224184 222957 221976 221756 222299 223154 224010 224913 225934 226873 227332 226995 225920
$$ packed form
52956B69465m51l84p20j427k076k406k334j758q78l85p76j579j915j656j409j456
52940B47855j459j272j257j543j663j281p08l50j47M5r6q39j651j594n00P17J012
52923B35269K87n80o34K22J124J183N00M2L87R85R12J11n09k30O51J160O65n63
52905B40982j576j602p43J39K88k21o79n53K9N32N98L56K16L70N36L30j86n39
52887B38277m36r3J13M8k13n09n50o1P96J402J398J211J467K101K405J963J171
52870B50490P58J005J471J420N34o09r76j30J218J973J741R69K22k77m95m84n14
52853B58316r50j793k593k950k939k907l043l213l146k686j970j282p53k89J14
52838B27916J85k13p34r57r50j063j227r81k20N43Q55Q56R03J021R39M59l37j075
$$ plain form
52820 225920 224725 224291 224958 226082 226676 226488 226160 226305 226738 226775 226070 225058 224670 225618 227746 230012 231302
52803 231302 231389 230940 230599 230302 229659 228694 227872 227441 227123 226574 225915 225531 225426 225082 224133 222906 222066 221779 221611
52784 221611 221325 221324 222050 223222 224116 224510 224947 225971 227401 228511 228772 228304 227703 227504 227766 228142 228386 228668
52766 228668 229320 230360 231427 232087 232046 231268 230167 229576 230038 231064 231461 230585 228993 227762 227463 227991 229049
52749 229049 230382 231638 232442 232713 232800 233192 234098 235320 236541 237762 239383 241718 244461 246843 248338 249029
52733 249029 249257 249218 249079 249170 249770 250768 251763 252490 252956 253238 253327 253169 252751 252085 251179 250043 248708 247292 246010
52714 246010 244989 244089 243022 241695 240295 239037 238024 237392 237377 238045 239178 240552 242163 243991 245709
52699 245709 246881 247349 247204 246571 245642 244833 244560 244783 245014 244849 244384 244027 244030 244186 244026 243274 242133 241026
$$ packed form
52820B25920j195m34O67J124N94j88l28J45M33L7p05j012l88R48K128K266J290
52803B31302Q7m49l41k97o43r65q22m31l18n49o59l84j05l44r49j227q40k87j68
52784B21611k86jP26J172Q94L94M37J024J430J110K61m68o01j99K62L76K44K82
52766B28668O52J040J067O60m1p78j101n91M62J026L97q76j592j231k99N28J058
52749B29049J333J256Q04K71Q7L92R06J222J221J221J621K335K743K382J495O91
52733B49029K28l9j39R1O00R98R95P27M66K82Q9j58m18o66r06j136j335j416j282
52714B46010j021r00j067j327j400j258j013o32j5O68J133J374J611J828J718
52699B45709J172M68j45o33r29q09k73K23K31j65m65l57LJ56j60p52j141j107
$$ plain form
52681 241026 240140 239416 238973 239132 239822 240356 240176 239621 239511 240080 240772 241057 240967 240773 240568 240409 240569 241366 242848
52662 242848 244774 246768 248461 249665 250528 251374 252353 253394 254449 255541 256525 257119 257287 257357 257603 257976 258311
52645 258311 258476 258116 256714 254300 251866 250570 250590 251165 251644 252018 252354 252343 251743 250910 250423 250387 250501 250722
52627 250722 251376 252531 253689 254395 254863 255629 256709 257527 257691 257499 257484 257746 257978 257967 257782 257479 256920 255948
52609 255948 254604 253101 251689 250564 249826 249456 249406 249723 250544 251964 253887 255917 257369 257572 256407 254546
52593 254546 253029 252513 252948 253819 254602 255105 255574 256421 257647 258684 258986 258717 258518 258655 258784 258626 258488 258888
52575 258888 259917 261214 262437 263503 264401 264991 265068 264628 264056 263935 264473 265196 265422 265043 264566 264377 264308 264041
52557 264041 263592 263113 262479 261471 260223 259242 258909 259111 259324 258964 257765 255992 254248 253071 252731 253290 254514
$$ packed form
52681B41026q86p24m43J59O90N34j80n55j10N69O92K85r0j94k05j59J60P97J482
52662B42848J926J994J693J204Q63Q46R79J041J055J092R84N94J68P0K46L73L35
52645B58311J65l60j402k414k434j296K0N75M79L74L36j1o00q33m87l6J14K21
52627B50722O54J155J158P06M68P66J080Q18J64j92j5K62K32j1j85l03n59r72
52609B55948j344j503j412j125p38l70n0L17Q21J420J923K030J452K03j165j861
52593B54546j517n16M35Q71P83N03M69Q47J226J037L02k69j99J37J29j58j38M00
52575B58888J029J297J223J066Q98N90P7m40n72j21N38P23K26l79m77j89o9k67
52557B64041m49m79o34j008j248r81l33K02K13l60j199j773j744j177l40N59J224
$$ plain form
52540 254514 255719 256131 255670 255105 255182 255872 256772 257875 259445 261273 262624 262994 262548 261806 261250 261338 262393
52523 262393 264210 265991 267001 267255 267345 267675 268026 267996 267684 267720 268552 269883 271068 271969 273123 274999 277436
52506 277436 279975 282403 284678 286568 287744 288133 287884 287060 285653 283755 281441 278600 275226 271811 269088
52491 269088 267339 266250 265410 264650 263872 262938 261844 260816 260123 259901 260106 260536 261016 261718 263055 264977 266671
52474 266671 267392 267407 267566 268113 268570 268820 269525 271264 273819 276628 279395 281934 283977 285585 287385 289964
52458 289964 293256 296786 300140 302882 304377 304202 302523 299710 295874 291153 286201 281878 278581 276182
52444 276182 274448 273119 271861 270622 269831 269734 269701 268791 266979 265209 264129 263359 262247 260854 259868 259831 260698
52427 260698 261906 262719 262720 262214 261962 262427 263438 264666 266111 267899 269890 271791 273507 275073 276420 277581
$$ packed form
52540B54514J205M12m61n65P7O90R00J103J570J828J351L70m46p42n56Q8J055
52523B62393J817J781J010K54R0L30L51l0l12L6Q32J331J185R01J154J876K437
52506B77436K539K428K275J890J176L89k49q24j407j898k314k841l374l415k723
52491B69088j749j089q40p60p78r34j094j028o93k22K05M30M80P02J337J922J694
52474B66671P21J5J59N47M57K50P05J739K555K809K767K539K043J608J800K579
52458B89964L292L530L354K742J495j75j679k813l836m721m952m323l297k399
52444B76182j734j329j258j239p91r7l3r10j812j770j080p70j112j393r86l7Q67
52427B60698J208Q13Jn06k52M65J011J228J445J788J991J901J716J566J347J161
$$ plain form
52411 277581 279104 281787 285798 290386 294804 299355 305096 312505 320854 329026 336495 343141 348416 351392
52397 351392 351656 349675 346123 341297 335444 329194 323267 318031 313664 310485 308667 307764 306982 305951 304923
52382 304923 304278 304136 304437 305038 305730 306441 307475 309319 312151 315703 319587 323505 327216 330578 333727 336952
52366 336952 340340 343706 346872 349785 352340 354283 355371 355514 354833 353722 352783 352406 352426 352349 351916 351294 350818
52349 350818 350764 351233 351984 352552 352885 353742 356042 359870 364520 369427 374523 379716 384664 389339 394308 400168
52333 400168 407139 415377 425214 436646 448975 461381 473707 486396 499928 514570 530453 547502
52321 547502 565424 583955 602971 622180 640972 658854 675773 691840 707072 721747 736631
52310 736631 752325 768535 784390 799335 813371 826652 839361 851841 864237 876069 886633
$$ packed form
52411B77581J523K683M011M588M418M551N741P409Q349Q172P469O646N275K976
52397C51392K64j981l552m826n853o250n927n236m367l179j818r03p82j031j028
52382C04923o45j42L01O01O92P11J034J844K832L552L884L918L711L362L149L225
52366C36952L388L366L166K913K555J943J088J43o81j111r39l77K0p7m33o22m76
52349C50818n4M69P51N68L33Q57K300L828M650M907N096N193M948M675M969N860
52333D00168O971Q238R837J1432J2329J2406J2326J2689J3532J4642J5883J7049
52321E47502J7922J8531J9016J9209J8792J7882J6919J6067J5232J4675J4884
52310G36631J5694J6210J5855J4945J4036J3281J2709J2480J2396J1832J0564
$$ plain form
52299 886633 895867 904307 912135 918812 923810 927160 929059 929446 928354 926253 923571 920069 915167 908785
52285 908785 901545 894217 887307 881116 875765 871125 867076 864065 863084 864802 868858 874242 880324 887238
52271 887238 895341 904618 914820 925908 938003 950911 963941 976312 987657 998171 1008375 1018790
52259 1018790 1029664 1040891 1052247 1063728 1075523 1087566 1099215 1109552 1118044 1124901 1130733 1135841
52247 1135841 1139856 1142125 1142443 1141152 1138441 1133877 1127025 1118363 1109079 1099918 1090766 1081441 1072298 1063688
52233 1063688 1055358 1046948 1038747 1031339 1024630 1017881 1010774 1003903 998132 993852 991023 989454 988750 988296
52219 988296 987698 987124 987017 987607 988886 990895 993729 997231 1000937 1004530 1008296 1013033 1019356 1027064 1035197
52204 1035197 1042808 1049602 1055788 1061434 1066246 1070043 1073237 1076722 1081282 1087054 1093423 1099380 1104236 1108150
$$ packed form
52299H86633R234Q440P828O677M998L350J899L87j092k101k682l502m902o382
52285I08785p240p328o910o191n351m640m049l011r81J718M056N384O082O914
52271H87238Q103R277J0202J1088J2095J2908J3030J2371J1345J0514J0204J0415
52259A018790J0874J1227J1356J1481J1795J2043J1649J0337Q492O857N832N108
52247A135841M015K269L18j291k711m564o852q662r284r161r152r325r143q610
52233A063688q330q410q201p408o709o749p107o871n771m280k829j569p04m54
52219I88296n98n74j07N90J279K009K834L502L706L593L766M737O323P708Q133
52204A035197P611O794O186N646M812L797L194L485M560N772O369N957M856L914
$$ plain form
52190 1108150 1111939 1116229 1120816 1124919 1127954 1129946 1131215 1131870 1131704 1130449 1127986 1124329 1119554 1113781
52176 1113781 1107150 1099766 1091806 1083733 1076201 1069587 1063665 1057986 1052554 1047931 1044662 1042783 1041871 1041350
52162 1041350 1040757 1040013 1039597 1040221 1042145 1044952 1048047 1051097 1053839 1055795 1056613 1056551 1056307 1056319 1056490 1056545 1056435
52145 1056435 1056375 1056649 1057431 1058708 1060372 1062379 1064728 1067248 1069603 1071613 1073397 1075114 1076809 1078717 1081514
52130 1081514 1085968 1092482 1101145 1112081 1125467 1141361 1159710 1180336 1202694 1225932 1249538 1273677
52118 1273677 1298542 1323646 1348266 1372292 1396010 1419141 1440813 1460510 1478387 1494471 1508228
52107 1508228 1519268 1527975 1535084 1540955 1545539 1548722 1550426 1550710 1550036 1549130 1548283 1546982 1544454 1540372 1534846
52092 1534846 1528060 1520133 1511076 1500692 1488789 1475719 1462369 1449372 1436603 1423725 1410908 1398735
$$ packed form
52190A108150L789M290M587M103L035J992J269O55j66j255k463l657m775n773
52176A113781o631p384p960q073p532o614n922n679n432m623l269j879r12n21
52162A041350n93p44m16O24J924K807L095L050K742J956Q18o2k44J2J71N5j10
52145A056435o0K74P82J277J664K007K349K520K355K010J784J717J695J908K797
52130A081514M454O514Q663J0936J3386J5894J8349K0626K2358K3238K3606K4139
52118A273677K4865K5104K4620K4026K3718K3131K1672J9697J7877J6084J3757
52107A508228J1040Q707P109N871M584L183J704K84o74r06q47j301k528m082n526
52092A534846o786p927r057j0384j1903j3070j3350j2997j2769j2878j2817j2173
$$ plain form
52080 1398735 1387768 1378575 1371785 1367614 1365628 1365452 1367463 1372196 1379248 1387429 1395994 1405140 1415299 1426613
52066 1426613 1439222 1453307 1468459 1483496 1497388 1510001 1521583 1531881 1540397 1547261 1553213 1558596
52054 1558596 1562913 1565550 1566555 1566375 1565116 1562443 1558096 1552163 1544732 1535584 1524317 1510645 1494538
52041 1494538 1476287 1456572 1436260 1415981 1395947 1376314 1357486 1339837 1323303 1307527 1292368
52030 1292368 1277972 1264499 1252126 1241282 1232325 1224845 1217712 1210070 1201953 1193685 1185062 1175592 1165371
52017 1165371 1155162 1145525 1136225 1126600 1116297 1105476 1094441 1083276 1071853 1060059 1047866 1035159
52005 1035159 1021659 1007195 991921 976084 959656 942471 924662 906621 888491 870149 851884
51994 851884 834747 819844 807383 796570 786319 775946 765458 755347 745957 736918 727463 717378
$$ packed form
52080A398735j0967r193o790m171j986j76K011M733P052Q181Q565R146J0159J1314
52066A426613J2609J4085J5152J5037J3892J2613J1582J0298Q516O864N952N383
52054A558596M317K637J005j80j259k673m347n933p431r148j1267j3672j6107
52041A494538j8251j9715k0312k0279k0034j9633j8828j7649j6534j5776j5159
52030A292368j4396j3473j2373j0844q957p480p133p642q117q268q623r470j0221
52017A165371j0209r637r300r625j0303j0821j1035j1165j1423j1794j2193j2707
52005A035159j3500j4464j5274j5837j6428j7185j7809j8041j8130j8342j8265
51994H51884j7137j4903j2461j0813j0251j0373j0488j0111r390r039r455j0085
$$ plain form
51982 717378 707204 697257 686929 675465 663091 650818 639254 628181 617176 606132 595180 584660
51970 584660 575218 567460 561367 556451 552670 550726 551243 553965 558027 562731 567806 573117 578492 583839
51956 583839 589155 594275 598588 601114 601118 598851 595539 592413 589781 587281 584901 583376 583611 586064 590782
51941 590782 597618 606242 616281 627721 640940 656141 672952 690725 708944 727066 744165 759046
51929 759046 770574 777697 779397 775103 765172 750636 732416 711137 687758 663878 640972 619454
51917 619454 598883 579020 560279 543066 527165 512237 498653 487357 478820 472579 467912 464611
51905 464611 462834 462550 463512 465593 468760 472717 476931 481076 485265 489723 494314 498347 500826 501016 498940
51890 498940 495225 490347 484268 477028 469392 462419 456439 450957 445697 441306 438768 438420 439831 442433
$$ packed form
51982G17378j0174r947j0328j1464j2374j2273j1564j1073j1005j1044j0952j0520
51970E84660r442p758o093m916l781j944N17K722M062M704N075N311N375N347
51956E83839N316N120M313K526Mk267l312l126k632k500k380j525K35K453M718
51941E90782O836Q624J0039J1440J3219J5201J6811J7773J8219J8122J7099J4881
51929G59046J1528P123J700m294r931j4536j8220k1279k3379k3880k2906k1518
51917F19454k0571j9863j8741j7213j5901j4928j3584j1296q537o241m667l301
51905D64611j777k84R62K081L167L957M214M145M189M458M591M033K479J90k076
51890D98940l715m878o079p240p636o973n980n482n260m391k538l48J411K602
$$ plain form
51876 442433 445994 450525 456030 462447 469689 477553 485535 492816 498647 502821 505636 507327 507745 506711
51862 506711 504401 501142 497047 492242 487272 482852 479235 476245 473947 472847 473281 474919 477023 478952
51848 478952 480348 481113 481319 480945 479678 477262 473935 470127 465768 460417 454220 448177 443133 438986 435250
51833 435250 431971 429547 427955 426708 425532 424614 424183 424204 424566 425216 425953 426317 425877 424642 423114 421847
51817 421847 420898 419792 418154 416301 414941 414331 414094 413924 414102 415113 417051 419610 422330 424584 425647
51802 425647 425153 423408 421067 418774 417197 416920 417816 418875 419229 419189 419679 420766 421359 420424 417916 414434
51786 414434 410543 406769 403748 401901 401130 401150 401957 403662 405996 408361 410381 412157 413895 415535 416905
51771 416905 418111 419605 421845 425056 429288 434519 440583 447178 454065 461143 468140 474401 479324 482892
$$ packed form
51876D42433L561M531N505O417P242P864P982P281N831M174K815J691M18j034
51862E06711k310l259m095m805m970m420l617k990k298j100M34J638K104J929
51848D78952J396P65K06l74j267k416l327l808m359n351o197o043n044m147l736
51833D35250l279k424j592j247j176r18m31K1L62O50P37L64m40j235j528j267
51817D21847r49j106j638j853j360o10k37j70J78J011J938K559K720K254J063
51802D25647m94j745k341k293j577k77Q96J059L54m0M90J087N93r35k508l482
51786D14434l891l774l021j847p71K0Q07J705K334K365K020J776J738J640J370
51771D16905J206J494K240L211M232N231O064O595O887P078O997O261M923L568
$$ plain form
51757 482892 485389 486591 485714 482280 476630 469440 461195 452377 443676 435548 427893 420596 414111 409024
51743 409024 405335 402639 400792 399834 399560 399835 401208 404421 409257 414619 419876 425352 431225 436768 441200
51728 441200 444733 448078 451297 453773 455149 455737 456081 456531 457167 457696 457461 455916 453091 449338 444797 439588
51712 439588 434456 430599 428577 427738 426970 425764 424292 422728 420920 418742 416500 414903 414691 416187 418992
51697 418992 422079 424406 425587 425935 425882 425547 424931 424280 423956 424033 424303 424698 425335 426009 425997 424739 422568 420365
51679 420365 418506 416576 414209 411831 410283 409947 410572 411903 414100 417406 421601 426045 430320 434676 439710
51664 439710 445590 451768 457536 462699 467456 471727 474902 476318 475724 473212 469072 464033 459454 456787
51650 456787 456687 458801 462364 466762 471432 475539 478063 478264 476040 471876 466519 460584 454367 448000 441734
$$ packed form
51757D82892K497J202q77l434n650p190q245q818q701q128p655p297o485n087
51743D09024l689k696j847r58k74K75J373L213M836N362N257N476N873N543M432
51728D41200L533L345L219K476J376N88L44M50O36N29k35j545k825l753m541n209
51712D39588n132l857k022q39p68j206j472j564j808k178k242j597k12J496K805
51697D18992L087K327J181L48n3l35o16o51l24P7K70L95O37O74j2j258k171k203
51679D20365j859j930k367k378j548l36O25J331K197L306M195M444M275M356N034
51664D39710N880O178N768N163M757M271L175J416n94k512m140n039m579k667
51650D56787j00K114L563M398M670M107K524K01k224m164n357n935o217o367o266
$$ plain form
51635 441734 435951 430881 426504 422793 419861 417657 415702 413428 410759 408061 405550 403026 400312 397567
51621 397567 394952 392252 389152 385713 382342 379360 376861 374874 373325 371898 370204 368082 365552 362655
51607 362655 359728 357622 357054 357641 358176 358150 358487 360437 364123 368617 373107 377531 382281 387822 394482 402138
51591 402138 410043 417277 423338 428044 431017 431779 430378 427540 424091 420565 417443 415377 414923 416259 419296
51576 419296 423924 430094 437851 447366 458741 471765 486063 501476 517978 535245 552724 570347
51564 570347 588813 608819 630201 652122 674010 696096 719089 743533 769330 795668 821388
51553 821388 845614 868002 888232 905254 917213 922281 919695 910077 894824 875132 851601 824740
51541 824740 795659 765965 736983 709285 683064 658722 636890 618019 602109 588709 577013
$$ packed form
51635D41734n783n070m377l711k932k204j955k274k669k698k511k524k714k745
51621C97567k615k700l100l439l371k982k499j987j549j427j694k122k530k897
51607C62655k927k106n68N87N35k6L37J950L686M494M490M424M750N541O660P656
51591D02138P905P234O061M706K973P62j401k838l449l526l122k066m54J336L037
51576D19296M628O170P757R515J1375J3024J4298J5413J6502J7267J7479J7623
51564E70347J8466K0006K1382K1921K1888K2086K2993K4444K5797K6338K5720
51553H21388K4226K2388K0230J7022J1959N068k586r618j5253j9692k3531k6861
51541H24740k9081k9694k8982k7698k6221k4342k1832j8871j5910j3400j1696
$$ plain form
51530 577013 566114 555444 545026 535167 525913 516910 507812 498624 489598 480860 472312 463903 455944
51517 455944 448995 443358 438700 434266 429513 424545 419955 416252 413402 410865 408102 405072 402121 399489
51503 399489 397130 395115 393812 393331 393007 391884 389736 387289 385447 384657 384973 386270 388150 390034 391601
51488 391601 392953 394241 395463 396764 398495 400617 402345 402854 402161 400943 399620 398090 396283 394468 392821
51473 392821 391076 388869 386229 383446 380565 377243 373193 368621 364073 359887 355933 352035 348471 345766
51459 345766 343968 342474 340835 339528 339541 341156 343454 345196 346138 347247 349594 353164 357021 360658 364824
51444 364824 370723 378620 387708 397280 407468 418609 430361 441729 451650 459296 464265 466915 468250
51431 468250 469063 469409 469172 468656 467955 466141 461951 455323 447506 439603 431766 424014 416928 411002 405926
$$ packed form
51530E77013j0899j0670j0418r859r254r003r098r188r026q738q548q409p959
51517D55944o949n637m658m434m753m968m590l703k850k537k763l030k951k632
51503C99489k359k015j303m81l24j123k148k447j842p90L16J297J880J884J567
51488C91601J352J288J222J301J731K122J728N09o93j218j323j530j807j815j647
51473C92821j745k207k640k783k881l322m050m572m548m186l954l898l564k705
51459C45766j798j494j639j307J3J615K298J742R42J109K347L570L857L637M166
51444C64824N899P897R088R572J0188J1141J1752J1368R921P646M969K650J335
51431D68250Q13L46k37n16p01j814m190o628p817p903p837p752p086n926n076
$$ plain form
51416 405926 401152 396749 393172 390559 388840 388214 388785 389920 390702 390972 391229 391496 391164 390229 389856 391062
51400 391062 393347 395390 396791 398391 400953 404294 407973 412181 417441 423826 431009 439046 448670 460638
51386 460638 475073 491597 509989 530504 553602 579537 608349 640191 675420 714153 755825
51375 755825 799391 843930 888717 932571 973513 1009367 1038572 1060050 1072516 1074531 1065590 1046869
51363 1046869 1020589 988737 952509 912750 870461 826742 782558 738822 696657 657224 621165
51352 621165 588385 558618 532089 509300 490198 474039 460264 449020 440364 433328 426463 419259
51340 419259 412384 406475 401392 396920 393446 391393 390438 389926 389748 390166 390893 391021 389979 388092 386115 384626
51324 384626 383876 383698 383327 381776 378800 375265 372247 369962 367844 365498 363235 361636 360930 360891 361147 361426
$$ packed form
51416D05926m774m403l577k613j719o26N71J135P82K70K57K67l32r35l73J206
51400C91062K285K043J401J600K562L341L679M208N260O385P183Q037R624J1968
51386D60638J4435J6524J8392K0515K3098K5935K8812L1842L5229L8733M1672
51375G55825M3566M4539M4787M3854M0942L5854K9205K1478J2466K015q941j8721
51363A046869k6280l1852l6228l9759m2289m3719m4184m3736m2165l9433l6059
51352F21165l2780k9767k6529k2789j9102j6159j3775j1244q656p036o865p204
51340D19259o875n909n083m472l474k053r55n12j78M18P27J28j042j887j977j489
51324C84626p50j78l71j551k976l535l018k285k118k346k263j599p06l9K56K79
$$ plain form
51308 361426 361565 361449 361069 360628 360449 360658 360996 361101 360954 360835 360816 360536 359676 358475 357538 357153 357015 356592 355651
51289 355651 354452 353629 353864 355419 357861 360454 362924 365715 369307 373535 377774 381670 385349 388947 392319
51274 392319 395292 397903 400190 401967 403053 403619 404123 404998 406454 408427 410527 412210 413248 413903 414499
51259 414499 414898 414598 413222 410733 407335 403418 399462 395742 392228 388925 385992 383253 380017 375951 371826
51244 371826 368683 366427 364096 361538 359751 359257 359112 358230 356983 356654 357759 359675 361608 363096 363712
51229 363712 363146 361810 360782 360812 361618 362268 362059 361058 359925 359214 358766 357999 356867 356161 356524 357594 358579
51212 358579 359319 360199 361326 362489 363845 365843 368389 370734 372420 373832 375676 378344 381857 385920 389829
51197 389829 392831 394850 396515 398271 399860 400784 400878 400238 399044 397664 396531 395638 394582 393344 392560 392632
$$ packed form
51308C61426J39j16l80m41j79K09L38J05j47j19j9k80q60j201r37l85j38m23r41
51289C55651j199q23K35J555K442K593K470K791L592M228M239L896L679L598L372
51274C92319K973K611K287J777J086N66N04Q75J456J973K100J683J038O55N96
51259D14499L99l00j376k489l398l917l956l720l514l303k933k739l236m066m125
51244C71826l143k256k331k558j787m94j45q82j247l29J105J916J933J488O16
51229C63712n66j336j028L0Q06O50k09j001j133p11m48p67j132p06L63J070R85
51212C58579P40Q80J127J163J356J998K546K345J686J412J844K668L513M063L909
51197C89829L002K019J665J756J589R24R4o40j194j380j133q93j056j238p84P2
$$ plain form
51181 392632 393043 393005 392436 391814 391387 391140 391337 392362 393966 395210 395426 394873 394266 393962 393833 393664 393334 392672
51163 392672 391505 389996 388777 388497 389192 390214 390840 390877 390583 390171 389611 388831 387881 386800 385459 383675 381437
51146 381437 379106 377337 376603 376634 376544 375730 374518 373645 373344 373316 373474 374113 375330 376734 377927 378826 379433 379741
51128 379741 380093 381094 382785 384303 384802 384503 384374 384912 385675 386035 386032 386322 387449 389349 391554 393807 396277
51111 396277 399081 401828 403982 405565 407068 408639 409805 410209 410252 410704 411899 413570 415241 416612 417715
51096 417715 418868 420358 422067 423578 424676 425459 425945 425931 425418 424812 424520 424649 425190 426125 427166 427814 427896
51079 427896 427686 427295 426521 425620 425654 427388 430186 432637 434164 435522 437800 441443 446212 451603 457262 463252
51063 463252 470081 478351 488460 500690 515278 532165 550820 570457 590156 608731 625008 638593
$$ packed form
51181C92632M11l8n69o22m27k47J97J025J604J244K16n53o07l04j29j69l30o62
51163C92672j167j509j219k80O95J022O26L7k94m12n60p80r50j081j341j784k238
51146C81437k331j769p34L1r0q14j212q73l01k8J58O39J217J404J193Q99O07L08
51128C79741L52J001J691J518M99k99j29N38P63L60lK90J127J900K205K253K470
51111C96277K804K747K154J583J503J571J166M04M3M52J195J671J671J371J103
51096D17715J153J490J709J511J098P83M86j4n13o06k92J29N41R35J041O48Q2
51079D27896k10l91p74r01L4J734K798K451J527J358K278L643M769N391N659N990
51063D63252O829Q270J0109J2230J4588J6887J8655J9637J9699J8575J6277J3585
$$ plain form
51051 638593 650025 659950 668639 676615 684956 694188 703230 710208 714123 715157 713729 710060 704428 697040
51037 697040 687766 676811 665547 655795 648172 641745 635300 628172 619883 609941 598347 585696 572601
51024 572601 559650 547958 538879 532800 528969 526778 526462 528163 531172 534802 539397 545756 553915 563148
51010 563148 572871 582918 593096 603074 612672 621887 630604 638585 645666 651811 657028 661344 664654 666598
50996 666598 666867 665687 663668 661145 658134 654947 652204 650006 647826 645683 644748 646158 649732 654602 660716
50981 660716 668898 679556 692080 705564 719565 734043 749093 764885 781548 799024 817294 836786
50969 836786 858326 882710 910481 941948 977167 1015965 1058165 1103604 1151796 1201896 1253407
50958 1253407 1306584 1361710 1418157 1474599 1529931 1583478 1634517 1682327 1726699 1767806 1805480
$$ packed form
51051F38593J1432R925Q689P976Q341R232R042O978L915J034j428l669n632p388
51037F97040r274j0955j1264r752p623o427o445p128q289r942j1594j2651j3095
51024E72601j2951j1692r079o079l831k191l16J701L009L630M595O359Q159R233
51010E63148R723J0047J0178R978R598R215Q717P981P081O145N217M316L310J944
50996F66598K69j180k019k523l011l187k743k198k180k143r35J410L574M870O114
50981F60716Q182J0658J2524J3484J4001J4478J5050J5792J6663J7476J8270J9492
50969H36786K1540K4384K7771L1467L5219L8798M2200M5439M8192N0100N1511
50958A253407N3177N5126N6447N6442N5332N3547N1039M7810M4372M1107L7674
$$ plain form
50947 1805480 1839205 1868902 1895093 1918101 1937743 1954132 1968261 1981342 1993907 2005915 2017272
50936 2017272 2027643 2035957 2040761 2041132 2036906 2028091 2014655 1997050 1976358 1953423 1927998 1899108
50924 1899108 1866170 1829330 1788760 1744181 1695408 1643063 1588428 1532741 1476907 1421716 1367903
50913 1367903 1316011 1266485 1219878 1176637 1136746 1099918 1066173 1035750 1008446 983549 960562
50902 960562 939496 920256 902370 885635 870469 857149 845213 834179 824320 816057 808994 802433
50890 802433 796598 792443 790192 788919 787737 786696 786196 786186 786365 786737 787594 789231 791909 795799 800723 806254
50874 806254 812264 819048 826783 835307 844697 855612 868598 883336 899045 915491 933207 952817
50862 952817 974560 998467 1024582 1052961 1083787 1117703 1155780 1198846 1246874 1299299 1356037
$$ packed form
50947A805480L3725K9697K6191K3008J9642J6389J4129J3081J2565J2008J1357
50936B017272J0371Q314M804L71m226q815j3436j7605k0692k2935k5425k8890
50924A899108l2938l6840m0570m4579m8773n2345n4635n5687n5834n5191n3813
50913A367903n1892m9526m6607m3241l9891l6828l3745l0423k7304k4897k2987
50902I60562k1066j9240j7886j6735j5166j3320j1936j1034r859q263p063o561
50890H02433n835m155k251j273j182j041n00j0J79L72Q57J637K678L890M924N531
50874H06254O010O784P735Q524R390J0915J2986J4738J5709J6446J7716J9610
50862I52817K1743K3907K6115K8379L0826L3916L8077M3066M8028N2425N6738
$$ plain form
50851 1356037 1418066 1486825 1563098 1646713 1737272 1834719 1938850 2048607 2162445 2279450
50841 2279450 2399605 2522711 2647326 2770973 2891160 3006010 3114114 3214129 3304568 3383909
50831 3383909 3450885 3504869 3546056 3575485 3595002 3607071 3614198 3618319 3620768 3622780 3625741 3630738
50819 3630738 3638077 3647422 3658209 3669539 3679567 3685286 3683241 3670664 3645892 3607840 3555489 3488278
50807 3488278 3406776 3312400 3206398 3089704 2964025 2832370 2697927 2562861 2428873 2298397
50797 2298397 2174238 2058046 1950063 1850531 1760433 1680525 1610376 1548853 1495067 1448489 1408649
50786 1408649 1375139 1347487 1324660 1305171 1288037 1273224 1260798 1250132 1240385 1231217 1222435 1213440
50774 1213440 1203762 1193854 1184558 1175878 1166902 1156855 1145649 1133454 1120424 1106905 1093350 1079924
$$ packed form
50851A356037O2029O8759P6273Q3615R0559R7447J04131J09757J13838J17005
50841B279450J20155J23106J24615J23647J20187J14850J08104J00015R0439P9341
50831C383909O6976N3984M1187K9429J9517J2069P127M121K449K012K961M997
50819C630738P339R345J0787J1330J0028N719k045j2577k4772l8052n2351o7211
50807C488278q1502r4376j06002j16694j25679j31655j34443j35066j33988j30476
50797B298397j24159j16192j07983r9532r0098p9908p0149o1523n3786m6578l9840
50786A408649l3510k7652k2827j9489j7134j4813j2426j0666r747r168q782q995
50774A213440r678r908r296q680q976j0047j1206j2195j3030j3519j3555j3426
$$ plain form
50762 1079924 1066547 1053340 1040583 1028302 1016407 1005292 995718 988032 982013 977613 975295 975377 977583
50749 977583 981597 987713 996567 1008507 1023528 1041594 1062706 1086862 1114314 1145760 1181821 1222240
50737 1222240 1265868 1311683 1359658 1410428 1464138 1520014 1577268 1636008 1696688 1758795 1820852
50726 1820852 1881904 1942186 2001811 2059563 2113814 2164162 2211168 2254785 2294134 2328684 2358388
50715 2358388 2382291 2398198 2404513 2401781 2391982 2377045 2358710 2339046 2319999 2302613 2287450 2275635
50703 2275635 2268678 2267124 2269879 2275000 2280828 2286287 2290411 2291714 2288035 2277160 2257741 2229371 2191761
50690 2191761 2144415 2087572 2023029 1953418 1880907 1807067 1733668 1662719 1595654 1533107 1475620
50679 1475620 1424008 1378904 1340488 1308871 1284251 1266384 1254302 1246908 1243620 1244222 1248334 1255329
$$ packed form
50762A079924j3377j3207j2757j2281j1895j1115r574p686o019m400k318Q2K206
50749I77583M014O116Q854J1940J5021J8066K1112K4156K7452L1446L6061M0419
50737A222240M3628M5815M7975N0770N3710N5876N7254N8740O0680O2107O2057
50726A820852O1052O0282N9625N7752N4251N0348M7006M3617L9349L4550K9704
50715B358388K3903J5907O315k732r799j4937j8335j9664j9047j7386j5163j1815
50703B275635o957j554K755N121N828N459M124J303l679j0875j9419k8370l7610
50690B191761m7346n6843o4543o9611p2511p3840p3399p0949o7065o2547n7487
50679A475620n1612m5104l8416l1617k4620j7867j2082p394l288O02M112O995
$$ plain form
50667 1255329 1264622 1275799 1288481 1302179 1316235 1329945 1342873 1355061 1366824 1378385 1389962
50656 1389962 1402092 1415422 1430088 1445633 1461782 1479032 1498350 1520448 1545465 1573075 1602731
50645 1602731 1634055 1667162 1702481 1740169 1779906 1821368 1864599 1909700 1956401 2004133 2052322
50634 2052322 2100410 2147859 2194422 2240210 2285175 2328684 2369962 2408876 2445896 2481175 2513872
50623 2513872 2542316 2564561 2578719 2583225 2577407 2562179 2540181 2514939 2489542 2465883 2445038 2427940
50611 2427940 2415183 2406177 2399058 2391848 2383517 2373708 2361775 2346536 2326767 2301502 2269865 2231102
50599 2231102 2185015 2132188 2073782 2011193 1945843 1878988 1811662 1744883 1679796 1617396 1558149
50588 1558149 1502087 1449176 1399356 1352393 1308140 1266995 1229704 1196657 1167671 1142468 1120985
$$ packed form
50667A255329R293J1177J2682J3698J4056J3710J2928J2188J1763J1561J1577
50656A389962J2130J3330J4666J5545J6149J7250J9318K2098K5017K7610K9656
50645A602731L1324L3107L5319L7688L9737M1462M3231M5101M6701M7732M8189
50634B052322M8088M7449M6563M5788M4965M3509M1278L8914L7020L5279L2697
50623B513872K8444K2245J4158M506n818j5228k1998k5242k5397k3659k0845j7098
50611B427940j2757r006p119p210q331r809j1933j5239j9769k5265l1637l8763
50599B231102m6087n2827n8406o2589o5350o6855o7326o6779o5087o2400n9247
50588A558149n6062n2911m9820m6963m4253m1145l7291l3047k8986k5203k1483
$$ plain form
50577 1120985 1103087 1088432 1076795 1068181 1062413 1059018 1057813 1059267 1063888 1071486 1081364 1093044 1106369
50564 1106369 1121006 1136314 1151792 1167449 1183784 1201582 1221573 1243852 1267572 1291484 1314855
50553 1314855 1337714 1360318 1382672 1404552 1425658 1445696 1464634 1483025 1501820 1521706 1542800
50542 1542800 1565065 1588831 1614818 1643863 1676734 1713972 1755796 1802337 1854091 1911907 1976291
50531 1976291 2046856 2122657 2203022 2287910 2377583 2472047 2570733 2672567 2776346 2881061 2985686
50520 2985686 3088662 3187838 3281105 3366929 3444151 3511469 3567363 3610371 3639348 3653637 3653284
50509 3653284 3638919 3611269 3571004 3519305 3458373 3391104 3320381 3248954 3179659 3115208 3057750
50498 3057750 3008945 2970234 2942547 2925860 2919522 2922897 2934984 2953509 2975168 2996904 3016190 3029855
$$ packed form
50577A120985j7898j4655j1637q614n768l395j205J454M621P598R878J1680J3325
50564A106369J4637J5308J5478J5657J6335J7798J9991K2279K3720K3912K3371
50553A314855K2859K2604K2354K1880K1106K0038J8938J8391J8795J9886K1094
50542A542800K2265K3766K5987K9045L2871L7238M1824M6541N1754N7816O4384
50531A976291P0565P5801Q0365Q4888Q9673R4464R8686J01834J03779J04715J04625
50520B985686J02976R9176R3267Q5824P7222O7318N5894M3008K8977J4289l53
50509C653284j4365k7650m0265n1699o0932o7269p0723p1427o9295o4451n7458
50498C057750m8805l8711k7687j6687o338L375J2087J8525K1659K1736J9286J3665
$$ plain form
50486 3029855 3033681 3023917 2998682 2957392 2899651 2825742 2737783 2639296 2533595 2423334 2311430
50475 2311430 2201255 2095472 1995287 1901159 1813658 1733273 1659940 1593258 1532919 1478597 1429699
50464 1429699 1385570 1345818 1310321 1279157 1252642 1231084 1214263 1201406 1191882 1185652 1182877 1183462
50452 1183462 1187245 1194256 1204341 1216791 1230838 1246425 1264129 1284342 1306823 1330901 1355738 1380483
50440 1380483 1404534 1427686 1449724 1469872 1486989 1500326 1509834 1515760 1518362 1518092 1515667 1511719 1506595
50427 1506595 1500717 1494845 1489706 1485491 1482059 1479628 1479019 1481179 1486665 1495661 1508313 1524823 1545343
50414 1545343 1569972 1598936 1632570 1670960 1713648 1759770 1808413 1858704 1909674 1960304 2009764
50403 2009764 2057445 2102723 2144783 2182699 2215530 2242280 2261928 2273638 2276866 2271315 2256936 2234001
$$ packed form
50486C029855L826r764k5235m1290n7741p3909q7959r8487j05701j10261j11904
50475B311430j10175j05783j00185r4128q7501q0385p3333o6682o0339n4322m8898
50464A429699m4129l9752l5497l1164k6515k1558j6821j2857r524o230k775N85
50452A183462L783P011J0085J2450J4047J5587J7704K0213K2481K4078K4837K4745
50440A380483K4051K3152K2038K0148J7117J3337R508N926K602k70k425l948n124
50427A506595n878n872n139m215l432k431o09K160N486Q996J2652J6510K0520
50414A545343K4629K8964L3634L8390M2688M6122M8643N0291N0970N0630M9460
50403B009764M7681M5278M2060L7916L2831K6750J9648J1710L228n551j4379k2935
$$ plain form
50391 2234001 2203033 2164655 2119696 2069488 2015836 1960670 1905851 1853224 1804455 1760685 1722603
50380 1722603 1690922 1666414 1649368 1639356 1635623 1637243 1642775 1650358 1658501 1666274 1672351 1674463 1670485
50367 1670485 1659645 1642102 1617806 1586645 1549449 1507887 1463401 1417027 1370250 1325066 1282925
50356 1282925 1244251 1209178 1178004 1150720 1126798 1105827 1087718 1071992 1057476 1043069 1028271
50345 1028271 1012654 995586 977036 958138 940377 924618 911292 900910 893681 889139 886800 886879
50333 886879 889697 894779 901295 909014 918004 927675 937118 946313 956039 966445 976620 985822 994337 1002755
50319 1002755 1011130 1019279 1027243 1034863 1041339 1045786 1048039 1048534 1047695 1045919 1043869 1042199 1040973 1039831
50305 1039831 1038794 1038529 1039629 1041930 1044851 1048391 1053550 1061582 1072876 1086748 1102320 1119362 1138118
$$ packed form
50391B234001l0968l8378m4959n0208n3652n5166n4819n2627m8769m3770l8082
50380A722603l1681k4508j7046j0012l733J620N532P583Q143P773O077K112l978
50367A670485j0840j7543k4296l1161l7196m1562m4486m6374m6777m5184m2141
50356A282925l8674l5073l1174k7284k3922k0971j8109j5726j4516j4407j4798
50345A028271j5617j7068j8550j8898j7761j5759j3326j0382p229m542k339P9
50333H86879K818N082O516P719Q990R671R443R195R726J0406J0175R202Q515Q418
50319A002755Q375Q149P964P620O476M447K253M95q39j776k050j670j226j142
50305A039831j037k65J100K301K921L540N159Q032J1294J3872J5572J7042J8756
$$ plain form
50292 1138118 1158659 1180840 1204744 1230579 1257865 1285006 1309786 1329980 1343430 1348163 1343173 1329265
50280 1329265 1308907 1285138 1260540 1236840 1214976 1195342 1178097 1163385 1151306 1141775 1134458 1128802
50268 1128802 1124111 1119777 1115645 1112124 1109804 1108873 1108966 1109592 1110682 1112686 1116101 1120958 1126910 1133833 1142147
50253 1142147 1152338 1164195 1176741 1188849 1199820 1209537 1218445 1227387 1237021 1247131 1256676 1264632
50241 1264632 1270573 1274330 1275496 1273639 1268916 1262143 1254285 1246076 1238039 1230553 1223749 1217353 1210646 1202542
50227 1202542 1191918 1178125 1161191 1141426 1118919 1093618 1065880 1036687 1007253 978544 951214
50216 951214 925781 902593 881675 862735 845473 829865 816029 803837 792833 782755 774018 767302
50204 767302 762565 758814 755113 751514 748548 746015 742876 738533 733678 729488 726325 723620 720854 718024
$$ packed form
50292A138118K0541K2181K3904K5835K7286K7141K4780K0194J3450M733m990j3908
50280A329265k0358k3769k4598k3700k1864j9634j7245j4712j2079r531p317n656
50268A128802m691m334m132l521k320r31R3O26J090K004L415M857N952O923Q314
50253A142147J0191J1857J2546J2108J0971R717Q908Q942R634J0110R545P956
50241A264632N941L757J166j857m723o773p858q209q037p486o804o396o707q104
50227A202542j0624j3793j6934j9765k2507k5301k7738k9193k9434k8709k7330
50216I51214k5433k3188k0918j8940j7262j5608j3836j2192j1004j0078q737o716
50204G67302m737l751l701l599k966k533l139m343m855m190l163k705k766k830
$$ plain form
50190 718024 715115 711727 707582 703072 698789 694671 690045 684585 678802 673461 668834 664796 661246 658102
50176 658102 655076 651948 648977 646608 644817 643174 641664 640903 641307 642484 643870 645563 648025 651171 654350
50161 654350 657283 660495 664688 670069 676467 683746 691883 700861 710755 721788 734132 747785 762681
50148 762681 778703 795511 812749 830637 849958 871050 893190 915537 938430 962980 989360
50137 989360 1016267 1042365 1067572 1092511 1117332 1141761 1165845 1189797 1213122 1234614 1253339
50126 1253339 1269000 1281161 1288697 1290432 1286075 1276276 1262022 1244233 1223708 1201120 1177089 1152314
50114 1152314 1127512 1103174 1079603 1057326 1037126 1019425 1003808 989443 975813 962794 950133
50103 950133 937263 923792 910010 896809 884999 874698 865457 857020 849735 843984 839467 835536 832121
$$ packed form
50190G18024k909l388m145m510m283m118m626n460n783n341m627m038l550l144
50176F58102l026l128k971k369j791j643j510p61M04J177J386J693K462L146L179
50161F54350K933L212M193N381O398P279Q137Q978R894J1033J2344J3653J4896
50148G62681J6022J6808J7238J7888J9321K1092K2140K2347K2893K4550K6380
50137I89360K6907K6098K5207K4939K4821K4429K4084K3952K3325K1492J8725
50126A253339J5661J2161P536J735m357r799j4254j7789k0525k2588k4031k4775
50114A152314k4802k4338k3571k2277k0200j7701j5617j4365j3630j3019j2661
50103I50133j2870j3471j3782j3201j1810j0301r241q437p285n751m517l931l415
$$ plain form
50090 832121 829686 828266 827330 826941 828195 831901 837432 843599 850183 857797 866546 875682 884400 892155 898395
50075 898395 902934 906654 910833 915526 919472 921838 923194 924345 925055 924604 922933 920450 917096 912403 906408
50060 906408 899923 893863 888662 884258 880325 876546 872921 869799 867495 866063 865494 865954 867635 870595 874798
50045 874798 880081 886083 892665 900384 909969 921126 932576 943662 955151 967897 981367 994325
50033 994325 1006506 1018599 1030780 1042284 1052568 1062094 1071724 1081905 1092664 1103831 1115034 1125929
50021 1125929 1136692 1147899 1159728 1171580 1182665 1192664 1201566 1209102 1214658 1217701 1218292 1217193 1215298
50008 1215298 1212729 1208525 1201459 1191081 1177750 1161820 1143253 1122032 1098569 1073681 1048496 1024291
49996 1024291 1002073 982247 964979 950630 939276 929918 920929 911568 902472 894386 886999 879408 871199
$$ packed form
50090H32121k435j420r36l89J254L706N531O167O584P614Q749R136Q718P755O240
50075H98395M539L720M179M693L946K366J356J151P10m51j671k483l354m693n995
50060I06408o485o060n201m404l933l779l625l122k304j432n69M60J681K960M203
50045H74798N283O002O582P719R585J1157J1450J1086J1489J2746J3470J2958
50033I94325J2181J2093J2181J1504J0284R526R630J0181J0759J1167J1203J0895
50021A125929J0763J1207J1829J1852J1085R999Q902P536N556L043N91j099j895
50008A215298k569m204p066j0378j3331j5930j8567k1221k3463k4888k5185k4205
49996A024291k2218j9826j7268j4349j1354r358q989r361r096q086p387p591q209
$$ plain form
49983 871199 862477 853145 842756 831067 818304 804872 791074 777101 763108 749275 735885 723278
49971 723278 711637 700972 691392 683176 676410 670704 665458 660302 655224 650447 646275 642845 639895 637026
49957 637026 634348 632674 632856 635125 639196 644712 651297 658498 666108 674469 684091 694966 706452 717765
49943 717765 728274 737449 744900 750573 754657 757262 758377 758140 756863 754655 751252 746308 739680 731303
49929 731303 720997 708684 694849 680657 667443 656038 646466 638215 630806 624208 618803 614952 612588
49916 612588 611219 610376 610034 610520 611985 614115 616429 618706 621031 623647 627024 631853 638521 646534 654833
49901 654833 662862 671075 680231 690450 701225 712087 722909 733569 743633 752504 759720 765009 768108
49888 768108 768684 766548 761970 755672 748374 740388 731668 722131 711717 700321 688011 675307 662948
$$ packed form
49983H71199q722r332j0389j1689j2763j3432j3798j3973j3993j3833j3390j2607
49971G23278j1641j0665r580q216o766n706n246n156n078m777m172l430k950k869
49957F37026k678j674J82K269M071N516O585P201P610Q361R622J0875J1486J1313
49943G17765J0509R175P451N673M084K605J115k37j277k208l403m944o628q377
49929G31303j0306j2313j3835j4192j3214j1405r572q251p409o598n405l851k364
49916F12588j369q43l42M86J465K130K314K277K325K616L377M829O668Q013Q299
49901F54833Q029Q213R156J0219J0775J0862J0822J0660J0064Q871P216N289L099
49888G68108N76k136m578o298p298p986q720r537j0414j1396j2310j2704j2359
$$ plain form
49875 662948 651329 640502 630710 622456 615789 609918 604024 598275 593712 591145 590438 590793 591496 592416 594031
49860 594031 597052 601895 608462 616415 625525 635641 646487 657668 668894 680055 691107 701915
49848 701915 712154 721339 729073 735274 739963 742873 743590 742252 739778 737084 734237 730597 725575 719013
49834 719013 711081 702222 693193 684789 677439 671226 666193 662405 659731 657816 656359 655346 655069 655976 658354
$$ packed form
49875F62948j1619j0827r792q254o667n871n894n749m563k567p07L55P03R20J615
49860E94031L021M843O567P953R110J0116J0846J1181J1226J1161J1052J0808
49848G01915J0239R185P734O201M689K910P17j338k474k694k847l640n022o562
49834G19013p932q859r029q404p350o213n033l788k674j915j457j013k77R07K378
$$ [...]
##END NTUPLES=NMR SPECTRUM
##END=
