##TITLE=AC1593_CASAH13323_8314147_4EOzgultl5
##JCAMPDX= 6.0         $$ Bruker NMR JCAMP-DX V2.0
##DATA TYPE= NMR SPECTRUM
##DATA CLASS= NTUPLES
##ORIGIN= BRUKER
##OWNER= Administrator
$$ 1.72 TOPSPIN		Version 2.1
$$ 2013-11-09 12:36:35.593 -0800  Administrator@X
$$ Compression mode = diff/dup
##.OBSERVE FREQUENCY= 400.02188249412
##.OBSERVE NUCLEUS= ^1H
##.ACQUISITION MODE= SIMULTANEOUS (DQD)
##.ACQUISITION SCHEME= undefined
##.AVERAGES= 64
##.DIGITISER RES= 22
##SPECTROMETER/DATA SYSTEM= spect
##.PULSE SEQUENCE= noesygpps1d.comp
##.SOLVENT NAME= COFFEE_meoh
##.SHIFT REFERENCE= INTERNAL, COFFEE_meoh, 1, 14.96095
##AUDIT TRAIL= $$ (NUMBER, WHEN, WHO, WHERE, PROCESS, VERSION, WHAT)
$$ ##TITLE= Audit trail, TOPSPIN		Version 2.1
$$ ##JCAMPDX= 5.01
$$ ##ORIGIN= Bruker BioSpin GmbH
$$ ##OWNER= Administrator
$$ $$ E:\/data/COFFEE/nmr/AC1593_CASAH13323_8314147_4EOzgultl5/12/pdata/1/auditp.txt
$$ ##AUDIT TRAIL=  $$ (NUMBER, WHEN, WHO, WHERE, PROCESS, VERSION, WHAT)
(   1,<2013-11-09 12:36:30.202 -0800>,<Administrator>,<X>,<go>,<TOPSPIN 2.1>,
      <created by zg
	started at 2013-11-09 12:24:58.797 -0800,
	POWCHK enabled, PULCHK disabled,
       configuration hash MD5:
       C8 4E 4E 5D D3 5C D8 9E 9F 52 82 E0 59 8A DE 15
       data hash MD5: 64K
       DF CD 74 1B FB 64 EF 09 B7 8A A5 F6 FC CE 15 9C>)
(   2,<2013-11-09 12:36:33.530 -0800>,<Administrator>,<X>,<proc1d>,<TOPSPIN 2.1>,
      <Start of raw data processing
       efp LB = 0.3 FT_mod = 6 PKNL = 1 PHC0 = 0 PHC1 = 0 SI = 128K 
       data hash MD5: 128K
       39 C5 9E C1 37 0A 19 A6 BA 24 69 CE 46 B8 34 2D>)
(   3,<2013-11-09 12:36:34.577 -0800>,<Administrator>,<X>,<proc1d>,<TOPSPIN 2.1>,
      <pk PHC0 = -85.7373 PHC1 = 0 
       data hash MD5: 128K
       BC 2F 55 81 57 B9 26 C9 E2 4F D0 57 D7 00 18 0B>)
(   4,<2013-11-09 12:36:34.999 -0800>,<Administrator>,<X>,<proc1d>,<TOPSPIN 2.1>,
      <abs ABSG = 1 
       data hash MD5: 128K
       2A 55 A5 FD 79 EE 17 3D 77 13 3F AE FF 3B 5D 0A>)
(   5,<2013-11-09 12:36:35.108 -0800>,<Administrator>,<X>,<proc1d>,<TOPSPIN 2.1>,
      <abs ABSG = 2 
       data hash MD5: 128K
       A5 B1 D7 CA D6 19 BC 4F 5E CB 21 39 32 27 E6 71>)
(   6,<2013-11-09 12:36:35.202 -0800>,<Administrator>,<X>,<proc1d>,<TOPSPIN 2.1>,
      <abs ABSG = 3 
       data hash MD5: 128K
       F2 C5 1E 98 DD B9 91 EB 83 FE 84 FB 20 4A 1E 41>)
(   7,<2013-11-09 12:36:35.280 -0800>,<Administrator>,<X>,<proc1d>,<TOPSPIN 2.1>,
      <abs ABSG = 4 
       data hash MD5: 128K
       8B 42 6A 83 7C B4 22 9E AD 3D F0 A4 C2 2A D6 D5>)
(   8,<2013-11-09 12:36:35.374 -0800>,<Administrator>,<X>,<proc1d>,<TOPSPIN 2.1>,
      <abs ABSG = 5 
       data hash MD5: 128K
       80 76 32 05 03 01 CD E0 C8 DA 60 6F DF D1 17 3E>)
$$ ##END=
$$ 
$$ $$ hash MD5
$$ $$ E6 09 C9 A0 2F 38 90 4F EB E8 D4 78 97 D2 4F 9B
##$RELAX= 
##$RELAX= 
##$RELAX= 
##$RELAX= 
##$RELAX= 
##$RELAX= 
##$RELAX= 
##$RELAX= 
$$ Bruker specific parameters
$$ --------------------------
##$DU= <E:\>
##$EXPNO= 12
$$ [...]
150 150 150 150 150 150 150 150
##$TP07= 0
##$TPNAME0= <>
##$TPNAME1= <>
##$TPNAME2= <>
##$TPNAME3= <>
##$TPNAME4= <>
##$TPNAME5= <>
##$TPNAME6= <>
##$TPNAME7= <>
##$TPOAL= (0..7)
0.5 0.5 0.5 0.5 0.5 0.5 0.5 0.5
##$TPOFFS= (0..7)
0 0 0 0 0 0 0 0
##$TUNHIN= 0
##$TUNHOUT= 0
##$TUNXOUT= 0
##$USERA1= <user>
##$USERA2= <user>
##$USERA3= <user>
##$USERA4= <user>
##$USERA5= <user>
##$V9= 5
##$VALIST= <valist>
##$VCLIST= <CCCCCCCCCCCCCCC>
##$VD= 0
##$VDLIST= <DDDDDDDDDDDDDDD>
##$VPLIST= <PPPPPPPPPPPPPPP>
##$VTLIST= <TTTTTTTTTTTTTTT>
##$WBST= 1024
##$WBSW= 4
##$XGAIN= (0..3)
0 0 0 0
##$XL= 0
##$YL= 0
##$YMAX_a= 5814005
##$YMIN_a= -11276922
##$ZGOPTNS= <>
##$ZL1= 120
##$ZL2= 120
##$ZL3= 120
##$ZL4= 120
##$ABSF1= 14.96095
##$ABSF2= -5.597232
##$ABSG= 5
##$ABSL= 3
##$ALPHA= 0
##$AQORDER= 0
##$ASSFAC= 0
##$ASSFACI= 0
##$ASSFACX= 0
##$ASSWID= 0
##$AUNMP= <proc_prof1d_extract.lims>
##$AXLEFT= 0
##$AXNAME= <>
##$AXNUC= <1H>
##$AXRIGHT= 0
##$AXTYPE= 0
##$AXUNIT= <>
##$AZFE= 0.1
##$AZFW= 0.1
##$BCFW= 0
##$BC_mod= 0
##$BYTORDP= 0
##$COROFFS= 0
##$CY= 15
##$DATMOD= 1
##$DC= 0
##$DFILT= <>
##$DTYPP= 0
##$F1P= 0
##$F2P= 0
##$FCOR= 0.5
##$FTSIZE= 131072
##$FT_mod= 6
##$GAMMA= 0
##$GB= 0
##$INTBC= 1
##$INTSCL= 1
##$ISEN= 128
##$LB= 0.3
##$LEV0= 0
##$LPBIN= 0
##$MAXI= 10000
##$MC2= 0
##$MEAN= 0
##$ME_mod= 0
##$MI= 0
##$NCOEF= 0
##$NC_proc= -2
##$NLEV= 6
##$NOISF1= 0
##$NOISF2= 0
##$NSP= 0
##$NTH_PI= 0
##$NZP= 0
##$OFFSET= 14.96095
##$PC= 1
##$PHC0= -85.7373
##$PHC1= 0
##$PH_mod= 1
##$PKNL= yes
##$PPARMOD= 0
##$PPDIAG= 0
##$PPIPTYP= 0
##$PPMPNUM= 2147483647
##$PPRESOL= 1
##$PSCAL= 4
##$PSIGN= 0
##$PYNMP= <proc.py>
##$REVERSE= no
##$SF= 400.020009655851
##$SI= 131072
##$SIGF1= 0
##$SIGF2= 0
##$SINO= 400
##$SIOLD= 131072
##$SPECTYP= <>
##$SREGLST= <1H.CDCl3>
##$SSB= 0
##$STSI= 131072
##$STSR= 0
##$SW_p= 8223.68421052631
##$SYMM= 0
##$S_DEV= 0
##$TDeff= 65536
##$TDoff= 0
##$TI= <>
##$TILT= no
##$TM1= 0
##$TM2= 0
##$TOPLEV= 0
##$USERP1= <user>
##$USERP2= <user>
##$USERP3= <user>
##$USERP4= <user>
##$USERP5= <user>
##$WDW= 1
##$XDIM= 131072
##$YMAX_p= 429361512
##$YMIN_p= -18460
##$CURPLOT= <Network HP LaserJet P1505>
##$CURPRIN= <$Network HP LaserJet P1505>
##$DFORMAT= <normdp>
##$LAYOUT= <+/1D_H.xwp>
##$LFORMAT= <normlp>
##$PFORMAT= <normpl>
##$SURQMSG= 1
$$ End of Bruker specific parameters
$$ ---------------------------------
##NTUPLES= NMR SPECTRUM
##VAR_NAME=  FREQUENCY,     SPECTRUM/REAL,   SPECTRUM/IMAG
##SYMBOL=    X,             R,               I
##VAR_TYPE=  INDEPENDENT,   DEPENDENT,       DEPENDENT
##VAR_FORM=  AFFN,          ASDF,            ASDF
##VAR_DIM=   131072,        131072,          131072
##UNITS=     HZ,            ARBITRARY UNITS, ARBITRARY UNITS
##FACTOR=    0.0627417313425164, 1,          1
##FIRST=     8223.62146879497, -621,         -57374
##LAST=      0,             961,             -58424
##MIN=       0,             -18460,          0
##MAX=       8223.62146879497, 429361512,    0
$$ Real data points
##PAGE= N=1
##DATA TABLE= (X++(R..R)), XYDATA
$$ [...]
63933C095206K19258K11884J99643J82064J59226J32239J02358P0369L7129L898
63923D413274k8681o1177r4044j25972j54378j77412j94869k07203k14407k16261
63913B938870k13248k06709j97987j87588j75414j61709j47401j33298j19393
63904A396123j05386r1636p8989o7885n8196m9852m2927l7168l2124k7794k4457
63893G79709k1896j9560j7592j6742j7009j7290j6797j6011j5657j5531j4953
63882E90671j3777j2272j0505q484o470m578k511j46K101M039O204Q898J1362
63869E64532J2781J3634J5032J7070J8853K0009K1052K2184K2827K2600K1926
63858G72500K1229K0245J8588J6414J4098J1687R071O367L710R56k007m943p589
$$ y = [3095206, 3314464, 3526348, 3725991, 3908055, 4067281, 4199520, 4301878, 4372247, 4409376, 4413274, 4384593, 4323416, 4229372, 4103400, 3949022, 3771610, 3576741, 3369538, 3155131, 2938870, 2725622, 2518913, 2320926, 2133338, 1957924, 1796215, 1648814, 1515516, 1396123, 1290737, 1199101, 1120112, 1052227, 994031, 944179, 901252, 864084, 831960, 804166, 779709, 757813, 738253, 720661, 703919, 686910, 669620, 652823, 636812, 621155, 605624, 590671, 576894, 564622, 554117, 545633, 539163, 534585, 532074, 531928, 534029, 538068, 544272, 553170, 564532, 577313, 590947, 605979, 623049, 641902, 661911, 682963, 705147, 727974, 750574, 772500, 793729, 813974, 832562, 848976, 863074, 874761, 883832, 890199, 893909, 894865, 892858, 887915, 880326]
63845H80326j0116j2823j5516j7657j9171k0732k2960k5592k7671k8518k8303
63834F51267k7689k7185k6896k6619k6011k4766k2907k0795j8756j6820j5035
63823C97788j3781j3365j3410j3072j1920j0302q838p891p498p381p022o081m860
63810B72367l885l165k355j647j657k241k327j425n48q51j974k581k257j905k299
63795B41250l112l578l446k988k475j996j613j395j338j365j430j585j905k296
63781B10728k383j848q75n1K23O3j71k04R4N97Q18L30n38r07m35K54M67K51k0
63762B06393k91n82n95j79J78p5p05j070j097j230j554j597j083k53O10J477K273
63745B00620K717K664K318J938J575J183Q52Q12J206J839K206K001J610J732K406
$$ y = [880326, 870210, 857387, 841871, 824214, 805043, 784311, 761351, 735759, 708088, 679570, 651267, 623578, 596393, 569497, 542878, 516867, 492101, 469194, 448399, 429643, 412823, 397788, 384007, 370642, 357232, 344160, 332240, 321938, 313100, 305209, 297711, 290330, 283308, 277227, 272367, 268482, 265317, 262962, 261315, 259658, 257417, 255090, 253665, 253117, 252266, 250292, 247711, 245454, 243549, 241250, 238138, 234560, 231114, 228126, 225651, 223655, 222042, 220647, 219309, 217944, 216514, 214929, 213024, 210728, 208345, 206497, 205622, 205571, 205794, 205857, 205686, 205482, 205576, 206173, 206991, 207321, 206783, 205876, 205441, 205695, 206162, 206413, 206393, 206102, 205520, 204925, 204746, 204924, 204849, 204144, 203074, 201977, 200747, 199193, 197596, 196513, 196260, 196870, 198347, 200620, 203337, 206001, 208319, 210257, 211832, 213015, 213867, 214679, 215885, 217724, 219930, 221931, 223541, 225273, 227679]
63730B27679K831K385J446Q60R79J568K328L090L802M641N801O855O843N477L777
63715B80362K816K359J477R3j013j554k068k943l970m926n663n616m155j780k
63700B53417L96K30N51J223J501J382J501J961K154J782J341J374J783K175K561
63685B75332L200L893L899K832J258R3m22p04r24p12P5R35J354J408J382J279
63669B94178J053Q99R07Q25O66Q75J381J181k27j642j562m81m50k328m724n925
63653B84626n742n030m396m033l964l840l069j791j025j307j770j231K27J544
63639B49199K177K514K932L173K893K254J754J698J977K352K740L249L890M480
63625B87282M914N334N736N691M967M311M887O817Q906J0109J0697J1607J3105
$$ y = [227679, 230510, 232895, 234341, 235201, 236180, 237748, 240076, 243166, 246968, 251609, 257410, 264265, 271108, 276585, 280362, 283178, 285537, 287014, 287107, 286094, 284540, 282472, 279529, 275559, 270633, 264970, 259354, 255199, 253419, 253417, 253813, 254043, 254594, 255817, 257318, 258700, 260201, 262162, 264316, 266098, 267439, 268813, 270596, 272771, 275332, 278532, 282425, 286324, 289156, 290414, 290507, 290085, 289381, 288457, 287745, 287820, 288755, 290109, 291517, 292899, 294178, 295231, 296130, 297037, 297862, 298528, 299403, 300784, 301965, 301738, 300096, 298534, 298053, 297603, 295275, 290551, 284626, 278884, 273854, 269458, 265425, 261461, 257621, 254552, 252761, 251736, 250429, 248659, 247428, 247655, 249199, 251376, 253890, 256822, 259995, 262888, 265142, 266896, 268594, 270571, 272923, 275663, 278912, 282802, 287282, 292196, 297530, 303266, 308957, 313924, 318235, 323122, 329939, 338845, 348954, 359651, 371258, 384363]
63612C84363J4697J5991J7051J7995J8800J9639K0976K3023K5188K6364K5823
63601F09910K3814K1108J7977J3938Q692L003j735m682o070o642o932p076o993
63588F58312o747o847p981j0280j3152j6045j8873k1333k2470k1741j9959j8269
63576D74615j6564j4050j1100r117q422p690n876l474j339O09K639M199M582M099
63562D13111L706L979M957O438P761P951O888N868O259P947R786J1262J2913J5387
63548E24213J8695K2312K5538K8075L0505L3725L7294L8928L6291K9104J9033
63537H43713Q211j494q537j2299j3552j3445j2274r931p145n184m485m726o089
63524G52763r245j3926j8681k2505k5672k8503l0256l0055k8339k6502k5299k4185
$$ y = [384363, 399060, 415051, 432102, 450097, 468897, 488536, 509512, 532535, 557723, 584087, 609910, 633724, 654832, 672809, 686747, 695439, 698442, 696707, 692025, 685955, 679313, 672381, 665305, 658312, 651565, 644718, 636737, 626457, 613305, 597260, 578387, 557054, 534584, 512843, 492884, 474615, 458051, 444001, 432901, 423784, 415362, 407672, 401796, 398322, 396983, 397592, 400231, 404430, 409012, 413111, 416817, 420796, 425753, 432191, 439952, 447903, 454791, 460659, 466918, 474865, 484651, 495913, 508826, 524213, 542908, 565220, 590758, 618833, 649338, 683063, 720357, 759285, 795576, 824680, 843713, 851924, 850430, 841893, 829594, 816042, 802597, 790323, 780392, 773247, 768063, 763578, 758852, 752763, 743518, 729592, 710911, 688406, 662734, 634231, 603975, 573920, 545581, 519079, 493780, 469595]
63512D69595k2219j9270j6239j4170j3173j2384j1093r583q443p467n991m146
63500C25417k865k485k294j741j318j651k383k669k267j545p00K83J078J144M78
63485C06482k76n64l98k7M94J188J942K574L003L236L322L370L474L513L118K045
63469C36496N05j062k374l335l738l460k957l087l975m520l668j931q52r05r29
63454C00208J16J640K362K050J545J456J718K207K930L618L929M207N269P278
63440C40533R350J0596J1101J1665J2916J4952J7536K0419K3594K7067L0137L1027
63428E60893K8036K1294J3011N757Q28j773k462j662K29L065O984J1835J6792
63415F62827K0852K3675K5652K7227K8369K8607K7277K3842J8208J0974L324l360
$$ y = [469595, 447376, 428106, 411867, 397697, 384524, 372140, 361047, 351464, 343021, 335554, 329563, 325417, 322552, 320067, 317773, 316032, 314714, 313063, 310680, 308011, 305744, 304199, 303499, 303782, 304860, 306004, 306482, 306206, 305642, 305244, 305217, 305711, 306899, 308841, 311415, 314418, 317654, 320976, 324346, 327820, 331333, 334451, 336496, 337001, 335939, 333565, 330230, 326492, 323032, 320075, 316988, 313013, 308493, 304825, 302894, 302042, 301137, 300208, 300324, 301964, 304326, 306376, 307921, 309377, 311095, 313302, 316232, 319850, 323779, 327986, 333255, 340533, 349883, 360479, 371580, 383245, 396161, 411113, 428649, 449068, 472662, 499729, 529866, 560893, 588929, 610223, 623234, 628991, 629819, 628046, 625584, 623922, 624151, 627216, 634200, 646035, 662827, 683679, 707354, 733006, 760233, 788602, 817209, 844486, 868328, 886536, 897510, 900834, 897474]
63403H97474q017j0373j0928j0455r523q624q472r643j1967j4786j7902k1611
63391G55173k5640k8770l0026k9789k9101k8228k6633k4192k1601j9456j7592
63380D74145j5577j3415j1388r492p455n230l124j393J47J939M129O258P632Q062
63366D35238Q139Q648R766J1086J2337J3859J6134J9046K1847K3935K5452K6964
63354F32451K8654L0098L0860L1028L0832K9817K6933K1640J4706P575J172m344
63342H81422q802j1585j2267j1367j0078r326r321j0011j1568j4184j7566k0919
63330G34428k3517k5149k5995k6125k5295k3241k0120j6623j3541j1123q805n697
63318E09197j518K763N226M141q06q104j5221k0018k1740k0964j8816j6278j3981
$$ y = [897474, 889457, 879084, 868156, 857701, 848178, 839554, 831082, 821439, 809472, 794686, 776784, 755173, 729533, 700763, 670737, 640948, 611847, 583619, 556986, 532794, 511193, 491737, 474145, 458568, 445153, 433765, 424273, 416818, 411588, 408464, 407071, 407218, 409157, 413286, 419544, 427176, 435238, 443377, 452025, 461791, 472877, 485214, 499073, 515207, 534253, 556100, 580035, 605487, 632451, 661105, 691203, 722063, 753091, 783923, 813740, 840673, 862313, 877019, 884594, 885766, 881422, 872620, 861035, 848768, 837401, 827323, 817997, 808676, 798665, 787097, 772913, 755347, 734428, 710911, 685762, 659767, 633642, 608347, 585106, 564986, 548363, 534822, 523699, 514894, 509197, 507679, 510442, 515668, 519809, 519003, 510899, 495678, 475660, 453920, 432956, 414140, 397862, 383881]
63305C83881j2188j0826r606q288o860n442m187l317l062l342l627l280k216j033
63291C06607m52o11j050j325j472j803k309k581k356j914j740j867j844j351n96
63276B83336m5Q1k5k4J77K84l1n52n14N04J837K358J840J205J281J860K326K678
63258B98576L299M011M087L342K567K610L383M134M440M549M739M850M763N017
63244C54367O401Q798J0947J1770J1627J1827J3078J4992J6967J8897K0832K2629
63232E23132K4237K5805K7149K7647K7171K6583K6718K7227K7148K6382K5789
63221H14988K5925K6441K6884K7364K8109K8861K9167K8890K8061K6427K3552
63210A114669J9309J3954P712N79p333j5414k2735k8677l3258l6756l9162m0256
$$ y = [383881, 371693, 360867, 351261, 342973, 336113, 330671, 326484, 323167, 320105, 316763, 313136, 309856, 307640, 306607, 306155, 305544, 304494, 303169, 301697, 299894, 297585, 295004, 292648, 290734, 288994, 287127, 285283, 283932, 283336, 283291, 283372, 283347, 283323, 283500, 283784, 283753, 283201, 282687, 283191, 285028, 287386, 289226, 290431, 291712, 293572, 295898, 298576, 301875, 305886, 309973, 313315, 315882, 318492, 321875, 326009, 330449, 334998, 339737, 344587, 349350, 354367, 360768, 369566, 380513, 392283, 403910, 415737, 428815, 443807, 460774, 479671, 500503, 523132, 547369, 573174, 600323, 627970, 655141, 681724, 708442, 735669, 762817, 789199, 814988, 840913, 867354, 894238, 921602, 949711, 978572, 1007739, 1036629, 1064690, 1091117, 1114669, 1133978, 1147932, 1155644, 1156223, 1148890, 1133476, 1110741, 1082064, 1048806, 1012050, 972888, 932632]
63198I32632m0055l8834l6690l3508k9443k5064k0764j6500j2313q677n862l405
63186F61517o34K540N782Q933J1862J4097J5297J5982J7026J8446J9395J9450
63174H09693J9228J9507K0321K1120K1355K0616J8776J6249J3739J1407Q660M936
63162A005607L39m760j0275j6125k1726k6187k9059l0694l1898l3281l4693l5255
63150G31993l4183l1679k8778k6227k3829k1032j7775j4540j1860j0026r054q591
63138D94419q052p068n780m548l577k880k460k296k301k379k352j853o04J095
63124D49364K441K981L059L254L648L956M122M350M619M655M416M313M657N108
63110E04943M952M027L082K982L592L876L188K013J185P98M53J84M10J031J390
$$ y = [932632, 892577, 853743, 817053, 783545, 754102, 729038, 708274, 691774, 679461, 670784, 664922, 661517, 660883, 663423, 669205, 678138, 690000, 704097, 719394, 735376, 752402, 770848, 790243, 809693, 828921, 848428, 868749, 889869, 911224, 931840, 950616, 966865, 980604, 992011, 1000671, 1005607, 1005946, 1001186, 990911, 974786, 953060, 926873, 897814, 867120, 835222, 801941, 767248, 731993, 697810, 666131, 637353, 611126, 587297, 566265, 548490, 533950, 522090, 512064, 503010, 494419, 486367, 479299, 473519, 468971, 465394, 462514, 460054, 457758, 455457, 453078, 450726, 448873, 448269, 449364, 451805, 454786, 457845, 461099, 464747, 468703, 472825, 477175, 481794, 486449, 490865, 495178, 499835, 504943, 509895, 513922, 517004, 519986, 523578, 527454, 530642, 532655, 533840, 534638, 535091, 535275, 535685, 536716, 538106]
63095E38106J201Q52N90J30o31j181j065n47r3K19M44M02J37K29R77J737J841
63078E43348J790K663M425N782N912N529N810O957Q266R188R769J0278J0882J1735
63064F42334J2978J4565J6259J7883J9534K1469K3841K6588K9543L2651L6016
63053H93661L9789M3993M8401N2494N5687N7808N9366O1115O3245O5166O6149
63042A506874O6086O5529O5187O5359O5754O5799O5365O5109O5754O7020O7628
63031B231464O6471O3267N7949N0146L9719K7296J3599j416j7929l5023n0838
63020B444705o4109p4814q3294q9423r2950r3990r2692q8871q2478p4166o5014
63009A542904n5808m6850l8157k9555k0827j2240m693J198O018J0957J6268K0902
$$ y = [538106, 539307, 540159, 540749, 540879, 540248, 539067, 538002, 537455, 537362, 537581, 538025, 538427, 538564, 538793, 539770, 541507, 543348, 545138, 547801, 552226, 558008, 563920, 569449, 575259, 582216, 590482, 599670, 609439, 619717, 630599, 642334, 655312, 669877, 686136, 704019, 723553, 745022, 768863, 795451, 824994, 857645, 893661, 933450, 977443, 1025844, 1078338, 1134025, 1191833, 1251199, 1312314, 1375559, 1440725, 1506874, 1572960, 1638489, 1703676, 1769035, 1834789, 1900588, 1965953, 2031062, 2096816, 2163836, 2231464, 2297935, 2361202, 2419151, 2469297, 2509016, 2536312, 2549911, 2548495, 2530566, 2495543, 2444705, 2380596, 2305782, 2222488, 2133065, 2040115, 1946125, 1853433, 1764562, 1682084, 1607918, 1542904, 1487096, 1440246, 1402089, 1372534, 1351707, 1339467, 1334774, 1335972, 1341990, 1352947, 1369215, 1390117]
62997A390117K3982K5999K8138L0735L3070L4464L4952L4832L4186L3200L2421
62986A736096L2179L1862L0341K7026K2204J6274R134N59r190j9366k9220l8240
62974A809659m6157n2939n8749o3588o6970o8232o7273o4767o1494n7681n3226
62963A148583m8396m3910m0155l6707l2955k9093k6071k4481k3797k2925k1327
62952G98766j9429j7997j7403j7382j7405j7167j6780j6405j5874j4867j3527
62941F14530j2498j2126j1939j1227r950q626p558o539n335m107l249l021l251
62928E15104l295k532j180k73l67o71j43Q07P32p07k101k207j552j425k068k733
62912D95389l014l111k936k082q33k74r65k153k801k922l320m198m770m334l227
$$ y = [1390117, 1414099, 1440098, 1468236, 1498971, 1532041, 1566505, 1601457, 1636289, 1670475, 1703675, 1736096, 1768275, 1800137, 1830478, 1857504, 1879708, 1895982, 1905116, 1905675, 1896485, 1877119, 1847899, 1809659, 1763502, 1710563, 1651814, 1588226, 1521256, 1453024, 1385751, 1320984, 1259490, 1201809, 1148583, 1100187, 1056277, 1016122, 979415, 946460, 917367, 891296, 866815, 843018, 820093, 798766, 779337, 761340, 743937, 726555, 709150, 691983, 675203, 658798, 642924, 628057, 614530, 602032, 589906, 577967, 566740, 556790, 548164, 540606, 534067, 528732, 524625, 521376, 518355, 515104, 511809, 509277, 508097, 507824, 507457, 506786, 506643, 507450, 508182, 507475, 505374, 503167, 501615, 500190, 498122, 495389, 492375, 489264, 486328, 484246, 483413, 483139, 482174, 480021, 477220, 474298, 470978, 466780, 462010, 457676, 454449]
62897D54449k381k161k067j536p10k38n06j179j483r04L02J236J194L98l13m79
62881D43622m23n46o95n76l47l42m43k84J19M35N63O00M29q3n85o46n46q99j477
62862D37876j354l68M94N46L33N72R60R00O74R93J720K029J706J398J533J722
62846D51734J481R29M73K11p0n19j073j549j793j745j481j182j010r54q07m23
62830D42222q2l02j070j532r60J70P43N78O35J544K677L201L246L478M019M442
62814D63009M482M225L818L506L645M270M905N242N594O293P014P312P406P788
62800E38509Q398Q869R332J0203J1368J2317J3067J4120J5495J6579J7239J8396
62788F93892K1076K5296L0178L4970L9672M4845N0969N7965O5309P2563P9650
$$ y = [454449, 452068, 449907, 447840, 446304, 445594, 445356, 444850, 443671, 442188, 441284, 441586, 442822, 444016, 444414, 444101, 443622, 443199, 442653, 441958, 441382, 441035, 440693, 440250, 439966, 440085, 440520, 441083, 441683, 442112, 442029, 441444, 440798, 440252, 439353, 437876, 436522, 436154, 436648, 437194, 437527, 438099, 439059, 439959, 440633, 441626, 443346, 445375, 447081, 448479, 450012, 451734, 453215, 454144, 454617, 454828, 454758, 454239, 453166, 451617, 449824, 448079, 446598, 445416, 444406, 443452, 442645, 442222, 442140, 441838, 440768, 439236, 438276, 438446, 439189, 439767, 440402, 441946, 444623, 447824, 451070, 454548, 458567, 463009, 467491, 471716, 475534, 479040, 482685, 486955, 491860, 497102, 502696, 508989, 516003, 523315, 530721, 538509, 546907, 555776, 565108, 575311, 586679, 598996, 612063, 626183, 641678, 658257, 675496, 693892, 714968, 740264, 770442, 805412, 845084, 889929, 940898, 998863, 1064172, 1136735, 1216385]
62777A216385Q6561R3157R9352J05084J09772J12262J11817J08848J03970R6689
62767B243897Q5686P0454N2006L1993J1641q295k7201m4538n9975p3381q4778
62756B197509r4081j00803j04298j04663j03054j00686r7760r3753q8523q2546
62746A227342p6299p0008o3859n7989n2319m6915m2285l8741l5672l2065k7751
62735F83439k3554k0270j8007j6405j4953j3170j1060r247q214p570o642n444
62723E28903m345l183j627j39N04N80J150K473L833N010O666Q911J0839J2060
62709E71635J3498J5974J8963K1555K3855K6574K9953L3907L8560M3832M8975
62698H87281N3393N7429O1654O5784O9148P1749P4013P5718P6006P4284P0452
$$ y = [1216385, 1302946, 1396103, 1495455, 1600539, 1710311, 1822573, 1934390, 2043238, 2147208, 2243897, 2329583, 2400037, 2452043, 2484036, 2495677, 2487382, 2460181, 2415643, 2355668, 2282287, 2197509, 2103428, 2002625, 1898327, 1793664, 1690610, 1589924, 1492164, 1398411, 1309888, 1227342, 1151043, 1081035, 1017176, 959187, 906868, 859953, 817668, 778927, 743255, 711190, 683439, 659885, 639615, 621608, 605203, 590250, 577080, 566020, 556773, 548559, 540989, 534347, 528903, 524558, 521375, 519748, 519609, 520113, 520693, 521843, 524316, 528149, 533159, 539825, 548736, 559575, 571635, 585133, 601107, 620070, 641625, 665480, 692054, 722007, 755914, 794474, 838306, 887281, 940674, 998103, 1059757, 1125541, 1194689, 1266438, 1340451, 1416169, 1492175, 1566459, 1636911]
62687A636911O4376N5901M5330L3255J9995N667r267k4048l8052n0688o1119o8729
62675A609532p3745p6848p8258p7818p5815p2965o9589o5443o0497n5242n0118
62664H53194m5197m0662l6890l3825l0851k7670k4797k2686k0853j8444j5532
62653E35787j3112j1861j1361j0764r777q801q312q366q582q401p509o136m847
62640D17958l941l194k359j581j012l27P84J766J688O34j96j33M1n03j204r95
62624D07426j70m5r52j703j382n09jJ89P73K002L456M613N249N515N887O750P887
62607D44985Q724R234R983J1188J2336J3105J4007J5644J7860K0233K2947K6471
62595F26717L0709L5104L9402M3687M7741N0987N3121N4301N4573N3480N0402
$$ y = [1636911, 1701287, 1757188, 1802518, 1835773, 1855768, 1861435, 1852168, 1828120, 1790068, 1739380, 1678261, 1609532, 1535787, 1458939, 1380681, 1302863, 1227048, 1154083, 1084494, 1019051, 958554, 903312, 853194, 807997, 767335, 730445, 696620, 665769, 638099, 613302, 590616, 569763, 551319, 535787, 522675, 510814, 499453, 488689, 478912, 470111, 461799, 453433, 444851, 436450, 428941, 422805, 417958, 414017, 410823, 408464, 406883, 405871, 405544, 406328, 408094, 409782, 410416, 410220, 410087, 410128, 409625, 408421, 407426, 407256, 407211, 406259, 404556, 403174, 402665, 402664, 402853, 403626, 405628, 409084, 413697, 418946, 424461, 430348, 437098, 444985, 453709, 462943, 472926, 484114, 496450, 509555, 523562, 539206, 557066, 577299, 600246, 626717, 657426, 692530, 731932, 775619, 823360, 874347, 927468, 981769, 1036342, 1089822, 1140224]
62584A140224M5151L8138K9989K1045J1211M99j0389k0286k8497l5226m0946m5705
62572A105208m9177n1057n1185m9659m7036m4141m1440l8814l6117l3479l0931
62561F32172k8156k4978k1719j8780j6195j3929j2138j0823r632q427p572p184
62549D52639o634n378l881l005k780k573k219k130k310k086j088J88J058J383
62535D21184J365J040L61m24q48o21J48J136K099L027M029N239O797Q817J1163
62520D64512J3381J5198J7031J9533K2653K5700K8401L1289L4705L8101M0783
62509G51287M2790M4408M5314M4887M3113M0430L6890L2110K5963J8756J0809
62498A136757K417n769j2950j8763k3271k6371k7745k7441k6013k3923k1138j7396
$$ y = [1140224, 1185375, 1223513, 1253502, 1274547, 1285758, 1286257, 1275868, 1255582, 1227085, 1191859, 1150913, 1105208, 1056031, 1004974, 953789, 904130, 857094, 812953, 771513, 732699, 696582, 663103, 632172, 604016, 579038, 557319, 538539, 522344, 508415, 496277, 485454, 475822, 467395, 459823, 452639, 446005, 440627, 436746, 433741, 430961, 428388, 426169, 424039, 421729, 419643, 418555, 418743, 419801, 421184, 422549, 423589, 423950, 423526, 422678, 422057, 422205, 423341, 425440, 428467, 432496, 437735, 444532, 453349, 464512, 477893, 493091, 510122, 529655, 552308, 578008, 606409, 637698, 672403, 710504, 751287, 794077, 838485, 883799, 928686, 971799, 1012229, 1049119, 1081229, 1107192, 1125948, 1136757, 1139174, 1133405, 1120455, 1101692, 1078421, 1052050, 1024305, 996864, 970851, 946928, 925790, 908394]
62486I08394j2671p302j864L173P778J2213J6522K0398K3713K6603K8833K9591
62474A055381K8400K5674K1850J6624R895K863l081q256j4328k1944k9840l6548
62462A046690m1757m5553m7415m6886m4724m2419m0718l9118l6688l3022k8493
62451E99897k3912j9890j6456j3309j0420q049o211m530k736q78J004K975M771
62438E02256N840O132O403P275Q250Q159O560M229K233P27j070l830p157r878
62424E36129j1221j1461j1324j1115j0780j0457j0375j0310r702q396o857n580
62412D18551m755m468m694m992m757l986l355l280l397l190k721k399k349k332
62398C67876k070j415m57L83P05P67J363K738L995M009K705J023j59n91l10O97
$$ y = [908394, 895723, 888421, 886557, 889730, 897508, 909721, 926243, 946641, 970354, 996957, 1025790, 1055381, 1083781, 1109455, 1131305, 1147929, 1157824, 1160687, 1157606, 1149350, 1135022, 1113078, 1083238, 1046690, 1004933, 959380, 911965, 865079, 820355, 777936, 737218, 698100, 661412, 628390, 599897, 575985, 556095, 539639, 526330, 515910, 507861, 501650, 497120, 494384, 493506, 494510, 497485, 502256, 508096, 514228, 520631, 527906, 536156, 544315, 550875, 555104, 557337, 558064, 556994, 553164, 546007, 536129, 524908, 513447, 502123, 491008, 480228, 469771, 459396, 449086, 439384, 430988, 424131, 418551, 413796, 409328, 404634, 399642, 394885, 390899, 387544, 384264, 380867, 377677, 374956, 372557, 370208, 367876, 365806, 364391, 363934, 364317, 365022, 365789, 367152, 369890, 373885, 377894, 380599, 381622, 381463, 380872, 380562, 381259]
62382C81259K249L745M467M210L543L379M186N514O448O497O003N647N811O510
62368D49468P611Q904J0072J0895J1582J2723J4844J7892K1200K4013K6229K8489
62356F43922L1482L5235L9241M3048M6303M8407M8693M7133M4343M0555L5070
62345A103432K7228J7744Q585J367l878q335j3050j8032k2466k5706k8005l0201
62333A008683l2656l4613l4775l2554k8678k4574k1286j8933j7004j4969j2705
62322G35936j0617r434r682j1173j3149j5039j6864j8669j9846j9607j8104j6501
62310E57251j5669j5290j4551j3223j1666j0112q577p280o554o288n925n057l815
62297D33244k607j760j341j118p77l68l15p18q83p7J405K461K479J947J644J748
$$ y = [381259, 383508, 387253, 391720, 395930, 399473, 402852, 407038, 412552, 419000, 425497, 431500, 437147, 442958, 449468, 457079, 465983, 476055, 486950, 498532, 511255, 526099, 543991, 565191, 589204, 615433, 643922, 675404, 710639, 749880, 792928, 839231, 887638, 936331, 983464, 1027807, 1068362, 1103432, 1130660, 1148404, 1156989, 1158356, 1154478, 1146143, 1133093, 1115061, 1092595, 1066889, 1038884, 1008683, 976027, 941414, 906639, 874085, 845407, 820833, 799547, 780614, 763610, 748641, 735936, 725319, 715885, 706203, 695030, 681881, 666842, 649978, 631309, 611463, 591856, 573752, 557251, 541582, 526292, 511741, 498518, 486852, 476740, 468163, 460883, 454329, 448041, 442116, 437059, 433244, 430637, 428877, 427536, 426418, 425641, 425273, 424958, 424240, 423357, 423280, 424685, 427146, 429625, 431572, 433216, 434964]
62281D34964J957K110K344K779L285L580L518L279L214L432L746M103M777N877
62267D82965O976P685Q336R611J1640J3997J6506J9433K2829K6335K9822L3703
62255F89838L8206M2754M6519M9463N2303N5357N7620N7355N3614M7102L9354
62244A229485L1434K3672J6398J0071M503j272p937j5227k2677l0284l7803m4076
62232A156287m7953m9510m9575m8511m6342m3646m1190l8852l5964l2609k9476
62221F92659k6550k3250j9861j7546j6537j5641j4068j2540j1839j1384j0190
62210E13253q414o984o179n547m804m022l157k112j037q9R02J998K781K903K759
62195D82251K970L522L950M195M630N355N990O297O527P085Q064R170R929J0020
$$ y = [434964, 436921, 439031, 441375, 444154, 447439, 451019, 454537, 457816, 461030, 464462, 468208, 472311, 477088, 482965, 489941, 497626, 505962, 515573, 527213, 541210, 557716, 577149, 599978, 626313, 656135, 689838, 728044, 770798, 817317, 866780, 919083, 974440, 1032060, 1089415, 1143029, 1190131, 1229485, 1260919, 1284591, 1300989, 1311060, 1315563, 1314291, 1306354, 1291127, 1268450, 1238166, 1200363, 1156287, 1108334, 1058824, 1009249, 960738, 914396, 870750, 829560, 790708, 754744, 722135, 692659, 666109, 642859, 622998, 605452, 588915, 573274, 559206, 546666, 534827, 523443, 513253, 504839, 497855, 491676, 486129, 481325, 477303, 474146, 472034, 470997, 470908, 471810, 473808, 476589, 479492, 482251, 485221, 488743, 492693, 496888, 501518, 506873, 512863, 519160, 525687, 532772, 540836, 550006, 559935, 569955]
62181E69955R530Q881Q393Q011P419O359M883L450K637K586K966L732N448Q363
62167F52613J1649J4431J7213K1186K6176L0591L3498L5487L7009L7219L5249
62156I52321L1496K6735K0907J3947O999J553k315n751r462j3217j6820k0525
62144I85868k4344k7684k9867l0579k9850k7888k4965k1218j6866j2654r505p415
62132G23033n408l022j051j91J68Q40J402J065L61N67J727K732L327M578P033
62117G37161R724J1504J2330J2513J1596Q789M212q69m852o687o390n002l770
62104G80259l228l270l951n596p971j0032j0790j0123q576o759n071l560j885
62091F99447K71K538M034M270L636K863K411K389K618K657K267J992K835M994
$$ y = [569955, 579485, 588366, 596759, 604770, 612189, 618548, 623431, 626881, 629518, 632104, 635070, 638802, 644250, 652613, 664262, 678693, 695906, 717092, 743268, 773859, 807357, 842844, 879853, 917072, 952321, 983817, 1010552, 1031459, 1045406, 1052405, 1053958, 1051643, 1045892, 1036430, 1023213, 1006393, 985868, 961524, 933840, 903973, 873394, 843544, 815656, 790691, 769473, 752607, 739953, 730448, 723033, 717625, 714603, 713552, 713361, 713529, 714369, 715771, 716836, 717197, 717764, 719491, 722223, 725550, 730128, 737161, 746885, 758389, 770719, 783232, 794828, 803617, 807829, 806960, 802108, 795421, 789031, 784029, 780259, 777031, 773761, 769810, 764214, 756243, 746211, 735421, 725298, 716722, 709963, 704892, 701332, 699447, 699718, 702256, 706290, 710560, 714196, 717059, 719470, 721859, 724477, 727134, 729401, 731393, 734228, 739222]
62077G39222P437R078J0017J1186J2985J4722J5444J4959J3964J3336J3419J3945
62065H89714J4502J4978J5552J6458J7831J9625K1445K2589K2399K0627J7402
62054A093122J3119Q413M002L17k690n285p815j0822j4771j9372k3613k6844k9432
62041I78329l1943l4133l5383l5673l5394l4449l2381k9356k6185k3354k0689
62030F39389j8104j5953j4402j3062j1564j0036q756p678o606n582m913m926n674
62017E12133o708p264o994o375o077o099n955n505m965m330l425k524k131k077
62003D41704j570l35J032K077L024L993M459M098L525L474L668L224J888J88j476
61988D72973l131m645n534n617n385n466n956o486o689o425n758m975m477m408
$$ y = [739222, 746659, 755737, 765754, 776940, 789925, 804647, 820091, 835050, 849014, 862350, 875769, 889714, 904216, 919194, 934746, 951204, 969035, 988660, 1010105, 1032694, 1055093, 1075720, 1093122, 1106241, 1114654, 1118656, 1118973, 1116283, 1110998, 1103183, 1092361, 1077590, 1058218, 1034605, 1007761, 978329, 946386, 912253, 876870, 841197, 805803, 771354, 738973, 709617, 683432, 660078, 639389, 621285, 605332, 590930, 577868, 566304, 556268, 547512, 539834, 533228, 527646, 522733, 517807, 512133, 505425, 498161, 491167, 484792, 478715, 472616, 466661, 461156, 456191, 451861, 448436, 445912, 443781, 441704, 440134, 439799, 440831, 442908, 445932, 449925, 454384, 458482, 462007, 465481, 469149, 472373, 474261, 474449, 472973, 469842, 465197, 459663, 454046, 448661, 443195, 437239, 430753, 424064, 417639, 411881, 406906, 402429, 398021]
61974C98021m340l656k265p81J44L94J60n10j541k388k350j416l42K68M95N63
61958C80456L31l30j052j319j054n25K1K90o6q70j165r1K069M187N539O320P067
61941C99808Q002Q940R545R734R998J1034J2777J4218J4520J3970J3331J2736
61929E38613J1879J0911J0254R677Q406O211L804K028J039K78j105l523o205p565
61915E84702o926n447m647m441l536j411J305M103P036R751J1432J1945J2031
61902F15897J2024J1440J0089Q516O839M330P36k917n582p375q788r568r342q653
61888F17646q395q532q283p369o359n876o040o594p119p235o946o721o937p498
61874E17742q096q556q710q339p522o627n787m780l581k516j670p48K53R67J554
$$ y = [398021, 393681, 390025, 387760, 386979, 387123, 387517, 387677, 387167, 385626, 383238, 380888, 379472, 379130, 379398, 379893, 380456, 380787, 380457, 379405, 378086, 377032, 376507, 376528, 376818, 376752, 375882, 374717, 374626, 376695, 380882, 386421, 392741, 399808, 407810, 416750, 426295, 436029, 446027, 457061, 469838, 484056, 498576, 512546, 525877, 538613, 550492, 561403, 571657, 581334, 589740, 595951, 599755, 601783, 602822, 603100, 601995, 598472, 592267, 584702, 577776, 572329, 567682, 563241, 559705, 558294, 559599, 563702, 570738, 580489, 591921, 603866, 615897, 627921, 639361, 649450, 657966, 664805, 669135, 669871, 666954, 661372, 653997, 645209, 635641, 626299, 617646, 609251, 600719, 592436, 585067, 578708, 572832, 566792, 560198, 553079, 545844, 538898, 532177, 525240, 517742, 509646, 501090, 492380, 484041, 476519, 469892, 464105, 459325, 455744, 453228, 451558, 450810, 451063, 452030, 453584]
61859D53584K848N070P211Q435R306J0810J2774J4280J5208J6220J7496J8633
61847E91875J9659K1060K2616K3237K2412K0909J9538J7904J5035J0862O367K365
61835G93839j243m890q416j1045j2191j1945j0765q891o335l204K80L955P561
61822G26710J0408J1705J1349J0030Q394O385L600j7m093q155j1841j5017j7759
61809G31699k0093k1696k2182k1641k0543j9145j7425j5611j4181j3208j2224
61798E33750j0958r613q332p005n852n431n694n688m735l393k637k603k722k650
61784D56437k470k226j885j584j477j520j641j839j917j520p54k27k00k29m0n6
61768D36852n63j059j080j012j311j551j141l67J87P35J716K546K205R37J62O15
$$ y = [453584, 456432, 461502, 468713, 477148, 486454, 497264, 510038, 524318, 539526, 555746, 573242, 591875, 611534, 632594, 655210, 678447, 700859, 721768, 741306, 759210, 774245, 785107, 791474, 793839, 792596, 787706, 779290, 768245, 756054, 744109, 733344, 724453, 718118, 714914, 715194, 719149, 726710, 737118, 748823, 760172, 770202, 778596, 784981, 788581, 788564, 784471, 776316, 764475, 749458, 731699, 711606, 689910, 667728, 646087, 625544, 606399, 588974, 573363, 559182, 545974, 533750, 522792, 513179, 504847, 497842, 491990, 486559, 480865, 475177, 470442, 467049, 464412, 461809, 459087, 456437, 453967, 451741, 449856, 448272, 446795, 445275, 443634, 441795, 439878, 438358, 437604, 437377, 437177, 436948, 436908, 436852, 436289, 435230, 434150, 433138, 431827, 430276, 429135, 428768, 428955, 429690, 431406, 433952, 436157, 437094, 437256, 437871]
61752D37871J637K345K496K057J035l5l81j79m87j666k801l136l101l259l156
61737D29240k157q39l93r24j330q75l4M52N84P67R96R74P70Q41J326J792J860
61720D33050J759J960K475K925L122L193L046K353J159J45j24J53L25N2n62j289
61704D53742j925k342k647l080l567l668l257k878l066l603l852l575k975k288
61690D11019j789j926k853l920m212l597k790k384k301k171j847j430j116j054
61676C77629j229j496j820k251k581k384j710j257j455j800j590r09l48p2J17
61661C56844J00l75r33q14J17J210J901K148K018J553J064R04Q80N00j12k46L62
61644C67121J178J773K364L160L759L673L031K357J902J506Q61k31j641k788l086
$$ y = [437871, 439508, 441853, 444349, 446406, 447441, 447406, 447025, 446846, 446359, 444693, 441892, 438756, 435655, 432396, 429240, 427083, 426244, 425851, 424927, 423597, 422722, 422688, 423140, 423724, 424491, 425487, 426461, 427231, 428072, 429398, 431190, 433050, 434809, 436769, 439244, 442169, 445291, 448484, 451530, 453883, 455042, 455187, 455063, 455216, 455541, 455593, 455031, 453742, 451817, 449475, 446828, 443748, 440181, 436513, 433256, 430378, 427312, 423709, 419857, 416282, 413307, 411019, 409230, 407304, 404451, 400531, 396319, 392722, 389932, 387548, 385247, 383076, 381229, 379799, 378683, 377629, 376400, 374904, 373084, 370833, 368252, 365868, 364158, 362901, 361446, 359646, 358056, 357147, 356799, 356727, 356844, 356944, 356569, 355636, 354822, 354939, 356149, 358050, 360198, 362216, 363769, 364833, 365737, 366617, 367117, 367005, 366759, 367121, 368299, 370072, 372436, 375596, 379355, 383028, 386059, 388416, 390318, 391824, 392685, 392454, 390813, 388025, 384939]
61629C84939k605k011j726j593j464j613k217k832k819k114j237o89n82p84j116
61614C59537j430j651j775j794j717j680j973k769l848m672m848m561m315m212
61600C18292l728k587j527j519k275k463j573o79q42j625k009j968k125k408k215
61585B88749j641j373j432j122l63Mm99j378k053k489k635k179j297q23j090j349
61569B67030q55O8O44P63Q47J010J016Q16O50P22J136J901K620K576J498J10n97
61552B81955m15J06N46R48J332J414J020M77K78M61O40O49Q72J585K250K010R98
61535B97126M74J252K531K891K033Q25m2o26j043j114q77o95p22p62q32j171j599
61518B97649j506p57M0L52L04J30k44p34q05j32Q47J427J351P08m38j889l043
$$ y = [384939, 382334, 380323, 378597, 377004, 375540, 373927, 371710, 368878, 366059, 363945, 362708, 362019, 361437, 360653, 359537, 358107, 356456, 354681, 352887, 351170, 349490, 347517, 344748, 340900, 336228, 331380, 326819, 322504, 318292, 314564, 311977, 310450, 308931, 306656, 304193, 302620, 301941, 301099, 299474, 297465, 295497, 293372, 290964, 288749, 287108, 285735, 284303, 283181, 282818, 282822, 282323, 280945, 278892, 276403, 273768, 271589, 270292, 269469, 268379, 267030, 266175, 266243, 266887, 267650, 268497, 269507, 270523, 271339, 271989, 272711, 273847, 275748, 278368, 280944, 282442, 282552, 281955, 281540, 281646, 282192, 283140, 284472, 285886, 286906, 287383, 287661, 288122, 288762, 289411, 290283, 291868, 294118, 296128, 297126, 297600, 298852, 301383, 304274, 306307, 307132, 307090, 306464, 305421, 304307, 303430, 302735, 302013, 301251, 300419, 299248, 297649, 296143, 295386, 295426, 295778, 296082, 296212, 295968, 295234, 294429, 294297, 295144, 296571, 297922, 298630, 298192, 296303, 293260]
61501B93260l275k526j320l29P1J5pK82N45L46q5j03M30J066J542J958K127J589
61483B95586N00k80l57l15n97o94L3J266K154K390K239J898J384Q89N98M11J54
61466C07259p2j50k52n29p54o45l28j52k26l67k94L01J433K422K301J009k83n02
61448C10171J29O58P74R70J534K036J893J076J89l1O26J612K211K331K376K438
61432C30993K213J779J705K035J980J069M2j30M51R35R88R05P78L57k97o57l75
61415C44771K87P64O87J63l11l18l5L0j86k77k25n55j399k049j985j659j607j527
61397C34569j011n89r64j624j366j16Q38N83l76j053j183j117j112j172j239j207
61381C21861r43m01L69J295K199K752K812K635K521K384K050J766J929K428K711
$$ y = [293260, 289985, 287459, 286139, 285810, 285881, 285896, 285889, 286171, 286716, 287062, 286977, 286874, 287304, 288370, 289912, 291870, 293997, 295586, 296086, 295806, 295449, 295134, 294537, 293843, 293876, 295142, 297296, 299686, 301925, 303823, 305207, 306096, 306694, 307105, 307259, 307187, 307037, 306785, 306256, 305502, 304857, 304529, 304377, 304151, 303784, 303490, 303791, 305224, 307646, 309947, 310956, 310673, 310171, 310300, 310958, 311732, 312702, 314236, 316272, 318165, 319241, 319430, 319399, 320025, 321637, 323848, 326179, 328555, 330993, 333206, 334985, 336690, 338725, 340705, 341774, 341816, 341686, 342137, 343072, 344060, 344965, 345743, 346100, 345803, 345146, 344771, 345058, 345822, 346509, 346672, 346361, 346043, 346008, 346038, 345852, 345575, 345350, 344795, 343396, 341347, 339362, 337703, 336096, 334569, 333558, 332969, 332005, 330381, 329015, 328899, 329737, 330320, 329944, 328891, 327708, 326591, 325479, 324307, 323068, 321861, 320918, 320517, 320886, 322181, 324380, 327132, 329944, 332579, 335100, 337484, 339534, 341300, 343229, 345657, 348368]
61366C48368K478J878J118L31k33k82J31O36J010J380J913K620L344L846L968
61351C72506L990M573O027P786Q934R094Q469P266N572L681K153J412J486K072
61337D45021K693K972K984L093L272L030K194J267O05k01j510k691k840k105j502
61322D56282j548j849j956j799j257r8J424K596L100L321L708M291N054O170P570
61307D85009Q705R165R313J0065J1962J4545J6563J6906J5506J3219J0739Q022
61295F29719M877J719q53k837m667o483q055r280j0162j0579j0602j0817j1582
61282E50398j2149j1346r119o666m994m116l673l457l066j883P8J850K558K448
61268D96863K445L014L780M055L471K258J136Q44J640L238N148O912Q142Q616
$$ y = [348368, 350846, 352724, 353842, 354173, 353940, 353658, 353789, 354425, 355435, 356815, 358728, 361348, 364692, 368538, 372506, 376496, 381069, 387096, 394882, 403816, 412910, 421379, 428645, 434217, 437898, 440051, 441463, 442949, 445021, 447714, 450686, 453670, 456763, 460035, 463065, 465259, 466526, 467131, 466930, 465420, 462729, 459889, 457784, 456282, 454734, 452885, 450929, 449130, 447873, 447775, 449199, 451795, 454895, 458216, 461924, 466215, 471269, 477439, 485009, 493714, 502879, 512192, 522257, 534219, 548764, 565327, 582233, 597739, 610958, 621697, 629719, 634596, 636315, 635462, 632625, 627958, 621475, 613420, 604140, 593978, 583399, 572797, 561980, 550398, 538249, 526903, 517784, 511118, 506124, 502008, 498335, 494878, 491812, 489929, 490007, 491857, 494415, 496863, 499308, 502322, 506102, 510157, 513628, 515886, 517022, 517866, 519506, 522744, 527892, 534804, 542946, 551562]
61254E51562Q317P279N621L824K626K215J914J121J60l86p45j564k680l235k960
61239E73069k485k327k360k396k508k579k294j705j230q86k67O68J494K210L353
61224E59757M983O326O773O609O430O513P037Q100R222R534Q968Q455Q520Q473
61210F65700P562O169N082M296L364K426J974J946J950K099K815L970N002N883
61196G20238P200R206J1483J3610J5583J7333J8285J7744J5506J2041Q255N056
61184H71540K894J600P81J93l29j129k478m095n241n531n398n719o922q574r825
61169H21767j0278j0365j0739j1464j2041j2185j2228j2619j3295j3744j3550
61158F89259j2805j1999j1596j1548j1240j0143q427o728n301l787j891J1J104
$$ y = [551562, 559879, 567158, 572779, 576603, 579229, 581444, 583358, 584479, 584639, 584253, 583508, 581944, 579264, 576029, 573069, 570584, 568257, 565897, 563501, 560993, 558414, 556120, 554415, 553185, 552299, 552032, 552700, 554194, 556404, 559757, 564740, 571066, 577839, 584448, 590878, 597391, 604428, 612528, 621750, 631284, 640252, 648707, 657227, 665700, 673262, 679431, 684513, 688809, 692173, 694599, 696573, 698519, 700469, 702568, 705383, 709353, 714355, 720238, 727438, 736644, 748127, 761737, 777320, 794653, 812938, 830682, 846188, 858229, 866484, 871540, 874434, 876034, 876815, 877008, 876679, 875550, 873072, 868977, 863736, 858205, 852807, 847088, 840166, 831592, 821767, 811489, 801124, 790385, 778921, 766880, 754695, 742467, 729848, 716553, 702809, 689259, 676454, 664455, 652859, 641311, 630071, 619928, 611501, 604773, 599472, 595685, 593794, 593805, 594909]
61145E94909Q86m32k114l524m650n902p289q153q014p279o598n834m354k192j43
61130E29317J309K442L572M596N496O580Q022R648J1403J3424J5552J7299J8614
61117F47274K0027K1827K3676K5225K6502K7446K7752K7505K7328K7494K7438
61106I29494K6554K4924K3031K1153J9324J7291J4376J0114N129O78k917o399
61094A082752r991j2890j4894j7197k0603k4040k5959k6412k6580k6864k6690
61083H50632k5741k4292k2604k0900j9643j8945j8068j6373j4373j2940j1942
61072F44811j0620q895p261n781m233k944k335j918r15M17J194J489K208L474
61058F08691M451M777M985N388N804O451P884R855J1382J2231J3139J4402J5492
$$ y = [594909, 595795, 595363, 593249, 589725, 585075, 579173, 571884, 563731, 555717, 548438, 541840, 536006, 531652, 529460, 529317, 530626, 533068, 536640, 541236, 546732, 553312, 561334, 570982, 582385, 595809, 611361, 628660, 647274, 667301, 689128, 712804, 738029, 764531, 791977, 819729, 847234, 874562, 902056, 929494, 956048, 980972, 1004003, 1025156, 1044480, 1061771, 1076147, 1086261, 1091390, 1092068, 1089151, 1082752, 1072761, 1059871, 1044977, 1027780, 1007177, 983137, 957178, 930766, 904186, 877322, 850632, 824891, 800599, 777995, 757095, 737452, 718507, 700439, 684066, 669693, 656753, 644811, 634191, 625296, 618035, 612254, 608021, 605077, 602742, 600824, 599909, 600326, 601520, 603009, 605217, 608691, 613142, 617919, 622904, 628292, 634096, 640547, 648431, 658286, 669668, 681899, 695038, 709440, 724932]
61045G24932J6335J7680J9760K1787K3255K4583K6037K7223K8176K9620L1487
61034I90875L2505L2131L1652L2413L4048L5522L6830L8455M0038M0863M0986
61023A386318M0852M0427L9868M0282M2666M6738N1897N8575O7336P7302Q6886
61012A979147R5751J04929J15947J31258J54685J89556K36982K97456L72758M63690
61002D142159N67513O81672Q10007R61417J143097J359344J611395J878155K083101
60993A5237860K096483J809790J236959N40730n7807m07533m79450l24725k3611
60984A9628696L11484N20722M46386L6261o00613j253943j738001j975314j990037
60975A3385641j852200j633106j388776j156073r52198p80191o38138n23697m32972
$$ y = [724932, 741267, 758947, 778707, 800494, 823749, 848332, 874369, 901592, 929768, 959388, 990875, 1023380, 1055511, 1087163, 1119576, 1153624, 1189146, 1225976, 1264431, 1304469, 1345332, 1386318, 1427170, 1467597, 1507465, 1547747, 1590413, 1637151, 1689048, 1747623, 1814959, 1892261, 1979147, 2074898, 2179827, 2295774, 2427032, 2581717, 2771273, 3008255, 3305711, 3678469, 4142159, 4709672, 5391344, 6201351, 7162768, 8305865, 9665209, 11276604, 13154759, 15237860, 17334343, 19144133, 20381092, 20921822, 20864015, 20456482, 19977032, 19652307, 19628696, 19940180, 20460902, 20907288, 20943549, 20342936, 19088993, 17350992, 15375678, 13385641, 11533441, 9900335, 8511559, 7355486, 6403288, 5623097, 4984959, 4461262, 4028290]
60966D028290l60414l01733k55051k18710j90031j66935j48918j35391j24458
60957B126649j14255j04410r5228q6421p7468o8530o0188n2820m6807m2794m1013
60946A336715m0709m0765m0566l9902l8611l6800l4973l3437l1995l0549k9496
60935I38912k8988k8369k6964k5011k3249k1942k0943k0271j9925j9450j8330
60924F85470j6669j4927j3307j1940j1216j1133j0723r162p179o292o648o759
60912E59515n583l731k224j077J30J176J475J036L91j39m94m31K76J331K040K039
60896E55730J500P50p7r71j872k603k955k906k794k947l197l110k826l110m287
60881E24325n649o378o632p042p507p301o386n746o086o797o699n477l938k984
$$ y = [4028290, 3667876, 3366143, 3111092, 2892382, 2702351, 2535416, 2386498, 2251107, 2126649, 2012394, 1907984, 1812756, 1726335, 1648867, 1580337, 1520149, 1467329, 1420522, 1377728, 1336715, 1296006, 1255241, 1214675, 1174773, 1136162, 1099362, 1064389, 1030952, 998957, 968408, 938912, 909924, 881555, 854591, 829580, 806331, 784389, 763446, 743175, 723250, 703800, 685470, 668801, 653874, 640567, 628627, 617411, 606278, 595555, 586393, 579214, 572922, 566274, 559515, 553932, 550201, 547977, 546900, 547030, 548206, 549681, 550717, 551108, 550969, 550475, 550044, 550320, 551651, 553691, 555730, 557230, 557980, 557903, 556932, 555060, 552457, 549502, 546596, 543802, 540855, 537658, 534548, 531722, 528612, 524325, 518676, 512298, 505666, 498624, 491117, 483816, 477430, 471684, 465598, 458801, 452102, 446625, 442687, 439703]
60867D39703k783k955l159l273l168k621j563k81P44J216J174Q53M37K4k65k25
60851D23858K57R67J400J235P39N16P31Q90N45p1m16m08m16o26q94j193j667k152
60833D23295k180j687j219j163j195q83m44l72n84m97P2O03N86J29k93m51m70
60816D13247n52q20j296j881k360k571k572k546k547k467k260k015j767j422j028
60801C85143r58j527k460l068k995k548k240k320k773l429l835l504k514j626
60787C49346j434j720j897j792j658j662j795j919j633m99J091J811R37m71p43
60772C35962K74J238J305J041J237J853K479K985L272L109K674K604L095L510
60758C66638L220K343J379O48L73N79O65k08j782k584j708q0P76O14L27M01M19
$$ y = [439703, 436920, 433965, 430806, 427533, 424365, 421744, 420181, 419900, 420644, 421860, 423034, 423887, 424324, 424348, 424083, 423858, 424115, 425082, 426482, 427717, 428456, 428972, 429703, 430593, 431138, 431067, 430651, 430243, 429827, 429201, 428307, 427114, 425447, 423295, 421115, 419428, 418209, 417046, 415851, 414968, 414524, 414152, 413568, 413071, 413143, 413746, 414332, 414461, 414168, 413717, 413247, 412695, 411875, 410579, 408698, 406338, 403767, 401195, 398649, 396102, 393635, 391375, 389360, 387593, 386171, 385143, 384185, 382658, 380198, 377130, 374135, 371587, 369347, 367027, 364254, 360825, 356990, 353486, 350972, 349346, 347912, 346192, 344295, 342503, 340845, 339183, 337388, 335469, 333836, 333337, 334428, 336239, 337176, 336705, 335962, 336236, 337474, 338779, 339820, 341057, 342910, 345389, 348374, 351646, 354755, 357429, 360033, 363128, 366638, 369858, 372201, 373580, 374228, 374601, 375180, 375845, 375637, 373855, 371271, 369563, 369483, 370259, 370873, 371200, 371601, 372020]
60741C72020r4j126k411l657m545m922m942m753m246l461k905l049l710m273m344
60726C19582l916l208k567k236j940j170jQ14Q89O98O55M63j02n09k69K07L45
60709C07735L41N34M70l26j168r77N0P17O79P72J466K159K271K030J799J529J294
60692C21375J532K318L013L116K953L043L312L340L058K761K664K748L009L486
60678C61728M157M746M724L730K091P22J85J38pk60l76n93j313k334l094l536
60662C70708m030m523m538l973l125k012n17P27O93m81j244m50J267K463K590
60647C53555K108J545J140J114J538J935J524Lk073l732m341m076l623l432l331
60632C39854l007k551k133j540n97J55O8l94k8J392K676K879K477K274J983Q69
$$ y = [372020, 371926, 370800, 368389, 364732, 360187, 355265, 350323, 345570, 341324, 337863, 334958, 331909, 328199, 323926, 319582, 315666, 312458, 309891, 307655, 305715, 304545, 304544, 305358, 306247, 306945, 307600, 308063, 307961, 307452, 307183, 307390, 307735, 308076, 308610, 309080, 308754, 307586, 306609, 306659, 307376, 308055, 308827, 310293, 312452, 314723, 316753, 318552, 320081, 321375, 322907, 325225, 328238, 331354, 334307, 337350, 340662, 344002, 347060, 349821, 352485, 355233, 358242, 361728, 365885, 370631, 375355, 379085, 381176, 381898, 382083, 382221, 382214, 381954, 381578, 380985, 379672, 377338, 374244, 370708, 366678, 362155, 357617, 353644, 350519, 348507, 347990, 348717, 349410, 348929, 347685, 347235, 348502, 350965, 353555, 355663, 357208, 358348, 359462, 361000, 362935, 364459, 364462, 362389, 358657, 354316, 350240, 346617, 343185, 339854, 336847, 334296, 332163, 330623, 330026, 330181, 330249, 329855, 329827, 331219, 333895, 336774, 339251, 341525, 343508, 344377]
60616C44377p31j609j326p45p38j127j199p66k52M7K68N66P96P93P24Q46R91P25
60598C41640O4l37N1R99J854K204K002J421R51J211K205L052K935K076J198M33
60582C63959n43j515j767j078j7Q75J536K023K351K781L647M830N928O971Q273
60567C98254R629J0472J0934J1906J3657J5189J5326J3873J1309P976M060l3l802
60554E18750o894r003r910r768q956p590n640l569k104j135L39K783N306O839
60540D69448P475Q106R231J0797J2772J5133J7438J8961J9278J8422J6616J4095
60528F37772J0991P208K706j919n548p597q538r094r328q941q047p111o373n837
60514E80344n534n333m690l196j306J9M77P77J694L160M576N832P593J0452J4170
$$ y = [344377, 343646, 342037, 340711, 339966, 339228, 338101, 336902, 336136, 335884, 335931, 336199, 336765, 337561, 338354, 339078, 339924, 340915, 341640, 341704, 341367, 341418, 342417, 344271, 346475, 348477, 349898, 350849, 352060, 354265, 357317, 360252, 362328, 363526, 363959, 363416, 361901, 360134, 359056, 359039, 359914, 361450, 363473, 365824, 368605, 372252, 377082, 383010, 389981, 398254, 407883, 418355, 429289, 441195, 454852, 470041, 485367, 499240, 510549, 518525, 522585, 522552, 518750, 511856, 502853, 492943, 483175, 474219, 466629, 460989, 457420, 455316, 454181, 454520, 457303, 462609, 469448, 476923, 485029, 494260, 505057, 517829, 532962, 550400, 569361, 588639, 607061, 623677, 637772, 648763, 655971, 658677, 656758, 651210, 643613, 635075, 625981, 616653, 607712, 599665, 592554, 586181, 580344, 574810, 569477, 564787, 561591, 560285, 560304, 560781, 561558, 563252, 566412, 570988, 576820, 584413, 594865, 609035]
60499F09035J8176K2566K8002L4393M0417M4885M8004N0643N2780N3499N2273
60488A054673M9248M4362L7244K8145J8036P456l893j6077k8195l9013m7713n3869
60476A050404n7406n8867n8868n7141n3002m7046m1227l6741l2875k8658k4531
60465E54042k1447j9217j6920j4452j2447j1008r559p817o104m724l794l550m129
60452D18874n089n656n501m822l915l025k427k210k127j997j924j861j462p60
60438C76098m33q08j170q06k07l72j216j668j222n39l67o88j117j511j836j881
60422C60257j451p18j78j78m97m66K75J230J614J419J333J589J650J240Q58Q60
60406C68837P93K76j42K01R79J395J382J479J838K117K171K146K120K137K375
$$ y = [609035, 627211, 649777, 677779, 712172, 752589, 797474, 845478, 896121, 948901, 1002400, 1054673, 1103921, 1148283, 1185527, 1213672, 1231708, 1239164, 1235271, 1219194, 1190999, 1151986, 1104273, 1050404, 992998, 934131, 875263, 818122, 765120, 718074, 676847, 640106, 607231, 578573, 554042, 532595, 513378, 496458, 482006, 469559, 458551, 448992, 441175, 435071, 430347, 426553, 423003, 418874, 413785, 408129, 402628, 397806, 393891, 390866, 388439, 386229, 384102, 382105, 380181, 378320, 376858, 376098, 375665, 374857, 373687, 372881, 372674, 372302, 371086, 369418, 368196, 367657, 367290, 366602, 365485, 363974, 362138, 360257, 358806, 358088, 357910, 357732, 357235, 356769, 357044, 358274, 359888, 361307, 362640, 364229, 365879, 367119, 367977, 368837, 369630, 369906, 369764, 369965, 370944, 372339, 373721, 375200, 377038, 379155, 381326, 383472, 385592, 387729, 390104]
60391C90104K726K580J658O59M62J024J691K197K593K623K026J232R40J208J629
60376D15352K132K826L329L180K696K610K967L177L003K605J855N98n11m84N51
60361D45886J331J153O38N52P42O93M95O51J340K224K841L007L038L430M158M557
60345D76736M244L809L896M014L110J195n56j406j839k525l337l781l731l251
60331D76578k248q04M51P54q2j557l007m089m820n281n331m810l931l114k393
60316D36316j401j66P14R66J152J863K977M227N894Q212J0673J2604J4047J5408
60302E13486J6714J7827J8742J8972J7332J3401Q450L829q82o699j2879j7295
60290E90998j8977j8656j7046j4319j1270r194q118o764m697l039k528k398j901
$$ y = [390104, 392830, 395410, 397068, 397727, 398189, 399213, 400904, 403101, 405694, 408317, 410343, 411575, 412515, 413723, 415352, 417484, 420310, 423639, 426819, 429515, 432125, 435092, 438269, 441272, 443877, 445732, 446330, 445819, 445335, 445886, 447217, 448370, 449008, 449560, 450302, 450995, 451490, 452141, 453481, 455705, 458546, 461553, 464591, 468021, 472179, 476736, 480980, 484789, 488685, 492699, 495809, 497004, 496448, 495042, 493203, 490678, 487341, 483560, 479829, 476578, 474330, 473526, 473977, 474731, 474649, 473092, 470085, 465996, 461176, 455895, 450564, 445754, 441823, 438709, 436316, 434915, 434749, 435463, 436429, 437581, 439444, 442421, 446648, 452542, 460754, 471427, 484031, 498078, 513486, 530200, 548027, 566769, 585741, 603073, 616474, 624924, 628753, 627871, 621172, 608293, 590998, 572021, 553365, 536319, 522000, 510730, 501536, 493418, 486654, 481957, 478918, 476390, 473992, 472091]
60277D72091j530j823k202k075k038k869m106m701m501m105l703l013k107j498
60263D31820j441j666j734j472j197j463k283k746k056p68j26k24JQ41J201M29
60247D17116n16m79K94Q85J122J378J573J416J093R73R08M88k73j036j495j343
60231D22104l97Q83J635J776K193L258M050L678K583J764J443J372J694K559L456
60216D54051L901M303N203O178O486O359O561P026P082O804O928P489P727P410
60202E43508P176P269P047O143N215M990N217N131M486L579K582J409J22r70j632
60187F01272j916k054k257k645l284m190n215o008o267o082n843n795n839n760
60173E38117n464m887m042l183k683k605k652k605k456k126j487q18o47r68j162
$$ y = [472091, 470561, 468738, 466536, 464461, 462423, 459554, 455448, 450747, 446246, 442141, 438438, 435425, 433318, 431820, 430379, 428713, 426979, 425507, 424310, 422847, 420564, 417818, 415762, 414994, 414868, 414644, 414645, 415486, 416687, 417116, 416600, 416121, 416415, 417300, 418422, 419800, 421373, 422789, 423882, 424855, 425763, 426251, 425978, 424942, 423447, 422104, 421707, 422590, 424225, 426001, 428194, 431452, 435502, 439180, 441763, 443527, 444970, 446342, 448036, 450595, 454051, 457952, 462255, 467458, 473636, 480122, 486481, 493042, 500068, 507150, 513954, 520882, 528371, 536098, 543508, 550684, 557953, 565000, 571143, 576358, 581348, 586565, 591696, 596182, 599761, 602343, 603752, 603874, 602904, 601272, 599356, 597302, 595045, 592400, 589116, 584926, 579711, 573703, 567436, 561354, 555511, 549716, 543877, 538117, 532653, 527766, 523724, 520541, 517858, 515253, 512601, 509996, 507540, 505414, 503927, 503109, 502462, 501494, 500332]
60158E00332r68q98j260j371m36J245K610L196L334L182K341P60o14o95M80J742
60142E12980K118J837J811K414L172L693M298N396O632P245P021O358N597M840
60128E75412M301M168M215M082L871L848L684K837J581Q95J155J794K314K761
60114F16918L111L057K665K406K279J779Q70J03m65j429k808l790m167m817o137
60099F09575p142o900n932n264n006m741m461m214l558k242p88L54J416K377K431
60084E65905J377N18R19J749J710J248J612K366J790l53k292k799k692l284m591
60069E63183n765o418o817p229p596p584o917n861n155n102n069m462l713l601
60055D81894l925l822l123k454k084j620q50PR66K338M002N282N741N554N107
$$ y = [500332, 499364, 498466, 497206, 495835, 495399, 496644, 499254, 502450, 505784, 508966, 511307, 512067, 511453, 510758, 511238, 512980, 515098, 516935, 518746, 521160, 524332, 528025, 532323, 537719, 544351, 551596, 558617, 564975, 570572, 575412, 579713, 583881, 588096, 592178, 596049, 599897, 603581, 606418, 607999, 608894, 610049, 611843, 614157, 616918, 620029, 623086, 625751, 628157, 630436, 632215, 633085, 633188, 632723, 631294, 628486, 624696, 620529, 615712, 609575, 602433, 595533, 589601, 584337, 579331, 574590, 570129, 565915, 562357, 560115, 559327, 559681, 561097, 563474, 565905, 567282, 567800, 568719, 570468, 572178, 573426, 575038, 577404, 579194, 578841, 576549, 573750, 571058, 567774, 563183, 557418, 551000, 544183, 536954, 529358, 521774, 514857, 508996, 503841, 498739, 493670, 489208, 485495, 481894, 477969, 474147, 471024, 468570, 466486, 464866, 464016, 464023, 464989, 467327, 471329, 476611, 482352, 487906, 493013]
60040D93013M782N016N916O827O894O063M984M095L314K457J326l36k313l641
60026E38397l655l013k945l682m518n088n651o274o744p178p802q218p916p296
60012D58417p155p251o607n243m307m272m298l757l156l022k958k413j580q32
59998D01566j09O35J047J025J128J760K489K749K641K652K887L151L338L441L421
59983D33821L365L450L576L381K688J573J11j483k610k904k952l564m426m457
59969D29569l591k986l185l232k305j080o37q06n53N03J831K852L306L004K028
59954D24718R81M73L77Q3o11j243j248n02O29J512J712J351R53Q42Q52O45J9j031
59936D30512k211k914k739k043j517j267q20j5P41J167J465J852K332L077M307
$$ y = [493013, 497795, 502811, 508727, 515554, 522448, 528511, 533495, 537590, 540904, 543361, 544687, 544351, 542038, 538397, 534742, 531729, 528784, 525102, 520584, 515496, 509845, 503571, 496827, 489649, 481847, 473629, 465713, 458417, 451262, 444011, 437404, 432161, 427854, 423582, 419284, 415527, 412371, 409349, 406391, 403978, 402398, 401566, 401457, 402092, 403139, 404164, 405292, 407052, 409541, 412290, 414931, 417583, 420470, 423621, 426959, 430400, 433821, 437186, 440636, 444212, 447593, 450281, 451854, 451965, 450482, 447872, 444968, 442016, 438452, 434026, 429569, 425978, 422992, 419807, 416575, 414270, 413190, 412553, 411747, 411194, 411697, 413528, 416380, 419686, 422690, 424718, 425699, 426172, 426549, 426632, 426021, 424778, 423530, 423028, 423657, 425169, 426881, 428232, 429185, 430027, 430879, 431524, 431543, 430512, 428301, 425387, 422648, 420605, 419088, 417821, 417001, 416986, 417727, 418894, 420359, 422211, 424543, 427620, 431927]
59921D31927N722O678P083P385P511O765N079L425K502J842P96l19q17o95l35
59906D84549K75J250K125K306J913J536J336J017N37J97J29J73J88J63J56L80
59890D98230J123K189K801K571K251K958M689O202O347N204L830L201L479M105
59876E49180M511M645M708M561L803K456J064r2j327k859m300n224n784o249o355
59861E42738n680m445l355k709k147j301k38P65J554K112K450K677L090M089N838
59846E45438P883R264R288Q085O244M016J384j241l010l468k919j839n40L85J7
59831E78987j910m415o126o525o045n274m507l842l279k805k536k625k878k806
59817E23414k318j942k094k489k667k703k934l201k967k149j378j298j881k520
$$ y = [431927, 437649, 444327, 451410, 458795, 466306, 473071, 478150, 481575, 484077, 485919, 486715, 486396, 485579, 484884, 484549, 484824, 486074, 488199, 490505, 492418, 493954, 495290, 496307, 496844, 497041, 497170, 497343, 497531, 497694, 497850, 498230, 499353, 501542, 504343, 506914, 509165, 512123, 516812, 523014, 529361, 534565, 538395, 541596, 545075, 549180, 553691, 558336, 563044, 567605, 571408, 573864, 574928, 574836, 573509, 570650, 566350, 561126, 555342, 549093, 542738, 537058, 532613, 529258, 526549, 524402, 523101, 522863, 523628, 525182, 527294, 529744, 532421, 535511, 539600, 545438, 553321, 562585, 571873, 579958, 586202, 590218, 591602, 590361, 587351, 583883, 580964, 579125, 578585, 578970, 578987, 577077, 572662, 566536, 560011, 553966, 548692, 544185, 540343, 537064, 534259, 531723, 529098, 526220, 523414, 521096, 519154, 517060, 514571, 511904, 509201, 506267, 503066, 500099, 497950, 496572, 495274, 493393, 490873]
59803D90873k635k102j218l77J34J04m92j227j409q98m73r18j939k566k520k425
59787D69912k658k760k282j556j202j363j775k180k341k023j304o98o51j054j338
59772D44727r52J69J341J619R30M91J414L129M057L737L253L469L936L948L581
59757D78849L251L100L368M467O052O930O618O203O789P847Q017P011N714M834
59743E59050M313L886L325K355J017K7Q4Q54J245O23o03j545j643j083o64r44
59727E70297j486j341m76K4m87j253j288p31l40l16m85r81j838k345j853q50l28
59710E53923l55k52J12J95j22l23j79nJ07N07J266J897K009J739J443J354J530
59693E64846J749J598J009N16N19P04O74O75R41Q63j82j489j653n70L88K49n66
$$ y = [490873, 488238, 486136, 484918, 484541, 484675, 484779, 484287, 483060, 481651, 480753, 480280, 479362, 477423, 474857, 472337, 469912, 467254, 464494, 462212, 460656, 459454, 458091, 456316, 454136, 451795, 449772, 448468, 447770, 447119, 446065, 444727, 443775, 443944, 445285, 446904, 447834, 448325, 449739, 452868, 456925, 460662, 463915, 467384, 471320, 475268, 478849, 482100, 485200, 488568, 493035, 499087, 506017, 512635, 518838, 525627, 533474, 541491, 548502, 554216, 559050, 563363, 567249, 570574, 572929, 573946, 573973, 574057, 574911, 576156, 576779, 576176, 574631, 572988, 571905, 571241, 570297, 568811, 567470, 566994, 567018, 566531, 565278, 563990, 563259, 562919, 562603, 562118, 561137, 559299, 556954, 555101, 554251, 553923, 553568, 553316, 553428, 553623, 553501, 553178, 552999, 552994, 553101, 553608, 554874, 556771, 558780, 560519, 561962, 563316, 564846, 566595, 568193, 569202, 569718, 570237, 570941, 571615, 572290, 573231, 574094, 573912, 572423, 570770, 570200, 570588, 570837, 570271]
59676E70271j373k264l477m613n156n216n170n050m746m427m302m196l771l040
59662E13470k358j986j838j566q94PO33Q32J125J976K966L275K884K608K954L549
59646E27637L810L546K696J126j005l083m584n391n459m716l580k922l065l241
59632E01769k618j507r63j361j963j965j390q45p91j274k024k570k441j621p22
59617D77714m68j011j916k790l593m240m325l531k101n98O52J578K070K126K135
59602D61702K490K905K627J452J7r51j258r97k77N68R98Q01L02j47m69n89l42
59585D68832J58N21O30P15O85P3j134k233k763l037l390l519l058k253j508q86
59569D47833m89o81j371j761j397r14r80j156o79J91N85M48N14J054J517J429
$$ y = [570271, 568898, 566634, 563157, 558544, 553388, 548172, 543002, 537952, 533206, 528779, 524477, 520281, 516510, 513470, 511112, 509126, 507288, 505722, 504828, 504835, 505468, 506300, 507425, 509401, 512367, 515642, 518526, 521134, 524088, 527637, 531447, 534993, 537689, 538815, 537810, 534727, 530143, 524752, 519293, 514577, 510997, 508075, 505010, 501769, 499151, 497644, 496681, 495320, 493357, 491392, 490002, 489157, 488366, 487092, 485068, 482498, 480057, 478436, 477714, 477246, 476235, 474319, 471529, 467936, 463696, 459371, 455840, 453739, 453141, 453793, 455371, 457441, 459567, 461702, 464192, 467097, 469724, 471176, 471193, 470242, 468984, 467987, 467710, 468278, 469276, 470077, 470379, 470232, 469763, 469174, 468832, 468990, 469511, 470141, 470856, 471541, 471614, 470480, 468247, 465484, 462447, 459057, 455538, 452480, 450227, 448719, 447833, 447344, 446663, 445292, 443531, 442134, 441220, 440240, 439084, 438405, 438596, 439181, 439629, 440143, 441197, 442714, 444143]
59553D44143R35M23J90M20R65J267R86N47O50J471K683L961N153O339P980J0491
59537D88604J3442J5948J8102K0656K2621K0758J3161K432o415j0774j1644j0695
59525E76196q325m766j113J548L030L524L181K436J827J114l84k488m130m940
59511E66710n758p217q793r672r780r456q873q114p265o213m922l933l817m086
59497D68811l649k442j635j939k662k795k191j248k30O68J275J777K509L210L211
59482D62670K553K072K186K481K717L253M099M577M410M200M322M213L479K776
59468E10008K814L183L004K261J682J641J907K178K322K252K046K039K491L347
59454E43175M484N898P427Q669R272R058P947O209M647L851L295J988o5j960l479
$$ y = [444143, 445078, 445501, 445691, 446111, 447076, 448343, 449329, 449876, 450526, 451997, 454680, 458641, 463794, 470133, 478113, 488604, 502046, 517994, 536096, 556752, 579373, 600131, 613292, 615724, 609309, 598535, 586891, 576196, 567871, 563105, 561992, 563540, 566570, 570094, 573275, 575711, 577538, 578652, 578268, 575780, 571650, 566710, 560952, 553735, 544942, 535270, 525490, 516034, 507161, 499047, 491782, 485569, 480647, 476714, 472897, 468811, 465162, 462720, 461085, 459146, 456484, 453689, 451498, 450250, 450020, 450688, 451963, 453740, 456249, 459459, 462670, 465223, 467295, 469481, 471962, 474679, 477932, 482031, 486608, 491018, 495218, 499540, 503753, 507232, 510008, 512822, 516005, 519009, 521270, 522952, 524593, 526500, 528678, 531000, 533252, 535298, 537337, 539828, 543175, 547659, 553557, 560984, 569653, 578925, 587983, 595930, 602139, 606786, 610637, 613932, 615920, 615855, 613895, 610416]
59439F10416n351p677r302r371q484p567o591n259m061l618l523k828j341L48
59425E35791J865L306M735O086P474R072J0806J2536J4295J6096J7718J8939J9729
59412F78448K0174K0654K1917K3988K4742K0827J1027j895j3313k0263k2433k0798
59400G43075j6550j0853m396K779J0063J5025J4456P233m261j5703k3594k6764
59388F90510k6033k2960j8856j4573j0768p832n572l467j467j32K57K49O13J503
59374E81472K539L296L475K964K090J415J105Q80P19J059J950K679K631K123J914
59359F12311K328L217M312N229N612N674O234P691R460J0771J1619J2547J3824
59346G10829J5270J6448J6762J5872J4320J3137J2505J1553R774P790O072L900
$$ y = [610416, 605065, 597388, 588086, 578715, 570231, 562664, 556073, 550814, 546753, 543135, 539612, 536784, 535443, 535791, 537656, 540962, 545697, 551783, 559257, 568329, 579135, 591671, 605966, 622062, 639780, 658719, 678448, 698622, 719276, 741193, 765181, 789923, 810750, 821777, 819882, 806569, 786306, 763873, 743075, 726525, 715672, 711276, 714055, 724118, 739143, 753599, 760832, 756571, 740868, 717274, 690510, 664477, 641517, 622661, 608088, 597320, 589488, 583916, 580449, 578982, 578850, 579107, 579356, 579969, 581472, 584011, 587307, 590782, 593746, 595836, 597251, 598356, 599236, 599955, 601014, 602964, 605643, 608274, 610397, 612311, 614639, 617856, 622168, 627397, 633009, 638683, 644917, 652608, 662068, 672839, 684458, 697005, 710829, 726099, 742547, 759309, 775181, 789501, 802638, 815143, 826696, 836470, 844260, 850332, 854232]
59334H54232N59l239o252q486j0862j3433j5180j5583j5204j4622j3774j2646
59322G25510j1703j1227j0843j0128r229q522q063p639p129o577o090n817n786
59309F16757n697n054l679k016p64j58L02J322L066N134P328R910J2622J3824
59295F52897J1500N287k955j0657j6114j8659j8391j6204j3519j1257r313p247
59283E45368n115l273j834o69K92J095J863K724L859N536P710R749J1091J2110
59269E90506J3454J4687J4614J3082J1351J0257R158P242M805K431n9k911n440
59256F83177o772p122p452q182r003r509r333q089n914l759k456j780j034r5P42
59241F03419J595K878M559O130P151P407O869N893N188N137N424N578N387M610
$$ y = [854232, 854791, 851552, 845300, 836814, 825952, 812519, 797339, 781756, 766552, 751930, 738156, 725510, 713807, 702580, 691737, 681609, 672380, 663858, 655795, 648156, 641027, 634450, 628360, 622543, 616757, 611060, 606006, 602327, 600311, 599547, 599389, 599691, 601013, 604079, 609213, 616541, 626451, 639073, 652897, 664397, 669684, 666729, 656072, 639958, 621299, 602908, 586704, 573185, 561928, 552615, 545368, 540253, 536980, 535146, 534477, 534769, 535864, 537727, 540451, 544310, 549846, 557556, 567305, 578396, 590506, 603960, 618647, 633261, 646343, 657694, 667951, 677109, 684351, 689156, 691587, 691528, 688617, 683177, 676405, 669283, 661831, 653649, 644646, 635137, 625804, 617715, 611801, 608042, 605586, 603806, 602772, 602677, 603419, 605014, 607892, 612451, 618581, 625732, 633139, 640008, 645901, 651089, 656226, 661650, 667228, 672615, 677225]
59227F77225K930O03j518k969m107n275o273p045p954q920r269q957q843r184
59213F00444r003p843o805o794o864n754m020l120l133k961k305j838j799j820
59199E36385j942k426k753k064n45Q21J696K444K965K801K231K086K392K403J956
59184E48450J697J951K403K921L695M527M887M745M515M328M139M303N103N952
59170F03616O106N879O187P093P882Q260Q400Q033O753N032L652K404N16j750
59156F78063l408m491n999q082r813j0817j1634j2233j1776j0312r129q914q820
59143E62635q037o980o341o023n771n771o010n995n635n476n592n230m134l113
59129D82527k714k316j288m1Q39J638K743L645L716L435L880N309O968Q115Q614
$$ y = [677225, 680155, 680758, 679240, 676271, 672164, 666889, 660616, 653571, 645617, 636697, 627428, 618471, 609628, 600444, 591441, 583598, 576793, 569999, 563135, 557381, 553361, 550241, 547108, 544147, 541842, 540004, 538205, 536385, 534443, 532017, 529264, 527200, 526655, 527476, 529172, 531616, 534581, 537382, 539613, 541699, 544091, 546494, 548450, 550147, 552098, 554501, 557422, 561117, 565644, 570531, 575276, 579791, 584119, 588258, 592561, 597664, 603616, 609722, 615601, 621788, 628881, 636763, 645023, 653423, 661456, 668209, 673241, 676893, 679297, 679813, 678063, 674655, 670164, 664165, 656083, 646270, 635453, 623819, 611586, 599810, 589498, 580369, 571455, 562635, 554598, 547618, 541277, 535254, 529483, 523712, 517702, 511707, 506072, 500596, 495004, 489774, 485640, 482527, 479813, 477497, 476209, 476168, 477007, 478645, 481388, 485033, 488749, 492184, 496064, 501373, 508341, 516456, 525070]
59114E25070Q676Q573Q495Q445Q315Q176Q231Q344Q036P067N725M529L887L921
59100F25490M218L986K924J712J044O11k31j175j400j015q81j088q87j55K93N6
59084F33502l57o43j104j777k330l088m831p212q734q806q447q430q139p067n991
59069E56546n577n102l830k516k234k553k340j714j737k492k938k644k400k885
59055E15584l679l880l120j780p07o49j529k280j908p00J10j73j001j403j101
59040D91784n81l47l65l24j43k4M6L91J099J740J986K203K925M034N010N751O551
59023E21736P493Q444R389J0211J0504J0267J0296J0959J1145R550O653M094K382
59010F33123O69j271k616l157l734m466m226k552o05O22J709L430N224O177O480
$$ y = [525070, 533746, 542319, 550814, 559259, 567574, 575750, 583981, 592325, 600361, 607428, 613153, 617682, 621569, 625490, 629708, 633694, 636618, 638330, 639374, 639985, 639754, 638579, 637179, 636164, 635283, 634195, 633308, 633153, 633446, 633502, 633145, 632502, 631398, 629621, 627291, 624203, 619372, 612160, 603426, 594620, 586173, 577743, 569604, 562537, 556546, 550969, 545867, 542037, 539521, 537287, 534734, 532394, 530680, 528943, 526451, 523513, 520869, 518469, 515584, 511905, 508025, 504905, 503125, 502418, 501769, 500240, 497960, 496052, 495352, 495462, 495289, 494288, 492885, 491784, 491203, 490856, 490491, 490167, 490024, 490000, 490046, 490437, 491536, 493276, 495262, 497465, 500390, 504424, 509434, 515185, 521736, 529229, 537673, 547062, 557273, 567777, 578044, 588340, 599299, 610444, 619994, 626647, 630741, 633123, 633792, 632521, 629905, 626748, 623014, 618548, 614322, 611770, 611165, 611787, 613496, 616926, 622150, 628327, 634807]
58995F34807O792P003O724O243N926N254L561J257n97j621k220k704l113l546
58981F63766m017m173l733k803j423O12L046M869N491N676O653Q691J1076J3078
58967G06809J4310J4636J4337J4062J4126J4097J3478J2369J1112R752Q211O511
58955H53810M462J635j949n594q690j1247j3405j5057j6191j7058j7672j7728
58943G35316j7213j6432j5340j3654j1726j0296r209p512n172l431k914k677j856
58930F17884r43n78k85M95J165J004M82M10M71o6q79j029n15j73l55p23j035j230
58912F14100r96j76P14J131J382K102L222M203N029O172P775R485J0929J1889
58898F76961J2314J2514J2913J3314J3074J2317J2106J2931J4024J4799J5958
$$ y = [634807, 641599, 648602, 655326, 661569, 667495, 672749, 676310, 677567, 676970, 675349, 673129, 670425, 667312, 663766, 659749, 655576, 651843, 649040, 647617, 648229, 651275, 656144, 661635, 667311, 673964, 682655, 693731, 706809, 721119, 735755, 750092, 764154, 778280, 792377, 805855, 818224, 829336, 839088, 847299, 853810, 858272, 859907, 857958, 852364, 843674, 832427, 819022, 803965, 787774, 770716, 753044, 735316, 718103, 701671, 686331, 672677, 660951, 650655, 641446, 633934, 628762, 625331, 622417, 619740, 617884, 616941, 616363, 616078, 616573, 617738, 618742, 619224, 619634, 620105, 620039, 619160, 618131, 617616, 617443, 617088, 616365, 615330, 614100, 613104, 612928, 613642, 614773, 616155, 618257, 621479, 625682, 630711, 636883, 644658, 654143, 665072, 676961, 689275, 701789, 714702, 728016, 741090, 753407, 765513, 778444, 792468, 807267, 823225]
58887H23225J8276K1175K3500K4792K4900K3267J9830J5859J2616R782O375K570
58875A026167p69l770p274j1191j4533j6921j8757j9928j9689j7932j5536j3295
58863H66572j1376r842q804p985o996o130o190p456r365j1078j1909j1538j0434
58850G47469r726r891r993q968p291o353o546p002p131p313p935q672q966q689
58836F32993q118p671p652p893p822p196o387n631m523k842j311p69r35p89J48
58821E63602J621L319M970O025O113N719N700O242O802O890O400N400M156L135
58807F36094K528K038J464J027P95L07p06j807k539l096l807m577n324o269p281
58792F08847p690p301o838o794o685o040n182m305k870q00P72R99O88J127K422
$$ y = [823225, 841501, 862676, 886176, 910968, 935868, 959135, 978965, 994824, 1007440, 1017222, 1023597, 1026167, 1025398, 1021628, 1014354, 1003163, 988630, 971709, 952952, 933024, 913335, 895403, 879867, 866572, 855196, 845354, 836550, 828565, 821569, 815439, 809249, 801793, 792428, 781350, 769441, 757903, 747469, 737743, 727852, 717859, 708891, 701600, 695247, 688701, 681699, 674568, 667255, 659320, 650648, 641682, 632993, 624875, 617204, 609552, 601659, 593837, 586641, 580254, 574623, 570100, 567258, 565947, 565178, 564243, 563454, 563602, 565223, 568542, 573512, 579537, 585650, 591369, 597069, 603311, 610113, 617003, 623403, 628803, 632959, 636094, 638622, 640660, 642124, 643151, 643946, 644253, 643547, 641740, 639201, 636105, 632298, 627721, 622397, 616128, 608847, 601157, 593856, 587018, 580224, 573539, 567499, 562317, 558012, 555142, 554342, 555114, 556113, 556801, 557928, 560350]
58777E60350L927N348O305N890L985K014J012q7k687n959p837p898p479p361p139
58762E42384o656o308n946n016l784l084k937k582j773q01L95J922K976K626J372
58747E12788O31Q47J358J911K868M007M504M255M060M394N012N632O130O140N506
58732E70043M848M797N061N104N193N659N844N106M199M203M706M567L947L890
58718F37167M394M663M881N891P314P913P775Q251R534J0095Q837O269L271J51
58704G26406k814n233p272r368j1294j2611j3831j5703j7617j8187j7331j6208
58692E78937j5237j3848j2112j0881j0158q962p103n551m848m532m301m293m199
58679D72912l502k682k727l352l257k172j106n41R2J055J935K806M214N947P274
$$ y = [560350, 564277, 569625, 575930, 581820, 585805, 587819, 588831, 588744, 586057, 580098, 572261, 564363, 556884, 549523, 542384, 535728, 529420, 523474, 518458, 514674, 511590, 508653, 506071, 504298, 503497, 503892, 505814, 508790, 511416, 512788, 513419, 514266, 515624, 517535, 520403, 524410, 528914, 533169, 537229, 541623, 546635, 552267, 558397, 564537, 570043, 574891, 579688, 584749, 589853, 595046, 600705, 606549, 611655, 615854, 620057, 624763, 629330, 633277, 637167, 641561, 646224, 651105, 656996, 664310, 672223, 679998, 688249, 697783, 707878, 716715, 722984, 726255, 726406, 723592, 718359, 711087, 701719, 690425, 677814, 663983, 648280, 630663, 612476, 595145, 578937, 563700, 549852, 537740, 526859, 516701, 507739, 500636, 495085, 490237, 485705, 481404, 477111, 472912, 469410, 466728, 464001, 460649, 457392, 455220, 454114, 453573, 453665, 454720, 456655, 459461, 463675, 469622, 476896]
58664D76896Q350R898J1566J2210J1626J0401Q314M834R52j660l215n288p651
58651E37233q206o528m922n122o169o516o168n691m925l811k978k548j757m95
58637D71397K59J93L48J349K447K982L284L541L239K363J733J550J039j0p86r17
58621D94011r05p91m6J045J596J933L269N266O117N458M979N518N820N015M027
58606E42312L521K633R41l63m96m18r37j292q91o70j435k493l119l759m549m305
58590E24680k384o5J231J846K824M256N722P163Q346Q741Q618R002R904J0084
58576E99968R119Q045P426O680N892O263P965R620J0716J2387J4969J7139J8485
58563G34674K0494K3688K6350K7476K8523L0374L1070K8668K4184J9513J4394
$$ y = [476896, 485246, 495144, 506710, 518920, 530546, 540947, 549261, 554095, 555047, 553387, 550172, 544884, 537233, 529027, 522499, 517577, 512455, 506286, 499770, 493602, 487911, 482986, 479175, 476197, 473649, 471892, 471397, 471656, 471849, 472197, 473546, 475993, 478975, 482259, 485800, 489039, 491402, 493135, 494685, 495724, 495714, 494928, 494011, 493106, 492315, 492269, 493314, 494910, 496843, 500112, 505378, 511495, 516953, 521932, 527450, 533270, 538285, 542312, 545833, 548466, 549407, 549044, 548548, 548130, 547193, 545901, 545010, 544340, 542905, 540412, 537293, 533534, 528985, 524680, 522296, 522231, 523462, 525308, 528132, 532388, 538110, 545273, 553619, 562360, 570978, 579980, 589884, 599968, 609087, 617132, 624558, 631238, 637130, 643393, 651358, 660978, 671694, 684081, 699050, 716189, 734674, 755168, 778856, 805206, 832682, 861205, 891579, 922649, 951317, 975501, 995014, 1009408]
58552A009408P822Q84m304p346r149r874r222p832o701o006n843o990r716j2957
58538I22174j5845j8756k1782k3743k3976k3452k2891k1489j8769j5875j3599
58527G01997j1013p578m734l714l577l030k373k131j657q68j215l146m621m143
58513F48197l117l176l335k205r11j139k066j959j281j509k269k270j877k143
58499F18940k496j891j084j339j943j469m27k12m44J77J405K151K693L942N429
58484F23432O321P391R657J2175J3468J4173J5800J7844J8629J8216J7892J7428
58472G92426J5203J0721N002r74o393j0034j1451j1973j2791j3059j1565q949
58460G36163o354l343P33M638O849Q034R690J1520J2421J2728J3162J2745J0205
$$ y = [1009408, 1017230, 1018114, 1013810, 1006464, 997315, 987441, 978219, 970387, 963686, 957680, 951837, 944847, 935131, 922174, 906329, 887573, 865791, 842048, 818072, 794620, 771729, 750240, 731471, 715596, 701997, 690984, 683406, 678672, 674958, 671381, 668351, 665978, 663847, 662190, 661322, 660107, 656961, 652340, 648197, 645080, 641904, 638569, 636364, 635453, 634314, 632248, 630289, 629008, 627499, 625230, 622960, 621083, 618940, 616444, 614553, 613469, 612130, 610187, 608718, 608291, 608079, 607635, 607812, 609217, 611368, 614061, 618003, 623432, 629753, 637144, 646801, 658976, 672444, 686617, 702417, 720261, 738890, 757106, 774998, 792426, 807629, 818350, 823352, 822378, 815985, 805951, 794500, 782527, 769736, 756677, 745112, 736163, 729809, 726466, 727199, 731837, 738686, 746720, 756410, 767930, 780351, 793079, 806241, 818986, 829191]
58447H29191O264K311j907o917j1287j3311j3645j3816j3458j1626r340q090p125
58434G27244n008k498j093k5K275M943O017N891O434P671Q375Q949J0543J2199
58420G91917J1925R873P618N161J613k158m583o219q546j0880j1515j1022j1288
58407G61896j2105j1752j0182q656p133m923k981k532k479j161N29Q35N76J636
58393G01568L317L731L472M291N347M597K822K450L329L509L179L952N237N231
58379G56032M577N030N555L935J244M16J298J511J286K757N248O061N525O439
58365H06914Q816J0010R798J0569J2498J3319J2973J3644J5118J4773J2476J0756
58353I51664R943P750M047J384L73q74k348j831O40K446L016M301O376P069O355
$$ y = [829191, 835455, 837766, 835859, 828942, 817655, 804344, 790699, 776883, 763425, 751799, 742459, 734369, 727244, 722236, 719738, 718645, 718620, 720895, 725838, 731855, 737746, 744180, 751851, 760226, 769175, 779718, 791917, 803842, 813715, 821333, 826494, 828107, 825949, 821366, 815147, 806601, 795721, 784206, 773184, 761896, 749791, 738039, 727857, 719201, 712068, 707145, 704164, 701632, 699153, 697992, 698521, 699356, 699932, 701568, 704885, 708616, 712088, 716379, 721726, 726323, 729145, 731595, 734924, 738433, 741612, 745564, 750801, 756032, 760609, 765639, 771194, 775129, 776373, 776789, 778087, 779598, 780884, 783641, 788889, 794950, 800475, 806914, 815730, 825740, 835538, 846107, 858605, 871924, 884897, 898541, 913659, 928432, 940908, 951664, 961607, 969357, 973404, 974788, 975161, 974287, 971939, 970108, 970748, 973194, 976210, 980511, 986887, 993956, 1000311]
58338A000311O650Q369R587J0248J2182J4862J5791J5208J5736J7354J7531J6174
58326A160003J5425J4662J1253O242L627L684K706j51j629n86L47K19J203L645
58312A220650N245N948Q109J1137J1666R838R567J1806J3395J3331J4069J5821
58300A350582J5829J4210J4273J6134J6378J4882J5298J7852J8638J7120J7224
58289A528420J9702K0664J9294J9593K2723K4840K4450K4760K6851K7759K7164
58278A786220K8558L2012L3314L1991L2443L5382L6378L4752L5419L9703M3008
58267B169180M3908M6640N2073N5320N5197N6822O1835O5280O5234O5990O8583
58256B806062O8017O3412O0837O2444O2883O0230N9849O3560O5878O5271O7937
$$ y = [1000311, 1006961, 1015330, 1024917, 1035165, 1047347, 1062209, 1078000, 1093208, 1108944, 1126298, 1143829, 1160003, 1175428, 1190090, 1201343, 1207585, 1211212, 1214896, 1217602, 1217451, 1215822, 1215236, 1215583, 1215802, 1217005, 1220650, 1225895, 1231843, 1239952, 1251089, 1262755, 1272593, 1282160, 1293966, 1307361, 1320692, 1334761, 1350582, 1366411, 1380621, 1394894, 1411028, 1427406, 1442288, 1457586, 1475438, 1494076, 1511196, 1528420, 1548122, 1568786, 1588080, 1607673, 1630396, 1655236, 1679686, 1704446, 1731297, 1759056, 1786220, 1814778, 1846790, 1880104, 1912095, 1944538, 1979920, 2016298, 2051050, 2086469, 2126172, 2169180, 2213088, 2259728, 2311801, 2367121, 2422318, 2479140, 2540975, 2606255, 2671489, 2737479, 2806062, 2874079, 2937491, 2998328, 3060772, 3123655, 3183885, 3243734, 3307294, 3373172, 3438443, 3506380]
58245C506380P5847Q2440Q5055Q9860R9411J07391J11170J17271J28547J38504
58235D541876J44328J52730J66536J78729J86392J96919K13593K29132K40592
58226F250827K55954K78492L00016L17439L40091L72213M05029M34775M71056
58217I425892N18189N66820O13834O70963P43415Q20857R00612R97308J117825
58208A6375715J250979J395180J570442J788957K042138K332828K690640L140098
58200C2586977L689731M373891N268351O440865P922088R740045J1928016J4473388
58192I6423352J7327778K0511644K4140483K8292180L2884462L7607891M1662815
58185B98850605M3358160M0334757L0943309J5874681j671301j7724610k9641205
$$ y = [3506380, 3582227, 3664667, 3749722, 3839582, 3938993, 4046384, 4157554, 4274825, 4403372, 4541876, 4686204, 4838934, 5005470, 5184199, 5370591, 5567510, 5781103, 6010235, 6250827, 6506781, 6785273, 7085289, 7402728, 7742819, 8115032, 8520061, 8954836, 9425892, 9944081, 10510901, 11124735, 11795698, 12539113, 13359970, 14260582, 15257890, 16375715, 17626694, 19021874, 20592316, 22381273, 24423411, 26756239, 29446879, 32586977, 36276708, 40650599, 45918950, 52359815, 60281903, 70021948, 81949964, 96423352, 113751130, 134262774, 158403257, 186695437, 219579899, 257187790, 298850605, 342208765, 382543522, 413486831, 429361512, 427690211, 409965601, 380324396]
58178C80324396l6794927l9814912l9638224l7183358l3363873k8989450k4618534
58171A39921118k0574596j7044416j4098878j1690278r723810q131485o859113
58164E1798542n831794m980137m274384l699163l220140k804136k446876k152326
58156B2389586j905072j686509j497715j343438j211571j088894r79854q90813
58148A1785720q11968p32570o58563n98262n45241m91245m41807m03672l70216
58139F732176l34293l02765k83625k70619k54576k38615k28578k19364k04326
58130D395415j88328j78455j70828j58884j45977j37945j31582j21906j12853
58121C048657j09584j07749j01198r3184q9570q7758q2543p6329p3703p1965o6637
$$ y = [380324396, 343529469, 303714557, 264076333, 226892975, 193529102, 164539652, 139921118, 119346522, 102302106, 88203228, 76512950, 66789140, 58657655, 51798542, 45966748, 40986611, 36712227, 33013064, 29792924, 26988788, 24541912, 22389586, 20484514, 18798005, 17300290, 15956852, 14745281, 13656387, 12676533, 11785720, 10973752, 10241182, 9582619, 8984357, 8439116, 7947871, 7506064, 7102392, 6732176, 6397883, 6095118, 5811493, 5540874, 5286298, 5047683, 4819105, 4599741, 4395415, 4207087, 4028632, 3857804, 3698920, 3552943, 3414998, 3283416, 3161510, 3048657, 2939073, 2831324, 2730126, 2636942, 2547372, 2459614, 2377071, 2300742, 2227039, 2155074, 2088437]
58110B088437o0483n8063n6892n2738m8043m6649m5738m1360l6545l5774l6626
58099A569526l4931l3048l4992l8284l8368l6585l6173l5022k9914k3599k0313
58088A208297j8481j4791j1196j0971j2046j1195j0615j3539j7385j8131j7488
58077A052459j9062k1226k0593j8787j9088j9972j8467j6385j6674j7152j4470
58066H50583j0916j0609j2140j1584r757r886j0859r432o720o129p056o748o141
58053G32606p901j0771j1619j1025j1350j1534r342o490o048o905o188m836n393
58040F23204o651o024m880n978p833p279n469n588o725n885m241n369q684j0394
58026E32204r813r258r001p675o420p247q470p056m247l638m877m680k981k548
$$ y = [2088437, 2027954, 1969891, 1912999, 1860261, 1812218, 1765569, 1719831, 1678471, 1641926, 1606152, 1569526, 1534595, 1501547, 1466555, 1428271, 1389903, 1353318, 1317145, 1282123, 1252209, 1228610, 1208297, 1189816, 1175025, 1163829, 1152858, 1140812, 1129617, 1119002, 1105463, 1088078, 1069947, 1052459, 1033397, 1012171, 991578, 972791, 953703, 933731, 915264, 898879, 882205, 865053, 850583, 839667, 829058, 816918, 805334, 795577, 785691, 774832, 765400, 758680, 752551, 745495, 738747, 732606, 724705, 713934, 702315, 691290, 679940, 668406, 659064, 652574, 646526, 639621, 633433, 628597, 623204, 616553, 610529, 605649, 599671, 591838, 584559, 579090, 573502, 566777, 560892, 556651, 551282, 542598, 532204, 522391, 513133, 504132, 496457, 490037, 482790, 474320, 467264, 463017, 459379, 454502, 449822, 446841, 444293]
58012D44293l392l041j727j927l236k901j119p31j904k030p46k97j052j231q42
57997D18117j417k195j169M58n28l831n883n466m592l971k273O7Q58K58N35J565
57981C90533Q85j486k679j863j273j880k111j475j472k192j854m50j80j490k208
57966C68805j334l43j7O29J626J540L40k26K72M18r3k4N32r1j999l325l356l270
57948C60084l428k821j532r69j255j122m49k37p2J404L601M547M355M988O583
57933C73677P289O869P107Q221Q265O614M859L649J821p11k325k775l889o324
57919D12347q387q869q493p824o392m586l797m016l606k078o82P5J013K101K263
57904C59069J752J992K763K218J20j642k229k765l627l576k223p94J14J096J906
$$ y = [444293, 440901, 437860, 436133, 434206, 430970, 428069, 426950, 426219, 424315, 422285, 421539, 421242, 420190, 418959, 418117, 416700, 414505, 413336, 413794, 413266, 409435, 403552, 398086, 393494, 389523, 387250, 387317, 388175, 388433, 388968, 390533, 391418, 389932, 387253, 385390, 384117, 382237, 380126, 378651, 377179, 374987, 373133, 372683, 372503, 371013, 368805, 367471, 367128, 367111, 367740, 369366, 370906, 371246, 371020, 371292, 371710, 371617, 371593, 372125, 372034, 370035, 366710, 363354, 360084, 356656, 353835, 352303, 351334, 350079, 348957, 348508, 348271, 348199, 349603, 353204, 357751, 362106, 367094, 373677, 380966, 387835, 394942, 403163, 411428, 418042, 422901, 426550, 428371, 427660, 425335, 422560, 418671, 412347, 403960, 395091, 386598, 378774, 372382, 367796, 363999, 359983, 356377, 354299, 353617, 353692, 354705, 356806, 359069, 360821, 362813, 365576, 367794, 367914, 366272, 364043, 361278, 357651, 354075, 351852, 351058, 351172, 352268, 354174]
57889C54174J507M70N28J449J196m40j402j042j039j955k157j150q51k231l610
57874C43447l572k905k406j422P7O11k60q93m22k57j423k667k679k026j483m57
57858C21263J561L717N167O122O688O383N548N379N900N809M804M025L750K903
57844C89019J329J57n66k042l993m533l536l203m381n240m747m474n433o032m965
57829C37360l515l150l150k459j707j580j282l52M1p10j121l3J353J578J160J104
57813C23537R34o6j333k286l507n223o292o167o033o627o748n507m069l592l208
57798B63813j939p64q51j411j140m20k25k65O6K28k06j71J249L026L718L629L868
57781B72205M399M616M749N200N520N426N730O876P718P200O026N370N049M304
$$ y = [354174, 355681, 356151, 356679, 358128, 359324, 358884, 357482, 356440, 355401, 353446, 351289, 350139, 349288, 347057, 343447, 339875, 336970, 334564, 333142, 333219, 333830, 333570, 332677, 332255, 331998, 330575, 327908, 325229, 323203, 321720, 321263, 322824, 326541, 331708, 337830, 344518, 350901, 356449, 361828, 367728, 373537, 378341, 382366, 386116, 389019, 390348, 390505, 389939, 387897, 383904, 379371, 375835, 372632, 368251, 363011, 358264, 353790, 348357, 342325, 337360, 333845, 330695, 327545, 325086, 323379, 321799, 320517, 320165, 320206, 319496, 318375, 318342, 319695, 321273, 322433, 323537, 324471, 324405, 323072, 320786, 317279, 312056, 305764, 299597, 293564, 286937, 280189, 274682, 270613, 267021, 263813, 261874, 261110, 260259, 258848, 257708, 257288, 257063, 256798, 256864, 257092, 256886, 256715, 257964, 260990, 264708, 268337, 272205, 276604, 281220, 285969, 291169, 296689, 302115, 307845, 314721, 322439, 329639, 335665, 341035, 346084, 350388]
57767C50388L250K184O79j393l065l748m270n317o154o075n773n964n997n143
57753C03602l905k927j936r18p83j597j827o62N89P40N97J050J299O95N13J748
57737B96278K940K409J168J237K340K695K038J514J319P51N6J72J013J682J949
57722C19561K055J738Q91K81K22l58k030l280k638j204j026k060k802l035l685
57707C02630m642m925m607m565m740m423l818l541l103j726k01n4j156j965j819
57692B57345j397j193j121j386k202k967k993k662k604k422j571o18j72N78K514
57677B37129M681N661O142Q095J1948J6552K1354K6690L2254L7424M2764M9044
57665D99738N4678N5921M9847L5918J5466q303l0127m5048n1696n2181m8951m3322
$$ y = [350388, 353638, 355822, 356501, 355108, 352043, 348295, 344025, 338708, 332554, 326479, 320706, 314742, 308745, 303602, 299697, 296770, 294834, 293916, 293133, 291536, 289709, 289047, 289636, 290376, 290973, 292023, 293322, 294017, 294530, 296278, 299218, 301627, 302795, 304032, 306372, 309067, 311105, 312619, 313938, 314689, 314745, 314917, 315930, 317612, 319561, 321616, 323354, 324245, 324526, 324748, 324390, 322360, 319080, 316442, 315238, 314212, 312152, 309350, 306315, 302630, 297988, 293063, 288456, 283891, 279151, 274728, 270910, 267369, 264266, 262540, 262339, 262285, 261129, 259164, 257345, 255948, 254755, 253634, 252248, 250046, 247079, 244086, 241424, 238820, 236398, 234827, 234209, 234037, 234615, 237129, 241810, 247471, 253613, 261708, 273656, 290208, 311562, 338252, 370506, 407930, 450694, 499738, 554416, 610337, 660184, 696102, 711568, 703265, 673138, 628090, 576394, 524213, 475262, 431940]
57653D31940l6566l0133k4428j9022j4328j1384r950q476o362m649m135m227m070
57640B54210l530k763j820r89o23n37l86l87p88j022n32J22J74R2O56J214N62
57623B43653q64j470r98o85j112j623j980k705l590l570k496j533j442j774k024
57608B15787k275k387j867q38o8J51K14L08L13M06O17J64j504l273l490k292j308
57591A98658j221j270j135j494k487l196l024k305j371l06L62J49l11m4M49j64
57575A81290j654k289j527p97j186k021k339k190j848j204n55o80j478j782j136
57560A58604m80n69q52n46K47J066J765K191K114J819J939K410K555K233J910
57545A76406J535N32r05j773j719j425j430j564j641j521o80J005K188J378p45
$$ y = [431940, 395374, 365241, 340813, 321791, 307463, 296079, 286129, 277653, 271291, 266642, 262507, 258280, 254210, 250680, 247917, 246097, 245108, 244485, 243948, 243562, 243175, 242387, 241365, 240833, 240955, 241129, 241221, 241877, 243091, 243653, 242789, 241319, 240321, 239636, 238524, 236901, 234921, 232216, 228626, 225056, 222560, 221027, 219585, 217811, 215787, 213512, 211125, 209258, 208420, 208352, 208503, 208717, 209025, 209338, 209744, 210361, 210525, 209021, 205748, 202258, 199966, 198658, 197437, 196167, 195032, 193538, 191051, 187855, 184831, 182526, 181155, 180849, 181211, 181360, 181049, 181005, 181454, 181290, 179636, 177347, 175820, 175023, 173837, 171816, 169477, 167287, 165439, 164235, 163680, 163000, 161522, 159740, 158604, 158124, 157555, 156703, 156157, 156404, 157470, 159235, 161426, 163540, 165359, 167298, 169708, 172263, 174496, 176406, 177941, 178473, 177568, 175795, 174076, 172651, 171221, 169657, 168016, 166495, 165815, 166820, 169008, 170386, 169641]
57530A69641j918j350l81j0K88Q63R86L61j33l6pk47J32J278J821R61j23j02N80
57511A72604P70M66M20Q23J349J802J919J329L21j99n6j10p10j098r40j132k213
57494A75345l219l124k360j897j798j619j400j304j110q09q95j339j263l74L58
57479A53192L36M54J504K564K270Q65l36r07j365j796j735j258j048j365j781
57464A49594j903j746j380q03p9O52J197J269P53J01j33j61o41j373j341l42M22
57447A44086nr88j240m19Q02J685J867J387P03K68o7o36j026n23M75O87j31p89
57429A46136n74j79j42K11J290K071J575M75L4K23J71k50m11j03L69R13J567J968
57411A55344J689Q80L1n15m63L94J566J993J328M17m6m92j409k203k107j436r96
$$ y = [169641, 167723, 166373, 165992, 165982, 166270, 167133, 168119, 168480, 168347, 168311, 168304, 168057, 168189, 169467, 171288, 172249, 172126, 172024, 172604, 173374, 173840, 174260, 175083, 176432, 178234, 180153, 181482, 181803, 181604, 181548, 181438, 180728, 179630, 178690, 177558, 175345, 172126, 169002, 166642, 164745, 162947, 161328, 159928, 158624, 157514, 156705, 155810, 154471, 153208, 152834, 153192, 153528, 153982, 155486, 158050, 160320, 161185, 160849, 159942, 158577, 156781, 155046, 153788, 152740, 151375, 149594, 147691, 145945, 144565, 143762, 143683, 144335, 145532, 146801, 147554, 147655, 147522, 147361, 146720, 145347, 144006, 143664, 144086, 144081, 143093, 141853, 141434, 142236, 143921, 145788, 147175, 147878, 148146, 148079, 147443, 146417, 145894, 146369, 147056, 146925, 146136, 145562, 145383, 145241, 145452, 146742, 148813, 150388, 150863, 150897, 151120, 151291, 151041, 150630, 150527, 150896, 151809, 153376, 155344, 157033, 157913, 157944, 157429, 156966, 157360, 158926, 160919, 162247, 162664, 162618, 162126, 160717, 158514, 156407, 154971, 153975]
57394A53975p79k48M95Q87R31J177J837K566L022L085K800K522K757L501M020
57379A82548L725K827J814Q21j31q09j125j333j537j534j365j426j703j695j356
57364A77721j323j802k121j777j106m45M38J552K200J943J289Q48O06N00Q01J377
57348A80701J488R23M29M47M02j09n27m25l48p12r51o62n70j291k053j784p27
57331A74231J09M02M62L53P5l5J49J78m3J82J073J627J067R8l13m02p66r89m41
57312A77017M40R29J310J996K172Q99r99j725r42O2L73K70J27k10q05j340j543
57295A78031j273m33O44J122O78J22K44P08Q38Q32J196J670J705J433J294J280
57279A90091J438K285L700M358L443K101J859K475K764K675K866K971K088N83
$$ y = [153975, 153196, 152948, 153443, 154330, 155261, 156438, 158275, 160841, 163863, 166948, 169748, 172270, 175027, 178528, 182548, 186273, 189100, 190914, 191735, 191604, 190795, 189670, 188337, 186800, 185266, 183901, 182475, 180772, 179077, 177721, 176398, 174596, 172475, 170698, 169592, 169147, 169585, 171137, 173337, 175280, 176569, 177417, 178023, 178523, 179324, 180701, 182189, 183112, 183541, 183988, 184390, 184281, 183754, 183329, 182981, 182269, 181318, 180656, 180086, 178795, 176742, 174958, 174231, 174340, 174742, 175204, 175557, 175632, 175597, 175746, 175924, 175881, 176063, 177136, 178763, 179830, 179928, 179615, 179213, 178447, 177458, 177017, 177457, 178386, 179696, 181692, 183864, 184763, 183764, 182039, 181097, 181159, 181532, 181802, 181929, 181719, 180914, 179574, 178031, 176758, 176325, 176969, 178091, 178769, 178891, 179135, 179843, 180681, 181513, 182709, 184379, 186084, 187517, 188811, 190091, 191529, 193814, 197514, 201872, 205315, 207416, 209275, 211750, 214514, 217189, 220055, 223026, 225114, 225697]
57265B25697l71o80j057j243l46J169J730R62J00o8n1k54l23j40p2R6J041K506
57247B28696L341L190K868K808K503J835J509J728J666Q48r6n07m83j25R16K513
57231B53210L627L501K572J758J449J606K153K861L318L371L185K801K235J878
57217B89525K153K701K732K207J878K078K266J967J397R82Q78J122J689K244K398
57202C18217K254K237K441K612K662K700K759K950L561M531N239N422N669O281
57188C69535O423N425M243M333N542O524O835P151P622P574O947O589O946P616
57174D59305Q350R254R950R792R111R078J0126J1576J2910J4250J5386J5639J5065
57161F09792J4720J5309J6378J7210J7650J7953J8507J9781K1757K3512K4211
$$ y = [225697, 225326, 224646, 223589, 222346, 222000, 223169, 224899, 225861, 225961, 225893, 225842, 225588, 225265, 225125, 225053, 225149, 226190, 228696, 232037, 235227, 238095, 240903, 243406, 245241, 246750, 248478, 250144, 250992, 250896, 250389, 249906, 249781, 250697, 253210, 256837, 260338, 262910, 264668, 266117, 267723, 269876, 272737, 276055, 279426, 282611, 285412, 287647, 289525, 291678, 294379, 297111, 299318, 301196, 303274, 305540, 307507, 308904, 309886, 310764, 311886, 313575, 315819, 318217, 320471, 322708, 325149, 327761, 330423, 333123, 335882, 338832, 342393, 346924, 352163, 357585, 363254, 369535, 375958, 381383, 385626, 389959, 395501, 402025, 408860, 416011, 423633, 431207, 438154, 444743, 451689, 459305, 467655, 476909, 486859, 496651, 505762, 514840, 524966, 536542, 549452, 563702, 579088, 594727, 609792, 624512, 639821, 656199, 673409, 691059, 709012, 727519, 747300, 769057, 792569, 816780]
57150H16780K4240K4420K4523K3799K2534K1577K0577J8578J6327J6008J8222
57139A047585K1051K2880K4384K6789K9700L1936L3474L5308L8015M1344M4812
57128A397278M8016N0785N3554N7184O2068O7747P3419P8439Q2498Q6096R0623
57117B147707R7066J04809J12610J20435J29234J39207J49724J60787J73064J86509
57107C521152K00627K16242K35359K59034K87073L20286L61594M14527M82292
57098F298186N68747O78390Q14443R77935J168519J383688J616214J854395K086532
57089A7447049K304297K501638K672825K813191K920023K991246L024341L015826
57081C9690436K955338K813509K537724K071498J391579N34932m07607j326925
$$ y = [816780, 841020, 865440, 889963, 913762, 936296, 957873, 978450, 997028, 1013355, 1029363, 1047585, 1068636, 1091516, 1115900, 1142689, 1172389, 1204325, 1237799, 1273107, 1311122, 1352466, 1397278, 1445294, 1496079, 1549633, 1606817, 1668885, 1736632, 1810051, 1888490, 1970988, 2057084, 2147707, 2244773, 2349582, 2462192, 2582627, 2711861, 2851068, 3000792, 3161579, 3334643, 3521152, 3721779, 3938021, 4173380, 4432414, 4719487, 5039773, 5401367, 5815894, 6298186, 6866933, 7545323, 8359766, 9337701, 10506220, 11889908, 13506122, 15360517, 17447049, 19751346, 22252984, 24925809, 27739000, 30659023, 33650269, 36674610, 39690436, 42645774, 45459283, 47997007, 50068505, 51460084, 51995016, 51587409, 50260484]
57073E0260484k134140k778377l241250l522972l634663l597852l443491l206659
57065B4701080k920592k613584k307612k017331j750783j512049j303153j123811
57057I152165r71440q42770p34920o44779n68811n04420m50334m04987l65762
57048C663942l30558k98858k70361k43934k18907j96029j75909j57669j40308
57039A631409j24199j10040r7369q5394p4184o3872n3709m3202l3082k3886j4703
57028I07769m650N787J6268K7443L7650M0228K7951R70l1750n9458p6565q3095
57016H08548q1504p4778o6003n7564n0383m4276l8735l3402k8431k4614k2561
57005B86297k1656k0488j8429j6160j4502j3426j2394j1160r836q568p341o105
$$ y = [50260484, 48126344, 45347967, 42106717, 38583745, 34949082, 31351230, 27907739, 24701080, 21780488, 19166904, 16859292, 14841961, 13091178, 11579129, 10275976, 9152165, 8180725, 7337955, 6603035, 5958256, 5389445, 4885025, 4434691, 4029704, 3663942, 3333384, 3034526, 2764165, 2520231, 2301324, 2105295, 1929386, 1771717, 1631409, 1507210, 1397170, 1299801, 1214407, 1140223, 1076351, 1022642, 979440, 946358, 922472, 907769, 903119, 908906, 925174, 952617, 990267, 1030495, 1058446, 1059416, 1027666, 968208, 891643, 808548, 727044, 652266, 586263, 528699, 478316, 434040, 395305, 361903, 333472, 308858, 286297, 264641, 244153, 225724, 209564, 195062, 181636, 169242, 158082, 148246, 139678, 132337, 126232]
56993A26232m917l979l361k706j487M74L070O356J0294J4060J6454J7157J6771
56980A94418J5437J2452P646K104k974p133r977j0875j0123r176q785p971n861
56967A59182l332j620l18J726M395O688Q541J0764J3550J6443J9336K1971K2764
56954B80090J9708J2652L581n374j3090j8797k1776k2102k0711j8381j5302j1745
56942A68753q357n551l106n90K221N282Q302J0963J3435J6341J9932K3627K6567
56929B77819K7950K6481K0511R733l689j6472k6269l2066l3603l1500k7408k2964
56917A68523j8745j4843j1742r839q650p459o214n065l728k241j543k185l144
56904G3125l030j964j039n45R7J010J745K228K712L035L008L247M569O835R258
$$ y = [126232, 121315, 117336, 113975, 111269, 109782, 110256, 113326, 119682, 129976, 144036, 160490, 177647, 194418, 209855, 222307, 229953, 232057, 229083, 221950, 211973, 201098, 190975, 181799, 173014, 165043, 159182, 155850, 154230, 153912, 155638, 160033, 166721, 175262, 186026, 199576, 216019, 235355, 257326, 280090, 299798, 312450, 316031, 310657, 297567, 278770, 256994, 234892, 214181, 195800, 180498, 168753, 160396, 154845, 151739, 151149, 153370, 158652, 166954, 177917, 191352, 207693, 227625, 251252, 277819, 305769, 332250, 352761, 362494, 358805, 342333, 316064, 283998, 250395, 218895, 191487, 168523, 149778, 134935, 123193, 113354, 104704, 97245, 91031, 85966, 82238, 79997, 78454, 76269, 73125, 70095, 68131, 67092, 66547, 66644, 67654, 69399, 71627, 74339, 77374, 80382, 83629, 88198, 95033, 104291]
56889A04291J1564J3936J6319J8693K1331K3696K3711J9540J1871L273m273j0110
56877B53842j3867j5241j4692j3085j0696p522m149j150J916N753R942J3582J6865
56864B21498K0713K5279L0103L5362M1449M7403N0965M9981M2923K9066R955r875
56852E94822k5555l5284m0006m0586l7288l1435k5066j8728j1569l722L468R829
56840C38880J6793K4961L3185M0774M8784N8243O8506P7906Q4302Q4230P3467
56829I50031N0335J8161j6182m5840o6396p6636p8148p3785o5830n5806m5312
56818D94592l5743k7138j8602r985k004N254J2554K0143K7588L5144M3654N2676
56806E98133N9815O2095N6920M2327J8757q990l3734n0967o0811o4941o3892n8272
$$ y = [104291, 115855, 129791, 146110, 164803, 186134, 209830, 233541, 253081, 264952, 268225, 263952, 253842, 239975, 224734, 210042, 196957, 186261, 178739, 174590, 173440, 175356, 181109, 191051, 204633, 221498, 242211, 267490, 297593, 332955, 374404, 421807, 472772, 522753, 565676, 594742, 604697, 594822, 569267, 533983, 493977, 453391, 416103, 384668, 359602, 340874, 329305, 325583, 329051, 338880, 355673, 380634, 413819, 454593, 503377, 561620, 630126, 708032, 792334, 876564, 950031, 1000366, 1018527, 1002345, 956505, 890109, 813473, 735325, 661540, 595710, 539904, 494592, 458849, 431711, 413109, 403124, 401120, 406374, 418928, 439071, 466659, 501803, 545457, 598133, 657948, 720043, 776963, 819290, 838047, 829057, 795323, 744356, 683545, 618604, 554712, 496440]
56794D96440n0268m2119l4339k6757j9999j4635r912m766P08N907J0916J6033
56782C27209K0906K5126K8768L1172L0050K3221J1011l858j8235k9763l7022l9765
56770C68820l8998l6134l2204k7983k4156k0819j7458j3983j1190r667q892p974
56758A19362o737n565m711m194l926l590k856j966j549j720j936j828j521j082
56744G6181n49l97j034j799j608o25j01l87n06LL03j46n74j94N96J082J202J122
56726G2569Q08N20P36J136Q34K5M4J251K233J917J026N91L65j87n46p8O54P54
56708H4652M37N05J027J472J627J577J290Q94Q15J064J036M68j14l41n15q31j018
56691I4045j110j545k064j753o41M1k21l91K71R75R15O72J030J555J478R92N99
$$ y = [496440, 446172, 404053, 369714, 342957, 322958, 308323, 298411, 293645, 294353, 300260, 311176, 327209, 348115, 373241, 402009, 433181, 463231, 486452, 497463, 493605, 475370, 445607, 408585, 368820, 329822, 293688, 261484, 233501, 209345, 188526, 171068, 157085, 145895, 136228, 127336, 119362, 112625, 107060, 102349, 98155, 94229, 90639, 87783, 85817, 84268, 82548, 80612, 78784, 77263, 76181, 75632, 75235, 74201, 72402, 70794, 70169, 70068, 69681, 69175, 69178, 69481, 69335, 68761, 68567, 69163, 70245, 71447, 72569, 73377, 73897, 74633, 75769, 76603, 76628, 76672, 77923, 80156, 82073, 83099, 83690, 84055, 83868, 83322, 83244, 83898, 84652, 85089, 85594, 86621, 88093, 89720, 91297, 92587, 93481, 94296, 95360, 96396, 96864, 96750, 96409, 95894, 95063, 94045, 92935, 91390, 89326, 87573, 86932, 86973, 86752, 86361, 86632, 87607, 88522, 89194, 90224, 91779, 93257, 94249, 94848]
56674I4848J52m74p33l05J94L75Q07J715K130J358K27j84p1q1n6L06N36L02K43
56655A01289Q61J527J670J839K528L016K596J811J342P73k15p23j12M85j89j424
56639A17074j723j197j007j194q72k1N65O91O64K80o51j313q51J15L63q1l68n14
56621A09960j139j963k127j687j351j114n38mk28q26p74j10K35L4j14n7j78m29
56603I7590m41l71n15m22M48J518J793J374J090J008N89j1j21K54N66P98J210
56586A06357J404Q39m3l53r5J04J17O6l90j305j602m60J120J614J272J434K160
56569A12239K322J846J883K786L641M001M454N268N904O266P142Q969J1113J2475
56555A90309J2133R633N568J582j170l046m566m944l435j344p48j647k219j714
$$ y = [94848, 95000, 94526, 93793, 93488, 93682, 94057, 94864, 96579, 98709, 100067, 100294, 100110, 100039, 99958, 99902, 100208, 100744, 101046, 101289, 102150, 103677, 105347, 107186, 109714, 112730, 115326, 117137, 118479, 119252, 119037, 118314, 118202, 118687, 118498, 117074, 115351, 114154, 113147, 111953, 111081, 111060, 111625, 112316, 112980, 113260, 112609, 111296, 110445, 110560, 110923, 110842, 110474, 109960, 108821, 106858, 104731, 103044, 101693, 100579, 100041, 100037, 99809, 98983, 98209, 98099, 98334, 98368, 98254, 98197, 98019, 97590, 97149, 96778, 96263, 95841, 96289, 97807, 99600, 100974, 102064, 103072, 103661, 103650, 103529, 103783, 104349, 105147, 106357, 107761, 108600, 108557, 108204, 108109, 108213, 108330, 108396, 108006, 106701, 105099, 104639, 105759, 107373, 108645, 110079, 112239, 114561, 116407, 118290, 121076, 124717, 128718, 133172, 138440, 144344, 150610, 157752, 166721, 177834, 190309, 202442, 212075, 217643, 219225, 218055, 215009, 210443, 205499, 202064, 200720, 199972, 198325, 196106, 194392]
56541A94392j188j391j795j927k007k009j608j186j521k320k526k093j963k234
56527A68624k038j314j060j476j497o68P0kl99o25j065k033k985l282k914k115
56511A45221j128n63r93k005k497k082j340p68l80l47q98j543j447o06K57Q47
56495A29728J360J575J077K16k55l21m51m60R2P53P36L67N24R66Q09L80Q43K004
56477A39943K406J708J188J456J464L84r85j433p94L16J262J566J194Q37J048
56462A51560J285P72k1p7L26N7p65q06K59J202J134N39R9j57k70p2L08O54J215
56443A57242K076K385J446J16l44k32n97j177r35j74n5m23k10L58J82m36k47M60
56425A59435K92m85k75P94R10j37m95N09J471J683J992K293J197r34j712n36K21
$$ y = [194392, 193204, 191813, 190018, 188091, 186084, 184075, 182467, 181281, 179760, 177440, 174914, 172821, 170858, 168624, 166586, 165272, 164212, 162736, 161239, 160571, 160641, 160639, 160240, 159615, 158550, 156517, 153532, 150250, 147336, 145221, 144093, 143530, 142537, 140532, 138035, 135953, 134613, 133845, 133465, 133118, 132220, 130677, 129230, 128624, 128881, 129728, 131088, 132663, 133740, 133956, 133701, 133380, 132929, 132469, 132561, 133314, 134050, 134417, 134941, 135907, 136716, 137096, 137939, 139943, 142349, 144057, 145245, 146701, 148165, 148549, 147564, 146131, 145337, 145653, 146915, 148481, 149675, 150512, 151560, 152845, 153617, 153596, 153519, 153845, 153902, 153137, 152331, 152590, 153792, 154926, 155465, 155564, 155407, 155137, 155065, 155373, 156027, 157242, 159318, 161703, 163149, 163265, 162921, 162689, 162092, 160915, 159980, 159806, 159751, 159328, 159118, 159476, 159658, 159222, 158975, 159435, 159727, 159242, 158967, 159761, 160671, 160534, 160039, 160548, 162019, 163702, 165694, 167987, 169184, 168250, 166538, 166002, 166223]
56408A66223q10j807j079K05N34O63J608K266J365p1l58K26M27J49k2j74k93M40
56390A69492K012K742J627R8j14N55P86O89J058J638J804J933K442K519J333l68
56374A90246j303j403j224p09K72J038J053Q41R66J043P53O27R41R93M99L55R78
56357A95966J279M29o31o09L86J536K466K794J915K48o66k91K04J50N27J848K832
56340B10383K481J703J467J218O10Q71K658M374M482L955M438N471N592M898M473
56325B59074M361L942L440L316L112K326J498J076M27q05j715j799j977k626k407
56310B71243p43N33j9q64P7K035K875K545K541L055L158K988L404M121M272M099
56294C05320M298M480M083L743M034M018L014K481L939O182O913O208N972O781
$$ y = [166223, 165413, 163606, 162527, 162732, 163266, 163929, 165537, 167803, 169168, 169097, 168739, 168965, 169392, 169541, 169519, 169345, 169052, 169492, 171504, 174246, 175873, 175971, 175857, 176412, 177198, 177887, 178945, 180583, 182387, 184320, 186762, 189281, 190614, 190246, 188943, 187540, 186316, 185607, 185879, 186917, 187970, 188811, 189777, 190820, 191573, 192200, 193141, 194134, 194633, 194988, 195966, 197245, 197674, 197043, 196434, 196820, 198356, 200822, 203616, 205531, 205779, 205113, 204822, 205026, 205176, 205703, 207551, 210383, 212864, 214567, 216034, 217252, 217862, 218733, 221391, 225765, 230247, 234202, 238640, 244111, 249703, 254601, 259074, 263435, 267377, 270817, 274133, 277245, 279571, 281069, 282145, 282572, 281767, 280052, 278253, 276276, 273650, 271243, 270500, 271033, 271014, 270150, 270227, 272262, 275137, 277682, 280223, 283278, 286436, 289424, 292828, 296949, 301221, 305320, 309618, 314098, 318181, 321924, 325958, 329976, 332990, 335471, 339410, 345592, 352505, 358713, 364685, 371466]
56280C71466P635Q134Q632Q802Q201P721Q509J0034J1084J1861J3210J4654J5275
56267E05218J5666J6913J8554J9638K0859K3427K6643K9043L1063L4238L8493
56256G79755M2772M7581N4319O2481P0237P7525Q6141R6758J08186J19526J30977
56245A676258J42502J53568J64003J73367J79843J81670J79223J73875J65397
56236C189706J52382J34569J12668Q6676N6621K4472p009l6838o5158r0727j11565
56225C445797j27652j40494j50292j55932j57602j56956j54700j50198j43495
56216B108476j35701j27386j18539j09930j02606r6167q9337q1963p4756o7653
56206A104438o0336n3786m9220m5960m2339l8171l4400l1067k7671k4739k2822
$$ y = [371466, 379101, 387235, 395867, 404669, 412870, 420591, 429100, 439134, 450218, 462079, 475289, 489943, 505218, 520884, 537797, 556351, 575989, 596848, 620275, 646918, 675961, 707024, 741262, 779755, 822527, 870108, 924427, 986908, 1057145, 1134670, 1220811, 1317569, 1425755, 1545281, 1676258, 1818760, 1972328, 2136331, 2309698, 2489541, 2671211, 2850434, 3024309, 3189706, 3342088, 3476657, 3589325, 3676001, 3732622, 3757094, 3750085, 3713247, 3648089, 3557362, 3445797, 3318145, 3177651, 3027359, 2871427, 2713825, 2556869, 2402169, 2251971, 2108476, 1972775, 1845389, 1726850, 1616920, 1514314, 1418147, 1328810, 1246847, 1172091, 1104438, 1044102, 990316, 941096, 895136, 852797, 814626, 780226, 749159, 721488, 696749, 673927]
56195F73927k0875j7895j5240j4681j5094j3932j1284r462r045q396o903n764
56183E25356n499n343n153n390n380m051k205j562j878j518m63o2j99L98J356
56168D88407J164K85P39K509L420K790K359L239M602N702O700P332P135P041Q381
56153E51805J0446J1494J1824J3143J5284J6540J7073J8977K2862K7362L2100
56142G48910L8223M5791N3382O0544O7999P5387Q1315Q5506Q8267Q8218Q3415
56131A516957P4531O4284N4208M4897L8436L6840L8146L7582L2788K4894J5026
56120A978589L407q177j6876k2194k5987k9391l2969l9102n0095o3911p5572q2797
56108A534925q6703q7516q3974p6870o8815o0281n0092l9677l2327k7979k3360
$$ y = [673927, 653052, 635157, 619917, 605236, 590142, 576210, 564926, 555464, 546419, 538023, 531120, 525356, 519857, 514514, 509361, 503971, 498591, 494540, 492335, 490773, 488895, 487377, 486914, 486852, 486653, 487051, 488407, 489571, 489856, 490595, 493104, 496524, 499314, 501673, 504912, 509514, 515216, 521916, 529248, 536383, 543424, 551805, 562251, 573745, 585569, 598712, 613996, 630536, 647609, 666586, 689448, 716810, 748910, 787133, 832924, 886306, 946850, 1014849, 1090236, 1171551, 1257057, 1345324, 1433542, 1516957, 1591488, 1655772, 1709980, 1754877, 1793313, 1830153, 1868299, 1905881, 1938669, 1963563, 1978589, 1981996, 1973819, 1956943, 1934749, 1908762, 1879371, 1846402, 1807300, 1757205, 1693294, 1617722, 1534925, 1448222, 1360706, 1276732, 1199862, 1131047, 1070766, 1020674, 980997, 948670, 920691, 897331]
56097H97331j7642j3353j1183q792n499l456l188k483o95K95K55J247L277L877
56083H39991K915L165N234O541O294O686Q188Q548P550P831R786J0615R623R410
56069I42377J0663J0937R892J0379J2894J4250J3382J3087J4483J5194J4594J5285
56057A097417J7580J8195J6321J5265J6147J5875J3447J2274J3830J4929J3826
56046A265106J3212J4669J6021J6539J8837K3044K5305K4585K4740K7258K8523
56035A497839K6964K6206K8059K9290K8533K9447L3533L6793L7221L8573M2868
56024A855326M6228M6157M5946M7815M8815M7574M7862N1231N3526N2900N3640
56013B397020N7672O0343N9340N9531O3975O8394O9837P2283P8114Q2811Q3936
$$ y = [897331, 879689, 866336, 855153, 846361, 840862, 837406, 834218, 831735, 831040, 831335, 831590, 832837, 836114, 839991, 842906, 846071, 851305, 857846, 864140, 870826, 879014, 887562, 895112, 902943, 912729, 923344, 932967, 942377, 953040, 963977, 973869, 984248, 997142, 1011392, 1024774, 1037861, 1052344, 1067538, 1082132, 1097417, 1114997, 1133192, 1149513, 1164778, 1180925, 1196800, 1210247, 1222521, 1236351, 1251280, 1265106, 1278318, 1292987, 1309008, 1325547, 1344384, 1367428, 1392733, 1417318, 1442058, 1469316, 1497839, 1524803, 1551009, 1579068, 1608358, 1636891, 1666338, 1699871, 1736664, 1773885, 1812458, 1855326, 1901554, 1947711, 1993657, 2041472, 2090287, 2137861, 2185723, 2236954, 2290480, 2343380, 2397020, 2454692, 2515035, 2574375, 2633906, 2697881, 2766275, 2836112, 2908395, 2986509, 3069320, 3153256]
56002C153256Q6677R4287J01929J06128J11279J20338J28563J33222J39819J51565
55992D327063J62611J69180J77137J90894K05252K16354K29781K49384K69383
55983F197039K86304L06919L35286L64385L90320M21573M63754N08955N51412
55974I825947N99486O60277P27543P97438Q80225R83048J098292J223532J374754
55965A8170542J564554J787499K044386K359833K758654L250797L862196M654629
55957D0453090N690471P002858Q618568J0568776J2847823J5412133J8267006
55950A18860725K1508846K5228673K9399154L3809526L7841393M0062363L8256409
55943C44967089L0514758J6857772j36950j6524567k9045354l6358587l8848814
$$ y = [3153256, 3239933, 3334220, 3436149, 3542277, 3653556, 3773894, 3902457, 4035679, 4175498, 4327063, 4489674, 4658854, 4835991, 5026885, 5232137, 5448491, 5678272, 5927656, 6197039, 6483343, 6790262, 7125548, 7489933, 7880253, 8301826, 8765580, 9274535, 9825947, 10425433, 11085710, 11813253, 12610691, 13490916, 14473964, 15572256, 16795788, 18170542, 19735096, 21522595, 23566981, 25926814, 28685468, 31936265, 35798461, 40453090, 46143561, 53146419, 61764987, 72333763, 85181586, 100593719, 118860725, 140369571, 165598244, 194997398, 228806924, 266648317, 306710680, 344967089, 375481847, 392339619, 392202669, 375678102, 346632748, 310274161, 271425347]
55936B71425347l7744168l4423007l0083659k5581859k1390521j7710292j4612324
55929H9879517j2087961j0055045q409037p076850o005912n134160m406036l797866
55921C2906650l298548k881822k520489k209512j951147j731951j535101j360896
55913A5417184j215079j089485r72435q66485p78731p04107o34086n71611n22422
55904H062743m81036m39496m01008l71526l46367l18142k89962k68352k50577
55895D896277k30773k11498j97738j86246j71731j57338j48409j41883j31991
55886C318670j20811j13333j07519r8802q9458q4523q3078q1816q2372q6842r0872
55875B279244q9300q4239q0154p5859o8831o2303o0128n9227n4894m9220m6621
$$ y = [271425347, 233681179, 199258172, 169174513, 143592654, 122202133, 104491841, 89879517, 77791556, 67736511, 59327474, 52250624, 46244712, 41110552, 36704516, 32906650, 29608102, 26726280, 24205791, 21996279, 20045132, 18313181, 16778080, 15417184, 14202105, 13112620, 12140185, 11273700, 10494969, 9790862, 9156776, 8585165, 8062743, 7581707, 7142211, 6741203, 6369677, 6023310, 5705168, 5415206, 5146854, 4896277, 4665504, 4454006, 4256268, 4070022, 3898291, 3740953, 3592544, 3450661, 3318670, 3197859, 3084526, 2977007, 2878205, 2788747, 2704224, 2621146, 2539330, 2456958, 2370116, 2279244, 2189944, 2105705, 2025551, 1949692, 1880861, 1818558, 1758430, 1699203, 1644309, 1595089, 1548468]
55864A548468m5429m1623l6799l4692l3602k9896k5578k4859k6424k6316k5293
55853A197957k6187k7102k4460k0144j8559j9058j8036j6107j6434j8206j8361
55842I75303j7779j9313k1576k1040j8595j7941j8985j8659j6827j5700j4890
55831G73998j2556j0006r786j0684r778p868p715q608p956o729p837j0552j1767
55818F52156j1581j2423j3829j3282j1210j0143r853q221n840m967m953l561j691
55805E40602j873l046j938J152L049L442M880P369Q079O417M692L636J666j284
55791E76843l440m754o754q853q893p268o468o602n463l161k567m738p685r979
55777D90218j2034j3475j2879j0604q636p349n380k732p84O09K643M312L136p07
$$ y = [1548468, 1503039, 1461416, 1424617, 1389925, 1356323, 1326427, 1300849, 1275990, 1249566, 1223250, 1197957, 1171770, 1144668, 1120208, 1100064, 1081505, 1062447, 1044411, 1028304, 1011870, 993664, 975303, 957524, 938211, 916635, 895595, 877000, 859059, 840074, 821415, 804588, 788888, 773998, 761442, 751436, 741650, 730966, 721188, 713320, 705605, 696997, 689041, 682312, 674475, 663923, 652156, 640575, 628152, 614323, 601041, 589831, 579688, 569835, 561614, 555774, 550807, 545854, 542293, 540602, 538729, 535683, 533745, 534897, 537946, 541388, 546268, 553637, 561716, 568133, 572825, 576461, 578127, 576843, 573403, 568649, 561895, 553042, 544149, 536881, 530413, 523811, 518348, 515187, 512620, 507882, 500197, 490218, 478184, 464709, 451830, 441226, 432590, 425241, 419861, 417129, 416345, 416954, 419597, 423909, 427045, 426338]
55763D26338m325o349p928r363r276p612o209n806n368m820n499p453r043r621
55749C27666r973r938q353n603l579k796k110j304j329j962j963j559k064l103
55735B72030l000j913j582j997j374L33J055J45p95j090k020l905n093m724l964
55720B42106l704l358k619k130j804p60O62J077O02Q58K126K967L010L454M333
55705B46820L989K045L12j42m73j702l099l880m453n092n229m882m939n449n350
55690B08476m455l794l634k986j519r7R34K101L189L293K730K864L755M099L626
55675B18582L316L096J795k48j215r52j410l199m367l615k201j487r66k7N62L18
55659B07982K30R34J490J236J130J942K804K752K235J905J398L85m97q18j186
$$ y = [426338, 422013, 415664, 407736, 398373, 389097, 381485, 375276, 369470, 364102, 359282, 353783, 346330, 337287, 327666, 317693, 307755, 299402, 293799, 290220, 287424, 285314, 284010, 282681, 280719, 278756, 277197, 275133, 272030, 269030, 267117, 265535, 263538, 262164, 262497, 263552, 263697, 262902, 261812, 259792, 255887, 250794, 246070, 242106, 238402, 235044, 232425, 230295, 228491, 227731, 228393, 229470, 230072, 230930, 233056, 236023, 239033, 242487, 246820, 250809, 252854, 253166, 253024, 252551, 250849, 247750, 243870, 239417, 234325, 229096, 224214, 219275, 213826, 208476, 204021, 200227, 196593, 193607, 192088, 191991, 192925, 195026, 198215, 201508, 204238, 207102, 210857, 214956, 218582, 221898, 224994, 226789, 226541, 225326, 224374, 222964, 219765, 215398, 211783, 209582, 208095, 207129, 207102, 207664, 207982, 208212, 209146, 210636, 211872, 213002, 214944, 217748, 220500, 222735, 224640, 226038, 226423, 225926, 225108, 223922]
55644B23922j974k588k698k917l467l641l297l372m195m748m379l747l424l046
55630A76429k491k391k716k477j553j160j755k179j669j043j053j163r76j141
55616A52662j864k131j542j299k231l233k972j842j068r90j240j570j584q22K24
55601A28498K96p21j461j235r63j247j215l02M71K00m28n24m56p15p33j20K53
55584A19598k35o31O9J193J576J428J702K388K819K887K859K643K290K413L256
55569A46255M041M116L852L624K967J590K06o34j463k643l309k716j701j580k327
55554A50278k982l147l072k918k807k998l253k768j430l04j40l58k33l3j32r2
55538A23611M19Q00O30N62J089J428Q04p0l7P35J204R80L78m71j471k210k528
$$ y = [223922, 221948, 219360, 216662, 213745, 210278, 206637, 203340, 199968, 195773, 191025, 186646, 182899, 179475, 176429, 173938, 171547, 168831, 166354, 164801, 163641, 161886, 159707, 158038, 156995, 155942, 154779, 153803, 152662, 150798, 148667, 147125, 145826, 143595, 140362, 137390, 135548, 134480, 133490, 132250, 130680, 129096, 128274, 128498, 128794, 128073, 126612, 125377, 124414, 123167, 121952, 121650, 122121, 122321, 121893, 121369, 120913, 120198, 119465, 119345, 119598, 119363, 118732, 118801, 119994, 121570, 122998, 124700, 127088, 129907, 132794, 135653, 138296, 140586, 142999, 146255, 150296, 154412, 158264, 161888, 164855, 166445, 166651, 166017, 164554, 161911, 158602, 155886, 154185, 152605, 150278, 147296, 144149, 141077, 138159, 135352, 132354, 129101, 126333, 124903, 124599, 124459, 124101, 123868, 123835, 123703, 123611, 124030, 124830, 125460, 126022, 127111, 128539, 129343, 129273, 129236, 129971, 131175, 132155, 132533, 132062, 130591, 128381, 125853]
55521A25853k822l063k483j086l77j334k733k806j790j318j871k394k167j625
55507I7984j313j186j060r39p44l44J30L45J45l53p68n83K41R11P12J83L71J094
55489I4826J203N73K56M90L25l67m08M48P31k55j105o99n0k92o43j37L40l17j177
55470I3742q47q8n17j711j882r36m56r62j330q95k31K33O94R75N99q9k19J66L15
55451H6561K14M85J043J172Q67P39P14J79p00j095r12p45n87jO22L95m09n39K52
55432H8255Q15M93K6J56N81P27N84L16j08m79m01j6N0k85l58J77P96Q43K85m58
55412I1999q78o08K18Q50O76o0p65j347j951k181j478p6J196J910K159K003J501
55395I3168J019P42K49o82j287p71L86J095J158J040N85o70k128k479j493k30
$$ y = [125853, 123031, 119968, 117485, 116399, 116022, 114688, 111955, 109149, 107359, 106041, 104170, 101776, 99609, 97984, 96671, 95485, 94425, 93486, 92742, 92398, 92528, 92873, 93018, 92665, 91897, 91314, 91555, 92466, 93178, 93361, 93732, 94826, 96029, 96602, 96858, 97348, 97673, 97306, 96898, 97346, 98077, 97822, 96717, 96018, 95968, 95676, 95033, 94896, 95236, 94919, 93742, 92895, 92807, 92290, 90579, 88697, 87761, 87305, 86343, 85013, 84118, 83887, 84120, 84814, 85789, 86388, 86299, 86080, 86246, 86561, 86775, 87260, 88303, 89475, 90342, 91081, 91795, 91974, 91274, 90179, 89267, 88522, 87935, 87934, 88556, 88951, 88542, 88003, 88255, 89070, 89563, 89589, 89745, 90326, 91053, 91637, 91953, 91845, 91366, 90965, 90949, 90999, 90714, 90356, 90533, 91329, 92172, 92457, 91999, 91121, 90513, 90731, 91581, 92257, 92197, 91432, 90085, 88134, 85953, 84475, 84399, 85595, 87505, 89664, 91667, 93168, 94187, 94929, 95178, 94496, 93209, 92438, 92824, 93919, 95077, 96117, 96702, 96032, 93904, 91425, 89932, 89702]
55379H9702N18Q92R98N97m3j66L20N92J69n28j027j311j345j058q63j285j883
55362H4279j619n20J44k59p81m41K72K37n48j009n21L32N76M8m05J6R82J354O90
55343H2827o0J55J089J707J664J414J184P05l6o16q07p58o36n78q20j332j487
55326H3615p73M68J485K023K132J597M02p52j214j293j496j448o15M36P79P31
55310H6077J263K120K069R07k87r67j585k113j723m43M43K41j45J67O53M48k14
55293H6911m69p2N84J034R11J12p55q11r4L60k1n94o28k73j3J20K26J08l35p56
55273H5545q88q36o21JR38J563J481R39L33j08m7P23J592J485K59j079j727j811
55255H7742j554p62L40Q42L59l04l14Q7K91L11L83K87j48m42j40L30K17m68j074
$$ y = [89702, 90220, 91112, 92110, 92707, 92664, 92498, 92818, 93410, 93579, 93051, 92024, 90713, 89368, 88310, 87447, 86162, 84279, 82660, 82140, 82284, 82025, 81244, 80803, 81075, 81312, 80764, 79755, 79234, 79566, 80142, 80190, 79785, 79801, 80783, 82137, 82827, 82767, 82922, 84011, 85718, 87382, 88796, 89980, 90685, 90649, 90033, 89226, 88468, 87832, 87254, 86434, 85102, 83615, 82842, 83310, 84795, 86818, 88950, 90547, 90949, 90197, 88983, 87690, 86194, 84746, 84131, 84567, 85346, 86077, 87340, 89460, 91529, 92436, 92149, 91182, 89597, 87484, 85761, 85318, 85761, 86002, 85857, 86024, 86677, 87125, 86911, 86442, 86370, 86954, 87988, 88899, 89011, 88256, 87445, 87351, 87711, 87690, 87096, 86468, 86195, 86182, 86302, 86528, 86636, 86301, 85545, 84657, 83821, 83200, 83201, 84139, 85702, 87183, 88122, 88455, 88347, 88300, 89023, 90615, 92100, 92359, 91280, 89553, 87742, 86188, 85426, 85766, 86608, 86967, 86663, 86349, 86436, 86727, 87038, 87421, 87708, 87560, 87118, 86978, 87308, 87525, 87057, 85983]
55236H5983j191q61k34M45P84O64M61N03N62K62l38q07p77j66O62R45K44p87r62
55217H5392o5Q98J149R61P79M91M4o7L52O19J73m88o02k75n8K6J87J14n03j072
55197H8055o59O02J581J546Q01Kn08o29n03n92j185j776j533m87L84M47K31N74
55179H6351J404J841J380M73r2l9L25O17O44L10l08p41m30N17J269J266Q78O80
55161I6345M85j93j052j217n41J11N8l84n73m38k98k32pN12J137J501J370Q74
55143I7458L50j24p01j191j090n16m52j297j911j098M39R58J83m68j81K80J73
55126I0812%M00J075J511J818K083J766N81p12j203j002p69n86j5R96J882K011
55109A00648J170k14j199j143m90k21m84n06K6M67L99K91M82N03nm91l77M1K54
$$ y = [85983, 84792, 83931, 83697, 84142, 84926, 85590, 86051, 86554, 87116, 87378, 87040, 86233, 85456, 85290, 85952, 86897, 87141, 86354, 85392, 85327, 86225, 87374, 88335, 89114, 89605, 89649, 89582, 89934, 90553, 90726, 90238, 89636, 89361, 89303, 89329, 89516, 89630, 89127, 88055, 87396, 87998, 89579, 91125, 91926, 91928, 91420, 90791, 90288, 89696, 88511, 86735, 85202, 84715, 85099, 85546, 85777, 86351, 87755, 89596, 90976, 91449, 91357, 91318, 91643, 92260, 92904, 93214, 92906, 92165, 91735, 92252, 93521, 94787, 95665, 96345, 96830, 96637, 95585, 94368, 93827, 93938, 93996, 93612, 93039, 92601, 92303, 92071, 92064, 92576, 93713, 95214, 96584, 97458, 97808, 97684, 96983, 95792, 94702, 94186, 93734, 92437, 90526, 89428, 89867, 90825, 91008, 90540, 90359, 90639, 90812, 90812, 91212, 92287, 93798, 95616, 97699, 99465, 100046, 99334, 98131, 97129, 96360, 95774, 95759, 96755, 98637, 100648, 101818, 101604, 100405, 99262, 98772, 98551, 98067, 97561, 97587, 98054, 98453, 98744, 99226, 99729, 99724, 99233, 98856, 98897, 99151]
55090I9151L99P46J010R22Q42J081J192P32J25J1K15J61j57l42l02j19K56N99
55072A06522K79o82j098j18J318J558M10p89j001m01L70R01R12L81j77j68K88
55055A08505N48L66Q6n9k02m75p80r81j049j036j058j095p99L1P57M34p23j330
55037A01140o88K52M04J7j61k42o16q45l83K05N1m99m67L8J16j81Q9R81J411R40
55017A01562M15M44M67q2p18p00j58K06M6m56r83j283j278j112q77l56N62J389
54999I7088J498J036O90P29Q61R82J244J407R52k0p29p66n04l24j62j8j89o52
54981A03123q16k48P90J723K157J850P89m55r76n12K17M03L3k98j07O43J535J882
54963A11733J259O3p81p99m08k53n05r04j165j163r12n59k06J90O06Q13O88M95
$$ y = [99151, 99550, 100296, 101306, 102228, 103070, 104151, 105343, 106075, 106200, 106211, 106426, 106587, 106430, 106088, 105786, 105667, 105923, 106522, 106801, 106119, 105021, 104903, 106221, 107779, 108189, 107400, 106399, 105998, 106368, 107269, 108181, 108562, 108385, 108217, 108505, 109053, 109419, 109505, 109446, 109244, 108769, 107989, 107008, 105959, 104923, 103865, 102770, 101971, 102002, 102759, 103193, 102470, 101140, 100452, 100704, 101108, 101125, 100964, 100722, 100106, 99261, 98878, 99083, 99134, 98635, 98168, 98206, 98322, 98141, 98230, 99211, 100622, 101562, 101977, 102421, 102888, 102806, 102088, 101388, 101230, 101436, 101482, 101026, 100043, 98760, 97482, 96370, 95493, 95137, 95699, 97088, 98586, 99622, 100312, 101041, 101902, 102884, 104128, 105535, 106487, 106467, 105738, 104972, 104468, 104144, 103982, 103964, 103775, 103123, 102307, 102059, 102849, 104572, 106729, 108579, 109368, 108913, 107937, 107425, 107642, 108045, 108078, 107780, 107673, 108316, 109851, 111733, 112992, 113055, 112274, 111475, 111067, 110814, 110309, 109405, 108240, 107077, 106165, 105606, 105400, 105590, 106196, 107009, 107697, 108192]
54945A08192N02M94R6n15p26k59N26J059R54J46q95j337q45q7O1l73o92n81k35
54926A05485L42J328K485L302L762M216M556M412M150M696O015O712N695L540
54912A60696J657P06K55l40j311k482l514m226m767n259n372m649l286k075j522
54897A24511j419j367j222r54n97m59q45j439j535r45k03L00P10J163J514J794
54881A19007K247K642K320J339Q43J692L273M315M449M312M414M573M397L697
54867A63520K398M78j831l951n222n353m667l882l447l150k583j836j335j177
54853A27962j117j198j707k442k643k047j359j360j902k237j985j387q03l62r
54838A05404L14M94K85l91j146j451j234q22m16K4M17N94P09J037J374J203N54
$$ y = [108192, 108694, 109188, 109284, 108769, 108043, 107784, 108310, 109369, 110323, 110469, 109574, 108237, 107392, 107305, 107366, 106993, 106301, 105720, 105485, 105827, 107155, 109640, 112942, 116704, 120920, 125476, 129888, 134038, 138734, 144749, 151461, 157156, 160696, 162353, 163059, 163314, 162974, 161663, 159181, 155667, 151441, 146674, 141415, 136043, 131394, 128108, 126033, 124511, 123092, 121725, 120503, 119549, 118952, 118493, 117648, 116209, 114674, 113729, 113526, 113826, 114536, 115699, 117213, 119007, 121254, 123896, 126216, 127555, 128398, 130090, 133363, 137678, 142127, 146439, 150853, 155426, 159823, 163520, 165918, 166396, 164565, 160614, 155392, 150039, 145372, 141490, 138043, 134893, 132310, 130474, 129139, 127962, 126845, 125647, 123940, 121498, 118855, 116808, 115449, 114089, 112187, 109950, 107965, 106578, 105775, 105413, 105404, 105718, 106212, 106497, 106106, 104960, 103509, 102275, 101453, 101037, 101061, 101478, 102072, 102781, 103818, 105192, 106395, 106949]
54821A06949P6P4J32l9j24J02K70R4r7J4K4n63j415j693j159l72J34L89P27J271
54801A04794J773J806J223M49P2J05Jm79q92q16m91l82m77m16q8L33P02R45R41
54782A09103P10N14N97Q85J192J472J683J637J255Q23O75Q11J019J233J553K073
54766A27235K830L828M937N828O140N670M507L114K122J712J302K48j277k498
54752A65698l066l319l546l674l747m047m421m279l483k679k316j961j158k99
54738A23703l6j96n2M77O41q0j225j851j468m15O12J219J503J669J700J627J789
54721A29617K428L165L450L393L525L803L629K892K185J778J153q9j593k843l728
54706A52765m179l998l504l526m157m259k929q52N61Q09L42n02j618k480k378
$$ y = [106949, 107025, 107099, 107231, 107192, 107068, 107170, 107440, 107534, 107437, 107451, 107475, 106912, 105497, 103804, 102645, 102273, 102407, 102796, 103523, 104794, 106567, 108373, 109596, 110045, 110117, 110222, 110223, 109744, 108852, 108036, 107545, 107163, 106686, 106270, 106182, 106515, 107217, 108162, 109103, 109813, 110327, 110924, 111809, 113001, 114473, 116156, 117793, 119048, 119871, 120546, 121357, 122376, 123609, 125162, 127235, 130065, 133893, 138830, 144658, 150798, 156468, 160975, 164089, 166211, 167923, 169225, 169473, 168196, 165698, 162632, 159313, 155767, 152093, 148346, 144299, 139878, 135599, 132116, 129437, 127121, 125160, 124002, 123703, 123667, 123471, 123419, 123896, 124537, 124457, 123232, 121381, 119913, 119498, 120110, 121329, 122832, 124501, 126201, 127828, 129617, 132045, 135210, 138660, 142053, 145578, 149381, 153010, 155902, 158087, 159865, 161018, 160929, 159336, 156493, 152765, 148586, 144588, 141084, 137558, 133401, 129142, 126213, 125361, 125922, 126731, 127073, 126571, 124953, 122473, 120095]
54691A20095j319j09N38N16R3l91o93q68j105j185o38L07O22r7q41n68K18L09
54673A14884k83m33J95O05N4q45j056m47K57M32R2l50n64o09p50r46q42l54J00
54654A09140K64M35Q31J051P34K75J90K17j37n49l16M03P66O27O78J172J444R77
54636A18202J15n92j042j306j296j095j031j149j092p27m18l91l12J90R84J627
54620A10667J782J320M09l94n75l01k31n41o49r4P98J437J647J560J204O08Mm26
54602A18225p88j199j390r78j0R08J151O86J50K08P36Q81J78o86o60K25Q59M54
54584A18950n19j098r48m66j02j0j67m88q09q75m62M20J331J618J050K01j05L02
54566A17823P85O44j89j146j478q84J27O34K90l05m76l22l03l18M2O11P64M20
$$ y = [120095, 118776, 118667, 119205, 119721, 119814, 119423, 118730, 117862, 116757, 115572, 114934, 115241, 115863, 115766, 114925, 114357, 114575, 114884, 114601, 114168, 114363, 114968, 115022, 114177, 113121, 112674, 112931, 113363, 113455, 113105, 112541, 111932, 111182, 110236, 109394, 109040, 109140, 109404, 109839, 110670, 111721, 112455, 112730, 112920, 113137, 113000, 112451, 112135, 112538, 113304, 113931, 114609, 115781, 117225, 118202, 118317, 117725, 116683, 115377, 114081, 112986, 111955, 110806, 109714, 108987, 108569, 108178, 107866, 108056, 109040, 110667, 112449, 113769, 114178, 113784, 113209, 112908, 112677, 112136, 111487, 111393, 112191, 113628, 115275, 116835, 118039, 118647, 118651, 118225, 117437, 116238, 114848, 113870, 113860, 114768, 115919, 116605, 116755, 116963, 117699, 118580, 118758, 118072, 117412, 117637, 118496, 118950, 118431, 117333, 116385, 115919, 115817, 115807, 115640, 115152, 114343, 113468, 113006, 113426, 114757, 116375, 117425, 117626, 117521, 117823, 118608, 119252, 119063, 117917, 116439, 115555, 115682, 116316, 116606, 116301, 115825, 115503, 115200, 114882, 114924, 115535, 116299, 116719]
54548A16719J70L17N24N78P99J350J760J536Q94M57N33Q56Q82K24r03j692j494
54531A23510n66K67O62Q68R37N49k32p89q07p04q41r44o90l51l34n70p62q52p46
54512A17605j31R48J672J290J41p46q74n89k84L2L49M03O2m03o51o38n08k77J92
54493A17593Q69J354J163L28m06k58O81J500J502R03L52Q4j26l87n05l89k85l91
54475A23582m13J61J298K187K049J052Q4l33m16l68L9P35R19P7r94j088k84K13
54457A28500j25n79n43m26p19j011o03L82J180J349J067O98M37K38j16o55r50
54440A28124n45K33M83q1p49q26m23N2N33R55R55M56L2P3J29l22r14r16l45J60
54420A27064L28L73M15M59P71J529K186J915P28n01j093j050n75K19R72J133O33
$$ y = [116719, 116889, 117206, 117730, 118308, 119107, 120457, 122217, 123753, 124647, 125104, 125637, 126493, 127375, 127599, 126696, 125004, 123510, 122944, 123211, 123873, 124741, 125678, 126227, 125995, 125206, 124399, 123695, 122854, 121910, 121220, 120869, 120535, 119965, 119203, 118351, 117605, 117474, 118422, 120094, 121384, 121525, 120779, 119905, 119316, 119032, 119064, 119413, 119816, 119878, 119475, 118824, 118186, 117678, 117401, 117593, 118462, 119816, 120979, 121307, 120901, 120643, 121324, 122824, 124326, 125229, 125581, 125665, 125539, 125152, 124647, 124258, 123973, 123582, 123169, 123330, 124628, 126815, 128864, 129916, 130000, 129667, 129251, 128883, 128922, 129657, 130576, 130653, 129659, 128571, 128287, 128500, 128375, 127796, 127253, 126827, 126108, 125097, 124494, 124876, 126056, 127405, 128472, 129170, 129607, 129845, 129729, 129074, 128124, 127579, 127812, 128295, 128214, 127465, 126639, 126216, 126268, 126801, 127756, 128711, 129167, 129199, 129272, 129401, 129079, 128165, 127249, 126904, 127064, 127392, 127765, 128180, 128639, 129410, 130939, 133125, 135040, 135768, 135267, 134174, 133124, 132549, 132768, 133740, 134873, 135506]
54403A35506J5k98m79p79r71o02M11J641K509K704K368J879J407Q58K89P5L13
54386A46846M23j72j119j506j034k80J92L36K49j03n25n66j83Q8o2j88K30R18
54368A43544J142P76M69P73J501K122K457K763L128L191K658J934J854K625L432
54353A74369L419K709K036J544O67p94k207l014l460m020m507m413l819l329l160
54338A52021k909k355j808j456q88J81J132J072J21o42o52n20r35j466j214k49
54322A39433L82P2o34r05n87k7M75P08M77j00n28n20l57l16j48M03R07P15o7o16
54302A38767m56N6L37J99k40q20j345j588j453r67k02N90Q88M09l68n88k4P30
54284A33925J139J261J300J154P78N59Q20J215J061K33o77j030p38j79K08K18
$$ y = [135506, 135521, 135223, 134744, 133965, 132994, 132392, 132803, 134444, 136953, 139657, 142025, 143904, 145311, 146169, 146458, 146533, 146846, 147269, 147097, 145978, 144472, 143438, 143158, 143350, 143686, 143935, 143832, 143307, 142741, 142558, 142646, 142584, 142396, 142626, 143544, 144686, 145462, 145931, 146704, 148205, 150327, 152784, 155547, 158675, 161866, 164524, 166458, 168312, 170937, 174369, 177788, 180497, 182533, 184077, 184744, 183950, 181743, 178729, 175269, 171249, 166742, 162329, 158510, 155181, 152021, 149112, 146757, 144949, 143493, 142605, 142786, 143918, 144990, 145111, 144469, 143817, 143297, 142362, 140896, 139682, 139433, 139815, 139887, 139253, 138348, 137761, 137734, 138209, 138917, 139394, 139294, 138766, 138246, 137889, 137573, 137425, 137828, 138735, 139450, 139383, 138767, 138311, 138367, 138704, 138903, 138663, 137843, 136498, 134910, 133457, 132490, 132288, 132878, 133766, 134175, 133807, 133219, 133195, 133925, 135064, 136325, 137625, 138779, 139557, 140116, 140936, 142151, 143212, 143445, 142768, 141738, 141000, 140821, 141029, 141247]
54268A41247k6j29J59O18P42L91L2K18R10J551J777J731J628J315O01k14n37k28
54250A51786K91O44Q14P36J66p39j193p49o8j49r54j507j297q45p24p90o91n42
54232A44189n41m15J96R59J157O68J61J74M85N77M09L46N34O92N50K43J55M87
54214A51026J078J529J402M40j183k792l561l098j715j99O50M73l68r95q16j45
54198A41726K49J55Q3L58N93L96O7J01L31J63m47q89p71l90k27l33m39l62j61
54179A40203k4LJ68P61J549J820J268M90J45Rm79j017p50K70R13N55j09k36L0
54160A45569J64K82P11J083O86m53j627k338k519k052q49N62J263R59K00m22p88
54143A40431q38l23O43J311J027O6o46n46J24P25Q75O70M57L95L03K9j82R0P81
$$ y = [141247, 141221, 141092, 141251, 141869, 142611, 143002, 143034, 143252, 144162, 145713, 147490, 149221, 150849, 152164, 152765, 152551, 152014, 151786, 152077, 152721, 153535, 154271, 154437, 153698, 152505, 151756, 151688, 151539, 150585, 149078, 147781, 146936, 146212, 145422, 144731, 144189, 143648, 143233, 143429, 144388, 145545, 146213, 146374, 146548, 147033, 147610, 148019, 148365, 148899, 149591, 150141, 150384, 150539, 151026, 152104, 153633, 155035, 155475, 154292, 151500, 147939, 144841, 143126, 142927, 143577, 144050, 143682, 142687, 141871, 141726, 141975, 142130, 142213, 142571, 143164, 143560, 143627, 143728, 144059, 144222, 143775, 142886, 142115, 141725, 141498, 141165, 140726, 140364, 140203, 140179, 140182, 140350, 141111, 142660, 144480, 145748, 146238, 146383, 146392, 145913, 144896, 144146, 144416, 145329, 145884, 145775, 145539, 145569, 145733, 146015, 146726, 147809, 148495, 148042, 146415, 144077, 141558, 139506, 138657, 139219, 140482, 141441, 141641, 141219, 140431, 139593, 139270, 139913, 141224, 142251, 142317, 141671, 141125, 141249, 141974, 142849, 143519, 143976, 144371, 144674, 144703, 144521, 144611, 145392]
54124A45392J301J276J056J183J589J669J049L4q08j192j202r98o03M0Q99J753
54108A52438K249K131J495P78M46N40O67M40p0m41m49l03k76l67l88k93j52K4
54090A58469K69N89J121K086L332M117L864L069K898L852N333O588P376P438O098
54075B16499L071p18l824n568o125n730m564l275k667k733k684k127j537j323
54061A76695j159o18P7M30L85J77q2l33l62r6K11M29P89J363J806J994K394L215
54043A87315L811L679L473M096N135N437N008N096O161P195P355P203P557Q134
54029B66655Q144P520O709N815M763L846L240K374O26j556l032l413l323l329
54015B95039l382l410l692m353n040n409n555n737n948n979n646m824l565k301
$$ y = [145392, 146693, 147969, 149025, 150208, 151797, 153466, 154515, 154549, 153741, 152549, 151347, 150349, 149746, 149786, 150685, 152438, 154687, 156818, 158313, 159091, 159537, 160077, 160744, 161184, 161114, 160673, 160224, 159921, 159645, 159278, 158890, 158597, 158445, 158469, 158738, 159327, 160448, 162534, 165866, 169983, 173847, 176916, 179814, 183666, 188999, 195587, 202963, 210401, 216499, 219570, 218852, 215028, 209460, 203335, 197605, 193041, 189766, 187099, 184366, 181682, 179555, 178018, 176695, 175536, 174918, 174995, 175425, 175810, 175987, 175905, 175572, 175210, 175114, 175325, 175754, 176543, 177906, 179712, 181706, 184100, 187315, 191126, 194805, 198278, 202374, 207509, 212946, 217954, 223050, 229211, 236406, 243761, 250964, 258521, 266655, 274799, 282319, 289028, 294843, 299606, 303452, 306692, 309066, 309692, 308136, 305104, 301691, 298368, 295039, 291657, 288247, 284555, 280202, 275162, 269753, 264198, 258461, 252513, 246534, 240888, 236064, 232499, 230198]
54001B30198j737k274l547m599m533l224j524o26r45j713j941j559j291j553k008
53986A97124k174j998j665j252p51l10j71m49j041j620j813j494q89k81L16R63
53970A82495J457J431Q05n9o69p19j89O16J235J397J212R63Q09Q23J024J287J435
53953A95353J585J948K247J922J236J410K982M774N425N355O068P835R467J0347
53939B57954J1250J2822J4548J5690J6124J5476J2642P182N41n121q777j0554
53927C39777j0532q670n651k674m01J277K445K892K681K383K525L204M233N328
53913C38817O172O633O845O820O249M989L513K439J764J044J13q07j538k000k047
53898C79006j756j716k396l435m160m645n515o725p450p344p096p353p812p854
$$ y = [230198, 228461, 226187, 222640, 218041, 213508, 210284, 208760, 208134, 207189, 205476, 203535, 201976, 200685, 199132, 197124, 194950, 192952, 191287, 190035, 189284, 188974, 188803, 188354, 187313, 185693, 183880, 182386, 181497, 181216, 181532, 182495, 183952, 185383, 186188, 186129, 185460, 184741, 184552, 185168, 186403, 187800, 189012, 189975, 190784, 191607, 192631, 193918, 195353, 196938, 198886, 201133, 203055, 204291, 205701, 208683, 213457, 218882, 224237, 230305, 238140, 247607, 257954, 269204, 282026, 296574, 312264, 328388, 343864, 356506, 363688, 364229, 359108, 350331, 339777, 329245, 320575, 314924, 312250, 311849, 313126, 315571, 318463, 321144, 323527, 326052, 329256, 333489, 338817, 344989, 351622, 358467, 365287, 371536, 376525, 380038, 382477, 384241, 385285, 385398, 384591, 383053, 381053, 379006, 377250, 375534, 373138, 369703, 365543, 360898, 355383, 348658, 341208, 333864, 326768, 319415, 311603, 303749]
53884C03749p474p106o879o640o398o270o110n630m775l713k564j408n27k85q48
53869B37122k060l414m160l776k649j918k248k976k910j832o67k63n44r91j388
53854B05326j737j910j823j750j929k031j495m43K45lp31j147j095r49q24m93
53838A87211J4L69N11O80P75L15o20j099m98N17Q65N01L11P44J334J592J578J481
53820A96581J218P54L68L47P18J369K051K340K027J632J863K510K584J822J233
53805B19417J758L094M443N672O911P651P205N867M619L871L290K774K597K611
53791B81780K249J518J090J140J020M22l6R1K30k49r98j376j588k251l247l965
53775B75830m394n056n913o226n617m509l456k746k658l362m282m378l352k020
$$ y = [303749, 296275, 289169, 282290, 275650, 269252, 262982, 256872, 251242, 246467, 242754, 240190, 238782, 238255, 237970, 237122, 235062, 231648, 227488, 223712, 221063, 219145, 216897, 213921, 211011, 209179, 208512, 208249, 207705, 206714, 205326, 203589, 201679, 199856, 198106, 196177, 194146, 192651, 192208, 192453, 192450, 191719, 190572, 189477, 188528, 187704, 187211, 187225, 187594, 188105, 188785, 189560, 189875, 189255, 188156, 187658, 188175, 189040, 189541, 189852, 190596, 191930, 193522, 195100, 196581, 197799, 198553, 198921, 199268, 199986, 201355, 203406, 205746, 207773, 209405, 211268, 213778, 216362, 218184, 219417, 221175, 224269, 228712, 234384, 241295, 248946, 256151, 262018, 266637, 270508, 273798, 276572, 279169, 281780, 284029, 285547, 286637, 287777, 288797, 289219, 289183, 289274, 289504, 289255, 288257, 286881, 285293, 283042, 279795, 275830, 271436, 266380, 260467, 254241, 248624, 244115, 240659, 237913, 235255, 231893, 227611, 223233, 219881, 217861]
53761B17861j208q77o91p67j331k106k585k646k449k061j552j196j129j046o41
53746A95576j20J38J03k3j81l05r0N15R15M85n32j320j485j233p11J26J017J430
53728A94305J271R85R05R22R57J151J438J469J157R17J024J227J224J173J365
53713B11490J731J998K110K175K181K014J686J360J195J269J574J936K114K001
53699B36834J709J460J513K066K953L568L427K750K163J933J842J705J498J029
53685B66450J10q97j305j030p23q14j026j080j151j306j165n90j44l59r33j207
53669B52830r82m81J02N61O83P45J372K332K227K71k229l225k365j003o2P34J512
53652B53022J558N59n79q42l88L3K14M12N48K56l96q15n44L42J411K200K440K204
$$ y = [217861, 216653, 215776, 215085, 214318, 212987, 210881, 208296, 205650, 203201, 201140, 199588, 198392, 197263, 196217, 195576, 195456, 195594, 195697, 195674, 195493, 195188, 195098, 195613, 196528, 197013, 196481, 195161, 193676, 192443, 191732, 191858, 192875, 194305, 195576, 196561, 197466, 198388, 199345, 200496, 201934, 203403, 204560, 205477, 206501, 207728, 208952, 210125, 211490, 213221, 215219, 217329, 219504, 221685, 223699, 225385, 226745, 227940, 229209, 230783, 232719, 234833, 236834, 238543, 240003, 241516, 243582, 246535, 250103, 253530, 256280, 258443, 260376, 262218, 263923, 265421, 266450, 266560, 265663, 264358, 263328, 262605, 261791, 260765, 259685, 258534, 257228, 256063, 255473, 255329, 254970, 254037, 252830, 251848, 251367, 251469, 252030, 252713, 253458, 254830, 257162, 259389, 259660, 257431, 254206, 251841, 250838, 250776, 251510, 253022, 254580, 255139, 254560, 253718, 253330, 253363, 253577, 253989, 254537, 254793, 254397, 253582, 253038, 253380, 254791, 256991, 259431, 261635]
53634B61635J816J510J278J090J001R74Q85Q81J366K358L153L055K295J807K096
53619B87200K780L293L657M209M857N059M637M242M645N718O529O436N706M885
53605C53853M031K944J840J196R72N77k56r66q37M9Q56Q93K28n42r56r54o82l10
53587C61936j54o17j626k377k145j385j290k140k805k341j369j071j429j437q16
53572C38934l81o47j057r64m80k6L33N86M37j21m36lO75O51j08n88K2J340K255
53553C40422K070J049o0p34q63m94L06J163J448R52L21L63J070J792K192K485
53537C53482K724K579K085J907K521L604M575N293N872O289O652P433Q822J0133
53523D23971J0432R683Q826Q746R545J0729J1677J2011J1919J2149J3282J4983
$$ y = [261635, 263451, 264961, 266239, 267329, 268330, 269304, 270189, 271070, 272436, 274794, 277947, 281002, 283297, 285104, 287200, 289980, 293273, 296930, 301139, 305996, 311055, 315692, 319934, 324579, 330297, 336826, 343262, 348968, 353853, 357884, 360828, 362668, 363864, 364836, 365413, 365157, 364191, 363354, 363403, 364259, 365152, 365380, 364838, 363882, 362928, 362246, 361936, 361782, 361165, 359539, 357162, 355017, 353632, 352342, 350202, 347397, 345056, 343687, 342616, 341187, 339750, 338934, 338553, 337906, 336849, 335885, 335405, 335379, 335712, 336298, 336735, 336614, 336178, 336175, 336850, 337501, 337393, 336805, 336827, 338167, 340422, 342492, 343541, 343481, 342747, 341884, 341390, 341696, 342859, 344307, 345259, 345580, 345943, 347013, 348805, 350997, 353482, 356206, 358785, 360870, 362777, 365298, 368902, 373477, 378770, 384642, 390931, 397583, 405016, 413838, 423971, 434403, 444086, 452912, 461658, 471203, 481932, 493609, 505620, 517539, 529688, 542970, 557953]
53511E57953J6254J6582J6533J7107J8628K0427K1571K1770K1506K1336K1265
53500G70932K0961K0384J9845J9439J8874J7940J6838J5849J5009J4278J3729
53489I64078J3398J3189J3124J3357J3789J4058J4102J4277J4700J4933J4739
53478A117744J4645J5156J5768J5441J3805J1362Q687O069L797K122Q19o42k430
53465A222343m304o177q185j0139j1450j1793j1437j0858j0444j0613j1586j2917
53453A102440j3784j4014j4331j5339j6679j7579j7808j7670j7377j6930j6331
53442I24598j5524j4251j2323r968p638n559l766k399j626j333j244j238j253
53429H46476r99j94R18J760K227K900M178N646O622P125P825R102J0566J1703
$$ y = [557953, 574207, 590789, 607322, 624429, 643057, 663484, 685055, 706825, 728331, 749667, 770932, 791893, 812277, 832122, 851561, 870435, 888375, 905213, 921062, 936071, 950349, 964078, 977476, 990665, 1003789, 1017146, 1030935, 1044993, 1059095, 1073372, 1088072, 1103005, 1117744, 1132389, 1147545, 1163313, 1178754, 1192559, 1203921, 1212608, 1218677, 1222474, 1224596, 1225415, 1224773, 1222343, 1218039, 1211862, 1203677, 1193538, 1182088, 1170295, 1158858, 1148000, 1137556, 1126943, 1115357, 1102440, 1088656, 1074642, 1060311, 1044972, 1028293, 1010714, 992906, 975236, 957859, 940929, 924598, 909074, 894823, 882500, 872532, 864894, 859335, 855569, 853170, 851544, 850211, 848967, 847729, 846476, 845477, 845283, 846201, 847961, 850188, 853088, 857266, 862912, 869534, 876659, 884484, 893586, 904152, 915855]
53415I15855J2609J3826J5574J7477J9033K0201K1410K3072K5112K6932K7887
53404A138988K7887K7610K7959K9243L0930L2307L3298L4541L6617L9336M1882
53393A500598M3605M4578M5259M5838M6087M5874M5471M5159M4758M3831M2308
53382A993366M0575L8956L7389L5671L3704L1399K8660K5572K2373J9082J5433
53371B322180J1347P191L184j110o272j2154j7942k3114k7861l2443l6539l9586
53359B146881m1483m2538m2868m2290m1021l9988l9923m0272l9590l7290l4497
53348A705121l2732l2128l1614l0656k9965l0294l1315l2074l2065l1284k9762
53337A361232k7543k4966k2404j9934j7663j6012j5161j4385j2685j0084p740
$$ y = [915855, 928464, 942290, 957864, 975341, 994374, 1014575, 1035985, 1059057, 1084169, 1111101, 1138988, 1166875, 1194485, 1222444, 1251687, 1282617, 1314924, 1348222, 1382763, 1419380, 1458716, 1500598, 1544203, 1588781, 1634040, 1679878, 1725965, 1771839, 1817310, 1862469, 1907227, 1951058, 1993366, 2033941, 2072897, 2110286, 2145957, 2179661, 2211060, 2239720, 2265292, 2287665, 2306747, 2322180, 2333527, 2340718, 2343902, 2342792, 2336520, 2324366, 2306424, 2283310, 2255449, 2223006, 2186467, 2146881, 2105398, 2062860, 2019992, 1977702, 1936681, 1896693, 1856770, 1816498, 1776908, 1739618, 1705121, 1672389, 1640261, 1608647, 1577991, 1548026, 1517732, 1486417, 1454343, 1422278, 1390994, 1361232, 1333689, 1308723, 1286319, 1266385, 1248722, 1232710, 1217549, 1203164, 1190479, 1180395, 1172655]
53326A172655o727p180q691j0863j3184j4876j5329j4599j3288j2009j1074j0463
53314A034372r943r344q668p925o914n443l627j754n6J182J595J374J588L151
53300I89588N544P407Q377R439J1226J3117J4504J5906J7937J9986K1006K1131
53288A155168K1395K2074K2421K2010K1230K0323J8986J7211J5608J4368J2801
53277A363595J0398P589M868J896j634m921o920p889r069j0920j2794j4373j6236
53264A303590j8618k0643k1516k1671k2028k2641k2932k2843k2891k3230k3481
53253A061096k3404k3158k2806k2149k1182k0146j9178j8398j8187j8776j9569
53242H34143j9663j9091j8704j8677j8107j6527j4833j4014j3734j3000j1642
$$ y = [1172655, 1165928, 1158748, 1150057, 1139194, 1126010, 1111134, 1095805, 1081206, 1067918, 1055909, 1044835, 1034372, 1024429, 1015085, 1006417, 998492, 991578, 986135, 982508, 980754, 980698, 981880, 983475, 984849, 986437, 989588, 995132, 1002539, 1010916, 1020355, 1031581, 1044698, 1059202, 1075108, 1093045, 1113031, 1134037, 1155168, 1176563, 1198637, 1221058, 1243068, 1264298, 1284621, 1303607, 1320818, 1336426, 1350794, 1363595, 1373993, 1381582, 1386450, 1388346, 1386712, 1381791, 1374871, 1366982, 1357913, 1346993, 1334199, 1319826, 1303590, 1284972, 1264329, 1242813, 1221142, 1199114, 1176473, 1153541, 1130698, 1107807, 1084577, 1061096, 1037692, 1014534, 991728, 969579, 948397, 928251, 909073, 890675, 872488, 853712, 834143, 814480, 795389, 776685, 758008, 739901, 723374, 708541, 694527, 680793, 667793, 656151]
53231F56151j0224q953p681o582n932n487m962m910o016p692q594q606r061j0659
53217E50792j2407j3194j3327j3633j3958j3592j2622j1786j1271j0591r578q584
53205D06249p695o542n148m222m313n064n712o000o300o960p800q275p982o962
53191C17274n590m297l452l307l759m269m311l949l661l541l128k221j350j062
53177B69377j153j117j038j403k164k638k403j803j381j226j078p94m90l96o60
53162B49633j204j713j913j877j789j531q75r2N2p65j827k077j333m39k42o75
53146B31333r71n65L52J096J134M73m03r31q64l80J35M18M50L17J35J24N01J142
53128B33496J560J437J052Q80R31Q76P02P57J080J191Q04K66L9J07K04L18N73
$$ y = [656151, 645927, 636974, 629293, 622711, 616779, 611292, 606330, 601420, 595404, 587712, 579118, 570512, 561451, 550792, 538385, 525191, 511864, 498231, 484273, 470681, 458059, 446273, 435002, 424411, 414833, 406249, 398554, 392012, 386864, 382642, 378329, 373265, 367553, 361553, 355253, 348293, 340493, 332218, 324236, 317274, 311684, 307387, 303935, 300628, 296869, 292600, 288289, 284340, 280679, 277138, 274010, 271789, 270439, 269377, 268224, 267107, 266069, 264666, 262502, 259864, 257461, 255658, 254277, 253051, 251973, 251179, 250689, 250293, 249633, 248429, 246716, 244803, 242926, 241137, 239606, 238731, 238639, 238691, 237926, 236099, 234022, 232689, 232250, 232008, 231333, 230362, 229797, 230149, 231245, 232379, 232852, 232449, 231518, 230654, 230274, 230409, 230827, 231277, 231594, 231729, 231853, 232354, 233496, 235056, 236493, 237545, 238425, 239356, 240232, 240934, 241691, 242771, 243962, 244766, 245032, 245071, 245178, 245382, 245700, 246273]
53111B46273Q32Q28N14M7m08o55n85m91q73j602j762r04Q4j8j136k035j897r97
53093B35215P6J005J475J169L36l11n06o73j046j264j047p13o00o26p49j180j734
53076B28827j633n86N76R29N93J66l50j123j532p11R56J994J619M93m28r90j505
53059B27295k028k373k340j685l11J298K311K457K186J757Q83m91j632j817j147
53044B24363j95O58J135Q81L1n52k94J95mo69p62l9O31O28L33L31N85P58O62J66
53024B28842p16j378r91J97P57j02j282j170K07J378J517J254J332J525J310Q17
53008B33497N02L35lm10l71K88J136J601J510J085O61M44M39N46O77P58O28J69
52990B43492l63m41O0M84J43o81r11lJ347K063J947J623J491J292Q20N07R01J833
$$ y = [246273, 247105, 247933, 248447, 248494, 248086, 247431, 246846, 246355, 245482, 243880, 242118, 241214, 241298, 241280, 240144, 238109, 236212, 235215, 235291, 236296, 237771, 238940, 239276, 238965, 238459, 237786, 236740, 235476, 234429, 233716, 233116, 232490, 231741, 230561, 228827, 227194, 226608, 227184, 228113, 228706, 228872, 228522, 227399, 225867, 225156, 226112, 228106, 229725, 230218, 229790, 228800, 227295, 225267, 222894, 220554, 218869, 218558, 219856, 222167, 224624, 226810, 228567, 229450, 228959, 227327, 225510, 224363, 224168, 224826, 225961, 226842, 226873, 226321, 226027, 226222, 226218, 225549, 224787, 224748, 225379, 226007, 226340, 226671, 227256, 228014, 228676, 228842, 228126, 226748, 225757, 225954, 226711, 226609, 225327, 224157, 224364, 225742, 227259, 228513, 229845, 231370, 232680, 233497, 233999, 234334, 234331, 233921, 233550, 233838, 234974, 236575, 238085, 239170, 239831, 240275, 240714, 241260, 241937, 242695, 243323, 243492, 243129, 242688, 242748, 243232, 243375, 242694, 241783, 241780, 243127, 245190, 247137, 248760, 250251, 251543, 252363, 252870, 253771, 255604]
52972B55604K447K079Q23o14j461j316m44L62N24K71K52N80P27M16Q5R6O1n12
52954B59980j268j408r34o99j121j550j245m50m6m29j240j960k366k402k045j386
52938B39431o30Q5O96J073J034N93O7j53Q1N93J033J143Q87L81k81j024j631j753
52920B41625j281o14l46o29r51p04Q5O95M68m21j129j041l81K02M39N05M52L2
52902B37006p31j249r92k74P5k30n86l55K42M35o1o29m63M98J496J718J063J57
52884B37120k12K83J309K155K245J477K27r39j544j348m49P49J789K422K640K474
52868B50398J975J350R15Q25R52J065R85O16J16KO63J674K027J283N3r46j719
52851B62234k469k873k643k326k646l297l346k776k509k835k921k257j576j653
$$ y = [255604, 258051, 260130, 260953, 260339, 258878, 257562, 257118, 257480, 258004, 258275, 258527, 259107, 259834, 260250, 260335, 260431, 260492, 259980, 258712, 257304, 256370, 255671, 254550, 253000, 251755, 251305, 251259, 250830, 249590, 247630, 245264, 242862, 240817, 239431, 238801, 238886, 239582, 240655, 241689, 242282, 242349, 242196, 242277, 242870, 243903, 245046, 245933, 246314, 246033, 245009, 243378, 241625, 240344, 239730, 239384, 238755, 237804, 237100, 237185, 237880, 238348, 237927, 236798, 235757, 235376, 235578, 236017, 236522, 236974, 237006, 236275, 235026, 234034, 233760, 233835, 233605, 233019, 232664, 232906, 233341, 233280, 232651, 232188, 232686, 234182, 235900, 236963, 237120, 236908, 237191, 238500, 240655, 242900, 244377, 244604, 243665, 242121, 240773, 240324, 241073, 242862, 245284, 247924, 250398, 252373, 253723, 254638, 255463, 256415, 257480, 258465, 259081, 259197, 259199, 259862, 261536, 263563, 264846, 264899, 263953, 262234, 259765, 256892, 254249, 251923, 249277, 245980, 242634, 239858, 237349, 234514, 231593, 229336, 227760, 226107]
52837B26107k045j782p35L69Q83O06k80j083r08K11R77M02p93j191o30p1J69P19
52819B20925J650J963J084k07r20j103j278j324p90J24O92O60M83N81Q80J109
52803B24529J052M92o63k025k806k558j674j007r59j124q87k56R8k75r49j080
52787B09908m36L68O83M90J48j25k77j74K38O05M77Rq4N50J350J563J254J098
52769B17645J254J029o9j496k280k128j464o59J22N60L93O0L34J182J673J287
52753B17443N79J58j35m97n08L7L53k01p62k6J645K494J836Q87P85J101J093J221
52735B27503K304L775M037K589P72R8N08P85L51j3N26J417J231l61j947k134j306
52718B40135r07j434k062k029j391m55N00Q86K56o45m11J011J943J231j75p43
$$ y = [226107, 224062, 222280, 221545, 221914, 222797, 223403, 223123, 222040, 221132, 221343, 222320, 222722, 221929, 220738, 220108, 220037, 220206, 220925, 222575, 224538, 225622, 225415, 224495, 223392, 222114, 220790, 220000, 220124, 220816, 221476, 221959, 222540, 223420, 224529, 225581, 226073, 225410, 223385, 220579, 218021, 216347, 215340, 214381, 213257, 212370, 212114, 212212, 211937, 210988, 209908, 209472, 209840, 210523, 211013, 211161, 211036, 210759, 210585, 210823, 211428, 211905, 211914, 211830, 212380, 213730, 215293, 216547, 217645, 218899, 219928, 219859, 218363, 216083, 213955, 212491, 211832, 211954, 212514, 212907, 212967, 213301, 214483, 216156, 217443, 218022, 218180, 218045, 217548, 217040, 217077, 217430, 217229, 216467, 216441, 218086, 220580, 222416, 223303, 224088, 225189, 226282, 227503, 229807, 233582, 237619, 240208, 240980, 241078, 241586, 242371, 242722, 242709, 243235, 244652, 245883, 245522, 243575, 241441, 240135, 239228, 237794, 235732, 233703, 232312, 231857, 232357, 233243, 233499, 232854, 232443, 233454, 235397, 236628, 236453, 235710]
52702B35710m63l62o92q36n49j45K96Q00Q40m4j068q52N85J639J194q4q71o98
52684B34400J02J095J768J503K43j226k123k466k548k174j051L30R74N60j99m34
52668B28754K0P30J214J257R27N21L34L72L43Q0j15K58J268K316K631J990Q84
52651B43784O2L4Q21J926K565K273J376N88P3p02j986l134l339k615j593o66J40
52634B39607O94Q24P40Q02R30P92O02R88J971K768K853K538K193J567L62r99j832
52617B57400k099k294k561k487j760o55J98L19k49q97q86j16O43N60k76q95m67
52600B43478Q05J859J774P17q9L66J644K228J267m42j444j220l33N11R96R87N22
52583B53626R1L31J255K075K062J240K71j56J99R13J142L79r20j772j747j288
$$ y = [235710, 235247, 234885, 234193, 233357, 232808, 232663, 232959, 233759, 234599, 234555, 233487, 232635, 233220, 234859, 236053, 235969, 235098, 234400, 234502, 235597, 237365, 238868, 239111, 237885, 235762, 233296, 230748, 228574, 227523, 227853, 228827, 229387, 229188, 228754, 228774, 229504, 230718, 231975, 232902, 233423, 233757, 234129, 234472, 234552, 234437, 234695, 235963, 238279, 240910, 242900, 243784, 243846, 243880, 244701, 246627, 249192, 251465, 252841, 253429, 253502, 252800, 250814, 247680, 244341, 241726, 240133, 239467, 239607, 240301, 241125, 241865, 242667, 243597, 244389, 244991, 245979, 247950, 250718, 253571, 256109, 258302, 259869, 260231, 259232, 257400, 255301, 253007, 250446, 247959, 246199, 245544, 245742, 246061, 245812, 244915, 244029, 243913, 244556, 245116, 244840, 243945, 243478, 244283, 246142, 247916, 248633, 248544, 248910, 250554, 252782, 254049, 253607, 252163, 250943, 250610, 251121, 252117, 253104, 253626, 253717, 254048, 255303, 257378, 259440, 260680, 260951, 260795, 260994, 261907, 263049, 263428, 262508, 260736, 258989, 257701]
52567B57701j000r75r79q59n21M3N71O03Mq47j557k054k233j804p92J66N15M31
52549B46413L87L74J63l4J67N55N41J42o1P7N0l41n89l66q5p9P8Q65J900K423
52529B52580K237J638Q18jk15M55J153P52m92j108l92P22J113R34R77J368J638
52512B64177J653J677J734J643J587K034K965L731L759L062J926M87j173k763
52498B86499l839m122l691k933k248j752j308r00p88j121j549j520r32k75m6k54
52482B59221n31n55l18m4N6mkK51O95J006Q03j6r97j302m20J182K460K865K785
52463B67135K826L067L284L482L698L583K698J225j24r37j481k207l173m076m560
52448B74440m389l553k401j502j248j562j931j802j089l91m46j224j849j609p47
$$ y = [257701, 256701, 255726, 254747, 253888, 253367, 253410, 253981, 254584, 254588, 253741, 252184, 250130, 247897, 246093, 245301, 245467, 245982, 246413, 246800, 247174, 247337, 247303, 247470, 248025, 248566, 248708, 248647, 248724, 248774, 248433, 247844, 247478, 247393, 247314, 247392, 248257, 250157, 252580, 254817, 256455, 257273, 257272, 257057, 257512, 258665, 259417, 258925, 257817, 257425, 258147, 259260, 260194, 261171, 262539, 264177, 265830, 267507, 269241, 270884, 272471, 274505, 277470, 281201, 284960, 288022, 289948, 290435, 289262, 286499, 282660, 278538, 274847, 271914, 269666, 267914, 266606, 265706, 264918, 263797, 262248, 260728, 259796, 259521, 259475, 259221, 258690, 258135, 257817, 257773, 257829, 257825, 257823, 258074, 258769, 259775, 260578, 260562, 259565, 258263, 257843, 259025, 261485, 264350, 267135, 269961, 273028, 276312, 279794, 283492, 287075, 289773, 290998, 290874, 289937, 288456, 286249, 283076, 279000, 274440, 270051, 266498, 264097, 262595, 261347, 259785, 257854, 256052, 254963, 254572, 254126, 252902, 251053, 249444, 248697]
52433B48697L9M68O22M62pk72J71R23J059M11j84j28K53M90P08J089J272R24M84
52414B57481N92J086J280J162J598L139N172O610P117P327P981R196J0574J1612
52400C31927J1703R997N935K59m997q119r171r438r601r126p472n082k864j259
52386B92692k79J2l67r70j166p75j02N19R85J350J767K333K871L048K911L016
52370C07845L778M864N524N363M542L420K282J311M94l08j101j655j804j550q61
52355C32144K77J380J620Q53Q7L05J205J704J516J424K039L040L744L912L751
52340C59001L566L649M111M667M931N024N542O765Q299R643J0761J1851J2890
52327D50700J3730J4471J5380J6518J7726J8961K0423K2170K3706K4223K3427
$$ y = [248697, 248736, 249204, 249826, 250288, 250281, 250009, 250180, 251103, 252162, 252573, 252389, 252261, 252514, 253004, 253712, 254801, 256073, 256997, 257481, 258073, 259159, 260439, 261601, 263199, 266338, 271510, 278120, 285237, 292564, 300545, 309741, 320315, 331927, 343630, 353627, 359562, 359821, 354824, 346705, 337534, 328096, 318495, 309369, 301897, 296815, 293951, 292692, 292413, 292425, 292058, 291088, 289922, 289147, 289045, 289564, 290549, 291899, 293666, 295999, 298870, 301918, 304829, 307845, 311623, 316487, 322011, 327374, 331916, 335336, 337618, 338929, 339423, 339115, 338014, 336359, 334555, 333005, 332144, 332421, 333801, 335421, 336274, 336361, 336666, 337871, 339575, 341091, 342515, 344554, 347594, 351338, 355250, 359001, 362567, 366216, 370327, 374994, 379925, 384949, 390491, 397256, 405555, 415198, 425959, 437810, 450700, 464430, 478901, 494281, 510799, 528525, 547486, 567909, 590079, 613785, 638008, 661435]
52316F61435K1959K0719J9865J8910J7809J7358J8073J9315K0010J9939J9629
52305H75021J9294J8621J7536J6454J5642J4961J4208J3223J1672R448P171N509
52293A038760M009J535j965n164p232q894j0958j2798j3337j2761j2108j1605
52281I47482j0644r159p803o681n004k294Q57L616N722P292Q446R527J1038J2993
52267I65388J4682J5473J5448J5040J4497J4009J3846J3985J4020J3810J3854
52256A124052J4481J5121J4941J3977J3002J2374J1608J0076P645M604J362j717
52244A241526m562p462j0486j3017j4360j4796j5305j6119j6376j5546j4467j4274
52232A084756j4854j5146j4616j3651j2646j1597j0586r863r261q246o875n959
$$ y = [661435, 683394, 704113, 723978, 742888, 760697, 778055, 796128, 815443, 835453, 855392, 875021, 894315, 912936, 930472, 946926, 962568, 977529, 991737, 1004960, 1016632, 1026080, 1033251, 1038760, 1042769, 1044304, 1042339, 1037175, 1029943, 1021049, 1010091, 997293, 983956, 971195, 959087, 947482, 936838, 927679, 919876, 913195, 908191, 905897, 906754, 910370, 916092, 923384, 931830, 941357, 952395, 965388, 980070, 995543, 1010991, 1026031, 1040528, 1054537, 1068383, 1082368, 1096388, 1110198, 1124052, 1138533, 1153654, 1168595, 1182572, 1195574, 1207948, 1219556, 1229632, 1237277, 1241881, 1243243, 1241526, 1236964, 1229502, 1219016, 1205999, 1191639, 1176843, 1161538, 1145419, 1129043, 1113497, 1099030, 1084756, 1069902, 1054756, 1040140, 1026489, 1013843, 1002246, 991660, 981797, 972536, 964290, 957415, 951456]
52220I51456n895n870m848k885r36L61J108J622K090K639L311L878M211M626N461
52205I60329O353O513N748M682L889L352K893K631K716L070L637M484N420N953
52191A021670N889N584N320M922M361M104M260L893K116m98k534l759n376q060
52177A041892j0773j2145j2205j1882j1302r728p080m509l083k624k269j670j071
52164I51551n14K92J343K163K544K967L904N003N476N193M795M648M230K944J084
52149I97623m61j261j492j203q8J774L529M316M131L562K895J981Q38l8j26O62
52133A016642K057L704N322O730P996R415J1284J3743J6810K0310K3741K6463
52121A164217K8262K9546L0783L1857L2271L1912L1264L0736L0069K8696K6527
$$ y = [951456, 945561, 939691, 934843, 931958, 931022, 931383, 932491, 934113, 936203, 938842, 942153, 946031, 950242, 954868, 960329, 966682, 973195, 978943, 983625, 987514, 990866, 993759, 996390, 999106, 1002176, 1005813, 1010297, 1015717, 1021670, 1027559, 1033143, 1038463, 1043385, 1047746, 1051850, 1056110, 1060003, 1062119, 1061621, 1059087, 1055328, 1049952, 1041892, 1031119, 1018974, 1006769, 994887, 983585, 973857, 966777, 962268, 959185, 956561, 954292, 952622, 951551, 951037, 951329, 952672, 954835, 957379, 960346, 964250, 969253, 974729, 979922, 984717, 989365, 993595, 996539, 997623, 997162, 995901, 994409, 993206, 993118, 994892, 998421, 1002737, 1006868, 1010430, 1013325, 1015306, 1016144, 1016106, 1015980, 1016642, 1018699, 1022403, 1027725, 1034455, 1042451, 1051866, 1063150, 1076893, 1093703, 1114013, 1137754, 1164217, 1192479, 1222025, 1252808, 1284665, 1316936, 1348848, 1380112, 1410848, 1440917, 1469613, 1496140]
52110A496140K4100K1870J9622J6814J3422J0138P625N820M250K831J973J799
52098A626404J647O56j359l793n924p476q709j0257j2840j6651k0884k4130k5395
52085A491289k4734k2906k0642j8273j5803j3108j0247p569n379l520j561N56
52073A348103K443M025N958Q849J2349J5410J7352J8262J8498J8239J7670J7125
52061A504283J6839J6683J6305J5457J4161J2677J1296J0069Q790P334N848M375
52049A644117K528q0l221o313r297j2699j6633k0315k2873k4262k5000k5363k5321
52036A455268k4998k4602k3980k2715k0806j8804j7199j6016j5123j4530j4178
52025A242317j3770j3172j2775j3006j3639j3969j3705j3265j3067j2892j2261
$$ y = [1496140, 1520240, 1542110, 1561732, 1578546, 1591968, 1602106, 1609731, 1615551, 1619801, 1622632, 1624605, 1626404, 1628051, 1628707, 1627348, 1623555, 1617631, 1610155, 1601446, 1591189, 1578349, 1561698, 1540814, 1516684, 1491289, 1466555, 1443649, 1423007, 1404734, 1388931, 1375823, 1365576, 1358007, 1352628, 1349108, 1347547, 1348103, 1350546, 1354571, 1360529, 1369378, 1381727, 1397137, 1414489, 1432751, 1451249, 1469488, 1487158, 1504283, 1521122, 1537805, 1554110, 1569567, 1583728, 1596405, 1607701, 1617770, 1626560, 1633894, 1639742, 1644117, 1646645, 1646565, 1643344, 1637031, 1627734, 1615035, 1598402, 1578087, 1555214, 1530952, 1505952, 1480589, 1455268, 1430270, 1405668, 1381688, 1358973, 1338167, 1319363, 1302164, 1286148, 1271025, 1256495, 1242317, 1228547, 1215375, 1202600, 1189594, 1175955, 1161986, 1148281, 1135016, 1121949, 1109057, 1096796]
52014A096796j1144r984r151q697q591q799r143r495j0078j1204j2605j3527j3794
$$ y = [1096796, 1085652, 1075668, 1066517, 1057820, 1049229, 1040430, 1031287, 1021792, 1011714, 1000510, 987905, 974378, 960584]
$$ [...]
##END NTUPLES=NMR SPECTRUM
##END=
