##TITLE=AC1594_CASAH13324_8314249_jSU31GdPd8
##JCAMPDX= 6.0         $$ Bruker NMR JCAMP-DX V2.0
##DATA TYPE= NMR SPECTRUM
##DATA CLASS= NTUPLES
##ORIGIN= BRUKER
##OWNER= Administrator
$$ 1.72 TOPSPIN		Version 2.1
$$ 2013-11-09 14:14:42.227 -0800  Administrator@X
$$ Compression mode = diff/dup
##.OBSERVE FREQUENCY= 400.02188249412
##.OBSERVE NUCLEUS= ^1H
##.ACQUISITION MODE= SIMULTANEOUS (DQD)
##.ACQUISITION SCHEME= undefined
##.AVERAGES= 8
##.DIGITISER RES= 22
##SPECTROMETER/DATA SYSTEM= spect
##.PULSE SEQUENCE= zg30
##.SOLVENT NAME= COFFEE_meoh
##.SHIFT REFERENCE= INTERNAL, COFFEE_meoh, 1, 14.98509
##AUDIT TRAIL= $$ (NUMBER, WHEN, WHO, WHERE, PROCESS, VERSION, WHAT)
$$ ##TITLE= Audit trail, TOPSPIN		Version 2.1
$$ ##JCAMPDX= 5.01
$$ ##ORIGIN= Bruker BioSpin GmbH
$$ ##OWNER= Administrator
$$ $$ E:\/data/COFFEE/nmr/AC1594_CASAH13324_8314249_jSU31GdPd8/10/pdata/1/auditp.txt
$$ ##AUDIT TRAIL=  $$ (NUMBER, WHEN, WHO, WHERE, PROCESS, VERSION, WHAT)
(   1,<2013-11-09 14:14:34.940 -0800>,<Administrator>,<X>,<go>,<TOPSPIN 2.1>,
      <created by zg
	started at 2013-11-09 14:13:21.408 -0800,
	POWCHK enabled, PULCHK disabled,
       configuration hash MD5:
       C8 4E 4E 5D D3 5C D8 9E 9F 52 82 E0 59 8A DE 15
       data hash MD5: 64K
       0F 1D F9 4C 5D 6C 90 89 5B 98 71 11 7F 5D 67 4B>)
(   2,<2013-11-09 14:14:38.297 -0800>,<Administrator>,<X>,<proc1d>,<TOPSPIN 2.1>,
      <Start of raw data processing
       efp LB = 0 FT_mod = 6 PKNL = 1 PHC0 = 0 PHC1 = 0 SI = 32K 
       data hash MD5: 32K
       BB 68 3B A7 BC 77 3C D7 2D E2 D5 B6 89 9E E7 EA>)
(   3,<2013-11-09 14:14:38.580 -0800>,<Administrator>,<X>,<proc1d>,<TOPSPIN 2.1>,
      <pk PHC0 = 90.74707 PHC1 = 0 
       data hash MD5: 32K
       52 73 BE 69 A0 5F D2 D7 9A 89 39 F4 16 61 D0 BB>)
(   4,<2013-11-09 14:14:38.677 -0800>,<Administrator>,<X>,<proc1d>,<TOPSPIN 2.1>,
      <abs ABSG = 1 
       data hash MD5: 32K
       F4 F3 FA D9 DE 44 30 27 70 31 33 C3 AF E2 E0 8F>)
(   5,<2013-11-09 14:14:38.747 -0800>,<Administrator>,<X>,<proc1d>,<TOPSPIN 2.1>,
      <abs ABSG = 2 
       data hash MD5: 32K
       D3 43 6A EB 46 2F 5D 18 08 DE 7E A8 CF 3E 5A A8>)
(   6,<2013-11-09 14:14:38.802 -0800>,<Administrator>,<X>,<proc1d>,<TOPSPIN 2.1>,
      <abs ABSG = 3 
       data hash MD5: 32K
       EC 6E 8E F9 EB 32 CE 24 FD A5 90 2F F2 1C B2 26>)
(   7,<2013-11-09 14:14:38.872 -0800>,<Administrator>,<X>,<proc1d>,<TOPSPIN 2.1>,
      <abs ABSG = 4 
       data hash MD5: 32K
       7F 4E E2 B2 28 49 57 9D E2 DB 02 AE 61 31 57 53>)
(   8,<2013-11-09 14:14:38.928 -0800>,<Administrator>,<X>,<proc1d>,<TOPSPIN 2.1>,
      <abs ABSG = 5 
       data hash MD5: 32K
       86 86 AE 71 68 FB 45 8F 36 CF 89 D1 11 05 52 8E>)
$$ ##END=
$$ 
$$ $$ hash MD5
$$ $$ 4C FD DD F4 97 08 25 0B AA 7E 95 22 6C C5 85 92
##$RELAX= 
##$RELAX= 
##$RELAX= 
##$RELAX= 
##$RELAX= 
##$RELAX= 
##$RELAX= 
$$ Bruker specific parameters
$$ --------------------------
##$DU= <E:\>
##$EXPNO= 10
##$NAME= <AC1594_CASAH13324_8314249_jSU31GdPd8>
$$ [...]
##$TP= (0..7)
150 150 150 150 150 150 150 150
##$TP07= 0
##$TPNAME0= <>
##$TPNAME1= <>
##$TPNAME2= <>
##$TPNAME3= <>
##$TPNAME4= <>
##$TPNAME5= <>
##$TPNAME6= <>
##$TPNAME7= <>
##$TPOAL= (0..7)
0.5 0.5 0.5 0.5 0.5 0.5 0.5 0.5
##$TPOFFS= (0..7)
0 0 0 0 0 0 0 0
##$TUNHIN= 0
##$TUNHOUT= 0
##$TUNXOUT= 0
##$USERA1= <user>
##$USERA2= <user>
##$USERA3= <user>
##$USERA4= <user>
##$USERA5= <user>
##$V9= 5
##$VALIST= <valist>
##$VCLIST= <CCCCCCCCCCCCCCC>
##$VD= 0
##$VDLIST= <DDDDDDDDDDDDDDD>
##$VPLIST= <PPPPPPPPPPPPPPP>
##$VTLIST= <TTTTTTTTTTTTTTT>
##$WBST= 1024
##$WBSW= 4
##$XGAIN= (0..3)
0 0 0 0
##$XL= 0
##$YL= 0
##$YMAX_a= 594831
##$YMIN_a= -515185
##$ZGOPTNS= <>
##$ZL1= 120
##$ZL2= 120
##$ZL3= 120
##$ZL4= 120
##$ABSF1= 14.98509
##$ABSF2= -5.573092
##$ABSG= 5
##$ABSL= 3
##$ALPHA= 0
##$AQORDER= 0
##$ASSFAC= 0
##$ASSFACI= 0
##$ASSFACX= 0
##$ASSWID= 0
##$AUNMP= <proc_prof1d_extract_pilot.lims>
##$AXLEFT= 0
##$AXNAME= <>
##$AXNUC= <1H>
##$AXRIGHT= 0
##$AXTYPE= 0
##$AXUNIT= <>
##$AZFE= 0.1
##$AZFW= 0.1
##$BCFW= 0
##$BC_mod= 0
##$BYTORDP= 0
##$COROFFS= 0
##$CY= 15
##$DATMOD= 1
##$DC= 0
##$DFILT= <>
##$DTYPP= 0
##$F1P= 0
##$F2P= 0
##$FCOR= 0.5
##$FTSIZE= 32768
##$FT_mod= 6
##$GAMMA= 0
##$GB= 0
##$INTBC= 1
##$INTSCL= 1
##$ISEN= 128
##$LB= 0
##$LEV0= 0
##$LPBIN= 0
##$MAXI= 10000
##$MC2= 0
##$MEAN= 0
##$ME_mod= 0
##$MI= 0
##$NCOEF= 0
##$NC_proc= -8
##$NLEV= 6
##$NOISF1= 0
##$NOISF2= 0
##$NSP= 0
##$NTH_PI= 0
##$NZP= 0
##$OFFSET= 14.98509
##$PC= 1
##$PHC0= 90.74707
##$PHC1= 0
##$PH_mod= 1
##$PKNL= yes
##$PPARMOD= 0
##$PPDIAG= 0
##$PPIPTYP= 0
##$PPMPNUM= 2147483647
##$PPRESOL= 1
##$PSCAL= 4
##$PSIGN= 0
##$PYNMP= <proc.py>
##$REVERSE= no
##$SF= 400.02
##$SI= 32768
##$SIGF1= 0
##$SIGF2= 0
##$SINO= 400
##$SIOLD= 32768
##$SPECTYP= <>
##$SREGLST= <1H.CDCl3>
##$SSB= 0
##$STSI= 32768
##$STSR= 0
##$SW_p= 8223.68421052631
##$SYMM= 0
##$S_DEV= 0
##$TDeff= 65536
##$TDoff= 0
##$TI= <>
##$TILT= no
##$TM1= 0
##$TM2= 0
##$TOPLEV= 0
##$USERP1= <user>
##$USERP2= <user>
##$USERP3= <user>
##$USERP4= <user>
##$USERP5= <user>
##$WDW= 1
##$XDIM= 32768
##$YMAX_p= 465338409
##$YMIN_p= -775299
##$CURPLOT= <Network HP LaserJet P1505>
##$CURPRIN= <$Network HP LaserJet P1505>
##$DFORMAT= <normdp>
##$LAYOUT= <+/1D_H.xwp>
##$LFORMAT= <normlp>
##$PFORMAT= <normpl>
##$SURQMSG= 1
$$ End of Bruker specific parameters
$$ ---------------------------------
##NTUPLES= NMR SPECTRUM
##VAR_NAME=  FREQUENCY,     SPECTRUM/REAL,   SPECTRUM/IMAG
##SYMBOL=    X,             R,               I
##VAR_TYPE=  INDEPENDENT,   DEPENDENT,       DEPENDENT
##VAR_FORM=  AFFN,          ASDF,            ASDF
##VAR_DIM=   32768,         32768,           32768
##UNITS=     HZ,            ARBITRARY UNITS, ARBITRARY UNITS
##FACTOR=    0.250966925370066, 1,           1
##FIRST=     8223.43324360094, -205520,      50798
##LAST=      0,             47012,           -143296
##MIN=       0,             -775299,         0
##MAX=       8223.43324360094, 465338409,    0
$$ Real data points
##PAGE= N=1
##DATA TABLE= (X++(R..R)), XYDATA
$$ [...]
23876 -197954 125282 -74279 -94139 -103571 -104762 127089 69868 -8658 -104601 7864 -254224 46958
23863 191586 258083 -44458 12421 124136 145389 -34427 -270687 243830 167161 -144251 -155804
23852 -155804 60953 -133389 144375 -29238 -272121 -85439 -177459 -20161 105286 208289
23842 208289 -178308 48656 -231012 -134608 -198100 91131 -192803 -451494 109092 16477
23831 80643 -45375 196953 -102195 91721 176712 93729 53412 -117850 14414 -148673 61926
23819 42593 -144201 -101495 78421 -140943 222004 -120602 -216513 75089 -76086 -171193 -180147
23808 -180147 175287 236289 23784 -210305 -64793 -162421 -101907 -51161 3597 -304595 -112191
23796 -250561 -24112 126260 58739 2154 135507 -93358 108174 364818 5911 -1819 57182
23784 -10874 -321950 232141 -167315 -166550 -75976 69268 54823 -96660 -61725 -408631 169285
23772 221657 -256280 -148499 -48642 -195525 -106011 40294 -363725 -342030 90803 52309 15977
23760 8284 271236 -38325 301355 -120738 54918 21314 82827 -150173 -119642 -20945 -9614
23748 -133030 -345646 -62307 110344 -311881 -44057 -340500 23225 254247 -347574 -90736
23737 -15121 -39011 -139988 -27041 -127825 -85994 194817 302611 177241 35230 -130854
23726 12274 -243791 -141722 -121993 9340 33473 -88914 86940 -66731 -54145 38305 -415836
23714 26947 84616 91289 105805 173352 129916 1766 -35210 -23829 80275 83576 84983 16321
23701 173387 175840 -99448 -195754 197938 -83448 179735 96445 195043 -37671 -58642 -89303
23690 -89303 -259160 147782 152624 -37542 -282043 -13840 -58293 -230799 28420 182123 132089
23679 132089 -28062 236514 245308 52534 -227988 -176143 178979 -4171 18439 -191080 297802
23667 279392 131145 438227 34926 53761 171669 -38876 -58043 39544 191884 -109682
23656 -9281 -183789 -262043 -89097 38203 296299 105312 -49526 13257 303374 31305 -99802
23644 -89446 -237082 -284438 -220633 -48502 -48988 -164744 160194 -85933 -198999 -276043 -224722
23633 -224722 -127632 44092 -181764 -139824 222039 44942 -211951 -216240 -86204 285444 -106416
23621 -38178 -453012 -307627 47260 -16624 267214 331591 -277288 73724 139636 -89456 -156216
23610 -156216 -196870 -54409 -79191 39781 -410247 64838 99448 93142 -50097 110208 -137086
23598 -45731 -30969 155919 192392 -43174 178554 89772 125561 -38976 -243470 -74394 282917
23586 -26772 174131 -46144 -93909 74871 -30378 -6075 23412 274486 121406 -3317 -27028
23575 -27028 -173866 -24566 -233236 68841 -10658 16349 79596 7426 -3576 -25793 194045
23563 191524 -177924 -311032 -160971 -66369 -88952 38459 190930 91843 32724 83873 20785
23551 57017 -47243 6352 20980 43270 22897 -295184 379389 102772 147753 -188272 296839
23539 -218888 17146 168090 613 -88821 -84994 -224086 194829 44054 256926 2597 -238401
23527 29464 112439 260680 -252330 -46424 -58781 -174873 -232170 89515 -1826 87621 160492
23516 160492 99722 -250601 -54321 -16167 154698 -185309 -352434 45867 68973 124329 40705
23504 -60185 -14960 34219 -50712 143045 39769 -195914 -7692 55347 173246 -85566 115762
23492 -195470 -31987 222596 136298 -126977 -48623 -184451 22504 171101 -188922 65860
23481 -119678 -164775 86013 -23391 -59651 143001 96558 58700 11708 -331505 -365968 -247827
23470 -247827 26559 -498804 12049 -121161 173213 187420 -63245 -132264 35904 -138321 -102107
23459 -102107 70121 -170789 152428 -220196 -183406 20687 94576 172831 2458 160768 -8613
23447 -377695 -39097 -22829 5131 143235 -177703 -39410 47685 82474 -203823 -64290 289982
23435 208580 99257 -73641 -11313 -7752 -149842 32291 423803 283122 -231041 -108284 -138745
23424 -138745 -104384 232496 78870 -160552 48089 21894 -167182 -183348 -122910 57590 113281
23413 113281 -151573 -286367 54307 178717 -174167 217943 145696 34801 206498 -29040
23402 37524 125768 3731 96231 -251153 -163636 20468 -226707 -297711 -63420 241566 7818
23390 -1085 -12249 -42214 -26935 42 -366892 -109911 33981 113719 -104952 -286875 -78985 118234
23377 -51710 -31325 111101 113701 -415472 152755 -125705 38464 1389 -19196 184720 10136
23365 -40724 143592 185366 58702 114134 -126284 40908 178753 231673 -330301 -9436 -73856
23354 -73856 51016 -124288 -256620 155168 69549 -259234 213554 201967 44807 107244 189158
23343 189158 12376 217562 -171166 -260539 88323 -57416 280774 13133 90643 242592 -84086
23331 -235509 299656 139145 -166926 -173173 171445 112121 272160 110599 166499 -63466
23320 5983 -88112 154969 -285782 -331527 148362 -188751 73962 51167 136150 148656 33292
23308 26970 -35031 -225306 336534 191844 6480 -75189 133891 -101587 -7130 -113444 -3607
23296 17649 169836 193427 153221 -221488 196730 43488 99778 -252603 -48342 -72568 121917
23284 -369430 95648 -195670 -10289 218259 52978 -272270 -205625 40491 -53381 39601 254896
23273 254896 -50855 214606 -56791 -37223 -61729 92276 -131876 241973 45659 -233215 -184033
23262 -184033 -48890 -51632 251930 -138971 190411 300659 -83764 -323962 -234514 -48480 -83886
23251 -83886 241466 -4490 -5402 357665 31289 -348430 -247259 137331 34290 -134452 282939
23239 51928 -89581 -418250 79889 -85476 -143888 -43563 -14087 -36587 -13028 -346072 -68057
23227 -123151 256726 -219085 57928 -104765 206159 -152562 149253 246495 529490 12866
23216 124599 -212683 -150173 -91312 -36305 -22175 276915 -84459 -81600 194584 71236 99671
23205 99671 -163685 32753 154419 -174078 124120 -22384 -235599 -320025 -55100 -220550
23195 -220550 178413 -45308 -344018 61781 -225022 -37908 -112184 -651529 184447 219536
23185 219536 -126290 -204038 10726 36874 305384 -1545 -84732 -48222 -95296 166645 47148
23173 -77046 -182963 55670 82917 188606 -26338 154323 13405 -285292 330078 -83066 -130788
23162 -130788 248842 -166744 185542 52245 -122189 195920 -183179 36836 -196315 176484
23151 120404 327657 -33006 336972 55424 -102636 46716 -199315 -296756 -28576 -89043 62830
23139 -163246 85163 -13163 -135049 314 38741 -49323 -353465 197035 84499 284680 18630
23127 337026 426681 -112308 -110308 14622 249384 29842 240571 -266696 67829 -65854 160416
23115 143915 -122208 45129 -394831 -68197 -273573 -4566 61710 -13104 135406 263115 204754
23104 204754 168233 259851 -270478 -35343 -87040 -6683 -39153 103923 -185881 61050 226860
23093 226860 -64642 -416 124998 -163780 158035 -96822 -106362 254257 -89025 -367913 -36160
23081 -38128 193235 116257 -156942 365431 147294 335255 -66330 -83280 45539 -16382 28648
23069 217386 -99680 4472 150869 107071 -244555 -184354 32300 162398 48733 -89413 -37393
23057 9272 -116387 103886 78610 87675 128733 54755 -250657 227213 162832 261875 -224597
23045 -59962 -440929 -100822 -28037 -160820 105979 -397425 54015 5913 -343604 505968
23034 -127102 54774 222492 -159564 164074 111627 -287865 -4386 58286 198651 -142446
23023 283116 371353 10549 -52066 -98193 -63781 -16872 188483 -102277 -249162 -87228 -86590
23012 -86590 128546 141154 205410 -374761 37648 50022 -105211 124047 165800 14214 82952
23001 82952 -110204 -148595 -37712 30233 138402 -195733 60039 138465 5820 -25227 18167
22989 -123705 171710 -161956 97426 -243068 -313633 217591 12025 -193356 18132 56021
22979 56021 48572 -111656 -142084 -151918 -33358 -34745 50751 92563 -113474 -442793 -55811 1285
22966 38110 -63175 -196515 286697 -2465 -43465 -242825 270976 4474 2657 -165498 64153
22954 -119928 -221880 68094 -268699 32460 145695 428799 -172998 7970 -102266 -226968
22944 -226968 -135072 27374 175930 -306603 -218309 -106416 86278 -272247 -59356 52547 28598
22933 28598 -61823 -106342 145474 -188798 78862 -54364 185032 -51211 -151314 -15869 -15593
22922 -15593 -29863 267925 49585 -124105 -205728 -346716 93911 -86757 8524 -96012 -69353
22911 -69353 284289 -172633 -143376 -102879 162314 -237740 -381634 -50312 -10797 341691
22900 -78157 192489 183296 -28268 -301641 -210537 -66987 15527 -335034 62561 52993 175637
22889 175637 254766 10781 167626 -14942 22325 -71227 162346 -352250 30675 166920 132489
22878 132489 -50803 -94599 291044 -66563 -9270 -131859 132748 124094 -224113 -160964 57352
22866 96032 -66850 -184895 79360 53576 -221464 -230596 -27813 252615 76190 310077 270269
22855 270269 -322146 -223000 136507 52075 185036 -26147 -139823 21308 67386 132758 -253216
22843 -83270 -163266 63734 -61289 139331 -54836 117067 -234351 94895 -6903 -203347 131232
22831 -15523 -147020 212272 202571 244451 -90083 118576 157957 194606 -167098 -186506 -404769
22820 -404769 -250867 34584 -353468 37420 59627 -192685 64321 -2928 -225272 -190060 182336
22808 443961 -78423 -163692 147325 103565 -107403 -55820 -218128 116845 -95279 -99775 -99344
22797 -99344 -182994 -100990 -81984 -70470 -90647 -142223 123026 -138095 -241850 -143050 -312668
22786 -312668 -68046 -103938 -143787 -182138 -253623 149712 -350657 -399100 -177802 -401507 156119
22774 247777 178869 41298 -292528 105237 -146670 -384084 88658 -169677 -357192 -188722
22764 -188722 -251754 -174762 -173408 172004 -137953 -119561 40322 -204160 -246571 82664 -39656
22752 -103815 33426 -194567 -249357 -5987 -23300 -52282 -223381 127631 -72471 -285927 -152766
22741 -152766 -127284 31739 193072 -16486 123312 196335 53622 59473 128414 8675 78429
22730 78429 -179356 31043 322359 180254 368546 -220024 67322 -57155 91913 197525
22720 197525 72951 -15909 -32168 80801 -16706 -35771 165592 -342036 202757 -58105 -5306
22708 13348 58594 36460 -98210 144110 -347980 155792 61698 -125523 -232149 -114458
22697 65239 266891 -181482 -141035 123232 69425 152464 163453 99170 68623 82 219722
22686 219722 98295 6101 -73013 -226356 17659 -16811 96723 -84807 -210505 -96849 -265879
22675 -265879 -124530 -105464 -219297 88223 -273524 -144459 314939 -178974 -217980 213575
22664 8868 -49286 -157548 -69028 -140317 77228 -279328 54051 252466 -247344 -54734 182915
22652 281464 -278987 9100 17238 4634 135845 -64066 295620 -241480 248749 -174284 -145856
22641 -145856 219663 264523 -38591 -407293 -95785 -263633 -98263 -37413 4498 58999 40139
22630 40139 93101 -117711 45243 -20011 -370047 -10057 42622 -48456 231512 -210598 -69165
22618 -156839 187138 -146210 209411 84110 -211462 -295253 -166543 -102421 21907 -169936
22607 49607 -109028 105788 -125983 -201099 59250 -92306 -163792 -392642 -171796 -309297
22597 -309297 -4066 57638 -188771 -7859 -84555 40085 -158124 -231599 102920 132544 -80383
22585 -57859 -98460 -11966 184563 -114218 -186391 26880 -55342 97462 82719 218675 -105451
22573 -29492 209860 -78539 -147805 -74556 -161672 121293 57947 -228213 294865 131181 -218914
22561 59086 -268824 218505 -137523 226352 -432905 -194877 318469 -203149 -100501 -26254
22550 205856 -32718 -163619 -34774 -24410 269965 277907 -310490 -131130 398827 -138261
22539 -28400 271972 -73459 149726 -122253 -2744 259314 264930 333307 338856 -101119 -144257
22528 -144257 -32299 130927 -124108 234187 3500 -26590 301789 167770 -168295 -328586
22518 -328586 97562 -111248 -313229 40432 -134571 86815 289917 -277455 124798 7912
22507 30711 -108531 259027 -338724 -100221 -92212 267724 -168630 31572 238660 -204255
22496 353502 -68816 -235105 27064 -105022 -237254 45117 -393051 106578 43169 -34960
22485 7398 -410960 -245881 155868 399793 84305 -82251 -126338 -123454 -74392 -179099 137767
22473 -296777 49729 203783 123853 -72990 -293770 73331 -54304 103839 11413 29204 -11559
22461 203463 -113382 293545 -105545 109142 -238407 187324 -53573 -11134 59486 -43090
22450 119434 -91587 -327775 -13525 -46956 127964 -123237 43845 -218034 33111 -358909
22439 -136882 -192671 -72818 202335 -126238 -151504 -75889 -22848 -341685 -42438 83873 123111
22428 123111 33659 -68446 -54140 -235088 -20636 -45701 -139742 -98436 148180 390241 -148245
22416 12839 77245 61016 -173983 295850 -272419 -245757 49807 1799 53693 126118 14876
22404 -39875 198536 -121793 93890 -41606 -35557 -269990 -226204 -74297 123455 -84090 -47361
22393 -47361 1857 -191258 150735 -189786 -58987 -222439 -41144 -93921 86969 -48964 -137955
22382 -137955 70019 -254098 98297 -60280 -159178 222950 -297610 -336397 -13299 131719 -123867
22370 -157725 141405 155451 -185331 -35881 200359 63629 -145127 -5604 -204016 -219526 65730
22358 182143 -270277 -110196 -9468 -355105 134535 44999 27453 -112186 139060 -288917
22347 -190323 93260 -200400 123071 -56700 92197 -18023 258819 210607 -266448 55210 254999
22336 254999 -8367 -51245 30928 -297836 428000 -116500 147015 93551 -431340 -139210
22325 -26545 -162805 65064 -116532 -327762 102233 -136696 5981 378966 -8847 318092 52279
22313 -311978 -202148 381775 -451493 30302 -208643 -118767 -118659 -34358 -55377 -186239 97569
22301 -109514 65222 67963 -47394 19851 -14649 -91104 -152853 -141183 -213965 31850 91658 -99999
22288 -200359 390254 -185609 19713 -147400 -110008 245578 -170445 -30320 -4552 -223266
22278 -223266 70032 -139046 -85663 -850 -303523 42607 -268689 -22584 105545 116868 43247
22266 -88953 -363883 -201462 -140408 -28749 198861 -356095 -201625 50170 -130152 -254516
22256 -254516 -92687 -170661 -180692 54071 26954 -343983 160967 362893 198665 207896 -13941
22244 57601 206351 94519 -13810 -111162 -360785 52014 -18407 89397 -33807 53544 296553
22233 296553 -235018 -260699 -170808 239674 -79843 -278247 -160892 -106038 48631 -21403 7887
22221 51786 85199 -146228 -8245 371800 240611 -178779 -45975 102237 -109083 -40950 -42216
22210 -42216 -31351 -138757 -202060 216770 -33833 71255 -202373 -65417 174170 -7765 -115330
22199 -115330 -335388 408064 278251 94526 -277689 -68635 -148357 -63287 129834 -73592
22188 209765 -122056 -126266 -60556 21261 -109544 -154231 161560 25690 437475 37307 61386
22177 61386 86039 121823 -221370 -487310 -214817 -99653 145135 -89944 56724 66334 -28671
22165 -309986 28711 23787 -135411 10315 -104098 98446 -218124 36715 141921 66621 -215515
22153 -54530 114070 194404 172049 -107202 -57583 -191041 39413 -23220 -495 78735 -271963
22141 148661 24541 73039 23491 -124764 143293 282819 -63890 -405274 63994 -47377 25145
22129 -48320 -137801 380710 95342 8145 -52068 -38455 -177615 128629 -86437 -52332 49401
22117 -71122 219628 91011 171781 -32509 87000 17050 -72885 313223 -123407 -185175 197777
22105 -85997 -137775 112946 -77115 -121994 129620 227880 -330148 -48121 57970 221802 214784
22094 214784 -1539 -67073 -83645 50876 -245604 -169124 -168924 90040 -337570 -208333 -136961
22083 -136961 150261 192154 157350 -84031 -313053 -100231 24509 -79170 130513 -55875 -34570
22072 -34570 -47184 -246405 -338890 -337170 -124876 -85410 -399562 -44526 -44100 118600 -53653
22060 -9605 112035 36344 -74005 6149 -159707 -66301 -206756 -261090 -161379 -23819 47621
22048 -121178 -55406 -54787 77342 89128 -272571 25697 32195 79312 -79559 305974 18493 -296369
22035 78323 -346219 -382317 124968 164809 -12267 -356952 119913 -365871 56690 -46493 -429213
22024 -429213 -360255 14887 380826 -372451 86656 403781 -10526 -179220 -35746 65876 94837
22013 94837 -174862 130761 123256 42461 129391 -242699 -13091 154257 -33649 -306484 -20039
22001 68595 -53603 -17566 -72812 66211 -76955 -224966 -83383 -225573 11535 134801 -164424
21989 41483 90897 -278456 -8504 184158 -25292 12207 192589 -46360 -77410 154124 -110050
21977 -435106 -47247 -115169 -126065 -305125 131105 -60861 218255 -85279 -374445 41251 -177065
21965 116839 -26399 -96074 38365 -16625 -228648 -367818 -98167 219621 52687 228171 -188427
21953 -243481 -208871 -71480 135958 171720 -316645 116041 -206831 33858 23292 -86829 -114494
21942 -114494 155449 -74066 198874 34826 -65912 -75940 -258098 -194804 -31844 128015 -17182
21930 -163302 96522 182627 -8267 -38533 141225 -256794 176504 -22280 -276352 34823 -37344
21918 -224734 146584 -126394 6653 73509 65522 180343 14145 -7475 215294 -24650 46961
21906 93558 -213738 145052 284183 144409 -272842 -87419 26366 102095 -289728 264298
21895 -359277 -94391 59314 -26385 184280 -156288 -355205 -224301 -178157 48043 85491 53749
21884 53749 -132874 -5927 9974 219135 -50187 78401 -68131 -24191 15337 -164797 -1729 18065
21871 -416798 10202 -155635 -64950 -6811 -72477 -252460 77638 359145 -50025 88895 315356
21860 315356 73814 89215 155417 270035 79547 -65938 56979 193530 137099 136357 149161
21849 149161 190001 -119832 -173063 -237612 -777 -52114 -132 -2484 -130893 -275764 276477 184023
21837 184023 -129909 102070 128691 -208357 -184107 -172973 -126562 -129389 165959 -87586 -260623
21826 -260623 -384546 -275950 -375731 -126170 268732 -26230 -426083 46138 74292 227290
21816 227290 60462 309691 -311218 -150062 31200 -7483 151598 -28488 -29531 58980 -146414
21804 80612 -102876 -247938 -46759 -94749 -63729 -224353 132205 -40042 -126451 -66803 -106010
21793 -106010 67635 -114711 -325419 236749 -266615 234401 -23627 202216 -25090 142134
21782 16506 45164 38318 189291 -31299 -273588 -69529 -117363 26626 85996 15798 59294
21771 59294 -47696 -184880 104022 359636 -43260 -56749 366570 52596 128500 167564 -42899
21759 -67587 -175289 -5625 84079 -72989 -100803 -56256 180168 42859 -155662 153288 -304581
21747 -144297 -191633 -69977 -54761 -232059 -62805 101245 108968 102374 -28752 -139497 -37495
21735 -340144 57966 -86958 -32268 -20798 -112153 -85197 204585 -58487 -120896 -71877 -89713
21724 -89713 334454 210796 145007 -45266 -97545 57777 356361 61912 10412 41783 -63843
21712 9918 240981 -53160 -176177 -157557 114267 133204 -77005 -26085 -96477 122774 -256694
21700 87105 77261 51459 155480 -149876 -144251 -18947 146926 23312 -375090 -59177 -80956
21689 -80956 -252883 81007 -210576 -69161 -17314 209849 147942 -143814 125697 -36301 -346111
21678 -346111 20006 -89109 -207307 217824 -105539 -29818 -191182 83339 37622 -281305
21667 128842 -442642 -298902 -244665 71103 17574 -189152 122330 200103 -424217 73938
21656 -45899 -14766 27969 -87318 -61141 -109866 -66721 -34527 -45505 -285678 -707311 140687
21644 -211399 139817 -155634 -38594 -63071 -239681 78352 201943 310787 154545 -84467
21633 279637 -203272 -43642 16870 19800 -113158 69625 -145464 68257 -440957 -33531 71827
21621 49578 -36154 32576 -158883 -332498 -1551 122265 -35900 -143841 -225349 -100966 203682
21609 -151691 37666 -74732 -14963 70957 166022 -116316 -142667 -60958 -187857 175862 -13147
21597 -128641 -187624 -203897 30989 -112690 -144890 -99122 -2962 16121 -204398 -465493 31038
21585 -98409 -99099 65272 144666 -176461 -291417 182062 -108902 -86923 -54173 108142 -168264
21573 47208 -86129 51999 64184 26488 -213174 41188 77233 88090 -120679 102021 -480517
21561 -170236 -52906 -5420 -399479 196507 -35421 -254990 -125099 -45376 7997 -296297 181684
21549 65902 -566548 -109000 74204 258383 116404 -89414 -116352 -12645 34113 64282 -239437
21537 155182 -154867 190083 298690 -67320 -83673 -331980 28861 -133291 -162363 80859
21526 -79505 243437 36106 -444098 5176 42479 -188398 261049 -96876 -151087 -188727 -223012
21515 -223012 795 1254 -183472 208599 -179221 -42046 -129846 -644 55027 -151842 86897 -262874
21502 32717 -184113 83737 -66154 -350326 -311258 97408 196511 200569 206235 -240915 -65069
21490 -36043 -149680 -12486 172224 25718 14319 2855 -143390 -129924 -150372 117945 126978
21479 126978 58990 21772 -325569 202496 -131849 112684 -117560 -272639 28143 260452
21469 260452 358799 897 203835 98408 -568880 60263 -86970 -198246 -20139 -243651 -90093
21457 -162747 71522 42320 76692 -253306 -197735 -64082 66595 154208 -70566 2002 191138
21446 191138 58170 -136412 -288 41765 -188768 -184984 128474 -169480 71568 176535 369918
21435 369918 174489 166409 168615 55423 -214876 347234 169823 79042 -9500 -142525 8913
21423 -126647 13696 80000 154227 -219783 -351619 58719 15977 -109395 -240730 162868
21412 84594 -298062 177357 -38912 410998 -246893 218310 -238246 -311062 -50252 -289307
21402 -289307 -342581 -29944 -87225 -40932 83194 -203276 67222 -300381 -85632 -45068 -307990
21391 -307990 215921 -180258 -128060 -9859 29699 309546 -61654 55149 -106634 -84798 228782
21379 -50279 -61726 126297 -503686 161144 -114940 59308 339038 -99538 71324 49568 12374
21367 -300025 82041 -23796 323748 121 -19587 -94868 -226300 60278 -64309 151458 -182104
21355 20916 -295315 115984 -132202 45945 33275 85851 -41169 -17295 -103019 153234 231307
21344 231307 71293 -6912 -84126 -132505 -9838 -265639 -111118 -65684 77804 -233564 17620
21332 -105560 75293 317772 258691 82135 -68650 -72906 35440 -416891 -173024 213551 -59712
21320 283501 -234795 -141988 -102015 -180694 -145009 -41669 56486 -59832 -118637 -406970 -334442
21309 -334442 -342581 -183127 -20725 174671 159214 -98817 -32820 75795 -207921 -399448 -75253
21297 -84961 166566 -43186 -177964 -235826 -158024 -26636 24478 -151855 267584 151790 -2297
21285 -43347 104379 -148125 135953 -63215 26538 141722 -284548 132041 -40318 67458
21274 290826 -265606 -240670 186288 52571 -190840 -535374 -21089 -58526 -140075 -108356 166994
21262 -197689 -189464 -340763 175960 -281189 -174147 -171889 60362 301303 131317 -38048 518356
21250 160953 -105899 -52355 -218974 -178080 -88246 148078 -101974 55836 -90385 -294324
21240 -294324 427905 -54471 -188674 26962 -114199 49734 348717 -183480 38406 -221432
21229 110472 -186492 71662 -96533 -88599 -60660 -67684 -202218 -323625 90507 -93118 -50740
21218 -50740 -15131 -326534 309844 -132007 132471 -143951 209705 203000 -20400 7816 -170160
21206 187869 -503717 -128051 111638 -258570 -47069 -65885 146773 -255018 -88829 -199518
21196 -199518 -79256 -41682 292959 -219401 44155 -203817 -61568 88134 -224252 -187993 -101066
21185 -101066 -95044 81871 115355 -64544 -275223 -384031 -127017 185168 23329 -34470 -34596
21174 -34596 202373 -14649 -143527 -124894 -134932 -239068 369 93414 -46506 -21595 460036
21162 -57583 -313276 -39417 -445641 60513 -276744 71252 -92758 58202 -89514 128547 -202791
21150 -5153 -232304 -140882 -66215 34403 -113751 -234477 -355272 -122435 -256429 -86691 365384
21138 106581 228353 -147879 -95156 -88033 -213128 47364 49700 -86621 128002 309120 -52084
21126 145041 -95482 -64005 -36876 -188619 15078 34217 22598 43882 -342284 -407336 -167396
21114 -184727 -120182 68493 -229262 -125306 16448 -219292 112318 -245911 -207732 -58323
21103 271361 -37114 -415797 210291 56222 345447 74956 94993 -121638 -187536 -140090 -29601
21091 -103081 26160 -134232 -302592 131633 88238 -60151 138035 3574 -123481 104462
21080 145533 -134134 -145403 89131 -120526 -299982 -226262 -211335 -20842 83604 102236 -174598
21068 61675 -139140 -197802 -10442 343452 44204 116761 -10661 17569 -400902 -137625 131512
21056 -167454 -182167 -215655 209104 135773 -92052 49883 263205 91245 54279 213043 -149442
21044 281377 -194649 82075 -53374 182765 -160443 97698 -197841 -18802 123446 163463
21034 163463 60626 262936 -133197 104243 29724 -105149 -383061 26648 -14580 83907
21023 -108282 150015 101407 -140211 -12387 -62524 71525 -246687 -163410 -122092 -83944 -114520
21012 -114520 -210629 -79268 124855 -99638 -43853 277244 148243 -443097 -40166 -157837
21002 -157837 203150 145481 -170231 -260119 -136475 -436901 -106493 2182 43913 158763
20992 158763 49323 519846 -154122 -281147 62986 119716 -34608 -101296 -145535 -106924 192186
20980 -233870 124982 -29976 -154024 3668 -55229 -247457 -213873 -291960 264191 781 114054
20969 114054 -319659 -101625 -157060 -48529 -45843 -106058 -266103 -142006 -162139 -238451 159443
20957 48717 -313686 -10114 -101921 -119297 323055 71394 -126002 -60162 261472 115575 385437
20946 385437 88683 -127124 -335853 140330 -72049 15801 -152190 -25528 -133340 145765
20935 -177210 -82835 15215 63704 113816 -250773 -364391 -51622 66983 -142723 -267498 -87267
20923 148978 -216357 184556 -50182 -22656 61097 -285967 -272268 -366927 116780 40588 55958
20912 55958 -249781 80671 -142018 -25966 498195 137121 18541 -189079 52052 298507
20902 298507 -69078 129475 115107 -96528 -310019 157170 68411 283686 -43405 -161030
20892 -161030 54462 -122117 -43435 89705 -193190 -174734 -7463 172549 223095 -186521 -63990
20880 -250956 244791 -18551 -142865 -81017 71103 64729 -47229 -159975 -104515 229644 -253017
20868 -222651 -169929 -132453 -141583 145156 -176461 -249255 -194848 -170148 -403405 109808 -56159
20856 110081 -14418 -125805 -107375 -56498 -59813 -81048 325933 -139613 48475 -176669 -158560
20845 -158560 -191158 -100359 -393452 298178 94946 117066 168359 -90262 -403402 -264332 -150016
20834 -150016 -148926 -137079 -138940 68188 -216010 71187 -511644 -308478 -73364 114414 111410
20823 111410 132738 -73328 -135573 -300218 -372060 88341 -122508 34767 -42248 -24607 115788
20811 132467 21185 -82606 -350183 83178 -101944 -144038 -127567 22941 108308 272525 356637
20800 356637 127705 250821 -42681 -66760 287845 -166777 -101076 207300 -243005 -93086
20789 -289381 -97914 80973 248284 -20323 384261 -285550 -57833 81805 191716 14181 -231028
20777 -111616 78042 122091 -108409 -37565 -243033 65441 -141571 -40236 -178387 -88653 -137158
20766 -137158 -286960 -98122 -127423 57614 -267166 -102274 -214796 209436 -178986 -233058
20756 -233058 -193162 -117422 30675 176813 -77493 1505 105635 -121107 -95579 -368276 90357
20744 -33453 344478 15370 -509460 -167265 79578 -207230 -256387 -115857 -92214 33016 -157493
20732 106890 -26045 -124137 -95453 -163588 -40133 13221 -34965 237884 289032 -17573 -298538
20721 -298538 140721 35317 394852 -244044 188579 57865 -236459 73264 -451853 -83398
20710 -293126 -122952 -82652 131170 170198 -27637 -109806 -56579 -139761 298669 175151 11462
20698 -3646 85369 -193506 221486 84224 85791 58745 -93236 -112910 -268148 -112517 -584661
20687 -584661 1593 -173487 -239164 -433779 168702 -90698 263388 139896 13828 30280 -50526
20675 -138094 139766 -18443 -383816 -406503 237958 -288332 50569 -304696 -80247 -140877
20665 -140877 -27585 -67885 -339804 -76756 -110830 -33160 -137286 -321278 31022 -110885 -31377
20653 44760 184720 208728 138582 120580 -56640 -36156 407662 -209311 -43158 125063 -62421
20641 -234854 1063 51049 -124786 -250532 -84533 -189933 -98309 -399770 93179 111681 -90248
20629 165050 -124668 -23084 -147428 -142793 126378 -158319 -363759 -14833 -141599 -61928
20618 -96215 195929 -141258 -70387 -113715 -158858 6238 137577 21999 -230572 33152 350018
20607 350018 -112959 26475 24935 -78599 7748 -77978 -127410 102032 -96496 -117756 24037
20595 254626 -152942 36924 167303 -294051 -68669 -102479 -100568 -228608 -103962 10445 193180
20584 193180 174014 -107440 50123 160799 16898 -131941 -97499 -92512 142474 69808 -137005
20572 58194 -104066 -140941 -49399 7964 -71896 -301614 -229876 -143794 -250178 -349140 -52767
20560 -52599 -67614 -156346 216911 169576 105971 123829 -209308 -366238 -293829 114849 31956
20548 49061 34125 -171779 -165372 173941 -240316 181562 24601 -245005 -101623 -69987 25433
20536 93233 115122 145910 5376 165672 -128028 -86024 35298 166661 -52460 -100174 26345
20524 176333 -326025 -146553 -238191 -249685 -102007 -163520 216202 -245975 -59155 238480
20513 32246 225078 -198285 -23221 -140066 -187863 -260979 -240359 66008 239846 168004 36448
20501 -286001 339134 -216668 -107128 -98320 -129098 82345 -96269 9165 -89969 127170 12042
20489 -194261 188519 118482 159682 -218227 -51880 -116712 24893 -276818 91600 215223 -93628
20477 -96846 20917 -32163 -253017 248397 -152828 54558 78503 -105060 -48969 128149 -254387
20465 297922 41918 73713 44015 126592 -90029 115507 -87078 -260469 390939 -124162 -101922
20454 -101922 152895 257320 -168866 -242355 169920 -23352 39712 -62086 -135156 221311
20443 -28852 -141789 93255 -164642 59573 70626 -116025 -297590 -313950 -68291 -206663 -98455
20431 -143944 -114201 -162660 -24757 -135623 -147246 110687 -37471 -315967 -23537 48511 106534
20420 106534 -22062 -252178 223136 60276 -24039 85531 113352 376514 81814 -255717 -82743
20408 -152697 -208309 -1988 -115387 3386 116857 -48064 -171122 -175085 -366839 9417 -237379
20396 31605 52314 -331946 -195610 227110 -282087 165 148693 -284429 24538 90085 -40717
20384 85928 98901 234921 21178 158960 27536 105401 -103603 230450 -133275 -104264 274986
20372 -134066 -57567 -190381 -313269 -194476 -211999 132841 20267 -58759 -54166 -461181 -53803
20360 -630786 -157885 150784 -246900 -217476 -98357 140552 -22825 76780 -235646 -67282
20349 -227714 331669 -59880 28422 262427 -127365 138399 -51152 23958 124584 -5993 36852
20337 -135097 -229244 180086 57372 -244632 -37266 266771 -193418 51757 -226939 -98342
20326 43495 -52334 -177393 -146847 13795 238785 165127 -368662 39761 -1276 -176151 140107
20314 -127420 -200149 -352303 -249649 -233399 -105670 97889 95611 111193 -89012 -265602 -148003
20303 -148003 -1744 67388 -52602 -233747 145173 -12721 -256010 -381502 -88859 174375 6506
20291 -141282 -348271 -173758 139187 -40868 -92802 -40823 124248 -249058 -80435 199510
20280 -28445 54221 161011 -233954 259974 74158 -10266 -232203 48686 -88691 361545 -131372
20268 97115 -64521 -126913 176203 188678 46152 -80277 121929 -206825 -135108 -63256 -39074
20257 -39074 -76591 -15328 -14197 -74715 95328 -79692 -220903 118147 110630 -155945 -64192
20245 163598 150420 -128285 241027 -266275 -39737 -311184 -227544 22781 -89216 18598 -11235
20233 -233812 86744 107011 129195 -499457 -77137 -190251 -283193 66529 -75945 89595 -177166
20221 87504 -328254 -171982 106721 -112933 107163 170390 -28262 -81426 274599 -354573
20210 -177690 -120883 -10817 -82395 25932 -179687 -240877 -38970 261434 208153 76813 -153024
20198 -63708 137778 -38070 -151051 248672 31572 -232239 -250138 188945 -395325 -177353
20187 75473 -33309 286550 -36028 44942 -167371 -45975 -35442 39170 61889 -28215 -107601
20176 -107601 -66291 221367 -51555 219950 304865 -53727 -219734 -172295 -293012 260550
20165 13167 -2834 -332614 -156370 -202170 -250303 -453673 91528 -262479 -28575 -195165 130415
20153 -92626 140622 -68450 -198069 463456 170662 -33220 61072 -134868 35598 -38684 -56933
20142 -56933 103112 174384 -188329 -286061 374779 -65139 82219 184465 57816 -10934 -909
20130 -44336 -119895 -122381 146974 205458 6258 -13197 -96471 -248934 -157749 118236 -258908
20118 212547 34322 124546 -279536 -337277 -320550 -375917 -292154 -172468 -335088 -15049 85988
20106 -10666 -12700 -337310 -186890 50844 9639 295782 -19797 -208205 -48929 -76774 77577
20094 162027 -642522 -218089 99722 100454 -376073 -225169 61279 -159620 -4275 -99940 -155101
20083 -155101 120965 -150978 222261 52409 -24768 -289399 53050 -141562 -88488 151243
20072 -125845 176705 -106276 -257631 170887 64709 42379 78632 188178 -31385 -126857
20062 -126857 -63839 -353917 64155 77639 -255466 47484 31361 199514 -107172 -196166 151060
20050 106147 -276950 -143478 -65868 -272206 -359027 -124808 -171712 34727 -49802 -77300 -308251
20039 -308251 -105614 190150 6308 -11003 150048 27185 -236413 -338237 -130721 -24004
20028 -266073 181327 120933 340494 -24472 17556 -83973 224476 -431198 140258 -74662
20017 -302144 -79796 -126603 -76655 -263564 124274 -234706 -295488 -178107 267072 271824 -61826
20005 -104953 205151 9588 -41196 76072 141591 -312588 42782 70844 29911 -259506 -193266
19994 -193266 371168 -66166 468924 -64487 -101317 -257541 251316 -72133 31809 359247
19984 359247 -55902 -82354 -64804 114284 -17836 -125587 178906 -271275 -298698 62512 -152219
19972 8385 -119098 127767 44726 -143648 -37070 -399593 -329239 -27790 50337 -169215 56629
19960 -322917 -253062 285125 60823 -267612 233384 187094 428654 -208637 -131993 297681
19949 37176 209478 -81333 -249435 -274492 71464 -138070 211762 -51981 -107614 170916 -85547
19937 -138825 -14776 -437462 -154813 -377973 -107223 166353 65753 275766 573 14647 66420
19926 66420 83690 -143433 -54859 -16259 -238800 -70799 247161 -236996 -167222 -69250 77706
19914 -276262 -29857 -199446 195863 -99131 -144155 -439836 49940 -227321 -273500 -27485 -41749
19903 -41749 -253382 -227625 27736 -202387 -55534 -98563 -239087 -50971 -185947 -374297 -83395
19891 -116965 -95408 227353 70162 80837 -356126 -71075 131617 -84757 -104781 -24307 -38144
19880 -38144 328828 71290 -133027 117540 -160041 -33566 -51469 -129068 -199094 -227455 -211213
19869 -211213 -13542 78933 140587 -164448 83147 5815 55274 168174 295422 116513 -235119
19857 -4643 -165610 -266570 114330 72901 154827 -159882 76085 -19522 -68951 174335 -171817
19845 142291 -112772 -217899 -302065 -77719 92091 19328 -207578 -46873 -160163 -289926
19835 -289926 68673 -153328 -122921 31273 90867 140957 -301092 -5598 -80315 -137185 41773
19823 -280715 -455959 30046 -109338 -311560 58677 161757 -255834 49758 -210779 -141603
19813 -141603 -39188 -135131 -367670 -17117 72077 -261388 -157867 174798 -80466 -258252
19803 -258252 -144674 -54471 17202 -102274 -11028 53934 -96725 -246697 292147 140432
19792 -189805 -123936 139671 -11422 117781 47968 -133832 -244765 -3315 -138020 -103599 37364
19780 52493 -86076 -191648 -117409 143751 -60798 67244 8554 -214705 -229570 -20689 -15032
19769 -15032 54986 -176246 -1494 121165 -95155 -129534 170902 -182453 -56166 -248570 258907
19757 189173 -420107 -401372 -64316 -59074 -37017 222672 -336594 -84234 -317906 -195096 -49298
19745 -276686 296063 -58552 -32337 -43025 -73527 190988 12459 -478874 -144052 310767
19734 282346 -154173 92851 40076 -282351 -135752 -270011 161798 -390145 -73521 388536
19723 -195130 106657 117581 -20915 43745 298357 28382 126683 -12544 -95128 -135261 -201740
19712 -201740 -26335 -139767 -216693 -1615 -191322 -93453 -63805 -149121 -86097 -90825 127648
19700 -170511 146328 9455 4027 -149438 -5209 163044 224930 -168560 -95325 -71755 -63390
19689 -63390 -47333 90459 -60910 -203054 161098 123667 9235 -29006 -233540 9946 -232635
19677 144198 -190738 -50616 189744 -147437 -155383 57314 -213537 -169789 -160677 110050 40219
19665 175334 -322245 -260877 -56936 -59613 -79091 126177 310103 236749 -89039 -70900 -299167
19654 -299167 273908 -168965 -210870 83922 578 -36984 -176218 172940 -116387 13403 -222246
19642 -155819 -38737 -146030 -8316 -67244 30563 135538 -242435 -33969 55334 83268 226194
19631 226194 -18967 -143219 -38197 -453476 166330 -49440 41143 40030 -189657 11407 -140162
19619 -63825 -196075 -271131 -229664 -55160 398953 -323810 235023 69704 -141265 -261900
19609 -261900 189301 145050 289751 89593 -216158 -282743 -158158 46233 -280666 -63705
19598 174227 157876 244116 123288 -183730 44469 -145096 -189522 -262548 163819 -242118
19587 -251609 -411172 105527 -42788 158449 31742 -204590 -218601 -350441 32764 -121062
19576 -126757 166389 9406 -186119 -6695 -214245 -17112 -93512 -219516 -115103 -301966 -109080
19564 -422334 -275536 -117624 -138719 -91295 27709 -145964 -316534 26304 79572 -36222 -421404
19553 -421404 56693 -429545 -70271 -194128 -271998 -240431 -167172 125743 152292 139430 61400
19541 -19553 225501 -79789 -136336 84111 -151213 -415621 -62577 -124957 -40579 -325598 -9858
19529 216764 -198476 -40195 44570 -90181 -186185 -59239 271218 106784 77918 -144031 -159119
19518 -159119 -112054 110666 -75098 -409876 -159350 -267268 -31134 92081 -100069 -95331 93474
19506 95067 -114345 -202369 233998 -198009 -255884 20176 -83314 87807 -476064 -17904 -3264
19494 289309 93741 57587 37919 -320883 -432180 -50616 -144995 112799 -147787 -89753 120028
19482 -74536 229817 -416473 56010 166624 51355 -48256 117824 153282 48637 -101308 274737
19470 -61078 -34872 -9466 -123035 -22583 140391 -76643 -526971 -313697 -177968 -151676 -45316
19458 -322746 -335444 36152 -62757 -81268 176806 -100580 -83113 -268510 150053 -260262
19447 61902 -7963 -209861 25438 -95479 -1100 10687 -144921 -253671 6717 -143605 3796 -57340
19434 -26122 -147923 -47388 11411 -69576 -67142 231915 111029 -63832 -221617 315207 -248710
19422 232386 -168138 -144513 -176443 -153951 215713 -1344 55036 -76555 182427 -349228 63075
19410 26498 -301739 -122450 -77080 -145096 91415 -83690 -107783 96939 -159141 -174417 -228417
19399 -228417 52564 123872 -167232 -220114 -280248 -164709 -231513 -274820 138176 254234 -131577
19387 -6497 18491 34118 119488 -22173 -340434 95264 -248813 59458 80598 -211073 32157
19375 -61945 -208326 -321192 3998 -9077 29523 -199678 78873 -34757 82140 -44882 -228735
19364 -228735 -128887 239945 45926 43437 -153925 29645 -166105 10651 -281173 -358197 -150247
19352 193295 303931 150073 -235167 -199044 -224589 -277351 -24712 -12924 -21631 -36012 -80615
19341 -80615 -385646 441320 -94271 94675 -150505 373134 -352950 -60494 -23207 148260
19330 -264177 -114160 -208484 144763 -120301 177684 190052 -5029 -307949 35998 -177121
19319 242062 29269 6024 108134 -16709 -202329 34856 -28511 77299 -355075 -41822 431096
19307 201693 50166 -73904 -23904 -35884 80262 -197684 -129391 -122202 130424 123924 -38616
19295 -298338 -57010 -448158 -95836 83266 210312 -54880 281478 -137257 -132007 -11975 -16272
19284 -16272 38605 186259 -59371 -362078 -195040 198956 -107240 -24641 -220024 -277166
19274 -277166 -52735 -184958 -236411 -192158 28580 -58763 -381947 56170 -179708 -147386 -26408
19262 -296135 78962 -306159 188045 -217783 -325287 63652 115474 -306430 -136977 -72750
19252 -72750 -156223 -166868 -253890 -208332 27423 -128642 70196 -198770 -102879 -32640 91781
19240 4964 -186523 -166430 267887 41152 -283906 -160477 -192706 -301475 -75203 -26070 238726
19228 -453439 -174297 -127743 128573 -58120 113511 187074 12037 -280786 -346398 -128451
19217 -153362 93512 161427 55306 -177662 366992 -168167 48442 -178945 -177881 331039 -198515
19205 -216775 290187 -166861 174073 49738 293875 -62776 -67926 -179489 -218335 70875 -27363
19193 -209903 87007 9261 95418 -148908 -17785 -99038 -55273 -358377 393962 -69487 114801
19181 -22606 -93795 -3222 151390 -17917 -208069 -2321 8872 132318 -85355 10753 47676 239608
19169 239608 187128 -255941 71237 114063 -23422 -1223 143497 -91002 76193 -14289 128110
19157 -91695 22200 9639 -357379 -12800 -73094 -302272 -59387 -122116 -306637 89906 247596
19146 247596 172462 -48551 2425 -89534 190397 -326698 -34154 -113825 29426 -289990 -208281
19135 -208281 28475 34028 328541 92866 -466513 -90966 17240 228811 86665 231889 -229835
19123 -392180 95051 69476 -23923 225660 178242 10038 67979 -61280 244692 -211141 -30831
19111 -167759 242462 -94909 269882 152522 -184382 -76465 126405 -84704 246229 -109718
19100 55734 -111313 -308942 -331824 -269457 -121381 -315750 134837 -99914 -120061 -21505 -257774
19089 -257774 -219706 -137466 -87350 100601 91650 -290561 -88657 -21455 138212 -86680 52467
19077 -151726 12297 -7587 -165297 -159710 128978 85046 191714 -138078 -133484 -52180 129597
19065 -145354 73456 203339 -318013 -147483 180897 -30211 -116480 -277237 433338 -86189
19054 -31685 -249780 -394652 -36276 -194614 -139418 57308 -34267 -266905 -120835 229402
19043 -30718 -117836 325508 -444448 17476 3559 33995 2715 -11847 -282713 -138375 -89379
19032 -89379 175683 -32582 118796 -162769 28907 20741 -207674 160753 54902 -37274 70655
19020 -141947 -150196 497779 308337 99921 39189 223 -167826 391597 176201 142670 252679
19009 252679 -8971 27335 -108835 36867 -56296 -141024 -196469 -192609 51273 -136684 -100555
18998 -100555 -232752 174610 -107099 118506 -149962 180660 182041 57246 198632 102180
18988 102180 -111205 -10644 -86973 132914 318835 -40810 -362900 -521258 -408204 40814
18977 26361 52017 -24496 -96042 -243134 -71520 -333814 180277 180368 -126519 20742 -108207
18965 311193 166580 -139464 -160982 -180308 -166574 -102707 128073 19184 34072 -7245 -292819
18954 -292819 216062 107612 -441726 4110 -18998 21608 116604 203316 -57230 -164826 69817
18942 -181702 -164965 91093 104082 -177427 -98938 -138856 -19212 -70257 -114010 23471 -84040
18930 -151078 77666 174788 48059 -180469 66021 -128760 -95478 -303685 -46381 -61602 90651
18918 163296 113449 284458 -211729 -314366 127002 -159767 -183967 125423 413123 87313
18907 -277467 -15680 -135556 -174488 14429 -24582 -87503 -53355 496 -305955 233276 -84308
18895 -171528 394800 -70424 -218633 4246 23521 -394273 -22809 -238156 127385 -88399 -34206
18883 -121504 4882 -468082 -309208 -100313 -132303 -75131 65294 -197804 119756 94462 -176738
18871 -116767 -68868 -294691 68880 -236438 -231922 -9995 -59718 -86587 75457 -75604 94527
18859 51597 111398 -13726 -40665 -302604 -102902 -56831 85798 71649 -76424 -134619 -134991 191794
18846 11454 244709 -160342 143018 -181424 -46922 -118801 -175025 166210 -228630 -151261
18836 -151261 21920 26590 -129230 -117943 212942 -102454 -288242 -139477 205064 -350826
18825 -130266 27340 207996 -74000 -263453 -77762 157089 -52453 89387 55558 199220 6215
18813 92936 -336961 365822 -160783 138531 7114 267494 202610 121614 -2288 71935 170257
18802 170257 -64212 -25517 -96504 51830 122178 -160980 -205974 181515 -225838 80486 -9651
18790 -161453 -108466 -5200 188227 -43814 -123381 216941 133775 99750 -126042 88511 58740
18779 58740 -100233 -164841 -109861 78977 123579 -102037 150255 -5706 182093 -388488 -319641
18768 -319641 101787 -202157 -149946 128471 70340 -56800 -147461 -165326 18933 -58845 -340645
18757 -340645 40161 33084 -115285 -32584 -189477 -178524 -396499 -389593 -19522 -165099 -40070
18745 83748 -183301 -128851 -20476 -72172 -293822 -182249 8079 -86945 -316633 70810 -46532
18733 -120401 -76353 189768 57886 -110122 -206903 -195027 -298823 -226748 -323405 22067 -35288
18721 -141772 -255607 -132136 84293 59118 286694 -227978 -473061 86125 -207538 -46563
18710 54202 -178441 -131099 31777 50310 -87191 42768 -326151 66702 -29566 -53352 59015
18698 -112115 605807 -60962 -353207 -59327 -157084 -11027 -150169 52043 48989 434054 -370707
18686 27875 225781 -308431 179830 -25346 -151158 -15317 -132136 311531 -341313 151835
18675 -55038 56352 -114671 5580 56530 -16715 172589 -6746 12733 11709 -90058 84130 -319977
18662 -48554 -226193 -503070 -234970 -142177 110697 -30767 -111105 250275 -164029 200854
18651 -82970 55694 -65274 -179225 37566 19143 -27186 198690 -219677 -60918 28182 -81058
18639 28506 -65514 -91890 -278638 -263335 -378468 -252873 -89492 342326 141434 350877
18629 350877 -40706 184443 63191 -244660 73281 -241387 24508 -88007 -181947 51321 -290374
18617 -290415 246052 -2934 -133395 -10457 61049 -72974 -8210 -227189 175943 -54288 18182
18605 327232 -232449 -9027 255354 -130420 -13088 149713 -4636 -181056 -273780 -142467 -137261
18594 -137261 -47501 67458 -74458 -433586 16073 221682 -241394 104755 -281546 -47525
18583 41458 -97690 -225822 -52814 -180620 -15048 344328 127862 170052 -102257 -203836
18573 -203836 -137956 4511 -76988 81892 -49980 5246 115504 -169278 -178895 -110740 153958
18561 -203220 -73761 -291708 -227902 -27749 -236661 -116460 223802 5788 -129725 -101975 -291177
18550 -291177 96865 -32301 -169342 -266844 -178875 -393074 -82034 179993 173740 -28776 -157938
18539 -157938 -45961 90850 -95488 -310522 -22613 177929 -66274 106195 -372904 -164379
18528 18492 -270363 133438 165731 -80656 -174637 156971 341466 -59407 238689 -274932
18517 -476405 -104108 127251 56766 250888 -311736 205511 -127370 -157447 -467202 390585
18506 237334 -222232 -185845 376259 -170005 -182479 28440 -66415 -222073 -91011 -155099 -162264
18495 -162264 -128350 43345 -325753 -281710 -79364 -115404 -346827 -10508 -225621 283676 75729
18483 114535 247164 76163 -67348 124909 146139 134827 26889 -316343 -187982 31571 -98442
18471 -171248 -177861 -84015 28176 -122261 -77534 -215341 296316 75589 -158744 -108363 -219267
18460 -219267 238002 -131411 -56964 -20337 -28043 -128224 -240261 -133954 -179741 101474
18449 -336132 -153106 184165 -181237 398178 -127653 155849 -56027 305595 -344225 -317834
18439 -317834 288550 -85411 71331 -122894 -33553 12452 -49818 20531 64002 213573 -61957
18427 -127311 -73159 149083 169131 102233 -138980 -76055 -365957 67665 -187630 -40767 -479873
18416 -479873 137427 -181443 133414 80278 -240794 -152034 -232760 -119975 28629 -29217
18405 143610 13872 254725 60966 67874 206913 170974 -207435 31097 -515918 -68458 -21673
18393 -301265 -19306 69313 239033 87338 -88287 -58907 -146488 56525 -107066 136490 -308258
18381 6668 157355 -65107 -222338 135566 -88033 -91148 -395445 394458 -244501 -238220 -145376
18370 -145376 3493 300448 -346577 -180190 322278 467984 -66824 50222 -66104 -185610
18360 -185610 -130843 -54048 86946 -183812 -180306 -57612 -128190 -83170 85831 168422 -384583
18348 104846 -221341 -420611 222575 -186752 -56028 7975 82467 239394 -268997 114395
18337 -158068 24470 -192312 -8237 271614 -110422 133783 68603 -482208 -20779 223786
18326 74034 -382185 336294 -148515 -72650 2399 176203 -145711 -129455 -104214 -58138 52138
18314 -13274 46034 -216372 -292787 -51879 -204593 -99232 -34105 12156 -145473 -115504 184797
18302 90935 -270765 -217777 -221557 -114295 -74235 300492 -228934 306944 -216452 235739
18291 1169 -126389 29970 -111038 -87708 -87326 110128 -91513 -90816 -175202 -325030 38104 -104395
18278 10776 -68835 -17065 -346678 224273 -82676 -66943 294743 165302 -179952 -85816 -86278
18267 -86278 330385 -172574 -322052 149502 -196122 -284755 -157856 -69099 116270 149516
18257 149516 149114 -85369 98956 158632 -29540 84607 20790 -110140 -30629 185311 50135
18245 -44330 96107 -150257 -297418 -184244 -228539 -17437 -314040 419338 402711 -295600
18234 -87690 -48338 -411002 207288 -2236 11172 164052 -69119 -43980 105639 -187100 -51941
18222 -39026 -20468 -231346 144229 23959 103304 242200 42415 155468 -254863 3550 4355
18211 4355 -132746 -135131 -192051 -3710 -207497 -437398 -153902 -77287 82763 179858 25345
18199 -90712 -196851 157723 -75419 -31095 -30488 218190 27531 -133996 29929 -140884 33595
18187 -119453 105265 -181994 -100673 -113715 -161796 81141 -187902 -7014 167401 -161347 -226408
18176 -226408 -81302 -95106 -135176 76420 -56772 -53577 -10226 124069 -195717 23522 -248299
18164 -158831 -280568 -34827 107639 -55774 205205 -226041 -206212 -61672 78860 -50763 106769
18152 128958 8844 92663 -248770 489108 -312141 146172 12092 -251751 -237355 53966 162931
18141 162931 -188828 28701 100400 95637 275352 -58592 194706 -102155 -359977 -150382
18130 -55750 -23946 110096 119512 -134056 -141623 434268 -315386 -171603 -210841 144276 -105745
18118 209797 -211217 -128039 -24326 138121 -367189 192418 300649 -35792 -104269 -349055
18108 -349055 -476816 -30831 52823 -87163 -195380 -55061 -213551 -55819 -136006 -394654 -210209
18097 -210209 30497 -196460 -119240 190892 -155517 -22434 -247361 -205219 -130970 13620 -8563
18085 -208804 37904 128824 -207963 -300512 -36086 -157448 -41894 222859 -100830 117569
18074 -127405 196005 216723 215289 278306 -32129 -24193 -204792 -97328 -38614 -22814 88822
18062 -270624 144457 -178650 28387 -53107 -9570 207650 108631 -123382 -349351 14217 -133652
18050 155715 -197451 -264805 180513 -243850 -271360 182295 189448 382918 22778 -37460 -413117
18039 -413117 -390802 53280 -32393 68887 -279468 -54728 -215717 100653 -94561 -39326 194484
18027 41581 -235414 -283835 347633 136794 92354 -143370 -123891 -17826 -203500 -63331 -46366
18016 -46366 -65003 174032 -124851 -21623 -109310 -81992 13868 154267 210221 -103750 -335314
18005 -335314 -81779 49660 -567412 -326663 -338316 -289559 -73075 169380 43569 -221154 163071
17993 90396 139674 -41379 17402 51972 -2926 1559 229235 -321337 186371 189727 356849
17982 356849 -129298 122659 90844 -486525 258700 -164521 -53955 -222224 170762 17974
17971 318297 289255 441681 -183087 112276 210222 188546 -130685 -187847 -65592 165269
17960 22101 332164 174569 170525 182466 21634 -122899 -105497 -382155 150603 -182695 156716
17948 -159537 -177882 -151781 -84567 316399 -69123 52526 19066 -33841 -66312 -53368 154894
17936 41260 -77526 -19329 -3921 -134136 38149 -37158 -165534 -198011 -112654 -349927 108109
17924 373536 201830 -44025 -14906 14023 289236 13857 71071 -161299 -197717 -8434 -92580
17913 -92580 -285292 75126 -73249 269597 77083 -311305 -55499 -324 56318 60974 -143274
17901 400005 228712 126742 -88028 -84692 -201946 3072 28434 171978 -9917 15012 176412
17890 176412 175861 -322277 161795 13 23067 -70648 217896 157366 -247771 29077 -95530 -275423
17878 -275423 -108228 -138703 -152875 -344635 -154252 88439 65143 -461509 -15173 -238999
17868 -238999 30753 -187125 -234678 -44316 -177680 -250742 -168774 155504 -238413 99759 -76578
17856 81653 13268 288660 275421 -391158 146688 -246122 -187549 -256992 -130345 -51517 -26030
17845 -26030 8710 -110608 57037 -4056 118978 127420 53878 -27394 -119328 -105114 46957 -327564
17832 216446 -36052 99031 354437 -119807 103477 177493 -60729 208808 24897 125539
17822 125539 -70878 211195 -230285 -96561 120782 -290768 130157 -1667 -11979 -284333
17812 -284333 -106406 -2758 161155 -172602 185314 205749 -11853 -29396 -90059 110512 187633
17801 187633 -119971 -92053 -60898 81057 -129811 -9928 -14511 -290512 -280122 13419 135299
17790 135299 -288694 61002 100481 -96435 -75511 -49738 86339 -211519 159382 163392 -222797
17778 -161675 185023 -38384 190269 -42544 -101889 13743 202760 31678 -42716 54647 -62967
17766 99741 -95275 118349 -104653 -68332 91966 50198 32303 -168040 141036 73209 -130927
17754 -273674 32138 -429 -37994 142453 -243840 79300 30489 -289757 -146716 76192 -185385
17742 -226068 -538706 -149154 -51807 351834 50635 165608 -215501 22489 -349549 -245324
17732 -245324 -39274 307248 473456 -347053 -90072 -95706 -108087 -56963 167308 -125992 -46172
17720 170040 132962 114363 -154856 260689 -31364 -263115 53574 -151880 -104741 37918 276629
17709 276629 227613 -169519 182009 -242968 172006 -93616 -225554 3546 269523 100554
17698 126882 205544 232670 -93649 55463 229624 -36437 -3725 -39605 -206758 -17224 25348
17686 -68884 181036 194879 42916 214623 -104461 -143441 59653 -5526 -253529 219261 99872
17674 -157415 245935 101300 -89352 24369 -296795 101206 -226523 320711 -130223 19439
17663 -135917 -75724 134832 -269806 -168256 39973 3021 -196884 -218499 -320521 340620
17652 165850 -19995 -15229 195692 143128 -298260 -42910 -208333 -473367 -193230 -190595 -69331
17640 -1266 -5394 -72869 214993 28498 -222945 156916 25775 165837 -144286 -33003 -13673
17628 -93162 343250 226506 -459609 -24173 103845 -6196 -188545 -47453 -49909 85761 70902
17617 70902 3769 161648 194911 102838 20937 -36280 -1217 -461174 -108865 -143788 -163855
17606 -163855 285348 -319806 45722 -180211 51608 -48826 -240043 -77772 205074 90352
17595 75171 -183143 -287877 287323 -390883 28200 87770 -6662 -78148 -61304 -1166 151098
17583 34524 -62740 90011 193237 73489 250258 104328 344265 226527 46563 -75287 -254011
17572 -254011 -80149 -23093 73899 193042 -3897 -303353 220340 -62990 -11336 17261 117852
17561 117852 157793 107183 -177029 -44080 98712 -153828 -336604 -178704 109631 -40270
17550 135086 -174088 -24231 244084 284628 -274723 211045 -8999 11687 -128848 230864
17539 -20043 -262213 110855 178261 432047 85314 163223 -3760 16633 317110 163012 -62898
17527 -119899 139435 -37428 132126 90431 283003 135617 81771 86418 455996 154830
17516 -66840 -131919 92487 424938 142888 -86770 97704 -283027 -47134 -38202 338745 31119
17504 -182208 -204513 -8480 -151328 -182950 141717 -134959 75523 53475 421774 150395 -110077
17492 -11802 740 159732 -34634 271671 -43629 -353384 11743 43736 281608 332143 231285
17481 231285 348843 164812 393717 331190 125595 165770 53757 9266 14871 -99069 267768
17469 183619 -100656 356861 28241 181972 21097 186201 -104822 31971 150110 12719
17458 -116645 -17655 31543 194347 -3340 175915 162130 428682 131005 -26849 38959 222701
17447 222701 561738 -115142 226336 -257178 -3776 -110686 179868 257225 200946 189655
17437 189655 282788 6697 162474 196536 257208 246890 121269 520845 350722 120882 315401
17426 315401 185663 275814 253310 516750 97959 419666 396563 233875 390200 1485 222961
17415 222961 287016 -82420 215721 -26125 236486 344142 209545 -4548 210872 -446541
17404 172611 23110 -10682 201533 55030 -98543 8588 50316 208643 103654 172511 90458
17393 90458 48570 -107723 62906 106563 275339 -41359 177787 183197 115693 43823 27933
17382 27933 104114 -133221 218343 81471 171713 78273 -228060 183911 34282 61138 378178
17371 378178 -113011 172722 -113957 132130 221305 144061 61549 118905 247035 82933
17360 228481 -340225 53120 320190 152754 -51224 72809 143870 232141 -316412 71261 261225
17349 261225 190631 103582 336995 20266 243155 235749 280952 -55993 62522 228339 169431
17338 169431 259054 114905 -79734 148659 337337 62997 153256 182441 64673 181554 153034
17327 153034 -56877 205910 186158 250068 330267 -73727 302838 13109 106425 -99817 -98956
17316 -98956 250322 -351321 96147 58222 17 152835 334291 237837 82023 5441 399802
17305 399802 156324 146576 26130 55028 75356 77098 -132520 38853 327068 333636 56942
17293 27410 160795 9033 -8611 280118 203785 -29049 236086 88740 86502 163798 4196 -58983
17280 205911 335963 175921 228529 -30497 172004 188794 513967 77083 28046 354013
17270 354013 -35705 61901 93848 25853 155474 -108193 -43841 -90086 -214591 39003 148616
17259 148616 -13067 110815 61267 362892 96538 256927 182765 217845 165501 -201753 271387
17247 -11274 142844 293437 130724 55260 -32496 225248 256176 317567 -84946 337882 347726
17236 347726 228816 334405 518300 152433 275469 332518 400736 290476 178994 81681
17225 131935 18284 240988 102163 -250058 200979 88397 78676 52160 -90116 197335 232840
17214 232840 -74513 91633 131652 46353 352922 22617 161499 567116 -29025 153041 -243237
17202 -31188 -63013 366293 -62820 400826 -101429 144113 287491 -66331 49762 248360
17192 248360 -72002 -75098 2393 185209 291645 268337 296580 219218 32361 124287 363919
17181 363919 164680 230853 121836 134715 110214 100484 87975 311982 208834 415600 105606
17169 24514 202021 194307 71881 84349 329912 86087 197779 72155 204375 233194 235306
17158 235306 309020 337600 339254 384469 204679 322398 287752 248006 276756 175773 480442
17147 480442 120279 169910 163191 559402 260669 390595 142424 141448 -38254 426278 324673
17136 324673 136799 329766 247350 415079 470596 267812 593601 358873 70497 359934
17126 359934 204325 501160 -35039 208463 465643 200049 278233 35945 335864 160660
17115 224382 267087 591151 165154 99913 212089 239466 315189 450514 150416 375870
17105 375870 50944 703553 450499 604241 629480 245180 195034 363801 169606 256691
17095 256691 277049 416199 122588 80020 480508 527708 337735 375256 251327 360634
17085 360634 499992 283051 -3929 734446 75208 359863 298089 212687 251639 208783 283257
17074 283257 353540 468690 474502 399276 341852 70417 728365 539347 248648 161685 184684
17063 184684 317359 651940 555349 268159 284501 524356 578559 645529 436394 357241
17053 357241 203304 576014 337851 107016 43438 418402 519165 479255 501587 362175
17043 362175 161529 581404 392351 448385 243495 558843 256170 718205 564891 681534
17033 681534 576566 591988 309896 604897 667929 558401 845232 222268 607783 287825
17022 631181 411093 363412 591304 454173 433832 363864 653150 468975 726612 655826
17012 655826 480349 561976 596212 346223 432865 481820 638703 669853 684700 600405 659797
17001 659797 579446 664330 407434 774120 604501 661989 549771 539151 701934 812051
16991 812051 597995 830263 477539 672034 560307 556127 621473 1045845 635916 735540
16981 735540 373472 892478 568416 745164 1005232 514150 695312 642860 742654 588946
16971 588946 693913 667182 917552 640688 767054 597001 574708 892845 729093 736678
16961 736678 488712 895931 698689 817672 1047107 845762 364452 586072 779774 876180
16951 876180 886331 791560 702389 1032341 992853 893576 953283 771922 902414 995984 1003658
16940 1003658 1030364 1132293 1069804 1008849 1205132 999761 1462168 1143240 1005729 1022760
16930 1022760 1209940 1172210 874022 1207957 906738 1095267 1212098 1111793 985347 1050548
16920 1050548 1175005 1153287 1343620 998811 1032548 1174540 1199135 1432018 1246480 1164787
16910 1164787 1322625 1575463 1429138 1548899 1158453 1578546 1271351 1319220 1637590 1454728
16900 1454728 1550598 1267038 1462133 1399128 1658325 1551384 1447205 1663928 1597771 1610538
16890 1610538 1382417 1625670 1458524 1767378 1862516 1908579 1505696 1847099 1772399 1865855
16880 1865855 1697440 1676150 1872322 1767808 2089898 1792126 2166198 1967386 1974623 2123381
16870 2123381 2266213 2301505 2158122 2029342 2248895 2246746 2249128 1995087 2222109 2362789
16860 2362789 2387670 2360837 2467861 2479760 2386233 3001523 2920422 2737621 2773117 3029964
16850 3029964 2412440 2714604 2797006 3170722 2801367 2626347 2885428 2750470 3020788 3100270
16840 3100270 3145190 3360374 3440209 3298088 3297583 3170831 3686926 3247005 3563049 3666902
16830 3666902 3659096 3884749 3607516 3944925 4185938 4093028 4174994 4125619 4377667 4327275
16820 4327275 4463440 4575034 4616470 4993092 4785212 4991881 4932928 5267993 5111137 5449560
16810 5449560 5207316 5758680 5650904 6285179 6009437 6248830 6128096 6016476 6327863
16801 6327863 6437436 6795793 6833161 6919748 6868281 7261535 7237522 7390031 7778577 7942342
16791 7942342 8314469 8601455 8747989 8969526 9103057 9265879 9546433 9764654 10309170
16782 10309170 10234575 10690039 11065192 11265032 11498856 12117775 12045486 12510039 12948030 13670864
16772 13670864 13572403 14273690 14738900 15078656 15783855 16322429 17235219 17381212 18296254
16763 18296254 18661721 19164683 20189568 20875246 21669301 22835916 23576237 24553936 25406836
16754 25406836 26510003 27681368 28929059 30553919 31674595 33077900 34998598 36606995
16746 36606995 38192434 40205955 42249497 44262575 46826773 49552799 52253412 54894045
16738 54894045 58176723 61516775 65211109 69008001 73318339 77936146 82786555 88022780
16730 88022780 93400999 99497630 105729316 112145290 119644530 126698223 134120113 141779917
16722 141779917 149094148 156870792 163814914 170512558 176582154 181900423 185584969 188696266
16714 188696266 190053478 190400896 189412069 186719484 182750525 177935828 172347918 165775860
16706 165775860 158722732 151009522 143243933 135834745 128428887 120894682 113468760 106683905
16698 106683905 100271180 93947972 88328711 82793384 78101359 73243050 68989321 64623821
16690 64623821 60970161 57637047 54192398 51094563 48642175 45946102 43468987 41106165
16682 41106165 39097388 37043622 35146799 33480832 31926499 30353706 29088448 28006800
16674 28006800 26511671 25466266 24178033 23256586 22472134 21339189 20637757 19627213
16666 19627213 18937124 18094524 17410808 17074042 16358062 15745121 15113724 14908553 14325032
16657 14325032 13720660 13296871 12509629 12293506 12324462 11322847 11158583 10926232 10561471
16648 10561471 10115516 9764976 9595306 9293518 9167414 8849295 8169242 8389826 8026236
16639 8026236 8144667 7636622 7270283 7360570 6899105 7058213 6630859 6313971 6503214 6062795
16629 6062795 6082276 6017455 5542379 6067669 5306132 5390223 5356349 4995516 5045245 5026636
16619 5026636 4759155 4824878 4615529 4514674 4252409 3981402 4119977 4064078 3930990 4047892
16609 4047892 3894244 3868934 3771357 3941410 3683203 3464975 3459887 3427603 3126425 3399409
16599 3399409 2974531 3314585 3030681 3026936 2989683 2953675 2823307 3008744 2694026 2987135
16589 2987135 2867015 2876098 2516190 2697144 2620965 2176095 2462569 2489032 2241033 2546078
16579 2546078 2476014 2000599 2152384 2400193 2102782 2323679 2020749 1969291 2068091 2022159
16569 2022159 1850834 1846472 1735308 1697523 1809987 1746850 1728289 2207641 1824511 1864132
16559 1864132 1551889 1720644 1489115 1656923 1681395 1619748 1464437 1830979 1497608 1436916
16549 1436916 1653732 1296611 1357179 1184175 1270998 1438489 1342943 1202414 1398030 1406036
16539 1406036 1179615 1178017 1535543 1022642 1396157 1076929 1341545 1463280 1312326 1334389
16529 1334389 1008740 1214413 1005003 1301061 1428885 966767 927410 1041902 1293431 959100
16519 959100 950986 1133884 922392 1057310 1087159 847616 711811 791896 742311 779892 734402
16508 734402 786408 932156 1186037 920929 885613 1049007 900446 847256 616904 572855
16498 572855 849562 866439 906390 822207 725952 721080 891424 816984 622966 625106 1016993
16487 1016993 608892 411928 823888 881111 927659 824843 608585 524991 627218 435236
16477 435236 783993 265979 419698 675884 996918 656570 429525 859561 411650 382844
16467 382844 692057 520434 380729 458578 527378 509264 735830 482589 438875 770602
16457 770602 829652 550574 705866 513009 355755 386068 438167 451013 133964 429165
16447 429165 754302 645101 610486 614245 188202 804390 811969 393931 540778 273328
16437 273328 416474 69842 553739 379058 401011 321467 288213 497756 663246 670400 527954
16426 527954 193478 376366 67844 252535 512752 187561 201731 484029 286143 372624
16416 372624 344467 437777 488230 354137 127704 123944 139189 112280 627124 496760 207635
16404 169407 184008 308779 601012 296383 89879 377150 769813 161041 423896 298331
16394 298331 551196 172972 461545 162787 284140 435486 50729 76284 163446 156441
16384 156441 -122122 298358 97451 229216 99070 234100 314523 305925 361217 200747 78857
16372 257467 20977 531639 300370 82232 430486 322902 124644 193358 1132 -78783 234623
16360 417075 376753 256886 349220 265055 416138 137007 82554 324358 408143 295464
16350 295464 255375 328670 242901 92449 67394 213037 287295 128856 326972 382582 178332
16338 67958 135992 195862 504085 70809 236237 513278 134821 155288 33165 471538 266480
16327 266480 382636 11425 334467 339058 254067 335179 428302 166818 -38115 225902 113696
16316 113696 133172 191768 188294 386647 82436 145775 392967 298724 119903 226157 103203
16304 176563 240965 42796 164432 31911 137879 111951 106375 -83305 96044 231031 42 98848
16292 98848 5885 -112207 176272 201674 10015 144358 117985 267348 88844 515937 85050
16280 61631 296242 -139981 117399 348340 51479 -43968 -39521 -129285 55070 -56343 431176
16268 232559 304778 234913 308123 227633 134103 17948 26117 -139303 107075 317341 430842
16257 430842 228776 -66320 63114 -90394 10609 143430 136803 16327 -10065 -45406 127198
16245 -98514 215699 71234 68367 7998 -77945 -25208 -103562 240075 242099 224038 -34117 129739
16232 443835 263944 138751 -69735 11062 442823 151732 45884 57134 76671 53176 2370
16220 -16813 -72086 38031 -358059 25708 -334486 61616 -291829 13174 93437 85718 -248665
16208 -73382 156916 -163149 152163 330921 211295 -22282 -52960 -31825 -63468 -11136 -252263
16197 -252263 -228671 -59597 66178 11823 -176938 71398 35077 109913 205785 34233 285403
16186 285403 -31802 138666 148455 12023 -278749 62227 123226 -191303 3049 -123581 50194
16174 358610 17755 69382 -451545 46266 16011 137866 46283 92489 7117 -98752 20589
16162 100299 76677 -60155 93181 -278035 -71395 -133559 124829 -136437 -224449 208697 -184371
16150 82551 26158 46373 21053 37620 -128805 -20860 -34911 -79104 -19309 48099 -35076
16138 109836 89502 21018 -20331 -6437 24023 -96635 165246 -11043 76758 159809 -35166
16126 -128391 108113 78193 -127099 1333 -62225 -361439 -235451 12545 -241794 78451 208452
16115 208452 -81933 -56525 -288619 -46890 968 -41347 -64020 24864 -248062 143463 -35402
16103 -10802 -81194 -315195 -49281 136867 265055 344646 -107043 148507 -11172 -185711
16093 -185711 59356 -298748 99305 165 68231 32440 213468 253386 -162072 85335 201026
16082 201026 36012 -15383 -193127 135332 -105599 -273760 -103421 84193 -204944 133333
16071 -238547 -84708 -93210 -421811 -36795 -28458 -51060 235639 123280 -517344 -37709 115146
16059 100231 18835 -297173 183901 189798 -153890 291648 -378401 -78909 -211761 40070
16048 -223978 157835 -319215 -297945 210839 -135932 -15958 -30261 69980 -90120 57717 -169842
16036 67447 202684 -279109 120781 13090 -141333 -1039 -31938 -145889 1427 -277646 50415
16024 43606 -252200 -154758 -103938 -170598 145793 180960 139374 -201406 -137920 113886 -41633
16012 -96048 55884 -157757 -180355 -166519 82886 242915 -8110 -295318 210021 -3446 110200
16000 -334682 43563 -50977 -344589 216343 -294698 -31555 -377504 268393 -49620 -243600
15990 -243600 -317407 139556 63154 236134 -40571 192162 119787 108961 74219 338126 15083
15978 14395 61028 -155776 88747 14504 272795 119379 -39052 -84523 367448 203713 -207887
15966 277466 -44383 -250834 -264094 65775 252209 196690 153415 -10320 -145252 -138984 -157908
15955 -157908 125178 177961 -182608 -76858 101220 28623 -21767 -57201 -25408 113124 -343963
15943 323609 386073 -61103 55051 -300342 -274042 -18288 225544 -94491 19883 -86395 179461
15931 99971 177864 -79076 -11228 -221896 -285189 320271 -29450 236558 -49923 -512114 128749
15919 -161252 -147814 62147 42052 -284188 61359 -179144 -331008 -126647 -198386 -213611 53125
15907 -239509 -234754 228372 82095 -345430 50670 -305370 20786 228656 29687 61283 -67676
15895 -101682 -373213 -54679 -182414 175026 126318 66389 110829 -517988 -79870 -6852 -250164
15884 -250164 -250272 -19875 102316 208278 -146704 -141491 -112179 -335568 -242524 -197936 203389
15872 -424906 136817 -44619 -79970 -180729 87423 21910 -103998 -143132 197250 -271304
15861 89064 -278916 -188673 -9609 -114528 -40510 63062 -148472 237734 108032 14276 310815
15850 310815 -169057 17588 27924 133343 -87076 109591 -389290 -239112 -289268 -37545
15839 -256821 227316 -49123 -312320 -150677 61711 126192 -222626 -87407 208257 8237 -155565
15827 1065 114904 158568 68147 126783 168783 298725 -105522 120229 -124528 -183720 -209855
15816 -209855 -80116 40220 -189956 -327966 -146002 -299166 306345 45377 15618 -158845
15805 6729 -205741 -35900 -47601 36763 -265343 -43627 10814 -137066 -105967 -496909 296786
15793 144698 -36883 316699 175579 405394 181936 -203486 104659 57146 -70408 29184
15782 -158254 -118520 91062 65974 -84881 283390 -120822 -25296 446009 -116663 -278714
15772 -278714 113287 -30259 -139114 -25055 -172732 444917 -389907 183281 -162824 -29129
15761 23159 -233252 252871 214639 -27628 -29482 -176198 66485 85164 256043 -282244 -180218
15750 -180218 -235097 -10555 -82814 78598 -24095 108575 53633 50928 -114104 -340268 157838
15738 -20551 125959 -105890 -126093 -66322 131536 -113068 49718 66409 -211645 -31624 -311414
15727 -311414 97105 -184774 -46708 -169568 88738 -65153 157591 28202 -355736 62322 -152902
15715 -217866 -211707 163178 -124995 -117435 -107994 -234836 -134821 165354 237358 -185429 -246412
15704 -246412 115501 -150035 85275 63388 117529 23943 1010 -89409 -281793 -93587 -127639
15693 -127639 123412 2426 203303 -236953 -71903 -285330 -11466 58239 150101 185274 60812
15681 86292 -53000 58719 -215109 150372 -263060 44265 158195 124302 -88911 57916 206135
15670 206135 -133767 -124847 277399 -11583 -331041 -177148 202442 69653 335886 -277421
15659 118359 -112010 -91797 -20121 9546 -70368 241859 -225586 35334 -35975 -62319 -9446
15647 -146540 171666 112882 -76453 106625 168703 127482 -120474 -18709 173957 7329 398075
15636 398075 212787 -276308 70690 151053 102568 41895 -228116 -69756 -410863 11621 -31580
15624 -109991 -163217 256239 81776 -379274 178000 27226 -309867 105100 174311 90122
15614 90122 -116276 -350938 -116864 311699 53681 -264735 202344 -162238 -72745 220250
15603 -80873 73728 -201721 -196967 -107237 -60517 158421 -246531 -68246 -89389 -151385 -194486
15592 -194486 -175825 -62313 62903 -31247 -16586 172132 -142476 96005 -46471 9758 -240301
15580 -60424 -76767 -86630 -190132 44747 -177773 97656 47258 -268212 -15963 -193914 -127539
15569 -127539 152787 3102 -6940 17775 95301 151645 -384285 209696 310606 352900 -32555
15557 -303899 208461 -202449 -247516 -62560 -473971 -349670 236824 183207 -109487 483154
15546 -232174 98757 113376 43064 -1771 -42741 -45315 -159822 -104001 123096 -4870 127939
15534 141562 -361246 -109848 77845 -119625 -106642 72760 108548 -153549 35566 -54546 -101836
15523 -101836 235312 -131904 -298335 212163 -268946 -54151 -71935 386762 129832 149768
15513 149768 150583 -228263 -94695 -203744 175490 49472 184139 48326 -39347 12765 -290889
15501 -121388 84037 -114664 73154 120485 -179041 -377876 82577 -207215 -135864 -321777
15491 -321777 133452 -350435 22730 -537028 -106292 71158 -338742 -90508 -106010 -241406
15481 -241406 -226159 -146 -21530 193776 101591 -265754 -51002 -73322 -103985 -166543 -158221 350914
15468 40358 -182803 -62445 -394012 123887 -15457 336043 -260733 -48449 35565 153296
15458 153296 -138439 -234392 -4779 -29885 202984 -113615 248019 -90420 149063 153460 176228
15447 176228 -98393 -423362 -242211 24439 91039 -97999 -78697 -77975 -145972 -68463 -105418
15436 -105418 10611 -73537 -36019 -297041 -28080 71608 -44009 -237458 -16042 -174078 -74277
15424 -45096 87216 231789 -197747 16898 -118401 -214081 -248271 -67501 173628 -9355 63518
15412 231927 -12369 54259 64627 3359 310542 119243 116234 75114 206191 -41314 44340
15400 55606 -317413 81842 -262602 -196737 -235151 -454705 53428 131976 69168 -126523 179040
15388 51254 22357 157948 -31118 -282970 -1105 61370 -128090 34398 -56489 -168480 -190573
15377 -190573 12991 -80792 70253 263300 312794 230959 -56272 181246 1683 -70028 98710
15365 322277 73296 222842 -156305 188163 -166785 115180 -221750 -85391 -58702 232618
15354 -122540 -340742 124357 -230783 -54104 13666 126282 -457200 239594 -182196 -148046
15344 -148046 -217769 -212007 71486 70977 -134193 -75387 -232 60015 -273301 -180379 -247650 111411
15331 137970 98967 48907 -13281 -44108 327541 49316 57284 54407 -71861 350260 149398
15319 6173 1275 210884 -115143 50555 272552 187464 -133194 217879 -110449 8497 -73323
15307 -94890 46315 29673 79635 34304 -120337 442138 61688 116845 -178687 -52751 195220
15295 -120195 57836 114427 197434 62286 -256457 -112229 -222029 63649 234306 195613 -47154
15283 -159339 227124 119353 -140474 -132057 -185333 180224 -1775 120461 -85011 -36854 100819
15271 28894 97713 301138 -68211 166351 140565 -152239 108252 30798 -16721 -25672 55541
15259 170245 15972 -237545 -102708 342665 127438 136007 -16539 -138133 87277 134849 335906
15248 335906 978724 1334554 686313 1593866 715798 385091 64556 21344 251249 -40026
15237 291923 -184206 12281 -22429 157876 295273 149081 -101875 -22841 36740 -85881
15226 -130407 -62771 53372 107312 -70931 214808 -20294 101063 322423 319143 115400 -52671
15214 99602 -59683 -78965 23662 34854 -184179 365447 235620 -212993 -48927 72027 27082
15202 -414965 -37667 -149090 65485 215506 63812 -18749 292071 -23036 -54938 106512 228300
15191 228300 -252218 19056 208251 431356 -86893 15664 120964 362873 27645 66608
15181 66608 453592 -14592 -53314 -159350 -86927 -125515 292790 -190227 32366 -95408 263992
15169 -24104 336076 -146465 22771 139076 124554 -679 -374 -44513 120220 -124964 242514
15157 145774 129514 124764 -26312 151448 146535 73350 126099 8510 49122 200571 245120 -121934
15144 51184 48836 82885 21348 96129 103268 -126772 111542 168799 86174 255561 194707
15133 194707 -41141 456452 370261 -204771 62545 -221550 57189 102899 4377 360381 375852
15122 375852 359120 281431 293820 -36265 -177208 -73303 -205898 232202 -100647 -32755 203041
15110 126416 90524 397628 153517 72419 120800 85609 74455 67582 -199891 243020 -9795
15098 59668 153070 22715 163001 -26958 -323811 10904 -55807 -161013 307369 -42052 364974
15086 7351 76037 -365606 -2472 80654 72312 154475 -180543 -87904 -26112 128371 155096 -34475
15073 280604 106534 227077 293024 376388 -8433 88264 201459 301834 156474 -24955 142254
15061 -13093 183299 89729 86895 226320 -59749 -67930 190232 104594 148856 -46595 155328
15049 114281 50717 106700 -14774 43339 73088 223262 86927 383671 -59128 332071 -135061
15037 193476 -300430 392987 197993 -49654 66418 102535 168211 317562 191327 188722 -53464
15025 224315 161203 423358 226864 238566 283483 247802 437336 348414 86891 43272 274714
15014 274714 386411 294997 419183 19009 299862 -384243 42375 103832 85345 125314 329784
15003 329784 216637 -315426 241715 184971 -172904 93643 80844 8928 79967 288488 58932
14991 220011 52158 197386 304203 497781 140391 392380 263717 132411 -102047 -24610
14980 89206 205326 21562 154518 78709 1381 166778 331001 111658 295872 246471 372712
14969 372712 99929 -408 121388 159882 141838 -95331 229719 170262 321620 502236 167829
14957 131747 311596 38146 321259 436705 222328 124858 247036 298222 -110219 372618
14946 261976 85438 245816 439415 559743 81768 322868 138409 100484 -56537 -158782
14936 -158782 288651 -123762 270113 430031 255289 325437 192014 168059 101740 10773
14925 376623 234266 219250 94438 41355 413931 325254 504262 321329 165185 317732
14915 317732 221561 131181 125882 393047 341497 -31375 238550 306763 381613 301969 368336
14904 368336 6074 313419 304394 301436 123439 562860 -14785 58371 -97269 507421 260203
14893 260203 58962 -63766 516659 230942 662873 322510 447923 122674 186487 215716
14883 215716 705823 352001 354347 315470 607959 41134 420640 173835 379987 253990
14873 253990 37303 246097 228513 474311 382426 238642 140984 402734 237375 108918
14862 67904 34783 305485 441979 153826 496059 265311 115602 102469 396533 307058
14852 307058 653932 409318 169830 101398 123255 309054 174890 166678 156615 452659
14842 452659 381652 284970 233174 371724 299376 55791 641604 206619 283643 223970 445807
14831 445807 666295 173326 25109 327510 482638 403504 -32027 139949 321829 450376
14821 450376 615818 584427 384859 111561 384505 128083 663840 727420 208067 160139
14811 160139 354135 280392 507169 438535 370588 445671 784870 212489 117904 297514
14801 297514 134351 171943 398786 607686 371844 372032 364061 425802 446079 197941 521381
14790 521381 378972 536834 698947 324026 613201 377214 462576 621849 630540 650039
14780 650039 462085 501014 457171 438519 498727 348340 574125 599695 472910 311455
14770 311455 450125 474891 672880 349616 329561 679424 399149 625176 771663 493014
14760 493014 229725 470531 346486 493393 300221 943889 636424 469230 220527 429099
14750 429099 672398 294985 305476 513706 421381 414448 485142 294668 363955 741237 390709
14739 390709 729036 775474 336160 543935 837687 600338 575820 726587 678019 842721
14729 842721 830742 979320 419525 669329 747351 707145 837963 837437 629895 638788 897693
14718 897693 666121 352416 542822 571531 713969 1155101 645014 871414 828651 395530
14707 1096904 924760 556953 703358 622196 526602 869547 519342 542822 819832 853185
14697 853185 1065214 837300 1105854 950098 490764 597381 1020455 647316 680038 881977
14687 881977 753919 943708 761603 862410 784922 1164297 1042585 1026860 651420 1024953
14677 1024953 907743 951697 706246 1040916 921909 672768 609805 778942 545285 835110
14667 835110 953738 633920 497569 959370 871668 988353 1300825 726507 1077420 1010134
14657 1010134 1116033 646013 1232537 709861 1176992 889482 1082755 914534 862232 948656
14647 948656 1015104 1088471 779262 1101080 958844 995305 1025635 1049035 1166634 1093020 1093539
14636 1093539 969876 812618 1506797 1050701 826517 1019442 1136938 1123764 1143217 1239574
14626 1239574 1509699 1785265 1344285 1053062 1338965 1164142 1306760 1003002 1213270
14617 1213270 933020 1456011 1541745 1229352 1176933 1382061 1083493 1283735 1171695 1440500
14607 1440500 1335853 1226514 1587040 1328125 1355648 1283470 1568557 1038291 1183901 1440300
14597 1440300 1218946 1337463 1326283 1522106 1379088 1489688 1569194 1446103 1695112 1527023
14587 1527023 1936053 1433862 1898410 1509377 1484251 1465010 1625449 1695948 1655852 1375101
14577 1375101 1718659 1918437 1877984 1880577 2015623 1744715 1809414 1596475 1933449 1993554
14567 1993554 1994196 2076643 2128968 2161554 2012233 2181267 2235224 2351571 2407573 2259382 2561445
14556 2561445 2657664 2686993 2855730 2926611 3574156 3788950 4854467 6606500 10343925
14547 10343925 20519163 39297323 44192588 19775466 8897757 3895168 3034856 1886937
14539 1886937 1782906 1883586 2138571 1915835 1647429 1636900 1723559 1728549 2093077 1830341
14529 1830341 1974651 2037285 2039098 1992612 2067544 2122890 2383995 1710192 2079137 2021072 2019210
14518 2019210 1919640 2143063 2621158 2316769 2491421 2332456 2553290 2433401 2360534 2536271
14508 2536271 2518826 2437804 2557080 2736551 2445817 2592560 2680417 2861718 2803248 2673954
14498 2673954 2928718 2838427 2808505 2880846 2934875 2878294 3003381 3108841 3170604 3059035
14488 3059035 2961745 3344398 2763634 3388444 3275379 3047090 3441132 3309270 3430943 3480582
14478 3480582 3517496 3407533 3627992 3625158 3749006 3897052 3724217 3719403 3537699 3765935
14468 3765935 4125578 3975026 4019360 4230768 4107689 3971931 3959936 3829303 4285597 4816031
14458 4816031 4752081 4392295 4393254 4553264 4541777 4324161 4780597 4594188 4869807 4613249
14448 4613249 4773181 4819469 4958976 4942074 5135908 5394599 5189929 5288229 5488840 5666144
14438 5666144 5506557 5357521 6143058 5786769 5973340 6129101 6128818 6285267 6525682 6697113
14428 6697113 6165143 6738117 6474764 6648951 6644326 6733636 6960461 7105591 6911580 7161920
14418 7161920 7197172 7170777 7324644 7743619 7825175 7978422 7882456 8014047 8143149 8154694
14408 8154694 8663388 8703530 8671056 8787723 8655272 8954542 9393109 9271573 9347942 9662421
14398 9662421 10032176 9867507 10134886 10216650 10221073 10539636 10816045 10654867 11004923 11831256
14388 11831256 11437933 11291410 12238588 12273536 12209229 12578858 12943024 13058788 13236826 13546948
14378 13546948 13513593 14129908 14080047 14453363 14952232 15199744 15435225 15828355 16144891 16495192
14368 16495192 17021036 16946451 17306655 18024741 18373286 18488497 19067189 19512367 20021839
14359 20021839 20298021 20984974 21276364 21643231 22430022 22938348 23215523 23690583 24273358
14350 24273358 24830173 25679978 26198874 27199948 27809368 28466438 28825212 29753333 30690147
14341 30690147 31394510 32179200 33081181 33967663 34802545 36244723 37293751 38530774 39526463
14332 39526463 40761636 42095347 43316043 44760743 45889627 47446359 49093425 50941567
14324 50941567 53010163 54377285 56244821 58516810 60248657 62733224 65442487 67483626
14316 67483626 69997886 72834313 75736138 78839544 82409452 85600294 89513058 93355019
14308 93355019 97560318 101874422 106646147 111078513 116193876 122100494 127822572 134501152
14300 134501152 141103134 147958232 155814115 163905240 172236556 181100038 191037115 201441723
14292 201441723 211909205 223668133 235787840 248638445 262173511 276474656 291243007
14285 291243007 306479594 322088019 338491373 354743638 370482078 386651343 402078467
14278 402078467 416572327 429748669 441579736 451751365 459695250 465211622 465338409
14271 465338409 461258236 458076013 455079085 449998713 443520742 433872930 422408918 409814431
14263 409814431 396038991 380848170 364407110 347775081 331232424 314833232 298719593
14256 298719593 283249413 269060033 255713278 242428209 229406919 217370777 206188172
14249 206188172 195312611 184924363 175677183 166934553 158560587 151210269 143744439 136688732
14241 136688732 130199490 123957763 118355732 113228450 108242047 103414746 98923510 94522903
14233 94522903 90525101 87000381 83745893 80499592 77176031 73884705 71215499 68212611
14225 68212611 66098200 63238626 60996313 58737946 56840478 55027389 53026883 51280639
14217 51280639 49422718 47871093 46786533 45217142 44008525 42542890 41036654 39648758
14209 39648758 38398497 37696358 37051249 36002977 34752135 33541463 32564891 31425379
14201 31425379 31138405 30676842 29500858 28513516 27879199 27004895 26551780 26153900 25351825
14192 25351825 24356969 23756288 23457331 22902956 21981381 21792300 21126622 20983857 20378894
14183 20378894 19742124 19686489 19298285 18526300 18197038 17599590 17397197 17176043 16726941
14174 16726941 16077402 15837299 15603923 15555121 15003576 14861533 14875937 14164945 13935592 13730860
14164 13730860 13776168 13342279 13125933 12906097 12824949 12561483 11934451 11859466 12106704 11614279
14154 11614279 11369806 11042526 11162390 11098789 10780924 10413520 10546386 10040527 9902344
14145 9902344 10032909 9865124 9535844 9233724 9341762 9472740 9184660 9196825 8875615 8725235
14135 8725235 8429299 8173600 8316882 8116994 7946355 8033269 7833429 7642629 7548631 7394674
14125 7394674 7422446 7449892 7134415 6977808 7044702 6869095 7031635 7142317 6413813 6862222
14115 6862222 6296832 6455862 6491920 6216354 6187785 5948163 6141266 5498877 6024415 5684483
14105 5684483 5707252 5660529 5781119 5633837 5427792 5543629 5448144 5111461 5343385 5033852
14095 5033852 5259957 5253045 4931777 4786560 4800391 4763569 4810728 4590923 4764185 4564333
14085 4564333 4839676 4142619 4369375 4152253 4241897 4175712 4039154 4339570 4209437 4106684
14075 4106684 4092707 3855136 4228867 3962561 3815327 3784512 3745278 3808561 3955689 3925712
14065 3925712 3702357 3708450 4049509 3734896 3443971 3904270 3669436 3984277 3734369 3664360
14055 3664360 3616946 3529158 3243538 3222492 3442031 3328339 3550049 2804244 3145689 2973264
14045 2973264 3351842 3234650 2950442 2840413 3265896 3101692 2882096 2751989 2889007
14036 2889007 2821975 2805387 2706027 2742253 2971227 2620530 2952924 2863321 2812666 2731558 2668366
14025 2668366 2675045 2380750 2522627 2523443 2711330 2479335 2336546 2015556 2142299 2279827
14015 2279827 2353293 2171212 2111948 2142071 2466856 2334045 2524113 2155634 1972359 2079963
14005 2079963 1980686 1987955 2255217 1942699 1957239 2174108 1851853 1935376 1876490 1736074
13995 1736074 1914975 1845090 2153442 1874021 2018969 2448111 2755518 5372417 13638785
13986 13638785 32359199 45964381 23453642 11428692 7527061 5304315 4542428 3885189
13978 3885189 3242654 2914497 2701434 2720126 2520693 2822283 2489853 2372439 2217728 2217271
13968 2217271 2261369 2207153 2203364 2268414 2198565 1918568 2042970 2199213 2152173 2376553 1774856
13957 1774856 1752732 1880472 1977021 1991105 1476655 1832988 1801356 1617792 1922409 1914431
13947 1914431 1862166 1533063 1471088 1688840 1735736 1596410 1495442 1666896 1694630 1574154
13937 1574154 1765255 1820543 1589011 1595679 1697157 1703538 1152983 1533049 1144886 1510309
13927 1510309 1511652 1532336 1757623 1504690 1104745 1245076 1291082 1271431 1357095 1272818 1296574
13916 1296574 1331715 1249764 1401962 1664043 1161009 1186861 1228110 1199723 1313527 1100308
13906 1100308 1210680 1129994 1310762 1237130 1327851 1283359 1530728 1603034 1478161 1337224
13896 1337224 1121916 1046718 1308844 1286286 1201729 1203209 1243395 1208628 1128889 1031768 1104914
13885 1104914 1211060 1244879 1254876 1481359 891500 1116216 1142475 1397336 819256 1107775
13875 1107775 1137918 1201494 1196139 989344 1016885 1036332 1063915 944089 1058097 720366 1173760
13864 1173760 1045131 1080537 957125 757173 868342 1082861 921716 930882 845511 1184190
13854 1184190 1191557 687574 731849 987883 1114052 741475 993519 766949 1016935 831070
13844 831070 579390 962486 922255 882578 877011 1038791 729922 765670 1004239 836026
13834 836026 939134 770418 758391 907624 769419 1088979 1120270 807171 1071781 856766
13824 856766 631235 957156 663691 480800 737248 942261 663342 552731 683347 1062601
13814 1062601 799509 867215 630105 818404 476898 839107 877467 582779 947068 887585
13804 887585 661249 676239 696951 577507 966475 742776 495136 724315 715966 659490
13794 659490 865535 521035 453224 217199 888545 660322 981838 778920 632268 672964
13784 672964 606945 847031 1035667 631688 588354 723249 967416 557053 544512 722641
13774 722641 437993 662775 747620 730478 736889 893051 815716 756794 731790 693745 635904
13763 635904 426342 668669 555207 789481 651390 863949 843271 293060 622167 280530
13752 633197 561455 824171 726239 630738 434792 424314 468168 718058 754111 466072 553407
13741 553407 273697 978110 661572 659306 844037 653488 433560 646493 616269 691334
13731 691334 792273 473152 298792 447970 776172 847163 797530 581765 229810 269247
13721 269247 543607 504913 646735 449620 450696 336699 653985 534418 527974 526247 582341
13710 582341 692115 317493 333259 613933 573545 641753 753238 546457 656209 658326
13700 658326 455574 569781 518368 399969 654073 623658 387197 371403 173111 237484
13690 237484 612392 140424 499626 343947 275753 471757 594862 641179 420914 490035
13680 490035 122722 651452 467805 -19843 379344 520993 255829 244699 520773 663189
13670 663189 292762 505582 134352 435765 270973 539951 488048 603124 371885 170082
13659 659076 442850 194703 522032 436826 477577 454515 445925 555987 539891 442084 366865
13648 366865 372921 153994 179656 111577 329314 535263 447663 518019 583030 496022 256346
13637 256346 407664 632795 332000 377550 297211 288312 738314 698700 353649 368778 418465
13626 418465 601584 476513 634758 430332 375883 332845 416587 603698 296258 610616
13616 610616 603537 -119965 570594 705152 535742 143206 365635 533207 373718 447518
13606 447518 83510 389255 270722 711171 592634 463564 238228 277509 276260 99260
13595 463560 642780 -90303 489098 100325 244537 410162 161932 162528 290883 272677
13585 272677 171099 357558 385206 208759 140204 322251 182087 411349 304119 469350
13575 469350 126521 275258 470536 196132 54142 413704 42164 335192 597882 269730
13564 410660 131358 -106855 255656 444286 248306 146334 175953 155541 228165 365866
13554 365866 284632 76062 646933 -29315 361304 274436 106470 341925 -112313 -4899 295783
13542 264823 -3265 273227 410728 458615 9199 360359 395545 300909 420992 308958 159877
13531 159877 236688 350468 109990 347007 257070 365428 278999 406179 419564 357586
13521 357586 454765 516728 214924 153470 268871 298701 392366 328223 471663 194536 329784
13510 329784 285770 581205 295747 357416 149362 328909 418654 192308 129723 112251
13500 112251 169118 520976 360421 -4862 364837 305254 109531 108852 134476 99796 -29581
13488 349590 283361 350962 310051 126408 -16145 371429 298790 238773 -89824 153756 -67305
13476 342561 303092 -109311 -99430 102601 126691 72975 444785 -80514 120371 355947 246048
13465 246048 192336 95700 417870 368061 290516 349637 78855 67766 324518 186848 152830
13454 152830 285496 296182 254891 -4693 364977 113693 503623 266118 49870 299570
13444 299570 533548 -76646 287287 -55131 283482 -118851 107814 154085 324887 207602
13434 207602 140831 424470 -50098 348615 78314 474605 355751 137621 23266 392992
13424 392992 377347 350607 304111 67003 -2310 406902 -46417 352554 -3302 -110669 -107648
13413 -107648 77414 415250 139523 132893 166142 195733 271066 584852 159050 71288 394469
13402 394469 -91913 1676 367450 152743 250653 106352 242258 351513 -32031 78551 411944
13391 411944 83192 376403 354215 156582 -92255 274124 253375 60230 328517 39565 428156
13380 428156 -145134 232054 477344 111718 354969 69050 341167 404402 471504 380288
13370 380288 17936 227920 61613 254581 107626 475404 240671 286209 305415 253697
13360 253697 610351 274574 271745 -91939 224938 -232267 -29863 160130 214562 466995
13350 466995 203703 25750 117785 194949 601426 249708 522062 533988 605656 137848
13339 -2874 69440 437931 166205 -122887 251495 198691 343009 282140 303671 468948 315937
13328 315937 124982 -92409 -37751 44048 285494 382820 448503 284201 -54275 65069 183219
13317 183219 -43746 78302 263428 104775 350296 648344 154808 -51628 277039 62150
13306 99379 -5238 493620 -61578 -29265 650417 578243 -171945 361959 17805 219642 209202
13295 209202 104644 89060 31150 363251 -173956 76589 360223 -14460 236527 49725
13284 -32217 70822 271664 160924 173086 452402 -50336 7250 61945 268980 319394 258267
13273 258267 -158233 75686 -47875 -70479 12581 -107788 81103 -18153 136332 -69011 -57701
13262 -57701 131829 -38845 262123 37091 -328783 16091 -113868 -127313 239227 17338 171569
13251 171569 -24916 409480 408467 -63242 237478 301115 -32304 83417 201526 -255987 120317
13239 169866 177965 68419 56412 132512 269278 44176 172790 -66609 36575 -93336 266289
13227 59829 -64250 404995 -194280 -16239 230364 -214671 285444 152719 264963 74602
13216 270430 214182 184266 47007 331668 128451 268182 69292 279419 39452 34832 77360
13205 77360 118992 321347 6700 146640 -117601 201417 336072 94147 -3828 66232 -6732
13193 50266 104178 56547 273228 141657 200980 68210 97443 -241758 173023 124071 59785
13181 -41588 -596258 -301471 236870 -58604 32319 60725 45398 -503811 120323 322698
13171 322698 103736 239663 51098 105105 153909 -64808 333180 -121508 4906 -146775 2632
13159 98542 -145069 233594 -9525 364550 88365 506377 217790 -243513 -11029 -29012 42842
13147 135442 42267 320621 216894 35076 -92770 198420 -225551 395005 -925 183547 242888
13136 242888 112082 107597 -127112 433664 139791 87188 47171 272841 -264844 216422
13125 26088 100664 -18329 368822 159519 -214517 141179 -4070 256964 -123380 -356295
13115 -356295 224957 135301 -13192 -86971 -138588 107933 180540 194321 40399 74040 139208
13104 139208 179819 -37421 111665 128556 -39523 185445 436345 -90536 157451 57078 194920
13093 194920 -120172 84852 207445 -32446 143154 -186892 98484 -157288 51216 -127273
13082 -4728 241637 281239 -142874 -25678 160385 77342 165595 -166408 242209 177640 352542
13071 352542 85600 -90691 29688 89050 141754 215746 22140 88223 -9421 355152 378318
13060 378318 509012 -11647 94693 243915 -71043 44368 286182 -13378 227498 149803 167454
13049 167454 11809 198090 -39749 150688 260499 -6590 146504 50267 127674 10440 287647
13038 287647 -41478 -37471 -96317 -58507 -94756 150801 100619 16423 -4168 83967 -135448
13026 304400 335816 377282 400093 141705 -132366 378148 174312 -71457 233164 17168
13015 364044 346443 220944 243003 -70083 -17346 272023 99683 142076 51043 29027 234138
13004 234138 -60129 81856 1602 -79949 261082 -97913 13887 67908 162824 27656 -117060
12992 262813 167829 170124 88348 111769 -72945 -197212 240717 -75891 227728 76209 140928
12981 140928 172069 89852 -13976 26515 -37302 -118881 46715 -286465 -17375 323978 -45221
12969 2694 -55631 283082 119909 174492 -177789 175165 113671 -127145 82470 4121 -199023
12957 96739 66854 25155 92794 305574 -73375 -14840 260232 77379 128096 55604 101853
12946 101853 191176 -42780 9741 3751 -274978 -142625 144560 285853 -108592 39980 35987
12935 35987 158352 89270 -58520 -62461 19033 146974 290795 -212554 65211 240934 261939
12924 261939 275554 160475 -32332 79307 86056 129575 -180879 249125 -321 514409 229635
12912 243517 -165073 30283 34150 -20698 -92065 163530 85989 -175262 -321353 -350948 297782
12900 -117741 146771 -122042 275582 -219322 138485 -27608 81999 167714 -290057 13396
12889 108347 295654 -48392 291761 -194396 282426 167300 231613 244834 137874 232195
12879 232195 -180213 -158544 -32228 -2634 134159 -94967 -41831 -148449 109680 -111837 -72624
12868 -72624 105498 6971 94543 55266 40650 -235909 37518 119332 -98611 -53279 45105
12856 -33465 201251 29318 305371 -147091 253932 -34477 39879 -257897 -173624 -64417 40781
12844 -328 105660 94976 -412705 61413 254440 386639 86618 -113408 163995 -121316 -39323
12832 -147755 -15526 -103974 -103586 72913 -335755 389045 -435374 242622 124289 35369 80198
12821 80198 419644 31041 -67161 -14437 170447 105514 241175 -64977 50549 -93627 -115256
12810 -115256 77591 98342 123086 84044 95261 321703 226316 6139 -49718 -49600 -27809 99087
12797 -102043 -144779 299958 -177304 117758 9555 37441 -172242 112168 -1917 221031 11953
12785 -308949 -226406 -102356 -87827 27473 529048 -73465 68903 232274 60539 -37987 -23636
12774 -23636 184704 121940 84888 229178 -168970 46348 195942 85731 295860 102667
12763 203106 21855 99581 -65521 45165 125896 -189619 173448 124263 147190 56830 137093
12752 137093 16769 -229678 -137943 80717 -21314 -129474 180242 -121963 -99312 -112162 135198
12740 152177 -85010 2943 66467 31920 117767 220392 255047 8506 35985 130339 33155 150386
12728 150386 -253888 281508 143425 -133962 139585 -56777 3528 -139258 -32968 -99610
12718 -99610 -182450 18645 -97507 -157252 -76017 7865 295439 250938 -180645 -48351 196244
12706 66563 116678 -138833 264228 11637 447992 -145339 134235 389246 -154389 -127116
12696 -127116 70877 221985 -258575 277433 -41128 318457 46617 172857 95346 191994
12686 191994 33904 -18921 -108179 126456 133187 315316 94097 -369523 223391 -209240 -10290
12674 204317 300431 -41508 262404 484464 492926 -76091 -148867 218273 -24101 438995 -222177
12662 252816 -321171 -145668 -62206 78220 377303 -180720 69463 -84864 -107006 139062
12651 -34630 280833 77068 63898 -33668 -4235 -262562 393948 -190368 235838 15400 -168097
12639 43120 80902 135816 -143700 -241868 76452 -5068 -50568 141545 87865 -161986 604848
12627 373758 109445 249462 45853 -5063 74944 218575 150006 140760 178612 167096 236822
12616 236822 104188 -158167 -22183 342833 55735 147277 160169 64500 211824 -246472
12605 -157187 111114 150309 -169170 -293932 83520 -67435 -1015 -77317 158078 -110694 86707
12593 -29682 148074 130803 157520 29198 -276919 -171516 -135650 -13253 33372 -127560 -12510
12581 166967 412259 245212 65702 -52731 43237 13152 -102251 83716 239267 -263121
12570 -38381 -166262 -143812 -207166 -26668 72566 31552 321388 -51447 35276 67241 -11777
12558 -112322 113145 -207005 -116429 -8837 -44907 167135 -260980 -183396 -222961 -174858 121743
12546 -72574 202540 162948 -71554 51825 -119931 -172762 10986 53443 -57543 -56506 43262
12534 166285 4817 74036 -18113 162897 280796 -292035 19319 -1511 282836 -215135 -36902
12522 150289 -27111 131428 209078 65481 211863 -199708 144250 -406279 147257 -91768
12511 -20585 -89099 -69789 107888 43634 233603 -107101 62932 336522 -103839 -93401 59560
12499 115776 -206520 109580 -101487 88715 -62712 166251 -233406 -245348 16858 -75576
12488 110094 -22715 117798 -78443 -297009 -122451 -192575 -156158 -28422 -38510 -31822 -14025
12476 -179036 -315534 38724 -201223 213817 -370941 248834 145198 -85312 -182363 48724
12465 -172259 125412 -18266 -118178 99274 315245 291446 104045 198904 214297 -189649 135653
12453 -62364 268366 -94356 -66289 -18192 -204388 -155912 79445 67328 -93863 -159440 17723
12441 160546 102358 158993 457678 -180391 12204 187199 -2533 -13294 85534 -179649 -176232
12430 -176232 -138621 270295 -310249 120302 134596 -180218 199039 -124641 133560 196014
12420 196014 289403 97267 -337710 81620 -56703 204247 -96967 143035 -248412 -120160
12409 -93533 47291 -31504 280897 -111306 -52597 399921 16770 74271 -235656 273037 244676
12398 244676 -216978 299943 242199 230338 -142027 -87406 -63715 -189586 -110322 -72257 -211380
12387 -211380 -79121 7784 42075 289765 33169 170807 -50200 -100288 316850 -192963 -260395
12376 -260395 245920 271632 78937 -13270 -9363 -90800 117652 -58476 -117635 182885 -92786
12364 -19851 75747 211855 -128894 133084 -51019 -169488 310833 23514 66845 -8190 -110550
12353 -110550 203350 208162 129489 -111159 344339 79627 227040 206441 219088 38185 -7575
12341 -163378 -14134 -40891 -121160 -87409 -157199 -240685 -71932 -141627 23592 129260 110987
12330 110987 -134970 9618 347369 -110850 -282761 258819 100824 -130186 -13269 -119763
12320 -119763 84947 -87927 -212398 175309 94109 219216 90304 16511 -26501 -310617 112578
12308 -39727 -287941 -12875 -64635 -300064 -114612 -263685 20901 -107686 127895 -67479
12297 -126638 69881 -98934 -101098 228361 152257 -59162 -98052 -22493 110542 110061 117966 -207336
12284 111059 168890 401354 330013 175612 -25469 114824 -267114 143777 97394 198165
12274 198165 -49209 152668 -140767 86415 26744 232456 -52970 36885 27652 -141429 -314868
12263 -314868 -127045 191467 -138609 400761 11145 12888 42391 -105033 -34585 -33241 22099
12251 -53003 160676 -4090 144299 -538 237814 -191503 36240 -47030 117806 -265893 121806
12239 -226163 122130 106108 320327 -66548 -29774 -26638 535338 374399 580 -269239 -11148
12227 327634 -56041 237888 184226 -94594 -181729 -144353 202597 374579 87951 335453 -183030
12215 74805 187141 168511 279618 230080 -66694 122977 127511 142303 189686 107225 -35400
12203 60308 39022 -300674 -48574 358743 297748 -55143 -402997 25177 13357 144978 572780
12192 572780 296636 121904 394917 154511 147188 76563 167131 122853 185427 308666 -176780
12180 183339 301840 344776 432513 201082 309903 252766 212509 -176181 124044 270942
12170 270942 149504 126030 -55628 -72855 299504 208153 32802 58578 231017 55678 307313
12159 307313 -15487 127934 -16599 88459 -43501 282640 89739 -134082 140263 331803
12149 331803 101380 203562 77589 75672 164105 -71729 375396 -179007 -224450 210829 -19022
12137 212352 -154158 -191426 378425 264908 -161039 229195 31064 -47631 14527 90357
12127 90357 -96072 183962 -269130 99906 79411 -299801 125882 -120341 258037 87607
12116 500682 -212189 95520 355054 16586 90046 255550 91463 -2846 332607 182897 -42332
12104 47526 252376 -96228 -84687 163056 -101316 29295 51063 152321 -6740 -194160 929
12092 81452 -126382 -55451 -41576 -118888 -155243 -2309 73315 155958 -75270 87415 -146160
12080 222343 3052 -49670 36758 108552 358238 1140751 1996864 625748 335818 -155934
12069 -75174 57978 -265040 132378 -1935 -271022 -8058 78519 -49637 133682 932 296023
12058 296023 185836 37942 -23426 626296 189296 -168713 -36335 83558 -177367 223794
12047 -270794 -96908 27657 -54176 -248532 -153686 -15508 -139280 -21435 -347135 -243364 -181232
12036 -181232 134868 -183698 56708 52842 -140170 179058 -180718 -40103 -45684 -262666 102919
12024 70677 98702 267061 -159892 106738 -4775 149228 186930 58966 208456 10300 43132
12013 43132 75835 -141111 88048 268342 105240 268218 -221142 76560 -115605 47443
12002 -153680 -213967 63646 73308 141236 175073 12999 -48499 85836 273909 -289841 110152
11990 23096 -72020 -97606 9085 -30749 -40902 -68473 -95892 51029 -204744 -200498 -10498 259292
11977 -102546 -48712 -130158 -252100 139430 258544 5776 303549 131807 105456 -381699
11966 -236255 -180079 203496 52596 -8454 144335 131359 -85900 -62524 -183465 -112191 -291913
11955 -291913 -135027 13967 88037 -226771 -314528 136240 -172564 114731 -195094 -117182
11945 -117182 -255515 -277909 -30329 26150 -244902 190443 -166413 -37357 -115520 -97934 -305372
11934 -305372 368579 -194785 54560 -156500 69157 92119 367843 -206332 -140973 -6495 14865
11922 41860 124682 25839 -176335 -36807 -207350 110281 -53576 -141922 53025 107187 -57821
11910 214855 194859 -114650 138451 -86568 -296727 -154427 86227 -148749 -1753 -37646 14617
11898 174984 224259 -157957 -170678 -118151 -88768 31220 267433 -299703 -254189 309627 39358
11886 141206 -255874 228377 134133 -37145 29705 -51453 -205222 241604 -184576 -149308
11876 -149308 -256544 66185 -118230 76594 271623 75687 -66580 -446606 22999 -120980
11865 121441 -247793 92838 168340 -222052 -153954 -38122 117700 -143191 -9139 -75979 -165617
11854 -165617 48584 304472 135218 -283006 284293 145018 167528 -139008 38813 92438
11844 92438 -125809 114837 270383 -54586 199557 -286756 -123806 -194724 119930 49025
11833 314576 19935 -72178 -156179 288502 -135574 -66514 -191909 -41273 -419413 257411
11822 118398 -209272 27785 -30262 -120480 129269 -149859 324035 -66888 156281 180938
11812 180938 -284825 -130492 -83052 226111 124503 35044 -22057 -9580 293174 281362 284257
11801 284257 25914 48163 265780 251548 -33351 72538 11912 101825 42288 -8955 -203009
11790 -203009 -157787 -70501 -231527 -158512 -130425 -169655 1875 247146 -218253 141488 41304
11778 306857 97742 65246 -246 8191 -493703 -70122 -296425 93917 -127640 -211979 -36431
11766 -410350 163665 4545 -184168 -28998 -521675 -201775 256451 72146 70177 -61968 -101018
11755 -101018 120005 184314 -255291 -111985 -160979 -210349 52444 -250166 -156633 -106304 -19415
11743 354111 -156348 -44394 44369 170967 -261517 8433 -144576 -44930 -161559 -48993 138981
11731 96848 -59526 -160129 -230339 59438 190225 -32497 149449 149787 -193659 -32065 246720
11719 60230 55198 144582 59350 -111303 -81803 218963 41838 -384812 5137 -47581 -183213
11708 -183213 260594 -260264 -37083 -9593 -196640 141820 -93218 -38082 246983 170853 232060
11697 232060 -31129 224942 208471 25511 -209082 106406 101975 148412 253034 49840 -265974
11685 -62776 -136793 207783 264037 367255 -75136 203172 134357 127275 324712 214485 124533
11674 124533 58818 -128289 49242 104540 97815 160923 123164 -10693 50063 -125142 93680
11662 -27075 286293 112713 71216 -44854 155216 -272222 3978 -140924 -165683 113725 -117455
11650 -39099 62291 195277 -9197 -36095 103617 163644 -32547 155411 48574 62438 317032
11639 317032 275927 -341004 69447 -216108 100250 194137 -62112 -99881 59283 -151501 210398
11627 152303 230620 48789 370493 114592 215080 -150231 317401 72979 199701 124130
11617 124130 263809 -62278 108945 215060 108851 334773 -46507 195856 74434 -135163
11606 79476 -136954 -11461 -29469 -71595 -22839 38312 146569 104511 144794 275903 33404
11594 22501 33000 66694 -41458 177818 -28832 236140 412175 287352 147996 581 216330
11583 216330 287132 71291 312634 -53089 77907 271140 -82168 163435 51008 95067 54043
11572 54043 299069 -1971 -14767 200533 322548 -15520 128689 -53853 -60761 335588 159990
11560 234130 -248611 10055 4042 -35642 212270 217722 32251 29147 176973 176652 262049 436148
11548 436148 72296 320281 188567 -53100 107954 207339 -126990 92086 74122 244170
11538 244170 -204085 368481 248560 208913 97855 75434 83011 156089 -121284 371473 -275016
11526 7909 -101039 -115878 296272 -111622 25926 -133012 75079 34751 -38352 -82251 382919
11514 -97580 97979 540597 146791 321974 318795 54269 89591 -93711 37735 -14184 6687
11502 -204379 -72076 177276 476677 32899 -133476 424831 -87739 68079 135378 297637
11492 297637 -15281 -213065 307008 72257 124273 -5707 -15449 252736 -148684 -48569 132434
11480 222791 410454 83518 394779 274140 92881 -25679 252641 3249 352092 55690 -61424
11468 247538 -279620 96210 367962 -117780 134413 219376 -72728 188118 64624 387647
11458 387647 732 -152554 -154613 -176917 -105657 -44252 233940 41371 134760 155286 129600 156850
11446 156850 -17013 -148844 -130245 92316 59935 173122 109689 152917 69002 87655 212489
11435 212489 -177765 20976 67004 -45565 189463 -200910 280684 35451 282662 -44796
11424 27204 -164226 86825 109747 63033 18052 55173 -26910 169323 220301 2364 -429071
11412 -197287 -205020 -69367 -62497 -39820 -201094 287994 194511 -274901 -7838 -50509 11517
11400 -260918 91096 258793 9320 57873 120827 139613 352101 -184540 -38417 47689 -23001
11388 114611 -251503 216702 -225180 -75953 67655 -53596 183205 112288 210666 224485 -56040
11376 142173 80406 199712 7852 306499 -41976 231942 -24078 214598 -123073 -465418
11366 -465418 147714 145590 1336 272573 -27665 322077 -111905 -121755 90814 633 170844
11355 170844 -263090 -265123 12 -176135 -37116 -328514 4186 -99426 -19194 532014 200929
11343 152431 -331468 -123138 -186374 -20545 166829 -281139 -109337 32059 -336695 192000
11332 -81154 145552 -272912 71278 -484168 -184297 100059 -14767 96173 -40283 265802
11321 -148107 -335178 128981 -11772 92856 -213735 -12750 33801 -159084 -99848 -221248
11311 -221248 121751 243314 220329 101284 -142072 -12420 47527 144086 319549 -3327 320154
11299 84428 444486 37328 15677 3098 -334238 -110042 40952 156315 -25478 -27377 -109975
11288 -109975 -205909 202213 13927 -355022 -107899 -17504 86557 148764 271274 67847 38355
11277 38355 -105070 -150316 -15155 115937 -14748 -42727 -308797 -163273 118560 -226876
11266 -195998 -145966 -295245 25752 -111478 -104879 4416 -136766 46 88473 -80790 -67994 235125
11253 -143635 4651 -108979 -64213 -96661 236691 134805 47556 -487 27939 116615 -116538
11241 63815 -314440 126223 92319 246242 -168238 -184330 52995 -164660 -35834 -17164 23897
11229 -124197 119224 194687 220309 115412 106087 -164326 -163809 -47542 -65647 -33932 79813
11217 210654 237848 210420 108007 190578 -66961 57820 152251 -285495 -64624 -78550 -48995
11206 -48995 5675 -224411 184380 -38733 52896 -38683 143321 -44020 -53654 163981 274882
11195 274882 -65172 -83436 -136852 -47147 -198383 -47796 -12928 35856 -40266 34016 92652
11184 92652 19235 -168865 117122 -115624 20330 -27539 -27336 105765 -136649 -23877 -149150
11173 -149150 143746 -38382 -338185 4325 -15380 34261 -12257 -26422 171146 -47666 33142
11161 -187833 43291 20541 -158760 -348110 6338 12987 -80119 -46640 -431735 -71031 -1198
11149 97422 -143721 -300128 44011 192092 -17325 -40306 96366 -332427 -46086 -172717 -250664
11138 -250664 124316 49046 30281 -369594 303062 -2184 22363 45994 83997 151942 -16065
11126 56745 166550 -2145 167277 -202532 31880 -76847 54964 251982 192835 44330 -68068
11114 -213511 -70587 -69919 229173 135636 -224411 43249 -51335 15832 222612 8014 2432 326836
11102 326836 235734 72819 -282872 60995 327209 187007 250725 455568 167533 126734
11092 126734 260493 247591 243030 -80550 467655 232665 197407 597154 380536 92985 -123192
11080 415060 56853 -96329 232747 286999 -231234 -61022 262835 265627 385315 435591 159961
11068 387704 27137 178746 415431 91579 309328 712170 2195 440801 783770 434093
11058 434093 260717 117492 457299 884121 426931 869109 734100 624110 619384 449430
11048 449430 700252 607223 285344 813732 420314 530228 347558 577369 670226 585044
11038 585044 977177 626359 545202 558607 447307 582441 648987 584640 777719 532819
11028 532819 753795 488408 518294 432768 422754 524097 681349 949602 417422 356978
11018 356978 723106 381882 667159 568725 850353 552594 831522 590223 510702 914175
11008 914175 532979 461136 387662 730731 414012 637607 756421 657821 351813 162888
10997 349192 386551 759848 682285 474921 448405 821151 268164 617902 785980 544486
10987 544486 693356 639717 850658 847451 799875 898233 1251245 865390 1128334 1248134
10977 1248134 1592136 1758385 1681897 2161805 2185478 2226915 2586409 2206026 2220331 2289046
10967 2289046 2211020 2104094 2063604 1932925 1686165 1977885 1702737 1784377 1684323 1966158
10957 1966158 1905198 1708116 1720538 1590740 1533507 1414299 970729 936817 714919 474619
10947 474619 665683 460608 634808 417742 317806 120407 353065 189452 606678 50732
10936 -52025 -318550 453823 -24667 31509 291047 -11086 45355 -16449 -17026 -5499 724 156460
10924 156460 -5737 -405708 -142491 -99558 -201058 -136692 242315 79157 32000 152478 232568
10913 232568 -165085 343724 195921 191153 469239 14407 215236 -39036 -362735 110373
10902 -137485 -133181 -270004 -41556 387988 328459 -48344 85605 243203 -105508 71940 -59207
10890 18868 -34291 -203396 -409408 184338 34965 413126 -160505 -145537 -42120 16774 189394
10879 189394 -123325 -106157 -70496 54165 131826 438009 -149683 37497 151620 -197030
10868 33637 146637 278062 -100269 -41435 -140780 -265451 -262383 -71610 -1157 16301 55814
10857 55814 122609 90376 -215432 -106039 -154115 -124178 132269 72746 61432 -126530 -165885
10846 -165885 152580 143775 98050 -207401 312457 -149681 -50930 3067 86641 -36520 224223
10834 146338 8348 -121401 53578 -168191 -241814 209472 -94217 96633 -114092 204277 -478731
10822 -95468 31222 51062 35665 -175372 -67285 115812 -211006 109033 -86264 82382 85788
10811 85788 288705 -26495 -26585 398179 94338 -383141 -2952 -29991 105006 -168803 -45693
10799 -91918 -175955 30792 92607 -94899 571244 53598 385792 317639 44606 140630 12451
10787 12923 -259470 -56763 314667 -13927 -125942 -366011 -205864 -40149 71437 7815 301444
10776 301444 -24900 -93083 -69362 -80381 106967 -146920 -192906 -130826 49736 -212947 36351
10764 117972 260199 -400593 -68295 83523 -436361 -140274 75325 255700 -160735 176385
10753 205402 -114465 106268 -75601 25256 108237 -44998 -231909 201083 52138 -56958 24207
10741 -324677 -2504 3860 -108741 -303385 63426 -128049 38345 199046 108172 -118398 -139327
10730 -139327 170632 -341014 135143 135421 165435 -178203 -211065 -111624 -336831 -219349 1784
10718 -93747 -234419 -57007 -99567 70450 -173187 62074 128982 -1314 186993 95449 -120937
10706 -187035 102099 -91974 131073 101834 214804 28496 -202387 133075 22164 170749
10696 170749 -79528 17070 25085 -178331 -13474 -102906 -31479 271085 -339247 -462602 -163554
10684 -226876 -164554 -229663 177625 -80860 -297618 128868 55321 10700 -60249 167172 -101127
10672 78341 -262167 33405 -123580 -89778 -177628 51742 70795 -173094 -352779 -81306 -160514
10661 -160514 18006 89341 200068 135872 185439 15691 -241244 -47567 100966 -152288 100569
10649 -47065 -350647 -18789 -22961 -132346 -157811 -121275 -120732 -225332 7013 31610 -45172 -82397
10637 -82397 -97001 -165975 273667 -38797 -283255 -69804 -66644 -146618 -31338 152812 189241
10626 189241 26756 62429 -137773 1316 -219408 -86579 14707 -338944 2889 -12008 -246633
10615 -246633 99566 -30576 -65378 48226 42283 193825 -264319 -292632 43605 -49045 -278591
10604 -278591 -313119 -439278 257857 -200951 29064 7471 -116374 143660 273634 -4573 -136823
10593 -136823 -112635 205718 299669 3795 -57849 -334599 60992 -84108 -102763 -81854 -156220
10582 -156220 3365 -127194 -70739 -178228 -213675 -79950 -230119 -54200 190711 -152545 93788
10570 -28559 -185587 -44871 -137744 1763 -13481 -69257 -14348 -91502 70618 -72068 -428642
10559 -428642 -378841 -20762 257540 -471281 169671 -257130 53506 6642 -142158 218571
10548 22031 40910 114913 -94440 132143 182952 69407 87228 8525 -291941 -36592 -219000
10537 -219000 31310 242133 -321430 -33545 -25115 -168807 27324 -283181 79706 -87905 -223108
10526 -223108 36356 126305 -168836 236189 -90949 -217847 92602 -105336 -280200 -23339
10515 -57801 -1883 14847 133234 -40955 98754 -159451 11482 170788 193243 171157 180303
10504 180303 -155278 169127 -175712 -108741 225555 80403 -269987 37894 -200269 -54717
10493 -49284 -113569 -55849 -128604 -247534 28233 -26347 172803 168002 -119734 -62422 -171386
10482 -171386 323533 563839 415155 313934 381801 -70426 -44986 283306 -136018 148738
10471 -306207 -207257 296508 91956 22454 31992 22377 -88617 207587 31262 -50356 -265398
10460 -265398 75902 -152796 -251128 -33480 -74493 -159088 -100245 -52547 113301 57136 -244437
10448 -85006 85311 -364656 153781 26554 199385 -86844 -164887 -17683 16571 -58592 238800
10436 -92298 341788 217499 -42390 -151114 -63598 -118221 -150319 -147930 -120416 -23379 12121
10424 105806 -143395 289475 139598 27626 -200687 5415 260468 135934 -204907 -243019
10414 -243019 -188148 126480 -485024 78205 70931 101717 227626 132915 285459 -287274 7220
10402 -9336 -69955 -123331 164955 -159632 9745 419592 148576 34750 -233721 -82950 274054
10390 11861 35612 155396 -26833 -121033 30314 -47697 34316 -91283 -10056 179795 384980
10379 384980 24307 177015 -288870 -22466 191155 167348 -97830 273568 348974 179130
10369 179130 377749 134707 202353 313215 435340 231111 115333 308165 230933 120289
10359 120289 417246 404362 419843 260207 163873 -2509 -89191 263184 448823 111932 244898
10348 244898 440878 315724 299144 511998 632873 446959 561978 432011 364354 -49475
10337 49800 58632 -145068 118805 327103 140481 105500 -124535 -16713 -33611 62079 57696
10326 57696 31662 370462 72495 14969 208254 -73406 21578 74801 198892 85833 367598
10315 367598 -192079 -45276 102261 91026 108971 -219080 -129264 169591 120491 -138744
10304 -305657 -91802 237452 104895 19488 45609 -68367 102530 -97203 -133251 383617 -240019
10292 -39882 1489 76538 -128657 521472 51757 165544 12989 -66531 -95762 -36073 137178
10280 -18590 -46511 403 -194273 -189480 -272018 -150356 -387328 313900 -173348 -419470 -70898
10268 68276 280866 211713 312082 -294581 129092 299751 143145 414827 614536 280131
10257 500715 481000 565314 9952 330845 231395 6152 78652 -268428 -136443 -243445 42867
10245 -86932 -317694 121963 60257 -20340 5820 54210 28151 166230 32581 116124 23017
10233 36508 -130625 189106 -313811 -595978 114354 47394 -89286 -70687 91221 199032
10223 199032 45259 -184867 12577 -35075 183817 78421 7147 -2425 71855 -113061 -100608
10212 -100608 -180441 133562 64821 -160856 -279435 -46350 -185490 -234726 -119811 -233368
10202 -233368 -112586 42625 -161893 -237957 172491 -291194 -85045 -195568 -52678 -203337
10192 -203337 140197 88328 358590 117892 -72942 -148602 41955 -212227 143957 -182242
10181 170240 -62178 -9449 63156 -37913 12892 160265 -13002 -228299 106695 130451 221992
10170 221992 339159 -260236 300447 55055 -189832 -25976 -21700 -203085 47178 -293192
10159 -209121 136873 65637 240017 76913 -187143 -1375 -135769 -189446 2386 -210116 -326431
10148 -326431 117541 -334008 86381 -182387 -55069 -29451 8137 -183321 -404785 -354575 -44840
10136 70864 219021 253350 -450729 -336615 -25730 -207803 75339 -262614 -417530 -123210
10125 -338653 126744 -143662 -199757 -19539 -360674 -33251 176010 -101819 100622 302453
10115 302453 -32696 4635 -38160 102230 93524 173213 -47474 -502725 266311 -41209 -163886
10104 -163886 -98442 -148883 -251887 73473 25861 -290727 -206783 -179017 -223063 54108 -228805
10092 -278470 -85730 93326 201828 85450 -26282 -261046 -238977 -15885 96944 195957 -130289
10080 -452549 -94536 111825 200169 16359 -220738 -90876 -280536 15216 112655 2284 156487
10069 156487 322844 -123598 -159295 -25905 -55003 -362332 -270037 -106793 -269018 55287
10058 -88900 -210352 318135 56036 -30886 -134300 -236424 -454783 -134978 98294 -18407
10047 -57142 -273336 -380590 22978 -181416 -164851 138899 184584 -25054 -149126 136850
10036 232368 -189247 -241813 123808 88459 -57246 -189729 236210 -149761 133721 -93333
10025 32950 284276 109305 313787 40603 -518 -240717 2029 206421 136128 -236280 -249005
10014 -249005 228765 55555 -324894 -108158 -84908 87991 148579 -7426 -141464 172642 -13542
10002 -72162 -146075 -15087 -18582 -166067 28360 194186 -68359 -55079 -91569 220077 -260825
9990 73333 53622 -145016 -224143 -257939 -203573 -138162 2049 -221852 -330077 -52246 -941 -162675
9978 -162675 138319 -38179 406677 -55816 -313690 285757 -104768 350097 -198859 215433
9967 -320159 -323168 -135261 30595 -184116 -138117 -215111 142534 -64414 -101134 -80410 66669
9955 245316 -19810 -107724 219605 3339 -127253 -322553 -255955 -120800 -218367 -186603 -45340
9943 -82523 135105 -49881 -420036 -30616 -197053 -37103 35534 -199957 -41009 -256171 -118767
9931 96039 28516 234113 -133146 98181 72961 -63275 -323523 41431 118366 -253151 -179688
9920 -179688 -140218 343750 112976 -146867 -50796 113745 -190531 199450 58151 -64637
9909 -350934 -124719 -9089 -59890 -14992 -130979 -111719 -171136 -113820 35847 -33740 -20117
9898 -20117 -240540 -108224 180083 -156838 -52372 -380267 -268774 -16378 76062 -1481 -205531
9887 -205531 -89929 -75941 -226571 -163965 -98510 -396856 -267745 -139266 -473578 2255 -359959
9875 -163245 76543 -69761 -94871 27824 -278211 -210621 -46700 -540 23533 23632 -338165 -126190
9862 -48487 11631 -381775 80978 -57394 26976 -110056 -301428 -313614 -118676 119876 -136244
9850 -276955 -38344 -425486 -180834 -77897 -124693 271817 29426 -8955 -338227 84906 -163050
9838 122436 -385774 -380760 70370 -168679 -316476 -98585 131770 -220314 8376 -97353 -10349
9826 76263 -64852 67340 85639 16851 -122069 164572 -103515 -145623 47831 -83284 169170
9814 -4801 95723 69262 -139460 88977 -116672 -221421 53125 -137779 113924 -246210 -47844
9802 -194190 413347 206378 -296760 -3672 182685 -107782 135357 62538 11505 281601
9792 281601 -5300 -109507 -218244 -221737 -65855 -334022 99808 -254464 23356 -315796 -157246
9780 -260703 234762 -116831 96418 -43853 -23487 103891 -427232 -188602 -226223 203296
9769 -211580 -256365 459690 495039 93710 -222290 -123107 -169189 -205364 209320 -145641 -132786
9758 -132786 110461 -128336 459 109494 -230866 -66372 -371024 -21922 141590 -196282 -183366
9747 -183366 -239389 -77092 8225 -123227 -16269 124915 174944 -169079 22852 272698 94501
9735 -151387 53830 135008 -54371 -76312 -190449 56132 -72229 -84905 -4480 210661 -60879
9723 216301 -343480 -200860 -125004 -190395 -271611 -165072 6728 -267917 -254705 35141 -254936
9711 78253 -4845 -68499 15585 192864 -5469 -8696 -451258 36639 -141193 -119660 -115024 5584
9698 53626 219162 25617 100084 -81890 -44246 58725 29384 -34242 -135680 108424 216200
9687 216200 141045 -180722 416774 -136112 137838 -15723 -3661 -367256 -109344 -169006 178933
9675 215486 147152 -442807 -26103 -53082 -204946 -446952 -428162 -31613 114272 100711 -122621
9663 -69161 249277 -247478 -18077 48584 -144506 -436781 -65910 -29641 -560023 -244369 31879
9651 -349937 56144 47340 -74548 105627 -324669 40235 -54082 -142989 -220672 15003 -22309
9639 -67428 -68155 9591 -68982 -263833 -355901 -102296 250606 70429 78763 65987 -89281 102900
9626 -28412 -57520 -79905 103891 168364 -103339 214555 -440616 32099 265742 -209294 88796
9614 -274858 -132698 -152183 -141013 290114 -92263 -218262 -33027 -318149 28444 61864 -61062
9602 4052 373096 99111 -35364 204030 -127853 -100304 174624 -251709 -66603 123516 -266504
9590 -202046 -24228 160228 -79343 -113061 108777 -191068 149518 -78464 268036 -244465
9579 -188497 -384721 -112197 -114512 -121363 -441159 212530 -243828 637 -244096 -266480 -164783
9568 -164783 -181871 -191937 -17005 -287658 -322942 72498 -223193 -3018 334671 45494 -52714
9556 3267 -175166 11082 207205 -203374 26456 -187745 -135294 66509 -434434 7384 101688
9545 101688 -311 -66510 -65316 61426 182681 -267490 -42882 147986 104022 76366 -88274 124931
9532 54740 -148027 372756 -169867 55157 12576 8025 -60493 279224 -296657 -129220 -253401
9521 -253401 231281 -189791 -238067 122198 -139690 -333687 -100527 -29972 -210655 -175818
9511 -175818 35185 4575 -137198 138635 -145195 133207 -130204 78657 -54251 -174838 141450
9499 -70001 -118902 -100125 207349 -84089 -174830 -247267 134292 49651 41538 -152106 -233761
9488 -233761 5623 58691 10586 5855 -223381 -293303 -83963 -77329 -73935 108554 -448836 40845
9475 299539 -60684 -341313 131298 -357855 38120 77878 -348804 -238347 -302404 -266017 -61245
9463 -48866 -99078 167222 -143811 -391436 202651 6393 87305 -225008 -94841 7126 -55589
9451 -132230 68232 -89178 213954 -138695 254742 -129591 216412 190816 95214 48662 -311372
9439 -542905 116851 79329 -287867 276586 -47603 -343462 332185 -80394 -59705 -80874 114526
9427 -198938 -130039 -775299 -391311 89868 -109837 -253086 281186 90180 380754 -365936
9416 411156 -4748 355265 -14081 -279033 -104049 -511049 -160588 -449428 -355568 187449
9405 -152229 70277 -2961 56326 105171 -110199 -320887 -15585 422 -156564 13775 272817
9394 272817 251580 -180977 142474 -141025 10330 182746 -287135 306637 161454 294692
9384 294692 75182 -25259 -271638 55554 109106 -192385 -198068 -76059 -129288 -290816 -9191
9372 -94802 225412 -303786 11049 -82809 -69436 -374919 -485125 -94211 342591 316156 31518
9360 -162037 -49837 -75115 -86871 18015 66059 345878 66999 -56290 161596 -282757 -134899
9348 -223044 -97638 -84912 -104835 126073 -29654 -122811 17536 29721 -60423 110257 -270387
9336 -3160 68182 21249 -39250 -3483 -137828 -167077 -158781 103289 -294252 -31979 -13570 174124
9323 -358463 -127830 -240021 -43512 -78323 -216890 61039 145556 -114469 -12611 -115742 231369
9311 109410 -101515 -165024 -276229 -346928 60331 -185107 136458 98452 -135795 -75666 -239214
9300 -239214 -183949 -136059 -212820 126146 29184 -323183 -87780 158229 -259312 -60614 81492
9288 46777 9116 80003 -370722 -62882 -45203 -91111 -157979 -278264 -93140 246973 -214729
9276 195829 122490 -183166 12580 -247965 -1203 14544 -8041 77539 -183182 37589 -203374
9264 -65988 -32280 50529 -43409 120599 64575 -19625 -328025 -116930 -321405 -370759 199988
9252 121571 245368 -281530 114743 -40213 148426 -148387 100692 -36732 -111371 127375
9241 -68195 -27908 -199951 52034 -330173 -19821 -62484 169425 -176861 186310 -21853 -210614
9230 -210614 -245425 145186 33808 -76028 74503 -344501 -82030 60629 88796 -8835 -410872
9219 -410872 -145025 80281 7669 -123764 -56874 -198809 -211969 98900 -6486 -177890 -32933
9207 -59331 -251760 56212 51281 -190284 46971 -66881 -110161 -223433 7806 -201187 -63279
9195 -106795 -136409 53562 147617 94540 35793 95996 -81291 -373075 -45817 143547 -34948
9183 -83955 7896 -5691 98148 63196 -173131 -240288 191203 28885 31890 -461771 264630 109298
9170 163555 3742 -167844 -7829 195874 -34145 152191 -168174 180777 -45811 -4513 -144600
9159 -144600 -313163 -37732 132257 -39395 -221691 97114 -77742 -342203 -105475 95237 -333915
9147 -160731 -69660 -182282 27970 58981 70789 -46812 -16095 132207 54349 -232996 132246
9135 -91456 20362 -22179 -105825 -231606 134845 -29978 206661 -142790 45524 31438 -21759
9123 -180823 60582 119354 -164970 -52374 -64521 -98290 -174304 34303 -154153 211355 149849
9112 149849 53959 243075 -87666 -231386 62475 -151214 -59956 99296 -336694 -201063 36192
9100 145401 88972 -18733 -44537 -112502 -52879 235284 -283741 51104 182463 -180496 -150522
9089 -150522 -17991 -156559 -131712 18769 54052 -18909 -67794 -7586 -190401 -204177 -27354
9077 -15808 -89296 -99747 -163887 -258751 156515 170529 -115279 -296593 -202580 30000 13788
9065 -111912 -113373 -131723 290178 7911 2779 -62162 -273954 -93273 -200703 -144432 49487 -48561
9052 150221 165827 254913 -39342 55055 -75649 -73907 -279565 -167521 -152918 140776 24622
9040 -63186 -30564 -910 225715 328966 -200248 -78285 -258851 78189 121173 -98859 -58392
9029 -58392 -317963 -128197 -113919 -309979 143336 99953 126473 157848 -160299 50860 -29016
9017 130918 -212573 -57963 -29837 6309 -106820 -211204 342347 -55571 -207659 -188023 170895
9005 23818 1638 25133 61504 5973 -1533 127596 -173250 177884 -152078 101430 20255
8993 93755 97668 81173 -202381 -176149 -97852 123000 254212 -210164 -175973 -92285 -3289
8981 193628 -114026 -280810 -205263 112066 -146581 -49550 331509 -117985 -702457 3540
8970 -404656 -168735 34829 -157814 -262795 88583 213 -246114 -282980 -42690 -400985 -117721
8958 -214627 -168377 11995 -279694 170256 -304269 37720 122378 -37770 42315 -133599 733
8946 -82706 39908 18438 -250363 -263004 -400738 -182939 55362 -71855 5908 -124600 -259001
8935 -259001 87354 204486 103111 -321085 -5005 -226060 -179978 -76602 -166007 -40532 236402
8923 611635 2749083 8197295 12649237 3334562 805464 787999 532402 -32252 204660
8913 146955 190754 76948 -173984 291917 117179 397208 398213 -68625 -46558 -70197 -56449
8902 -56449 -53887 -38426 -282269 -7640 -140741 162074 31477 33951 37913 59641 -253695 -40229
8889 136412 97063 -26149 -93607 127107 -362906 -218336 155361 -63916 -63687 -445373 -92220
8877 -190102 -5871 -17942 -153783 -185757 26247 4395 133436 174672 -66253 -151597 -26072 -59059
8865 -59059 198400 148742 -2106 -258738 -500373 17542 -298835 -26394 -223896 35940 -125546
8853 359204 -56336 -41165 141449 -83401 -78876 115034 -221268 -84190 -51867 -205559 60994
8841 46490 -243913 175246 -375132 -115642 164483 140121 9800 -182186 91057 -11636 -314962
8830 -314962 -97967 -300667 54054 -65069 67324 -105924 127966 152581 -79167 8754 -249084
8818 41363 107930 200567 71550 37151 635 -237280 -45171 -64168 -20327 61363 -51984 334851
8805 40530 17526 -187430 128316 214586 -109631 -74856 -2103 -355538 -4869 -164071 60563
8793 -46623 -170808 140882 182308 -186308 -226814 75328 -255506 -67784 -419794 106399 -120725
8781 126317 -387115 21532 -121289 -22564 75063 58136 78782 -64378 -282900 76526 -193927
8769 -39709 113833 -489823 191851 -38523 -1563 -112278 132799 -319356 -254153 -200274 -67062
8757 -113991 -330244 325862 -202759 -208693 22935 -281110 11408 -183918 -95126 -93265 -325464
8746 -325464 218478 70638 -230208 -9740 243016 204035 112196 -383396 -163727 -179940 -264358
8735 -264358 -269755 -125040 -63795 -206371 53209 -5389 143105 34539 -90439 72175 411048
8724 411048 -384427 49004 -188200 -188206 203579 -84396 -198420 -69819 -34058 -58073 -161067
8713 -161067 -128684 141957 207682 92071 -69241 94003 50559 39757 164874 -129376 -98691
8702 -98691 162718 86069 3517 356741 -310896 -8736 -199383 -110226 -234011 -37222 -313320
8691 -313320 57135 -149555 -323480 -60064 128781 -210134 6689 352229 -343654 -488385
8681 -488385 40348 -103405 -114532 -98502 74120 -82174 -80895 -83633 193868 -42647 -149669
8670 -149669 -227680 89793 -49846 120501 -183557 -74128 30596 36136 -52642 29589 12301
8658 188964 -29264 103926 71579 537 73149 -401975 -170900 -130455 -263433 -62957 -46292
8647 -46292 -205493 42718 -388205 -35086 119516 -535356 29937 9025 -111326 -86671 -194046
8636 -194046 53212 -157488 257176 -25388 -71691 -35526 86214 -336634 55203 -468991 -176236
8624 88493 121417 -251669 -230794 156922 -1899 -78741 78930 63136 -59204 37547 -84636 168429
8611 -203605 -157810 -194574 -15745 206616 -5719 133659 -139666 -278664 -56750 121403 117365
8600 117365 3997 -118967 -6956 -310618 -13213 -244939 151785 -388756 -49156 -7432 -108111
8589 -108111 -187918 -147385 -181995 -102980 -168383 -102426 -69405 -109335 -30881 394900 -16292
8577 -111454 25113 151075 -79882 135681 33186 -95427 84031 317834 -203914 -254865 -191830
8566 -191830 49149 -139900 213807 -35461 164344 -229915 -231828 131313 107022 -133506 87691
8554 138460 -117056 -147734 155455 -42053 -93808 329505 -246864 -112300 -295803 -502474
8544 -502474 -146950 105530 -139552 -264407 47522 147070 -69357 7973 -239103 -176435 144235
8532 123195 -3224 52212 -68826 -127373 -191896 -134358 -156412 -82855 -143695 -275299 65761 -330485
8519 233179 -148375 108507 -71129 -274847 12456 -188122 -119477 101910 126163 258019
8509 258019 -149108 84852 -245706 9029 -340944 220693 114579 -145255 149839 -42069
8498 24713 -207205 -26055 -241112 -70134 -18193 158000 297166 -86985 20145 -268817 -145520
8487 -145520 386172 -117682 148016 -17095 13922 -1333 75339 46675 -99383 -171361 -319774
8476 -319774 -236496 -24790 -102303 154368 179551 -70628 255868 7212 -6527 -123700 -63179
8465 -63179 -156520 -422510 65453 -278675 -5882 5065 -553520 -778 -105708 114410 -3984 -264826
8453 -264826 287533 69483 31940 2504 -26334 169761 10444 64170 -33906 -235180 -15103
8441 -319469 -103578 136980 100690 47650 -41511 -160537 208098 -72887 -254460 -125433
8430 -244264 -141908 943 -8743 258850 112141 -231753 73810 -23385 192394 -314152 -285823
8419 -285823 146734 213638 -128819 -340772 44410 -4112 -316682 39188 -130521 -111921 147410
8407 165520 -10630 388930 -263974 147838 107295 -104388 -241616 -147058 -240326 -358 236788
8395 -386215 41418 102453 -311415 -121469 -128863 -43129 249723 143088 -41874 -259292 263481
8383 -272748 111930 -296926 -92377 -50268 59252 86531 65038 -108907 -8742 -133498 -35675
8371 -199744 -140105 276515 -147816 75318 -170027 -187759 -252141 -274904 -101354 -203648 -291327
8360 -291327 -212967 -214829 31155 -59052 -479577 -32504 -26786 -219026 -5814 -52584 -266057 -133767
8348 -133767 -147048 -251538 58349 -215944 -196712 -8701 156533 -119753 -66388 56927 -129223
8336 -233664 -104 285834 -231976 -96065 -1858 -457270 -171638 -100211 -49252 -214684 53905
8324 86858 64944 -125455 -272691 39772 11502 -276222 -352833 398472 83636 -56873 -403147
8313 -403147 30001 -118365 141038 115358 105109 -19460 -132777 -297517 -134446 42190 -288464
8301 -189554 -120512 -176525 140232 -41606 166455 121181 -1088 153882 -81806 -48444 -32955
8290 -32955 -393518 -20611 14302 -244041 33674 28326 -366721 113254 -102422 -127614 -222109
8279 -222109 184496 55762 -39380 54407 -317016 425964 86702 -60460 236983 247258 114893
8267 -109791 -223258 -19349 -203056 67340 -285930 258144 106315 186585 3178 196804 245471
8256 245471 207179 -41154 -142398 -64088 -142266 45495 -270861 -246508 2842 142376 88831
8245 88831 182222 189749 -56858 111959 6397 -76778 314769 46363 20278 -294437 220034
8233 11640 -307984 128036 233255 62395 -186170 -122084 -33738 164529 194371 -418513 66871
8221 -154593 106951 -304648 -73909 107299 -195188 155450 -17283 -192462 81788 -81771
8210 -155548 -57017 95282 -239005 -190405 313212 -89200 16315 43365 -359977 82478 -183010
8198 -55432 -224716 -11500 -26265 -151105 38109 60794 -15299 6494 -91311 56833 17140 50535
8186 50535 -185301 -13368 -191189 -19674 41139 -34487 -154602 -102760 -215196 -217265 -125972
8175 -125972 -135238 177025 279842 -48730 -103480 171050 -24739 14968 -395163 -62505 -46068
8164 -46068 14569 -77475 -104101 57701 138185 206297 -324036 -165780 -78909 120406 -295405
8152 -88209 75067 22295 -222011 76680 -151508 111599 -116715 -172434 73367 -182452 -23442
8140 27350 -216397 3057 -56659 209982 -133012 -23458 -64916 -160962 -46851 -40850 -214781
8129 -214781 -84548 -169906 -273455 168521 19665 -370653 63416 169145 -55852 -346231 47158
8117 -28922 -145915 -262376 -200961 26025 -271126 -199315 -339030 -36325 -80781 -348063 -42965
8105 -11570 -292739 -392663 -127051 -80456 207232 -136816 -145123 -74936 173984 325025 88131
8093 78548 217888 -155685 -139980 212064 158509 -93354 192234 -117589 3610 264726 -11020
8081 -40846 86685 -234247 11463 -378081 41108 186151 -129128 -134762 -70688 -209827 -212180
8070 -212180 -357395 191353 102872 -24119 -101459 172294 -153117 -29511 123409 -30885 189919
8058 -220531 -30538 19070 164224 -194367 64467 -234739 -45130 -31622 10345 -95997 -83630
8047 -83630 5015 84440 120482 -77509 78651 158828 -305199 -265373 -56725 -221585 -222648 -3000
8034 -130317 -179552 -170628 102004 110994 80176 -134621 84702 -124994 -82318 10902 -207310
8022 -511451 -150711 -170493 95348 -130252 124604 -43333 -76100 -28773 -43007 -48292 163029
8010 -255248 93332 -13504 -156412 -80938 -215037 172856 130303 51333 223425 266906 207387
7999 207387 45423 -158472 -19994 153871 -148888 96679 31929 -48466 -21706 71123 -2118
7987 -352668 105782 -13527 -376559 -162443 148176 -70857 -474119 42470 121461 -99694 344553
7975 -181005 -166617 54425 -112946 -131136 -133812 150705 -193844 -212711 -310376 -63052 19941
7963 -67724 -38199 346035 18102 -96643 81242 284182 -92581 -246025 -165624 283312 64438
7951 -231237 128631 158210 -278912 309311 -178530 8705 174328 120447 9300 -115212 -45246
7939 -303273 -52378 -35448 32952 -163114 -66241 -83064 14619 -74200 -120552 166528 -114180
7927 -54158 -90801 -61699 -71243 -43592 -10274 -236639 14184 -481411 280466 -146291 71980
7915 -146065 5191 -29232 -282465 42314 -201666 -396539 -81822 68715 -353981 -149476 -55387
7903 108308 -66111 -114777 -140538 -278341 -84813 -10544 8415 226828 -120941 -271783 124555
7891 -118155 33560 109722 -281342 19639 19430 219134 -284577 -322965 -265935 302210 -169039
7879 -143993 -210942 -5757 328752 -3044 66175 -510038 77928 346929 -270591 142546 45319
7867 -156898 -14401 -217875 98593 -125750 -288711 -14272 94397 110827 -333401 -24264 231602
7855 -7362 24300 42952 -405671 121793 4192 -39286 -217463 109448 125719 -262436 -105450
7843 -28551 42758 -206979 405215 -267424 171486 377183 93533 191981 -27087 190788 306474
7832 306474 -33264 128966 219331 -1596 -87986 -389139 111482 217346 -196834 214167 134527
7821 134527 53507 -232187 -58968 125214 -94936 240955 47570 204334 -159203 -282414
7811 -282414 206116 85445 282038 -41257 -92558 38951 33711 176855 282510 71143 -25160
7799 -10536 25824 -69209 -338192 -95006 -76845 -173267 -20335 119651 78152 -191067 260663
7787 57141 33526 -127499 -174896 -334632 -139848 219932 -325495 24325 118757 -117919 -105175
7776 -105175 -118299 -234788 -97209 85020 198557 -90459 -136564 172341 58766 2538 195102
7765 195102 -73291 -188147 -157755 -528568 34575 -58643 -57003 -92496 -62830 237616 208359
7754 208359 -346197 -195339 -98006 -98926 -131580 -29597 -414957 283209 202920 -70511 21237
7742 139024 -59752 -79900 -150246 44496 17796 209473 -253391 -30610 2044 -190074 210994
7730 266584 -54062 30915 -177457 146767 68662 -176385 134998 -63466 185748 -161428
7719 103761 144869 -28882 -74565 49312 -88615 -207563 24144 -118074 86161 -117504 -211572
7708 -211572 -104558 -27007 -21549 -325569 79113 -190930 -34718 138961 3189 -8702 -222344
7697 -222344 -153937 -347605 -117190 -105985 -186449 -435141 -77166 -112822 178479 147104 -12096
7685 14259 10204 -109913 59879 128180 166883 -109690 -15153 -240523 -8206 137876 -117511
7673 -70863 14091 -235484 -280607 -237173 -396891 79362 -60777 -498830 133140 -215584 -235216
7662 -235216 -102907 -291568 -180455 -179891 -148242 -223550 79249 3607 131863 -193510 345934
7650 75349 -266919 105921 -35988 -163590 366170 -118529 134838 -311176 8738 -108254
7639 163224 7927 -85072 -8118 -169076 -1289 11508 -148524 2176 -285959 362 -224602 -100180
7626 -140772 -18821 -375659 -160377 145674 64992 -27927 -140526 -275444 94945 163916 62068
7614 126049 133229 -4 -172066 200226 -440543 102052 173735 -210992 -286541 21774 75510 -282086
7601 116894 -663 -106074 120780 -115106 -134380 -41253 -25312 38785 -88610 -37625 -163254
7590 -163254 -399448 -270147 252238 70054 -177473 3991 -205079 -209550 -192578 -157625 -173029
7579 -173029 -14229 219376 179160 -328248 359994 -160865 228338 -181404 -303675 -142738
7568 51746 -61906 -21267 -7269 210599 69737 -38173 -20861 82316 -115153 -243942 -212721
7557 -212721 -144149 -39091 23190 -2898 114833 -39723 59828 80115 -281098 15062 -18306
7545 31434 -203096 198428 -5521 79961 -121595 -200396 -395691 -137157 145279 -54140 -81040
7534 -81040 144469 -105866 91435 103247 5717 -61013 -251751 -193106 199718 -271487 -146777
7523 -146777 -146683 75136 188998 255137 108761 -29474 35636 -50624 44667 24345 309722 85154
7510 -204435 -247056 -62578 101373 -138883 -28423 151664 115417 132426 534365 72678 151240
7499 151240 -43425 -82851 146744 -16433 -104964 318429 32233 -118597 -34790 -104411 -124730
7488 -124730 -111434 -94704 267731 -106886 -175853 -38096 -413225 289400 -425448 -101139
7477 -55317 60220 190064 101519 31240 97142 -143899 -240028 134230 -87705 -191798 170184
7465 -134536 -310903 -20125 150897 416307 19124 -244253 4589 -219517 -152170 115388 -94872
7453 -146079 -155448 -28255 -133311 120627 219588 211175 -196604 -56048 -7302 -3777 -311584 -134802
7440 233320 -118352 49463 155035 170982 27689 -311637 -93707 -124264 -64454 -302099 -271526
7429 -271526 69470 -131889 130459 -172517 184823 33467 -210394 -57600 -109438 163223
7418 -63005 -71425 112193 54878 62434 -157133 -107940 -39296 90829 24627 -197811 194733
7406 -87589 145403 119615 85860 -352238 26348 143294 255700 -38305 -118654 83236 -88381
7394 -169086 -158640 170843 -63452 -232163 47900 44826 55810 126033 -127766 -233090 -103755
7382 -36463 -245185 65635 -306963 161811 -174794 27958 -30018 -257349 -56511 12638 -143368
7370 79155 58755 -24411 -40036 112688 -235099 13556 75315 -182497 -148563 -346782 -29756
7358 -76928 -402520 4460 -188306 -24697 138844 130306 -21853 -396337 -231 -356245 109009
7346 89342 -164993 -237261 -61015 -109703 -289315 365712 -86541 268246 -54516 104981 -82016
7334 -122986 432358 -291719 -303195 288334 -155467 47949 22218 -43983 -69693 56099 -361913
7322 4973 -30733 -27294 33672 -265839 242400 64927 -76818 30064 76643 23701 -141990 -100957
7310 -100957 3351 -13767 159466 95485 -1677 179367 -154837 218460 45398 56416 -251521
7298 -83337 -41310 -35109 -53670 -227727 165396 232054 -353798 -209823 -86842 -56279 28237
7286 99167 -30734 -95984 -19090 -318207 -132958 275248 106667 -332778 -109853 10200 -12255
7274 65372 335865 -72609 -387946 74211 218392 -107396 -28435 -308292 -402349 -238965 -63143
7262 -200394 95380 184086 -58094 -197985 142523 177816 -67554 -43647 -3757 -164879 -62480
7250 -122857 167664 -419779 -46151 153597 141763 213918 179910 474748 -113671 14914 -19301
7238 480014 -154893 394640 -145072 154839 32980 43282 122955 -46776 131938 -287637
7227 75326 -1124 -229909 -143149 133459 -31858 -268865 -38538 7676 -304290 -37972 137887
7215 -206672 -67638 -121829 168907 -52078 178861 118141 -5397 -142764 -327544 -24760 -337181
7204 -337181 138220 97377 150978 92177 233896 -136522 156057 44185 -189653 6854 -167495
7192 -68377 -113523 -79337 -200134 -312284 137313 -224838 -44673 84771 -214659 31838 -124720
7180 -190749 -219638 -252143 223510 -141963 84645 46558 -140565 52640 -177629 39663 -91119
7168 159806 195660 121431 -50650 -158950 -310955 341302 -126225 21945 -131754 -186999 58932
7156 -179551 -61389 309607 -74811 -24249 26549 -99975 188727 -136378 43431 -110481 -154244
7145 -154244 -352820 -197331 -132014 169480 195370 -190183 -265623 78644 -335345 -30547 250928
7133 -23045 -185844 225121 -79057 -37678 222018 -13579 -180003 -7075 -241669 -70857 -224164
7122 -224164 -328628 181613 -22580 -518385 154439 18690 255605 266466 141537 -75471
7111 -255386 -240468 69799 -107911 108265 249382 7849 -101515 279037 -24724 5859 77626
7100 77626 40727 348323 63607 -103946 71643 -442734 -39630 164197 -122872 -36662 -2351
7088 74858 206226 382842 -155155 -117605 -77336 147495 -6873 -98726 46864 -445819 29131
7076 -369613 106569 -70991 -351170 -21975 -286 -88014 137759 -213540 -175730 50562 -380522
7064 -62626 -154959 73875 102689 -557410 145381 208421 -309850 203728 266908 113462 394956
7053 394956 12518 231282 365127 -207303 -279448 -261149 83201 241245 -51516 -117902 -259799
7042 -259799 -291304 46682 165886 -169663 -370232 3458 -150888 -34932 233574 -53269 -125966
7031 -125966 48531 -323473 -9553 129932 288243 93266 483326 -223068 185847 48888 4797
7019 10156 -70359 55988 -219002 -166723 62423 -236763 -81702 45870 -131933 41341 16460
7007 -152872 -282845 -142582 130585 133872 17013 148872 345993 -147016 48394 21302 -74459
6995 -196774 -144199 70083 -140159 186986 -129711 242400 -107926 -204745 -33314 64013 -23425
6983 -57338 -39427 -75219 1955 12703 -173632 166133 -29822 69963 70685 250759 -427951 -10018
6970 250695 119029 310900 74606 -258539 86750 60272 63649 -55790 -348355 -25508 7193
6958 -271158 -137490 92861 -374436 -124592 349184 246242 171116 289489 190924 119549
6948 119549 -6703 46444 -101154 -60733 -47462 -96821 -185964 67707 -528961 -110629 183220
6936 206081 101227 -93735 -101934 -141870 158084 19981 55293 117347 32184 -142083 40588
6924 -387898 -50074 33601 -192271 -40221 205953 146319 -40824 183601 -287309 -70886 -13663
6912 44783 21623 -448932 -51449 188397 -123271 -333371 -201357 5660 296902 251699 -209846
6900 -74392 -45000 50176 -246134 205394 -190645 -328606 111841 54122 56819 67874 -99789
6888 33052 128888 137158 153465 35054 132900 -236903 107672 390263 81047 140293 -38336
6876 20947 -51962 -283747 -48062 -171927 74077 -196199 -327383 2460 -122826 7068 -224464
6864 219005 213664 -193762 73628 196004 -335691 -164917 11060 15312 134949 -214891 16239
6852 -10697 -71153 -190398 -342822 95 -180493 -81523 -77162 -26558 336848 156671 -123229
6840 -202919 -181002 -16701 33592 -253929 -82734 30054 -71039 -43068 -87114 -41208 -245513
6829 -245513 132443 -264692 -127528 -292562 142660 -206223 -326700 -91989 15366 -74751
6818 -9930 -275054 10464 6681 -400643 -5965 -193878 204172 4491 -37797 10099 159079 -110093
6805 -323695 -248187 182087 -173121 178303 206988 62963 218969 -101505 67858 -79201 -242195
6794 -242195 241396 60320 45689 -170363 301289 290179 -30189 14637 -426003 -165804 123572
6782 -249261 -39770 -224470 -52718 -34221 215423 167745 87725 37976 -213407 274373 202912
6771 202912 -222862 93912 52949 -444219 20382 -235637 -206834 232010 63277 -137634 -264608
6760 -264608 -47284 146775 107204 52803 404325 -81194 335429 131123 112017 73561 274761
6749 274761 -85764 -313425 -73235 -87847 -199823 107531 100722 631831 57633 -191047 226667
6737 -87244 -236199 30022 58681 -166067 -21292 117871 112374 -82315 -225338 -276533 -96850
6725 -82308 -158581 -136235 -102242 -156607 161912 -332141 153759 -25897 347187 47001 -21456
6713 62609 -188362 61951 181550 119533 -197637 -210663 139563 -131867 180494 -50986 206207
6701 -183270 151141 -117200 341504 34168 23907 -88185 -284656 367233 76078 -74189 66590
6689 124840 -72941 30631 -61993 44992 -113264 -351792 180266 -451241 -7152 -27240 65565
6677 -132744 -96115 17027 106487 -240828 -266702 166743 117487 258346 316958 99214 -302749
6665 71257 150418 -52204 -55712 332005 -42205 -137626 35170 -20152 110965 -96935 -62860 -51767
6653 -51767 15863 -255663 -28137 -97426 54144 -19080 27302 -343075 -96566 -54040 -157969
6642 -157969 -255910 142232 4182 31387 2536 4007 -337830 -106316 124137 101273 -27603
6630 -158063 269173 -81780 -317134 -73962 -442886 -143135 139293 -485401 -86417 4572 143467
6619 143467 -42350 55986 -261450 85318 -578 22758 -449405 258056 -20087 183609 -16222
6607 57767 63599 147526 397813 174321 104415 6592 -43210 400423 -83899 -145420 128866
6595 127158 680379 -14418 -7002 16561 110562 -216187 80996 2558 -340011 57831 244191
6584 244191 181058 -105951 47142 52103 -100836 71198 27344 169470 -245430 96116 62751
6573 62751 27409 88499 67425 -68915 -282798 -158706 -158656 65990 168707 -57292 184746 21187
6560 -85582 214134 -167052 88520 -14439 170915 -49855 66097 -244516 -210157 177824 -143894
6548 -229253 101396 177536 63546 42775 -46623 -7830 15855 -313142 -138058 -6753 -98126
6537 -98126 -21011 417373 -192554 -17050 -162653 -72077 -37963 -123385 44853 91131 -211967
6525 132904 311852 309025 -291290 175623 251736 -121009 -302158 -38274 -229876 23847 183283
6514 183283 337473 -70537 103187 124419 -140806 -303097 75135 -6313 174109 120537 -167007
6502 -104331 -159027 106904 -142302 -256407 -36584 -13694 -290448 291463 -21080 12391 104913
6491 104913 19925 -98307 -49072 338466 -376695 101908 -118113 -35958 285760 -249068
6480 -61627 -7175 97873 -223335 5133 136235 86640 -141576 209889 175546 8529 -43958 245743
6467 -151246 -81223 -380887 220304 161910 -227113 -11431 -139689 45505 -44586 -270189 171838
6455 -61949 -112116 -172644 -134794 -260018 -79301 133351 -103156 205869 235340 102498 -19591
6443 -37447 226709 -287788 107263 -215857 177612 13507 311737 -294332 100240 241261
6433 241261 -97063 -7170 247142 118962 279798 -289087 -227751 -598 -60605 -70479 -311747
6422 -311747 43734 389949 -253101 262595 -262091 204029 -255345 39148 -119727 -20357
6411 -168698 -269745 -115540 38584 -126817 -54456 -430707 -96227 -285656 -37104 45734 23915
6400 23915 32665 -218467 -210663 92377 166512 50262 -162765 -217304 -232854 -144938 333242 116152
6387 -66676 129459 -128633 -335943 134378 212896 39659 -581495 -37332 -71791 65251 -40049
6375 -51604 -50562 -71482 -314572 88088 264135 -161241 -426234 -110895 17570 -144352 -57327
6363 -20508 83488 184564 24598 -86249 40721 -251456 112315 6406 -129178 -174714 -240527
6352 -240527 -95705 -195546 -260036 -86734 -202493 259071 49934 -170952 -360357 -129558 -219050
6341 -219050 -299242 -143213 101654 14012 -201626 260266 -304395 -222491 -218891 129023 -197185
6329 -108725 217467 72335 128609 -23046 127401 -9674 -169579 108047 151231 -152852 101316
6317 16612 82953 -430112 -155348 -60226 7536 110030 -25264 -119203 37918 201013 72609
6305 -24623 278687 -112722 -274057 140024 122032 36295 209587 -5528 36258 76505 -52848
6293 9843 112586 232257 -236887 -72008 -245785 -190397 112831 130466 -96462 137337 50004
6281 -283214 67947 169076 -68678 -116375 136131 201442 34838 53577 -290022 18693 -147591
6269 55619 -68333 -115326 -158695 344762 -171556 -95868 -222514 172314 -59643 34485 -142655
6257 198275 -113840 8388 292553 155662 276639 63936 -99675 108803 -70566 -71704 117922
6245 205927 98670 40497 -5826 214961 -23130 58146 75560 -75730 25334 -51462 84133 -175755
6232 -90746 -281098 114989 165853 162508 -217952 -519307 110341 -235288 82260 -298413 -16930
6220 -512853 527377 -76170 28027 -103845 -19601 -66518 40212 -157620 51691 213942 212225
6209 212225 -170673 356833 -117966 -365149 -43475 -82423 -23675 179965 -125876 -62205
6198 132607 -293262 113042 -321378 83591 25980 124994 -345041 -78485 -11763 123767 -59706
6186 245668 -356347 -156015 -143299 -219135 354501 18029 -252192 -29610 44639 -201378 237791
6174 225788 292131 -289081 224056 81808 187556 169374 -69966 -99668 72357 63292 -160214
6162 -25746 76194 -20929 23176 -71424 -43927 -42093 36627 -199035 -244336 -77774 -173472 -118270
6150 -118270 -64031 -31468 34454 -346611 184873 22244 -268370 -221405 147692 17867 335511
6139 335511 86815 143083 94040 79217 -257737 -61058 93297 126033 209165 64465 -178700
6127 -144956 -91621 -265455 -209973 -114770 226588 26873 -345579 148867 43085 26778 -259435
6115 -14145 84860 -181766 3300 203501 204283 -102415 -244161 -64500 -217378 -480 241590 20919
6102 -278345 -48000 -6477 -46096 7317 38530 -38823 -39214 -49028 296774 13517 89342 -162357
6089 -197870 -37452 -55954 -129344 174494 -182715 -15045 -5726 137216 -148486 -109451 38767
6077 -35305 71281 132477 -52132 44054 -191263 118220 135527 -118006 -180724 -173025 3099 -47118
6064 199827 261176 -210709 -15771 -346345 198014 333018 49344 115607 74665 179689 -178463
6052 104242 -13957 104477 287651 -203029 -179742 45654 91927 -136677 30386 205794 340993
6041 340993 -56745 -84227 -102166 -41987 -55268 5452 -135466 -158207 193499 106354 107636 -290403
6028 -67045 -129266 -1624 -24782 -77525 -216312 61673 20384 -220937 -278723 60783 -145838
6016 -29643 -291866 14676 -15134 457 -94105 145747 -66757 -229499 9705 -238301 232470
6004 -75172 -251815 8402 -445583 117196 -246249 121914 -32150 -122716 168006 122843 -115427
5992 202643 -140703 -213312 41576 -229623 -47031 35299 155522 6229 9395 -120076 136150
5980 -252881 -533298 -159905 116173 142332 -105685 204829 -17617 123333 142570 157231
5970 157231 17736 -7341 16036 20659 -15248 -241483 -319533 276636 -46808 116474 40687
5958 105073 -221119 -266194 -65903 -1259 154192 267023 -185169 50483 -71641 -144285 9298
5946 -83115 -179611 134583 -124316 -74983 62822 -30660 88984 -75954 -60837 -20069 98080
5934 -116661 -117416 -21297 55829 -264681 28493 69542 32279 227116 -666179 98952 -100328
5922 -3863 72882 -6743 -239 -49246 124767 -70918 -218225 62506 142766 93717 -318192 242125
5909 -186223 -23448 388970 36740 87938 -54304 -147967 -56219 -402786 -379874 -71591 133599
5897 -276930 -146583 129565 354836 8662 -179529 -179321 5554 315368 -33891 -86990 204959
5885 248100 -389895 26534 -11012 83003 -224212 220383 146781 -152513 23735 106021 -256443
5873 -102410 78905 -272585 -387856 20896 -57097 183702 122347 -279509 79565 66266 -107483
5861 -168593 266659 -32138 -147867 228984 21887 -133605 74515 -106772 239770 188237
5851 188237 -110052 211442 -43584 -50766 -121323 110615 -85845 30878 110942 49868 263204
5840 263204 25338 283113 30574 223472 8611 -519497 -110732 -449784 181569 2227 -63069
5828 201211 -156044 -116001 12167 90903 -25332 -364091 -14333 -93686 12436 -185624 136844
5816 -357611 -163003 -97300 -67332 264295 31371 -151138 -214615 201785 215520 -241073 -116694
5804 -243472 79032 86259 130820 113511 271427 -118792 160056 -53467 456598 261909 230851
5793 230851 -167440 -129294 259477 22787 -56206 -183810 -78437 -264766 74524 -27188 -355971
5782 -355971 41198 147293 -278833 -55394 53230 -69443 -371310 -100217 189269 283809 -70846
5770 70549 30160 -12989 -21930 273911 -276877 13231 2006 62767 226522 108618 -135081
5758 229092 69869 11253 -64947 396273 29744 22351 49272 11954 91860 64311 -54586 -66590
5746 -66590 -88006 -14971 65292 -21623 -92331 -69009 111949 -269383 149237 183551 9063
5734 220470 57577 -326723 75822 -217491 -15445 -270600 127070 -393307 -26851 6055 -165597
5722 66171 -191884 187750 -63672 79351 184781 277130 -123590 -27301 235775 125821 -130292
5710 -81903 -166990 248994 132526 -72927 23413 -29215 -70677 -384835 -454727 25465 -3183
5698 5500 -71770 -148819 177395 70209 121060 29542 -30885 -52046 24965 -64478 -149710 545
5685 88967 -229320 -241788 167846 162443 -121141 2982 -9695 70631 -311036 97785 128232 -49802
5672 2921 -153594 -126539 -220673 58732 334338 -72766 16264 162432 111712 -6587 -177885
5661 -177885 -150381 6592 -172277 89276 268457 230247 -12249 128850 28277 258413 -41585
5649 144578 -120533 102610 305544 8060 255037 124232 111562 87736 169711 -80427 122830
5637 182621 1874 119268 -34944 -48050 96016 -119199 -457160 -23141 -168597 146012 -101910
5625 338311 -134490 175333 -66327 -168827 132295 207245 285244 182975 206253 -43814 -65859
5614 -65859 -91471 90178 -239975 102162 -145275 -177653 36329 132278 -158293 85205 165286
5603 165286 -21878 177043 -237573 -291931 -254980 69481 -85089 -55257 109741 95322 320498
5592 320498 -224577 -13426 247654 137749 59186 42264 -51854 -108730 -161097 -22614 269547
5580 -105694 -122311 -166432 -147929 -48719 -168413 -46327 -36085 -220110 -43297 -245481 71370
5568 -162966 -22114 -172755 -355844 196961 -41210 184527 -17424 -216843 120524 -188888
5557 296222 -175213 -10219 44946 -75198 -1046 15556 -126730 -14814 -296849 4857 -22154
5545 -217789 -11650 -91386 -8975 37763 163068 181833 174965 356334 -253275 119609 53923
5533 -24264 169179 -56763 -16082 -241595 -196229 116524 202734 119865 57128 26444 41515
5522 41515 -108260 -186207 250109 175499 -163338 -120907 121070 208821 36485 227053 -56294
5510 -189827 318092 -147330 -154864 20814 -100878 -254907 -177882 240214 81723 -15549 -302617
5499 -302617 -23890 130243 -42601 25359 147342 634399 -95325 -149572 142230 242086 45643
5487 -224698 -111043 82534 177651 -205800 -271320 -87071 186162 13452 293554 -111366 34165
5475 390579 -103829 -41467 71040 10045 109161 -55346 -63711 38676 85364 107324 -131782
5463 -95334 -151260 -10907 -98841 216298 294025 31643 355628 -189829 -257469 185252 54802
5451 124848 -21753 27439 352554 -111204 27130 -86743 227769 -175207 -17530 -11618 -206048
5440 -206048 136482 195788 -367231 -180984 333762 -48964 -124702 -150195 -15808 -209819 -252919
5429 -252919 10074 -114421 -85838 -271356 -75794 263399 103709 -140394 5341 166205 -59157
5417 62537 116224 74544 -11463 236960 -7870 367293 37971 -270921 -100864 -18420 -204636
5406 -204636 144709 3454 156589 -188192 -515807 -4965 -45254 23249 -163962 -238895 287077
5394 -83503 52078 -66071 254760 -53021 281000 45096 -407521 -54727 222644 -172906 185766
5382 82469 177783 -105939 -18252 -97707 269349 -302695 -168225 5471 -16344 -126427 -81369
5371 -81369 326004 -16769 -168525 -221036 137476 86388 -207521 -122996 -128823 -130333 45924
5359 -121916 -106003 17079 155881 167850 -156915 336054 -118815 3513 -225239 106746 -29725
5347 28903 178383 -320050 38384 -273734 65118 -212619 -22143 -283708 227279 -264270
5336 124263 58296 162485 79487 38812 273666 61329 64861 -38589 -105301 -126171 17397
5324 8622 -215698 -78234 293314 234101 9371 -138996 -4465 144731 -93320 -29688 267513
5312 -24898 228594 -369527 -151098 70333 163976 -408531 243699 147907 -49006 322350 165054
5301 165054 -53073 221078 -45001 -10962 -88864 -127887 10315 -191982 -167889 -283204 184972
5289 -90053 -261848 -85877 -50260 -14085 74697 -263053 -103734 11873 -115466 -205679 14347
5277 -66207 -279222 101917 290989 280240 104323 148458 72863 -195379 -145569 -34245 -7637
5265 -371195 -74052 -95255 -184758 -31117 -127849 -63440 107290 304613 291814 -93013 89167
5253 78765 55050 -148297 -105020 -92970 -208514 20286 174309 -57083 -160000 181220 82446
5241 -190631 4191 -51724 307046 -179644 101246 266072 -111078 -404387 206010 -117102
5230 97474 208904 37673 -109714 254365 -81564 -20927 -48047 -191030 11998 -103079 283900
5218 22241 175754 -140370 58889 288966 -73667 144068 -103774 10449 -59268 -68514 -185336
5207 -185336 45292 -88839 61866 -2662 350654 143767 -91741 139476 278750 -183657 168638
5195 4740 220977 -46464 20746 166396 7574 -170259 116214 266793 9158 -248624 -128098
5184 -128098 -167687 34 123829 -3472 -362718 120810 196328 -123989 -117737 -167223 -102581 158039
5171 -52712 148905 108807 -315468 -28706 59527 -74750 301762 105610 1509 52904 -54862
5159 42830 -199176 -241316 -182390 -135692 143167 -165151 -297210 3396 98221 85228 -53726
5147 -83747 53771 205830 170189 50297 140779 115625 422533 -40080 207674 189556 24140
5135 222704 52285 241412 -71085 92152 -103197 169545 -239130 54440 106525 140816 34443
5123 -218442 -231587 -212916 -54800 -209502 -52436 185476 23543 134519 -17620 232587 -362200
5111 -227844 -182835 -1273 -42448 -197422 96284 185701 -129310 136719 -145208 294397 22990
5099 -208524 -95683 -44434 5212 -487 106760 394325 336151 -154157 301920 13154 243743
5088 243743 258238 182138 -230839 150969 13414 21224 -108807 -3303 -565993 -30564 -94345
5077 -94345 -82606 131037 -131049 94215 66807 41168 -251059 -38502 26935 -124092 288935
5065 174017 -212755 -226344 -160618 -191823 -148504 43828 165469 138881 -168007 115383 -59108
5053 -202154 -43825 34673 3771 99073 143034 24132 -35824 -115855 -70200 -199844 79212 211408
5041 211408 104744 -93865 -56315 -31859 101397 318236 -90016 112420 66860 25421 126671
5030 126671 -86988 122422 241415 -39459 -185001 140797 184777 -180191 110467 113424 -240410
5018 189047 -143111 187253 -259853 -130787 -110472 157832 28431 104667 -43989 -97986 -65938
5007 -65938 154992 -126518 85123 141575 121314 -59726 -283303 -121639 -111432 -1396 362352
4995 -31317 299946 259308 -103529 -701 80929 -124799 -105489 117140 171270 -279954 276791
4983 194571 -70207 -196738 -9476 -341757 127869 -24903 91233 -85652 -41341 85459 -60892
4971 -40774 -144607 99962 4628 -123426 105638 333834 78150 -24138 248568 -181077 177590
4959 -171347 236108 -2426 -134637 241685 -143188 221505 -40598 9975 -353367 259492 257173
4948 257173 -62184 140426 18859 -429553 -78225 -497396 139758 237017 -51878 -189945 -296644
4937 -296644 -368958 19662 101024 145125 50830 231266 -51229 121620 -256740 55046 -82206
4925 -435756 -7761 -108336 -70457 241508 -81051 150641 22698 -171877 192202 84306 378930
4914 378930 -1936 -66929 42843 55053 62388 39241 -66719 240414 -16144 -69548 54890 -39739
4901 -173897 89085 254019 195725 203342 77455 -191767 -165510 300238 -44957 167935 128529
4890 128529 30021 261529 114924 8174 39905 158867 -206091 507969 50193 -100223 4260
4878 -180537 85768 -164161 -157206 388306 54896 -84694 -201449 196147 -6590 -114233 125658
4866 -24630 156494 29171 27186 -7119 162481 300778 -40583 199589 4656 55049 278493
4855 278493 -204184 172539 11781 -249938 41131 -165694 -102317 -103109 -348060 -203063 174089
4843 189403 -76625 -338426 189785 -209734 -240952 6819 -92780 -91501 132688 -3316 285374
4831 -49100 -301013 -142797 -7451 117898 284367 -55649 132071 56079 -253701 193992 -134856
4819 291918 25872 -80136 -102279 218659 163741 145489 128819 166884 -382725 65432 134135
4808 134135 -47139 -241567 -113592 117562 -10227 -201490 368327 211332 -174956 62331
4797 164237 109971 -10359 -49006 21994 -307066 -355112 12636 154718 -592138 -5557 65240
4785 -257893 -68570 -186806 -21925 -191448 -177539 -346097 -122300 -120166 220611 -275648 63307
4773 -130730 128544 147692 -265372 71547 -153707 -64282 250957 125145 -181511 11037
4762 -37883 70331 -161636 207723 180338 130862 53694 50888 280716 48520 -8138 167020
4750 -241974 41893 109245 21644 90917 60271 56264 -214577 234168 -48703 118647 -106254
4738 -27875 67924 92193 -9860 222931 36942 200892 233724 134447 170896 246750 -83861 137463
4725 -68888 260269 -146198 124182 -59383 -77515 85849 -112891 -227117 56959 29723 148549
4714 148549 -82858 82411 -164746 215686 120528 220819 -171328 127513 -124104 183766
4703 -80844 269755 -96840 268116 88332 114327 -12615 3172 72808 91071 -8176 -22063 -398600
4691 -398600 57985 219208 139410 -86086 82573 85550 283393 142072 -60188 24514 19178
4680 19178 74150 -63007 27698 -20169 93732 279484 109086 -146679 -60456 -337263 13336
4668 -120477 53866 -131403 816 110954 70376 -7526 389964 -152838 -144612 89864 -320697
4656 119072 110442 -73706 65786 -66510 123157 -208706 -41044 -242728 114697 5230 394332
4645 394332 4576 64324 395977 -79059 -20296 324145 123455 -71977 -38933 123278 -118144
4633 105644 101580 83468 138592 224530 -170699 39014 -125725 -363164 -94101 9338 -323945
4621 -421649 212752 266967 132128 87175 130387 131314 -72165 19911 39195 2192 -49584 -116647
4609 -116647 3544 123963 184865 -136928 -150667 242983 -70581 2386 -93842 160736 -147513
4597 -17972 153834 185074 -59392 -84446 170842 342932 -75064 62309 45095 -177004 -219145
4586 -219145 -109617 -78106 -239293 94459 -132345 -12311 -96044 307047 275085 -31081 161002
4574 322943 -17362 -180585 -149197 202859 63354 208290 78271 221003 236667 -66648 -4779
4562 -81183 -51379 -275887 -113121 157989 -159261 -123500 -140666 110205 -529672 77842 -107822
4550 163630 -13272 -34200 366331 -194775 155489 -235813 100554 -250445 -33847 416893
4539 -187121 51688 71958 193142 -320678 -17413 142603 -162065 48404 -196285 452877
4528 42520 35574 -61569 -131897 -145578 168405 170572 61989 76291 28358 -90430 14471 27324
4516 27324 76601 101527 -4135 124590 66314 -64458 342320 -172536 -479654 372676 -225544
4504 -30579 -12964 -128521 100862 141241 -236807 141711 -80365 -305926 -65325 29967 9404
4492 115758 42566 87530 -153347 -203384 -153657 -124462 -148640 -332112 241568 228878 52883
4480 35849 -262118 54098 -83698 -66897 -100526 -211504 159580 15881 -52228 -135665 172525
$$ [...]
##END NTUPLES=NMR SPECTRUM
##END=
