##TITLE=AC1594_CASAH13324_8314249_jSU31GdPd8
##JCAMPDX= 6.0         $$ Bruker NMR JCAMP-DX V2.0
##DATA TYPE= NMR SPECTRUM
##DATA CLASS= NTUPLES
##ORIGIN= BRUKER
##OWNER= Administrator
$$ 1.72 TOPSPIN		Version 2.1
$$ 2013-11-09 14:27:44.794 -0800  Administrator@X
$$ Compression mode = diff/dup
##.OBSERVE FREQUENCY= 400.02188249412
##.OBSERVE NUCLEUS= ^1H
##.ACQUISITION MODE= SIMULTANEOUS (DQD)
##.ACQUISITION SCHEME= undefined
##.AVERAGES= 64
##.DIGITISER RES= 22
##SPECTROMETER/DATA SYSTEM= spect
##.PULSE SEQUENCE= noesygpps1d.comp
##.SOLVENT NAME= COFFEE_meoh
##.SHIFT REFERENCE= INTERNAL, COFFEE_meoh, 1, 14.96094
##AUDIT TRAIL= $$ (NUMBER, WHEN, WHO, WHERE, PROCESS, VERSION, WHAT)
$$ ##TITLE= Audit trail, TOPSPIN		Version 2.1
$$ ##JCAMPDX= 5.01
$$ ##ORIGIN= Bruker BioSpin GmbH
$$ ##OWNER= Administrator
$$ $$ E:\/data/COFFEE/nmr/AC1594_CASAH13324_8314249_jSU31GdPd8/12/pdata/1/auditp.txt
$$ ##AUDIT TRAIL=  $$ (NUMBER, WHEN, WHO, WHERE, PROCESS, VERSION, WHAT)
(   1,<2013-11-09 14:27:39.623 -0800>,<Administrator>,<X>,<go>,<TOPSPIN 2.1>,
      <created by zg
	started at 2013-11-09 14:16:09.890 -0800,
	POWCHK enabled, PULCHK disabled,
       configuration hash MD5:
       C8 4E 4E 5D D3 5C D8 9E 9F 52 82 E0 59 8A DE 15
       data hash MD5: 64K
       21 40 8C C4 11 37 45 56 47 A1 EA E1 B5 90 3A A4>)
(   2,<2013-11-09 14:27:42.748 -0800>,<Administrator>,<X>,<proc1d>,<TOPSPIN 2.1>,
      <Start of raw data processing
       efp LB = 0.3 FT_mod = 6 PKNL = 1 PHC0 = 0 PHC1 = 0 SI = 128K 
       data hash MD5: 128K
       A3 B0 23 6E 8F E6 58 FB 0A AC D5 02 D8 7B 4D 95>)
(   3,<2013-11-09 14:27:43.763 -0800>,<Administrator>,<X>,<proc1d>,<TOPSPIN 2.1>,
      <pk PHC0 = -86.99524 PHC1 = 0 
       data hash MD5: 128K
       84 23 9F 20 36 6B 25 3E 76 A2 A9 C4 BA A5 B4 1D>)
(   4,<2013-11-09 14:27:44.201 -0800>,<Administrator>,<X>,<proc1d>,<TOPSPIN 2.1>,
      <abs ABSG = 1 
       data hash MD5: 128K
       B5 BD 22 03 D4 48 B4 29 6F F9 04 02 F1 37 A2 13>)
(   5,<2013-11-09 14:27:44.341 -0800>,<Administrator>,<X>,<proc1d>,<TOPSPIN 2.1>,
      <abs ABSG = 2 
       data hash MD5: 128K
       A0 38 00 1B 7D F1 2F 2B 11 FC F7 71 D8 DD C0 CC>)
(   6,<2013-11-09 14:27:44.404 -0800>,<Administrator>,<X>,<proc1d>,<TOPSPIN 2.1>,
      <abs ABSG = 3 
       data hash MD5: 128K
       29 5C D3 97 D7 3F 2B 8F 2B E2 A0 A9 EC 1D D8 83>)
(   7,<2013-11-09 14:27:44.498 -0800>,<Administrator>,<X>,<proc1d>,<TOPSPIN 2.1>,
      <abs ABSG = 4 
       data hash MD5: 128K
       0A 51 17 77 CF 34 3B 56 EA 75 6D 00 5E 55 2B 77>)
(   8,<2013-11-09 14:27:44.607 -0800>,<Administrator>,<X>,<proc1d>,<TOPSPIN 2.1>,
      <abs ABSG = 5 
       data hash MD5: 128K
       9A D4 4E 4B D7 3B 35 8D B3 15 39 FE 38 28 96 61>)
$$ ##END=
$$ 
$$ $$ hash MD5
$$ $$ A0 A4 31 49 1D 5C 24 39 CD EE B2 60 55 1B E1 22
##$RELAX= 
##$RELAX= 
##$RELAX= 
##$RELAX= 
##$RELAX= 
##$RELAX= 
##$RELAX= 
##$RELAX= 
$$ Bruker specific parameters
$$ --------------------------
##$DU= <E:\>
##$EXPNO= 12
$$ [...]
##$TP07= 0
##$TPNAME0= <>
##$TPNAME1= <>
##$TPNAME2= <>
##$TPNAME3= <>
##$TPNAME4= <>
##$TPNAME5= <>
##$TPNAME6= <>
##$TPNAME7= <>
##$TPOAL= (0..7)
0.5 0.5 0.5 0.5 0.5 0.5 0.5 0.5
##$TPOFFS= (0..7)
0 0 0 0 0 0 0 0
##$TUNHIN= 0
##$TUNHOUT= 0
##$TUNXOUT= 0
##$USERA1= <user>
##$USERA2= <user>
##$USERA3= <user>
##$USERA4= <user>
##$USERA5= <user>
##$V9= 5
##$VALIST= <valist>
##$VCLIST= <CCCCCCCCCCCCCCC>
##$VD= 0
##$VDLIST= <DDDDDDDDDDDDDDD>
##$VPLIST= <PPPPPPPPPPPPPPP>
##$VTLIST= <TTTTTTTTTTTTTTT>
##$WBST= 1024
##$WBSW= 4
##$XGAIN= (0..3)
0 0 0 0
##$XL= 0
##$YL= 0
##$YMAX_a= 5692624
##$YMIN_a= -11627457
##$ZGOPTNS= <>
##$ZL1= 120
##$ZL2= 120
##$ZL3= 120
##$ZL4= 120
##$ABSF1= 14.96094
##$ABSF2= -5.597241
##$ABSG= 5
##$ABSL= 3
##$ALPHA= 0
##$AQORDER= 0
##$ASSFAC= 0
##$ASSFACI= 0
##$ASSFACX= 0
##$ASSWID= 0
##$AUNMP= <proc_prof1d_extract.lims>
##$AXLEFT= 0
##$AXNAME= <>
##$AXNUC= <1H>
##$AXRIGHT= 0
##$AXTYPE= 0
##$AXUNIT= <>
##$AZFE= 0.1
##$AZFW= 0.1
##$BCFW= 0
##$BC_mod= 0
##$BYTORDP= 0
##$COROFFS= 0
##$CY= 15
##$DATMOD= 1
##$DC= 0
##$DFILT= <>
##$DTYPP= 0
##$F1P= 0
##$F2P= 0
##$FCOR= 0.5
##$FTSIZE= 131072
##$FT_mod= 6
##$GAMMA= 0
##$GB= 0
##$INTBC= 1
##$INTSCL= 1
##$ISEN= 128
##$LB= 0.3
##$LEV0= 0
##$LPBIN= 0
##$MAXI= 10000
##$MC2= 0
##$MEAN= 0
##$ME_mod= 0
##$MI= 0
##$NCOEF= 0
##$NC_proc= -2
##$NLEV= 6
##$NOISF1= 0
##$NOISF2= 0
##$NSP= 0
##$NTH_PI= 0
##$NZP= 0
##$OFFSET= 14.96094
##$PC= 1
##$PHC0= -86.99524
##$PHC1= 0
##$PH_mod= 1
##$PKNL= yes
##$PPARMOD= 0
##$PPDIAG= 0
##$PPIPTYP= 0
##$PPMPNUM= 2147483647
##$PPRESOL= 1
##$PSCAL= 4
##$PSIGN= 0
##$PYNMP= <proc.py>
##$REVERSE= no
##$SF= 400.020009660752
##$SI= 131072
##$SIGF1= 0
##$SIGF2= 0
##$SINO= 400
##$SIOLD= 131072
##$SPECTYP= <>
##$SREGLST= <1H.CDCl3>
##$SSB= 0
##$STSI= 131072
##$STSR= 0
##$SW_p= 8223.68421052631
##$SYMM= 0
##$S_DEV= 0
##$TDeff= 65536
##$TDoff= 0
##$TI= <>
##$TILT= no
##$TM1= 0
##$TM2= 0
##$TOPLEV= 0
##$USERP1= <user>
##$USERP2= <user>
##$USERP3= <user>
##$USERP4= <user>
##$USERP5= <user>
##$WDW= 1
##$XDIM= 131072
##$YMAX_p= 417773564
##$YMIN_p= -17530
##$CURPLOT= <Network HP LaserJet P1505>
##$CURPRIN= <$Network HP LaserJet P1505>
##$DFORMAT= <normdp>
##$LAYOUT= <+/1D_H.xwp>
##$LFORMAT= <normlp>
##$PFORMAT= <normpl>
##$SURQMSG= 1
$$ End of Bruker specific parameters
$$ ---------------------------------
##NTUPLES= NMR SPECTRUM
##VAR_NAME=  FREQUENCY,     SPECTRUM/REAL,   SPECTRUM/IMAG
##SYMBOL=    X,             R,               I
##VAR_TYPE=  INDEPENDENT,   DEPENDENT,       DEPENDENT
##VAR_FORM=  AFFN,          ASDF,            ASDF
##VAR_DIM=   131072,        131072,          131072
##UNITS=     HZ,            ARBITRARY UNITS, ARBITRARY UNITS
##FACTOR=    0.0627417313425164, 1,          1
##FIRST=     8223.62146879497, 1951,         -63653
##LAST=      0,             3392,            -63646
##MIN=       0,             -17530,          0
##MAX=       8223.62146879497, 417773564,    0
$$ Real data points
##PAGE= N=1
##DATA TABLE= (X++(R..R)), XYDATA
$$ [...]
61729D43421N61J946K752K476J475N87L17N72J032J491J851K104K281K328K045
61714D67239J394P21L44J00l30p95q89p35r87j924l143m187m905n059m335l082
61698D39427k376k798l667m011l795l656l836m014l964l729l335k794k327k159
61684C92966k231k402k668k904k741k097j460j221j134q75p23j071j652j920j901
61669C65966j972k022j616q74m09l66k02M00J024J084N28j87m95q7Q50J791K402
61652C65815K785K971K593J494L11j00L53J073J558J653J318P67N68R87J490J451
61636C87087J046P90N63j01j008j500j498j427j269o51J83M81J40k54n82j410
61620C80590k771l741l682l025k440k017j704j824k524l247l321k738k079j889
$$ plain form
61729 443421 443982 445928 448680 451156 452631 453218 453535 454107 455139 456630 458481 460585 462866 465194 467239
61714 467239 468633 469354 469698 469798 469468 468673 467784 467049 466062 464138 460995 456808 451903 446844 442509 439427
61698 439427 437051 434253 430586 426575 422780 419124 415288 411274 407310 403581 400246 397452 395125 392966
61684 392966 390735 388333 385665 382761 380020 377923 376463 375242 374108 373233 372510 371439 369787 367867 365966
61669 365966 363994 361972 360356 359482 359073 358707 358505 358905 359929 361013 361541 361354 360859 360772 361622 363413 365815
61652 365815 368600 371571 374164 375658 375969 375869 376222 377295 378853 380506 381824 382591 383159 384146 385636 387087
61636 387087 388133 388923 389486 389385 388377 386877 385379 383952 382683 382032 382215 382696 382836 382582 382000 380590
61620 380590 377819 374078 370396 367371 364931 362914 361210 359386 356862 353615 350294 347556 345477 343588
61606C43588k362l193l657l225k253j629j754k302k900l410l566l088k245j648
61592C06356j441j381j582k297k976k670j544q73j146j376q11k41p42j945k538
61577B82793j950q27j22k74r38j201m54P46J249Q57N14P70J066Q83N94N59M57
61560B84722J31J33O17P73K39L2R81K194K394J916J960K446K250J257N59O07O65
61543C03876L49L43J111J959J964J149K35j64J72J055J888K034J434N93m0l57
61527C17601l84k86m78j216k107k474k208j790j579j546j655j948k214k000j064
61512B94652M10J984L081L186K341J231M64k4m77p66p42p25r43r93n52k10o87
61495C01230j509j525n68L58O25O71J008J427J484J080L53l90n96J2Q35J030P76
$$ plain form
61606 343588 341226 338033 334376 331151 328898 327269 325515 323213 320313 316903 313337 310249 308004 306356
61592 306356 304915 303534 301952 299655 296679 294009 292465 291592 290446 289070 288259 288018 287276 285331 282793
61577 282793 280843 280016 279894 279620 278682 277481 277027 277773 279022 279879 280393 281163 282229 283112 283706 284265 284722
61560 284722 284853 284986 285603 286376 286615 286647 287628 289822 292216 294132 296092 298538 300788 302045 302604 303211 303876
61543 303876 304225 304568 305679 307638 309602 310751 310986 310822 310994 312049 313937 315971 317405 317998 317958 317601
61527 317601 317217 316931 316453 315237 313130 310656 308448 306658 305079 303533 301878 299930 297716 295716 294652
61512 294652 295062 297046 300127 303313 305654 306885 307349 307325 306848 306082 305340 304615 303672 302679 302127 301917 301230
61495 301230 299721 298196 297628 297986 298611 299282 300290 301717 303201 304281 304634 304244 303648 303660 304495 305525 306301
61478C06301J034J961K648K607K514K962L392K970J723K26j173k143k103r66K73
61463C22226N26m2l64M0O49Q60P11N25L96K18l3j63J02P98J530J818J662J442
61445C32901J254P64J4k33N73J772K126J322L08Q4O12J125J117P24L00q6n85j179
61427C42913j576j525j097n33J3M54O17M69L53O33J119J264R69P94J127J556J354
61410C48904M09o47j094q11l78n62j500k402k340j334l45q3l40n90p36q15n00
61393C34836M65J541J814J135L06N3K53M00L91N61J118J840K317K366K179K111
61377C53686K297K476K362K056J936K095K196J999J773J920K322K399J856J061
61363C82434N89N52O04M56K48L45R05J649K110K160K236K910M140N208N550N435
$$ plain form
61478 306301 307335 309296 311944 314551 317065 320027 323419 326389 328112 328338 327165 325022 322919 321953 322226
61463 322226 322752 322710 322346 322386 323035 323895 324606 325131 325527 325745 325712 325549 325651 326449 327979 329797 331459 332901
61445 332901 334155 334919 334933 334700 335273 337045 339171 340493 340801 340885 341497 342622 343739 344463 344763 344677 344092 342913
61427 342913 341337 339812 338715 338182 338195 338649 339266 339735 340088 340721 341840 343104 344073 344867 345994 347550 348904
61410 348904 349313 348666 347572 346761 346383 345821 344321 341919 339579 338245 337900 337817 337477 336887 336151 335336 334836
61393 334836 335301 336842 338656 339791 340097 340150 340403 340803 341194 341755 342873 344713 347030 349396 351575 353686
61377 353686 355983 358459 360821 362877 364813 366908 369104 371103 372876 374796 377118 379517 381373 382434
61363 382434 383023 383575 384179 384635 384883 385228 386133 387782 389892 392052 394288 397198 401338 406546 412096 417531
61347D17531N558O090O494O243N345M145K982K198K093K612L206L307K843K182
61333D72829J642J274R39N29M4l99p51j141j665k077j974j340o16j57J27M17O23
61316D68304N95M94O07J015J696K780M411O348Q027R115R888J0993J2776J4837
61302E51886J6331J6746J6246J5111J3204J0435P410M903K788K86k601m855n956
61289F41934o741q114r686j0510j0548j0471j0389r727q334o879o043n893o025
61276E32574n833m774k913j178l74j46N11J759K731K818K336J712Q47l04j096
61261E28670p13R64L229N132O060O050N707N522N244M278K754J627J509J855J643
61246E79531N56q37j764j851j270n92l75o85j135j455j768k194k428k028j007
$$ plain form
61347 417531 423089 429179 435673 441916 447261 451406 454388 456586 458679 461291 464497 467804 470647 472829
61333 472829 474471 475745 476684 477213 477257 476858 476107 474966 473301 471224 469250 467910 467294 467137 467264 467681 468304
61316 468304 468899 469393 470000 471015 472711 475491 479902 486250 494277 503392 513280 524273 537049 551886
61302 551886 568217 584963 601209 616320 629524 639959 647369 652272 655060 655346 652745 647890 641934
61289 641934 635193 627079 617393 606883 596335 585864 575475 565748 557414 550535 544492 538599 532574
61276 532574 526741 521967 519054 517876 517502 517356 517867 519626 522357 525175 527511 529223 530070 529766 528670
61261 528670 527957 528921 532150 537282 543342 549392 555099 560621 565865 570143 572897 574524 576033 577888 579531
61246 579531 580087 579250 577486 575635 574365 573773 573398 572713 571578 570123 568355 566161 563733 561705 560698
61231E60698P9O71P19P23J262K501M083N579O860P921Q568Q578Q165P902Q103
61216F32412Q482Q581Q344Q141Q300Q701Q819Q204O922N440M126L056K342K251
61202G24121K741L226L243L108L547M761O315P874R531J1407J3240J4609J5228
61189H22951J4952J3683J1409Q346N049K303O55j93j171k800m556n655o104o577
61175H52292p397q168q443q334q364q986j0261j1734j2724j2860j2400j1854j1566
61162G19201j1655j2099j2586j2705j2520j2523j2699j2223j0587q507p037o258
61150E87802n548m708l909k871j186N87J139l1k041l714m612m843m655m400m359
61135E42651m421m252l799l058j649P11L336N051N572N711O218P203Q669J0688
$$ plain form
61231 560698 560777 561448 562167 562890 564152 566653 570736 576315 583175 591096 599664 608242 616407 624309 632412
61216 632412 640894 649475 657819 665960 674260 682961 691780 699984 706906 712346 716472 719528 721870 724121
61202 724121 726862 730088 733331 736439 739986 744747 751062 758936 768467 779874 793114 807723 822951
61189 822951 837903 851586 862995 871341 876390 878693 879348 879155 877984 875184 870628 864973 858869 852292
61175 852292 844895 836727 828284 819950 811586 802600 792339 780605 767881 755021 742621 730767 719201
61162 719201 707546 695447 682861 670156 657636 645113 632414 620191 609604 601097 594060 587802
61150 587802 582254 577546 573637 570766 569580 570167 571306 571275 569234 565520 560908 556065 551410 547010 542651
61135 542651 538230 533978 530179 527121 525472 526183 529519 534570 540142 545853 552071 559274 567943 578631
61121E78631J2863J4534J5787J7458J9828K2130K3657K4529K5063K5210K5041
61110H04731K5034K5352K5487K5044K4240K3179K1421J8812J6082J3909J1978
61099A035269R513O355K855q60m805q680j2077j4991j7668k0060k1894k3073k3700
61086I06184k3870k3714k3389k2830k1772k0281j8896j7997j7246j6022j4117
61075F86050j1813r531p656o464n848n335m508l393k317j503q18J88J859L860
61061F32771N289N679N678O255P526Q873R894J0610J1032J1361J2386J4685J7477
61048G59516J9295J9842K0250K1397K2950K4290K5367K6404K7501K8852L0513
61037A026177L1889L2316L2254L2891L4461L5999L6993L8065L9757M1788M3925
$$ plain form
61121 578631 591494 606028 621815 639273 659101 681231 704888 729417 754480 779690 804731
61110 804731 829765 855117 880604 905648 929888 953067 974488 993300 1009382 1023291 1035269
61099 1035269 1044782 1051137 1053992 1053132 1048327 1039647 1027570 1012579 994911 974851 952957 929884 906184
61086 906184 882314 858600 835211 812381 790609 770328 751432 733435 716189 700167 686050
61075 686050 674237 664706 657050 650586 644738 639403 634895 631502 629185 627682 626864 627052 628911 632771
61061 632771 638060 643739 649417 655672 663198 672071 681965 692575 703607 714968 727354 742039 759516
61048 759516 778811 798653 818903 840300 863250 887540 912907 939311 966812 995664 1026177
61037 1026177 1058066 1090382 1122636 1155527 1189988 1225987 1262980 1301045 1340802 1382590 1426515
61026A426515M6409M9039N0941N1673N1622N0996M9729M8733M9844N3802N9529
61015A988832O5887P2812Q0214Q7235R3448R9590J06712J16062J30142J51989
61005B992923J83075K24081K77961L49330M40466N51879O87924Q56660J061794
60996G626093J300438J569464J856997K107629K203401K017139J519982Q40483
60988B1041626K00285k21575l69081k81202k8129K98480N56463N75026K54517
60979B2026410l45572j031020j595505j929459k034891j971056j803165j585140
60971I730602j357896j146041r58254p95610o58431n45569m52818l75948l13344
60962C126691k63972k25144j94080j69553j50450j34540j20234j07786r7449q8033
$$ plain form
61026 1426515 1472924 1521963 1572904 1624577 1676199 1727195 1776924 1825657 1875501 1929303 1988832
61015 1988832 2054719 2127531 2207745 2294980 2388428 2488018 2594730 2710792 2840934 2992923
61005 2992923 3175998 3400079 3678040 4027370 4467836 5019715 5707639 6564299 7626093
60996 7626093 8926531 10495995 12352992 14460621 16664022 18681161 20201143 21041626
60988 21041626 21241911 21020336 20651255 20370053 20341924 20640404 21196867 21771893 22026410
60979 22026410 21680838 20649818 19054313 17124854 15089963 13118907 11315742 9730602
60971 9730602 8372706 7226665 6268411 5472801 4814370 4268801 3815983 3440035 3126691
60962 3126691 2862719 2637575 2443495 2273942 2123492 1988952 1868718 1760932 1663483 1575450
60952A575450p8498o9315o0992n2910m4918l8488l4922l3720l3863l5117l6779
60941A055928l6848l4239l0621k8360k7677k7242k6439k5425k3935k1794j9824
60930G53524j8714j7690j5843j3951j3289j3321j2369j0184q111o957o343n990
60918F10762n969n747m600l058k463k917l132k543k067k253k181j001N02R24J51
60903E74408o45o07n8J77j98o99p97o96j134k292l271l166k306j917k647l958
60887E50194m899n038m696m628n371o630p516p655p606p836p824o932n671n109
60873D62783n290n216m396l435k987k943k942k878k582j714l54P91J212J238J469
60858D32756J938K214K116J965K105K464K592K234J746J831K674L646M072M017
$$ plain form
60952 1575450 1496952 1427637 1366645 1313735 1268817 1230329 1195407 1161687 1127824 1092707 1055928
60941 1055928 1019080 984841 954220 925860 898183 870941 844502 819077 795142 773348 753524
60930 753524 734810 717120 701277 687326 674037 660716 648347 638163 630052 623095 616752 610762
60918 610762 604793 599046 594446 591388 588925 586008 582876 580333 578266 576013 573832 572831 573333 574257 574408
60903 574408 573763 573156 573098 573275 573077 572378 571581 570885 569751 567459 564188 561022 558716 556799 554152 550194
60887 550194 545295 540257 535561 530933 525562 518932 511416 503761 496155 488319 480495 473563 467892 462783
60873 462783 457493 452277 447881 444446 441459 438516 435574 432696 430114 428400 428046 428837 430049 431287 432756
60858 432756 434694 436908 439024 440989 443094 445558 448150 450384 452130 453961 456635 460281 464353 468370
60844D68370L942L855L425K696K056J388L1k198m425n540n283m271l307k893l102
60829D54744l527l546k971k336k256k600k623j933j024o46q86j206j326j688k730
60814D23446m033m648m287l672l554l872m077l934l596l246l070l271l687l650
60800C70849k796j844j878k878l567k991j654p89q82j414j669j422q37j73L65
60785C46420P34J085J555J994K070J726J271R99Q71P35O91R46J387J665J767K096
60769C68012K801L365L232K596K141K100K022J475N67l15q80r22l54N38J147J104
60753C88629N38l28j537l047m261m354l082j064P63J827K091J791J117J58r96
60738C78245k259l611m969n918n924n003l903l297l095k948l005l530l967l406
$$ plain form
60844 468370 472312 476167 479592 482288 484344 485732 485763 483565 479140 473600 468317 464046 460739 457846 454744
60829 454744 451217 447671 444700 442364 440108 437508 434885 432952 431928 431282 430396 429190 427864 426176 423446
60814 423446 419413 414765 410478 406806 403252 399380 395303 391369 387773 384527 381457 378186 374499 370849
60800 370849 368053 366209 364331 361453 357886 354895 353241 352452 351570 350156 348487 347065 346228 346055 346420
60785 346420 347154 348239 349794 351788 353858 355584 356855 357854 358725 359460 360151 361097 362484 364149 365916 368012
60769 368012 370813 374178 377410 380006 382147 384247 386269 387744 388311 387996 387116 386194 385840 386378 387525 388629
60753 388629 389167 388839 387302 384255 379994 375640 372558 371494 372257 374084 376175 377966 379083 379241 378245
60738 378245 375986 372375 367406 361488 355564 350561 346658 343361 340266 337318 334313 330783 326816 323410
60724C23410j995j025j200j669j282j59P15R17Q12O61L41k4R4R53K079K699K467
60707C27794J644P94L66M57Q84J467K085K525K530K162J861J914K082J986J715
60692C52266J722K182K723K876K605K230J908J375M11n42o64J47Q81O13k34m10
60676C70089M88J630K146J934J203Q8q79q89j1M48n16k199l102k807k177j975
60660C63471k183k562l027l303k929j898q10j75L6J4k21n17l50O79K269L605M093
60643C56192L669K500P05j404l087l583k886j857j385j591k020k317k363j999
60629C38574j190m13k45n10m06K98Q22M99j97k46O01J599J956J581R49N16K84
60612C44472q5p27j215j067n03k04l36l76j13q8o25j140r11p5P28J257J561J419
$$ plain form
60724 323410 321415 320390 319190 317521 316239 316080 316795 317712 318524 319185 319526 319502 319596 320549 322628 325327 327794
60707 327794 329438 330232 330598 331055 331939 333406 335491 338016 340546 342708 344569 346483 348565 350551 352266
60692 352266 353988 356170 358893 361769 364374 366604 368512 369887 370298 369756 369092 369239 370120 370733 370499 370089
60676 370089 370577 372207 374353 376287 377490 377578 376699 375810 375799 376247 375731 373532 370430 367623 365446 363471
60660 363471 361288 358726 355699 352396 349467 347569 346759 346584 346620 346634 346413 345896 345546 346225 348494 352099 356192
60643 356192 359861 362361 363066 361662 358575 354992 352106 350249 348864 347273 345253 342936 340573 338574
60629 338574 337384 336971 336726 336216 335810 336108 336930 337429 337232 336986 337587 339186 341142 342723 343672 344188 344472
60612 344472 344387 343660 342445 341378 340875 340671 340335 339959 339846 339758 339133 337993 337082 337007 337735 338992 340553 341972
60594C41972O93L2L91J756L075L526L334L136L026K573J523K43n75o53m41n41
60578C63070q21n03O85J943K330J966J777K308L280M247N145O102P126Q182R330
60563D16167J0617J1845J2528J2099J0413P939N367K936M28k191m500o083o829
60550D70736o685n616l992k509j352J1J896L701M682M933N128N616O355P432R089
60535D99425J1301J3795J6313J8500J9841K0029J9175J7292J4018R373M354J28
60523F63544l076n760q097r744j0521j0618j0265r703r276q998q199o333l942
60510E59012k182j481j344j350j468j345k02K153M855P026Q878J1340J4897J9142
60496F17931K3470K7782L2324L6866M0401M1978M1674M0318L8242L4993L0460
$$ plain form
60594 341972 342665 342697 343088 344844 347919 351445 354779 357915 360941 363514 365037 365280 364705 364052 363611 363070
60578 363070 362249 361746 362431 364374 366704 368670 370447 372755 376035 380282 385427 391529 398655 406837 416167
60563 416167 426784 438629 451157 463256 473669 481608 486975 489911 490339 488148 483648 477565 470736
60550 470736 464051 458435 454443 451934 450582 450593 452489 456190 460872 465805 470933 476549 482904 490336 499425
60535 499425 510726 524521 540834 559334 579175 599204 618379 635671 649689 659062 663416 663544
60523 663544 660468 654708 646611 636867 626346 615728 605463 595760 586484 577486 569287 562954 559012
60510 559012 556830 555349 554005 552655 551187 549842 549640 551793 556648 563674 572552 583892 598789 617931
60496 617931 641401 669183 701507 738373 778774 820752 862426 902744 940986 975979 1006439
60485A006439K5532K1121J7181J3179Q916M101k107j0087j8671k6204l2446l8308
60473I68646m3778m7454m8344m7036m4587m1290l7171l2840k8988k5511k1882
60462E49765j8224j5324j3607j2622j1637j0376r076p975p088o400o036n971n779
60449D19650n047m029l443l476l516l023k209j539j081p52o52p23n99k74l85j257
60433C87645k176k325j913j607j389q72l59m83j061j272r12m82j51L55R05R80
60417C74883O61O13R81J179R53P31P52O95M30L45O60J076J310J352J116N65K38
60400C88540P87J855K281J659Q35O41R87J528K237K881K812J894R97R79J671K356
60384D14940K666K698K618K619K785K856K496J917J668J752J685J419J415J684
$$ plain form
60485 1006439 1031971 1053092 1070273 1083452 1092368 1096469 1094362 1084275 1065604 1039400 1006954 968646
60473 968646 924868 877414 829070 782034 737447 696157 658986 626146 597158 571647 549765
60462 549765 531541 516217 502610 489988 478351 467975 458899 450924 443836 437436 431400 425429 419650
60449 419650 414603 410574 407131 403655 400139 397116 394907 393368 392287 391535 390883 390160 389561 389287 388902 387645
60433 387645 385469 383144 381231 379624 378235 377363 377004 376521 375460 374188 373276 372794 372643 372998 373903 374883
60417 374883 375544 376157 377138 378317 379270 380001 380753 381448 381878 382223 382883 383959 385269 386621 387737 388302 388540
60400 388540 389327 391182 393463 395122 395957 396598 397585 399113 401350 404231 407043 408937 409934 410913 412584 414940
60384 414940 417606 420304 422922 425541 428326 431182 433678 435595 437263 439015 440700 442119 443534 445218
60370D45218J723J594J971K803L076K414J791J950K234J785R37M40K03r0Q0J219
60354D69348K526K741K062J891K825M132N185O154P004O966N652L886K711K007
60340E25090Q04j229l205m096l960l752m020m262l735k548j462q67o48r04k024
60325D89182l769n037n016m089l211k839k847k943k773k026r07q0K68Q57K243
60310D57013L925N070N765O750Q177R527J0674J2185J4389J6692J8100J8033J6427
60297F02727J3468R525N179Q94l338p880j2686j6736j8562j7580j4775j1709r119
60284E19408o847m902l768l573l684l481l086k910k959k949k796k646k633k867
60270D70307l343l697l449k685k209k646l699m469m375l568k704k360k487k462
$$ plain form
60370 445218 446941 448535 450506 453309 456385 458799 460590 462540 464774 466559 467496 467936 468139 468049 468129 469348
60354 469348 471874 474615 476677 478568 481393 485525 490710 496864 503868 510834 516486 520372 523083 525090
60340 525090 525894 524665 521460 517364 513404 509652 505632 501370 497635 495087 493625 492758 492110 491206 489182
60325 489182 485413 480376 475360 471271 468060 465221 462374 459431 456658 454632 453725 453645 453913 454770 457013
60310 457013 460938 466008 471773 478523 486700 496227 506901 519086 533475 550167 568267 586300 602727
60297 602727 616195 625720 630899 631793 628455 620575 607889 591153 572591 555011 540236 528527 519408
60284 519408 512561 507659 503891 500318 496634 493153 490067 487157 484198 481249 478453 475807 473174 470307
60270 470307 466964 463267 459818 457133 454924 452278 448579 444110 439735 436167 433463 431103 428616 426154
60256D26154j908j273j138j194o71L40Q94N79N5m5K06O73J537K526K738J859P65
60239D32097L30L14R1k76m20m24m46j38P08J513J723J764K396L475M196M202L716
60222D54821K960K210K037K620L177K924K339K570L774N047N827O409P005P272
60208E10992P060O919P394Q328R124R401R156Q599P945P305O711O264O037N745
60194F16980M886L393J839P37L5m29n74n82j158k655m341n224n292n325n789o506
60178E89995p196p689p781p450o986o491n587m075k564j797j723j772j731j680
60164E25473j486j047p95j109j588j588j255j210j460j431r51l54J98P18Q96M86
60148E13497Q0N36J624K197J776J110R15J025J013R60J184J781K781M245N953
$$ plain form
60256 426154 424246 422973 421835 420641 419970 420310 421204 421783 421838 421793 421999 422672 424209 426735 429473 431332 432097
60239 432097 432427 432741 432832 432556 432136 431712 431266 431128 431836 433349 435072 436836 439232 442707 446903 451105 454821
60222 454821 457781 459991 462028 464648 467825 470749 473088 475658 479432 484479 490306 496715 503720 510992
60208 510992 518052 524971 532365 540693 549817 559218 568374 576973 584918 592223 598934 605198 611235 616980
60194 616980 621866 625259 627098 627835 627870 627441 626867 626285 625127 622472 618131 612907 607615 602290 596501 589995
60178 589995 582799 575110 567329 559879 552893 546402 540815 536740 534176 532379 530656 528884 527153 525473
60164 525473 523987 522940 522145 521036 519448 517860 516605 515395 513935 512504 511553 511199 511397 512115 513011 513497
60148 513497 513577 514113 515737 517934 519710 520820 521735 522760 523773 524733 525917 527698 530479 534724 540677
60133E40677P397Q235Q459Q192P711P518P737P636O427M531L181K777K528J892
60119F24898J377J570K187K689L131L773M329M310L826L443L310K933J808O2j638
60104F62008k740l313l883m716n487n845n996o346o748o594n644m288l047k168
60090E95193j721j600j425q93k72r5l25l51J39P34R64R26R73J142J148P91J11
60073E95439p95j934l383n018o368o997p097p379q139q805q708q036p524p443
60059E07813p321o611n298l900l071l054l335l115k257j340o35L06J684K766K968
60044D75600K945L767N342O556O799O496O279O387O793P203P000N858M299L011
60030E54335J821J28j905l450m178m420m278l557k689k682l908n623p009p936
$$ plain form
60133 540677 548074 556309 564768 572960 580671 588189 595926 603562 609989 614520 617701 620478 623006 624898
60119 624898 626275 627845 630032 632721 635852 639625 643954 648264 652090 655533 658843 661776 663584 663646 662008
60104 662008 659268 655955 652072 647356 641869 636024 630028 623682 616934 610340 604696 600408 597361 595193
60090 595193 593472 591872 590447 589554 589282 589187 588862 588511 588650 589384 590348 591274 592247 593389 594537 595328 595439
60073 595439 594644 592710 589327 584309 577941 570944 563847 556468 548329 539524 530816 522780 515256 507813
60059 507813 500492 493881 488583 484683 481612 478558 475223 472108 469851 468511 467876 468182 469866 472632 475600
60044 475600 478545 482312 487654 494210 501009 507505 513784 520171 526964 534167 541167 547025 551324 554335
60030 554335 556156 556284 554379 550929 546751 542331 538053 534496 531807 529125 525217 519594 512585 504649
60016E04649q565q874q906q914q932q683q082p415o879o304n444m224k765j449
60002D09213p60o62m73K23R20J083J173J878K840L090K592K187K231K400K746
59987D30681L669M796N096M458L956M213M569M217L199J846K22j423k522k988
59973D63989l362l769l633k821k146k220k584k523k034j469q88k06N79J645L180
59958D41738M693N244M725M111M017L869K999J714O87l0o91j123j010m97j3J86
59942D70619Nn03r60j016j028j679k755l153k431j416r18o74j84L99Q08J352K336
59925D58802L406M145M729N434O100O530O784O597N353L260J679J440J628Q73
59911E16760o91j720j367Q9J971L687M718M898M606M228L775L292L115L203K898
$$ plain form
60016 504649 496084 487210 478304 469390 460458 451775 443693 436278 429399 423095 417651 413427 410662 409213
60002 409213 408453 407791 407318 407541 408461 409544 410717 412595 415435 418525 421117 423304 425535 427935 430681
59987 430681 434350 439146 444242 448700 452656 456869 461438 465655 468854 470700 470922 469499 466977 463989
59973 463989 460627 456858 453225 450404 448258 446038 443454 440931 438897 437428 436540 436334 436913 438558 441738
59958 441738 446431 451675 456400 460511 464528 468397 471396 473110 473797 473767 473076 471953 470943 470446 470433 470619
59942 470619 470624 470121 469161 468145 467117 465438 462683 459530 457099 455683 454765 454091 453907 454306 455114 456466 458802
59925 458802 462208 466353 471082 476516 482616 489146 495930 502527 507880 511140 512819 514259 515887 516760
59911 516760 516069 514349 512982 513071 515042 518729 523447 528345 532951 537179 540954 544246 547361 550564 553462
59896E53462J926J033R64J392J598J632J951K452K756L067L865M971N758O042
59882E92869O068N822N102M123L382L097L211L672M156L951K730J153N1o35j519
59867F37233k719l882m867n680n955n345m303l738l939m347m340l693k500j171
59853E80754l05m4K46J148K264K784K771L232M905P411R552J0120Q643N767K768
59838F42016L97j497l034l597k621o19J202J970J316q76m039o730p765p419o830
59823F01874o418n781m887m375m541m862m794m488m380m547m683m530m118l672
59809E35798l305k900k360j934j887j940j575q90n14n48l92J55N03L75L16N33
59793E19435K98p50j646j448p13n46q77q98o21o82j026j038p82r16j454j764j697
$$ plain form
59896 553462 555388 556421 557385 558777 560375 562007 563958 566410 569166 572233 576098 581069 586827 592869
59882 592869 598937 604759 609861 613984 617366 620463 623674 627346 631502 635453 638183 639336 639387 638752 637233
59867 637233 634514 630632 625765 620085 614130 608785 604482 600744 596805 592458 588118 584425 581925 580754
59853 580754 580449 580405 580651 581799 584063 586847 589618 592850 597755 605166 614718 624838 633481 639248 642016
59838 642016 642413 640916 637882 634285 631664 631045 632247 634217 635533 634657 630618 623888 616123 608704 601874
59823 601874 595456 589675 584788 580413 575872 571010 566216 561728 557348 552801 548118 543588 539470 535798
59809 535798 532493 529593 527233 525299 523412 521472 519897 519007 518493 517945 517553 517708 518211 518586 518902 519435
59793 519435 519733 518983 517337 515889 515176 514630 513753 512855 512234 511552 510526 509488 508706 507790 506336 504572 502875
59776E02875j662j674j338p51m14l12o3J64q9m04J85J587K561K491K224K768M056
59759E12204N407O380O734O320N509N178N817P068Q345R413J0173J0454J0341
59746F09343J0225J0255J0117R492Q427P183O036N215M647L837K435Q43k61q07
59732F86987j221j584j670j707k275l321m037l999l718l811m167m253l907l461
59718F43856l357l755m325m521m194l788l622l321k419j210l94j20j7P2J13L87
59702F09385J163K002K252K147K491L209L274K360J543J860K893L463L149K504
59688F43695K063J732J143K08p98j555j978k147k053j666j253j223j580j967k412
59673F30209l380m849o009o358o328o246n583m099k849k896l569l334j988p22
$$ plain form
59776 502875 501213 499539 498201 497450 497036 496724 496661 496825 496736 496332 496517 498104 500665 503156 505380 508148 512204
59759 512204 517611 523991 530725 537045 542554 547732 553549 560617 568962 578375 588548 599002 609343
59746 609343 619568 629823 639940 649432 657859 665042 671078 676293 680940 684777 687212 688055 687794 686987
59732 686987 685766 684182 682512 680805 678530 675209 671172 667173 663455 659644 655477 651224 647317 643856
59718 643856 640499 636744 632419 627898 623704 619916 616294 612973 610554 609344 608950 608830 608813 608885 608998 609385
59702 609385 610548 612550 614802 616949 619440 622649 625923 628283 629826 631686 634579 638042 641191 643695
59688 643695 645758 647490 648633 648841 648043 646488 644510 642363 640310 638644 637391 636168 634588 632621 630209
59673 630209 626829 621980 615971 609613 603285 597039 591456 587357 584508 581612 578043 574709 572721 571999
59659E71999k61k14j57PO80K289M195N101M790M377M639N173N318M820L407R22
59643F17085j862l701m474n237o387p027o622o004o039o307n968n068m192l504
59629E44693k913k572k534k374j794j225j286k024k949l624l873l882m100m674
59615E04869m986m387l281k660k652k467j781j101o22P1Q98J169R40J189K054
59600D87253K299J291J93J73O40M58j03o6M70O61N38Q04J341J308O31J36J28k6
59582D98129o39j127j064r44j400k217k668k453j930j574j539j702j901k049k073
59567D72849j894j587j435j563j673j348o57p4J20O8p8l53p24j036j171j004l17
59550D58123Q16J756J954J758J878K263K257J844J843K806M506O605R017J1549
$$ plain form
59659 571999 571738 571524 571367 571374 572054 574343 578538 583639 588429 592806 597445 602618 607936 612756 616163 617085
59643 617085 615223 611522 607048 601811 595424 588397 581775 575771 569732 563425 557457 552389 548197 544693
59629 544693 541780 539208 536674 534300 532506 531281 529995 527971 525022 521398 517525 513643 509543 504869
59615 504869 499883 495496 492215 489555 486903 484436 482655 481554 480932 481003 481901 483070 484010 485199 487253
59600 487253 489552 490843 491036 491209 491849 492307 492204 492138 492608 493269 493807 494611 495952 497260 497891 498027 498155 498129
59582 498129 497490 496363 495299 494355 492955 490738 488070 485617 483687 482113 480574 478872 476971 474922 472849
59567 472849 470955 469368 467933 466370 464697 463349 462692 462618 462738 462806 462728 462375 461651 460615 459444 458440 458123
59550 458123 458939 460695 462649 464407 466285 468548 470805 472649 474492 477298 481804 488409 497426 508975
59536E08975J4145J7354K1312K4046K2318J5111N263l098p995r887r707p920n023
59523E84894j922M36J490J382R46Q24N59p07k636l892m195m826o504q056q162
59508E49631p239o554o354o098n722n452m967l969l068k904k958k381j540j449
59494D88976j959j881q62J30L08J1j6N02J373K202K579K500K459K660K558J852
59478E03392J417K296M118N502N851N690N456N047M485L984L283J932L28n83o74
59463E51524o63o53Q8J570K556K333J973K863M733O144O445O255O257O427O592
59448F04444O796O908O430N131L530K248J088p79l568o359q026q411q142p573
59434E93717o540n113l878l206k810k333j863j552j131k66R85K448M202O209Q070
$$ plain form
59536 508975 523120 540474 561786 585832 608150 623261 628524 625426 617431 607544 597837 589917 584894
59523 584894 582972 583408 584898 586280 587226 588050 588609 587902 585266 581374 577179 572353 565849 557793 549631
59508 549631 542392 535838 529484 523386 517664 512212 507245 503276 500208 497304 494346 491965 490425 488976
59494 488976 487017 485136 484274 484404 484712 484723 484707 485209 486582 488784 491363 493863 496322 498982 501540 503392
59478 503392 504809 507105 511223 516725 522576 528266 533722 538769 543254 547238 550521 552453 552781 552198 551524
59463 551524 550861 550208 550296 551866 554422 556755 558728 561591 566324 572468 578913 585168 591425 597852 604444
59448 604444 611240 618148 624578 629709 633239 635487 636575 635796 632228 625869 617843 609432 601290 593717
59434 593717 587177 582064 578186 574980 572170 569837 567974 566422 565291 565025 566010 568458 572660 578869 586939
59419E86939R618J1368J3737J6205J7900J8813J9738K1163K2995K5146K7309K7927
59407H18858K4454J5619L290q466j6144j8702j7192j3254p927j469N988J3419
59395G98474J8418J8167J1560O47j0458j8402k2360k3258k2072j9398j5970j2643
59383G02705r804p450n709m636l730k467j267j003j570j861j383q63r33j206j145
59368F57678r29q63p17k33K95O24J051J754K258K193K022K389L230M186N306O742
59352F86986Q207R384J0450J1647J2782J3685J4651J5870J6911J7352J7379J7207
59340H52511J6474J4806J2522J0135P637M883K121n05l388o708r770j1816j3000
59327H75902j3914j4606j4858j4830j4772j4559j4181j4069j4267j3961j2655
$$ plain form
59419 586939 596557 607925 621662 637867 655767 674580 694318 715481 738476 763622 790931 818858
59407 818858 843312 858931 862221 853755 837611 818909 801717 788463 780536 779067 785055 798474
59395 798474 816892 835059 846619 847266 836808 818406 796046 772788 750716 731318 715348 702705
59383 702705 692901 685451 679742 675106 671376 668909 667642 666639 665069 663208 661825 660962 660029 658823 657678
59368 657678 656749 655886 655169 654936 655231 655855 656906 658660 660918 663111 665133 667522 670752 674938 680244 686986
59352 686986 695193 704577 715027 726674 739456 753141 767792 783662 800573 817925 835304 852511
59340 852511 868985 883791 896313 906448 914085 918968 921089 920584 917196 910488 900718 888902 875902
59327 875902 861988 847382 832524 817694 802922 788363 774182 760113 745846 731885 719230
59316G19230j1127j0292r863r132q376q186q101p288o156n808o091n646l955j939
59302F17270l97R86K759M937P450J0360J3190J4704J3716R865L647l681j0366
59289F84440j5039j7443j7954j6713j3883j0401p542n762m599l569k396p03J717
59276E70153M341O387P781R012J0240J1294J2264J3343J4242J4442J3849J2626
59264F99974J0833Q848P502O840N505K437j368m116n589o794p740p428n975m827
59250F98102m548m033k476o44M62R52J386J813K178K724L510M166M586N083N628
59235G18889N778N616N788O231N951M471K553R68n28k464m725o964r180j1323
59221G21061j2907j3543j3373j2673j1556j0316r456q989q357p284o139n238m479
$$ plain form
59316 719230 708103 697811 687948 678816 670440 662254 654153 646865 640709 634901 628810 623164 619209 617270
59302 617270 616873 617859 620618 625555 633005 643365 656555 671259 684975 694840 698487 694806 684440
59289 684440 669401 651958 634004 617291 603408 593007 585465 579703 575104 571535 569139 568436 570153
59276 570153 574494 580881 588662 597674 607914 619208 631472 644815 659057 673499 687348 699974
59264 699974 710807 719655 727157 733997 739502 741939 740571 736455 730866 724072 716332 708904 702929 698102
59250 698102 693554 689521 687045 686401 686863 687815 689201 691014 693192 695916 699426 703592 708178 713261 718889
59235 718889 724667 730283 736071 742302 748253 752724 755277 756245 755717 753253 748528 741564 732384 721061
59221 721061 708154 694611 681238 668565 657009 646693 637237 628248 619891 612607 606468 601230 596751
59208E96751l841l511l277k566j383m82k65k49N3M79P36R19J158J428J916K895
59192E90761M005M402L942L421L396L579L764M379N556O500O411N493M488L799
59178F53896L509L627L820L408K206R03K20J18K13M18Q09J195J329J179Q62N96
59162F78308P25J210J118n04l094m811m772m162m648o416q404r777j0393j0332
59148F14048r723q895q182p627p156o838o707o635o524o391o103n451m596m059
59134E19161m035m102l753k896j800q23k36P4O41J774L064L960M585N303N799
59119E26716N500M760M705N791P331Q454Q790Q273P172O329O397O814O460N364
59105F18856M685M904N209M865M068L114J837L25q12j370j813k239k062j141k64
$$ plain form
59208 596751 592910 589399 586122 583556 582173 581691 581426 581177 581230 581709 582445 583364 584522 585950 587866 590761
59192 590761 594766 599168 603110 606531 609927 613506 617270 621649 627205 633705 640116 645609 650097 653896
59178 653896 657405 661032 664852 668260 670466 671369 671589 671707 671920 672338 673147 674342 675671 676850 677712 678308
59162 678308 679033 680243 681361 680857 677763 672952 668180 664018 659370 652954 644550 634773 624380 614048
59148 614048 604325 595430 587248 579621 572465 565627 558920 552285 545761 539370 533267 527816 523220 519161
59134 519161 515126 511024 507271 504375 502575 501752 501516 501590 502231 504005 507069 511029 515614 520917 526716
59119 526716 532216 536976 541681 547472 554803 563257 572047 580320 587492 593821 600218 607032 613492 618856
59105 618856 623541 628445 633654 638519 642587 645701 647538 647863 647051 645681 643868 641629 639567 638426 638162
59090F38162k6j30k10m28p66p04j64J39k57j006j847l061m561n569n782n926o499
59073F01365o923o618n998n670n432m834m006l253k515j868j845k609l492l889
59059E42413l941l901l555k839k198j827j324o31m20j004j659j679j221o90j10
59044E15414L50K23l02l25L43P41L92J41N84R70O68M31J018J694J549J311K213
59027E27415L819M661M697N472P812J0775J3050J4350J5090J5459J5152J3695
59015F51447J0997P702M627J832j168m085n763n861n584n949o290n433l591j994
59001F30887j161n26N93K406M626O317O402M942L394K869K893K568K083K033K030
58986F72356J260q6j111j615k111k620k484j378K51J788K968L973N336P456R919
$$ plain form
59090 638162 638136 638006 637796 637368 636602 635898 635734 635873 635616 634610 632763 629702 625141 619572 613790 607864 601365
59073 601365 594442 587824 581826 576156 570724 565890 561884 558631 556116 554248 552403 549794 546302 542413
59059 542413 538472 534571 531016 528177 525979 524152 522828 522197 521777 520773 519114 517435 516214 515524 515414
59044 515414 515764 515987 515685 515360 515703 516444 516836 516977 517561 518531 519199 519630 520648 522342 523891 525202 527415
59027 527415 531234 535895 540592 546064 553876 564651 577701 592051 607141 622600 637752 651447
59015 651447 662444 670146 674773 676605 675437 671352 665589 659728 654144 648195 641905 636472 632881 630887
59001 630887 629726 629200 629793 632199 636825 643142 649544 654486 657880 660749 663642 666210 668293 670326 672356
58986 672356 673616 673530 672419 670804 668693 666073 663589 662211 662462 664250 667218 671191 676527 683983 693902
58971F93902J1763J2649J3128J3563J3695J3544J3692J4170J4204J3596J3133
58960H41039J2925J1727Q936N903M005K606L19k837n929q803j1686j3955j4940
58947H29310j5287j5984j6613j6140j4886j4081j3861j3248j1847j0061p932n247
58935F74123k653j171o86k03N24Q60O81O22R35J264J440J549J359O43j44n51j046
58918F77546k197l403l691l318l272l483l006j746n91P3O43J220J583K214L939
58903F62511O408Q213Q777R007R946J1644J3498J4734J4677J3392J2034J1708
58891G96549J2221J2774J3417J4676J6167J6970J7184J7743J8721J9067J8101
58880I73590J6056J3171R450N403J902q78l439n884p832r300j0736j2164j3171
$$ plain form
58971 693902 705665 718314 731442 745005 758700 772244 785936 800106 814310 827906 841039
58960 841039 853964 865691 874627 880530 884535 887141 887460 884623 878694 869891 858205 844250 829310
58947 829310 814023 798039 781426 765286 750400 736319 722458 709210 697363 687302 679370 674123
58935 674123 671470 670299 669613 669410 669934 670794 671475 672097 673032 674296 675736 677285 678644 679287 679143 678592 677546
58918 677546 675349 671946 668255 664937 661665 658182 655176 653430 652839 652912 653555 654775 656358 658572 662511
58903 662511 668919 677132 685909 694916 704862 716506 730004 744738 759415 772807 784841 796549
58891 796549 808770 821544 834961 849637 865804 882774 899958 917701 936422 955489 973590
58880 973590 989646 1002817 1012267 1017670 1019572 1018694 1015255 1009371 1001539 992239 981503 969339 956168
58867I56168j3587j3335j2005r605p390o710p261p633p303o890o713o509o454
58854H44773p091q169q796q750q567q401p907p153o580o219n977o365p735r188
58840G37875r572r263r533j0528j1338j1745j2162j2088j0475p738n614m783m238
58827F18798l274k400j932j235J27J689K982L973M495M353M160M775N850O215
58813F48576N681N162N009M642L896L275K776J932J019P72P98j07j995l694m738
58798F73004n694o508o410n655n523o231o687o632p040p960p961o540n093m543
58784E84527l823j808P81K494K981K801K578K993M355N654N395L813K698K495
58770F17934J408j760n699q451r628r680q642o865n581n409n371m539l421k708
$$ plain form
58867 956168 942581 929246 917241 907636 900246 893536 886275 878642 871339 864449 857736 851227 844773
58854 844773 837682 829513 820717 811967 803400 794999 787092 779939 773359 767140 761163 754798 747063 737875
58840 737875 728303 719040 709507 698979 687641 675896 663734 651646 641171 633433 627819 623036 618798
58827 618798 615524 613124 611192 609957 610084 611773 614755 618728 623223 627576 631736 636511 642361 648576
58813 648576 654257 659419 664428 669070 672966 676241 679017 680949 681968 682740 683538 683431 681436 677742 673004
58798 673004 667310 660802 654392 648737 643214 636983 630296 623664 616624 608664 600703 594163 589070 584527
58784 584527 580704 578896 579677 582171 585152 587953 590531 593524 597879 603533 608928 612741 615439 617934
58770 617934 619342 617582 611883 603432 593804 584124 575482 568617 563036 557627 552256 547717 544296 541588
58756E41588j925n17Q81J504J718K043K028J255M70L94L79m31j372j122K55J533
58740E48681K187K866M094N508O417O510O045N618N595N686N406M903M692M668
58726F18876M242L460K996K978K790K220J776J753K021K703M013N411O192O734
58712F68165P809Q807Q405O896N861N361L702M29k700m537o139q502j0826j2274
58698F70457j3554j5266j6418j6120j5249j4941j4738j3668j1934j0176q211n926
58686E14256m260l951m267m209l997m175m336l916l304k954k403j275l15k85o94
58671D69915o64j71N46J787L667N524O942Q371R955J0947J1010J0762J0152P922
58657E56665L742n69l264m729o094p184p347p034p009p042o649o151n788m953
$$ plain form
58756 541588 539663 539146 540027 541531 543249 545292 547320 548575 549045 549439 549818 549387 548015 546893 547148 548681
58740 548681 550868 553734 557828 563336 569753 576263 582308 587926 593521 599207 604613 609516 614208 618876
58726 618876 623118 626578 629574 632552 635342 637562 639338 641091 643112 645815 649828 655239 661431 668165
58712 668165 675974 684781 693186 700082 705943 711304 715006 715435 712735 708198 702059 693557 682731 670457
58698 670457 656903 641637 625219 609099 593850 578909 564171 550503 538569 528393 520182 514256
58686 514256 509996 506045 501778 497569 493572 489397 485061 481145 477841 474887 472484 471209 470894 470609 469915
58671 469915 469251 469080 469626 471413 475080 480604 487546 495917 505872 516819 527829 538591 548743 556665
58657 556665 560407 559838 556574 551845 545751 538567 531220 524186 517177 510135 503486 497335 491547 486594
58643D86594l570k865l451l934k899j045J97Q70J687K279K066J824K542L534L474
58628D87303K528J769J273M24n01p61o14q26j217j083n42j25M37J709L356M614
58612D97744N391N878N775N040M492M643M712L985L075K742K504J707Q90O87M55
58597E49720n68j728k094k056k383k534j604m0J062J718K600L688M675N891P464
58582E63811Q510Q502Q482R425J0470J0302R257Q502Q074P404O842P028P587P974
58568F82170Q741J0494J2571J4300J6450J9876K3737K6756K9093L1299L2438L1233
58556I39158K8016K3819J8511J1727M668r57m901p638q721p791o130n212m708
58543I79841l791l319m678p521j0705j4350j8806k2760k4707k5267k5743k5478
$$ plain form
58643 486594 483024 480159 476708 472774 469875 468830 469027 469897 471584 473863 475929 477753 480295 483829 487303
58628 487303 489831 491600 492873 493297 492796 492035 491421 490595 489378 488295 487753 487628 488065 489774 493130 497744
58612 497744 503135 509013 514788 519828 524320 528963 533675 537660 540735 543477 545981 547688 548578 549265 549720
58597 549720 549152 547424 545330 543274 540891 538357 536753 536713 537775 539493 542093 545781 550456 556347 563811
58582 563811 572321 580823 589305 598730 609200 619502 628759 637261 645335 652739 659581 666609 674196 682170
58568 682170 690911 701405 713976 728276 744726 764602 788339 815095 844188 875487 907925 939158
58556 939158 967174 990993 1009504 1021231 1025899 1024942 1020041 1012403 1003682 995891 989761 984549 979841
58543 979841 976050 972731 968053 960532 949827 935477 916671 893911 869204 843937 818194 792716
58531G92716k3154j9675j7015j5089j2454r425p614o987o053m668l966l917l524
58518F59175l041l415l956l188j720j535k634l150k632k446k839k386p19P22J016
58503F27252O83M0j110k057j638k94L66O7j08j7n20j332j112K63J630K708M179
58486F29000N716O278O348P527R878J1935J3340J5159J7480J9111J9799K0439
58474G82010K0800J9331J5572J0679N380n28o423j0764j3018j3968j3980j2777
58462G82314j0837r055p192m462j363J033L181O301J0016J2945J5172J7630J9465
58449H35148J8636J4948J0068M831r51o412j0093j2354j4608j6459j6237j4195
58437G92322j2310j1049r155o565m589l191j013J751L373L686M310N688O676P126
$$ plain form
58531 792716 769562 749887 732872 717783 705329 695904 688290 681303 675250 670582 666616 662699 659175
58518 659175 656134 652719 648763 645575 643855 642320 639686 636536 633904 631458 628619 626233 625514 626236 627252
58503 627252 627935 627975 626865 624808 623170 622876 623242 623309 623201 623184 622664 621332 620220 620483 622113 624821 629000
58486 629000 634716 640994 647342 654869 664747 676682 690022 705181 722661 741772 761571 782010
58474 782010 802810 822141 837713 848392 853772 853244 846821 836057 823039 809071 795091 782314
58462 782314 771477 762422 755230 750768 749405 750438 753619 759920 769936 782881 798053 815683 835148
58449 835148 853784 868732 878800 883631 882680 876268 866175 853821 839213 822754 806517 792322
58437 792322 780012 768963 759808 753243 748654 745463 744450 746201 749574 753260 757570 763258 769934 777060
58423G77060Q161R661J0233R704Q985P663M538M24k621m575o922r206r545q387
58409G95173q133q939q620o871n897o374o501n636n158n165l884j224N81P38J009
58394G25099K299L406L836M567N374M693K807J855K221K210J721K647N152P123
58380G75010P907Q937J0216R976Q308P286P063N726L473K764L805M254L903M993
58366H63621P306P854O470O691R712J2442J3083J3681J5351J5891J4199J2423
58354I98724J1582R583N689K484J320K22j685k220o20N90L38R57L351M963M764
58339A040042N347P725R092Q343Q668J1737J4437J4468J4330J6249J8017J7391
58327A185846J6120J5980J5083J1793Q173O185M369J597m5P62J820J726K611N531
$$ plain form
58423 777060 785221 794882 805115 814819 823804 831467 836005 836429 833808 829233 822311 813105 803560 795173
58409 795173 787040 778101 769481 762610 756713 750339 743838 738202 733044 727879 723995 722771 723352 724090 725099
58394 725099 727398 730804 734640 739207 744581 749274 752081 753936 756157 758367 760088 762735 767887 775010
58380 775010 782917 791854 802070 812046 820354 827640 834703 840429 843902 846666 850471 854725 858628 863621
58366 863621 870927 878781 885251 891942 901654 914096 927179 940860 956211 972102 986301 998724
58354 998724 1010306 1019889 1025578 1028062 1029382 1029604 1027919 1025699 1025079 1025669 1026007 1026964 1030315 1035278 1040042
58339 1040042 1045389 1053114 1062206 1070549 1079217 1090954 1105391 1119859 1134189 1150438 1168455 1185846
58327 1185846 1201966 1217946 1233029 1244822 1252995 1259180 1263549 1265146 1265101 1265863 1267683 1269409 1272020 1277551
58313A277551P630P121O624Q267J0053J0296J1014J3464J5081J4306J3760J5210
58301A410377J6218J5238J4936J6843J7971J6484J5495J7238J8941J8455J8509
58290A596705K1034K2934K1979K1360K3702K6225K6505K7288L0619L3111L2269
58279A883731L1617L4086L6251L4843L3085L4521L6391L5240L3446L3959L4279
58268B261449L2023L0790L4041L8645M0913M3270M8604N3881N5996N7905O2243
58257B759760O5206O3690O1995O4241O6752O5412O3716O5781O8361O7917O8508
58246C481339P4248Q1078Q4596Q8539R6685J04266J06898J09981J19171J29666
58236D476467J35472J40995J52370J65561J74608J83446J97657K13008K24359
$$ plain form
58313 1277551 1285181 1292302 1298926 1307193 1317246 1327542 1338556 1352020 1367101 1381407 1395167 1410377
58301 1410377 1426595 1441833 1456769 1473612 1491583 1508067 1523562 1540800 1559741 1578196 1596705
58290 1596705 1617739 1640673 1662652 1684012 1707714 1733939 1760444 1787732 1818351 1851462 1883731
58279 1883731 1915348 1949434 1985685 2020528 2053613 2088134 2124525 2159765 2193211 2227170 2261449
58268 2261449 2293472 2324262 2358303 2396948 2437861 2481131 2529735 2583616 2639612 2697517 2759760
58257 2759760 2824966 2888656 2950651 3014892 3081644 3147056 3210772 3276553 3344914 3412831 3481339
58246 3481339 3555587 3636665 3721261 3809800 3906485 4010751 4117649 4227630 4346801 4476467
58236 4476467 4611939 4752934 4905304 5070865 5245473 5428919 5626576 5839584 6063943
58227F063943K37138K57242K78728K94821L11637L37085L66172L91902M20220
58218H958888M58635N01023N40122N83583O40358P03739P66442Q39209R34077
58209A4926076J043348J157130J286991J448767J638242J850043K103529K421906
58201B7876032K805427L257982L821307M550985N485776O681224Q242012J0269026
58193G2989771J2804609J5884328J9595120K3997420K9017277L4447101L9837067
58186B48572693M4041613M4905174M0000638K8383334J1870112n589575k0075618
58179C92108371k9563588l4204051l5348117l4446561l2488361k9953672k7029166
58172A69074855k3861431k0665270j7651800j4934738j2547922j0508620q816843
$$ plain form
58227 6063943 6301081 6558323 6837051 7131872 7443509 7780594 8146766 8538668 8958888
58218 8958888 9417523 9918546 10458668 11042251 11682609 12386348 13152790 13991999 14926076
58209 14926076 15969424 17126554 18413545 19862312 21500554 23350597 25454126 27876032
58201 27876032 30681459 33939441 37760748 42311733 47797509 54478733 62720745 72989771
58193 72989771 85794380 101678708 121273828 145271248 174288525 208735626 248572693
58186 248572693 292614306 337519480 377520118 405903452 417773564 412183989 392108371
58179 392108371 362544783 328340732 292992615 258546054 226057693 196104021 169074855
58172 169074855 145213424 124548154 106896354 91961616 79413694 68905074 60088231
58165F0088231p426806o273472n319118m543840l910577l375639k920954k544529
58157B3773296k230040j953889j711763j510866j343764j194052j060165r50442
58149A1818315q60902p78860p02677o38401n82500n26267m72145m28313l92025
58140F436225l54455l17079k87617k64781k42225k22706k13007k09098k01016
58131D124241j88827j79738j73113j62386j48735j39139j33098j24236j13046
58122B761923j05664j01789r5710q7741q3179q1319p6527o9101o4491o2729n8798
58111A874875n2729m9426m9042m6960m2892m1188m2319m2492m1322m1913m3870
58100A380722m3815m2180m2061m2252l8845l2935k9419k8914k7873k5708k4800
$$ plain form
58165 60088231 52661425 46387953 41068835 36524995 32614418 29238779 26317825 23773296
58157 23773296 21543256 19589367 17877604 16366738 15022974 13828922 12768757 11818315
58149 11818315 10957413 10178553 9475876 8837475 8254975 7728708 7256563 6828250 6436225
58140 6436225 6081770 5764691 5477074 5212293 4970068 4747362 4534355 4325257 4124241
58131 4124241 3935414 3755676 3582563 3420177 3271442 3132303 2999205 2874969 2761923
58122 2761923 2656259 2554470 2458760 2371019 2287840 2206521 2129994 2060893 1996402 1933673 1874875
58111 1874875 1822146 1772720 1723678 1676718 1633826 1592638 1550319 1507827 1466505 1424592 1380722
58100 1380722 1336907 1294727 1252666 1210414 1171569 1138634 1109215 1080301 1052428 1026720 1001920
58089A001920k4442k1823j8208j7259j8156j7097j4610j4440j6183j6045j4170
58078H09487j4149j5857j5751j3927j3961j5883j6082j4254j3812j5165j5102
58067F45544j3166j2318j2766j1375p925n964o525o601m947m007n050o289o850
58054E41761p958r438r405q110p817q500p950o233n688o359n869m020l099l445
58040D47870l120k082k293l529l528k496k973m961n674m610m463o359q385r396
58026C84001j0271j0886r813p579o475o684o281n159n117n965n539l851l145l609
58012B93627l152j691j507k808l169j957j221j548j136K02K69j369k321j599j081
57997B69539j743k000j047l78q09j105n78m0N58K248M246M302K514J460J903J810
$$ plain form
58089 1001920 977478 955655 937447 920188 902032 884935 870325 855885 839702 823657 809487
58078 809487 795338 779481 763730 749803 735842 719959 703877 689623 675811 660646 645544
58067 645544 632378 620060 607294 595919 587994 582030 575505 568904 563957 559950 554900 548611 541761
58054 541761 533803 524365 514960 506850 499033 490533 482583 476350 470662 464303 458434 454414 451315 447870
58040 447870 444750 442668 440375 436846 433318 430822 427849 422888 417214 412604 408141 401782 393397 384001
58026 384001 373730 362844 353031 345452 338977 332293 326012 320853 315736 309771 304232 300381 297236 293627
58012 293627 290475 288784 287277 284469 281300 279343 278122 276574 275438 275640 275909 274540 272219 270620 269539
57997 269539 267796 265796 264749 264371 263562 262457 261879 261839 262397 264645 268891 273193 275707 277167 279070 280880
57981B80880L34p74o53p16j509j585n99l00j261j802j227j001j623j501r4Q90
57965B67459O23M79J082J018k51j097o29j08k89j07P60P51q89k749l718m290m577
57948B53468l656j889j130j688j700m56M59L12N53J887K879K813L104M612O153
57933B65721O966Q001R454R686P990N903M436K546k90k636l615m383n691o409
57919B97679n891n351n481n166l983l469m350m961m018k653k080j515j05J273
57905B49929J739J910K210J743L11o04k65ko65j000k6J195J749K548M184N240
57889B70196M575L281K697K391J730J410J740J493J50p30j33M13o81k504l493
57874B82535l916m615m995m359l616l748l968l270k276j936j808j325j144j607
$$ plain form
57981 280880 281214 280440 279787 279071 277562 275977 275378 275078 273817 272015 270788 269787 268164 266663 266569 267459
57965 267459 268082 268561 269643 270661 270410 269313 268684 268576 268287 268180 268940 269691 268802 266053 262335 258045 253468
57948 253468 249812 247923 246793 245105 243405 242949 243408 243720 244273 246160 249039 251852 254956 259568 265721
57933 265721 272687 280688 290142 299828 307818 313721 318157 320703 320413 317777 314162 309779 304088 297679
57919 297679 291788 286437 280956 275790 271807 268338 263988 259027 255009 252356 250276 248761 248656 249929
57905 249929 251668 253578 255788 257531 257842 257238 256973 256971 256306 255306 255280 256475 258224 260772 264956 270196
57889 270196 274771 278052 280749 283140 284870 286280 288020 289513 289663 288933 288800 289213 288532 286028 282535
57874 282535 278619 274004 269009 264650 261034 257286 253318 250048 247772 245836 244028 242703 241559 239952
57860B39952j523k07J021J085J176K550M111M312L936M647O087O702O372O099
57846B86320N902N064L757K674J738O81O4K67M48j58r43j228j637k742l681l652
57830B92874l435l873m156l321k182j965k275k110j750j857j843j034l25q39j864
57815B60045k005j465j369j679j617j467k127l470m661n483o037n936n166m831
57801B12732n583o286n668m345l627l378k627j502q73q14q62j026j244p56O33
57786A74774J729J677J374J783K211J825J516K438L953M873N564O870Q084Q038
57772B26709P228O853O674N798M651M156L834K762J515J041N84j057l020l493
57758B64235k643k203k630l060l446m378n117m238k139o56l12n2M02K48l80k42
$$ plain form
57860 239952 238429 238222 239243 240328 241504 244054 248165 252477 256413 261060 267147 273849 280221 286320
57846 286320 292222 297286 301043 303717 305455 306136 306200 306467 306915 306757 305814 304586 302949 300207 296526 292874
57830 292874 289439 285566 281410 278089 275907 273942 271667 269557 267807 265950 264107 263073 262748 261909 260045
57815 260045 258040 256575 255206 253527 251910 250443 248316 244846 240185 234702 228665 222729 217563 212732
57801 212732 207149 200863 195195 190850 187223 183845 181218 179716 178843 178029 177167 176141 174897 174141 174774
57786 174774 176503 178180 179554 181337 183548 185373 186889 189327 193280 198153 203717 210587 218671 226709
57772 226709 233937 240790 247464 253262 257913 262069 265903 268665 270180 271221 271805 270748 267728 264235
57758 264235 261592 259389 256759 253699 250253 245875 240758 236520 234381 233725 233413 233361 233763 234011 233631 233389
57742B33389P78J287N32o73j430j663j463r48p00j037j077k3J197J160L77N84
57726B30290J971L074L198K978K690J953J159J239J914J947J173N91M98L09P4
57711B55058L79P87K49r34j473j365j827k966l594l489l731m481m537l560k730
57696B21786k652k527j904j464j465j271j001j774l601m852m591l771l388l035
57682A84490k217j422r45k2J764L580M707N742P531R996J2887J6706K2052K8794
57668B93643L6583M5219N3853O0338O1789N5458L9768J6130j0020l1801m5431
57657E75529n1637n2720n0013m4495l7919l1798k6305k1154j6746j3624j1568
57646B17550r990q577p101n356l688k791k583k174j244m71k62j15L19N38J56l65
$$ plain form
57742 233389 234167 235454 235986 235313 233883 232220 230757 229809 229109 228072 226995 226972 228169 229329 229706 230290
57726 230290 232261 235335 238533 241511 244201 246154 247313 248552 250466 252413 253586 254177 254675 254984 255058
57711 255058 255437 256224 256473 255539 254066 252701 250874 247908 244314 240825 237094 232613 228076 224516 221786
57696 221786 219134 216607 214703 213239 211774 210503 209502 207728 204127 199275 194684 190913 187525 184490
57682 184490 182273 180851 179906 179884 181648 185228 189935 195677 203208 213204 226091 242797 264849 293643
57668 293643 330226 375445 429298 489636 551425 606883 646651 662781 652761 620960 575529
57657 575529 523892 471172 421159 376664 338745 306947 280642 259488 242742 229118 217550
57646 217550 207560 198983 191882 186526 182838 180047 177464 175290 174046 173575 173313 173198 173517 174055 174211 173846
57630A73846n07m34m50m83m83o35r38j223j690k573l272k913j826j320j765k174
57614A51160j876j399j219r66l96p3l94r06j045p96k93L38N45j79j227j394p26
57597A39154n78j545k584k689k189j868j910k257k923l471l237k406j863j694
57583A07940j163k98k6l58j46Q07J155K68o14n02l04j070k113k271j889j970k398
57566I5048k365j909j696j815j905j943j979j661q98l47l82k98N79J689K101J916
57550H4135J918K376L013L550L548K404L46j276j517j098j207j757j740p97M26
57535I2324J171J072K23o63o98R4O74N27L91Q91J366R28j33r46j362j633j522
57518I2704p15L17Q46R03R74J087J002R11J131J447J441J107O45K8o64r56n68
$$ plain form
57630 173846 173339 172905 172455 171972 171489 170854 169916 168693 167003 164430 161158 158245 156419 155099 153334 151160
57614 151160 149284 147885 146666 145700 145304 145231 144837 143931 142886 142090 141797 142135 142680 142501 141274 139880 139154
57597 139154 138576 137031 134447 131758 129569 127701 125791 123534 120611 117140 113903 111497 109634 107940
57583 107940 106777 106479 106453 106095 105949 106756 107911 108179 107565 107063 106759 105689 103576 101305 99416 97446 95048
57566 95048 92683 90774 89078 87263 85358 83415 81436 79775 78877 78530 78148 77850 78429 80118 82219 84135
57550 84135 86053 88429 91442 94992 98540 100944 101290 100014 98497 97399 96192 94435 92695 91898 92324
57535 92324 93495 94567 94790 94127 93429 93523 94197 94724 95115 96006 97372 98300 98167 97221 95859 94226 92704
57518 92704 91989 92306 93152 94055 95029 96116 97118 98029 99160 100607 102048 103155 103800 103828 103164 102208 101640
57501A01640J44P64J231J317N02j068k355k731k729k895k840k203j586j630j947
57486H3614j884j647j720j847j544r86n56j20M29P00O32R42J827K172J117m09
57470H0720r78p22p54j240j447j268j260j465j438j202j045p40j3N62K41n87j012
57453F6352j031j228j398q75j0J38m67p52k62L40N65P57J116J242R93Q53J092
57436F7425J258Q54j4q79j282r23P1J053J503J577J578J279M68l72p57j121k074
57419F9644l063k965j809p83n20n02k31J41N03J062J596J438O01J17P71K075K884
57402G0959K556J274l23j559k128k248k180j792r49q0K31J04R6K42J03k42o6R86
57384F4984K385L490M219M708M796M225L090J809P40r1q27j452j655j314r56j239
$$ plain form
57501 101640 101784 102548 103779 105096 105598 104530 102175 99444 96715 93820 90980 88777 87191 85561 83614
57486 83614 81730 80083 78363 76516 74972 73986 73430 73310 73739 74439 75071 76013 77840 80012 81129 80720
57470 80720 79742 79020 78266 77026 75579 74311 73051 71586 70148 68946 67901 67161 67148 67710 67951 67364 66352
57453 66352 65321 64093 62695 61820 61810 61948 61481 60729 60467 60807 61372 62129 63245 64487 65480 66333 67425
57436 67425 68683 69537 69523 68644 67362 66439 66510 67563 69066 70643 72221 73500 73968 73596 72839 71718 69644
57419 69644 66581 63616 61807 61024 60504 60002 59771 59912 60415 61477 63073 64511 65112 65229 66000 68075 70959
57402 70959 73515 74789 74466 72907 70779 68531 66351 64559 63610 63530 63761 63865 63961 64203 64306 64064 63998 64984
57384 64984 67369 70859 75078 79786 84582 88807 91897 93706 94446 94355 93528 92076 90421 89107 88151 86912
57368H6912j972k274j920j708k118k421j858r34o41r11q46k12K75Q3m67p39m09
57351F7840L75J144J471J502J772K339K525J931J011L14j89n73n27j13k5m36m39
57334G9922M52J238R18J01r8P2l51j156j345r37q50j219j318j050j017j160p50
57317G1452J50N96L03M4K44L65K5l65l99k44j23k6Rm5J74Q87J451J086K07qO44
57296G6427J230J199R85Q96N93k3l57J7P32J197J195Q27L35O7J24K34L43R44K194
57277H9159L264L345K742K106J365M79L50J486K513J790K6o26K61J103J172J470
57261A12005K452K991K336J270N79n3q12r03J21J449K260K761L313L650L667L865
57245A40951M366M578M392M609N496O121N773N037M774N052N629O428O955O404
$$ plain form
57368 86912 84940 82666 80746 79038 76920 74499 72641 71707 71066 70155 69309 69097 69372 69455 68988 68249 67840
57351 67840 68215 69359 70830 72332 74104 76443 78968 80899 81910 82224 82035 81462 80935 80822 80797 80361 79922
57334 79922 80374 81612 82530 82631 82533 82605 82254 81098 79753 78816 77966 76747 75429 74379 73362 72202 71452
57317 71452 71602 72198 72501 72545 72789 73154 73179 72814 72415 72171 72048 72022 72031 71986 72160 73047 74498 75584 75791 75783 76427
57296 76427 77657 78856 79841 80737 81330 81307 80950 80967 81699 82896 84091 84918 85253 85320 85444 85678 86021 86965 89159
57277 89159 92423 95768 98510 100616 101981 102460 102810 104296 106809 108599 108625 107999 108260 109363 110535 112005
57261 112005 114457 117448 119784 121054 121633 121580 120768 119865 119986 121435 123695 126456 129769 133419 137086 140951
57245 140951 145317 149895 154287 158896 164392 170513 176286 181323 186097 191149 196778 203206 210161 216565
57231B16565N069M493N510P156Q246Q916R741J0455J0522J0193J0044J0155J0392
57218C27457J0835J1304J1249J0670J0307J0455J0582J0588J1287J2972J4716
57207D52422J5906J7327J9759K2484K4314K5221K5890K6408K6439K6156K6007
57196G08333K6008K5970K5927K5782K5172K4235K3795K4122K4390K3974K3361
57185I81069K3099K2761K1887K1031K0925K1296K1503K1669K2305K3323K4355
57174A225223K5470K6827K8098K8865K9076K8547K6806K3965K1029J8691J6676
57163A499273J4891J4094J4568J5154J4760J3930J3823J4383J4778J5100J6241
57152A660995J8366K0564K1947K2322K2009K1648K1845K2472K2725K2345K2139
$$ plain form
57231 216565 221634 226127 231637 238793 247039 255955 265696 276151 286673 296866 306910 317065 327457
57218 327457 338292 349596 360845 371515 381822 392277 402859 413447 424734 437706 452422
57207 452422 468328 485655 505414 527898 552212 577433 603323 629731 656170 682326 708333
57196 708333 734341 760311 786238 812020 837192 861427 885222 909344 933734 957708 981069
57185 981069 1004168 1026929 1048816 1069847 1090772 1112068 1133571 1155240 1177545 1200868 1225223
57174 1225223 1250693 1277520 1305618 1334483 1363559 1392106 1418912 1442877 1463906 1482597 1499273
57163 1499273 1514164 1528258 1542826 1557980 1572740 1586670 1600493 1614876 1629654 1644754 1660995
57152 1660995 1679361 1699925 1721872 1744194 1766203 1787851 1809696 1832168 1854893 1877238 1899377
57141A899377K2748K3667K4216K4731K5935K7737K9462L0847L2085L3393L5083
57130B209281L7498M0338M2766M4719M7263N1030N5071N8145O0384O2898O6382
57119B775775P0899P6576Q3775R2851J04080J17347J31801J46535J61594J77587
57109C938820J94592K12698K33403K58788K89349L24614L66143M18006M84048
57100F720461N67013O70960Q02354R68263J175903J434449J754025K141004K595418
57091A8829850L111771L677507M269100M853763N397290N867860O233584O463231
57083E8703956O528317O390895N984004N225349M081873K631917J051719m71874
57075I0126156j821490k959189l885843m607043n127293n454940n603234n590272
$$ plain form
57141 1899377 1922125 1945792 1970008 1994739 2020674 2048411 2077873 2108720 2140805 2174198 2209281
57130 2209281 2246779 2287117 2329883 2374602 2421865 2472895 2527966 2586111 2646495 2709393 2775775
57119 2775775 2846674 2923250 3007025 3099876 3203956 3321303 3453104 3599639 3761233 3938820
57109 3938820 4133412 4346110 4579513 4838301 5127650 5452264 5818407 6236413 6720461
57100 6720461 7287474 7958434 8760788 9729051 10904954 12339403 14093428 16234432 18829850
57091 18829850 21941621 25619128 29888228 34741991 40139281 46007141 52240725 58703956
57083 58703956 65232273 71623168 77607172 82832521 86914394 89546311 90598030 90126156
57075 90126156 88304666 85345477 81459634 76852591 71725298 66270358 60667124 55076852
57067E5076852n439888n179657m837036m438685m011463l579843l161775k768788
57059B1659717k409229k088810j808931j567504j361861j189264j045269r24230
57051I264619q21580p34168o58711n91815n31453m76846m27039l81032l38977
57042D302998l01621k68660k39024k12508j89613j69889j52021j35483j20619
57033B513560j06999r3260p8933o4972n1924l8855k4661r090Q291K8300M8856
57022B130313O1764N5984K6832j7997o2981r5748j13324j18979j16236j07500
57012A642128r5889q4778p5284o6335n7537n0129m4848m0774l7049l4044l2025
57001A023436l0230k8254k7016k7220k7856k7371k5468k2929k0421j8241j6412
$$ plain form
57067 55076852 49636964 44457307 39620271 35181586 31170123 27590280 24428505 21659717
57059 21659717 19250488 17161678 15352747 13785243 12423382 11234118 10188849 9264619
57051 9264619 8443039 7708871 7050160 6458345 5926892 5450046 5023007 4641975 4302998
57042 4302998 4001377 3732717 3493693 3281185 3091572 2921683 2769662 2634179 2513560
57033 2513560 2406561 2313301 2234368 2169396 2117472 2078617 2053956 2044866 2053157 2081457 2130313
57022 2130313 2192077 2248061 2274893 2256896 2193915 2098167 1984843 1865864 1749628 1642128
57012 1642128 1546239 1461461 1386177 1319842 1262305 1212176 1167328 1126554 1089505 1055461 1023436
57001 1023436 993206 964952 937936 910716 882860 855489 830021 807092 786671 768430 752018
56990G52018j4288j0938o505k255J265M999R541J3717J5861J5348J1978N294m038
56977G91997j3238j9507k2654k4289k5124k4487k2136j8978j5976j3418j1317
56966E80873r555p662n243k504J82L012O407J0311J4382J8416K1679K2406J8917
56953F71621J1209R08r950j9503k6145k9127k9053k7088k3901j9885j5856j2592
56941D70638r978p378m577j624J808O051J0718J5221J9816K5123L0677L4639L4996
56928F26130L0469K0658O432r582k3737l3278l7651l8134l6490l3809l0314k6053
56916D14641k1698j8195j5703j3528j1380r918r615r797r452q374o915n202l366
56903B71498k021j720k137k427k124j220J86J733K794L288M124O110Q913J1715
$$ plain form
56990 752018 737730 726792 720287 718032 719297 724296 733837 747554 763415 778763 790741 796035 791997
56977 791997 778759 759252 736598 712309 687185 662698 640562 621584 605608 592190 580873
56966 580873 571318 563656 558413 555909 556091 559103 565510 575821 590203 608619 630298 652704 671621
56953 671621 682830 683738 673788 654285 628140 599013 569960 542872 518971 499086 483230 470638
56941 470638 460660 453282 448705 447081 448889 454940 465658 480879 500695 525818 556495 591134 626130
56928 626130 656599 677257 683689 674107 650370 617092 579441 541307 504817 471008 440694 414641
56916 414641 392943 374748 359045 345517 334137 324219 314604 304807 295355 286981 280066 274864 271498
56903 271498 269477 267757 265620 263193 261069 259849 260035 261768 264562 267850 271974 278084 286997 298712
56889B98712J4461J7635K1133K4180K6117K6484K4478J9306J1238J916o511j2479
56877D66670j5616j6677j6632j5595j3046r219n461k679k74K826O784J1318J6698
56864D09097K3239L0340L7165M3919N1210N8061O1491N8300M6963K8378N797j6015
56852H37945l2752m2545m6115m5318m1772l6489l0061k2953j5769q962k267N104
56840E18046J3502K2665L2675M4248N7507P1332Q4337R5404J02142R9881Q4069
56829A225808N4302J5696k3500n5646p6495q6129q7513q3652p6041o5630n4003
56818F87197m2711l2214k2429j3564n457L073J2983K3648L3921M3912N4329O4319
56806H07007P1072P1227O1907M1635J2422j9226m5425o1993o9777p1553o9123
$$ plain form
56889 298712 313173 330808 351941 376121 402238 428722 453200 472506 483744 485660 479149 466670
56877 466670 451054 434377 417745 402150 389104 379885 374424 371745 371471 374297 381081 392399 409097
56864 409097 432336 462676 499841 543760 594970 653031 714522 772822 819785 848163 853960 837945
56852 837945 805193 762648 716533 671215 629443 592954 562893 539940 524171 515209 512942 518046
56840 518046 531548 554213 586888 631136 688643 759975 844312 939716 1041858 1141739 1225808
56829 1225808 1280110 1295806 1272306 1216660 1140165 1054036 966523 882871 806830 741200 687197
56818 687197 644486 612272 589843 576279 570822 573895 586878 610526 644447 688359 742688 807007
56806 807007 878079 949306 1011213 1052848 1065270 1046044 1000619 938626 868849 797296 728173
56795G28173o3408n5468m6464l7415k9355k2880j7391j1697n486O87O731J3130
56783D59157J9719K5626L0630L5005L7528L5111K5583J0202p225k3040l5084m2431
56771E70781m5098m3958m0377l5724l1156k7306k3999k0706j7428j4730j2849
56760B57450j1442j0311r677r415q691o958m829l467l240l424l171k414j800j809
56746A76802k196k331j953j288n79J9J73l81j189j461j262j447k129k230j159
56731A57389J37N97N46P76J108J037R82J524K127J968J490J680K265K185J481
56716A77292J126J153O50m18j020p91m41k68K44J053J336J011J058J817K276J714
56700A87792Q01M33N01M68K80O0l05p79j040j091j269j421r70m9L73j11p45p78
$$ plain form
56795 728173 664765 609297 562833 525418 496063 473183 455792 444095 438609 439296 446027 459157
56783 459157 478876 504502 535132 570137 607665 642776 668359 678561 671336 648296 613212 570781
56771 570781 525683 481725 441348 405624 374468 347162 323163 302457 285029 270299 257450
56760 257450 246008 235697 226020 216605 207914 200956 196127 192660 189420 185996 182825 180411 178611 176802
56746 176802 174606 172275 170322 169034 168455 168474 168647 168266 167077 165616 164354 162907 160778 158548 157389
56731 157389 157526 158123 158669 159445 160553 161590 162572 164096 166223 168191 169681 171361 173626 175811 177292
56716 177292 178418 179571 180221 179803 178783 177992 177551 177283 177527 178580 179916 180927 181985 183802 186078 187792
56700 187792 188593 189026 189527 189995 190275 190335 190030 189251 188211 187120 185851 184430 183460 183411 183784 183673 182928 182150
56682A82150l59R7N91J107J355J366J614K115K116J135l01j286j400p71J01M97
56666A90127Q7n03m24J78M44J83k4j8j79k84M41J835K591K016R08K52N1PK16O18
56646A98522O26k3p32q98o51m17l21l73n81p16n56m38p70j115p44j8J8n74o78
56627A89561j64k48j332k101j619q58j052j745j731j001n20o72r70j027r06p33
56611A72882n69m66l14PK18o6n99p39n20n84r65r65m09K6L6J47N84Q13O36O11
56591A69764R01Q74K94j85j75o2R4Q64K077K489J590M61P9Pl59n19J57J262K115
56572A81728K705K978K391J128N99J560K840L114K925L677N446P173Q376R422
56558B36062J0515J1432J1893J1375R200N510J543j650l941n186m821l250k265
$$ plain form
56682 182150 181791 181888 182479 183586 184941 186307 187921 190036 192152 193287 192986 191700 190300 189529 189630 190127
56666 190127 190214 189711 189287 189465 189909 190092 190068 190050 189871 189587 190028 191863 194454 196470 197378 197630 197681 197688 197904 198522
56646 198522 199148 199125 198393 197495 196844 196427 196106 195733 195152 194436 193880 193442 192672 191557 190813 190795 190813 190239 189561
56627 189561 189397 189149 187817 185716 184097 183239 182187 180442 178711 177710 177190 176518 175548 174521 173615 172882
56611 172882 172313 171847 171533 171540 171758 171692 171093 170354 169834 169250 168285 167320 166911 166937 166973 167120 167704 168517 169153 169764
56591 169764 170665 171539 171833 171648 171473 171411 171505 172369 174446 176935 178525 178986 179065 179072 178713 178194 178351 179613 181728
56572 181728 184433 187411 189802 190930 191529 193089 195929 199043 201968 205645 211091 218264 226640 236062
56558 236062 246577 258009 269902 281277 290477 295987 297530 295880 291939 286753 281932 278682 276417
56545B76417k863l798l486k254j390j139j151j802l335m495l835j906m49M7L50
56530B44911N50k3j134j613j191q00q78p81j76K48r4q24j273j340j371j632k045
56513B30534k173j667r44r19j723k381k305k222k784l185k343p53J36j9l63m72
56497B06417p33j173j213p01k05k1K20P81J298J239M94n15j070p40L8L31p7m24
56479B03946j83J96J96Q3K12L78M43Q73J817K528K444J986J543O94n95j121j30
56462B15310J126R80k15p21J4R00J072P33L07q1k99k87l68o95p39o2Q33J285J514
56443B20607J931K119J513O27L80O73P08L42P7M9L3N3J43j6m03k34Q12J657J217
56424B32288M9n48m13k93l63k29M4J50L66R71J354P96k36p53o51m29j24L93O76
$$ plain form
56545 276417 273554 269756 266270 264016 262626 261487 260336 258534 255199 250704 246869 244963 244514 244561 244911
56530 244911 245461 245438 244304 242691 241500 240700 239822 239041 238865 239113 239019 238195 236922 235582 234211 232579 230534
56513 230534 228361 226694 225750 224831 223108 220727 218422 216200 213416 210231 207888 207135 207271 207252 206889 206417
56497 206417 205684 204511 203298 202597 202392 202371 202591 203372 204670 205909 206403 205888 204818 204078 204116 204447 204370 203946
56479 203946 203763 203959 204155 204238 204450 204828 205271 206144 207961 210489 212933 214919 216462 217156 216561 215440 215310
56462 215310 216436 217416 217201 216480 216494 217394 218466 219199 219506 219425 219126 218839 218471 217776 217037 216975 217808 219093 220607
56443 220607 222538 224657 226170 226797 227177 227850 228558 228900 228977 229026 229059 229112 229255 229239 228836 228602 229414 231071 232288
56424 232288 232337 231789 231376 231083 230720 230491 230535 230685 231051 232022 233376 234172 233936 233183 232532 232103 231979 232372 233048
56405B33048M03J97O05J022Q03N78J158J939J852J091M79r6j039j674j159j41
56389B39066J86M5M35J200J430J179J066Q03j30r58o35K08K18l78l13M48J010
56372B44880J480K489L296K709J454J282J924J455m41j931j925j176k90J009K361
56357B58576K678K038J656J732J318N43O99J792K240J544J072J501J663Q00j1
56342B79841K89J110J451J322J169J096J296K085L041L316K990K955L311L399
56328C08671L296L752M530M601M030L860M021L335J804Q46Q48M92q74k128k300
56313C38784j886j533j029k60K99N55J013J675K034K224K780L315L112K814L664
56298C57561N213N821N333N005M919M004K704K943M880O380O346O055O489O889
$$ plain form
56405 233048 233451 233648 234253 235275 236078 236656 237814 239753 241605 242696 243175 243079 242040 240366 239207 239066
56389 239066 239252 239297 239732 240932 242362 243541 244607 245410 245280 244322 243687 243895 244113 243735 243422 243870 244880
56372 244880 246360 248849 252145 254854 256308 257590 259514 260969 260528 258597 256672 255496 255206 256215 258576
56357 258576 261254 263292 264948 266680 267998 268541 269240 271032 273272 274816 275888 277389 279052 279852 279841
56342 279841 280130 281240 282691 284013 285182 286278 287574 289659 292700 296016 299006 301961 305272 308671
56328 308671 311967 315719 320249 324850 328880 332740 336761 340096 341900 342746 343594 344086 343212 341084 338784
56313 338784 336898 335365 334336 334076 334375 334930 335943 337618 339652 341876 344656 347971 351083 353897 357561
56298 357561 362774 368595 373928 378933 383852 387856 390560 393503 398383 404763 411109 417164 423653 430542
56284D30542O893P491Q840R472Q868Q536R449J0605J1210J2014J3314J3930J3559
56271E64723J3836J5612J7277J7360J6926J7691J9607K1738K4007K6529K8789
56260G84095L0799L3677L7876M2373M6774N2527O0707P0166P9254Q8139R8190
56249A424577J10161J23975J39100J54347J68401J81098J92941K03185K10074
56240B907859K13104K13012K09280J99937J84332J63667J38271J07094P0809L2682
56230D440047m713m1062p5573j05599j29624j48997j65021j76755j83389j86292
56220C223022j86844j84463j78642j70814j62360j52826j41921j31179j21840
56211A792133j13042j03799r4860q6950p9261p1365o4514n9363n4536m9108m4255
$$ plain form
56284 430542 437435 444926 453766 463238 472106 480642 490091 500696 511906 523920 537234 551164 564723
56271 564723 578559 594171 611448 628808 645734 663425 683032 704770 728777 755306 784095
56260 784095 814894 848571 886447 928820 975594 1028121 1088828 1158994 1238248 1326387 1424577
56249 1424577 1534738 1658713 1797813 1952160 2120561 2301659 2494600 2697785 2907859
56240 2907859 3120963 3333975 3543255 3743192 3927524 4091191 4229462 4336556 4407365 4440047
56230 4440047 4435334 4394272 4318699 4213100 4083476 3934479 3769458 3592703 3409314 3223022
56220 3223022 3036178 2851715 2673073 2502259 2339899 2187073 2045152 1913973 1792133
56211 1792133 1679091 1575292 1480432 1393482 1314221 1242856 1178342 1118979 1064443 1015335 971080
56200I71080m0727l7086l2446k8498k6696k5673k3655k1278j9705j8088j5348
56189F81880j2550j1155j0606r839r336r558r256p544n771n179m725l336k234
56176E80791k552k788j236R05J431N09l07p27r95l09J628L145L019K589L310M165
56160E92578L907L737N079O720O972O761P754R259R892J0545J2625J5038J6010
56147G06877J6516J8723K2367K5764K9299L4865M2605N0945N9119O7322P5198
56136A149600Q2199Q8264R2334R1728Q5115P4608O3122N1622M0978L3824L1712
56125A885106L2206L1513K8310K2818J4612M205n370j1598j5381j8561k1154k3729
56113A922977k9591m0954n5101o7681p7514q4917q8076q5221p8388p0943o3100
$$ plain form
56200 971080 930353 893267 860821 832323 805627 779954 756299 735021 715316 697228 681880
56189 681880 669330 658175 647569 637730 628394 618836 609580 602036 596265 591086 586361 583025 580791
56176 580791 578239 575451 574215 575120 576551 577060 576753 576026 575031 574722 576350 579495 582514 585103 588413 592578
56160 592578 596485 600222 605301 612021 618993 625754 633508 642767 652659 663204 675829 690867 706877
56147 706877 723393 742116 764483 790247 819546 854411 897016 947961 1007080 1074402 1149600
56136 1149600 1231799 1320063 1412397 1504125 1589240 1663848 1726970 1778592 1819570 1853394 1885106
56125 1885106 1917312 1948825 1977135 1999953 2014565 2018770 2013400 2001802 1986421 1967860 1946706 1922977
56113 1922977 1893386 1852432 1797331 1729650 1652136 1567219 1479143 1393922 1315534 1244591 1181491
56102A181491n3488m3366l5349k9548k4449k0014j6638j3045q607n585n543n878
56090I19981l620k50J210J391K670M414M594M023M641N645N488N565P611R812
56076I73175R821R237J0546J2258J1895J1075J2508J4504J3986J2542J3731J6533
56064A121811J7329J6403J6642J7603J6745J4918J4892J6005J5843J5389J6819
56053A300399J8230J6545J3686J3744J5981J6791J6560J8098K0312K0196J9222
56042A489764K0952K4097K4870K4244K5873K8731K9195K8580L0896L4835L5702
56031A797739L3783L2988L2963L0564K7516K8234L1557L2939L3161L6289M0881
56020B158614M2329M2201M5784N1883N4890N5467N9032O4894O7483O7407P0417
$$ plain form
56102 1181491 1128003 1084637 1049288 1019740 995291 975277 958639 945594 936987 931402 925859 919981
56090 919981 916361 916111 917321 918712 921382 925796 930390 934413 939054 944699 950187 955752 963363 973175
56076 973175 982996 992233 1002779 1015037 1026932 1038007 1050515 1065019 1079005 1091547 1105278 1121811
56064 1121811 1139140 1155543 1172185 1189788 1206533 1221451 1236343 1252348 1268191 1283580 1300399
56053 1300399 1318629 1335174 1348860 1362604 1378585 1395376 1411936 1430034 1450346 1470542 1489764
56042 1489764 1510716 1534813 1559683 1583927 1609800 1638531 1667726 1696306 1727202 1762037 1797739
56031 1797739 1831522 1864510 1897473 1928037 1955553 1983787 2015344 2048283 2081444 2117733 2158614
56020 2158614 2200943 2243144 2288928 2340811 2395701 2451168 2510200 2575094 2642577 2709984 2780401
56009B780401P6141P8732P8261Q0407Q5316Q7997Q9296R4819J03393J08417J10399
55998C773579J16019J25196J31737J36395J45943J59483J69381J75851J86601
55989E120185K01958K14915K25947K42534K63812K81575K96793L18668L47036
55980G513423L73063L97634M30739M72085N11760N50739O00492O61542P24039
55971A2235516P90306Q73911R75498J084211J203917J351826J530707J731636
55963B1777528J965217K258974K623872L059454L594098M283699N173651O308274
55955E1044767P774897R681837J2090603J5029967J8568326K2782723K7642042
55948A64615162L2974379L8415061M3031927M4879806M1408704L1079711J4976805
$$ plain form
56009 2780401 2856542 2935274 3013535 3093942 3179258 3267255 3356551 3451370 3554763 3663180 3773579
55998 3773579 3889598 4014794 4146531 4282926 4428869 4588352 4757733 4933584 5120185
55989 5120185 5322143 5537058 5763005 6005539 6269351 6550926 6847719 7166387 7513423
55980 7513423 7886486 8284120 8714859 9186944 9698704 10249443 10849935 11511477 12235516
55971 12235516 13025822 13899733 14875231 15959442 17163359 18515185 20045892 21777528
55963 21777528 23742745 26001719 28625591 31685045 35279143 39562842 44736493 51044767
55955 51044767 58819664 68501501 80592104 95622071 114190397 136973120 164615162
55948 164615162 197589541 236004602 279036529 323916335 365325039 396404750 411381555
55941D11381555l293243j9547062l1103802l7400951l9254573l7927434l4666928
55934B08187562l0531485k6256397k2229767j8624946j5524765j2937197j0799530
55927G1283475r037600p602659o443901n493103m699053m043674l508951l059243
55919B7395291k668985k337331k061702j822804j607118j419483j262023j122557
55911A3093288r93715q82604p92148p11945o36080n71814n22445m78802m35322
55902G068413l98189l70149l42988l12438k85727k67185k50165k30017k11892
55893D399663j99097j86377j71090j58953j52435j44961j32667j20983j13774
55884C019326j06518r5946q6265q0354p4512o7305o4103o7376p1366p1580p0920
$$ plain form
55941 411381555 408088312 388541250 357437448 320036497 280781924 242854490 208187562
55934 208187562 177656077 151399680 129169913 110544967 95020202 82083005 71283475
55927 71283475 62245875 54643216 48199315 42706212 38007159 33963485 30454534 27395291
55919 27395291 24726306 22388975 20327273 18504469 16897351 15477868 14215845 13093288
55911 13093288 12099573 11216969 10424821 9712876 9076796 8504982 7982537 7503735 7068413
55902 7068413 6670224 6300075 5957087 5644649 5358922 5091737 4841572 4611555 4399663
55893 4399663 4200566 4014189 3843099 3684146 3531711 3386750 3254083 3133100 3019326
55884 3019326 2912808 2816862 2730597 2650243 2575731 2508426 2444323 2376947 2305581 2234001 2163081
55873B163081p1672p0178o4679o0143n9941o0271n7714n5025n4671n3793n0293
55862A504701m7235m6740m5822m2453l9465l8609l7004l3186l0440l0443k9750
55851A083554k6327k3442k3516k3949k2650k1772k2576k2347j9892j8353j9281
55840H39449j9539j7389j5776j6341j6061j3344j1633j3137j4656j3442j1744
55829F76387j1682j1088q464o789q119r401q002o583q070j0298j0171r065r486
55816E59169j0110q673o528o080o547o041n141n007m672l278k224k293j613R00
55802D91862L256M069N010P074Q030O482M724M532L844Q55k196k912k992m987
55788E26651p820r143r377r773r127o090k575j512l016n578q852j2452j4323j3236
$$ plain form
55873 2163081 2091409 2021231 1956552 1896409 1836468 1776197 1718483 1663458 1608787 1554994 1504701
55862 1504701 1457466 1410726 1364904 1322451 1282986 1244377 1207373 1174187 1143747 1113304 1083554
55851 1083554 1057227 1033785 1010269 986320 963670 941898 919322 896975 877083 858730 839449
55840 839449 819910 802521 786745 770404 754343 740999 729366 716229 701573 688131 676387
55829 676387 664705 653617 645153 638364 630245 620844 612842 606259 598189 587891 577720 568655 559169
55816 559169 549059 540386 533858 527778 521231 515190 510049 505042 500370 497092 494868 492575 490962 491862
55802 491862 495118 499187 504197 511271 519301 525783 530507 535039 538883 539738 537542 534630 531638 526651
55788 526651 518831 509688 500311 490538 481411 475321 472746 471234 468218 462640 453788 441336 427013 413777
55774D13777j0895r030o582k263K478N770Q208J0632J1265Q095K258l501q082
55761D22130j1524j3245j3260j3190j3926j4031j2401j0377r319q382o724n428
55749B90323n185m487k409p36j013j921j855j675k499l175k505j628j753j804
55735B57678p74p5r51j903j296l38p70j817k123k541m172n691n518m707m897n268
55719B14837m320k870k402k191q60Q05J381J555K648L955M223M226N229O319N896
55704B38431M341K753O61k387m771n047m621n456o676o377n237n196n879n451
55690A89088l982k975k495j595o88p47r70N4J716K563L122M840P032P658O568
55675B09189N382M619L439J772M01o33j704k331k081j865k374k475j205n6p85
$$ plain form
55774 413777 402882 393852 387270 385007 387485 393255 401463 412095 423360 431455 433713 430212 422130
55761 422130 410606 397361 384101 370911 356985 342954 330553 320176 310857 302475 295751 290323
55749 290323 285138 280651 278242 277506 276493 274572 272717 271042 268543 265368 262863 261235 259482 257678
55735 257678 256904 256829 255878 253975 252679 252341 251571 249754 247631 245090 240918 235227 229709 225002 220105 214837
55719 214837 210517 207647 205245 203054 202194 202999 204380 205935 208583 212538 216761 220987 226216 232535 238431
55704 238431 242772 245525 246186 243799 239028 233981 229360 223904 217228 210851 205614 200418 194539 189088
55690 189088 185106 182131 179636 178041 177353 176606 175636 175690 177406 179969 183091 187931 194963 202621 209189
55675 209189 214571 219190 222629 224401 224802 224169 222465 220134 218053 216188 213814 211339 210134 210078 209293
55660B09293k254k150p29m2l02L9J227K011K155K529K992K637J801J516J320m4
55644B21999k164l498l925m510n171m919m056l847m312m475m447n040n689n036
55630A60910l334k062j445m99P26J110N52K0k84r21j639j671j306j331j430r11
55614A46485m32j000j916j841j265j651k715k924k213j827j923j600j017j083
55600A23078j367p53J99kr90j070k94l29j293j483m55K77L0j37K96M73J66K64
55582A16610P65N56k91k72Q41J338M13l90L67K066L453M386N201N753N977O194
55566A52967O244N486M022K696J683L92j072j896k224l155m736n577n010m072
55552A45748l838m055m083l864l463k716j834j343j216r30m59k08q3L06P11O91
$$ plain form
55660 209293 207039 204889 204160 204118 203816 203855 205082 207093 209248 211777 214769 217406 219207 220723 222043 221999
55644 221999 219835 216337 212412 207902 202731 197812 193756 189909 185597 181122 176675 171635 165946 160910
55630 160910 157576 155514 154069 153570 154296 155406 155958 155978 155694 154773 153134 151463 150157 148826 147396 146485
55614 146485 146053 145053 143137 141296 140031 138380 135665 132741 130528 128701 126778 125178 124161 123078
55600 123078 121711 120958 121157 121155 120165 119095 118801 118472 117179 115696 115241 115518 115548 115411 115707 116180 116346 116610
55582 116610 117375 117931 117640 117368 118209 119547 119960 119570 119937 122003 125456 129842 135043 140796 146773 152967
55566 152967 159211 164697 168719 171415 173098 173490 172418 170522 168298 165143 160407 154830 149820 145748
55552 145748 141910 137855 133772 129908 126445 123729 121895 120552 119336 118406 117947 117739 117656 117962 118673 119364
55536A19364O59J206J747J341N18N70J290J248J71p96j183j655k281k229j470
55521A18500j076j469j936k134k452k729k254j201n50m32j85M2n11j390j283l79
55505I8561k74j283j882j326p51r96j290r26m74m66m31l0L07M89J038J719J472
55488I3457K79m71r0M83M63L11L51q2j232k082j878j227r39q77o16j43N77J624
55470H7908K382J960O53l29o50r74j268p80J04pj111j516n69L89M91O00J199J171
55452H9653p2j194j126q12j248j519m91R26J151M23J89P33J117R59P29N76J57
55435I0151n54j126j237q31k4P65J028Q13N75L76J7j21M63J074M77r53j409l21
55417H9163Q38R88R20J405J678R73Ql60n86j283j850j608j145j199j215l92P51
$$ plain form
55536 119364 120023 121229 122976 124317 124835 125405 126695 127943 128114 127318 126135 124480 122199 119970 118500
55521 118500 117424 115955 114019 111885 109433 106704 104450 103249 102699 102267 102082 102124 101613 100223 98940 98561
55505 98561 98287 97004 95122 93796 93045 92049 90759 89833 89359 88893 88462 88432 88739 89228 90266 91985 93457
55488 93457 93736 93265 93175 93658 94121 94432 94783 94701 93469 91387 89509 88282 87343 86466 85850 85707 86284 87908
55470 87908 90290 92250 92903 92574 91924 90950 89682 88902 89006 88999 87888 86372 85803 86192 86683 87283 88482 89653
55452 89653 89581 88387 87261 86449 85201 83682 83191 84117 85268 85691 85880 86613 87730 88689 89418 89994 90151
55435 90151 89597 88471 87234 86403 86379 87144 88172 88985 89560 89936 89953 89832 90295 91369 91846 90893 89484 89163
55417 89163 90001 90989 91909 93314 94992 95965 95973 95613 95027 93744 91894 90286 89141 87942 86727 86335 87086
55400H7086J094N12l72j248j876j638m97L87M8r00j281r90o34l53l5ql81l66O94
55381G9242K089K504J655M00l79l49K56O70K24o23o81K35R53P92N33Q44J057M52
55363H9874m38q20q97j101j038m23j8m88j115q66%N69P14P67M60m49j089l79J256
55344H4519K235J762N00n26q88p41m91m18l86j65n8m79r20l71J013J825J356M25
55326H8192j64o22j071r21j62K09j06n5P64J066R2q05k73Q04Q91K99K80O69M36
55307H9523k44m23k85p63j627j723r11k26k01l84l69j70K24O95P57L04O6M54P56
55288H5453M00N1K87L44n15j413j213m56k49k31M98J320J061L42O69J688J584
55271H9620J21r78p76j53J02K52L44j48r63j044l28P3j69p7P66J468J460J327
$$ plain form
55400 87086 88180 88692 88320 87072 85196 83558 83061 83448 83496 82596 81315 80325 79691 79338 79303 79295 78914 78548 79242
55381 79242 81331 83835 85490 85890 85511 85162 85418 86088 86312 85689 85008 85243 86196 86988 87521 88365 89422 89874
55363 89874 89436 88616 87719 86618 85580 85157 85139 84651 83536 82670 82670 83239 83953 84720 85180 84731 83642 83263 84519
55344 84519 86754 88516 89016 88490 87602 86861 86370 85952 85566 85401 85343 84864 83944 83573 84586 86411 87767 88192
55326 88192 88028 87406 86335 85414 85252 85461 85355 85300 86064 87130 87222 86417 86144 86948 87839 88138 88418 89087 89523
55307 89523 89279 88856 88571 87808 86181 84458 83547 83321 83120 82736 82367 82197 82421 83116 83873 84177 84243 84697 85453
55288 85453 85853 85904 86191 86535 86020 84607 83394 82938 82689 82458 82956 84276 85337 85679 86348 88036 89620
55271 89620 89741 88763 87987 87834 87936 88188 88532 88384 87421 86377 86049 86122 85953 85876 86642 88110 89570 90897
55253I0897J420J069n7j090j241q77o33m00J47Q46J421J837J928J372L41n44j076
55236I5360j459j505p71L19O30j24j004j266j146r76n71N3L90K85K49M96N18O6
55218H9544k80MO05R06P45L25p8j29K55N50J66n87q67n86n17j001j507j559j289
55199H4700q08j0Q01R62M72J22L01M91K65k4M8L01M38N34O69O36L42J8j69k83
55179H9806l14k01j67l99n23j03L91J25o68q35n3O77O01K29K70N13M93M15P10
55160I0967J181J252P59K1n56o79l55l2j68n06k91O35J506J580Q69j62j012j201
55142I3808n53L03M17k59p96n99j80l04r67j585j670j048N6R54J008M94M03J113
55124I0595J812J615O77j68n26p16j149j757k007j462l67M74O46O42J077J715
$$ plain form
55253 90897 92317 93386 93329 92239 90998 90121 89488 89088 89235 90081 91502 93339 95267 96639 96980 96436 95360
55236 95360 93901 92396 91625 91944 92574 92450 91446 90180 89034 88058 87487 87540 87930 88215 88464 88960 89478 89544
55218 89544 89264 89268 89873 90779 91524 91849 91771 91642 91897 92447 92613 92026 91159 90573 90056 89055 87548 85989 84700
55199 84700 83892 83882 84683 85645 86117 86239 86540 87031 87296 87272 87320 87621 88059 88593 89262 89898 90240 90258 90089 89806
55179 89806 89492 89291 89124 88725 88202 88099 88490 88615 87947 87112 87059 87736 88337 88566 88836 89349 89842 90257 90967
55160 90967 92148 93400 94159 94180 93624 92945 92590 92558 92390 91884 91593 92228 93734 95314 96183 96021 95009 93808
55142 93808 93255 93558 93975 93716 92920 92321 92141 91837 90870 89285 87615 86567 86623 87577 88585 89079 89482 90595
55124 90595 92407 94022 94699 94531 94005 93289 92140 90383 88376 86914 86547 87021 87667 88309 89386 91101
55108I1101J824J313Q05P67J118J555J684J099j4o28k6J104J536J151P48N33O3
55091A05733n17m99pl9q22j308o92N94J732K340K168J044m07j047o22j2K03L44
55073A08186N88N03J31K21Q04P55l85j376j005J25N76N8o22r17q63n67k36k54
55055A05722n98o87m09n24j295j640o12R41J391M60o94j187j081o83k01O6K1J18
55037I9108N99P52j06j241j229K1J169J366J152J184J198Q24L86K04k01j350k603
55020A01233k637j069R76K105J986J288O65K08j81l69j44L53O78N74K08j16l16
55003A05442n10p72r64q22k32N81J223J517J525J201M10n75j004n08L82R03R25
54986A08722P11K82l35o62l98j85p90j715j635l14J031J435J223J018P08M0n52
$$ plain form
55108 91101 92925 94238 95043 95810 96928 98483 100167 101266 101252 100624 100598 101702 103238 104389 105137 105670 105733
55091 105733 105216 104717 104710 104671 103849 102541 101849 102443 104175 106515 108683 109727 109320 108273 107651 107639 107842 108186
55073 108186 108774 109277 109408 109629 110433 111188 110803 109427 108422 108547 109123 109181 108559 107642 106779 106212 105976 105722
55055 105722 105124 104437 104028 103504 102209 100569 99957 100898 102289 102749 102055 100868 99787 99104 98903 98969 98990 99108
55037 99108 99707 100459 100353 99112 97883 97904 99073 100439 101591 102775 103973 104797 105183 105387 105186 103836 101233
55020 101233 98596 97527 98503 100608 102594 103882 104547 104755 104574 104205 104061 104414 105092 105666 105874 105758 105442
55003 105442 104932 104160 103196 102374 102142 102723 103946 105463 106988 108189 108599 108024 107020 106512 106894 107797 108722
54986 108722 109433 109715 109380 108718 108320 108135 107345 105630 103995 103681 104712 106147 107370 108388 109096 109136 108584
54969A08584n06l1J91m8l49k82K20Q44J090P19R9j90o7J17K33M11M99K04k10j28
54949A11400M02O28L03M1J96K12l80j128j336j014n89k42O0K71M68Q87J429J584
54931A13192J176O33L43K70L77Q49J515J822J695J772K346K832K803K858L785
54916A38268N312O346O175M981L492K399J771Q65j044l505n176n429m929m488
54902A45038m155l815l672l677l299k443j788j684j543r22l73m82q43p68l05J81
54886A15450P33J370J608J261J021J450K056K182K151K557L177L552M020N061
54872A47649O132O307N636M771L647J800l68j902k768l790n130o024o054n611
54858A44295m891l535j652l00l84j577k737l030k457j643j238j331j498j498j647
$$ plain form
54969 108584 108078 108047 108238 108190 107841 107559 107779 108623 109713 110432 110531 110341 110274 110391 110624 111035 111534 111738 111528 111400
54949 111400 111802 112430 112733 112774 112970 113182 112802 111674 110338 109324 108735 108493 108553 108824 109292 110179 111608 113192
54931 113192 114368 115001 115344 115614 115991 116840 118355 120177 121872 123644 125990 128822 131625 134483 138268
54916 138268 143580 149926 156101 161082 164574 166973 168744 169609 168565 165060 159884 154455 149526 145038
54902 145038 140883 137068 133396 129719 126420 123977 122189 120505 118962 118040 117667 117185 116342 115574 115269 115450
54886 115450 116183 117553 119161 120422 121443 122893 124949 127131 129282 131839 135016 138568 142588 147649
54872 147649 153781 160088 165724 170495 174142 175942 175574 173672 170904 167114 161984 155960 149906 144295
54858 144295 139404 135869 134217 133917 133533 131956 129219 126189 123732 122089 120851 119520 118022 116524 114877
54843A14877k175k635k433j644q22k66k1j53m89m14L91J262J312N57k72p64r69
54826A05342q40l27J77K27L1M1J15j90o90p53k85K22N11P23Q25O69N29Q27J311
54807A08465J295O53k5l59n47p87r15p59l45K31P57Q87N60K70M00O43N98N64J010
54788A12596J604J571Q24%m98p16o61k89J24L54O93J327J657J133M17N98J483
54771A22217J869J428J105J569K461L366M367N384N972O176O581P149O955N551
54757A82150L730K430J626O84p99k905n397p494q288p764o832o094n288m151l028
54742A32580k213j465o44j53k53n57o75p66r51q06L0J101J548J065J01n53k99
54725A27090Q02J914K232K019K316L494M782N410N463N222M509L238J956J134
$$ plain form
54843 114877 112702 110067 107634 105990 105168 104902 104881 104728 104239 103825 104216 105478 106790 107347 107075 106311 105342
54826 105342 104502 104175 104352 104579 104610 104651 104766 104576 103886 103133 102848 103070 103581 104304 105129 105798 106327 107154 108465
54807 108465 109760 110413 110388 110029 109482 108695 107780 107021 106676 106907 107664 108551 109111 109381 109781 110424 111022 111586 112596
54788 112596 114200 115771 116595 116595 116097 115381 114720 114431 114555 114909 115602 116929 118586 119719 120136 120734 122217
54771 122217 124086 125514 126619 128188 130649 134015 138382 143766 149738 155914 162495 169644 176599 182150
54757 182150 185880 188310 189936 190620 189821 186916 181519 174025 165737 157973 151141 145047 139759 135608 132580
54742 132580 130367 128902 128258 128105 127852 127295 126620 125854 124903 124097 124127 125228 126776 127841 127942 127389 127090
54725 127090 127892 129806 132038 134057 136373 139867 144649 150059 155522 160744 165253 168491 170447 171581
54711A71581L83r33k600l737l988l898m116m589m699m049l020k397k420k440j839
54696A27239r45n00n41n60n27q42j266r96k4N87K09n14q37r67j306j495j093n78
54678A15044p29j370j604j113m66k35l68m22o6O15J072Q12J45o4M02P56M22m8
54660A12783P3M22J24o96j017m12M41Q56R77J201J427J264P11J82RJ36K75K47
54642A19003J16Rp6j41k6L62O72L88l74q34n44l8q8p19j339j563j371p09M00J404
54622A14532J547P95Jj30J62K22K9J50P06R52K01j104j746j131O9Q39R21P57O41
54603A18413M46j4p39j604k233j998o02J250K323K081J169N08L97N45N94L90J0
54586A20936k36l0N54J076J155P64J32l83m22J5L72Q0o83j162r90n50l35m03n69
$$ plain form
54711 171581 171964 171031 168431 164694 160706 156808 152692 148103 143404 139355 136335 133938 131518 129078 127239
54696 127239 126294 125794 125253 124693 124166 123324 122058 121062 121038 121625 121834 121320 120483 119516 118210 116715 115622 115044
54678 115044 114315 112945 111341 110228 109762 109527 109159 108737 108671 109286 110358 111170 111315 111251 111653 112409 112831 112783
54660 112783 112856 113278 113402 112706 111689 111277 111718 112574 113551 114752 116179 117443 118154 118336 118345 118481 118756 119003
54642 119003 119119 119128 119052 118911 118885 119247 119919 120307 119933 119099 118555 118517 118429 117710 116371 114808 113437 112728 113128 114532
54622 114532 116079 116874 116875 116745 116907 117129 117158 117308 118014 118966 119167 118063 116317 115186 115255 116094 117015 117772 118413
54603 118413 118859 118845 118106 116502 114269 112271 111669 112919 115242 117323 118492 119000 119397 119942 120536 120926 120936
54586 120936 120700 120670 121224 122300 123455 124219 124351 123968 123546 123561 123933 124013 123330 122168 121178 120628 120293 119890 119321
54567A19321p42q69q03m63P6O62J095J217J139J209J394J027k27j498j554m73
54551A20511M27L63n8m6K47K54ko4K15O00R17J153J309J365J233P69Q2k75J23
54532A29123Q29R53L50k68m20m00n21o39o18o49p48o46m17n40j001j060l47N06
54514A23487P72N26K25K1k5K58P12P63K63k01k57k39k84J27R84J073m15k330k762
54495A22698j433K42J149J376J270P91P1l15l0N94J018R86N25j14n01l90l3J68
54477A28072J78J94K16J60J67L69N39M46K83L30M32L42L61R28J802K179J675O85
54459A39358j37l84q0K76P8o41j100p69j15J64R3Qk78j010j600j268l69nl26l90
54439A31505K09P35O66N54R42J351J055K70k47l14l15l36o5N28J023J100Q61N11
$$ plain form
54567 119321 118579 117710 116907 116444 116520 117182 118277 119494 120633 121842 123236 124263 124036 122538 120984 120511
54551 120511 120938 121301 121243 121197 121444 121698 121696 121632 121847 122447 123364 124517 125826 127191 128424 129193 129275 129000 129123
54532 129123 129952 130905 131255 130987 130567 130167 129646 129007 128389 127740 126992 126346 125929 125389 124388 123328 122981 123487
54514 123487 124259 124785 125010 125031 125006 125264 125976 126739 127002 126801 126544 126305 126021 126148 127132 128205 127790 125460 122698
54495 122698 121265 121507 122656 124032 125302 126093 126164 125849 125819 126413 127431 128417 128942 128828 128327 127937 127904 128072
54477 128072 128250 128444 128660 128820 128987 129356 129895 130341 130624 130954 131386 131728 132089 133017 134819 136998 138673 139358
54459 139358 139221 138837 138757 139033 139111 138470 137370 136601 136486 136650 136743 136751 136473 135463 133863 132595 132226 132221 131895 131505
54439 131505 131714 132449 133115 133669 134611 135962 137017 137287 137040 136726 136411 136075 136010 136538 137561 138661 139522 140033
54421A40033O8m24o67l63L22Q12P32L17Qj91o07j143j177m88K18J29n64q84k72
54402A35859Q40J588J457N87l56o15l3P92J220J227J058N64m88j570j640l98J254
54385A41346K202K149J446M57n19j043p92r1K86j00q10r88k51Q86J541J264L58
54368A47341m13l20Q91K701M035M152L343K474K014J932K320L305M290M136K592
54353A84793P71k76p80j472k279k648k707l092l835m247l924l162k375j759j523
54338A51485j805k213k022j039J49Q63R60P39N31M03J86k38n49k74L99N91j40
54321A48026j075j272p59k27L4J17j30q76j581j455o18k9j51m61m01j12J6r8k90
54302A38658m32m91n81q83j223j023j32O81P30M75P10J145Q62L6k05L21M74k42
$$ plain form
54421 140033 140101 139677 139010 138647 138969 139781 140513 140830 140838 140647 140040 138897 137720 137232 137450 137579 137015 136131 135859
54402 135859 136699 138287 139744 140331 139975 139360 139327 140119 141339 142566 143624 144188 143700 142130 140490 140092 141346
54385 141346 143548 145697 147143 147600 147081 146038 145246 145155 145441 145341 144531 143543 143292 144178 145719 146983 147341
54368 147341 146928 146608 147499 150200 154235 158387 161730 164204 166218 168150 170470 173775 178065 182201 184793
54353 184793 185564 185288 184508 183036 180757 178109 175402 172310 168475 164228 160304 157142 154767 153008 151485
54338 151485 149680 147467 145445 144406 144555 145418 146378 147117 147648 148051 148237 147999 147450 147176 147575 148166 148026
54321 148026 146951 145679 144920 144693 144727 144844 144714 143838 142257 140802 140184 140155 140004 139543 139142 139030 139046 138948 138658
54302 138658 138226 137735 137154 136271 135048 134025 133893 134574 135304 135779 136489 137634 138496 138532 138327 138648 139122 138880
54284A38880o96J00J349J643R87N59Q94J357J317R18N46K33j92o47q38o24k57
54267A45529j24k46j60M32J082J076M35k7K82J116J875K254K259J961J463R15
54251A60122L59j66m94n35n60q39j171j227j217j556j988j796r34j52J53L59O79
54234A49037O62Q9m89n94n26o33n31K22J199J636J524J399J291P09m21j385j477
54217A51712p33J74N62K72k30l87k26k47n67o58k85j26q87k055k279j009P95J750
54199A45576J427N03j84l80l20k15l7J89J79k53q43j148j096r20o22J7Q67J407
54181A44147J406J219J226J378J506J629J706J461P69n1o33j003j361j639j610
54166A50150j201n34J98O66N56m3n46m78mK88L6n97j072q82KR54J231P13n7o08
$$ plain form
54284 138880 138184 138284 139633 141276 142263 142822 143716 145073 146390 147308 147854 148087 147895 147248 146410 145786 145529
54267 145529 145405 145159 144999 145431 146513 147589 148024 147997 148279 149395 151270 153524 155783 157744 159207 160122
54251 160122 160481 160315 159821 159286 158726 157887 156716 155489 154272 152716 150728 148932 147998 147846 147999 148358 149037
54234 149037 149699 149788 149299 148705 148179 147546 147015 147237 148436 150072 151596 152995 154286 154995 154574 153189 151712
54217 151712 150979 151153 151715 151987 151757 151370 151144 150897 150330 149672 149387 149261 148374 146319 144040 143031 143826 145576
54199 145576 147003 147506 147322 146942 146622 146407 146370 146559 146738 146485 145642 144494 143398 142478 141856 141873 142740 144147
54181 144147 145553 146772 147998 149376 150882 152511 154217 155678 156447 156396 155763 154760 153399 151760 150150
54166 150150 148949 148415 148613 149279 149835 149792 149246 148768 148764 149052 149088 148491 147419 146537 146539 147493 148724 149437 149380 148772
54146A48772q91r15n03L32J118J306Q36J60j74K7M02L70j17l31K77J238J630J306
54128A54843Q32M08j97p53o50q5j16j077j949j802r44o3P99J707K139J863J705
54111A56660K326K840J935L6r90k95R67J356Q34K76J37K23L48O22J137J625J626
54094A71663J069O34J158K517L544L388K525J917J589P89o48j968k580k762k977
54079A79858l155k947k389j846j445q70J87J453K121J631M34l29JJ018J899K278
54063A77899K213J733R04J32q9K95Q75J177R52L28q8L89J630K570K371J422P15
54046A95428N78O00O03Q68J442J882J920J937K507L740N236O427O923O726O206
54031B43023N750N482N314N186N031M707M132L413K696K053J613J534J681J652
$$ plain form
54146 148772 147881 146966 146463 146795 147913 149219 150055 150215 150041 150068 150470 150840 150723 150392 150669 151907 153537 154843
54128 154843 155675 156083 155886 155133 154483 154398 154282 153205 151256 149454 148510 148447 149246 150953 153092 154955 156660
54111 156660 158986 161826 163761 163797 162807 162512 163479 164835 165669 165945 166082 166305 166653 167275 168412 170037 171663
54094 171663 172732 173366 174524 177041 180585 183973 186498 188415 190004 190793 190145 188177 185597 182835 179858
54079 179858 176703 173756 171367 169521 168076 167206 167393 168846 170967 172598 173032 172703 172704 173722 175621 177899
54063 177899 180112 181845 182749 182881 182792 183087 183962 185139 186091 186419 186331 186720 188350 190920 193291 194713 195428
54046 195428 196006 196606 197209 198077 199519 201401 203321 205258 207765 211505 216741 223168 230091 236817 243023
54031 243023 248773 254255 259569 264755 269786 274493 278625 282038 284734 286787 288400 289934 291615 293267
54017B93267J280P93K28p84k321l738m373m409m496m853n240n550n883o125n962
54002B41834n247m124k949k257k397k920k843j882r26p70j098j244j331j695j917
53987B08234j503j063j527k520k785k108j492j355j026k46K07q1m10k71k30o86
53971A91138q83j38Q31R37M39M30J043J370J043O94P60Q29N82N89J585L377M941
53954B09567N530N395N451O342P879R384J0549J1646J2747J3005J1188P037J778
53941C17498k830n713o806o448m983k870q78K95N41L82L71N48N58J90k98l48M18
53924B89627J781L032L592L573L538L823M345N045N970O855P122O711O406O931
53910C58351Q014Q805Q860Q174O597M013J010j293k320k482k511k704k944l047
$$ plain form
54017 293267 294547 295340 295568 294784 292463 288725 284352 279943 275447 270594 265354 259804 253921 247796 241834
54002 241834 236587 232463 229514 227257 224860 221940 219097 217215 216289 215519 214421 213177 211846 210151 208234
53987 208234 206731 205668 204141 201621 198836 196728 195236 193881 192855 192609 192816 192735 192325 192054 191824 191138
53971 191138 190255 190117 190948 191885 192324 192754 193797 195167 196210 196904 197664 198493 199075 199664 201249 204626 209567
53954 209567 215097 220492 225943 232285 240164 249548 260097 271743 284490 297495 308683 315720 317498
53941 317498 314668 308955 302149 295701 290718 287848 286970 287265 287806 288188 288559 289107 289665 289855 289557 289209 289627
53924 289627 291408 294440 298032 301605 305143 308966 313311 318356 324326 331181 338303 345014 351420 358351
53910 358351 366365 375170 384030 392204 398801 402814 403824 402531 400211 397729 395218 392514 389570 386523
53896C86523k996k979l284m005m964n940o763p107o722o100o276p467q510q323
53882C05087p328o570o067n110l843l193l304l327k888k590k851l330l783m374
53868B46529m778m217k845j946k124k434k069j705k209k992k915k110j621j764
53854B10800j993k076k222k220j622p30l45m86l27M11R99Q60M00K56L43J66l77
53837B01837r31j192j171j031q58o21l15j44l08o02n05Q3N89N75M08O69J257J613
53819A99353J596J502J453J372J407J677J752J176L97L50J120J866K225K790L880
53804B23916M834N040M878M950N130N076N076N432N542M669L367K962L591L872
53790B88335K864J294L81K74M06O65J222J649J231J26p36j078j677l034m434m934
$$ plain form
53896 386523 383527 380548 377264 373259 368295 362355 355592 348485 341763 335663 329387 321920 313410 305087
53882 305087 297759 291189 285122 280012 276169 272976 269672 266345 263457 260867 258016 254686 250903 246529
53868 246529 241751 237534 234689 232743 230619 228185 226116 224411 222202 219210 216295 214185 212564 210800
53854 210800 208807 206731 204509 202289 200667 199937 199592 199106 198779 199190 200189 201049 201449 201705 202048 202214 201837
53837 201837 200906 199714 198543 197512 196654 196033 195718 195574 195266 194664 194159 194242 194831 195406 195814 196483 197740 199353
53819 199353 200949 202451 203904 205276 206683 208360 210112 211288 211685 212035 213155 215021 217246 220036 223916
53804 223916 228750 233790 238668 243618 248748 253824 258900 264332 269874 274543 277910 280872 284463 288335
53790 288335 291199 292493 292874 293148 293554 294219 295441 297090 298321 298447 297711 296633 294956 291922 287488 282554
53774B82554m693m561m755m765m366l978l834l626l147k740k725k841k708k428
53760B31387k364k482k464k216j955j874k056k555l205l436k785j581o73m97p86
53745B00458j161j457j349l87J098J798Q31q67j482n34O24P10N0k40J07M99O64
53728A99362Q93J225J218P21J51j71l64l91J52J255K099K078J724J930K595K842
53712B17319K434K079K274K554K268J522R66R66J271J387J106P24P82J429K218
53697B41299K649K790L004L246L215K981K920K941K515J591Q34O51O23K94j32
53682B71421l60p24j551k218j684J3J526J643N27p10j206r60m74j76k00m61q16
53665B63590j123j220j040p15m36j77K73R01J275R89J99m34l71K52P53N81m8k95
$$ plain form
53774 282554 277861 273300 268545 263780 259414 255436 251602 247976 244829 242089 239364 236523 233815 231387
53760 231387 229023 226541 224077 221861 219906 218032 215976 213421 210216 206780 203995 202414 201741 201244 200458
53745 200458 199297 197840 196491 196104 197202 199000 199831 198964 197482 196948 197572 198282 198332 198092 198199 198698 199362
53728 199362 200255 201480 202698 203419 203570 203399 203035 202644 202796 204051 206150 208228 209952 211882 214477 217319
53712 217319 219753 221832 224106 226660 228928 230450 231416 232382 233653 235040 236146 236870 237652 239081 241299
53697 241299 243948 246738 249742 252988 256203 259184 262104 265045 267560 269151 269985 270636 271259 271553 271421
53682 271421 271061 270337 268786 266568 264884 264897 266423 268066 268593 267883 266677 265717 265243 265067 264867 264406 263590
53665 263590 262467 261247 260207 259492 259056 258879 259152 260053 261328 262317 262516 262082 261711 261963 262716 263297 263249 262954
53647B62954L81J534K157J778Q74J56j91l98n38l66K79J147J743J812J590J461
53631B76373J424J138N89L08O56J244J525J700K391L553M366M306L722L198K927
53616C09420K904L130L373L272K973L119L885M562M524M049L704L389K685J793
53602C56782J380J635K121K510K890L212L025K050P40k4K01R52J282P24j74m97
53586C78809k5N45N56J22k73n39r90j723k388k552k186j731j740k303k863k845
53570C57874k328j795j351p49j20lm39p27l72L07Q31J169J325R84J57m94n24m15
53552C53330o77q50k44P59J112O50K19L26N04K66q4Q4R22K027K853L129L035L042
53534C70403L386L876M341M944N698O153O115O234P177Q478R115R024R115R776
$$ plain form
53647 262954 263335 264869 267026 268804 269678 269834 269643 269245 268707 268341 268620 269767 271510 273322 274912 276373
53631 276373 277797 278935 279524 279832 280488 281732 283257 284957 287348 290901 295267 299573 303295 306493 309420
53616 309420 312324 315454 318827 322099 325072 328191 332076 336638 341162 345211 348915 352304 354989 356782
53602 356782 358162 359797 361918 364428 367318 370530 373555 375605 376345 376321 376522 377474 378756 379480 379306 378809
53586 378809 378784 379329 379885 380007 379734 379195 378205 376482 374094 371542 369356 367625 365885 363582 360719 357874
53570 357874 355546 353751 352400 351651 351531 351528 351089 350362 349990 350297 351128 352297 353622 354606 354763 354269 353745 353330
53552 353330 352653 351803 351559 352318 353430 354080 354299 354625 355129 355395 355311 355395 356317 358344 361197 364326 367361 370403
53534 370403 373789 377665 382006 386950 392648 398801 404916 411150 418327 426805 435920 444944 454059 463835
53520D63835J0300J0111R712R918J0757J1673J2403J3160J4104J5061J5818J6465
53508F13317J7320J8468J9478J9828J9664J9705K0210K0521K0001J8943J8047
53497H25502J7434J6881J6528J6554J6450J5588J4334J3667J3736J3809J3636
53486I94119J3812J4569J5248J5329J5140J5191J5625J6518J7763J8369J7047
53475A168730J4072J1489J0555J0078Q280N421L157J863J62k830o169q408r312
53462A207088r659j0008j0204r860q978q153q202r364j0967j2174j2956j3900
53450A082663j5117j5953j5941j5501j5344j5588j5807j5708j5253j4327j2765
53439I15359j0734q708o862m984l159k148k553l814m640m405l498k287n93J457
$$ plain form
53520 463835 474135 484246 493958 503876 514633 526306 538709 551869 565973 581034 596852 613317
53508 613317 630637 649105 668583 688411 708075 727780 747990 768511 788512 807455 825502
53497 825502 842936 859817 876345 892899 909349 924937 939271 952938 966674 980483 994119
53486 994119 1007931 1022500 1037748 1053077 1068217 1083408 1099033 1115551 1133314 1151683 1168730
53475 1168730 1182802 1194291 1204846 1214924 1223204 1228625 1231782 1233645 1233807 1230977 1224808 1216400 1207088
53462 1207088 1197429 1187421 1177217 1167357 1158379 1150226 1142024 1132660 1121693 1109519 1096563 1082663
53450 1082663 1067546 1051593 1035652 1020151 1004807 989219 973412 957704 942451 928124 915359
53439 915359 904625 895917 889055 884071 880912 878764 876211 872397 867757 863352 859854 857567 856974 858431
53425H58431K874K944K399K646M067N916P610R152J0349J0793J0860J1705J3741
53412I53487J5977J7375J8165J9163K0539K1993K3532K5228K6597K7162K7446
53401A196664K8542L0666L2913L4514L5633L6745L7927L9121M0495M2082M3363
53390A598665M3758M3448M3327M3985M4983M5292M4358M2553M0649L9060L7757
53379B067835L6619L5483L3919L1412K7948K4063K0258J6566J2827Q980M953O08
53367B321471l892q155j2249j6841k2143k7140l0599l2641l4485l6572l7848l7335
53355B021571l5739l4780l5116l5644l4876l2580k9828k7794k6930k7074k7926
53344A673284k9209l0654l2027l3093l3428l2544l0464k7953k5896k4457k3166
$$ plain form
53425 858431 861305 864249 866648 869294 873361 879277 886887 896039 906388 917181 928041 939746 953487
53412 953487 969464 986839 1005004 1024167 1044706 1066699 1090231 1115459 1142056 1169218 1196664
53401 1196664 1225206 1255872 1288785 1323299 1358932 1395677 1433604 1472725 1513220 1555302 1598665
53390 1598665 1642423 1685871 1729198 1773183 1818166 1863458 1907816 1950369 1991018 2030078 2067835
53379 2067835 2104454 2139937 2173856 2205268 2233216 2257279 2277537 2294103 2306930 2315910 2320863 2321471
53367 2321471 2317579 2309424 2297175 2280334 2258191 2231051 2200452 2167811 2133326 2096754 2058906 2021571
53355 2021571 1985832 1951052 1915936 1880292 1845416 1812836 1783008 1755214 1728284 1701210 1673284
53344 1673284 1644075 1613421 1581394 1548301 1514873 1482329 1451865 1423912 1398016 1373559 1350393
53333A350393k1655j9977j8269j6569j5058j4028j3519j3333j3504j4356j5861
53322A174264j7389j8313j8534j8173j7198j5671j4007j2631j1606j0890j0470
53311A009382r954q524n942l243j721j390j117j82J035K032L041M537O433Q232
53297A002619R705J0988J2221J3446J4812J6476J8262J9683K0419K0678K0924
53286A180233K1292K1371K0611J8905J6729J4701J3075J1669J0161Q409O491M570
53274A348217K760J077n45k304m460p022r467j1094j1897j2740j4358j6409j7934
53261A243824j8600j8896j9213j9393j9344j9370j9671j9973k0049k0024j9871
53250A029420j9170j7866j6768j6574j6862j6767j6474j7068j8838k0578k0963
$$ plain form
53333 1350393 1328738 1308761 1290492 1273923 1258865 1244837 1231318 1217985 1204481 1190125 1174264
53322 1174264 1156875 1138562 1120028 1101855 1084657 1068986 1054979 1042348 1030742 1019852 1009382
53311 1009382 999428 990904 984962 981719 979998 978608 977491 977309 978344 980376 983417 987954 994387 1002619
53297 1002619 1012324 1023312 1035533 1048979 1063791 1080267 1098529 1118212 1138631 1159309 1180233
53286 1180233 1201525 1222896 1243507 1262412 1279141 1293842 1306917 1318586 1328747 1337156 1343647 1348217
53274 1348217 1350977 1352054 1351509 1349205 1344745 1337723 1328256 1317162 1305265 1292525 1278167 1261758 1243824
53261 1243824 1225224 1206328 1187115 1167722 1148378 1129008 1109337 1089364 1069315 1049291 1029420
53250 1029420 1010250 992384 975616 959042 942180 925413 908939 891871 873033 852455 831492
53239H31492k0087j9166j8960j8956j8127j6225j4099j2718j2058j1312j0114
53228F59670r026q560q368p865p308p453q344r186r559r997j1112j2694j4010
53215E36188j4628j4629j4242j3687j3100j2385j1242r561p727o337n699n677
53203D07274n886n977n872n777n859n961n812n558n654o191o703o859o923p129
53189C21113p060o188m834l904l700l583l004k277j989k117k195k086k020k108
53175B74048k281k601l078l263k672j640j098j286j411r07l51m77r75j059p56
53160B50193o81p66l04O38R80R0j304k158k287k040j512p64l22o57j379j593j021
53143B35113k58O3j07l73l61l6K36O9l92m98K1N62M32j15j63O24J533J733J294
$$ plain form
53239 831492 811405 792239 773279 754323 736196 719971 705872 693154 681096 669784 659670
53228 659670 650644 642084 633716 625851 618543 611090 602746 593560 584001 574004 562892 550198 536188
53215 536188 521560 506931 492689 479002 465902 453517 442275 432714 424987 418650 412951 407274
53203 407274 401388 395411 389539 383762 377903 371942 366130 360572 354918 348727 342024 335165 328242 321113
53189 321113 314053 307865 303031 299127 295427 291844 288840 286563 284574 282457 280262 278176 276156 274048
53175 274048 271767 269166 266088 262825 260153 258513 257415 256129 254718 253811 253460 252983 252008 250949 250193
53160 250193 249512 248746 248442 249080 250060 250150 248846 246688 244401 242361 240849 240085 239763 239106 237727 236134 235113
53143 235113 234855 234918 234811 234438 234077 234041 234277 234346 233954 233456 233477 234039 234471 234356 234193 234817 236350 238083 239377
53124B39377R94J314J851J863J245P04Q60J466J889K063K334K531K063R99J91
53109B61744j4l07j132j740j326l97p2n39j122j494j815j896j378o44n53j148
53093B46167j558j328r46q30o96l20j23m70r69j059q55q68j116j053l20O94J105
53076B35455M50o81j107m03N18N73j58q33j214j681k062j591k98O39M20l10n23
53059B27194j98N4M1n5l45r96j553j267j08J119J656J426Q45M15M46P95R11M15
53041B30795l63p00k98M85J078J154P35R0m12n57l93o6L12N98O11L31l7k79k59
53022B32825J41Q56J367J128M44L00R91J485Q02m86r05p1R06J004M42m7k78l98
53004B40506j96N55J349J254J65r42j189p68m17l73l47k32j78o5L94R99J136P62
$$ plain form
53124 239377 240371 241685 243536 245399 246644 247348 248208 249674 251563 253626 255960 258491 260554 261553 261744
53109 261744 261730 261423 260291 258551 257225 256828 256756 256217 255095 253601 251786 249890 248512 247868 247315 246167
53093 246167 244609 243281 242335 241505 240809 240489 240366 239896 238927 237868 237013 236145 235029 233976 233656 234350 235455
53076 235455 235905 235224 234117 233714 234232 234805 234647 233814 232600 230919 228857 227266 226968 227607 228027 227717 227194
53059 227194 226996 227050 227091 227036 226691 225695 224142 222875 222767 223886 225542 226968 227813 228228 228674 229469 230380 230795
53041 230795 230432 229732 229434 229919 230997 232151 232886 232976 232564 232007 231614 231548 231860 232458 233069 233400 233363 233084 232825
53022 232825 232966 233822 235189 236317 236761 237061 238052 239537 240339 239853 238948 238877 239783 240787 241229 241182 240904 240506
53004 240506 240310 240865 242214 243468 243633 242691 241502 240734 240317 239944 239597 239365 239187 239122 239516 240515 241651 242413
52986B42413O42J217J911K061J918K058K252J941J388J385J874J970J386Q10O18
52971B65844K76n30j132q92k21J40K00L59N28M56M84J075J831J865J066J84l73
52954B71160r73j826k321j864q65m12j032k145k766k495j747j150q95p70n63k50
52938B49086Q9K75N3n54j004p95k10P6K6K25O81O13j74o20P5J103J100J22n92
52919B49575n27m04p22r35m81K62N64L38K5j30j78j82j84l41o94r59q43m51j80
52900B43553k14l37k27J69N71O27K51k17k56L48J185J508R23j32p35m16L95R59
52882B47955J043Q25L40m06q80m23O28J029K90m94j38R41J367Q08K88O20J427
52865B55220J899J843J633J642J965K445K732K523J770N96r05k474l578l870l623
$$ plain form
52986 242413 243055 244272 246183 248244 250162 252220 254472 256413 257801 259186 261060 263030 264416 265226 265844
52971 265844 266120 265590 264458 263566 263345 263485 263685 264044 264572 265028 265512 266587 268418 270283 271349 271533 271160
52954 271160 270187 268361 266040 264176 263311 262899 261867 259722 256956 254461 252714 251564 250669 249899 249336 249086
52938 249086 249175 249450 249503 248949 247945 247150 246940 247016 247042 247267 247948 248561 248387 247767 247842 248945 250045 250167 249575
52919 249575 249048 248644 247922 246987 246506 246768 247332 247670 247695 247565 247387 247205 247021 246680 245986 245027 244184 243733 243553
52900 243553 243339 243002 242775 242944 243515 244142 244393 244176 243920 244268 245453 246961 247884 247752 247017 246601 246996 247955
52882 247955 248998 249823 250163 249757 248877 248454 249082 250111 250401 249907 249769 250710 252077 252885 253173 253793 255220
52865 255220 257119 258962 260595 262237 264202 266647 269379 271902 273672 274268 273363 270889 267311 263441 259818
52850B59818l304k923k354k018k471l381l761l319k812k787k737k011r47m73q66
52835B23654j466j489q04M3L86Q0l75m72l54m99q35p32LP44Q93O27M60N06N74
52816B20944O61Q92J164J248J116Q62M69m9m12k66M31J315J829J544N06o26j103
52799B30525r07p50j147j764j933j477p95l54k89l64k02K08L42j69p62m60P24
52782B20426J631J475P60K61n4m58o08j65L53K45j89k06K1k82r64j055m37j86
52764B20568q44j534j363p43n30o33l28N14J363J858J968J595O63m18j017r00
52748B20219k53P08J727K305K092J405R26R14J141J466J925K339K356J989J577
52733B42836J232Q08M36N37J089J450J176N91K53K74M82P95J053Q90J93n72r38
$$ plain form
52850 259818 256514 253591 251237 249219 246748 243367 239606 236287 233475 230688 227951 225940 224993 224520 223654
52835 223654 222188 220699 219895 219938 220324 220404 220029 219557 219203 218704 217869 217137 217140 217884 218777 219404 219864 220370 220944
52816 220944 221605 222497 223661 224909 226025 226887 227356 227307 226895 226629 227060 228375 230204 231748 232254 231628 230525
52799 230525 229618 228868 227721 225957 224024 222547 221752 221398 221109 220745 220543 220751 221093 220924 220162 219702 220426
52782 220426 222057 223532 224292 224553 224499 224041 223433 223268 223621 223866 223677 223471 223492 223210 222246 221191 220754 220568
52764 220568 219724 218190 216827 216084 215554 214921 214593 215107 216470 218328 220296 221891 222554 222136 221119 220219
52748 220219 219966 220674 222401 224706 226798 228203 229129 230043 231184 232650 234575 236914 239270 241259 242836
52733 242836 244068 244876 245312 245849 246938 248388 249564 250155 250408 250682 251164 251959 253012 253902 254095 253523 252585
52716B52585j144j695k416k506j627l93L56M05R5k44n09o90p42o44m46k18J5L70
52698B40552R67J641J935J542O43k98r67j250j083n34K5K15M1k37m94o57m49K55
52680B41847R30Q58J41l65k89k15o37j124j020m46j4J21K28K71o4o85r74n25M00
52661B38438J190J407R99L63K08J021K513L779M118L605K924K676K794K525J223
52646B69783p83k350k762k433k191k200k080j670j159o64j92Q8R2J46N13P64L10
52629B53212n16o65K35J375J938K033K194K456K398J768P18l56j029j128q98o61
52613B63074l34K43O79L72m83r55o82l03k79j46N23J175J120O80O46R76R77N29
52595B67812K16K52J55l49q36p80k00N33J076J223J000Q13J075J641J942J770
$$ plain form
52716 252585 251441 249746 247330 244824 243197 242804 243160 243565 243660 243416 242907 242217 241475 240831 240385 240167 240182 240552
52698 240552 241519 243160 245095 246637 247280 246982 246015 244765 243682 243148 243173 243388 243429 243192 242698 242041 241592 241847
52680 241847 242777 243635 243776 243411 243122 242907 242270 241146 240126 239680 239666 239787 240015 240286 240222 239537 238563 238038 238438
52661 238438 239628 241035 242034 242397 242605 243626 246139 249918 254036 257641 260565 263241 266035 268560 269783
52646 269783 269000 266650 263888 261455 259264 257064 254984 253314 252155 251491 251299 251387 251479 251625 252138 252902 253212
52629 253212 252696 252031 252266 253641 255579 257612 259806 262262 264660 266428 267146 266790 265761 264633 263735 263074
52613 263074 262740 262983 263662 264034 263551 262596 261914 261611 261332 261186 261709 262884 264004 264684 265330 266306 267283 267812
52595 267812 268028 268280 268435 268086 267250 266470 266270 266803 267879 269102 270102 270915 271990 273631 275573 277343
52579B77343J561J716K057K151J900J553J321J144Q42L29l00q80j381j878k268
52564B85210k232j665r37m86l55l91o61j231j716j619j080p96j073j436j350r02
52548B67280n58n47p44r37r31n87R7R31J637J949J727J196R55J389K123K355J789
52531B79124Q84J92j63k91k56j47k4L04J085K015K284J554M36k88n70q18j076
52514B84245r71l53N37J455K319L010L374L513L769M231M448L728J791q39l137
52499C11120m419m892n179n330m772l324j793j060j056j086r11q71j087j265j344
52484B72731j616k018j870p69P17J653J787J537J242Q68M23J75K97O01Q02Q99
52468B77459J111J510J866J915J736J729K200L033L780M039L648K671J354N7r69
$$ plain form
52579 277343 278904 280620 282677 284828 286728 288281 289602 290746 291588 291917 291617 290737 289356 287478 285210
52564 285210 282978 281313 280376 279890 279535 279144 278483 277252 275536 273917 272837 272041 270968 269532 268182 267280
52548 267280 266722 266175 265431 264494 263563 262976 263073 264004 265641 267590 269317 270513 271468 272857 274980 277335 279124
52531 279124 280008 280200 280037 279746 279490 279343 279319 279623 280708 282723 285007 286561 286997 286709 286139 285321 284245
52514 284245 283274 282921 283458 284913 287232 290242 293616 297129 300898 305129 309577 313305 315096 314257 311120
52499 311120 306701 301809 296630 291300 286528 283204 281411 280351 279295 278209 277298 276427 275340 274075 272731
52484 272731 271115 269097 267227 266458 267175 268828 270615 272152 273394 274262 274685 274860 275157 275758 276560 277459
52468 277459 278570 280080 281946 283861 285597 287326 289526 292559 296339 300378 304026 306697 308051 308108 307139
52453C07139j760k431k917l097l100l175l250l026k595k496k894l083k341r56
52439B70018P6L10K90O35J175J265O48k87r94j226j124r93r67q37k98M98Q97M13
52421B69499n80j134o77M40J382J645J384J117J217J657K149K513K886L463M175
52406B91136M810N518O839Q964J1141J2184J1509R433O455K813j082m304o047
52393C59369o459o393o373o218n674m905m249l814l542l293k787j785n62K20M19
52378C03954P28J716K896L348L001K662K829L199L459L905M890O061O586O043
52364C55277M774L445K398J404J22j300k241k428k336k388k130r36P01J483J095
52349C56940O25R85J791K357K793L299L236K007M20n2Q58K131L115M156N471O575
$$ plain form
52453 307139 305379 302948 300031 296934 293834 290659 287409 284383 281788 279292 276398 273315 270974 270018
52439 270018 270094 270404 270694 271329 272504 273769 274417 274130 273136 271910 270786 269793 268826 267989 267691 268189 269086 269499
52421 269499 268919 267785 267108 267548 268930 270575 271959 273076 274293 275950 278099 280612 283498 286961 291136
52406 291136 295946 301464 308303 317267 328408 340592 352101 361534 367989 370802 369720 365416 359369
52393 359369 352910 346517 340144 333926 328252 323347 319098 315284 311742 308449 305662 303877 303315 303535 303954
52378 303954 304682 306398 309294 312642 315643 318305 321134 324333 327792 331697 336587 342648 349234 355277
52364 355277 360051 363496 365894 367298 367420 366120 363879 361451 359115 356727 354597 353661 354362 355845 356940
52349 356940 357565 358550 360341 362698 365491 368790 372026 374033 374453 374401 375259 377390 380505 384661 390132 396707
52333C96707P191P809Q869J0056J0947J1703J2693J3891J5079J6211J7238J8001
52321E46395J8635J9546K0621K1055K0390J9264J8592J8502J8656J9009J9533
52310G60198J9650J8930J8071J8192J9134J9472J8480J7109J6574J6700J6388
52299I58898J5250J3956J3098J2381J1099Q979O304L438N45k217m614o556q278
52286A022283r902j0974j0817r538q214p724p712p120n537l494j517M34K505M455
52272I47128N978P177Q387R737J1133J2491J3747J4699J5142J5119J4909J4714
52260A090361J4556J4418J4413J4677J5137J5456J5349J4904J4512J4332J4014
52249A252129J3059J1351R100O408L199l28l522n751o983p781q705r792j0620
$$ plain form
52333 396707 403898 411707 420576 430632 441579 453282 465975 479866 494945 511156 528394 546395
52321 546395 565030 584576 605197 626252 646642 665906 684498 703000 721656 740665 760198
52310 760198 779848 798778 816849 835041 854175 873647 892127 909236 925810 942510 958898
52299 958898 974148 988104 1001202 1013583 1024682 1033661 1039965 1043403 1043948 1041731 1037117 1030561 1022283
52286 1022283 1012381 1001407 990590 981052 972838 965114 957402 950282 944745 941251 939734 940168 942673 947128
52272 947128 953106 960283 968670 978407 989540 1002031 1015778 1030477 1045619 1060738 1075647 1090361
52260 1090361 1104917 1119335 1133748 1148425 1163562 1179018 1194367 1209271 1223783 1238115 1252129
52249 1252129 1265188 1276539 1285639 1292047 1295246 1294918 1291396 1285645 1278662 1270881 1262176 1252384 1241764
52236A241764j0849j0613j0222r603q375o675n477n615o664p291o689n219l690
52223A144782k560j972j952k188j988r01P44K258L308L953M209M062L812L963
52209A159530M589N208N436N562O218P507Q695Q961Q378P868Q078Q523Q214P022
52195A259789N909N735O300O871P164P319P321P024O597O290N740M215J702p53
52181A337223k250l110m406o606r164j1204j2258j2354j1881j1340j0939j0268
52169A231443q783o673m932m259m151l453j692M86K202L249L910M280M119L366
52155A219112K357J449O01m21j604k596l075l006k525j754q58j33J56P3o9j15
52139A207592k32o45j319k110k929l514l241j673P06K809M260N902Q586J1892
$$ plain form
52236 1241764 1230915 1220302 1210080 1200477 1192102 1185427 1179950 1174335 1167671 1160380 1153691 1148472 1144782
52223 1144782 1142222 1140250 1138298 1136110 1134122 1133221 1133965 1136223 1139531 1143484 1147693 1151755 1155567 1159530
52209 1159530 1164119 1169327 1174763 1180325 1186543 1194050 1202745 1211706 1220084 1227952 1236030 1244553 1252767 1259789
52195 1259789 1265698 1271433 1277733 1284604 1291768 1299087 1306408 1313432 1320029 1326319 1332059 1336274 1337976 1337223
52181 1337223 1334973 1331863 1327457 1320851 1311687 1300483 1288225 1275871 1263990 1252650 1241711 1231443
52169 1231443 1222660 1215987 1211055 1206796 1202645 1199192 1197500 1197986 1200188 1203437 1207347 1211627 1215746 1219112
52155 1219112 1221469 1222918 1223519 1223098 1221494 1218898 1215823 1212817 1210292 1208538 1207680 1207547 1207703 1207776 1207707 1207592
52139 1207592 1207360 1206715 1205396 1203286 1200357 1196843 1193602 1191929 1192635 1195444 1199704 1205606 1214192 1226084
52125A226084J4627J6385J7982K0258K3151K6017K8374K9948L0534L0227K9470
52114A493057K8524K7067K4818K2271K0349J9322J8547J7238J5132J2462R754
52103A708541P737O921O990O939O083M663L276K045P02q21k354m028o337r532
52089A730825j3208j6627j9252k0895k1537k1199j9902j7724j4907j1936r287
52078A544351p063m931k604k69J569K695L536M847P029R754J2256J4057J5314
52065A600541J6456J7552J8259J8322J7928J7429J6924J6220J5151J3772J2292
52054A780846J0880R463P742N460K747J0k536n090p926j1024j4230j7572k1022
52041A737748k4073k5952k6488k6451k6745k7365k7401k6057k3500k0575j7925
$$ plain form
52125 1226084 1240711 1257096 1275078 1295336 1318487 1344504 1372878 1402826 1433360 1463587 1493057
52114 1493057 1521581 1548648 1573466 1595737 1616086 1635408 1653955 1671193 1686325 1698787 1708541
52103 1708541 1716278 1723199 1730189 1737128 1743211 1747874 1751150 1753195 1753897 1753076 1750722 1746694 1740357 1730825
52089 1730825 1717617 1700990 1681738 1660843 1639306 1618107 1598205 1580481 1565574 1553638 1544351
52078 1544351 1537288 1532357 1529753 1529484 1531053 1533748 1537284 1542131 1549160 1558914 1571170 1585227 1600541
52065 1600541 1616997 1634549 1652808 1671130 1689058 1706487 1723411 1739631 1754782 1768554 1780846
52054 1780846 1791726 1801189 1808931 1814391 1817138 1817148 1814612 1809522 1801596 1790572 1776342 1758770 1737748
52041 1737748 1713675 1687723 1661235 1634784 1608039 1580674 1553273 1527216 1503716 1483141 1465216
52030A465216j5639j3651j2166j1407j1153j0907j0554j0494j1029j1830j2269
52019A334117j2116j1712j1552j1776j2037j1804j1018j0364j0602j1592j2409
52008A207135j2663j3095j4493j6502j8143j9179k0197k1516k2796k3676k4078
51997A000797k3806k2660k1010j9562j8321j6565j4148j2068j1269j1533j2082
51986H17773j2688j3540j4496j5141j5345j5231j4868j4398j4168j4307j4505
51975F59086j4531j4580j4632j4062j2507j0644r281q091o107l216k82K127M238
51962E57518O310Q136R321R475Q229N818L445K093J078j162m680p616q544q073
51948E81348p537p097o015m065j730O52L097N570P944J0188J2162J3503J4138
$$ plain form
52030 1465216 1449577 1435926 1423760 1412353 1401200 1390293 1379739 1369245 1358216 1346386 1334117
52019 1334117 1322001 1310289 1298737 1286961 1274924 1263120 1252102 1241738 1231136 1219544 1207135
52008 1207135 1194472 1181377 1166884 1150382 1132239 1113060 1092863 1071347 1048551 1024875 1000797
51997 1000797 976991 954331 933321 913759 895438 878873 864725 852657 841388 829855 817773
51986 817773 805085 791545 777049 761908 746563 731332 716464 702066 687898 673591 659086
51975 659086 644555 629975 615343 601281 588774 578130 568849 560758 554651 551435 551153 553280 557518
51962 557518 563828 571964 581285 590760 598989 604807 608252 610345 611423 610261 605581 597965 589421 581348
51948 581348 573811 566714 560699 556634 554904 555556 558653 564223 572167 582355 594517 608020 622158
51935F22158J4499J4842J4713J3664J2108J0855R987Q784O696L974J409k53r64
51922G32472j783m282q976j4618j9478k2985k5482k6810k6271k3926k0945j8259
51910E18657j5618j2491r262o870n512m354k546j08K283M098N349O228O647O346
51896D92847N331L933K298P4l119o989j0579j2951j3702j3024j1459r616p863
51883D15181o230m620l077j710n13O19J771K990M345N888P561R143J0165J0041
51869D51554Q608O568M877L665K170o0k471m273n345n908n824m861l303j595L25
51854D44127K627M753N752N455M592L747K804J519r0k056m429o704p930p800p101
51839D39266o730o690o462n900n283m772m249l554k515r96P88K178K673K486K173
$$ plain form
51935 622158 636657 651499 666212 679876 691984 702839 712826 721610 728306 732280 733689 733436 732472
51922 732472 730689 726407 717431 702813 683335 660350 634868 608058 581787 557861 536916 518657
51910 518657 503039 490548 481286 474416 468904 464550 462004 461896 464179 468277 473626 479854 486501 492847
51896 492847 498178 502111 504409 504483 501364 494375 483796 470845 457143 444119 432660 423044 415181
51883 415181 408951 404331 401254 399544 399031 399650 401421 404411 408756 414644 422205 431348 441513 451554
51869 451554 460162 466730 471607 475272 477442 477382 474911 470638 465293 459385 453561 448700 445397 443802 444127
51854 444127 446754 451507 457259 462714 467306 471053 473857 475376 475286 473230 468801 462097 454167 446367 439266
51839 439266 432536 425846 419384 413484 408201 403429 399180 395626 393111 392115 392903 395081 397754 400240 402413
51824D02413J871J264K21r22j774k283k616k858k969k818k278j388m82K4J05K61
51808C85771R22J776J967J100k40j170j540j836k191k026q96P57K060K556K353
51793C89363J732J016M87L3q47k191l117k828j788j129j071q11l6M60M7p45j072
51776C77503r27p78n52K51J647L098M261N316O469P635Q664R513J0075J0117R576
51761D51868Q668P562O032L719P13k320m829p000r311j1465j2329j1361r561q427
51747D01959q203p890o872n618m697l946k986j860o76P97K619M268N209N577N836
51732C83517O069O030N598M775L534K054P52k39j147j749j122J025L312L839K218
51717D18466l03k483l973m733m635l881l036k348j677j189j391k186k621k055
$$ plain form
51824 402413 404284 405548 405769 404847 403073 400790 398174 395316 392347 389529 387251 385863 385381 385405 385510 385771
51808 385771 386693 388469 390436 391536 391296 390126 388586 386750 384559 382533 381637 382394 384454 387010 389363
51793 389363 391095 392111 392598 392631 391784 389593 386476 383648 381860 380731 379660 378849 378813 379273 379320 378575 377503
51776 377503 376576 375798 375246 375497 377144 380242 384503 389819 396288 403923 412587 422100 432175 442292 451868
51761 451868 460536 468098 474130 477849 478562 476242 471413 464413 455102 443637 431308 419947 410386 401959
51747 401959 393756 385866 378994 373376 368679 364733 361747 359887 359211 360008 362627 366895 372104 377681 383517
51732 383517 389586 395616 401214 405989 409523 411577 412329 412090 410943 409194 408072 409097 412409 416248 418466
51717 418466 418163 415680 411707 406974 402339 398458 395422 393074 391397 390208 388817 386631 384010 381955
51703C81955j016l57m2O70K047L477M220M108L493K670J542l6j665k392j669j45
51687C96860Q96Q61J40p96j931l171l987m034l676l378k962j926l35J097J684
51672C75342J335N45O9L38J023J428J541K250M173O674Q499R121Q835P783N734
51657D34690K783l67l041m998o047n783m104j582J038L442N553O946O874M921
51643D40325J428k658o295q757r806r644q731p645o857o389n701m229k058J01
51629C63084J659K535K874K772K517K610L150L450K712R94r18k451l596m401m650
51614C72341m304l820l712l941m017l564k652j752j389j704k167j970r05L29R26
51599C37699Q80R22J688L245N289P449R480J1335J2970J3850J2887R407M151j102
$$ plain form
51703 381955 380939 380582 380540 381210 383257 386734 390954 395062 398555 401225 402767 402731 401066 398674 397005 396860
51687 396860 397756 398617 398757 397961 396030 392859 388872 384838 381162 377784 374822 372896 372561 373658 375342
51672 375342 376677 377222 377291 377629 378652 380080 381621 383871 388044 394718 403217 412338 421173 428956 434690
51657 434690 437473 437106 434065 429067 423020 417237 413133 411551 412589 416031 421584 428530 435404 440325
51643 440325 441753 439095 432800 424043 414237 404593 395862 388217 381360 374971 369270 365041 362983 363084
51629 363084 364743 367278 370152 372924 375441 378051 381201 384651 387363 388357 387439 384988 381392 376991 372341
51614 372341 368037 364217 360505 356564 352547 348983 346331 344579 343190 341486 339319 337349 336444 336773 337699
51599 337699 338579 339501 341189 344434 349723 357172 366652 377987 390957 404807 417694 427101 431252 430150
51585D30150n028p505q930r456r083p939o064l390k84K328L960N357P574J0442
51571D02132J2636J3313J3038J2988J3836J5625J8038K0385K1738K1695K0884
51560E86308K0422K1031K2902K6000K9954L3726L5987L5927L3474K8761K1792
51549H96284J2827K731p270j6135k3285k8620l2440l5163l6884l7313l6232l3862
51537F24638l0688k7034k3063j9024j5230j1813q722o031l993k667j721q10n5
51524D73787J09m53j366k215l065m257n782p134p862q053q003p655o725n455m686
51509D01185m909n475n297m270l443l657m395m391l173j562p18r53j631j966j776
51494C53569j488j432j319o03O65J701J920J690J764K244K546K345J929J569J133
$$ plain form
51585 430150 425122 417617 408687 399231 390148 382209 376145 372755 372471 374799 378759 384116 391690 402132
51571 402132 414768 428081 441119 454107 467943 483568 501606 521991 543729 565424 586308
51560 586308 606730 627761 650663 676663 706617 740343 776330 812257 845731 874492 896284
51549 896284 909111 911842 904572 888437 865152 836532 804092 768929 732045 694732 658500 624638
51537 624638 593950 566916 543853 524829 509599 497786 489064 483033 479040 476373 474652 473842 473787
51524 473787 473896 473443 472077 469862 466797 462540 456758 449624 441762 433709 425706 418051 411326 405871 401185
51509 401185 396276 390801 385504 381234 377791 374134 369739 365348 362175 360613 359895 358942 357311 355345 353569
51494 353569 352081 350649 349330 348727 349392 351093 353013 354703 356467 358711 361257 363602 365531 367100 368233
51479C68233N03q5n16j098j992k716k780k515k700l442m022l872l176k366j618
51464C35838j026q89j311j844j884j391r23r40j330j580j312o08P7L71L36L79
51448C21963Q03J520K257K865L405M106N354P467J0206J2646J3760J3187J1326
51435D10865Q772N895K913J00k153l337l025j399L63P20q16l099m547m705m342
51420D02205m116l849l186k401k052k180k374k469k649k861k679j958j216r94
51406C67221j154j145p35j04O62J624K540K883K532K090K163K559K621K226K018
51391C88001K586L769M943N791O498P392Q702J0590J3156J6345K0018K4172K8890
51378E40853L4014L9097M3768M7963N1656N4511N5881N4946N0655M2036K9142
$$ plain form
51479 368233 368736 368651 368135 367037 365045 362329 359549 357034 354334 350892 346870 342998 339822 337456 335838
51464 335838 334812 333923 332612 330768 328884 327493 326570 325630 324300 322720 321408 320800 320877 321248 321584 321963
51448 321963 322766 324286 326543 329408 332813 336919 342273 349740 359946 372592 386352 399539 410865
51435 410865 419637 425532 428445 428545 426392 423055 420030 418631 418994 419714 418898 415799 411252 406547 402205
51420 402205 398089 394240 391054 388653 386601 384421 382047 379578 376929 374068 371389 369431 368215 367221
51406 367221 366067 364922 364187 364083 364745 366369 368909 371792 374324 376414 378577 381136 383757 385983 388001
51391 388001 390587 394356 399299 405090 411588 418980 427682 438272 451428 467773 487791 511963 540853
51378 540853 574867 613964 657732 705695 757351 811862 867743 922689 973344 1015380 1044522
51367A044522J3782j233j3882k3909l2049l8705m3615m6486m7517m7281m6349
51356G17278m4982m3070m0291l6481l1937k7312k3184j9716j6644j3657j0798
51345D09206q442o834n833n240n179n756o458o401n323l915k912k275j563p21
51331C42354n1L07L89R8o09j269j190k26J099K287L231L779L460K040J01j410
51315C54390k094k335k558k603j983o13R39J970K191J706P07n83j752k341k295
51300C42746j976j672j358j011q32r56j208j440j789k343k780k701k120j353n94
51285C18613P4N48R37J687L007M443N452O163O979P639P387O042M177K258L03
51270C75709j490k531k527j799p26N77J877K754L200L631L970L475J892Q0j060
$$ plain form
51367 1044522 1058304 1057071 1043189 1019280 987231 948526 904911 858425 810908 763627 717278
51356 717278 672296 629226 588935 552454 520517 493205 470021 450305 433661 420004 409206
51345 409206 400764 393930 388097 382857 377678 371922 365464 359063 353740 349825 346913 344638 343075 342354
51331 342354 342303 342610 342999 343097 342488 341219 340029 339803 340902 343189 346420 350199 353659 355699 355800 354390
51315 354390 352296 349961 347403 344800 342817 342204 343143 345113 347304 349010 349717 349134 347382 345041 342746
51300 342746 340770 339098 337740 336729 335897 334941 333733 332293 330504 328161 325381 322680 320560 319207 318613
51285 318613 318687 319235 320172 321859 324866 329309 334761 340924 347903 355542 362929 368971 373148 375406 375709
51270 375709 374219 371688 369161 367362 366636 367213 369090 371844 375044 378675 382645 386120 388012 388092 387032
51255C87032j638k184k629k652k535k765l143l211l222l774m531m456l384k383
51241C44525k220k295j679n06K98K14m66j224j666j486o09N15J165J010M26K0
51225C36022K4J89K51L04O19J174J567J504J212J104J222J286J172R99P57K48
51209C49654m42p82l93M02R18R42J011J769L143M254M208L041J781J412J840K085
51193C74843J425J71q66j339j516j582j233k18J009J533J007J21j93J40L79K2
51177C73703o15r82r74q23o32m53n56j189k113k749k703j897l73J548L026L260
51161C65478K512J950K236K742K522J654R62P23L78m60j372j800j877k105k525
51146C71018k704k474k188k145k196k090j863j570j020j56N15M64j4p7M91J042
$$ plain form
51255 387032 385394 383210 380581 377929 375394 372629 369486 366275 363053 359279 354748 350292 346908 344525
51241 344525 342305 340010 338331 337825 338123 338337 337871 336647 334981 333495 332886 333401 334566 335576 336002 336022
51225 336022 336046 336235 336486 336790 337409 338583 340150 341654 342866 343970 345192 346478 347650 348649 349406 349654
51209 349654 349212 348430 348037 348439 349357 350299 351310 353079 356222 360476 364684 367725 369506 370918 372758 374843
51193 374843 376268 376439 375573 374234 372718 371136 369903 369685 370694 372227 373234 373355 373162 373302 373681 373703
51177 373703 373088 372106 371132 370309 369677 369224 368668 367479 365366 362617 359914 358017 357644 359192 362218 365478
51161 365478 367990 369940 372176 374918 377440 379094 380056 380779 381157 380697 379325 377525 375648 373543 371018
51146 371018 368314 365840 363652 361507 359311 357221 355358 353788 352768 352612 353127 353591 353577 353500 353991 355033
51130C55033J107J045J306J647J673J706K346L415L996L522K317J046K13J41Q84
51115C81397J933K489K217J488Q66O82J077J908K539K316J486J082J619K366K336
51100D07801J534P58N23P05J045J386J489J168O36L28K95J37l46q07q42n71m70
51083D14769p14r42p22j41K58J79l0J41O26Q94Q26R72J655K281K075J333J206
51066D24666K191L461M041M164M913O696Q709J0100J1172J2977J5772J8282J8750
51053E45894J6552J2719R026O827O610Q134J0555J2531J2771J0842P515M075J191
51040F65242j508m753q604j2162j4175j3867j1350p614m193k489l029n221p909
51027E68368j0118j1383j1603j0841r291p296n357l931l033k067m73J453K845
$$ plain form
51130 355033 356140 357185 358491 360138 361811 363517 365863 369278 373274 376796 379113 380159 380372 380513 381397
51115 381397 383330 385819 388036 389524 390390 391072 392149 394057 396596 398912 400398 401480 403099 405465 407801
51100 407801 409335 410093 410616 411321 412366 413752 415241 416409 417045 417373 417668 417805 417459 416652 415810 415239 414769
51083 414769 414055 413113 412391 412250 412508 412687 412657 412798 413424 414318 415144 416116 417771 420052 422127 423460 424666
51066 424666 426857 430318 434359 438523 443436 450132 458841 468941 480113 493090 508862 527144 545894
51053 545894 562446 575165 584191 591018 597628 605762 616317 628848 641619 652461 659976 664051 665242
51040 665242 663734 658981 650377 638215 624040 610173 598823 591209 587016 584527 581498 576277 568368
51027 568368 558250 546867 535264 524423 515132 507836 502479 498548 495515 493448 492975 494428 497273
51014D97273L548M491O351Q365R293R175R261J0222J1324J1571J0936J0062R364
51001F11236Q826Q257P376N974M280K747J384k65k153l342l094j864p40k14o4
50986F38344jR9N05J506L115N283Q178J1758J5296J7930J9508K0348K0352J9162
50972G81383J7202J5791J5967J7692K0466K4154K8826L4214L9716M4815M9299
50961A089525N3255N6975O0733O4469O7831P0479P2100P2228P0481O7063O2678
50950A807817N7793N2387M6534M0780L5624L1000K6680K3001K0737K0337K1499
50939B184189K3451K5294K6184K5499K3180J9881J6570J3732J0852O835J124n757
50927B371034j2901k0050k7587l5667m3914n1991n9889o7428p3918p8624q1299
$$ plain form
51014 497273 500821 505312 511663 520028 529321 538496 547757 557979 569303 580874 591810 601872 611236
51001 611236 620062 628319 635695 641669 645949 648696 650080 649815 647662 644320 641226 639362 638622 638408 638344
50986 638344 638343 638442 638947 640453 643568 648851 657029 668787 684083 702013 721521 741869 762221 781383
50972 781383 798585 814376 830343 848035 868501 892655 921481 955695 995411 1040226 1089525
50961 1089525 1142780 1199755 1260488 1324957 1392788 1463267 1535367 1607595 1678076 1745139 1807817
50950 1807817 1865610 1917997 1964531 2005311 2040935 2071935 2098615 2121616 2142353 2162690 2184189
50939 2184189 2207640 2232934 2259118 2284617 2307797 2327678 2344248 2357980 2368832 2375667 2376791 2371034
50927 2371034 2358133 2338083 2310496 2274829 2230915 2178924 2119035 2051607 1977689 1899065 1817766
50916A817766q2024q0918p8292p4731p0591o5672n9812n3560m7798m2905l8683
50905A122780l4986l1882k9227k6696k4328k2528k1317k0016j8062j5745j3783
50894H64210j2310j0830r121p691p040o802o045m397k491j139m40M1M89P68J025
50879G98227J706K826L751M115M485N635P450R046R884J0220J0503J0920J1568
50866H90336J2604J4035J5659J7366J9202K1117K3053K5283K8218L1716L5093
50855A133682L8141M1618M6420N2636N9814O7689P6121Q4726R3266J02185J11986
50844A908284J22149J31440J39387J46602J53444J59048J62192J62371J59494
50835C244411J53019J42257J27490J10138R1808P3519N5824L9239K4501J2648
$$ plain form
50916 1817766 1735742 1654824 1576532 1501801 1431210 1365538 1305726 1252166 1204368 1161463 1122780
50905 1122780 1087794 1055912 1026685 999989 975661 953133 931816 911800 893738 877993 864210
50894 864210 851900 841070 831949 824258 817218 810416 804371 799974 797483 796344 795904 795945 796434 797202 798227
50879 798227 799933 802759 806510 810625 815110 820745 828195 837241 847125 857345 867848 878768 890336
50866 890336 902940 916975 932634 950000 969202 990319 1013372 1038655 1066873 1098589 1133682
50855 1133682 1171823 1213441 1259861 1312497 1372311 1440000 1516121 1600847 1694113 1796298 1908284
50844 1908284 2030433 2161873 2301260 2447862 2601306 2760354 2922546 3084917 3244411
50835 3244411 3397430 3539687 3667177 3777315 3869123 3942642 3998466 4037705 4062206 4074854
50825D074854M776J326J794N383J1813K1010L2106M3432N3423O0962O4648O2617
50813D438144N3598L7896J6928p826l5069o3291r0863j16610j40001j60727j78206
50802C753973j91422j99239k01143j97905j91159j82127j71007j57784j43139
50793B119048j28170j13626r9915q7449p6326o5943n5674m5886l7493l0650k4677
50782A353239j9355j5335j3014j1806j1002j0562j0523j0286r367q361q267r063
50770A216298r777r930j0170j1253j3057j4864j6145j6744j6690j6206j5701j5400
50758A050361j5032j4142j2688j1111r790q620p241n555l798k074o5K572N634
50745I68451Q552J1158J3947J7424K1454K5557K9516L3416L7219M0835M4540M8886
$$ plain form
50825 4074854 4079630 4080956 4082750 4088133 4099946 4120956 4153062 4196494 4249917 4310879 4375527 4438144
50813 4438144 4491742 4529638 4546566 4538740 4503671 4440380 4349517 4232907 4092906 3932179 3753973
50802 3753973 3562551 3363312 3162169 2964264 2773105 2590978 2419971 2262187 2119048
50793 2119048 1990878 1877252 1777337 1689888 1613562 1547619 1491945 1446059 1408566 1377916 1353239
50782 1353239 1333884 1318549 1305535 1293729 1282727 1272165 1261642 1251356 1241989 1233628 1225361 1216298
50770 1216298 1206521 1196591 1186421 1175168 1162111 1147247 1131102 1114358 1097668 1081462 1065761 1050361
50758 1050361 1035329 1021187 1008499 997388 987598 978978 971737 966182 962384 960310 960245 962817 968451
50745 968451 977003 988161 1002108 1019532 1040986 1066543 1096059 1129475 1166694 1207529 1252069 1300955
50733A300955N4008N9303O3972O7690P0653P3118P5115P6515P7322P7813P8323
50722B074787P8754P8439P6743P3632O9325O3445N5074M3836L0537J6436K392
50711B663400j0800k1695k8607l0866k9141k4500j7665r237MR445J8815K7584
50699B546737L4536L8485L9106L6450K9947J8657K636j6547l6932n7214p6407
50688B559454r3150j05943j13974j17314j16513j12355j05803r7712q8557p8685
50678A529448o8712n9363n0978m3415l6309k9289k2151j5111q716l198J766O291
50666A200263R674J1195J1226J0848J0501R893R145Q973R466R738R323R052R794
50653A329091J1044J1686J1637J1787J2556J3491J4256J5225J6846J9099K1735
$$ plain form
50733 1300955 1354963 1414266 1478238 1545928 1616581 1689699 1764814 1841329 1918651 1996464 2074787
50722 2074787 2153541 2231980 2308723 2382355 2451680 2515125 2570199 2614035 2644572 2661008 2663400
50711 2663400 2652600 2630905 2602298 2571432 2542291 2517791 2500126 2490889 2490893 2500338 2519153 2546737
50699 2546737 2581273 2619758 2658864 2695314 2725261 2743918 2746554 2730007 2693075 2635861 2559454
50688 2559454 2466304 2360361 2246387 2129073 2012560 1900205 1794402 1696690 1608133 1529448
50678 1529448 1460736 1401373 1350395 1306980 1270671 1241382 1219231 1204120 1195404 1192206 1193972 1200263
50666 1200263 1209937 1221132 1232358 1243206 1253707 1263600 1272745 1281718 1291184 1300922 1310245 1319297 1329091
50653 1329091 1340135 1351821 1363458 1375245 1387801 1401292 1415548 1430773 1447619 1466718 1488453
50642A488453K4562K7380L0075L2933L6321L9987M3076M5020M5983M6321M6088
50631A906199M5362M4655M4487M4796M5158M5600M6690M8443M9023M4938L3297
50620B398648J4539p047k5903l8463m4136m3915l9131l1431k2789j4644p330p79
50608B137619M576Q011R313Q734O316J774m961j3452k3035l3012m2577n0974n7862
50595A950470o3276o7080o8838o8385o6223o3140n9643n6048n2789n0176m7803
50584A287069m4760m0760l6675l3581l1433k9175k6108k2662j9594j6955j4193
50573I71173j1022p700m523j497J488M375O926Q844R998J0719J1725J3421J5371
50560A029298J6795J7560J8254J9323K0597K1751K2654K3107K2704K1400J9835
$$ plain form
50642 1488453 1513015 1540395 1570470 1603403 1639724 1679711 1722787 1767807 1813790 1860111 1906199
50631 1906199 1951561 1996216 2040703 2085499 2130657 2176257 2222947 2271390 2320413 2365351 2398648
50620 2398648 2413187 2406140 2380237 2341774 2297638 2253723 2214592 2183161 2160372 2145728 2138398 2137619
50608 2137619 2142195 2150206 2159519 2168253 2174569 2176343 2171382 2157930 2134895 2101883 2059306 2008332 1950470
50595 1950470 1887194 1820114 1751276 1682891 1616668 1553528 1493885 1437837 1385048 1334872 1287069
50584 1287069 1242309 1201549 1164874 1131293 1099860 1070685 1044577 1021915 1002321 985366 971173
50573 971173 960151 952451 947928 946431 947919 952294 959220 968064 978062 988781 1000506 1013927 1029298
50560 1029298 1046093 1063653 1081907 1101230 1121827 1143578 1166232 1189339 1212043 1233443 1253278
50549A253278J8711J8041J7427J6749J6190J5699J5059J4484J4700J6197J8675
50538A435210K1483K4428K7914L2308L7380M2490M7245N1789N6350O0720O4510
50527A901827O7935P1941P7357Q3983R0778R6719J01326J04511J06245J06388
50517B809010J04657J00662R4109Q4954P3382N9669M4135K7113R002r606k7814
50506C369273m4738n9916p3153q3845r0921r3692r2425q7731p9705o8263n4063
50495B540821l8448k2397o171R781K4203L5732M3844M8579M9502M5487L5676K0326
50483B786935O39k1772m4851o5987q2827r4643j02488j07575j09826j08612j04480
50472A944513r9166r3677q7354p9369p0361o1765n4187m7375m1460l7041l4074
$$ plain form
50549 1253278 1271989 1290030 1307457 1324206 1340396 1356095 1371154 1385638 1400338 1416535 1435210
50538 1435210 1456693 1481121 1509035 1541343 1578723 1621213 1668458 1720247 1776597 1837317 1901827
50527 1901827 1969762 2041703 2119060 2203043 2293821 2390540 2491866 2596377 2702622 2809010
50517 2809010 2913667 3014329 3108438 3193392 3266774 3326443 3370578 3397691 3406693 3397087 3369273
50506 3369273 3324535 3264619 3191466 3107621 3016700 2923008 2830583 2742852 2663147 2594884 2540821
50495 2540821 2502373 2479976 2473805 2483586 2507789 2543521 2587365 2635944 2685446 2730933 2766609 2786935
50483 2786935 2787574 2765802 2720951 2654964 2572137 2477494 2375006 2267431 2157605 2048993 1944513
50472 1944513 1845347 1751670 1664316 1584947 1514586 1452821 1398634 1351259 1309799 1272758 1238684
50461A238684l1712k9454k7466k5533k2679j8407j3570r309n719k178J447M708
50449A058812P390R707J1892J4108J6650J9630K2666K5341K7755L0052L1603L1330
50437A306936K8817K4568J9266J3536Q337M641K446P48j176k995m159m784n291
50424A390890n698n823n750n600n047l643j378J454M732Q412J2265J6173K0484
50411A421471K5507L0782L5458L9284M2699M5933M8564N0089N0410M9655M8032
50400A887884M5971M3874M1465L7756L2023K4377J5214M626p208j9463l1145m1916
50388B033458n1774o0056o5471o7384o6480o3784n9433n2964m4588l5493k6645
50377A439386j7869q620O13Q319J3540J6830J9243K0682J9796J5470Q030j057
$$ plain form
50461 1238684 1206972 1177518 1150052 1124519 1101840 1083433 1069863 1060554 1054835 1052657 1054104 1058812
50449 1058812 1066202 1075909 1087801 1101909 1118559 1138189 1160855 1186196 1213951 1244003 1275606 1306936
50437 1306936 1335753 1360321 1379587 1393123 1401460 1406101 1408547 1409295 1408119 1405124 1400965 1396181 1390890
50424 1390890 1385192 1379369 1373619 1368019 1362972 1359329 1357951 1359405 1364137 1372549 1384814 1400987 1421471
50411 1421471 1446978 1477760 1513218 1552502 1595201 1641134 1689698 1739787 1790197 1839852 1887884
50400 1887884 1933855 1977729 2019194 2056950 2088973 2113350 2128564 2133190 2125982 2106519 2075374 2033458
50388 2033458 1981684 1921628 1856157 1788773 1722293 1658509 1599076 1546112 1501524 1466031 1439386
50377 1439386 1421517 1412897 1413510 1421829 1435369 1452199 1471442 1492124 1511920 1527390 1535420 1534363
50365A534363j0247j8724k6420l3493l9585m3733m5253m4624m3016m1002l8315
50354A149951l4925l1582k8946k6729k4263k1381j8200j4475r924n070j123R33
50342I34266P55j499n094q640j0841j1420j0874r441p019l988j214R78L041N111
50328H74121O517O886P016P926R487J0770J1464J2185J3435J4871J5754J5670
50316A006102J4653J2907J0614P938N129K568N75q70j944k571k482j822j163o51
50302A048983L87K471M946O628P312Q008R700J2505J6153K0593K5764L1229L6627
50289A231306M2297M8780N5239N8432N3878L8999J5788r642l0603m3407m8081
50278A412986m6591m1202l4068k7139k1593j7505j4290j1451q876o780n491n046
$$ plain form
50365 1534363 1524116 1505392 1478972 1445479 1405894 1362161 1316908 1272284 1229268 1188266 1149951
50354 1149951 1115026 1083444 1054498 1027769 1003506 982125 963925 949450 939526 934456 933333 934266
50342 934266 935021 933522 928428 919788 908947 897527 886653 877212 870193 866205 864991 865969 869010 874121
50328 874121 880638 887524 894540 902466 911953 922723 934187 946372 959807 974678 990432 1006102
50316 1006102 1020755 1033662 1044276 1052214 1057343 1059911 1060486 1059616 1057672 1055101 1052619 1050797 1049634 1048983
50302 1048983 1049370 1051841 1056787 1063415 1070727 1078735 1088435 1100940 1117093 1137686 1163450 1194679 1231306
50289 1231306 1273603 1322383 1377622 1436054 1489932 1528931 1544719 1535077 1504474 1461067 1412986
50278 1412986 1366395 1325193 1291125 1263986 1242393 1224888 1210598 1199147 1190271 1183491 1178000 1172954
50266A172954m971m737m468m745n556n966n182l533j932o25R63L246N899Q327
50252A149674J0318J1968J3224J3867J3940J3916J4288J5058J5823J6429J7220
50241A305725J8397J9361J9094J7162J3911R762M856m30n310r372j3018j6533
50229A363605j9129j9642j8025j5415j2841j0679r464j0271j3721j9114k5033
50218A190271l0377l4397l6355l5923l3747l0943k7977k4656k1032j7676j4968
50207H82220j2742j0863r504q602p631o351n301n027n191n017m362l756l548l658
50193G90667m024m629n068m771l944l632m503o011p088p323p067o773o629o615
50179G12590o538o193n754n763o374o931o741o015n535n522n364m499l085j723
$$ plain form
50266 1172954 1167983 1163246 1158778 1154033 1148477 1142511 1137329 1133796 1131864 1131239 1132202 1135448 1141347 1149674
50252 1149674 1159992 1171960 1185184 1199051 1212991 1226907 1241195 1256253 1272076 1288505 1305725
50241 1305725 1324122 1343483 1362577 1379739 1393650 1403412 1408268 1407838 1402528 1393156 1380138 1363605
50229 1363605 1344476 1324834 1306809 1291394 1278553 1267874 1258410 1248139 1234418 1215304 1190271
50218 1190271 1159894 1125497 1089142 1053219 1019472 988529 960552 935896 914864 897188 882220
50207 882220 869478 858615 849111 840509 832878 826527 821226 816199 811008 805991 801629 797873 794325 790667
50193 790667 786643 782014 776946 772175 768231 764599 760096 754085 746997 739674 732607 725834 719205 712590
50179 712590 706052 699859 694105 688342 681968 675037 668296 662281 656746 651224 645860 641361 638276 636553
50165F36553q95p13q24n34N45J951K792K793K475K319K260K181K406L364N052
50150F61725P092R067J0544J1121J0770R979R309Q991R067R686J0952J2762J4965
50137G96030J7508K0252K2916K5449K8138L1023L3509L4973L5501L5683L5890
50126A116872L6195L6728L7454L7598L5913L1707K5265J7310Q505m52q776j5966
50114A358353k1936k6604k9753l1417l2040l1871l0569k7823k4180k0783j8365
50103A063012j6765j5480j4324j3500j3213j3363j3618j3648j3345j2710j1650
50092I11396j0028p940n636l062J23L756O745Q024P890P782Q634J0010J1052J1646
50078I60392J2129J2297J1583J0153Q990Q590Q179O782M648K949K188J577K52
$$ plain form
50165 636553 635658 634945 634121 633587 634132 636083 638875 641668 644143 646462 648722 650903 653309 656673 661725
50150 661725 668817 677884 688428 699549 710319 720298 729607 738598 747665 757351 768303 781065 796030
50137 796030 813538 833790 856706 882155 910293 941316 974825 1009798 1045299 1080982 1116872
50126 1116872 1153067 1189795 1227249 1264847 1300760 1332467 1357732 1375042 1383547 1383095 1374319 1358353
50114 1358353 1336417 1309813 1280060 1248643 1216603 1184732 1154163 1126340 1102160 1081377 1063012
50103 1063012 1046247 1030767 1016443 1002943 989730 976367 962749 949101 935756 923046 911396
50092 911396 901368 893428 887792 884730 884853 888609 895354 903378 911268 919050 927684 937694 948746 960392
50078 960392 972521 984818 996401 1006554 1015544 1024134 1032313 1039095 1043743 1046692 1048880 1050457 1050709
50065A050709j528k857l542m346n829p526q565q728q489q190p743p175o952p397
50051I61842q037p936o614m435k121j68J393K900M781P099R357J0952J1819J2389
50037I93221J3002J3680J4430J5257J5780J5359J3932J2247J0958R860Q455O861
50025A143042N549M479L176J638M78R3K37N57J057J865K890L910M632M617L628
50010A181848K142J057P92J079J714K868M379N373N066L509J176j797n398r247
49996A194561j2843j6014j8650k0298k0644k0160j9673j9413j9032j8387j7700
49985I91747j7124j6712j6812j7784j9276k0422k0766k0512j9823j8603j7050
49974G86863j5715j4797j3951j2929j1844j0566q697o515n213n500o566p046o620
$$ plain form
50065 1050709 1049181 1046324 1042782 1038436 1032607 1025081 1016516 1007788 999299 991109 983366 976191 969239 961842
50051 961842 953805 945869 939255 934820 932699 932531 933924 936824 941605 948704 958061 969013 980832 993221
50037 993221 1006223 1019903 1034333 1049590 1065370 1080729 1094661 1106908 1117866 1127726 1136181 1143042
50025 1143042 1148591 1153070 1156246 1157884 1158362 1158455 1158692 1159249 1160306 1162171 1165061 1168971 1173603 1178220 1181848
50010 1181848 1183990 1185047 1185839 1186918 1188632 1191500 1195879 1201252 1206318 1209827 1211003 1209206 1203808 1194561
49996 1194561 1181718 1165704 1147054 1126756 1106112 1085952 1066279 1046866 1027834 1009447 991747
49985 991747 974623 957911 941099 923315 904039 883617 862851 842339 822516 803913 786863
49974 786863 771148 756351 742400 729471 717627 707061 698364 691849 686636 681136 674570 667524 660904
49961F60904n933n425m982m525m069l302j852l8J432K550M098O418Q743J0176
49947F64195J0754J1036J1030J0185Q317O050M241L227K776K480K071J452N40
49934G38354q42k939n863r397j2906j5516j6601j6222j5018j3572j2065j0540
49922F06873r187q019o576m492k240p34j49K59R87J554J314M71k36m44j99O73
49906E79855K446M801O852Q025Q504Q746R052R687J0883J2374J3360J3268J2296
49893G00149J0934R268P154M799K678Q84j021l417o135q673j0676j2079j2932
49880F80933j3202j2832j2042j1380j1245j1306j0739r233p471o295n698n030
49868E64460l989k869j904r54L5Q23J345J973L029M327N526O605P708Q803R823
$$ plain form
49961 660904 654971 649546 644564 640039 635970 632668 630816 630778 632210 634760 638858 645276 654019 664195
49947 664195 674949 685985 697015 707200 715517 721567 725808 729035 731811 734291 736362 737814 738354
49934 738354 737512 734573 728710 719313 706407 690891 674290 658068 643050 629478 617413 606873
49922 606873 597686 589667 583091 578599 576359 575625 575476 575735 576722 578276 579590 580061 579825 579381 579182 579855
49906 579855 582301 587102 593954 601979 610483 619229 628281 637968 648851 661225 674585 687853 700149
49893 700149 711083 720351 727505 732304 734982 735866 734845 731428 725293 716620 705944 693865 680933
49880 680933 667731 654899 642857 631477 620232 608926 598187 588954 581483 575188 569490 564460
49868 564460 560471 557602 555698 554744 554779 555602 556947 558920 561949 566276 571802 578407 586115 594918 604741
49853F04741J0877J1993J2849J3172J3173J3039J2294J0317P545N368M506M113
$$ plain form
49853 604741 615618 627611 640460 653632 666805 679844 692138 702455 710000 715368 719874 723987
$$ [...]
##END NTUPLES=NMR SPECTRUM
##END=
