##TITLE=AC1595_CASAH13325_8314296_jPeCuXUwKw
##JCAMPDX= 6.0         $$ Bruker NMR JCAMP-DX V2.0
##DATA TYPE= NMR SPECTRUM
##DATA CLASS= NTUPLES
##ORIGIN= BRUKER
##OWNER= Administrator
$$ 1.72 TOPSPIN		Version 2.1
$$ 2013-11-09 13:00:38.589 -0800  Administrator@X
$$ Compression mode = diff/dup
##.OBSERVE FREQUENCY= 400.02188249412
##.OBSERVE NUCLEUS= ^1H
##.ACQUISITION MODE= SIMULTANEOUS (DQD)
##.ACQUISITION SCHEME= undefined
##.AVERAGES= 8
##.DIGITISER RES= 22
##SPECTROMETER/DATA SYSTEM= spect
##.PULSE SEQUENCE= zg30
##.SOLVENT NAME= COFFEE_meoh
##.SHIFT REFERENCE= INTERNAL, COFFEE_meoh, 1, 14.98509
##AUDIT TRAIL= $$ (NUMBER, WHEN, WHO, WHERE, PROCESS, VERSION, WHAT)
$$ ##TITLE= Audit trail, TOPSPIN		Version 2.1
$$ ##JCAMPDX= 5.01
$$ ##ORIGIN= Bruker BioSpin GmbH
$$ ##OWNER= Administrator
$$ $$ E:\/data/COFFEE/nmr/AC1595_CASAH13325_8314296_jPeCuXUwKw/10/pdata/1/auditp.txt
$$ ##AUDIT TRAIL=  $$ (NUMBER, WHEN, WHO, WHERE, PROCESS, VERSION, WHAT)
(   1,<2013-11-09 13:00:31.355 -0800>,<Administrator>,<X>,<go>,<TOPSPIN 2.1>,
      <created by zg
	started at 2013-11-09 12:59:25.558 -0800,
	POWCHK enabled, PULCHK disabled,
       configuration hash MD5:
       C8 4E 4E 5D D3 5C D8 9E 9F 52 82 E0 59 8A DE 15
       data hash MD5: 64K
       E4 1E 7F 4E 67 9D BD 42 B5 0C 39 09 B5 12 CC 39>)
(   2,<2013-11-09 13:00:34.355 -0800>,<Administrator>,<X>,<proc1d>,<TOPSPIN 2.1>,
      <Start of raw data processing
       efp LB = 0 FT_mod = 6 PKNL = 1 PHC0 = 0 PHC1 = 0 SI = 32K 
       data hash MD5: 32K
       BB 25 3F 84 03 D5 9C 5E 8E A8 52 F2 7F 21 22 B8>)
(   3,<2013-11-09 13:00:34.636 -0800>,<Administrator>,<X>,<proc1d>,<TOPSPIN 2.1>,
      <pk PHC0 = 90.98328 PHC1 = 0 
       data hash MD5: 32K
       6A 75 47 DB 77 49 08 C0 29 77 89 D5 D6 3B 36 D0>)
(   4,<2013-11-09 13:00:34.777 -0800>,<Administrator>,<X>,<proc1d>,<TOPSPIN 2.1>,
      <abs ABSG = 1 
       data hash MD5: 32K
       A4 FB 89 44 4C CF 1E AA 05 82 16 32 3C 06 05 16>)
(   5,<2013-11-09 13:00:34.855 -0800>,<Administrator>,<X>,<proc1d>,<TOPSPIN 2.1>,
      <abs ABSG = 2 
       data hash MD5: 32K
       F7 E5 45 A6 76 8E E8 93 2D 42 1A B8 86 93 47 25>)
(   6,<2013-11-09 13:00:34.964 -0800>,<Administrator>,<X>,<proc1d>,<TOPSPIN 2.1>,
      <abs ABSG = 3 
       data hash MD5: 32K
       78 04 CC AF B3 CE 90 5D 8D 36 FC C7 3B 0E CD E6>)
(   7,<2013-11-09 13:00:35.027 -0800>,<Administrator>,<X>,<proc1d>,<TOPSPIN 2.1>,
      <abs ABSG = 4 
       data hash MD5: 32K
       46 F6 27 02 4F 2C C1 06 F7 EF 8A 0C 17 18 30 08>)
(   8,<2013-11-09 13:00:35.105 -0800>,<Administrator>,<X>,<proc1d>,<TOPSPIN 2.1>,
      <abs ABSG = 5 
       data hash MD5: 32K
       BA 59 B6 E4 F1 24 0E FF 07 5E 8D 02 B3 78 C4 46>)
$$ ##END=
$$ 
$$ $$ hash MD5
$$ $$ AF 11 CF 00 53 1D EA 78 3E 3B DE 29 8E E1 1E 26
##$RELAX= 
##$RELAX= 
##$RELAX= 
##$RELAX= 
##$RELAX= 
##$RELAX= 
##$RELAX= 
$$ Bruker specific parameters
$$ --------------------------
##$DU= <E:\>
##$EXPNO= 10
##$NAME= <AC1595_CASAH13325_8314296_jPeCuXUwKw>
$$ [...]
##$TP= (0..7)
150 150 150 150 150 150 150 150
##$TP07= 0
##$TPNAME0= <>
##$TPNAME1= <>
##$TPNAME2= <>
##$TPNAME3= <>
##$TPNAME4= <>
##$TPNAME5= <>
##$TPNAME6= <>
##$TPNAME7= <>
##$TPOAL= (0..7)
0.5 0.5 0.5 0.5 0.5 0.5 0.5 0.5
##$TPOFFS= (0..7)
0 0 0 0 0 0 0 0
##$TUNHIN= 0
##$TUNHOUT= 0
##$TUNXOUT= 0
##$USERA1= <user>
##$USERA2= <user>
##$USERA3= <user>
##$USERA4= <user>
##$USERA5= <user>
##$V9= 5
##$VALIST= <valist>
##$VCLIST= <CCCCCCCCCCCCCCC>
##$VD= 0
##$VDLIST= <DDDDDDDDDDDDDDD>
##$VPLIST= <PPPPPPPPPPPPPPP>
##$VTLIST= <TTTTTTTTTTTTTTT>
##$WBST= 1024
##$WBSW= 4
##$XGAIN= (0..3)
0 0 0 0
##$XL= 0
##$YL= 0
##$YMAX_a= 586849
##$YMIN_a= -508450
##$ZGOPTNS= <>
##$ZL1= 120
##$ZL2= 120
##$ZL3= 120
##$ZL4= 120
##$ABSF1= 14.98509
##$ABSF2= -5.573092
##$ABSG= 5
##$ABSL= 3
##$ALPHA= 0
##$AQORDER= 0
##$ASSFAC= 0
##$ASSFACI= 0
##$ASSFACX= 0
##$ASSWID= 0
##$AUNMP= <proc_prof1d_extract_pilot.lims>
##$AXLEFT= 0
##$AXNAME= <>
##$AXNUC= <1H>
##$AXRIGHT= 0
##$AXTYPE= 0
##$AXUNIT= <>
##$AZFE= 0.1
##$AZFW= 0.1
##$BCFW= 0
##$BC_mod= 0
##$BYTORDP= 0
##$COROFFS= 0
##$CY= 15
##$DATMOD= 1
##$DC= 0
##$DFILT= <>
##$DTYPP= 0
##$F1P= 0
##$F2P= 0
##$FCOR= 0.5
##$FTSIZE= 32768
##$FT_mod= 6
##$GAMMA= 0
##$GB= 0
##$INTBC= 1
##$INTSCL= 1
##$ISEN= 128
##$LB= 0
##$LEV0= 0
##$LPBIN= 0
##$MAXI= 10000
##$MC2= 0
##$MEAN= 0
##$ME_mod= 0
##$MI= 0
##$NCOEF= 0
##$NC_proc= -8
##$NLEV= 6
##$NOISF1= 0
##$NOISF2= 0
##$NSP= 0
##$NTH_PI= 0
##$NZP= 0
##$OFFSET= 14.98509
##$PC= 1
##$PHC0= 90.98328
##$PHC1= 0
##$PH_mod= 1
##$PKNL= yes
##$PPARMOD= 0
##$PPDIAG= 0
##$PPIPTYP= 0
##$PPMPNUM= 2147483647
##$PPRESOL= 1
##$PSCAL= 4
##$PSIGN= 0
##$PYNMP= <proc.py>
##$REVERSE= no
##$SF= 400.02
##$SI= 32768
##$SIGF1= 0
##$SIGF2= 0
##$SINO= 400
##$SIOLD= 32768
##$SPECTYP= <>
##$SREGLST= <1H.CDCl3>
##$SSB= 0
##$STSI= 32768
##$STSR= 0
##$SW_p= 8223.68421052631
##$SYMM= 0
##$S_DEV= 0
##$TDeff= 65536
##$TDoff= 0
##$TI= <>
##$TILT= no
##$TM1= 0
##$TM2= 0
##$TOPLEV= 0
##$USERP1= <user>
##$USERP2= <user>
##$USERP3= <user>
##$USERP4= <user>
##$USERP5= <user>
##$WDW= 1
##$XDIM= 32768
##$YMAX_p= 464749730
##$YMIN_p= -664297
##$CURPLOT= <Network HP LaserJet P1505>
##$CURPRIN= <$Network HP LaserJet P1505>
##$DFORMAT= <normdp>
##$LAYOUT= <+/1D_H.xwp>
##$LFORMAT= <normlp>
##$PFORMAT= <normpl>
##$SURQMSG= 1
$$ End of Bruker specific parameters
$$ ---------------------------------
##NTUPLES= NMR SPECTRUM
##VAR_NAME=  FREQUENCY,     SPECTRUM/REAL,   SPECTRUM/IMAG
##SYMBOL=    X,             R,               I
##VAR_TYPE=  INDEPENDENT,   DEPENDENT,       DEPENDENT
##VAR_FORM=  AFFN,          ASDF,            ASDF
##VAR_DIM=   32768,         32768,           32768
##UNITS=     HZ,            ARBITRARY UNITS, ARBITRARY UNITS
##FACTOR=    0.250966925370066, 1,           1
##FIRST=     8223.43324360094, 49026,        -37612
##LAST=      0,             -159357,         67713
##MIN=       0,             -664297,         0
##MAX=       8223.43324360094, 464749730,    0
$$ Real data points
##PAGE= N=1
##DATA TABLE= (X++(R..R)), XYDATA
$$ [...]
19578A35660a49909g2947k46905J38286A48111C1491b19286L1405E2672d29551
19567a2385A24804l1121b93315o3200f9557J9619A90976A9500M544d43616A64081
19555A46312c20010k2635A15839b81764a8883b572k41380A11607m9090k4863h4342
19543e7996q5869m50221A60292b31358a09019A7749J60511J353a47218n4551A93081
19531b5162p918Q768F1546f3553E175b53B9526d69300E1261b23431M1969j298
19519a82760f8159A73843G8948b71695e5680m2878M31H7823a13857A95952a77859
19507e4432A66677b32100A6432Q55M002K02495G7503B0410J38972K1570h1104
19495a25367p0478b2686j6718O484A36649b15131L7433g9310B07083b31778Q8998
$$ plain form
19578 135660 -149909 -72947 -319852 -181566 148111 31491 -219286 -187881 52672 -429551
19567 -12385 124804 93683 -293315 -356515 -69557 -49938 190976 19500 24044 -443616 164081
19555 146312 -320010 -342645 115839 -281764 -18883 -2572 -243952 111607 62517 37654 -84342
19543 -57996 -143865 -594086 160292 -231358 -109019 17749 178260 179613 -147218 -201769 193081
19531 -25162 -33080 -24312 61546 -63553 5175 -253 29526 -469300 51261 -223431 -181462 -182760
19519 -182760 -68159 173843 78948 -271695 -55680 -98558 -98127 87823 -113857 195952 -177859
19507 -54432 166677 -232100 16432 17287 21289 223784 77503 20410 159382 180952 -81104
19495 -125367 -195845 -22686 -39404 -32920 136649 -215131 -177698 -79310 207083 -231778 -142780
19484a42780j79785D8503b97842b9644A7548N4673a52292G565a57815C66265a61829
19472G4724a45519N7493B22803j01064D0035Q5831a08344A42287a03986m9785
19462a53771a9539l9526j19156P1288o4785G0413J32096i9341F9821a4702j8976
19451c3678j6521J8846k196f942B49269b01631J2564m6158J17408J6458l04427
19440d05786h6098B2496b51485a04616q0574D0658f757o4435n2913l1681d051
19428e2059k9152k6961a1388k12212C3555q360d3583o5985j19257B13053a21291
19416b04669L399Q0376A15334a06605F1644b50144a06400G6057b5520o8795j32190
19405b26505F7387a18949q7592g6362a0172q7714c2484A28342b10747F1617A3910
$$ plain form
19484 -142780 -322565 48503 -297842 -29644 17548 72221 -152292 7565 -157815 366265 -161829
19472 74724 -145519 -88026 222803 121739 40035 125866 -108344 142287 -103986 -153771
19462 -153771 -19539 -59065 -178221 -106933 -171718 70413 202509 -99341 69821 -14702 -33678
19451 -33678 -50199 -31353 -33549 -6942 249269 -201631 -189067 -235225 -117817 -101359 -405786
19440 -405786 -86098 22496 -251485 -104616 -185190 40658 -6757 -71192 -124105 -155786 -4051
19428 -52059 -81211 -108172 -11388 -223600 33555 25195 -43583 -109568 -228825 213053 -121291
19416 -204669 -201270 -120894 115334 -106605 61644 -250144 -106400 76057 -25520 -94315 -226505
19405 -226505 67387 -118949 -206541 -76362 -10172 -97886 -32484 128342 -210747 61617 13910
19393G0556L845b9994A19278B829a81518p5483k4747A90950c71815J71468N6972
19382a43375l1562m200R438k2837E8435d2350F4626B7815J19245b89732i4938
19370B3984d8087b984A94002g6678L2545H3158c2289C292g0229G363a39079C2221
19357f0644A18208n1039R9031E9460k3625K1834k1356L9432K72955f8823p3534
19346a42357N0343c7097A89006J45779c65251a75136n1272n9640J24171c0308
19335a62118J7345A23550g4442I2939b88511C48401b28454D3185M5471a91774
19324g248j01525C60928c9554p1259I7417M5831H798L7736d9755k53655e6583
19312d06001D6044c8855n4830A13351b33943D1723f8527j8417A63835b25427A6382
$$ plain form
19393 70556 74401 -29994 119278 2829 -181518 -257001 -281748 190950 -371815 -200347 -143375
19382 -143375 -174937 -179137 -169699 -192536 58435 -42350 64626 27815 147060 -289732 -94938
19370 23984 -48087 -2984 194002 -76678 -44133 83158 -32289 3292 -70229 7363 -139079 32221
19357 -60644 118208 67169 166200 59460 35835 57669 36313 75745 348700 -68823 -142357
19346 -142357 -92014 -37097 189006 334785 -365251 -175136 -226408 -286048 -161877 -30308
19335 -162118 -144773 123550 -74442 92939 -288511 348401 -228454 43185 88656 -191774
19324 -7248 -108773 360928 -39554 -110813 97417 143248 8798 46534 -49755 -303410 -56583
19312 -406001 46044 -38855 -93685 113351 -233943 41723 -68527 -86944 163835 -225427 16382
19300A23986C145J07754a11302j625E1009D053L9840a23153B69527D3427b62464
19288d512r8771I9999a36922a2752j44327p9839B1467a59556B7540b89650Q7032
19277b02618M4407k5886k27131g6494j22986c3558i30k45334C04552a58988k46108
19266d05096a97490q602d1114k37865J6452Q028G9594b14007a00218j79573b6319
19254E9238J00954h5518n1628B7855i8057m1640E3982i3854j15514H8262b07778
19242a27536A95655a60724C32197e63778i3997A8236a90211G8114J838J5804a09603
19230a961k77482A20063n5617c250F0327a16550A52926b12504f216A51836f589
19218B05717i4955M4988n378B61878j27306c03334a31367d9308C9168f5225j55837
$$ plain form
19300 123986 3145 110899 -111302 -112927 51009 4053 43893 -123153 269527 43427 -262464
19288 -4512 -103283 99999 -136922 -12752 -157079 -236918 21467 -159556 27540 -289650 -202618
19277 -202618 -158211 -184097 -411228 -76494 -199480 -33558 -930 -246264 304552 -158988 -405096
19266 -405096 -197490 -206092 -41114 -278979 -262527 -254499 79594 -214007 -100218 -279791 -26319
19254 59238 160192 -85518 -137146 27855 -98057 -139697 53982 -93854 -209368 88262 -207778
19242 -127536 195655 -160724 332197 -563778 -93997 18236 -190211 78114 79952 95756 -109603
19230 -1961 -279443 120063 64446 -3250 60327 -116550 152926 -212504 -6216 151836 -6589
19218 205717 -94955 -49967 -55345 261878 134572 -303334 -131367 -49308 39168 -65225 -221062
19207b21062F4845N2141a12389l2625A01502a48818j84244A37575K26875a2336
19196I7308a26697A81162d25235g4400G976N0319j6110e0302k60769A64871h4376
19184b13309b0941c894j65101B97732a080k23938J06174l3804p9691N127j93678
19173d20890B7068K87792j54178J92100A50703a54851A69779a51985r4076L8472
19163b07589B0457a38807p2569d3695j64764k5573b3886j0839j7497l28874d6976
19151a48813F0910e1770A08734m1423a31520J4816j57126b7113j090k45303e067
19139e51405E1759d38174I4084b75175q3667A32584a46323G2545a44539a3257
19128B7936A3576a51777a8496m11844a64879L5076e7870j21217h4494D0940b4962
$$ plain form
19207 -221062 64845 116986 -112389 -145014 101502 -148818 -333062 137575 364450 -12336
19196 97308 -126697 181162 -425235 -74400 7976 58295 42185 -50302 -311071 164871 -84376
19184 -213309 -20941 -3894 -168995 297732 -1080 -225018 -118844 -152648 -232339 -227212 -420890
19173 -420890 27068 314860 160682 352782 150703 -154851 169779 -151985 -246061 -207589
19163 -207589 20457 -138807 -211376 -43695 -208459 -234032 -23886 -34725 -52222 -381096 -46976
19151 -148813 60910 -51770 108734 67311 -131520 -116704 -273830 -27113 -28203 -273506 -5067
19139 -551405 51759 -438174 94084 -275175 -358842 132584 -146323 72545 -144539 -13257
19128 27936 13576 -151777 -18496 -430340 -164879 -129803 -57870 -179087 -84494 40940 -24962
19116e76610C6749b79808F0197b52900a20815B45719c7988l14751D10003H4108
19105A06492G505J24903b12793k68447F8248a55725N994b3701j65812i4043l388
19094i7431H1115g2634B11405b53145m6141E3787b81404f4194p1484D5833e4267
19082B35225I8867b36345L4738B40399b4276C7791g9351B11515n4404a11343C1567
19070A15193a2218H9186b07978H4279c40732a61948o1191A99402A7353K5830c54896
19058B25208b24179a00953k71139A1586f0836A4983J02497b6060C4235O7853b41297
19046A44518D6317O5326n181P592A6822J9707e592k65260i9149C22484A28898
19034a39885e7036C9273J81300c90920H8518e4521m7822l1987R287A595N7626
$$ plain form
19116 -576610 36749 -279808 60197 -252900 -120815 245719 -37988 -352739 410003 84108
19105 106492 7505 132408 -212793 -481240 68248 -155725 -149731 -23701 -189513 -94043 -97431
19094 -97431 81115 -72634 211405 -253145 -299286 53787 -281404 -64194 -135678 45833 -54267
19082 235225 98867 -236345 -201607 240399 -24276 37791 -79351 211515 157111 -111343 31567
19070 115193 -12218 89186 -207978 84279 -340732 -161948 -223139 199402 17353 43183 -354896
19058 225208 -224179 -100953 -372092 11586 -60836 14983 117480 -26060 34235 102088 -241297
19046 144518 46317 111643 106462 114054 16822 36529 -5592 -270852 -99149 322484 128898
19034 -139885 -57036 39273 220573 -390920 88518 -54521 -102343 -134330 -125043 1595 59221
19023E9221K48598c5199A36252A1373K09491f0864A20564A7055J95605e2946n1268
19012a04214k1046G4189a17370I7537i0851k18900G8518Q1973l5930c14562j30230
19001d44792B12314l5846k9283a48450m39470F7159a18847K0181j56568C6123
18990E7494e60395A20778a6037l5848n728K7263q6550A26317b2339k49012O1120
18979b10231P5031j24891O3848G1961a05590l9884M6514M7469j85782J16495H8717
18967a76090B25551R6310h2090E8325c23087A50009E0718b72965D4423L22619
18957C67042F0788c80201K8984a33795A66925D8272R5498a39604B42614A14283
18946a37654A07837h3882A4135R4712e63827H681b5759A59189Q6631b67495g0149
$$ plain form
19023 59221 307819 -35199 136252 11373 220864 -60864 120564 17055 212660 -52946 -104214
19012 -104214 -125260 74189 -117370 97537 -90851 -309751 78518 160491 124561 -314562 -444792
19001 -444792 212314 176468 147185 -148450 -587920 67159 -118847 -98666 -255234 36123
18990 57494 -560395 120778 -16037 -51885 -57613 -30350 -116900 126317 -22339 -271351 -210231
18979 -210231 -135200 -260091 -196243 71961 -105590 -145474 -98960 -51491 -237273 -120778 88717
18967 -176090 225551 321861 -82090 58325 -323087 150009 50718 -272965 44423 367042
18957 367042 60788 -380201 -351217 -133795 166925 48272 143770 -139604 242614 114283
18946 -137654 107837 -83882 14135 108847 -563827 8681 -25759 159189 245820 -267495 -70149
18934b33305n7536J40977A26036a40228n5329p4394j51931A84362E632c3574B31221
18922b59949j20716E7909b79374A23487h0926D246i7121F2151b27420A90566b77788
18910d09p3509A75847C7295b28352M7053j92190E5192i119H6316b91759J32131
18899a59628L9276D3255K38150c5475A0999d5127A62052i3410m3629j74082P0214
18888b40907g5979I3539b01305k0788j21192B7616b73159f907j20411o5033B90957
18876A07657b89128J28381B38680d96515i0991K1971B2201c99874A42120F3317
18865A10683C9578Q82c35770e6770l88929C4256a16021r8045A51144n6971a09726
18853D72184C2448a53871D6193g1391C985a56213j01086D69581A64749a5781l83266
$$ plain form
18934 -233305 -290841 -149864 126036 -140228 -195557 -269951 -421882 184362 5632 -33574 231221
18922 -259949 -380665 57909 -279374 123487 -80926 4246 -97121 62151 -227420 190566 -277788
18910 -409 -73918 175847 37295 -228352 -181299 -373489 55192 -9119 86316 -291759 -159628
18899 -159628 -120352 43255 281405 -35475 10999 -45127 162052 -93410 -137039 -311121 -240907
18888 -240907 -75979 93539 -201305 -222093 -343285 27616 -273159 -6907 -127318 -192351 290957
18876 107657 -289128 -160747 238680 -496515 -90991 -69020 22201 -399874 142120 63317
18865 110683 39578 40460 -335770 -56770 -445699 34256 -116021 -214066 151144 94173 -109726
18853 472184 32448 -153871 46193 -71391 3985 -156213 -257299 469581 164749 -15781 -399047
18842c99047a30600e739K709B16494d5643o4007G8264a10542b7877q3256A82900
18830a73352C7050b05689K4132O6114H1140b17837d8479k1225m1427A98763n9919
18819A38844B6336J03504D5978J2152j3537J25205F717L83069A15675k974L0091
18808A42792o917a437A34020e9406a656j50189A70428G0104K732R2478n6755m4773
18796F3786K15673A34763d4208a8579k01308j0258Q3023A79785E1690L79426b59999
18784g4644L2737B3753O5766a14968K3792A2202h7572H24a14832j35138a6561
18772A50098H19a84525P3025c5969k37095A30195E5610a47826B06117H742J72251
18761A80993a31466p8898q3289F7666a66631K7721E6300g2644A49164a72426G0913
$$ plain form
18842 -399047 -130600 -5739 -3030 216494 -45643 -109650 78264 -110542 -27877 -111133 182900
18830 -173352 37050 -205689 -181557 -115443 81140 -217837 -48479 -69704 -111131 198763 138844
18819 138844 26336 129840 45978 58130 44593 169798 6717 389786 115675 112701 142792
18808 142792 135875 -1437 134020 -59406 -1656 -151845 170428 70104 72836 165314 108559 63786
18796 63786 279459 134763 -44208 -18579 -219887 -230145 -147122 179785 51690 431116 -259999
18784 -74644 -41907 23753 89519 -114968 -91176 12202 -87572 824 -114832 -249970 -16561
18772 150098 819 -184525 -111500 -35969 -273064 130195 55610 -147826 206117 8742 180993
18761 180993 -131466 -210364 -293653 67666 -166631 -138910 56300 -72644 149164 -172426 70913
18749b7794a0179A4174K19368g6332A4161b03149c2974E2713b54350i9183j21466
18738b20649H1263B7801a9027p7616k33220G2503a80415J4469O4023B79951E7727
18726a79981A45813h0827k43029a55627A87009c6696O834l210l47711A75033b90154
18714a13859A53526O9738b78795k81164J79858J32210A53691a17621K5235k50609
18704c42995c0513A3654a37299e4878A30398A4029L44586i4870m04039K03605
18694b95304J23396D7587a07977m7578P265F4841P729a54223A02950a13646K5783
18683h7863C69117b47376a00819A19230b15227g9365j56955B51936A14508b10436
18672i8584j87486C001c04098a05832J9880A31561P3828c09008n1808A26987g5000
$$ plain form
18749 -27794 -10179 14174 233542 -76332 14161 -203149 -32974 52713 -254350 -99183 -220649
18738 -220649 81263 27801 -19027 -96643 -329863 72503 -180415 -165946 -101923 279951 57727
18726 -179981 145813 -80827 -323856 -155627 187009 -36696 -29862 -33072 -380783 175033 -290154
18714 -113859 153526 223264 -278795 -559959 -380101 -247891 153691 -117621 -92386 -342995
18704 -342995 -30513 13654 -137299 -54878 130398 14029 358615 -94870 -498909 -295304
18694 -295304 -171908 47587 -107977 -155555 -148290 64841 72570 -154223 102950 -113646 -87863
18683 -87863 369117 -247376 -100819 119230 -215227 -79365 -236320 251936 114508 -210436
18672 -98584 -286070 3001 -304098 -105832 -85952 131561 205389 -309008 -360816 126987 -75000
18660b20916B74571f0418C6106A867a18681j87141c8525D0854c12148a36952D36540
18648a42375A71600A9609f800j77381E6712g2768m3785B61379h8955M3206A55238
18636a40606r9836c9956D0484R3780i9219j18704J2722F3161b83438J18048C02981
18624A37203A4349g3537K9902D9894b14968p4423h956D4121E246a73481k1762
18613a95243A27994h45j72297B39236G4525a48338B54876A27151K79522i0042
18602a09881l02391J62773B67818d66n9544j09497j96865A05179K80578I4214
18591a52050n5242F7538k4019a80732E1925b30653c1093n4065k24919C29498F100
18579b55556l0799A56780b7649p1762B5270c68327a5711o1734B91852b3857j69039
$$ plain form
18660 -220916 274571 -60418 36106 1867 -118681 -305822 -38525 40854 -312148 -136952 436540
18648 -142375 171600 19609 -6800 -184181 56712 -72768 -116553 261379 -88955 -45749 155238
18636 -140606 -240442 -39956 40484 134264 -99219 -217923 -205201 63161 -283438 -165390 302981
18624 137203 14349 -73537 -43635 49894 -214968 -289391 -8956 44121 5246 -173481 -195243
18613 -195243 127994 -845 -173142 239236 74525 -148338 254876 127151 406673 -90042
18602 -109881 -412272 -249499 267818 -466 -60010 -169507 -366372 105179 385757 94214
18591 -152050 -207292 67538 43519 -180732 51925 -230653 -31093 -85158 -310077 329498 6100
18579 -255556 -286355 156780 -27649 -99411 25270 -368327 -15711 -77445 291852 -23857 -192896
18568a92896A05268b03333i3321B3845L7339e8755I9420D3513R7128B5143e9136
18556c01857c1583A95343a50949m8741k5598B57441A10630a66455K8574j29921
18546b67802A40256C3037J59029c07464a3541j86273M2993I6625C650a65461G2447
18534a4269B60028p0098d9555o9548E6085N0347O8560c2678l55098l2075g9993
18522bA76464a20886m4254Q151j8691A1860e36124J85839i076D10168r1075i2585
18509a9250b71r4113G0736i7534k11237J45441k12059J30676G6205N7910g3721
18497d3254l33561A99231d5432B99935h6665a330j55156p1219J07582K7859j22922
18486b15186I8612J51435i7444J0180D0583d3287l41661a68017q1247a1627j14474
$$ plain form
18568 -192896 105268 -203333 -93321 23845 61184 -58755 99420 43513 140641 25143 -59136
18556 -301857 -31583 195343 -150949 -199690 -225288 257441 110630 -166455 -137881 -267802
18546 -267802 140256 33037 192066 -307464 -13541 -199814 -156821 96625 3650 -165461 72447
18534 -14269 260028 189930 -49555 -119103 56085 106432 174992 -32678 -387776 -419851 -79993
18522 -2 176464 -120886 -165140 -156989 -175680 11860 -536124 -350285 -9076 410168 319093 -92585
18509 -19250 -271 -94384 70736 -97534 -308771 -163330 -375389 -244713 76205 134115 -73721
18497 -43254 -376815 199231 -45432 299935 -86665 -1330 -156486 -227705 -120123 -92264 -215186
18486 -215186 98612 250047 -97444 -87264 40583 -43287 -384948 -168017 -249264 -11627 -126101
18475a26101j8811C25797a65352d1464p7308K3712B7181a05026J2353A7720J16245
18464A33965C038J12136E2451a7909j5552p7012H3628f7293A401a97513B71405
18452c945j13037K9458c3168C15938b21854h139j62021m3327j54878d9116k41217
18441b90333a1099l04277a11623d0260A56661a23255D5278J2667h2864m8979j24209
18430b56052A39695b72673R0198N1197D8785a25156p3416G8787e4256H7352J31574
18419B18926h0862B03578F478J41399n4103d4762L092j5077k54137h4809F1640
18407a83932k6811c7442G9427K20177a13054N0352j20786k9589i4142d2953q7617
18396a30570B06349d1717A81771a08595n8904a250o2275A40168b10870E7180b501
$$ plain form
18475 -126101 -144912 325797 -165352 -41464 -118772 -95060 27181 -105026 -92673 17720 133965
18464 133965 3038 115174 52451 -17909 -33461 -110473 83628 -67293 1401 -197513 271405
18452 -3945 -116982 -87524 -33168 315938 -221854 -8139 -170160 -213487 -368365 -49116 -290333
18441 -290333 -11099 -315376 -111623 -40260 156661 -123255 45278 57945 -82864 -131843 -256052
18430 -256052 139695 -272673 -182475 -131278 48785 -125156 -198572 78787 -54256 87352 218926
18419 218926 -80862 203578 6478 147877 93774 -44762 -41670 -56747 -310884 -84809 61640
18407 -183932 -210743 -37442 79427 299604 -113054 -62702 -183488 -213077 -94142 -42953 -130570
18396 -130570 206349 -41717 181771 -108595 -167499 -1250 -63525 140168 -210870 57180 -2501
18384i9011H8252a46145P2212J3280A61645h3905q8332j39197h7915A54401a21968
18372G5003I955a98488R5660r6990D11420j46796G0470b18140b5392b640A45017
18360d5533D03874d53003A65926a64004j86c6523j94903B89506a52747P0057B14480
18348b82357A65983B5619a6972A13910P972a21999c9799k60042b2708n070k3260
18337e1038I6268c7268I3173K6723P0988a01718p2279j0509N0337H9014c87140
18325b59360Q1505G4347i2421A99949F2216N7946b63382A02092a70275g3401l6427
18314a09828I5430b5953A70822k8868b06358A09651b38540a02903I0576a0676
18303b62188a06185F193J26972a53675k91617d0982a3278B6810J65082b35638
$$ plain form
18384 -99011 88252 -146145 -73933 -60653 161645 -83905 -172237 -311434 -87915 154401 -121968
18372 75003 9955 -198488 -102828 -199818 411420 264624 70470 -218140 -25392 -2640 145017
18360 -45533 403874 -453003 165926 -164004 -164190 -36523 -231426 289506 -152747 -82690 214480
18348 -282357 165983 25619 -16972 113910 121882 -121999 -39799 -299841 -22708 -27778 -51038
18337 -51038 96268 -37268 93173 119896 190884 -101718 -173997 -184506 -134169 89014 -387140
18325 -259360 -177855 74347 -92421 199949 62216 120162 -263382 102092 -170275 -73401 -109828
18314 -109828 95430 -25953 170822 141954 -206358 109651 -238540 -102903 90576 -10676
18303 -262188 -106185 6193 133165 -153675 -445292 -40982 -13278 26810 191892 -235638
18292b0810k05879a05373A37648a6317q7343m173j77018a05675M6347K1600G734
18280b11657j5178j66819a82448c4980A54894a24954K5470A70197c37888e7834
18269C7564M4694N2721a8740j62582N4786L8174C49508E5031a28029L6412H4260
18257b0055k22799e3194j94820q7576A31162A7683a85728A59217O7105A6580L482
18246B0062a17289b3112l60363B31577a21374l87956F7339J0787M552a27377D9087
18234C39227d1219J5158o704J0573Q936q6178A0519a26795q3189A68649m3882
18223A24767J03165a92672B05842i9691B05771l1178N1911a23753G7780a09062
18212a05870B7218a63368A04839a18426j57444A61851M4420d692B71137j06250
$$ plain form
18292 -20810 -226689 -105373 137648 -16317 -103660 -107833 -284851 -105675 -59328 -37728 7734
18280 -211657 -226835 -393654 -182448 -34980 154894 -124954 -99484 170197 -337888 -57834
18269 37564 82258 134979 -18740 -181322 -126536 -88362 349508 55031 -128029 -91617 84260
18257 -20055 -242854 -53194 -248014 -335590 131162 17683 -185728 159217 226322 16580 20062
18246 20062 -117289 -23112 -383475 231577 -121374 -509330 67339 78126 82678 -127377 49087
18234 339227 -41219 -26061 -32765 -22192 -13256 -99434 10519 -126795 -209984 168649 124767
18223 124767 227932 -192672 205842 -99691 205771 174593 226504 -123753 77780 -109062
18212 -105870 27218 -163368 104839 -118426 -275870 161851 206271 -4692 271137 164887
18202A64887E8596c04305p8620J79977K4427j08471P8283d3751D36289f0922p1893
18191a32815N1350l5478j75671J41909A60512j0176b0197A6670a02871A49554
18180b2842p2237a7287r2702j44510A63878K15953b78839A79033d04982n362C5224
18168b49173B0093R3312a65898b6405k74653c7828B24899E1334P3953a16465H1267
18156e3095j19871j3009a8202k08056A20318b09953B37169j16425j0191K22889
18146C33442b45475A40931a80420a9252B52227i8228K6251A9560J49429e79311
18135e6667j04329A5241h3369a4122j03697B2443d604j10391B96571a55661K0021
18124a35640J0641O1974A6826L8849b45048E6789J61701b63743L8885Q3795C3879
$$ plain form
18202 164887 58596 -304305 -382925 -202948 -178521 -286992 -208709 -43751 436289 -60922 -132815
18191 -132815 -81465 -116943 -292614 -150705 160512 150336 -20197 16670 -102871 149554
18180 -22842 -95079 -17287 -109989 -254499 163878 379831 -278839 179033 -404982 -410344 35224
18168 -249173 20093 113405 -165898 -26405 -301058 -37828 224899 51334 125287 -116465 81267
18156 -53095 -172966 -185975 -18202 -226258 120318 -209953 237169 120744 110553 333442
18146 333442 -245475 140931 -180420 -19252 252227 -98228 -71977 19560 168989 -579311
18135 -56667 -160996 15241 -83369 -14122 -117819 22443 -4604 -114995 296571 -155661 -135640
18124 -135640 -124999 -63025 16826 55675 -245048 56789 218490 -263743 -224858 -141063 33879
18112a55589m0439N7249D9286i3625G7356b15651e5702L926O26D8217a052m45826
18100d46878a21966N0623J318F2461L99537k1076g6746a6407F1007c37552f4618
18088b59443B87123E7516r629K20981A02613b95294A07864f7393p5669J6798J043
18077a25221A71196h7793A27941a90609A62505H0566h5333E0781a32684r413M719
18066a37378A15290D5274A2734g0915A77216H6940l2511b74992f0530e04A2487
18054H6649J76687b98602D2916a4559j14852b1591C6776e8188H0915a12876c2427
18042a41243f5048k65038a20199J7219O437B44916b9798D6089d73317K25741O6539
18031a81037A70326k2057h8277I7905k4756a7676k43221i4197A27389a98494o0829
$$ plain form
18112 -155589 -196028 -138779 49286 -93625 77356 -215651 -55702 -51776 -51150 48217 -1052 -446878
18100 -446878 -121966 -71343 -70025 62461 461998 440922 -76746 -16407 61007 -337552 -64618
18088 -259443 287123 57516 47887 268868 102613 -295294 107864 -67393 -143062 -126264 -125221
18077 -125221 171196 -87793 127941 -190609 162505 80566 -85333 50781 -132684 -142097 -137378
18066 -137378 115290 45274 12734 -70915 177216 86940 54429 -274992 -60530 -504 12487
18054 86649 263336 -298602 42916 -14559 -129411 -21591 36776 -58188 80915 -112876 -32427
18042 -141243 -65048 -330086 -120199 -102980 -96543 244916 -29798 46089 -473317 -247576 -181037
18031 -181037 170326 148269 -88277 97905 73149 -17676 -260897 -94197 127389 -198494 -259323
18020b59323E1746I587a95825P4064A09905a54724j79267N5960f9786J6339j02566
18009a56013I4629K127K96806b75455h3281r0350E4836a45308B63251b79979f4113
17997a62308J4893B7737o435b42797a00538j44415A26916g6791O581m3016n8934
17986a72160A1804M9633a5721l08011c0142j94929A75736a71001d1439D83208
17975c7302A85595d7389A95151M7619a7279A68530c39306A41404n9285r78a99309
17963C0827N0175a55514A64943M6486k0552D109c81996a61754a6342l79449F2245
17951B02940b70807A78227a91935g2821K6164k55293A60741a92373k0797q3744
17941b96914A39797D7888b09559A84873e8832j59050q5102a30344A38039P7502
$$ plain form
18020 -259323 51746 9587 -195825 -121761 109905 -154724 -333991 -278031 -69786 -53447 -156013
18009 -156013 94629 96756 393562 -275455 -83281 -173631 54836 -145308 263251 -279979 -64113
17997 -162308 -147415 27737 21302 -242797 -100538 -244953 126916 -76791 -70210 -113226 -172160
17986 -172160 11804 61437 -15721 -323732 -30142 -225071 175736 -171001 -41439 483208
17975 -37302 185595 -47389 195151 242770 -17279 168530 -339306 141404 82119 81141 -199309
17963 30827 81002 -155514 164943 211429 190877 4109 -381996 -161754 -16342 -395791 62245
17951 202940 -270807 178227 -191935 -72821 -46657 -301950 160741 -192373 -213170 -296914
17941 -296914 139797 47888 -209559 184873 -58832 -217882 -302984 -130344 138039 215541
17931B15541a52409D6356a25382j1439j9845k75041a73299A15298d7561B23603
17920c55501f1395j3590k86491k1375F6392f9586C2018J26821c5323a6752B37
17908B12109a54582K7462A8104a33572F2237b37639i3115a9034q8814k00085E7478
17896h4429A8097K47341a1170j33311m3278h8854j01913f1210j22539g9339B52047
17884c75560c1714F6505b57974c8167j01286B08442d73368a39925a3752r3236
17874a06988K1168p7173A5927J02182A3930J33733f5811B55794a40086g824G9437
17862a74181d0311a3877j33363L7658j9798A19375Q6180C9743J17843a21088b0101
17850A8658c7639J979m18911A06137M5961a52930k60789A41504J07495a16880
$$ plain form
17931 215541 -152409 46356 -125382 -136821 -156666 -431707 -173299 115298 -47561 223603
17920 -355501 -61395 -74985 -361476 -382851 66392 -69586 32018 158839 -35323 -16752 237
17908 212109 -154582 -127120 18104 -133572 62237 -237639 -93115 -19034 -107848 -307933 57478
17896 -84429 18097 265438 -11170 -144481 -187759 -88854 -190767 -61210 -183749 -79339 252047
17884 -375560 -31714 66505 -257974 -38167 -139453 208442 -473368 -139925 -13752 -106988
17874 -106988 -85820 -162993 15927 118109 13930 147663 -65811 255794 -140086 -7824 79437
17862 -174181 -40311 -13877 -147240 -109582 -129380 119375 205555 39743 157586 -121088 -20101
17850 18658 -37639 -35660 -454571 106137 152098 -152930 -413719 141504 248999 -116880
17839a23541a6302j32610j63663A2011K86245p0452G3578J00776b73B7093M580
17828C1673L96566G3916j30K06c0345B91680D0746J67152a60953k7814F2831J5833
17816G8664k2853Q423h1043C0934b69331H3992O8652Q483a78891a1845A59042
17804A88757i1238j18316c9003G5182C6748i1475M1865m0438c6961A76631F1045
17792a39486C25500a15564I7905c17084L0002D2042h3288G1478L7246J03632G2879
17780i4063p6763c5862j4990r0709A08235J01892E8999a63958B274b72298l03668
17769e75966A59481G3465a507j35332l1640D04952a32857O2115O421r6877A2535
17757E7756a76757e1660A1094a91710B53738a23441c7346k73633c4410l7145E6655
$$ plain form
17839 -123541 -16302 -148912 -312575 12011 298256 227804 73578 174354 -273 27093 31673
17828 31673 428239 73916 73786 73992 -30345 291680 40746 207898 -160953 -188767 62831 78664
17816 78664 55811 64234 -81043 30934 -269331 83992 152644 161127 -178891 -11845 159042
17804 188757 -91238 -209554 -39003 75182 36748 -91475 -49610 -90048 -36961 176631 61045
17792 -139486 325500 -115564 97905 -317084 -287082 42042 -83288 71478 108724 212356 72879
17780 -94063 -170826 -35862 -50852 -141561 108235 210127 58999 -163958 2274 -272298 -575966
17769 -575966 159481 73465 -1507 -136839 -168479 404952 -132857 -70742 -64321 -161198 12535
17757 57756 -176757 -51660 11094 -191710 253738 -123441 -37346 -310979 -34410 -71555 56655
17745d9537J7262j09770q6696b5972E2498k1458c06336f0711l812B42395j683
17734B40712g5987B68651a87533a4462k53041B03167N615a66011A14843c8027
17723b9794J0606A12903d2596A1931Q1058a71148C6814i5777j91665E932J505
17712G437M54114b00873b9573j77659P5712I1782a26367d5154B10857q5586M6803
17701A72074B6448b0638k23836K8619A8176a07560q2518a2523A88071l219a69726
17689I549J62964A4273a70182C8781a44721D4942a52378H8179k9471J07075E3869
17677G7682J28282K2121d35367A16358h2261j29698A38956a58843M9972M3023
17667f5848B82433G0360b7704J836F1718J8614K43008A5676J0290a00996o7981
$$ plain form
17745 -49537 -32275 -142045 -228741 -25972 52498 31040 -306336 -60711 -64523 242395 240712
17734 240712 -75987 268651 -187533 -14462 -267503 203167 208782 -166011 114843 -38027
17723 -29794 -19188 112903 -42596 11931 92989 -171148 36814 -95777 -287442 5932 7437
17712 7437 461551 -200873 -29573 -207232 -131520 91782 -126367 -45154 210857 125271 172074
17701 172074 26448 -20638 -244474 -215855 18176 -107560 -190078 -12523 188071 184852 -169726
17689 9549 172513 14273 -170182 38781 -144721 44942 -152378 88179 58708 165783 53869
17677 77682 205964 228085 -435367 116358 -82261 -211959 138956 -158843 -108871 -65848
17667 -65848 282433 70360 -27704 -25868 61718 80332 323340 15676 25966 -100996 -168977
17656a68977e6407k53329B63999b34519A34747m8295a64980G3590d0636n5161
17646i5797l1849K7088O802B40028J29554J4517A61281Q2048q4949c0992r8478
17635a29470I4137d539n6863H5943a00437C08785j09322h4549E7643c0788j98988
17624b29776j29339g1496B12295f3793j20141c018j28090l6927j61214a55333
17613c1961A1283J40673H706b00001e1807j35751h0900b1066A67497d35149A61083
17601B3459d17821P6249B81705q9893m4344a92715o1637L9122J03477G8867H68
17589D1798a04955B60806A5073d8451A02932b38607C01048b9144I6997d0786p223
17578d8009A46095M12172a88081C85014A29423c0234m690B18768L4773M5875D0314
$$ plain form
17656 -168977 -56407 -309736 263999 -234519 134747 86452 -164980 73590 -40636 -95797
17646 -95797 -127646 -100558 -93756 240028 369582 384099 161281 243329 158380 -30992 -129470
17635 -129470 94137 -4539 -61402 85943 -100437 308785 199463 -84549 57643 -30788 -229776
17624 -229776 -359115 -71496 212295 -63793 -183934 -3018 -131108 -168035 -329249 -155333
17613 -31961 11283 151956 8706 -200001 -51807 -187558 -80900 -21066 167497 -435149 161083
17601 23459 -417821 -341572 281705 191812 147468 -192715 -254352 -215230 -111753 78867 868
17589 41798 -104955 260806 15073 -48451 102932 -238607 301048 -29144 96997 -40786 -48009
17578 -48009 146095 558267 -188081 385014 129423 -30234 -34924 218768 253541 299416 40314
17566A59588b0656B50553f8541I6179a13269l6712A80240A8760a30722H7124N3906
17555A41030A8953M25604A57881J571l9840k3682b85635C54432e3931B69933C1587
17543D7798a12341c2746C50943E0393a65439A09529J67423A32670a585G3775c27106
17531H850L55267j79709A5980K13764b68065C35050l397f6530B942L9465e4164
17519b47439j83832C171e1255J3492A27201D7318L52686d4863D1722a84099A86558
17507b48278R5047C607P8084a10849A92359K9042c9177A53875r316n1785K84232
17496C77006k9896a61139G398a52074B73951E6767J66660H4432n618a97182F2479
17484g8224I2213c13300E5011K18893j32947J95976j02425j00221f2108B876Q0716
$$ plain form
17566 159588 -20656 250553 -68541 96179 -113269 -149981 180240 18760 -130722 87124 141030
17555 141030 18953 444557 157881 159452 119612 95930 -285635 354432 -53931 269933 31587
17543 47798 -112341 -32746 350943 50393 -165439 109529 276952 132670 -1585 73775 -327106
17531 8850 364117 184408 15980 229744 -268065 335050 331653 -66530 2942 42407 -54164
17519 -247439 -431271 3171 -51255 -37763 127201 47318 400004 -44863 41722 -184099 186558
17507 -248278 -153231 3607 81691 -110849 192359 221401 -39177 153875 144559 92774 377006
17496 377006 347110 -161139 7398 -152074 273951 56767 223427 84432 78814 -197182 62479
17484 -78224 92213 -313300 55011 273904 140957 336933 234508 134287 -62108 2876 83592
17473H3592L2946J17867b19920A42981a17440l4941M5227l52525B41828j20587
17463A21241R6177f6709D2844J4085b9572C7778c836n0974a9283A37561F7888
17451a20246k4134C31152p6349j2117q8943K69467J37764k06014j13844K37615
17441D78731b7920F3727a22097B1937N8520L81159G0615g4877C42983A33551D6777
17429b22147d2518j4262C4001L48541d7467k08828C25109M9332h4509B52321L5906
17418B88227n4172k805Q8067j33126J64195M5925A07594J39542Q6226A23532C8842
17406A26686J45921A9950K00909a05223E3814P4040a92451g3726r5375F2540b13478
17394f9460n5340K9767B35870N3842a78133q205C38176J1034b90058c1436A5806
$$ plain form
17473 83592 116538 234405 -219920 142981 -117440 -152381 -107154 -459679 241828 121241
17463 121241 217418 -66709 42844 56929 -29572 37778 -3836 -54810 -19283 137561 67888
17451 -120246 -144380 331152 254803 242686 153743 423210 560974 354960 241116 478731
17441 478731 -27920 63727 -122097 21937 80457 461616 70615 -74877 342983 133551 46777
17429 -222147 -42518 -56780 34001 382542 -47467 -256295 325109 374441 -84509 252321 288227
17418 288227 234055 231250 319317 186191 350386 396311 107594 247136 333362 123532 38842
17406 126686 272607 19950 220859 -105223 53814 127854 -192451 -73726 -169101 62540 -213478
17394 -69460 -124800 -95033 235870 289712 -178133 -186338 338176 349210 -290058 -31436 15806
17382a64703C00214L1393j55884k7408K06047D8235D353b937A31162h3864j70240
17371b54104c2956A57345k4985K4758K39635C6233J50279O901i5383A41374A7037
17359G1984K6497h3795E6750J02263J63600e4833A66483m8877b7858B97570I3753
17347C37940C1352J10990a81138A15030J27156a75640B03234D9660a08790M1360
17337f7430A79130F8483A6163J58816a85033B31037o8083a19569A59048c18460
17326I3108P8518E6933c9535a3924k07785C1853O9925e0193I5728q525A3352b56088
17313C8526K12695a81136A72905a75612B21690a57970A4926K01767I8564O9530
17303A68094G5495J21511o4280L9535f8186B51257I5674L1716m2153K87133E9039
$$ plain form
17382 -164703 300214 331607 175723 148315 354362 48235 4353 -2937 131162 -83864 -254104
17371 -254104 -32956 157345 132360 157118 396753 36233 186512 193413 -95383 141374 17037
17359 71984 98481 -83795 56750 159013 322613 -54833 166483 117606 -27858 297570 93753
17347 337940 31352 142342 -181138 115030 242186 -175640 203234 49660 -108790 -67430
17337 -67430 179130 68483 16163 174979 -185033 231037 162954 -119569 159048 -318460
17326 93108 171626 56933 -39535 -13924 -221709 31853 101778 -50193 95728 87203 13352 -256088
17313 38526 251221 -181136 172905 -175612 221690 -157970 14926 216693 98564 168094
17303 168094 75495 197006 132726 172261 -68186 251257 95674 127390 85237 372370 59039
17291g834A12031L53332O2895d8606A71923G6426a40936N5888A46720m8290L81537
17280D79967P1447B09942c3356A52065n7705a91605B37797j2728J89230b6445
17269B75599j4393K1237H237K60797j33057b52065D947J58001h5355D3019a4122
17257B51992g4516A81778K02644K8908j42354R4065A64976l2602a31575G2993
17246E7178N4997N8922R3227B0373J83555I6713J06879G1672J46962e708j2120
17235a7828A98096a77925P8364G3407a3330A45828A3457a85859A86590G4978J92443
17224B67421F2646a8683A14123A7679K79042A25018O3608K72064D2291h3297b8019
17212A81354n1900K9015b6146C8809K5497B7698P0201h0356j29E2192J98607J02784
$$ plain form
17291 -7834 112031 465363 528258 -48606 171923 76426 -140936 -85048 146720 98430 479967
17280 479967 551414 209942 -33356 152065 94360 -191605 237797 225069 414299 -26445
17269 275599 261206 282443 8237 269034 135977 -252065 4947 162948 -85355 43019 -14122
17257 251992 -74516 181778 384422 413330 270976 365041 164976 132374 -131575 72993
17246 57178 112175 171097 264324 20373 203928 96713 203592 71672 218634 -5708 -17828
17235 -17828 198096 -177925 -99561 73407 -13330 145828 13457 -185859 186590 74978 267421
17224 267421 62646 -18683 114123 17679 296721 125018 188626 460690 42291 -83297 -28019
17212 181354 129454 158469 -26146 38809 64306 27698 97899 -80356 -80485 52192 250799 353583
17200C53583j60342a77444B88154L0191d1315G4920g3012C49402I3270L55475
17190D48745j27433A59140l6525n0732K54720A07934K28653A48984J18348A3540
17179B66827J08457c2637B18263J85630M6853k16884n0613r23J75647A51076a529
17167A65123O730j6468J43424j43028L49530I5379B9279K63643A23078A8192M29860
17156D48052A57602G7088J35232M0487a55769B82472o7857J10216j9157Q3921
17146C89595A79181Q2238q2040J19181L7751A05152L64078H4349L19625j32613
17136B71361m1779a65867A15517a32969D75950j2952k27741a85981G1977N28083
17126F00060B97079C7827K75987C3902L63180e760A40290J64179F6216K99042
$$ plain form
17200 353583 193241 -177444 288154 318345 -41315 74920 -73012 349402 93270 448745
17190 448745 321312 159140 122615 71883 326603 107934 336587 148984 267332 13540
17179 266827 375284 -32637 218263 403893 450746 233862 183249 182326 357973 151076 -1529
17167 165123 171853 155385 298809 155781 505311 95379 29279 292922 123078 18192 448052
17156 448052 157602 77088 212320 252807 -155769 282472 214615 324831 305674 389595
17146 389595 179181 261419 179379 298560 336311 105152 469230 84349 403974 271361
17136 271361 229582 -165867 115517 -132969 475950 462998 235257 -185981 71977 600060
17126 600060 297079 37827 313814 33902 397082 -5760 140290 304469 66216 365258
17116C65258E0020K30087M8771j06966o9155F3182G895M69044j21822n9389q5633
17105B10095L16815F3182J23624K1515L1377J14759J42088A34137J04595K69058
17095E07790k0332J68086k59290J01676Q947A56741L9083A4541Q7024N6775b9338
17083C13025j01007F6867B1688J44137K85414j16909K06060A79067M49747j40047
17073D88767k5155B23049L3916a07885A68215J58731K6563J26574A97423J13530
17063C10953q3113J22464q6127N0251q6226O7923L02203o6154L4332B77511j9377
17052B58134N8950J94498B50010P5094j59776a09462D38346K96073A33399M15135
17042E48534j46886p9607M03393l61661J76647B63156K98035B45829r6462J42799
$$ plain form
17116 365258 50020 280107 328878 221912 152757 63182 7895 476939 355117 295728 210095
17105 210095 526910 63182 186806 208321 239698 354457 496545 134137 238732 507790
17095 507790 487458 655544 396254 497930 506877 156741 195824 14541 101565 158340 -29338
17083 313025 212018 66867 21688 165825 451239 334330 540390 179067 628814 488767
17073 488767 463612 223049 256965 -107885 168215 326946 353509 480083 197423 310953
17063 310953 227840 350304 264177 314428 228202 296125 598328 532174 566506 277511 258134
17052 258134 317084 511582 250010 325104 165328 -109462 438346 734419 133399 548534
17042 548534 401648 322041 725434 363773 540420 263156 561191 245829 149367 292166
17032B92166P9152G9933K85262o8285L72540M9670k69834N840P1903J91656j64186
17021E54499j02721J7080L8400J4258J92346j11068k77233L398K84764j72412
17011D41311J48146j35745J00088K33470P228k89938J62726j565j13615Q5862
17001F37968N7620K24392k76675n3928n7390L83775D47581L26685j29652j59518
16991D85096M80045C73998N11283l01555L76947k88833J58610j01724j00890p616
16981F20220l3031j72476j7280L75351P7311C90347K93449O6693J13342p6029
16971G87802K0004K24729m58705J09121n3182J91499j84505L97665j56080M6940
16961I25288M288l41323K58987m402o9482L19076l19973K78282k94516j91034
$$ plain form
17032 292166 371318 79933 365195 296910 669450 719120 449286 455126 527029 718685 554499
17021 554499 451778 468858 507258 521516 713862 602794 325561 328959 613723 441311
17011 441311 589457 453712 553800 787270 794498 504560 667286 665721 552106 637968
17001 637968 695588 919980 643305 589377 531987 915762 447581 774266 644614 485096
16991 485096 965141 373998 885281 583726 960673 671840 830450 728726 627836 620220
16981 620220 587189 414713 397433 772784 850095 390347 683796 750489 863831 787802
16971 787802 807806 1032535 573830 682951 629769 821268 636763 1034428 878348 925288
16961 925288 929576 588253 847240 842838 773356 1092432 772459 1050741 756225 565191
16951E65191K63195j70643L05604j10573j20617r2348N73778p213k45617k00949
16941G59808J34495k32386K24985j0413J99576k22367K98237j94678M238k6946
16931I34549K47738N448j68338K37284j39751J21688j63552J23849j43683L6064
16921A091296L90l7084O2075J67859o7811Q2530o13846M58741J74689k31501K50527
16910A337865m03318K11843J74895k07456J59524l2382J35754k20521M69162l1561
16900A593805j16283l42368L05732k62296K28400J44890j60879K22900j11328
16891A502573J52785m18402J5081N85127l96928J50389J68257k13442L32912k26623
16881A651729J25824l47161O63537o14113N13926l72958L85780k95869J14323
$$ plain form
16951 565191 828386 657743 963347 852774 732157 639809 1213587 1206374 960757 759808
16941 759808 894303 661917 886902 876489 1076065 853698 1151935 957257 961495 934549
16931 934549 1182287 1187735 1019397 1256681 1116930 1238618 1075066 1198915 1055232 1091296
16921 1091296 1091686 1054602 1116677 1284536 1216725 1299255 685409 1144150 1318839 1087338 1337865
16910 1337865 934547 1146390 1321285 1113829 1273353 1240971 1376725 1156204 1625366 1593805
16900 1593805 1477522 1135154 1440886 1178590 1406990 1551880 1391001 1613901 1502573
16891 1502573 1655358 1236956 1252037 1837164 1440236 1590625 1758882 1545440 1878352 1651729
16881 1651729 1777553 1430392 2093929 1479816 1993742 1620784 2006564 1710695 1825018
16872A825018P922N07009l44733L01677j50904j62000J31948q6424k56852M58646
16862B231307K31617m9248R0029k86368j04602O13351k91157m24845N42562m4175
16852B508471p8940J93115j83676M79028m86592K65308Q0406K8857P9204K39117
16842C124298r3280o2504k88782K87595J04393J69753j16936J69647k08609J38706
16832C224281L25176L27468n04041K32035m1546J14868J59071J86865l92314O93820
16822D325683j57272J14978k51585L69192j23531l3544J62822K39602m1461L41558
16812D946442k4860M52765k97244L12993r0769K60809J76135K36531n51629P69400
16802F190573j92375Q6532N6231j01944M49390O8167l3167L49053M95581k41162
$$ plain form
16872 1825018 1832940 2339949 1995216 2296893 2145989 1983989 2115937 2029513 1772661 2231307
16862 2231307 2462924 2413676 2503705 2217337 2112735 2726086 2434929 2010084 2552646 2508471
16852 2508471 2429531 2622646 2438970 2917998 2431406 2696714 2777120 2805977 2885181 3124298
16842 3124298 3031018 2968514 2679732 2967327 3071720 3241473 3124537 3294184 3085575 3224281
16832 3224281 3549457 3876925 3372884 3604919 3563373 3678241 3837312 4024177 3631863 4325683
16822 4325683 4168411 4283389 4031804 4400996 4277465 4243921 4406743 4646345 4604884 4946442
16812 4946442 4921582 5374347 5077103 5390096 5299327 5560136 5736271 5972802 5421173 6190573
16802 6190573 5998198 6084730 6140961 6039017 6488407 6556574 6523407 6872460 7368041 7126879
16792G126879O06734O7731R0933M16067L2219O6092L68609L26491J31225O28886
16782I861866J19257l14204O08882L24711K1432Q47030j07062R67345O0931P01055
16772A3091243J28121n874M23723Q37536N48431L84079K64855Q70586P34508O96947
16762A7974155O85536O82337N94695J069407L40101P90422J181526Q56286J454535
16753B5629000Q08691R26955J324648J191400J355085J723386J465316K021697
16745C6446178J660083J819308K358063K021545K653217K196025L168952K874246
16737E5197617L286159L104915L717459M110276M622552M048455N489719M687580
16729H8264732O056841N910394O141829O448609O905142P496335P247975P706657
$$ plain form
16792 7126879 7733613 7801344 7892277 8308344 8340563 8406655 8775264 9101755 9232980 9861866
16782 9861866 9981123 9666919 10275801 10600512 10621944 11468974 11361912 12329257 12390188 13091243
16772 13091243 13219364 13213490 13637213 14474749 15023180 15407259 15672114 16542700 17277208 17974155
16762 17974155 18659691 19342028 19936723 21006130 21346231 22136653 23318179 24174465 25629000
16753 25629000 26437691 27364646 28689294 29880694 31235779 32959165 34424481 36446178
16745 36446178 38106261 39925569 42283632 44305177 46958394 49154419 52323371 55197617
16737 55197617 58483776 61588691 65306150 69416426 74038978 78087433 83577152 88264732
16729 88264732 94321573 100231967 106373796 112822405 119727547 127223882 134471857 142178514
16721A42178514P157036P259697O904812N956438N969972M589788L080866K301543
16713A85398666J090679j55514j804170k668600m043586n118917n916662o480217
16705A60301679p256743p309705p444287p436378p451877p274397o799601o360225
16697A02968466o423129n693401n629711m963121m976626m764633m139942l474722
16689F2903181l404673l610258l039973l059980k681326k411592k519317k063930
16681D0112132j969425j915588k040469j272047j632401j683322j475847j138207
16673B6984826r11114j431818q39568r09825r39960j011514p10505j83201j383740
16664A8663581n54881r62242o66718l06491m94886n32679q80174k32621p07530
$$ plain form
16721 142178514 149335550 156595247 163500059 169456497 175426469 180016257 183097123 185398666
16713 185398666 186489345 186333831 184529661 181861061 177817475 172698558 166781896 160301679
16705 160301679 153044936 145735231 138290944 130854566 123402689 116128292 109328691 102968466
16697 102968466 96545337 90851936 85222225 80259104 75282478 70517845 66377903 62903181
16689 62903181 59498508 55888250 52848277 49788297 47106971 44695379 42176062 40112132
16681 40112132 38142707 36227119 34186650 32914603 31282202 29598880 28123033 26984826
16673 26984826 26073712 24641894 23802326 22892501 21952541 20941027 20230522 20047321 18663581
16664 18663581 18108700 17146458 16479740 16173249 15678363 15145684 14265510 14032889 13325359
16655A3325359l15180m44414o5082o72166k31766o73134l4748k09782l44952m17223
16645I916912m0485n48668l34993m88139L9612k75324l39652K31106m80273J01922
16635G782018n25526k94636M5911k39040K4198n26753J72398k41799j35996j16702
16625E944073m24213k6707j21423l66347N82179j45343k25533K49471n65825j8909
16615D881423l21562J50n6187k67398M37978n12171n89543M91888m3422k28779
16605C792377L811K730j89911l5510q5862j59713r2824K81461k25440q9178k39911
16594B962030j79371K21914j83149J84886J17533l01677K4904j77350j64970n2247
16584B452503K64920m8411k86764K48631m67873R431P0357K8643l60600N27329
$$ plain form
16655 13325359 13010179 12565765 12500683 11828517 11596751 10923617 10888869 10679087 10334135 9916912
16645 9916912 9876427 9327759 8992766 8504627 8544239 8268915 7929263 8160369 7680096 7782018
16635 7782018 7256492 6961856 7007767 6768727 6792925 6266172 6438570 6196771 6060775 5944073
16625 5944073 5519860 5493153 5371730 5005383 5587562 5442219 5216686 5466157 4900332 4881423
16615 4881423 4559861 4560011 4503824 4236426 4674404 4162233 3572690 4064578 4021156 3792377
16605 3792377 3796188 3798918 3609007 3573497 3487635 3327922 3235098 3516559 3291119 3201941 2962030
16594 2962030 2782659 3004573 2821424 3006310 3123843 2822166 2847070 2669720 2504750 2452503
16584 2452503 2717423 2669012 2382248 2630879 2163006 2172437 2242794 2271437 1910837 2438166
16574B438166K7717r5176k33416l76946O44416j57168k09434N14225q68522K80464
16564A964326J08023k01047k951J24357j50510n4950o1210L3807P3166j19636
16554A713375J31828k93769k22740L62579k07628o5317M27591k69414l05172J89230
16544A460563l58058N82065j58890J76662o66754L04692J65067l00457Q3075P9450
16534A367415j0755k75075j9969J03710J69720J4883j31023r7447l1276L64702
16524A454885p2406P0837k31416P3777j54521j90768L76620k18044k32544J58544
16514A034964J4123q3744j38852O4988J82369k53243j29351N01727l87015M61495
16504A267461m51215N8124L31790n33595L12760k7183l4555M2908m17781K2388
$$ plain form
16574 2438166 2465883 2370707 2137291 1760345 2404761 2247593 2038159 2552384 1683862 1964326
16564 1964326 2072349 1871302 1868351 1992708 1842198 1787248 1726038 1759845 1833011 1713375
16554 1713375 1845203 1551434 1328694 1691273 1483645 1418328 1845919 1576505 1271333 1460563
16544 1460563 1102505 1684570 1525680 1702342 1035588 1340280 1505347 1204890 1287965 1367415
16534 1367415 1356660 1081585 1061616 1165326 1335046 1349929 1218906 1121459 1090183 1454885
16524 1454885 1382479 1453316 1221900 1295677 1141156 950388 1327008 1108964 876420 1034964
16514 1034964 1049087 965343 826491 891479 1073848 820605 691254 1192981 805966 1267461
16504 1267461 816246 874370 1206160 672565 985325 958142 923587 966495 548714 571102
16494E71102J51632J54929J36006j09942k54332K46794j11284J66428j32392q5650
16484G33291p4045j10672K76693r3051L6528L94438m14601C14740L39908L55100
16474A009748m4160l5305l09085P1681K34607l42464p1835J59206J33292k26602
16464E79083k01686K29279L00546l60868O8759j03558M06567j88737l58891L58163
16454G28657C01332J36259J35776j62531J23870j7020J04193k41543N9918N3646
16444D93900n693o4788K56736j93255M7833O9515k94825N71958k88370M4129K06630
16433H43770B98463J47700J85680j75382P2413P5020p7413k13293J83581l7030
16423D59739A87784K12842M4381l2159J79559J027k44345l4836J02106J36114
$$ plain form
16494 571102 722734 877663 1013669 903727 649395 896189 784905 951333 818941 733291
16484 733291 659246 548574 825267 732216 768744 1163182 748581 314740 654648 1009748
16474 1009748 965588 930283 621198 692879 927486 585022 513187 672393 805685 579083
16464 579083 377397 606676 907222 546354 615113 511555 918122 729385 370494 728657
16454 728657 301332 437591 573367 410836 534706 517686 621879 380336 440254 493900
16444 493900 488207 423419 680155 486900 534733 604248 309423 881381 593011 637140 843770
16433 843770 298463 446163 631843 456461 528874 603894 526481 313188 496769 459739
16423 459739 187784 400626 445007 412848 592407 593434 349089 314253 416359 552473
16413E52473j02247A65352K15913J29065k42105K09793r1033M49051j90478k14744
16403D30814N879J21642c7909A47392K06396m2567m7846j3706J18557p7127L6839
16392C27938P4427l4948L1488j35787O2237R508N179J11659A62007J41954K22338
16381E26299B43641j09731J02565p6802K93320o7895l3649j6924J2838K59509
16371F06872k94448R5746j60026n8605E6804n981P3122J71427M21825C33849A64949
16359E1877R4373J20673r7311R7138f141C00445l5209q232J35535j65015J56319
16348C83843K69386A70383j1158l9494c2438D26460A54107K09855Q2647o7055
16338C79554h8798C41533j45454n4833D9767L57095H9723J39947H1495L00670
$$ plain form
16413 552473 450226 165352 381265 510330 268225 478018 386985 836036 645558 430814
16403 430814 436693 558335 -37909 147392 353788 311221 263375 249669 368226 291099 327938
16392 327938 402365 367417 398905 263118 325355 334863 340042 451701 162007 303961 526299
16381 526299 243641 133910 236475 159673 452993 385098 351449 334525 347363 606872
16371 606872 312424 408170 248144 189539 56804 50823 123945 295372 717197 333849 164949
16359 51877 146250 266923 169612 266750 -6141 300445 265236 257004 392539 227524 383843
16348 383843 653229 170383 159225 119731 -32438 426460 154107 363962 446609 379554
16338 379554 -88798 341533 196079 141246 49767 406862 89723 229670 81495 382165
16328C82165j13103p790J21709D3669J11196K1508a9258k26361A95577P0787A22553
16316H9233b48742f5963C31834K53157C8304J01423R9862J7042A20385J87466
16306C07851A28904J10490a11141B53224m5653K59161A07216L25490j28176h3590
16295H9649J88603d7163C4542a13799H2973j3233Q2042K88204A42942i562A493
16283G0739J55120a3455A64384n8864a01478F1669J26788L00705n8650j78389
16273B52123j15398J4555M9111j4556b2392C9785J02539d7873A27396E9760Q0156
16262A39916d4544m1746I3251K61572j22760a15460j67342F6328K1229J80835
16252B68392o6938c56313E32079A36778L2719l1160m2930B4240J06999B9524A4170
$$ plain form
16328 382165 269062 261272 382981 43669 154865 176373 -19258 -245619 195577 266364 122553
16316 89233 -248742 -65963 331834 584991 38304 139727 239589 256631 120385 307851
16306 307851 128904 239394 -111141 253224 207571 466732 107216 432706 304530 -83590
16295 89649 278252 -47163 34542 -113799 82973 69740 151782 439986 142942 -9562 1493
16283 70739 225859 -13455 164384 105520 -101478 61669 188457 489162 430512 252123
16273 252123 136725 151280 200391 185835 -22392 39785 142324 -47873 127396 59760 139916
16262 139916 -44544 -86290 93251 354823 232063 -115460 -282802 66328 87557 268392
16252 268392 201454 -356313 532079 136778 169497 138337 95407 24240 131239 29524 14170
16240A31978J55169D4595L04786a12167A6405L19114j19605r1721c42182i8386
16229A19532A8728K2632Q2419J96991b2747j43414a2972D5025J26754J04920A04564
16217A77171a22416j2553D0154a22255A58810a73372C3664J88789H4338j606k9252
16206E3480h6142j63221A4237i6702B20498M4409a9007A62418c6720B38671n2757
16195A85914j4062J05245n2892m5865a36661C31694g3591F9808g8167k24418C07261
16183b17525C52917j13094J01903C4711L9869B4297N1248b02232A22343N7157
16173A79500D122P16a15365B34389R3735h8831B78602K43142D9312M10086i5074
16161F5716r085i0021j79825c8939A35467m126J66847a91487l2252c4130R459
$$ plain form
16240 131978 287147 44595 349381 -112167 16405 335519 215914 124193 -342182 -98386
16229 119532 18728 41360 123779 320770 -22747 -166161 -12972 45025 171779 276699 104564
16217 177171 -122416 -134969 40154 -122255 158810 -173372 33664 222453 84338 82732 53480
16206 53480 -86142 -249363 14237 -96702 220498 264907 -19007 162418 -36720 238671 185914
16195 185914 171852 277097 224205 178340 -136661 331694 -73591 69808 -78167 -302585 307261
16183 -217525 352917 239823 341726 34711 74580 24297 75545 -202232 122343 179500
16173 179500 4122 4838 -115365 234389 328124 -88831 278602 521744 49312 459398 -95074
16161 65716 56631 -90021 -269846 -38939 135467 131341 298188 -191487 -223739 -34130 -24671
16150b4671r2410C337i144j5171j3754A04292a86175I3725A0636b7427k08264
16139b35691A11849a3073B3373i7083A34105d5746B12166J29068A11700b17520
16128A04415a38530j96852I7046c5011C1730J71763b9998q1479I1232K3330d8153
16116h3417n0467A17653b05680D7111i9057c3770j24752J031B77075j37505F460
16104b15596b9777A14230N4689e9265A93280b60661A58902M515l482c73456g8277
16092B7096a71724A80722O8534i9287q8988G6129j0350b5808B24639L5814A24675
16080a38126A74218i2418d2536K1137D9354b05176A12888l2918I408a45222C5287
16068F4494J28786a55105H4739N338D0816N1551b08605A06540a30861B83962c19902
$$ plain form
16150 -24671 -117081 3337 -9144 -24315 -38069 104292 -186175 93725 10636 -27427 -235691
16139 -235691 111849 -13073 23373 -97083 134105 -45746 212166 341234 111700 -217520
16128 104415 -138530 -335382 97046 -35011 31730 203493 -29998 -111477 91232 114562 -48153
16116 -83417 -133884 117653 -205680 47111 -99057 -33770 -158522 -157491 277075 139570 6460
16104 -215596 -29777 114230 168919 -59265 193280 -260661 158902 163417 159935 -373456 -78277
16092 27096 -171724 180722 249256 -99287 -188275 76129 65779 -25808 224639 260453 124675
16080 -138126 174218 -92418 -42536 -21399 49354 -205176 112888 79970 9408 -145222 35287
16068 64494 193280 -155105 84739 90077 40816 92367 -208605 106540 -130861 283962 -319902
16056b44013c7118J6491G2952c60935f8097l59309a91768j24030B88789a0800
16045a00907K9498A62086J22640A08906A0583J73937G4918A0486e28317b9764
16034C35116a82733A50552J1058d6635E2859c60610A84102b71482k583I0643g6358
16022b71316I8011J56503Q3676b48605C0054b31294B8736a2349j56810l5645F1502
16010E3590J31588D7836M038B0597i3592N931q2240e4085j70566A77021J719C9065
15997d8073m3133L0173n5004N6095C27674j56276J45063a40385d8783j3327B3578
15985A09656Q5320K0105p120p7848J60527L8530K6833F9743b7644n9832F5627
15973H4153B0886a23945k94521A26552J73690A9776Q4776b47973p2770E0957e7312
$$ plain form
16056 -244013 -37118 -20627 72952 -360935 -68097 -427406 -191768 -315798 288789 -10800
16045 -100907 -71409 162086 284726 108906 10583 184520 74918 10486 -528317 -29764
16034 335116 -182733 150552 161610 -46635 52859 -360610 184102 -271482 -274065 90643 -76358
16022 -271316 98011 254514 338190 -248605 30054 -231294 28736 -12349 -169159 -204804 61502
16010 53590 185178 47836 51874 20597 -93592 -87661 -169901 -54085 -224651 177021 178740 39065
15997 -48073 -91206 -61033 -116037 -59942 327674 171398 316461 -140385 -48783 -62110 23578
15985 109656 194976 215081 207961 130113 290640 329170 356003 69743 -27644 -87476 65627
15973 84153 20886 -123945 -418466 126552 300242 19776 104552 -247973 -320743 50957 -57312
15961A46191P0627c1216j60026L0030A44155l0879b66898I8106a30655B06258
15950b80945C07125j15678d03658A6912b9410A12312b6572C02487b54081P6235
15940a77846B84517E3535B4578a79249A01572a52397K5186L6234l16059c0422
15929a77910E3221c422k42898R3386j38999I0508g4239K621J8925j0410j12565
15918a75668J4169P5702j24089i1126l1c4969A36854f7502H7477k9139b8024C4355
15905c06836a37861m0192A1157J03388i1669j51103A69859g284k19840G4182k6683
15894D7499g0833a4274E2261b71509F6518A4151c21738D0751b16570B05873a58011
15882A88159i0589p2278B5692h9389K8591J0758A82772l0576b02615F0119a41256
$$ plain form
15961 146191 216818 -31216 -191242 -161212 144155 113276 -266898 98106 -130655 206258
15950 -280945 307125 191447 -403658 16912 -29410 112312 -26572 302487 -254081 -177846
15940 -177846 284517 53535 24578 -179249 101572 -152397 -127211 -90977 -407036 -30422
15929 -177910 53221 -3422 -246320 -152934 -291933 90508 -74239 -71618 -52693 -63103 -175668
15918 -175668 -161499 -85797 -209886 -91126 -91157 -34969 136854 -67502 87477 58338 -28024 34355
15905 -306836 -137861 -178053 11157 114545 -91669 -242772 169859 -7284 -227124 74182 47499
15894 47499 -70833 -14274 52261 -271509 66518 14151 -321738 40751 -216570 205873 -158011
15882 188159 -90589 -162867 25692 -89389 -60798 -50040 182772 152196 -202615 60119 -141256
15870a97813H4275a15528n6951D4515J01143a07564j97653B0270a53097D38436
15859I9871c23816F4205a15556A88526a5503A39966E5310a7198A86753o1852b22601
15847h9229k17767B5428c92173J36201k7484Q2237C7892c6300A63278K6597C5763
15835e1605j1402j3694J5318C0937Q885j2568L2178J38648a24605a7085r9172
15824a16257A70596i6369p0750j51228B32905l631e5660m6054b9211l87464J94924
15813b21751A02223k6490B4619a66081f351B07452b6868j50848E8197a34776J766
15802a33010j16794J18901B0375b82531A35152B3374K8237c69153B26070e6140
15791G8542c51073B07471i0776B8453a28715j183K7239m8390G4848c130k78437
$$ plain form
15870 -197813 84275 -115528 -172479 44515 145658 -107564 -305217 20270 -153097 438436
15859 99871 -323816 64205 -115556 188526 -15503 139966 55310 -17198 186753 124901 -222601
15847 -89229 -306996 25428 -392173 -255972 -283456 -201219 37892 -36300 163278 189875 35763
15835 -51605 -63007 -76701 -61383 30937 39822 27254 59432 198080 -124605 -17085 -116257
15824 -116257 170596 -96369 -167119 -318347 232905 229274 -55660 -101714 -29211 -416675 -221751
15813 -221751 102223 75733 24619 -166081 -6351 207452 -26868 -177716 58197 -134776 -133010
15802 -133010 -249804 -130903 20375 -282531 135152 23374 51611 -369153 226070 -56140
15791 78542 -351073 207471 -90776 28453 -128715 -129898 -102659 -151049 74848 -3130 -281567
15780b81567a8500j95607l5975J14595m33242e6293f868G3557c07272C0987B692
15768B6210a72948G6008J94005b66934P8083O9410p0347H149b57945B066e6217
15756a90967B51352p7916J0555m8213a24237M1341B71712a60595M6115B9904b69825
15744D6334g7688B01801b04186C81153b25251a11152j79895g6440A95074j9423
15734A75651q6a86822d5000A45749K07548B7170M1230J63322I4550a4633j55069
15723a69702d1991B04532e0695j2393j78747F2096e03010J91132A71519d0987
15712c14153d5089A26913a61725d7731G8230a5954d901D820K33273a06457J9061
15701h7396K6061i068k94926I8768f3195B23655k6989D6431a68972A35731Q286
$$ plain form
15780 -281567 -18500 -214107 -250082 -135487 -568729 -56293 -6868 73557 -307272 30987 2692
15768 26210 -172948 76008 270013 -266934 -188851 -119441 -189788 8149 -257945 2066 -56217
15756 -190967 251352 173436 183991 135778 -124237 -82896 271712 -160595 -114480 29904 -269825
15744 46334 -77688 201801 -204186 381153 -225251 -111152 -291047 -76440 195074 175651
15734 175651 175565 -186822 -45000 145749 353297 27170 68400 231722 94550 -14633 -169702
15723 -169702 -41991 204532 -50695 -63088 -241835 62096 -503010 -311878 171519 -40987
15712 -314153 -45089 126913 -161725 -47731 78230 -15954 -4901 4820 238093 -106457 -87396
15701 -87396 -61335 -9068 -303994 98768 -63195 223655 196666 46431 -168972 135731 144017
15690A44017A9578R0219J12112p7468p0083g6121B33187b92090d6706A16783b0286
15678g2628j11167C0161R7503A9528K2763a63476P0270A46691b27873C92343F0728
15666d1883A99789m7787j0020h4761j5259B7893d128j83875i1314p3266J6869
15655a47711k20958a30658j3632C6587N5397J06524l5207E4187a61178A36313
15644D39681a72183b1477A15931J80393C5122b86012I7764b81114O4896B21690
15633F5486O3901B3941a81894B74437D9350d20427g0910A92509N6572b30062C6964
15621b78544P1379j05653A23425a72953I4549h3453p6900B15440f1092B03630
15610a8846O771p7197A64932a06941J3953A67409E6449a45352m4496J4239A26292
$$ plain form
15690 144017 19578 109797 221909 144441 74358 -76121 233187 -292090 -46706 116783 -20286
15678 -72628 -183795 30161 127664 19528 42291 -163476 -93206 146691 -227873 392343 60728
15666 -41883 199789 152002 141982 -84761 -100020 27893 -4128 -188003 -91314 -164580 -147711
15655 -147711 -368669 -130658 -144290 36587 91984 198508 163301 54187 -161178 136313
15644 439681 -172183 -21477 115931 296324 35122 -286012 97764 -281114 -216218 221690
15633 65486 129387 23941 -181894 274437 49350 -420427 -70910 192509 249081 -230062 36964
15621 -278544 -207165 -312818 123425 -172953 94549 -83453 -160353 215440 -61092 203630
15610 -18846 -12075 -89272 164932 -106941 -92988 167409 56449 -145352 -189848 -175609 126292
15598i2573L544A6089N87a56732K8131j52629a2754B74968a00649l6316B67961
15586A73631J12713j42175d3083A08782a43214k12170N4439F7178B5789h6786
15575B11110b0996n9647k5730B06370I2558A178a20349A49449m4271J84252a90114
15563F6671d5196A6534e0317l39561a66937j77729a17894A78710B0981c61194
15552A34617b07343H4997b89187a21256I4905A2308M1132P2670a76161k51114
15542d27275I8814a54530B9431A0320d6649F7719b18514C57744D258a72499Q0463
15531i2036j53976B92325c24806G2139R193f7535j32135f8387k70717B6973q108
15520A8865a39445c547G6477a41168F678a79628H6004P5717b87800C0192a07911
$$ plain form
15598 -92573 -89029 16089 16676 -156732 -128601 -281230 -12754 274968 -100649 -136965 267961
15586 173631 286344 144169 -43083 108782 -143214 -355384 -300945 67178 25789 -86786
15575 211110 -20996 -80643 -106373 206370 92558 1178 -120349 149449 105178 289430 -190114
15563 66671 -45196 16534 -50317 -389878 -166937 -344666 -117894 178710 20981 -361194
15552 134617 -207343 84997 -289187 -121256 94905 12308 53440 126110 -176161 -427275
15542 -427275 98814 -154530 29431 10320 -46649 67719 -218514 357744 4258 -172499 -92036
15531 -92036 -246012 292325 -324806 72139 81332 -67535 -199670 -68387 -339104 26973 18865
15520 18865 -139445 -3547 76477 -141168 6678 -179628 86004 161721 -287800 30192 -107911
15508f3069o0721A67740e6833B59076a42786c3480r0883c7737G5520A515a55463
15496A37229f7609j60543R9791A22097c7995G4461A2260b13668c6672j57886l8877
15485b33435q6239A70382a39182A63239c5153F4629Q4293k0864j2592f0108C07382
15473A87595a3490j14677k8651j863j6488e294l49733g4819r8334G2705J4524
15462H7229h7503M2963l4024A91355H456L09830F7092b77227O4859h665q3882
15451i2547F3696g8835k5876J4375B21040d5582n1403j2713l08630B1500b30260
15439B17904m9533p1524K36729B0206i7780b3934B12115A6297J6714a50384B40629
15427A95665i6740A88310b4499B65789J05522F9375K52301d54040a3822l3833
$$ plain form
15508 -63069 -123790 167740 -56833 259076 -142786 -33480 -124363 -37737 75520 1515 -155463
15496 137229 -67609 -228152 -128361 122097 -37995 74461 12260 -213668 -36672 -194558 -233435
15485 -233435 -319674 170382 -139182 163239 -35153 64629 148922 128058 115466 -60108 307382
15473 187595 -13490 -128167 -156818 -158681 -175169 -5294 -355027 -74819 -173153 72705 87229
15462 87229 -87503 -44540 -78564 191355 8456 318286 67092 -277227 -212368 -8665 -92547
15451 -92547 63696 -78835 -104711 -90336 221040 -45582 -96985 -109698 -418328 21500 -230260
15439 217904 168371 96847 333576 20206 -97780 -23934 212115 16297 33011 -150384 240629
15427 195665 -96740 188310 -24499 265789 371311 69375 321676 -454040 -13822 -47655
15417d7655C18034i1617b7498k35528B61467I5992a98670A33115a2166j93682
15407b05848M5987B38279d4474B49381E949L17141E731e1550m6366d8053Q673
15396c9380j75038B3625O643P3680D8410N3268c50828J47853L3732L3094A30460
15384b5832F4229a29832b3098J0516l9402j28668G2112a57651O2445d0680A0721
15372d0625A36428b59432f7285G9356R1892c78446k3136I6941c8377o4668A67210
15360i6919A75486l0035O5416I4696i5824M2759A9856f6511B37917h2627j65610
15349b48237M0811A69762j2690b06264B36371q7903c1240j89099F8155f163G258
15337C3890J69471d98797B15898q2534P8465H1659a68200a0920j22922A4569Q5651
$$ plain form
15417 -47655 318034 -91617 -27498 -263026 261467 95992 -198670 133115 -12166 -205848
15407 -205848 -159861 238279 -44474 249381 5949 323090 5731 -51550 -97916 -48053 -39380
15396 -39380 -214418 23625 30268 103948 48410 101678 -350828 -202975 -169243 -136149 130460
15384 -25832 64229 -129832 -23098 -12582 -51984 -180652 72112 -157651 -95206 -40680 10721
15372 -40625 136428 -259432 -67285 79356 171248 -378446 -401582 96941 -38377 -103045 167210
15360 -96919 175486 145451 210867 94696 -95824 -53065 19856 -66511 237917 -82627 -248237
15349 -248237 -207426 169762 157072 -206264 236371 148468 -31240 -220339 68155 -6163 7258
15337 33890 203361 -498797 215898 133364 211829 81659 -168200 -10920 -133842 14569 100220
15326A00220A2625L54658b51429J04235j55679A46914P5181L7855J27104b74852
15315d75085h4833C4431h1896j28899j5541A56272K5012h6075A73736Q8934C1089
15303A79853a32029h292Q37H0371a67293A05251C6695K97405j27656G0771b68753
15291A41629b1593B18389C1184a78170K7349F9901N1346d22531A97019D7922A8311
15279B98574i7222f257A70346d4439F7549K19807e6645j9970p8539k52197A37803
15267B93001j25253a28620C3932a28075B9459F037a43413a8819q2406B21357e1207
15255g3075n7251E5859J58819J3293r3393J40353K66823J055050J45346m86374
15245A255776L87103F27686k50785j74684a47374O9108m9838A86550i5285A41403
$$ plain form
15326 100220 12625 367283 -251429 -147194 -302873 146914 222095 259950 387054 -274852
15315 -475085 -84833 34431 -81896 -210795 -226336 156272 181284 -86075 173736 262670 31089
15303 179853 -132029 -8292 -7455 80371 -167293 105251 36695 334100 206444 70771 -268753
15291 141629 -21593 218389 31184 -178170 -150821 69901 121247 -422531 197019 47922 18311
15279 298574 -97222 -6257 170346 -44439 67549 287356 -56645 -76615 -155154 -407351 137803
15267 293001 167748 -128620 33932 -128075 29459 6037 -143413 -18819 -101225 221357 -51207
15255 -73075 -130326 55859 214678 227971 134578 274931 541754 1596804 1742150 1255776
15245 1255776 1642879 627686 376901 202217 -147374 -78266 -128104 186550 -95285 141403
15234B94039b771A59905K9542c66180a19009D3654K42152A23599a35901r7468
15224b33369A9298a17784I3293C9057A5837K86381J741a48463j38288h4605B36057
15212B9350b1741D468J8579O2727B3982P2499P6941f3935k17025a23010E7645
15200A10460b94443D61208B04850P680F2468D250a10571J6828h913m9088a0774
15188B89192i113D1272a11312B11343M0323l0128q6228J71125a22628j3934P077
15177a29485B94966i7315F7179A5874e5406A62955l9034a43267B07478e8677o445
15166f5122A7070J77204b57173d4034l0323F0182e3711J8964J358D87710A17191
15154B50136B6501c912b00j2987A00725a44114c8404D850g824A19972b099G0884
$$ plain form
15234 294039 -2771 159905 189447 -366180 -119009 43654 285806 123599 -135901 -233369
15224 -233369 19298 -117784 93293 39057 15837 302218 303959 -148463 -286751 -84605 236057
15212 29350 -21741 4468 23047 85774 23982 96481 173422 -63935 -280960 -123010 57645
15200 110460 -294443 461208 204850 212530 62468 4250 -110571 -93743 -8913 -58001 -10774
15188 289192 -9113 41272 -111312 211343 251666 221538 135310 306435 -122628 -136562 -129485
15177 -129485 294966 -97315 67179 15874 -55406 162955 123921 -143267 207478 -58677 -65122
15166 -65122 17070 194274 -257173 -44034 -74357 60182 -53711 -34747 -33389 487710 117191
15154 250136 26501 -3912 -200 -13187 100725 -144114 -38404 4850 -7824 119972 -2099 70884
15141H2277J63636a544B40353H213K51810G0663j744g0270B0293g5773B04264
15129a43911F3295k3878K6525A1463M651P4152j3605K67986r8129a06028L2820
15118g3208J5226B41969h7807C440K19593L0627J5529o4322p4396j570h180C91262
15105A85618J58084C7165h206j95851N5556A9921a4724j1755l9528B11186h53
15093b631A24383J66821r9790p9387h1903A63741j1629E2872B3862J79865i5586
15081C6196a018B77780O5531k9376G8798J47217F6389L39930e6345C35617b55066
15069B86942b66972B217c74887A95997E3000c8493j4885m52811C5359K92436G3808
15057A92301a43354A21102b09254B87298H9995O3161a50182D65681l7427r1750
$$ plain form
15141 82277 245913 -1544 240353 8213 260023 70663 68919 -70270 20293 -75773 204264
15129 -143911 63295 39417 65942 11463 16114 90266 76661 344647 246518 -106028 -73208
15118 -73208 -57982 241969 -87807 3440 223033 253660 269189 204867 130471 128901 -8180 391262
15105 185618 343702 37165 -8206 -204057 -148501 19921 -14724 -26479 -66007 211186 -853
15093 -2631 124383 291204 191414 112027 -81903 163741 152112 52872 23862 203727 -95586
15081 36196 -1018 277780 343311 313935 78798 226015 66389 406319 -56345 335617 -255066
15069 286942 -266972 2217 -374887 195997 53000 -38493 -53378 -506189 35359 327795 73808
15057 192301 -143354 121102 -209254 287298 89995 153156 -150182 465681 428254 336504
15047C36504J9206i6277C8592a88125C3269L56252A3795K3132j0615N6719K33284
15036C16315o3573J8068j27608P0899n1683C7480h1544b7594A93106p5028L20561
15025D38639H4783a2696I567K36564r4011b03234A28907b3467G8968K48282a8092
15013A44351D3690M20560B06564f8612j67969B11844J30745E0396G095d2862G6925
15001a48206D32329A96416K9916j06490J05053M6563a24528B84230A25756a3267
14990C87363j90383B7209a1717F5943L41345a18809j6188a6572n6002B34053p5462
14979A58591M0568J24246E4268J76378o7643J37439A02663J95612e1157H7308
14968A27216K39464M5507l2599E1740R1757J38922i657A36637m998K9709J47388
$$ plain form
15047 336504 355710 -96277 38592 -188125 33269 389521 13795 36927 26312 83031 316315
15036 316315 252742 270810 143202 214101 162418 37480 -81544 -27594 193106 118078 438639
15025 438639 84783 -12696 9567 246131 152120 -203234 128907 -23467 78968 327250 -18092
15013 144351 43690 464250 206564 -68612 -236581 211844 342589 50396 7095 -42862 76925
15001 -148206 432329 196416 226332 119842 224895 271458 -124528 284230 125756 -13267
14990 387363 196980 27209 -11717 65943 407288 -118809 -134997 -16572 -72574 234053 158591
14979 158591 199159 323405 54268 230646 163003 300442 102663 298275 -51157 87308
14968 127216 366680 412187 379588 51740 143497 282419 -9657 136637 131639 161348 308736
14957C08736J0173D4277K27799a48750A61037L05383H1240J39056M3778j18999
14947A45075K19074P9887j43781A02276L70855j79210P4531a25729B04008M96976
14937G00984A79818n1035K68842j43596c2147A51594B8216J60927n1462L17175
14927D54856j87658M4871a70255E90948A29046K24220i6374C01179H1331J13576
14917A94907j0083K60825o8225p7366d8066A58170J36744A00935K33471p8107
14907B56299K94004B51433K11979C7117L26988A29567L35375k06637J03542j41662
14897B20185R4428R2343j15965j07374K07187n9298K95008E2137A3014M89389
14887E02403B38791i3365D55161o9361I5571K12069A36932a17671D38486p2601
$$ plain form
14957 308736 318909 44277 272076 -148750 161037 466420 81240 220296 264074 145075
14947 145075 364149 444036 300255 102276 473131 293921 368452 -125729 204008 700984
14937 700984 179818 128783 397625 254029 -32147 151594 28216 189143 137681 454856
14927 454856 267198 312069 -170255 590948 129046 353266 -96374 301179 81331 194907
14917 194907 184824 445649 377424 300058 -48066 158170 294914 100935 334406 256299
14907 256299 550303 251433 463412 37117 364105 129567 464942 258305 361847 220185
14897 220185 314613 406956 290991 183617 390804 331506 626514 52137 13014 502403
14887 502403 238791 -93365 455161 385800 95571 307640 136932 -117671 438486 365885
14877C65885j12715K1793H3271R7366n5406c9886B05488P7053L2763K85150k67915
14866C32539A55857M36215j62170k05285n16J48764l7101K30569p0538k43241
14856B52554K19359p6123k1196K81499k31034J9811k7795o133q4989n3235J75339
14845D48057J36926A68138L83095I9045L21490r029O4144j04017r4398R9260L2005
14834D08500j20626j40450J61787N8602j05622C1328L31028J47663k00194j5559
14824B94266E3648L21358O0029k6033n7580o9621p3026P941N4594J23319A03927
14812C28719J68262j5364Q3987m6006A27733K49258r0377m8611M967L06235q8904
14801D60301A56347l0258K88100F3633O4525j4622N78139l41769b371I6516K10557
$$ plain form
14877 365885 253170 274963 83271 180637 125231 -39886 205488 282541 315304 600454 332539
14866 332539 155857 592072 429902 224617 224101 372865 335764 566333 495795 252554
14856 252554 471913 395790 374594 656093 425059 444870 417075 410942 325953 272718 448057
14845 448057 584983 168138 551233 99045 420535 411506 475650 371633 277235 376495 408500
14834 408500 287874 147424 309211 367813 262191 31328 362356 510019 309825 294266
14824 294266 53648 375006 435035 409002 351422 281801 208775 216716 271310 394629 103927
14812 328719 496981 481617 565604 519598 127733 376991 286614 238003 242970 549205 460301
14801 460301 156347 126089 414189 63633 128158 113536 691675 349906 -2371 96516 307073
14790C07073k0395J63120J20068A3268J53621J33425K47708k48140M7702M2137
14780C89721j30879L32865Q6244B99154L46829j4402j24840J58993O5207k76529
14770D54412J396K09528A44255K55530P5546m5541K6720j9732L28814k86020A84887
14758A35033K52839J05411n0772J74521G5166M50147j57118K30735B52649K11533
14748D64182r2474J50857Q4424K64563D09717L00432J8032k83552l1195M55723
14738H69157k59157k01502K46407k68719o108l9478M18025q3321L70201m32801
14728F12704j9218n323J84552k21868N827Q4049j46878r588j98174K81065K47900
14717H15048q1293q289j2665C16605O69342l04678J80552L1951p5882j68453J04112
$$ plain form
14790 307073 286678 449798 569866 13268 166889 300314 548022 299882 347584 389721
14780 389721 258842 591707 677951 299154 645983 631581 506741 665734 730941 454412
14770 454412 455808 665336 144255 399785 475331 429790 456510 436778 765592 479572 184887
14758 135033 387872 493283 442511 617032 75166 525313 368195 598930 252649 464182
14748 464182 371708 522565 606989 871552 409717 710149 728181 444629 413434 869157
14738 869157 610000 408498 654905 386186 380078 340600 758625 675304 1045505 612704
14728 612704 593486 588163 772715 550847 556674 640723 493845 484257 286083 567148 815048
14717 815048 733755 725466 712801 316605 985947 681269 861821 893772 817890 649437 753549
14706G53549C03330K71481K07663M8730k00674n5275K9239Q9090J6559j87375
14696E22768L0228M01333j5474j68880j18507M6850L4602j12042N6146k00113
14686D76911N20283j36646l5591D03185N52564l08369j63342J40049J14383J22129
14676H60599l0008p7647n9466J98186k0957J71542k54191o3741n7273o3612O12170
14665A215602n74673J02806Q5977P4457j99092j32411L17349K79490j8920m32793
14655G17792j38200L83262j34464n3755Q6991K22043j11520K27872l94624K50306
14645A055703k82196K45510k84105J04286l8222J54849M365P0051J80603n85247
14635F25597J95284L24212j62591P62306H71268J40861J33994L37431l45982O2189
$$ plain form
14706 753549 303330 574811 782474 831204 630530 575255 604494 693584 710143 522768
14696 522768 552996 954329 938855 769975 651468 698318 732920 620878 677024 476911
14686 476911 997194 860548 824957 403185 955749 647380 484038 624087 738470 860599
14676 860599 830591 752944 693478 891664 870707 1042249 788058 724317 667044 603432 1215602
14665 1215602 640929 743735 829712 904169 705077 572666 890015 1169505 1150585 717792
14655 717792 579592 962854 828390 774635 861626 1083669 972149 1200021 805397 1055703
14645 1055703 773507 1019017 734912 839198 800976 955825 960190 1030241 1210844 625597
14635 625597 820881 1145093 982502 1744808 871268 1012129 1146123 1483554 1137572 1199761
14625A199761J11286j88122j13155M07054l42703L28765j62838r2793J43724l49884
14615I41095M41367l63621K05092K62606J7789j36740l18120M16415l55520j4908
14605A095455L54053j55470P9845k848l27312M30818k49919M6848j24312L65545
14595A512703l01997N31430m26757J58913r9233L0776J2340K70977m40464K97168
14585A545856k9393q1738Q4837N3559J64902j33464J60971k75210R6462M21783
14575B008565l53099K80727l38242K54109K6653j18867J14559J44917j74072j90560
14565A654690K26893j80305O25716N4709j97897l21213N9039M32002l0685p1618
14555B251331J97420N33847K02543P1521Q23565R26050K320809M240769R944810
$$ plain form
14625 1199761 1311047 1122925 1009770 1416824 1074121 1402886 1240048 1147255 1290979 941095
14615 941095 1382462 1018841 1223933 1486539 1504328 1367588 1049468 1465883 1110363 1095455
14605 1095455 1449508 1294038 1373883 1371035 1043723 1474541 1224622 1271470 1147158 1512703
14595 1512703 1210706 1742136 1315379 1474292 1375059 1405835 1418175 1689152 1248688 1545856
14585 1545856 1516463 1434725 1519562 1573121 1738023 1604559 1765530 1490320 1586782 2008565
14575 2008565 1655466 1936193 1597951 1852060 1878713 1759846 1874405 2019322 1845250 1654690
14565 1654690 1881583 1701278 2326994 2381703 2183806 1862593 1921632 2353634 2322949 2251331
14555 2251331 2448751 2982598 3185141 3256662 4080227 5006277 7327086 11567855 21512665
14546B1512665J5928248L216730A9902290H287967C451692q62577q59271l56838
14538A373006J03498O2944n1750O2548L8788K17477j50972K11922o8213j87959
14528A611289L84162l9442J86120l18362j74325L31876M77314m46783L7029P9926
14518B128804j29833k51895J96643M2259J87705J23375j63672n0378J2231M03560
14508B498799k66001L28483j50771J05513J1597M31562o34409J20115r7746J74314
14498B521456K29210j72064K38858N1909j78115j0677M1602N5639j4063L55631
14488C119386j52146K11899k60838Q9579n3091L32940k40072J67356j71530L41038
14478C384521q971r7661J95830r1170m9280J34707l0138N46485n84845K21970
$$ plain form
14546 21512665 37440913 40657643 19902290 8287967 3451692 2589115 1729844 1373006
14538 1373006 1476504 1539448 1487698 1550246 1589034 1806511 1655539 1867461 1799248 1611289
14528 1611289 1995451 1956009 2142129 1823767 1649442 1981318 2458632 2011849 2048878 2128804
14518 2128804 1998971 1747076 1943719 1985978 2173683 2297058 2133386 2083008 2095239 2498799
14508 2498799 2232798 2561281 2410510 2516023 2527620 2959182 2324773 2444888 2347142 2521456
14498 2521456 2750666 2578602 2817460 2869369 2691254 2680577 2722179 2777818 2763755 3119386
14488 3119386 2967240 3179139 2918301 3007880 2954789 3287729 3047657 3215013 3043483 3384521
14478 3384521 3375550 3277889 3473719 3382549 3333269 3467976 3437838 3984323 3399478 3621448
14468C621448N8699N4958K26930j63893o1781J38061q7628o357P394N62092j01423
14457D248500l28369M72836J32022k14178j31698M02392J19792j48752j71759
14448D380786L40015J2337J23712k03077R4367M65891k75591L92203k68780L45190
14438E407053m35773L89878K81177l15791K51716K92478J52830l27208M66334
14429F162694l18487J08796K05764m79j40396K36496L03846j99035K87808j69921
14419F477086M35374J34936J43239l5537M9433n7794M31615k1389K27201J27567
14409G911731j07127R8560J78514M6847K23546L03869N3599J29580j2460J18689
14399H945348L45282J51505m573L91979k8380j22045R23824k13250K82079k47410
$$ plain form
14468 3621448 3680147 3735105 3962035 3798142 3736361 3874422 3786794 3780437 3787831 4349923 4248500
14457 4248500 3920131 4392967 4524989 4310811 4179113 4581505 4701297 4552545 4380786
14448 4380786 4720801 4733138 4856850 4653773 4748140 5214031 4938440 5330643 5061863 5407053
14438 5407053 4971280 5361158 5642335 5326544 5578260 5870738 6023568 5696360 6162694
14429 6162694 5844207 5953003 6158767 6158288 6017892 6254388 6558234 6359199 6647007 6477086
14419 6477086 6912460 7047396 7190635 7155098 7204531 7146737 7578352 7556963 7784164 7911731
14409 7911731 7804604 7903164 8081678 8128525 8352071 8655940 8709539 8839119 8826659 8945348
14399 8945348 9290630 9442135 9437562 9829541 9801161 9679116 10602940 10389690 10671769 10424359
14389A0424359M77111J20554K00247K77745J14995J00872L82924N27775n6746
14380A2569836J67528M25655M41448O9084l0806J82299N90699J56180K72485K22364
14370A5066772m1811P97734O9554O75933K69974M40841J64708J31092N77328L96454
14360A8548579M48950K95635M46889P00198M78961J25931O73862O56386P64547
14351B3139938J11895N01256M35416R10626M73604Q80655O05144P80761N75880
14342B8415175J158488O90426J018650P60077Q53948J307923N97179R64208J417997
14333C7184071J198930Q45572J212101J424674Q27546J886617J558497J669690
14325D7807698J329711J804858J918979J753508J833210K225171J829350K417044
$$ plain form
14389 10424359 10901470 11022024 11222271 11500016 11615011 11715883 12098807 12626582 12569836
14380 12569836 12737364 13163019 13604467 13673551 13642745 13825044 14415743 14571923 14844408 15066772
14370 15066772 15024961 15822695 15892249 16568182 16838156 17278997 17443705 17574797 18152125 18548579
14360 18548579 18997529 19293164 19740053 20440251 20919212 21045143 21719005 22375391 23139938
14351 23139938 23251833 23753089 24188505 25099131 25572735 26453390 27058534 27839295 28415175
14342 28415175 29573663 30264089 31282739 32042816 32896764 34204687 34801866 35766074 37184071
14333 37184071 38383001 39228573 40440674 41865348 42692894 44579511 46138008 47807698
14325 47807698 49137409 50942267 52861246 54614754 56447964 58673135 60502485 62919529
14317F2919529K898330K375938K508596K886602L027348L245007L410222L417079
14309H6688651M079733L960007M483587M266188M911530N507596N090695N934939
14301A24922926O519239O589762P116911P311356Q072920Q658580R233590R511933
14293A87937217J0569095J0622494J2291794J2260300J3210785J3648342J4759562
14286B75299589J4762187J6079043J6073176J6868084J6843496J6736550J6149010
14279C88811135J6394523J4553026J3454935J2064007R629584O513620L328900
14272D64749730j075313l717694k579721k265053l882081o280897j0356827j2624970
14264D21967174j3853943j5428773j6020952j6920176j7013320j6555048j6848914
$$ plain form
14317 62919529 65817859 68193797 70702393 73588995 76616343 79861350 83271572 86688651
14309 86688651 90768384 94728391 99211978 103478166 108389696 113897292 118987987 124922926
14301 124922926 131442165 138031927 145148838 152460194 160533114 169191694 178425284 187937217
14293 187937217 198506312 209128806 221420600 233680900 246891685 260540027 275299589
14286 275299589 290061776 306140819 322213995 339082079 355925575 372662125 388811135
14279 388811135 405205658 419758684 433213619 445277626 454907210 461420830 464749730
14272 464749730 463674417 459956723 457377002 455111949 451229868 444948971 434592144 421967174
14264 421967174 408113231 392684458 376663506 359743330 342730010 326174962 309326048
14257C09326048j5760561j5095367j4803814j2832785j3516759j2976183j1891161
14250B12449418j1309528j0477371j0115682r195541q611692q017447p773873
14243A46948284p102240o919869o266534o271012n502157m745560m982269m572423
14235A00586220m520800m213991l926790l377888l118606l625674k987132k737887
14227G2077452l034257k601689k476955k099964k498725k242438j827584j843229
14219E3452611j529252k140972j753265j482950j445659o45588j426775j319208
14211D1708942j624816j276959r44287j205079l63070j089149j217655j452419
14203C2535508o04547r22313o98581n74877p28736j020456p69256n22401o86572
$$ plain form
14257 309326048 293565487 278470120 263666306 250833521 237316762 224340579 212449418
14250 212449418 201139890 190662519 180546837 171351296 162739604 154722157 146948284
14243 146948284 139846044 132926175 126659641 120388629 114886472 110140912 105158643 100586220
14235 100586220 96065420 91851429 87924639 84546751 81428145 77802471 74815339 72077452
14227 72077452 69043195 66441506 63964551 61864587 59365862 57123424 55295840 53452611
14219 53452611 51923359 49782387 48029122 46546172 45100513 44454925 43028150 41708942
14211 41708942 40084126 38807167 37862880 36657801 36294731 35205582 33987927 32535508
14203 32535508 31930961 31008648 30310067 29735190 29006454 27985998 27216742 26694341 26007769
14194B6007769p04911p2506j070538n99222o37021o62718n06905n10507M4241
14185B1287682j064495k13657m72090l69363q02318L1544m37884m06735m82236
14176A7070448l02421l34967n7907n46959m88696j88437K24761p62780k87654
14167A4325388k32710l90370n8573k81330p6194j83556m88646l50948K38267n53436
14157A1947892k08869j53137k68359J58765k93828m47623J49887p19489J34761
14148A0300000m93501N6001M1995l99420Q66l2198m38029J38845q8778l20603
14138H765178K12745k22798l04422j48243k49248L65538j92918l07761j2706k14930
14128G690435j54992j0978o5073P5343m71394K60311k04505l42387O954l39428
$$ plain form
14194 26007769 25302858 25230352 24159814 23560592 22923571 22260853 21753948 21243441 21287682
14185 21287682 20223187 20009530 19537440 19168077 18365759 18397303 17959419 17552684 17070448
14176 17070448 16768027 16433060 16375153 15828194 15339498 15151061 15375822 14613042 14325388
14167 14325388 14092678 13702308 13643735 13362405 13286211 13102655 12614009 12263061 12501328 11947892
14157 11947892 11739023 11585886 11317527 11476292 11182464 10734841 10884728 10165239 10300000
14148 10300000 9806499 9862500 9904495 9505075 9505941 9473743 9035714 9174559 9085781 8765178
14138 8765178 8977923 8755125 8450703 8302460 8053212 8418750 8225832 7918071 7905365 7690435
14128 7690435 7535443 7524465 7459392 7534735 7063341 7323652 7119147 6776760 6783714 6444286
14118F444286K48281l09500q4285K46335l78826k16117M26159k65708j55837O9753
14108F024541j18907J46175p86931M61369j77458l53501J13451P8364n1884j245
14098E333974J06223o11272J37507L09037k09808j29983K46836k05555l59892
14089D617067Q7147k396j90320K3704K10849m2229n6593j90484k84624N2943q5417
14078D139647r4146J34578l64823n7756j4673K43147j11421L7434J4602J09403
14068D035992j79012q7666N0255M8754l39168l3801J5909L0420J96135j41194
14058C596624J63351L9277j36966j83224M8821j97988j82290K29973o307P6636
14048C447907l45589J37582O5857j81040O9042m42177K62575k02722J02864K38387
$$ plain form
14118 6444286 6692567 6383067 6298782 6545117 6166291 5950174 6376333 6110625 5954788 6024541
14108 6024541 5905634 6051809 5264878 5726247 5548789 5195288 5308739 5387103 5335219 5333974
14098 5333974 5440197 4828925 4966432 5275469 5065661 4935678 5182514 4976959 4617067
14089 4617067 4704214 4701818 4511498 4535202 4746051 4703822 4647229 4456745 4172121 4225064 4139647
14078 4139647 4045501 4180079 3815256 3757500 3742827 3985974 3874553 3911987 3926589 4035992
14068 4035992 3856980 3769314 3819569 3868323 3529155 3495354 3511263 3541683 3737818 3596624
14058 3596624 3759975 3799252 3662286 3479062 3527883 3329895 3147605 3377578 3371271 3447907
14048 3447907 3102318 3239900 3305757 3124717 3193759 2751582 3014157 2811435 2914299 3152686
14038C152686m64510M83267j44429r5888k96623K44562r1528n2572J09765P448
14028B852178K14553l82401k5630j72422n2223q4971J01942L5272r8495J90498
14018B578301m83619K69921j68738M4493j05530K40995j41400J25079K7324l49913
14008B036913P5101J4416m8863Q6159n9538j73749j75389l0060q8029j5615K12317
13997A833663Q4806l0345j99887J10605P1218J38863L36232K91248J008904K950189
13987F595496Q471674J6722087R740092j8293654A1104897m534309j635402q27144
13979D108042q46856m71076K48834j45724l19255k18500J69447n6101o94219N74814
13969B349406j99141J51285k27737L1890l75499J31737O6914J5214j0993Q0149
$$ plain form
14038 3152686 2688176 3171443 3027014 2931126 2634503 2879065 2787537 2734965 2844730 2852178
14028 2852178 3066731 2684330 2658700 2486278 2434055 2349084 2451026 2486298 2387803 2578301
14018 2578301 2094682 2364603 2195865 2240358 2134828 2375823 2234423 2359502 2386826 2036913
14008 2036913 2112014 2126430 2077567 2163726 2104188 1930439 1755050 1724990 1636961 1621346 1833663
13997 1833663 1918469 1888124 1688237 1798842 1870060 2008923 2345155 2636403 3645307 6595496
13987 6595496 15067170 31789257 41529349 23235695 11104897 6570588 4935186 4108042
13979 4108042 3261186 2790110 3038944 2893220 2573965 2355465 2524912 2468811 1774592 2349406
13969 2349406 2150265 2301550 2073813 2105703 1730204 1861941 1928855 1944069 1933076 2013225
13959B013225l0702k38264P3216o9001J56490j86826K9347L19228m30006l22571
13949A314136Q91J91583L00233L4784l69203L12237j14000J30650l61671K69424
13939A709064l15331R7565J10076q7591K2218J84719l43232O39415n02009j05898
13929A408996R5608J40317m87302R6028J73411m2525k28657K36683l53471L00346
13919A339434J01399P0730K9001n3672l50904m433K53980j36477L8806l18240
13909I69624K10732J26571Q8818k67503r9268K95547l92056K70132J48761O0807
13899A412165j36559J69103j89610k62132K71509O019j71006J2165k1111j72051
13889I18492P5299L18740l35843Q2036r880K16852m18235O7770K94276K60849
$$ plain form
13959 2013225 1982523 1744259 1817475 1748474 1904964 1718138 1747485 2066713 1636707 1314136
13949 1314136 1315027 1506610 1806843 1841627 1472424 1784661 1670661 1801311 1439640 1709064
13939 1709064 1393733 1491298 1601374 1513783 1536001 1720720 1377488 2016903 1514894 1408996
13929 1408996 1504604 1644921 1157619 1253647 1427058 1384533 1155876 1392559 1039088 1339434
13919 1339434 1440833 1511563 1540564 1486892 1135988 1131555 1385535 1249058 1287864 969624
13909 969624 1180356 1306927 1395745 1128242 1028974 1324521 932465 1202597 1351358 1412165
13899 1412165 1275606 1444709 1255099 992967 1264476 1270495 1099489 1111654 1090543 918492
13889 918492 993791 1312531 976688 1058724 1048844 1265696 847461 915231 1209507 1470356
13879A470356n61134K59107j94137o5740J59182j8903L91821m87024L23059p792
13869A268795m83662K36570j62741P5868K44150m45297K17294K45598l62298J35183
13859I69460J3964K6697j04439r0137J3987J47274L41068l84237P6248k39794
13849G70091J09491K8976J26973j80123j76888M13344J6684n20636P16957j46284
13839A158585m58835j20432m1314L42900K03998k97775O539N4309l24378K79379
13829H02976j35013K62227k88421K7446q1477J59269l7269J95885J79159E35827
13818A081525j55181l6334J33869m09160j01822N22617k57227J78310k62342J83619
13808H77874l83316L18447J44503j80072J069J2923p440j45703K48789k29989
$$ plain form
13879 1470356 909222 1168329 974192 908452 1067634 1048731 1440552 953528 1276587 1268795
13869 1268795 785133 1021703 858962 934830 1178980 733683 950977 1196575 834277 969460
13859 969460 983424 1010121 905682 815545 829532 976806 1317874 933637 1009885 770091
13849 770091 879582 908558 1035531 855408 678520 1091864 1108548 587912 1304869 1158585
13839 1158585 699750 579318 538004 880904 1084902 787127 793666 847975 523597 802976
13829 802976 667963 930190 641769 669215 587738 747007 709738 905623 1084782 535827
13818 1081525 926344 890010 1023879 614719 512897 1035514 778287 956597 694255 877874
13808 877874 494558 813005 957508 777436 778505 791428 783988 638285 887074 657085
13798F57085J13974o1733N0731L2495k2998m0771l2775k84121M2713L38709R0835
13787H84144L842k64404K8453j30909P25M327L60378K2222l80074K08977j62883
13776E74798M8868l351M66890n34088m4416q8536K83419l27008j05702J54396
13766D25270L43633J70344M8277l73180J6078k66340O8597R7142o0857J31281
13756F00245K60550M4306C37724M46654k35348r73J84385j57943N2078M7079C18609
13744E28937Q2366k24380n9908J41534j32163J68606k20850L34160k18555K07651
13734F07398l9745K07451k58349k3188J05986J08206j94064p3342K29033o5441
13724F03945j20727Q4424j21429N4462J75436j52026j46934l7110J32826k7107
$$ plain form
13798 657085 771059 709326 760057 792552 769554 728783 696008 411887 454600 793309 884144
13787 884144 887986 623582 652035 521126 521851 526178 886556 908778 528704 737681 574798
13776 574798 623666 620315 1087205 553117 508701 420165 703584 376576 270874 425270
13766 425270 768903 939247 987524 614344 630422 364082 432679 529821 468964 600245
13756 600245 860795 905101 337724 784378 549030 548057 732442 574499 626577 673656 318609
13744 528937 611303 386923 327015 468549 336386 504992 284142 618302 399747 607398
13734 607398 567653 775104 516755 493567 599553 707759 513695 440353 669386 603945
13724 603945 483218 567642 446213 500675 676111 524085 377151 340041 472867 445760
13714D45760J70666B87741M22276l47502J37877J39258O9503k33181n0952M1446
13704D66466B01105L76938K01432C33881J77586L9289o7546K56100C52171L2951
13694C85122L62746j37884o6478J86306B81800P584L25272k60377L57157J611
13684G13047k23970k41312M75390B57379N83761B84789j04622N50616l03373J70907
13674E98317o2693A38025L67863A26247M61365k09125J9820J64818k65701M2465
13664C39889M3665L13201k00921j40082K99653j35802J58652k17432j88046N7657
13654C30434m3794K64084B10290p3679L21712l9816p3449K90814p5821J68324
13644G28375l54582q3730A19048K03296J27495j07175I8728K20128K80673A79124
$$ plain form
13714 445760 616426 287741 710017 362515 500392 639650 709153 475972 425020 466466
13704 466466 201105 578043 779475 333881 511467 550756 483210 739310 352171 385122
13694 385122 747868 609984 543506 729812 281800 289384 614656 354279 711436 713047
13684 713047 489077 247765 723155 257379 841140 284789 180167 730783 427410 598317
13674 598317 535624 138025 505888 126247 587612 378487 398307 563125 297424 339889
13664 339889 383554 696755 495834 355752 655405 519603 678255 460823 272777 330434
13654 330434 286640 550724 210290 136611 458323 418507 345058 635872 560051 728375
13644 728375 373793 290063 119048 322344 449839 342664 98728 318856 599529 179124
13633C95271A75241H6015K94889K63741l07158J5955r092j8849J06512j16130
13623C15883e3778F7176J28895K87490j91518J24708j98060K72039A76023b0020
13612A38863K13426L3904A47846K96082J51579L2501B85679M0460J26604Q3798
13602E36541j92175A38186L47751N6429B3733M42183j46298a18019A47237D3115
13591B97113A43569J41390f2547B52189J14082K9668F1971P6901J28204J86586
13581D53662j35336M8475K6911o9609l9790n3469M332M3713j25926J16474J26539
13570C95976j36570A8789M83752B39225g464D49901o3209A44326M07655b5207
13559D00192a0180B36749q7114L36025j59525J65856A12858J07417M2538g2984
$$ plain form
13633 395271 175241 86015 380904 644645 337487 353442 344350 325501 432013 315883
13623 315883 -53778 67176 196071 483561 292043 416751 218691 490730 176023 -20020
13612 138863 352289 386193 147846 443928 595507 628008 285679 326139 452743 536541
13602 536541 344366 138186 485937 542366 23733 465916 319618 -118019 147237 43115
13591 297113 143569 284959 -62547 252189 366271 395939 61971 138872 267076 453662
13581 453662 318326 366801 393712 324103 284313 230844 235176 278889 152963 269437 395976
13570 395976 259406 18789 502541 239225 -7464 449901 386692 144326 551981 -25207
13559 400192 -10180 236749 149635 485660 326135 491991 112858 220275 262813 -72984
13548A18493L78929B06596J4205Q0417M2356k6905j9971p3859L259Q0127K98343
13537F04568k23876j11707L4465D2957J21346J16292L6981P283l6171P4789K28962
13526E92439B30007q6317l3194e9306D64716G2772L31000A53458K85204Q3494
13516E22156A96094E1253K78527i320E0123P0522j0211J77817j27017L62035B13448
13504D90659a8116D2688O7227c6190A13886O5724M4844O9148r8688I79M32575
13493D33554d8102A22290N8250C9781c35108A09168M70647B79832A4474J31695
13483A46169K62807G0171N0461L5335E4536J47604L35352G4171K77545A10155
13472I3796m1925K7520J69041J63593a05512B15481n7115K62730j43640q7232
$$ plain form
13548 118493 497422 206596 220801 301218 343574 316669 296698 222839 226098 306225 604568
13537 604568 380692 268985 303450 42957 164303 280595 317576 324859 288688 363477 592439
13526 592439 230007 143690 110496 -59306 464716 72772 403772 153458 438662 522156
13516 522156 196094 51253 329780 -9320 50123 120645 110434 288251 161234 523269 213448
13504 490659 -18116 42688 109915 -36190 113886 179610 224454 293602 194914 979 433554
13493 433554 -48102 122290 180540 39781 -335108 109168 579815 279832 14474 146169
13483 146169 408976 70171 120632 155967 54536 202140 537492 74171 351716 110155
13472 93796 51871 79391 248432 412025 -105512 215481 158366 421096 277456 190224
13462A90224D6469M3869P1581J58671r6341j07024P3735M0698K7402j3990N7894
13451C02964d3989D70091A25913L96963k32820J47469H5773J70078J14827Q5142
13441D55820H4380J66974O9213j5379L6021G5152J39160A9088P2124J76131p9396
13430A87947e9354A90241a63183A68317c2382B52149A00981b35512D42610B4930
13419C67071E1666K99617A64172P2967A11211m6726J74538J15357q5877a24553
13408C92998d1505D14093i512D90820g3073C60953h8677B51435k0050E1639i7366
13396A15880N7231J25828i92B41913r8628C9480A5563J42273C9375L91201A29638
13384B28838n9994Q8696L3901a17211C55526o7070J9393H8530K06854L13742I3978
$$ plain form
13462 190224 46469 90338 161919 320590 224249 117225 190960 231658 259060 245070 302964
13451 302964 -43989 470091 125913 522876 290056 437525 85773 255851 370678 455820
13441 455820 84380 251354 320567 305188 341209 75152 214312 19088 91212 267343 187947
13430 187947 -59354 190241 -163183 168317 -32382 252149 100981 -235512 442610 24930
13419 367071 51666 351283 164172 237139 111211 64485 239023 354380 268503 -124553
13408 392998 -41505 414093 -9512 490820 -73073 360953 -88677 251435 231385 51639 -97366
13396 115880 173111 298939 -992 241913 143285 39480 15563 157836 39375 430576 129638
13384 228838 168844 257540 291441 -117211 355526 288456 307849 88530 295384 609126 93978
13372B67980q2578Q565p1379h796A52565O4176n6547L26851A85061J57583E4846
13360C4849K13440o1975K3794j7848r928K75736m9145A81698e2617A49601J34181
13349B83782A26324J5789b698C65001A08498O2426P758J49408k372J02895j30421
13338B98192o7250J61526o0688K8356K7566G289K62327C4188Q2501L01976D0326
13326B47220j20670K38716j57875o4271k5541C7889J23189K10380p6706F7283
13315A47093b79577B60135j6678a16733I2666M7690K46412j89303l3758B3240
13304C32279H3989J84082D7893O5858K55601j47880J30539i6068A06716c69926
13293A59647K058c8850B45168K52419E091K21554F9208O9914K52789o7511C2504
$$ plain form
13372 267980 185402 193967 122588 -8796 152565 216741 160194 487045 185061 342644 54846
13360 34849 248289 186314 210108 192260 182332 458068 408923 181698 -52617 149601 283782
13349 283782 126324 142113 -2698 365001 108498 170924 178682 328090 325718 428613 298192
13338 298192 230942 392468 331780 360136 387702 7289 269616 34188 116689 418665 40326
13326 247220 126550 365266 207391 143120 117579 37889 161078 371458 294752 67283
13315 147093 -279577 260135 243457 -116733 92666 140356 386768 197465 163707 23240
13304 332279 83989 268071 47893 113751 369352 221472 352011 -96068 106716 -369926
13293 159647 161705 -38850 245168 497587 5091 226645 69208 139122 391911 324400 32504
13281A96862K08544A11283O5030H5768K05215A01679b07947A87023d2269H0166
13270F394a5814B00134k1788b19503B69275A5830M4523a05577D24553d2667p0907
13259a13574A04223N2472D740K39860A00377M713J48614j23952L50653B38599
13248G0137b74754F5726e2m5829B9299J74494a0528D6799f4518q3523J1973D17101
13235B17704r6017N6533d9840B19113J22568J5206A40606a96829E2711K66587
13225C19298D0542P471K0482J74459H4512J09610o4895P8330a10135A39125j803
13214A37322n9795L17884C7168P8544a36028l848I3715K65971o3516c2389A39019
13202A46078k0241J62734B5916L95073A15446P9706f2734j44594b3655A81889
$$ plain form
13281 196862 405406 111283 176313 85768 290983 101679 -207947 187023 -42269 80166
13270 6394 -15814 200134 178346 -219503 269275 15830 60353 -105577 424553 -42667 -113574
13259 -113574 104223 156695 4740 244600 100377 105090 253704 129752 480405 238599
13248 70137 -274754 65726 -52 -45881 29299 203793 -10528 46799 -64518 -148041 -136068 417101
13235 217704 121687 178220 -49840 219113 341681 356887 140606 -196829 52711 319298
13225 319298 40542 48013 68495 242954 84512 194122 129227 207557 -110135 139125 137322
13214 137322 77527 395411 37168 115712 -136028 -139876 93715 359686 296170 -32389 139019
13202 146078 125837 288571 25916 420989 115446 195152 -62734 -207328 -23655 181889
13191b03615i18m240C05630A30211a44497i852F1113J60575b14008B29918l0224
13180A99694a99400A1906J23896j7948P781L57310b06095P9045H5825K2341b7569
13168A63632a49244B13377k5589C7956d3941I0717J31820q9921g351r3041A2959
13156F9409N0406K49449H7328J28392b70488B63959I5388j8954J79480r6505e4934
13144b34360P1840B21571o5088C6689J93468i3774B57682D4601Q9691J05238B2499
13132A5386L2816a75673C30149g9129B212L2683K44439a5087A86354h0939a7239
13120b81066A03565m4457L348O1612L5218C3751R6036a19523C95706a6749q5631
13109a02380D003c0129r5271a2829I4161B4167b5890B76750m3935a04327A33065
$$ plain form
13191 -203615 -918 -5158 305630 130211 -144497 -9852 61113 221688 -214008 229918 199694
13180 199694 -199400 11906 135802 117854 125635 482945 -206095 -127050 85825 108166 -27569
13168 163632 -149244 213377 187788 37956 -43941 90717 222537 132616 -7351 -100392 12959
13156 69409 119815 369264 87328 215720 -270488 263959 95388 76434 255914 159409 -54934
13144 -234360 -162520 221571 156483 36689 230157 -93774 257682 44601 134292 239530 22499
13132 15386 48202 -175673 330149 -79129 2212 34895 279334 -15087 186354 -80939 -17239
13120 -281066 103565 59108 62456 124068 159286 33751 129787 -119523 395706 -16749 -102380
13109 -102380 4003 -30129 -125400 -12829 94161 24167 -25890 276750 232815 -104327 133065
13097b22693H4641M718j4453M097N8337f2270G9050J92425e0082C0281J5224K99990
13085C45495A01857J5584K9335O8505B8421J62937c8273j0180H2697J44942a71733
13073e4982A82684b3685C1664j3169J31780g3376C25492F0004J77497A9184b74196
13061B58860j6123F3565h4164F5772k3782a65516E0392J1444a95320D4428J18963
13050A63391J16860F0623a08776H5630C8297b15244A64393a43114H7521D3700
13039A85699a280l6491k17298A41019J22893P4748d0868k42648A49509K96909
13029D46418n7083n7880o1915f545j73640A72148a0088j6485A22117a89167A53000
13017A46914l4400J67661f8066D5845L83600J32464k17148A50942a66785N9397
$$ plain form
13097 -222693 84641 89359 74906 79003 137340 -62270 79050 271475 -50082 30281 45505 345495
13085 345495 101857 117441 146776 215281 28421 191358 -38273 -48453 82697 227639 -171733
13073 -54982 182684 -23685 31664 18495 150275 -73376 325492 60004 237501 19184 -274196
13061 258860 242737 63565 -84164 65772 41990 -165516 50392 61836 -195320 44428 163391
13050 163391 280251 60623 -108776 85630 38297 -215244 164393 -143114 87521 43700
13039 185699 -1280 -37771 -255069 141019 263912 338660 -40868 -283516 149509 446418
13029 446418 389335 331455 269540 -6545 -180185 172148 -10088 -26573 122117 -189167 153000
13017 146914 112514 280175 -68066 45845 429445 561909 344761 150942 -166785 -107388
13007a07388H2778Q1795J33284C4324A4487Q4728C3871J12096k9863J14793b80903
12995B54698D6679L19745j70680m7833i7966H6227l9626O9374J61281b31439i5175
12983A38797j1318J06995A13722J54431D2164J61534K4567F1017J74021G2025
12972A7847J09154D3313i8762C711J94648l3275a6233k05178A9219M1985j1732
12961D9472c5173A11551g497A0691f9074C75718G0832b63140A05558N2645a76999
12949H9742J09287b23449G9932B9992J07791E0204a30489k0182C14661c4269r5555
12938a29824C58084d3884m8417L9443G9451I802L48562A77558o4135i3157A10404
12926b08623C01994H1524b14288C08895G0746D287a14562B44857j13827J46733
$$ plain form
13007 -107388 82778 164573 297857 34324 14487 99215 33871 145967 116104 230897 -280903
12995 254698 46679 366424 195744 147911 -97966 86227 46601 115975 277256 -231439 -95175
12983 138797 127479 234474 113722 268153 42164 203698 228265 61017 235038 72025
12972 17847 127001 43313 -98762 3711 198359 165084 -16233 -221411 19219 61204 49472
12961 49472 -35173 111551 -7497 10691 -69074 375718 70832 -263140 105558 158203 -176999
12949 89742 199029 -223449 79932 29992 137783 50204 -130489 -150671 314661 -34269 -129824
12938 -129824 358084 -43884 -92301 -52858 79451 9802 358364 177558 113423 -93157 110404
12926 -208623 301994 81524 -214288 308895 70746 4287 -114562 244857 131030 277763
12916B77763b78193C6023a04418c4579k1454j44429A07194a19204M7730k03831
12906b75305A50853c9146D10843D6282a51318c0144j76683C87779a04386I8499
12895I2827g7778A18827R1085I0662a42756E1466i1354j19115I5617e5981B95558
12883C0285J76354H3485a91283C0439K75661j12644a36275d3513F5285c67844
12872A0848K06293a17068G1220Q9604g4695j6398G1136J17556a43372B77708b73413
12860b34540d0006k98561C26056H9879a85105A42692a11645A11718L3273a16542
12849G6341a26809j5325A7111c2626C78487G5832b81828B15092J54696A61898
12838c4856B87048F0277h9857a8173A75835K5704b24473A04970e3411C07180b05283
$$ plain form
12916 277763 -278193 36023 -104418 -34579 -56033 -200462 107194 -119204 -71474 -275305
12906 -275305 150853 -39146 410843 46282 -151318 -30144 -206827 387779 -104386 98499
12895 92827 -77778 118827 209912 90662 -142756 51466 -91354 -210469 95617 -55981 295558
12883 30285 206639 83485 -191283 30439 306100 193456 -136275 -43513 65285 -367844
12872 10848 217141 -117068 71220 160824 -74695 -91093 71136 188692 -143372 277708 -273413
12860 -234540 -40006 -338567 326056 89879 -185105 142692 -111645 111718 144991 -116542
12849 76341 -126809 -142134 17111 -32626 378487 75832 -281828 215092 369788 161898
12838 -34856 287048 60277 -89857 -18173 175835 201539 -224473 104970 -53411 307180 -205283
12826B89921A23710b320j82349j38276A23221a4812j51952B35175e0291a4138
12815f3194C36790j61623g2018k04924B60157F3891N9054J37743G1090r514l0607
12804C0969J8124b07185f8324L263A92092m1384B8610L2430R9243P1223A03765
12792b5470l13277a18984A24566c1714k76B9691b65827F62h222C1502Q9755E659
12779A04358m9692N4563N1715A8272L6725a19039k06380J12785I1422b64805E9134
12767E6173P0651d5973A28146m34R744k1765b1078j27379D7996a14047a4817k87838
12755c02655A70155o3811i7055B268a90710E5231e2322o0409A28293a19086H2082
12743b64211C9507c27589A84581g6954A70569J00408F4743b5978p7575B06202
$$ plain form
12826 289921 123710 -2320 -184669 -322945 123221 -14812 -166764 235175 -50291 -14138
12815 -63194 336790 175167 -72018 -276942 260157 63891 122945 260688 71090 61576 30969
12804 30969 49093 -207185 -68324 -65061 192092 150708 28610 61040 160283 231506 103765
12792 -25470 -338747 -118984 124566 -31714 -31990 29691 -265827 662 -8222 31502 121257 5659
12779 104358 54666 109229 160944 18272 54997 -119039 -325419 -212634 91422 -264805 59134
12767 56173 126824 -45973 128146 127712 137456 115691 -21078 -148457 47996 -114047 -14817 -302655
12755 -302655 170155 106344 -97055 2268 -190710 55231 -52322 -112731 128293 -119086 82082
12743 -264211 39507 -327589 184581 -76954 170569 270977 64743 -25978 -103553 206202
12732i2289I5401L91847B1083Q1872Q5891c25448A31479a03811K1397j22364B36215
12720a6785B52993M656a76309A81146a24898d5026n6070A60090L25147A28757
12709B69613b2192C46748g21m5966f111A27502D0726J82433l0598g2416A89396
12697A46884n9645J66575E4627b74236E2679K21791A22283D2087J17454l2940
12687A26601j1614b55341N9312A13288J14128n4749a90836B67782A02324a22248
12676A68158N2915C2468N0490L07743B022J20435R6078g8442A35784a31521A59641
12664c81998A4181J3033K97622a28962B47433C7543J54350c9061k3403B05198
12653I9851C5291O0224a06437M6835j57651i3057k3863i552l1183i629p924D7546
$$ plain form
12732 -92289 95401 487248 21083 102955 188846 -325448 131479 -103811 -82414 -204778 236215
12720 -16785 252993 257649 -176309 181146 -124898 -45026 -101096 160090 485237 128757
12709 269613 -22192 346748 -721 -46687 -6111 127502 40726 223159 192561 -72416 189396
12697 146884 87239 253814 54627 -274236 52679 274470 122283 42087 159541 126601
12687 126601 114987 -255341 -196029 113288 227416 172667 -190836 267782 102324 -122248
12676 168158 221073 32468 82958 390701 2022 122457 218535 -78442 135784 -131521 159641
12664 -381998 14181 27214 324836 -128962 247433 37543 191893 -39061 -62464 205198
12653 99851 35291 95515 -106437 -59602 -217253 -93057 -116920 -9552 -40735 -9629 -17553 47546
12640H1580a46932d9433f551A03142M37600B01643F6078g3418n7540B82728j32028
12629A50700d0950l4973G8943b14640B30409A6802a98319B85141a2990C19892
12618B24361L10886h748l2929j22149o0744M5224h987A57333n2179a9644J962
12607a7682m5840k0618l1981k05782a53314N3269A0214b55101H1182Q9186n5521
12596A14847J87677e451C24187I3470k1696J21503a69136q8700a0103H8530c38506
12584C62947A78347m7760L01178b01781K3929C93213j44007K042l5370a14291
12573C08925p0455O3626A35373c0459E4223f6608C25636i2259H5132e1790B83101
12561c7102j67174J00706e0474j24156e5280j713C58839B8180A3317P307M38956
$$ plain form
12640 81580 -146932 -49433 -6551 103142 540742 201643 66078 -73418 -130958 282728 150700
12629 150700 -40950 -75923 78943 -214640 230409 16802 -198319 285141 -12990 319892
12618 224361 535247 -8748 -41677 -163826 -224570 -179346 -8987 157333 105154 -19644 -17682
12607 -17682 -63522 -84140 -116121 -321903 -153314 -100045 10214 -255101 81182 170368 114847
12596 114847 302524 -5451 324187 93470 71774 193277 -169136 -257836 -10103 88530 -338506
12584 362947 178347 130587 431765 -201781 -177852 393213 249206 251248 215878 -114291
12573 308925 238470 302096 135373 -30459 54223 -66608 325636 -92259 85132 -51790 283101
12561 -37102 -204276 -103570 -50474 -174630 -55280 -56993 358839 28180 13317 20624 459580
12550D59580b68986q1621f3870A22969a97270n2594M1409B40711C9169h3270A89494
12538A86758E6211a4530B6542N4564J73274a54829A66880c9994B99419n5636j08685
12527A35098n4252O0812c76687G7481a28262B85028I1969n499c38556G7O8816
12516F8893e5999j2461A57845n9363B2511i2086G9505A3579L74455b6788r6158
12505a22946i11k86438A90024i5153C30696b10452i2659A14400a47935B39523
12494a20496F0266a00538A64131F0433J00856J07147F1331l952f5769L2095j58216
12483a91890P7821n8922c6620A17221J13851b18024H7394J08306g4054C1593d12564
12471B5845L08659a91129B4625a22339M6929B83583j01150b68742B08968a97089
$$ plain form
12550 459580 -268986 -350607 -63870 122969 -197270 -249864 -208455 240711 39169 -83270 189494
12538 186758 56211 -14530 26542 81106 254380 -154829 166880 -39994 299419 243783 135098
12527 135098 80846 141658 -376687 77481 -128262 285028 91969 86470 -338556 77 68893
12516 68893 -55999 -68460 157845 98482 22511 -92086 79505 13579 388034 -26788 -122946
12505 -122946 -911 -287349 190024 -95153 330696 -210452 -92659 114400 -147935 239523
12494 -120496 60266 -100538 164131 60433 161289 268436 61331 57379 -65769 -33674 -191890
12483 -191890 -114069 -172991 -36620 117221 231072 -218024 87394 195700 -74054 31593 -412564
12471 25845 334504 -191129 24625 -122339 -75410 283583 182433 -268742 208968 -197089
12460H9544d9894l6650B49850A11842e4739j94107E8512A1557K42870b9604A22329
12448A75427l6615k0827c13710A82069a09901e0985B07383B4983a22644k816L308
12437a22152D07323a58212L6107k557I2789c30958a1224j54639O4684j15450H2788
12425B21397Q6127I9777a01392L1330A63506l8317a56343c455B9986L46022D2355
12413c0604m32702c6677l9917o8509B8473a2965q3481d7737A64602A7026J31026
12402A48052g4573F1271a76916A0928a74799B2666a42570B544a22591j10642K5960
12391b07273A31030D9384e9792b5632j48448A3863c18459A59157a5326A38988
12380g5153p19A44578J70323g7255n1371A25718M7584b05547h4269M1817A2482
$$ plain form
12460 89544 -49894 -86544 249850 111842 -54739 -248846 58512 11557 254427 -29604 122329
12448 175427 138812 117985 -313710 182069 -109901 -50985 207383 24983 -122644 -125460 -122152
12437 -122152 407323 -158212 -122105 -124662 92789 -330958 -11224 -165863 -101179 -216629 82788
12425 221397 307524 99777 -101392 -70062 163506 125189 -156343 -3455 29986 376008 42355
12413 -30604 -463306 -36677 -76594 -145103 28473 -12965 -96446 -47737 164602 17026 148052
12402 148052 -74573 61271 -176916 10928 -174799 22666 -142570 2544 -122591 -233233 -207273
12391 -207273 131030 49384 -59792 -25632 -174080 13863 -318459 159157 -15326 138988
12380 -75153 -75872 144578 314901 -77255 -128626 125718 173302 -205547 -84269 -42452 12482
12368i4125C6378b41931B1335J96176C9792a226l4653B47300A7675J20250K21015
12357C58940A36261A0773M0564j8512J30818a87485P8799A42745E4923c82130
12346B12121E143R7343a10722N4438a3760A41026a6007B48704a87733A08852a51245
12334b0694A04321O7719F5032C1569B858c06938B40998J504g088j1275A26976
12322A1972f1411I5130J84213c8651k30706R4437G6561R8649K71088F4563R5280
12311A59843h3946d1328A8763f5078A11424a84157k8286B63027a42730B38036
12300f667I9745R497d11901a7103j20465A67412C2934R9708E3150P4949P5628
12289B03727p180E0042A8049J77316e9427B39206b1665j9498A248M72349k09768
$$ plain form
12368 -94125 36378 -241931 21335 217511 39792 -1226 -35879 247300 17675 137925 358940
12357 358940 136261 10773 51337 32825 163643 -187485 -108686 142745 54923 -382130
12346 212121 5143 102486 -110722 -56284 -13760 141026 -16007 248704 -187733 108852 -151245
12334 -20694 104321 172040 65032 31569 2858 -306938 240998 242502 -7088 -18363 126976
12322 11972 -61411 95130 279343 -38651 -269357 -174920 76561 175210 446298 64563 159843
12311 159843 -83946 -41328 18763 -65078 111424 -184157 -212443 263027 -142730 238036
12300 -6667 99745 109242 -411901 -17103 -137568 167412 32934 132642 53150 128099 203727
12289 203727 196547 50042 18049 195365 -59427 239206 -21665 -41163 1248 473597 263829
12278B63829a24630A64207o9100g3736C04404R4897D8760f2255B09653b4144A31253
12266C1783Q73q013d3413A783a90963f2799A5605K17207B9412a20211B8385J91583
12254B19968i4908B60024a7625E254K45238F425J84786r3193b0871B12644B4702
12242c5092B18396c24480a15534B19318I1594l8134a83274I0093b24909d5387
12231A73610M3024o505l1261j1506b18273B19453h5331B65988K9950A00667b7064
12219E26332j62143A7170J36462J37112G0086K7636a57843B04232d3284j29591
12209a72875F7469j4213O1714j4289a65017A62764F0886i201j76859d7522B11711
12197C0240J84891a86529d0517H0777M0557K85141E1070J96360j00871C398a72055
$$ plain form
12278 263829 -124630 164207 95107 -73736 304404 399301 48760 -62255 209653 -24144 131253
12266 31783 32656 24643 -43413 1783 -190963 -62799 15605 232812 29412 -120211 28385 219968
12254 219968 -94908 260024 -17625 5254 250492 6425 191211 98018 -20871 212644 24702
12242 -35092 218396 -324480 -115534 219318 91594 53460 -183274 90093 -224909 -45387
12231 173610 216634 210129 178868 167362 -218273 219453 -85331 265988 295938 100667 -27064
12219 526332 364189 17170 153632 290744 70086 97722 -157843 204232 -43284 -172875
12209 -172875 67469 53256 114970 100681 -165017 162764 60886 -9201 -186060 -47522 211711
12197 30240 215131 -186529 -40517 80777 121334 406475 51070 247430 146559 3398 -172055
12185C03910D9641a53849B24880h8810A81578N7574a03053F2853f5005I4881L93584
12174D88465A36413M2472K14219F9536b10500h6811D0678a25425G3646a7703B38715
12162C2553a57468C89223I5971a62481b8549A79945G5320L61031a2836j37859
12152a50695c6510j19850A61959E4564J29452K6839p7213M7844G2550B9539b17719
12140F6518h1474A93089J0053Q4611C1049a62730c0223H9939k0398d2150A18077
12128a658E8771J29367C0447b02221A23711K6278i0421q5227F9859h0906c6054
12116F312K00726C505c04450I4117a19535B45742a15120J1145j86844A36677K9214
12105A65891i7689j09288C82178i3390A02737M9061J55378h3450p7763e1310I540
$$ plain form
12185 303910 49641 -153849 224880 -88810 181578 239152 -103053 62853 -65005 94881 488465
12174 488465 136413 178885 393104 69536 -210500 -86811 40678 -125425 73646 -17703 238715
12162 32553 -157468 389223 95971 -162481 -28549 179945 75320 436351 -12836 -150695
12152 -150695 -36510 -156360 161959 54564 184016 210855 133642 181486 72550 29539 -217719
12140 66518 -81474 193089 203142 287753 31049 -162730 -30223 89939 69541 -42150 118077
12128 -1658 58771 188138 30447 -202221 123711 149989 -90421 -175648 69859 -80906 -36054
12116 6312 207038 3505 -304450 94117 -119535 245742 -115120 -103975 -290819 136677 165891
12105 165891 -97689 -206977 382178 -93390 102737 151798 307176 -83450 -161213 -51310 9540
12093d7106o0225E1925c49637a60309G8971a75151P2057B01547B7600a11780q3917
12082a95697c2789B47636f1706D7122R8829P9337F922P6976O87718M61543m04752
12071H28407C04085a5489k00662k9032g6446F9090f1031A52726G359O7031L23186
12060C97576h0564H2136A8822e5442l01060b0197e36l41965G9171M9858M8080
12049A77109H2141j8143a41634N0955c5303p2012c6268r318A56344a55895G5872
12037I2832C3348O3502K48822A21266g5460A37322a21804G3775a02039k3345c3687
12025E8947a87162c2138f100G4983a14292j4213F9130a63183j08937A7835a55043
12013C2904h1935d028B2810c09339D48133A91626a62466A78021J22926A850g3912
$$ plain form
12093 -47106 -107331 51925 -349637 -160309 78971 -175151 -103094 201547 27600 -111780 -195697
12082 -195697 -32789 247636 -61706 47122 145951 225288 6922 83898 771616 1233159 828407
12071 828407 304085 -15489 -216151 -245183 -76446 69090 -61031 152726 7359 74390 397576
12060 397576 -80564 82136 18822 -55442 -356502 -20197 -536 -342501 79171 129029 177109
12049 177109 82141 63998 -141634 -90679 -35303 -107315 -36268 -45586 156344 -155895 75872
12037 92832 33348 96850 345672 121266 -75460 137322 -121804 73775 -102039 -125384 -33687
12025 58947 -187162 -32138 -6100 74983 -114292 -128505 69130 -163183 -272120 17835 -155043
12013 32904 -81935 -4028 22810 -309339 448133 191626 -162466 178021 300947 1850 -73912
12001i0369B70428E9431L4761c9088H3262B0363c8662j29008J9177K0020A07013
11989b33362j25586J58491Q3821D3976a74803H9695a12365A36858o16A5352J32136
11978A47488a5278A30816n4202A629c5300A71451K2042a41919p4955p7989J8510
11967b76353a9595B21998b74411d1060k18814C46189c08252J08237P5017M2881
11957h2117k11857D8236A2367h0581A33811g9483l72410b14274A49903K24782
11947C74685p1403j03874E1649R3603c09099d5529A4525d35758H0629d7637r8257
11936a45894B09898d0666B7934g1382D8847c1975B90188b24631B1144e6177B4679
11924C3742a94204F3206Q2963C0508b36668B13626F4406C1068a73410a2000o9316
$$ plain form
12001 -90369 270428 59431 94192 -39088 83262 20363 -38662 -167670 -148493 -128473 107013
11989 -233362 -358948 -200457 -116636 43976 -174803 89695 -112365 136858 136242 15352 147488
11978 147488 -15278 130816 76614 1629 -35300 171451 193493 -141919 -216874 -294863 -276353
11967 -276353 -19595 221998 -274411 -41060 -259874 346189 -308252 -200015 -124998 -82117
11957 -82117 -293974 48236 12367 -80581 133811 -79483 -451893 -214274 149903 374685
11947 374685 303282 199408 51649 145252 -309099 -45529 14525 -435758 80629 -47637 -145894
11936 -145894 209898 -40666 27934 -71382 48847 -31975 290188 -224631 21144 -56177 24679
11924 33742 -194204 63206 146169 30508 -236668 213626 64406 31068 -173410 -12000 -81316
11913h1316H7553B4208f1643A93171K87642j93464m8839c0905r8555p5919c901
11901A61071I612l535J12311J55959A24054c7094a2334G9371Q0039b27912d0626
11889d7538q0692g174j28609C21898k8349r7720b88062a4052p8116K2397D3112
11877A04114L9824D8516c61507R7267l9794a38979E0079B3993a72824E9790a40003
11865a11094l33523P1809a29021d0751B16386E9854i4003k70799P9857A6234M5567
11854F1801c1810A07414l5229b84453J14330a1076o1338k1730q6876g8386G9794
11842A18982g2418j17908B44593F0828J098a83239M4431r178B7650O4788H341
11830a25372A00672b76688b9523j02094A01715b50A49668b18685i1630B55885
$$ plain form
11913 -81316 87553 24208 -61643 193171 480813 287349 238510 -30905 -129460 -205379 -3901
11901 161071 9612 6077 118388 274347 124054 -37094 -12334 79371 159410 -227912 -40626
11889 -47538 -128230 -7174 -135783 321898 293549 195829 -288062 -14052 -92168 -69771 43112
11877 104114 143938 48516 -361507 -264240 -304034 -138979 50079 23993 -172824 59790 -140003
11865 -111094 -444617 -372808 -129021 -40751 216386 59854 -94003 -364802 -284945 16234 61801
11854 61801 -31810 107414 72185 -284453 -170123 -11076 -72414 -94144 -181020 -78386 79794
11842 118982 -72418 -190326 244593 60828 61926 -183239 -138808 -147986 27650 92438 8341
11830 -125372 100672 -276688 -29523 -131617 101715 -250 149668 -218685 -91630 255885
11819g6531j40189R0133L9574j20009C7113a58019E9843a05947B21611d9209j30487
11808a79696C80018B5600c78148f7570j5389j36443e0797h730k15391J05958A41972
11796B21841b46755d4739F2290a96572j32841g6454i516k12018A10234a04723
11785A76456a48341m72468B13584H6560e896F8443J08274a13155F9828b3952l8602
11774f2554c1026G3464H767d583k02987J9369A52905b49136j65457A58131a31706
11762a36761K8404F9178b70697A48255d7791R099j69457B8618E619a58118G992
11750A64381e747A92133C3866a63704L576B7033O4597i8628c2379D7270K21265
11739B68535J53432F2273b10841B40605a61679A70563e4951A6085f2042p9889
$$ plain form
11819 -76531 -216720 -126587 -87013 -207022 37113 -158019 59843 -105947 221611 -49209 -179696
11808 -179696 380018 25600 -378148 -67570 -82959 -219402 -50797 -8730 -224121 -118163 141972
11796 221841 -246755 -44739 62290 -196572 -329413 -76454 -9516 -221534 110234 -104723
11785 176456 -148341 -620809 213584 86560 -5896 68443 176717 -113155 69828 -23952 -62554
11774 -62554 -31026 73464 8767 -4583 -207570 -188201 152905 -249136 -414593 158131 -131706
11762 -136761 -108357 69178 -270697 148255 -47791 -38692 -208149 28618 5619 -158118 7992
11750 164381 -5747 192133 33866 -163704 -160128 27033 91630 -98628 -32379 47270 268535
11739 268535 421967 62273 -210841 240605 -161679 170563 -54951 16085 -62042 -141931
11729a41931N1841j33601g0198L4070C47054a54072j00595A36058b06937G6859
11718c722A99534k1380m3801b21218A71706D8853a49998L0972h25A49084f1222
11706C44080H984K40620f0922K6784B04735a54385A78794H1119b61310F4377a23787
11694a1011m9015r568A02436J15543a85452j45279a34228C497L07670A29221f4285
11682F1422N6172K12255A49431D3889a44600B4948g6205m5172N6410l96962b9410
11670D0307J10544J32504j03693C2934J06436a45440a1245k0918P712H5200a23537
11658c3563B74364A17887b44830c4460A64810C3213L26306a08138j00651a00498
11647A47944b46961h8631b7176k70231D37523a21562d5095j12432B40535J08166
$$ plain form
11729 -141931 -90090 -223691 -70198 -36128 347054 -154072 -254667 136058 -206937 76859
11718 -3722 199534 178154 134353 -221218 171706 48853 -149998 -119026 -825 149084 -61222
11706 344080 8984 249604 -60922 -34138 204735 -154385 178794 81119 -261310 64377 -123787
11694 -11011 -60026 -69594 102436 217979 -185452 -330731 -134228 3497 311167 129221 -64285
11682 61422 117594 329849 149431 43889 -144600 24948 -76205 -121377 -64967 -461929 -29410
11670 40307 150851 283355 179662 32934 139370 -145440 -11245 -32163 -24451 85200 -123537
11658 -33563 274364 117887 -244830 -34460 164810 33213 359519 -108138 -208789 -100498
11647 147944 -246961 -88631 -27176 -297407 437523 -121562 -45095 -157527 240535 348701
11637C48701h7108A6672a38406H5053a6648A20262a17912A06738j8763J10954
11627A98929K05117A68152L87671B27739p0648b6534A39094j0262n8327l4639
11617C5866b6898H2013C8360f1405n12210E1457M90820e0139C66696a9841A35639
11605B06244a15811B20087I3228A231b64440A17002J56798H1783h2229J2455j04646
11594a74420A95646G3773a83449B3426c2338k67381C08222a12932A49715c6563
11583D17273A63637K7615L2064N7998h9354B06155h9858A59025a25121A91941
11572H4818d3462A42641L11713G6562a18240C54627b24297J07833M9636I0255
11561a49687B52017H9130L40731A0595h5850B05167r9663P3925d5709m7882m0617
$$ plain form
11637 348701 -87108 16672 -138406 85053 -16648 120262 -117912 106738 87975 198929
11627 198929 404046 168152 555823 227739 157091 -26534 139094 128832 70505 35866
11617 35866 -26898 82013 38360 -61405 -573615 51457 542277 -50139 366696 -19841 135639
11605 206244 -115811 220087 93228 1231 -264440 117002 273800 81783 -82229 -69774 -174420
11594 -174420 195646 73773 -183449 23426 -32338 -299719 308222 -112932 149715 -36563
11583 417273 163637 191252 223316 281314 -89354 206155 -89858 159025 -125121 191941
11572 84818 -43462 142641 454354 76562 -118240 354627 -224297 -116464 -66828 90255
11561 -149687 252017 89130 429861 10595 -85850 205167 105504 179429 -45709 -93591 -134208
11550a34208k5239B45023b4601C07061b0728I2438l0367j0219O4574C0170J19463
11539A49633N8358l2962L34070j46649a51271A58373F1507J70882m3453N7788
11529B46724o5793o899a32169A30363D0544a05949C4141b2497A50797a96336B57294
11517A66160a45375A36671d0160B48358b20720A24982O5938I3419a35018B97929
11506A38110L7473O417b590A27827P755L6622L29601A3542J40287J20739H254
11494d6180E1435a8172A75637G7181N8215i2259a0886A06294M0686m1274C6709
11482I1878J06426N5174q8470i8689E2586k2070J90106M8484J16390j80794b5269
11470A03548K67363A45302L0525b8050B46381J62083b16465A2639J00825J73652
$$ plain form
11550 -134208 -159447 245023 -24601 307061 -20728 92438 62071 51852 116426 30170 149633
11539 149633 207991 175029 509099 362450 -151271 158373 61507 232389 188936 246724
11529 246724 180931 174032 -132169 130363 40544 -105949 34141 -22497 150797 -196336 257294
11517 166160 -145375 136671 -40160 248358 -220720 124982 190920 93419 -135018 297929
11506 138110 175583 182000 -2590 127827 135582 172204 501805 13542 153829 274568 8254
11494 -46180 51435 -18172 175637 77181 135396 -92259 -10886 106294 146980 105706 36709
11482 91878 198304 253478 165008 -98689 52586 30516 220622 269106 385496 204702 -25269
11470 103548 370911 145302 175827 -28050 246381 408464 -216465 12639 113464 287116
11460B87116I8592K21983B5896E152J90608b83806A25035M6040j1129a03004A28357
11448F6247K11120E4958c00476B99263f7659j41747a2537D2500P8771k3636K79843
11437C77478A59498h8755j65698a0613r1500c3206G5570O6570P4730M3832b33336
11425B44435H4466O1518a58736B85886a11395b8839E0323d8123D53798b54859
11414c18872A73406Q0816o6552a75197f5084B6708a68459A60681a20517E8769
11403A14440M8350Q9806j7408b4535C2225a20535A35510d16673h9330H9167m1610
11392D7557b61483L592R026Q3588j56144F8720c75244A20817K89884E0094b56884
11380g0827C3524h9876J3167H7015j0571j1929K2670k4298J63372g2634k9932
$$ plain form
11460 287116 98592 320575 25896 5152 195760 -283806 125035 171075 159946 -103004 128357
11448 66247 277367 54958 -300476 299263 -67659 -209406 -12537 42500 121271 97635 377478
11437 377478 159498 -88755 -254453 -10613 -102113 -33206 75570 142140 216870 260702 -233336
11425 244435 84466 145984 -158736 285886 -111395 -28839 50323 -48123 453798 -254859
11414 -318872 173406 254222 187670 -175197 -65084 26708 -168459 160681 -120517 58769
11403 114440 162790 252596 235188 -24535 32225 -120535 135510 -416673 -89330 89167 47557
11392 47557 -261483 -257891 -248865 -165277 -321421 68720 -375244 120817 410701 50094 -256884
11380 -70827 33524 -89876 -76709 87015 76444 64515 87185 62887 226259 -72634 -102566
11369a02566A64001f4443j71471B76202a25653C6467J1035b71810h1525I6453
11358I521O129E557a56265B47622e1726k36817A7936Q9429b15105p2478a3705
11346b4710A54605b18095C480L16331j18050b7249I5144a62529A9284b4276A0614
11334b37931c0471E0300c13055A60610G86d7141C08894a71353f1771K7274k48491
11323b82988A73364c21189A00281h4064D7404P4103c47087A19607L783a44559
11312A78459G9312k884J65843b36323H4314M9946c3955j22349G2394c4403B6321
11300a7336k6554j05078A09482B4483K0951Q3079i9019C961c80624H4052h5233
11288b66544O4122A56055b06239e240j0577C0422c71807H7030c9830j41724A69634
$$ plain form
11369 -102566 164001 -64443 -235914 276202 -125653 36467 47502 -271810 -81525 96453
11358 9521 15650 5557 -156265 247622 -51726 -288543 17936 107365 -215105 -287583 -13705
11346 -24710 154605 -218095 3480 319811 201761 -27249 95144 -162529 19284 -24276 10614
11334 -237931 -30471 50300 -313055 160610 786 -47141 308894 -171353 -61771 -34497 -282988
11323 -282988 173364 -321189 100281 -84064 47404 121507 -347087 119607 123390 -144559
11312 178459 79312 76428 242271 -236323 84314 134260 -33955 -156304 72394 -34403 26321
11300 -17336 -43890 -148968 109482 24483 45434 128513 -99019 3961 -380624 84052 -85233
11288 -266544 -202422 156055 -206239 -5240 -15817 30422 -371807 87030 -39830 -181554 169634
11276e11264d476I1892B7121b2108j04793R617d1343n4693A15502D4688K7559
11265G2247a19213N6271j97162A38272a05432b9803A02675a66801Q3180o1287
11255a44908B07940E9088K21221C4913a7557j23751b4776j88938B93707b35270
11244b8629q2457o0669Q3458C23496g8223p525k50612a15632j53393m2012A38984
11232E3323a20892o9796k68664K7041e9818A27744o0357M704b0528B7391K30639
11221B58030a12551A03990K06047I6895a86094A10832K8796H730c2260C7786b03183
11209c77723J09147A02492a96700b5635C9247Ee374A19182J03237P5707q2767
11198B15359a4352A69144q1391K1114m8251K500c49029c0069m5524k91549C1314
$$ plain form
11276 -511264 -4476 91892 27121 -22108 -126901 -117284 -41343 -96036 115502 44688 72247
11265 72247 -119213 -62942 -260104 138272 -105432 -29803 102675 -166801 -83621 -144908
11255 -144908 207940 59088 280309 34913 -17557 -141308 -24776 -213714 293707 -235270
11244 -28629 -111086 -171755 -88297 323496 -78223 -85748 -336360 -115632 -269025 -311037 138984
11232 53323 -120892 -190688 -459352 -432311 -59818 127744 67387 72091 -20528 27391 258030
11221 258030 -112551 103990 310037 96895 -186094 110832 139628 8730 -32260 37786 -203183
11209 -377723 -268576 102492 -196700 -25635 39247 5 -5374 119182 222419 298126 215359
11198 215359 -14352 169144 87753 108867 60616 63116 -349029 -30069 -75593 -367142 31314
11186a20757o3436C70639c08306j09755d1816A0054g5190E0296a1514j49567j54976
11175c16057a49563g606A02547a61097l11562B14172R2045a17126l6142B54556
11164A20713a85834j73588a24902A76778a79882f5357A42601F7950Q3557M0577
11154A92084D9914b13153i4471C16516I0308a22126E3272K1381J84795a99612
11143D95524A89992a59537B05611O8675I7758B4448J28756J7085a573B62785f3300
11131A45902R1229A08410c0935q8625I6605a58254G5734K53722A10999J184f7717
11119A44894i7330J9604A32104e1454I7265h8003D70276A714L36247c7106C74583
11107i6346B4918L4951a07588j86071R8989C08588b07371A22132B0064J46663
$$ plain form
11186 -120757 -184193 370639 -308306 -418061 -41816 10054 -75190 50296 -11514 -161081 -316057
11175 -316057 -149563 -7606 102547 -161097 -472659 214172 306217 -117126 -153268 254556
11164 120713 -185834 -359422 -124902 176778 -179882 -65357 142601 67950 151507 192084
11154 192084 49914 -213153 -94471 316516 90308 -122126 53272 74653 259448 -199612
11143 495524 189992 -159537 205611 274286 97758 24448 153204 170289 -1573 262785 -63300
11131 145902 237131 108410 -30935 -119560 96605 -158254 75734 329456 110999 112183 -67717
11119 144894 -97330 -77726 132104 -51454 97265 -88003 470276 1714 337961 -37106 374583
11107 -96346 24918 59869 -107588 -293659 -194670 308588 -207371 122132 20064 166727
11097A66727J1992J42108b30496I6050a29707A82753n8655J08738K475F1121b33324
11085D18371j39879A04150K01630C3366J68141o4502M052M25925j97230e7070
11074I7278J83486K4187A39593n687m5537N5309L32291K2714O5083k09272A42657
11062B36615N11333l30245I2671J01326L90747p9113n203n2716J3684M59588l77592
11051E43392K0502l7506N7987Q4411k24745L29122M4625j87998K30067n5794J3499
11040H17562l14499c2973F57750j75556L6978j49465q8518P8983A37566K36485
11030C74051K14211o0562M5827J80876k95651K00773l7184k96708J64859O7822
11020E58314O9204J66330j08406B37556M15834j02967J54055j38564l2909j40161
$$ plain form
11097 166727 178719 320827 -230496 96050 -129707 182753 124098 232836 235311 61121 -233324
11085 418371 278492 104150 305780 33366 201507 137005 141057 566982 369752 -57070
11074 97278 280764 304951 139593 133906 88369 143678 475969 498683 563766 354494 142657
11062 236615 747948 417703 92671 193997 584744 505631 500428 447712 461396 920984 543392
11051 543392 563894 526388 584375 668786 444041 773163 817788 629790 859857 804063 817562
11040 817562 503063 -32973 657750 482194 519172 369707 281189 360172 137566 374051
11030 374051 588262 527700 573527 754403 458752 659525 622341 325633 490492 558314
11020 558314 627518 793848 685442 237556 653390 550423 704478 565914 533005 392844
11010C92844l667j40890J53010M5211K2707N3384J91511O7175l00211L85160k5720
10999H40514k95517o3499L27682l70037J76004B61038N78535q8482j27215J09964
10989G33840l60003K78350K30196k44423N52742l47731r7792L14236P6781q0366
10979A055830J28972j09319M81669L34787j25168Q1324K64944N50924k57000k11519
10969B195444J65965m67229k60273M6606k14489J45806J42522l31848M3072J28378
10959A593954P9112n0162j44514L29841l33406L6295m6060o08732P1359l82516
10949E45171j67916j52005J19459J4266j70546L35883j98971Q565J1203P6658
10939D21767b1767B08105a6875I0731l8834L19652d1246A21061d644l0108B28109
$$ plain form
11010 392844 389177 248287 401297 446508 469215 522599 714110 781285 481074 866234 840514
10999 840514 544997 481498 809180 439143 615147 261038 839573 751091 623876 733840
10989 733840 373837 652187 882383 637960 1190702 842971 745179 1059415 1136196 1055830
10979 1055830 1184802 1075483 1557152 1891939 1766771 1848095 2113039 2663963 2406963 2195444
10969 2195444 2361409 1894180 1633907 1680513 1466024 1611830 1754352 1422504 1465576 1593954
10959 1593954 1673066 1622904 1478390 1808231 1474825 1511120 1465060 856328 927687 545171
10949 545171 377255 225250 344709 358975 188429 524312 325341 333906 345109 421767
10939 421767 -21767 208105 -16875 90731 51897 371549 -41246 121061 -4644 -34752 228109
10927B03536A1705a97088F3433n651l084B0644f9740A69414C5307O7202a029j31819
10915a32848D6847j2619M8017a3909B48202k0577F2720a11959c0743k4825J3821
10904d1747C11398A28972a53746A29992a2340A81642b82051G9719H399e2130j72464
10893b24594B9117J71273a3981j59677F677K5418b29037r8445g134A49414c61730
10881C22778b5808A33849n8923J45964K00095b53129f0568A51747a15669A4243
10870a33301B04017e76745a43705A10902a91021A09973q33m2251a94970O4807
10860a30163D8813e7040J7041j71957D02856F963K11221a24151k00960A48122
10849h1393B68598c28448A15554b08135i577C4707a22878q1927j2710O9177A50626
$$ plain form
10927 203536 11705 -197088 63433 57782 54698 20644 -69740 169414 35307 102509 -1029 -132848
10915 -132848 46847 34228 82245 -13909 248202 227625 62720 -111959 -30743 -55568 -41747
10904 -41747 311398 128972 -153746 129992 -12340 181642 -282051 79719 8399 -52130 -224594
10893 -224594 29117 200390 -13981 -173658 6677 32095 -229037 -327482 -7134 149414 -361730
10881 322778 -25808 133849 74926 220890 420985 -253129 -60568 151747 -115669 14243
10870 -133301 204017 -576745 -143705 110902 -191021 109973 109140 66889 -194970 -130163
10860 -130163 48813 -57040 -39999 -211956 402856 6963 218184 -124151 -325111 148122
10849 -81393 268598 -328448 115554 -208135 -9577 34707 -122878 -204805 -217515 -148338 150626
10837a73233H4518j6715O3424J57183A00363f2061b7243E35603j13429G8991J37135
10826B16126m1687a24878A25450j8423b75596c6700j65689N8617k19292a9039
10815B31017o7912b4458B16097E1423a85727f0091p8937C9237J60634f2349H4
10803B59439c1177j91127i015F5963a98005f1445M258l0265L4140n367B43971
10791F4648c14475A32003E5166J7024j491J80993B8486e2176l1199p0674o7151
10780b21200B95291r2530k1536a16898A47172F3093j7980a8673j02474p5839B01150
10768C5285A2094b02204C21109i6224j4756D4131c50201c7730l83023A04976a66056
10756E6023k080P9486c0365A02635i3645E6253e6676j18082E7379f1560A20837
$$ plain form
10837 -173233 84518 67803 131227 288410 100363 -62061 -27243 535603 422174 78991 216126
10826 216126 174439 -124878 125450 107027 -275596 -36700 -202389 -143772 -363064 -19039
10815 231017 163105 -24458 216097 51423 -185727 -60091 -139028 39237 199871 -62349 84
10803 259439 -31177 -222304 -9015 65963 -198005 -61445 -57187 -87452 -53312 -58679 243971
10791 64648 -314475 132003 55166 72190 70699 251692 28486 -52176 -83375 -154049 -221200
10780 -221200 295291 202761 181225 -116898 147172 63093 45113 -18673 -121147 -196986 201150
10768 35285 12094 -202204 321109 -96224 -110980 44131 -350201 -37730 -420753 104976 -166056
10756 56023 53943 133429 -30365 102635 -93645 56253 -56676 -174758 57379 -61560 120837
10744f8152e612B33545r189a43689k26863J84565j02212N0753P4487a9479F9274
10732a45119j37210I4598K4206d5817H5430R3630g1045q7132C3899o656J28411
10721A55654L2499l2673J59586a62593D17853b97329c1742j78332c1666C41846
10710A06689J54745j30660L8239g6600A02322a66863j05604R4949P4638n5959
10700a58839N618J7924O2333j62667o2667M1764k06993B3640a34785j0995d8699
10688G7056b14695b9241f568m1037o2186b6489k45332h0178m9914n449l69696
10677e05237A63368i4390p0936c8051l4201I6057b19302O6986B22073a87135q8808
10666b75943a35509c4511B36921b33843J02313E3512J22848a81597M6650A4434
$$ plain form
10744 -68152 -5612 233545 224356 -143689 -370552 -185987 -288199 -237446 -162959 -19479 69274
10732 -145119 -282329 94598 118804 -45817 85430 179060 -71045 -158177 33899 27243 155654
10721 155654 188153 155480 315066 -162593 417853 -297329 -31742 -210074 -31666 341846
10710 106689 261434 130774 169013 -76600 102322 -166863 -272467 -177518 -102880 -158839
10700 -158839 -153221 -135297 -72964 -235631 -298298 -256534 -463527 23640 -134785 -145780 -48699
10688 77056 -214695 -29241 -6568 -47605 -109791 -26489 -271821 -80178 -130092 -135541 -505237
10677 -505237 163368 -94390 -165326 -38051 -72252 96057 -219302 -152316 222073 -187135 -275943
10666 -275943 -135509 -34511 236921 -233843 -131530 53512 176360 -181597 -134947 14434
10655c35134J44491C2993a37461j98087b5361j07683J5358j49229B4225g7898
10644b77015j53891b8649j81644r1799g2700r0619g0494j65172j18625a69687
10633A18408E6856L031J25748k5322b11479H3062a497B6637b11572f6188K5617
10622d0571k04883A35835b18603P1832J2178b8095A06424K53182C0555E278K41171
10611B46449j09473i6989n4776B36210c34782A13012a87517G9665i8436A09206
10600e9560m8876d1950A55774i5731k38138b1758r4543G1635a30720B2621a52037
10588C04319J6568E4272a85820h4431A9555L3363j7463c05111M9678o1998B47580
10576A94118b32070A41009j629a26690A80681l665n1278g8363j4423k203j9444
$$ plain form
10655 -335134 -190643 32993 -137461 -335548 -25361 -133044 -117686 -266915 24225 -77898
10644 -277015 -430906 -28649 -210293 -302092 -72700 -163319 -70494 -235666 -354291 -169687
10633 118408 56856 59887 185635 160313 -211479 83062 -1497 26637 -211572 -66188 -40571
10622 -40571 -245454 135835 -218603 -146771 -134593 -28095 106424 359606 30555 5278 246449
10611 246449 136976 -96989 -151765 236210 -334782 113012 -187517 79665 -98436 109206
10600 -59560 -108436 -41950 155774 -95731 -333869 -21758 -116301 71635 -130720 22621 -152037
10588 304319 320887 54272 -185820 -84431 19555 52918 35455 -305111 -255433 -317431 247580
10576 194118 -232070 141009 139380 -126690 180681 177016 125738 -78363 -92786 -94989 -114433
10565a14433k20284K3364F149K7192J27034N610e9176C4706J36656a5710f130
10553B33205H7813b26434j53171o3027B39278d2991j14635q2291B53770e4768
10542a36351o7044c3385I3262b67647g3825j53515i4136k33412a26168N8030D9119
10530c3528k88953J37581M8232A04342g4332b9572a736k08952n4610C12743D7646
10518a24819B2128J93763a60304A17563L00733d08370C1387a80642b0245C80873
10507I0870b5463A31736j2375g8291A01234c2754I264a37055A84036c27399d6822
10495c12931A34498A7359b29478b9987D8519b0857A54045b11918H2736K91799
10485C74535I4579c0450k5012F08562n5925k31167J23789J2646l7136r4500A47802
$$ plain form
10565 -114433 -334717 -311353 6149 33341 160375 165985 -59176 34706 171362 -15710 -6130
10553 233205 87813 -226434 -379605 -442632 239278 -42991 -157626 -239917 253770 -54768
10542 -136351 -203395 -33385 93262 -267647 -73825 -227340 -94136 -327548 -126168 -68138 49119
10530 -33528 -322481 -184900 -136668 104342 -74332 -29572 -1736 -210688 -265298 312743 47646
10518 -124819 22128 215891 -160304 117563 418296 -408370 31387 -180642 -20245 380873
10507 90870 -25463 131736 119361 -78291 101234 -32754 9264 -137055 184036 -327399 -46822
10495 -312931 134498 17359 -229478 -29987 48519 -20857 154045 -211918 82736 374535
10485 374535 94579 -30450 -55462 608562 552637 321470 445259 457905 420769 326269 147802
10473a03645A96588a46848A71119G8758k3302K64775a42923E956K22915a07558
10462C1286L512e4670k91770a25710c8173I2324a56243r6751P506j58730a96023
10450F73Q1366b37888C0410M9993N0597a62164j47549N4194C23806a61721B6950
10438a41566e2108K2028o1395B67395P487a9998k2659k49548i0326A94639A9678
10426A45597b392I8937a46961j7691C862a51330I47L48821H1009j1052K81518
10415C51475b13756B55121o6362F1097O1630b01723e4621A16863b47290J12446
10405a34844F9060a30972A37301b27237c4119m3465B77436J924I7807h8024F2719
10393g8318C0759L73099a69470b8058A08656n3424a23119j37480e0308C11020
$$ plain form
10473 -103645 196588 -146848 171119 78758 55456 320231 -142923 5956 228871 -107558
10462 31286 34798 -54670 -346440 -125710 -38173 92324 -156243 -252994 -245488 -404218 -196023
10450 673 82039 -237888 30410 80403 131000 -162164 -309713 -255519 323806 -161721 26950
10438 -141566 -52108 -30080 -91475 267395 274882 -19998 -42657 -292205 -90326 194639 19678
10426 145597 -2392 98937 -146961 -164652 3862 -151330 947 349768 81009 69957 351475
10415 351475 -213756 255121 188759 61097 122727 -201723 -54621 116863 -247290 -134844
10405 -134844 69060 -130972 137301 -227237 -34119 -77584 277436 279360 97807 -88024 62719
10393 -78318 30759 403858 -169470 -28058 108656 55232 -123119 -260599 -50308 311020
10382D8956A8442f3667D14689i0926B50301L1594a22775B30102H227J73226J67972
10371C49425j31999I3974K48368L8680L25723B39734A9134N58989a43316E6787
10360B1874R0960J8131L08841I7352N28716A40151d7672B31983L36771A18613
10349G18527B74266O2910J39198B00588J31468L00310j62617A18595a8762A58683
10338C27034j24145a50223A51452d1660C47805A34573F0884J4161j7953O234i439
10326I2924J35005D0310d06114A23732K31391j15897A12080m4085N0308a28091
10315a65766c2664A86114p6864i4384K104o712A64987c08955A26925K04914a4130
10303H7646b89544E8751I110L09239d3588j05095C60811k6704f7081A0616J65455
$$ plain form
10382 48956 18442 -63667 414689 -90926 250301 281895 -122775 230102 8227 181453 349425
10371 349425 217426 93974 342342 381022 706745 239734 19134 578123 -143316 56787
10360 21874 112834 130965 439806 97352 626068 140151 -47672 231983 568754 118613
10349 718527 274266 337176 476374 200588 332056 632366 469749 118595 -18762 158683
10338 327034 202889 -150223 151452 -41660 347805 134573 60884 75045 57092 63326 -9439
10326 92924 227929 40310 -406114 123732 355123 239226 112080 67995 118303 -128091
10315 -165766 -32664 186114 109250 -94384 -92280 -98992 164987 -308955 126925 331839 -14130
10303 87646 -289544 58751 9110 318349 -43588 -148683 360811 334107 -67081 10616 176071
10292A76071b11067D5643d33556A67679h6340d0688m9887K1768n6180d9611k7495
10281g7106B00891i8268j8239d0503C8392J61260L19861A72413m6945a75142j15562
10270b90704i9297A32763a28211p0010C7714L473a17773A61616f6419D1327i219
10258D08569A88374K90239G3248Q1749o7000b470m0840m6732J620A42776d8963
10246b7470C8288K7048J5152C1289Q1047c8820k37215a19933B3222a98767F6679
10234c3641l5202B9251b9379e799A44874K6320A9422L1934b40678e7838A99002
10222b530I5109J75856i7687a0587n5747F639a3050I6952A5789c5703B95131H0738
10209B16082b04674A69968c63441D7315a88465j58015H9341b54606L070i8593
$$ plain form
10292 176071 -211067 45643 -433556 167679 -86340 -40688 -90575 -68807 -124987 -49611 -77106
10281 -77106 200891 -98268 -116507 -40503 38392 199652 519513 172413 125468 -175142 -290704
10270 -290704 -99297 132763 -128211 -198221 37714 41187 -117773 161616 -66419 41327 -9219
10258 408569 188374 478613 73248 154997 87997 -2470 -43310 -90042 -88422 142776 -48963
10246 -27470 38288 65336 80488 31289 112336 -38820 -276035 -119933 23222 -198767 66679
10234 -33641 -68843 29251 -29379 -5799 144874 171194 19422 51356 -240678 -57838 199002
10222 -2530 95109 270965 -97687 -10587 -66334 6639 -13050 96952 15789 -35703 295131 80738
10209 216082 -204674 169968 -363441 47315 -188465 -346480 89341 -254606 -251536 -98593
10198f1309B71532o5897e3190k11990A34024o3423O0433c05363Q9258K6379H3910
10186h1093K1286a8998B82854e472A62881B5679M9671c60410A31512f7341A58156
10174a33658a3683m2495B5943c5542j74894d4793B3462J23271f39068a48737l1088
10163a79825k10247n0508b6492m3723F3316a56121j29992a23902A80469c41973
10152b76464i7352F5813K28378a9732G9226d289A71222F3511a04486B80999c41165
10140I9979N7303e9644j70156C1608N5376a75207B02701b12251M5486p9713d6799
10128C8511q045d79092B06232B912Q8685e0833B3215i8697A28583K16594a87073
10116b07689C88380E4536J2460a16570c7741O786q9687o6671A38106a69637k69579
$$ plain form
10198 -61309 271532 205635 -53190 -265180 134024 70601 131034 -305363 -216105 -189726 83910
10186 -81093 -59807 -18998 282854 -5472 162881 25679 75350 -360410 131512 -67341 158156
10174 -133658 -13683 -56178 25943 -35542 -210436 -44793 23462 146733 -639068 -148737 -179825
10163 -179825 -390072 -440580 -26492 -70215 63316 -156121 -286113 -123902 180469 -341973
10152 -276464 -97352 65813 294191 -19732 79226 -4289 171222 63511 -104486 280999 -341165
10140 99979 157282 -59644 -229800 31608 86984 -175207 202701 -212251 -166765 -246478 -46799
10128 38511 30466 -479092 206232 2912 91597 -50833 23215 -98697 128583 345177 -187073
10116 -207689 388380 54536 66996 -116570 -37741 -30955 -120642 -187313 138106 -169637 -439216
10105d39216h1061m4696b747k42887A14992a45141b2272G149J71717b84693B69825
10093c29700g0703D1683b61131A06737B8530J51723J64853c7519n7513f821E9487
10081E499L3789a31616k09842O7778A45013a32647F6435F602J05424c44221a07126
10069a14727l5593d1967H8137c52258G5501b50218g842C00153a0978A3624h2660
10057C277a60497d1840J1465a2220j48711d0882m2613A62849p4133j5627o824
10046F6265f7192E8766O5168d04530h2012q4783g6202b5763j10967A53676J25754
10035B79430b46504A56210h2428K2460q5716A5438d28801a40067F85a61194O9921
10024i1273B6846a66842j44603J0179g9749j5250A7771a07710c6954l2768A89294
$$ plain form
10105 -439216 -81061 -125757 -2747 -245634 114992 -145141 -22272 7149 178866 -284693 269825
10093 -329700 -70703 41683 -261131 106737 28530 180253 345106 -37519 -95032 -6821 59487
10081 5499 39288 -131616 -341458 -273680 145013 -132647 66435 6602 112026 -344221 -107126
10069 -114727 -150320 -41967 88137 -352258 75501 -250218 -7842 300153 -10978 13624 -82660
10057 3277 -160497 -41840 -30375 -12220 -160931 -40882 -83495 162849 88716 73089 66265
10046 66265 -67192 58766 123934 -404530 -82012 -166795 -76202 -25763 -136730 153676 279430
10035 279430 -246504 156210 -82428 -59968 -145684 15438 -428801 -140067 685 -161194 -91273
10024 -91273 26846 -166842 -311445 -301266 -79749 -94999 17771 -107710 -36954 -69722 189294
10012B50055F3609a95125M6020A73068K60180B7595j371f3448o8325B3883e1835
10000F1371b53818G1912B6282M5490a99588D5610f5360B2292d1078m2741l28598
9989d12417A28804h4028j71086k7365a35119C5252c3850A65336A8414a06671A78052
9977A07126d9457p480D7728a51160P4610F1468d44518a41636A37163f3464k89124
9966c52588J39949G8562b70551e8988F3750b05733j40762R9579p0343F116a99519
9954A6912a6520k2677D6300f3959b1727E5634c02303a12965k62465A42377n6160
9943H6217a4044q0826C4995b18816h8828F9668c0852j13498b6098E8978q516a35746
9930g5189q1796C0624K4946a92325i524k59426a19561H3052b39088A11292l7217
$$ plain form
10012 250055 63609 -195125 -149105 173068 433248 27595 26224 -63448 -131773 23883 -51835
10000 61371 -253818 71912 26282 71772 -199588 45610 -65360 22292 -41078 -83819 -412417
9989 -412417 128804 -84028 -255114 -282479 -135119 35252 -33850 165336 18414 -106671 178052
9977 107126 -49457 -56937 47728 -151160 -76550 61468 -444518 -141636 137163 -63464 -352588
9966 -352588 -212639 78562 -270551 -58988 63750 -205733 -346495 -246916 -317259 6116 -199519
9954 16912 -16520 -39197 46300 -63959 -21727 55634 -302303 -112965 -375430 142377 86217
9943 86217 -14044 -94870 34995 -218816 -88828 69668 -30852 -144350 -26098 58978 50462 -135746
9930 -75189 -156985 30624 55570 -192325 -9524 -268950 -119561 83052 -239088 111292 74075
9919G4075a87858N5742M3695A84427b85903A36411b71118B21836P4700b49593
9908a26431L1205c411C837a67636D72065H5118b25301R3944e0524A85881c12719
9896b22463A18925e2554a4596j21995K5545k9020L8963k5384b7148m46888G1624
9884F852Q2707b8254q9989N8354F0034b47198D2296i7816J6136B05762c78864
9872b32410b5065j4694j52010e9425l5894a5790j66718b4207l1539O414A64466
9860g2239l11838P0105A7125a13112A41597O1850I01Q4947a97649O6339L9878
9849i1432q0249j41251B18249c3692A20394b13403j16047G4392a2712j73420j1778
9838a97910A88522A3879c49472a70517j42635a10881q4161k14669c4804B37725
$$ plain form
9919 74075 -187858 -132116 -88421 184427 -285903 136411 -271118 221836 296536 -249593
9908 -126431 -95226 -3411 3837 -167636 472065 85118 -225301 -131357 -50524 185881 -312719
9896 -222463 118925 -52554 -14596 -136591 -111046 -140066 -101103 -126487 -27148 -474036 71624
9884 6852 89559 -28254 -118243 -59889 60034 -247198 42296 -97816 -81680 205762 -378864
9872 -232410 -25065 -39759 -191769 -59425 -95319 -15790 -182508 -24207 -55746 -49332 164466
9860 -72239 -384077 -313972 17125 -113112 141597 203447 901 85848 -197649 -131310 -91432
9849 -91432 -171681 -312932 218249 -33692 120394 -213403 -329450 74392 -12712 -186132 -197910
9838 -197910 188522 13879 -349472 -170517 -313152 -110881 -195042 -409711 -34804 237725
9827h8564j90983B5020a59156b5571l11079F6163b39394i2560o941k41826H9517
9815b1308A72741e14457F4573K53340A16549i3113A33028m6799N0617a96253F6242
9803G9212A9905R5506c72859j00388c7072A37873e6487A75507d33686B50327a29148
9791g4548I2546c3563e043n7097G0258q646a8781k50062e3566E4978c06154H0693
9778A563i3148j81131a17757C35224d458l64332i0906G6610e8342E0869a0862
9766E3938i4160B8591b4646C457K56208H0294k9690a42287n8095h3486K2951k89449
9754c49984I0477P411c22619g7995l27720f4309B8296b21570i8356j16021D2186
9742A11683b05350k71495a48606d4941j26830N7358e6778j07032I7474R1462O0263
$$ plain form
9827 -88564 -279547 25020 -159156 -25571 -336650 66163 -239394 -92560 -99501 -341327 89517
9815 -21308 172741 -514457 64573 317913 116549 -93113 133028 86229 136846 -196253 66242
9803 79212 19905 115411 -372859 -473247 -37072 137873 -56487 175507 -433686 250327 -129148
9791 -74548 92546 -33563 -5043 -62140 70258 61612 -18781 -268843 -53566 54978 -306154 80693
9778 1563 -93148 -274279 -117757 335224 -4458 -368790 -90906 76610 -58342 50869 -10862
9766 53938 -94160 28591 -24646 3457 259665 80294 50604 -142287 -200382 -83486 -60535 -349984
9754 -349984 90477 97888 -322619 -77995 -405715 -64309 28296 -221570 -98356 -214377 42186
9742 111683 -205350 -476845 -148606 -44941 -171771 -114413 -56778 -163810 97474 188936 249199
9731B49199A1643a32788A82255a82865A4404c0316k65014J20234O8883k03520
9721c09733c7022F9086a49152l7923E1743J558R8831p1136Q2433d1820j8674G5485
9708b13441o0797A33304f0417j53570P1763A6343b07944A96656B4503b33455O5740
9697a67715M0096D9160b42006k62542a10684m1615j61185b8156j76681A83192
9686d4854n131A96309E287O6103c54232j09788G8915a4656j82807f1465C904a90202
9673a5725j74631P2558D2309I867J92517C6577K30173b77546O9016L6154e1586
9661E2702b91982b6697C01273d1298J6810E5771c4729j98333A72100M0481F2950
9649a13704j09237j22852k3950A22629b3764m6498L3172n9916M5220m2939l9139
$$ plain form
9731 249199 11643 -132788 182255 -182865 14404 -30316 -295330 -175096 -106213 -309733
9721 -309733 -37022 69086 -149152 -187075 51743 53301 152132 80996 163429 -41820 -60494 75485
9708 -213441 -274238 133304 -60417 -213987 -142224 16343 -207944 196656 24503 -233455 -167715
9697 -167715 -127619 49160 -242006 -504548 -110684 -152299 -313484 -28156 -204837 183192
9686 -44854 -49985 196309 5287 71390 -354232 -464020 78915 -14656 -197463 -61465 3904 -190202
9673 -15725 -190356 -117798 42309 9867 202384 36577 266750 -277546 -208530 -172376 -51586
9661 52702 -291982 -26697 301273 -41298 -24488 55771 -34729 -233062 172100 212581 62950
9649 -113704 -222941 -345793 -369743 122629 -23764 -70262 -37090 -97006 -51786 -94725 -133864
9638a33864A25072a12880L3660B068b93659J4308h1344B03499a07863A36646E8284
9626c25036f2122n1009J3925H1716h5979C44818G7251Q653J4798e2164j79918
9615b32082k4659f1653E7946L330e0429m7197k20178E4414J0318b5196n1504a3893
9602g4791j15331A44648h1562K4708q8320D6880b5288G6035n695K7912l5448k2576
9590D0228i2982k7515d316j47480A06984a87265K9740D9351k3027f4747A24153
9578B05162a21060F5949a72315A16687n7989a01308j41125C8946a60080j56080
9568c16160C1521a90229A51819g1838B7247b4150j782m1646l31259J42724j13313
9557c69426J59299D5808a56235j8877O2957c8606A91758B7284a1183j81956E7068
$$ plain form
9638 -133864 125072 -112880 -79220 2068 -293659 -279351 -81344 203499 -107863 136646 58284
9626 -325036 -62122 -113131 -99206 81716 -85979 344818 77251 85904 100702 -52164 -232082
9615 -232082 -256741 -61653 57946 61276 -50429 -97626 -317804 54414 64732 -25196 -76700 -13893
9602 -74791 -190122 144648 -81562 -56854 -145174 46880 -25288 76035 70340 98252 62804 40228
9590 40228 -92982 -120497 -4316 -151796 106984 -187265 -157525 49351 26324 -64747 124153
9578 205162 -121060 65949 -172315 116687 58698 -101308 -242433 38946 -160080 -316160
9568 -316160 31521 -190229 151819 -71838 27247 -24150 -25932 -67578 -398837 -256113 -369426
9557 -369426 -210127 45808 -156235 -175112 -112155 -38606 191758 27284 -11183 -193139 57068
9545C0399J72319a62683A48016b05076d6202j40904K3736L064q7615k5665J33277
9534a40309j18264J07679A25287b60871j66186o987c7679q2950I9103P5360i3970
9522A31824J03941a38769j1889p9829I971J01488a24092P896e071B32821A05975
9510b06353E9417b12398H420a3130N345B2278f7125B0628a28621n6647b3259j89807
9498b13066Q718h7963I2509c04764e5227A97010E3284K10531l3830b05089d1394
9486c04258A31698a89841j00652a79A84210m1838a99934K7723J3165A42422e9975
9474d9960E1451P1748d1651A38755P3797a02284J1209L4579j30955I6729d27337
9462a51743L8004B76116b10633R8039L8234j81106B00418b47867Q3831f9293l59674
$$ plain form
9545 30399 202718 -162683 148016 -205076 -46202 -187106 -163370 -160306 -247921 -273586 -140309
9534 -140309 -258573 -150894 125287 -260871 -427057 -434044 -37679 -120629 99103 174463 -93970
9522 131824 235765 -138769 -150658 -230487 9971 111459 -124092 -116196 -5071 232821 105975
9510 -206353 59417 -212398 8420 -13130 -7785 22278 -67125 20628 -128621 -185268 -23259 -213066
9498 -213066 -204348 -87963 92509 -304764 -55227 197010 53284 263815 229985 -205089 -41394
9486 -304258 131698 -189841 -290493 -179 184210 142372 -199934 -172211 -159046 142422 -59975
9474 -49960 51451 123199 -41651 138755 212552 -102284 -91075 -56496 -187451 96729 -427337
9462 -151743 -113739 276116 -210633 -112594 -74360 -255466 200418 -247867 -164036 -69293 -428967
9451d28967a99857B46987o8889j405H4595B2526a72718A1439K01429M7961b82676
9439F3341a06008D1529a35533B43256c27565a40448H4700c12317g9175d456j19040
9428a23496B34J10424c25098H5334b15323k8425j14586I4614Q5994a48421a7432
9416e1678o5248l3217n5284A01182i0166L0918I7837a2160j02789j576j30827
9405b47352i9116j1974A16486J67466j23778n0212a77903a166B36755O0823a48466
9393a57728h867j45524l9813I7774J35882a66350r4008l8385J20446A85261b17288
9381c8130k71558A61753J18541b5485l03056A87806e1635A24310a36769A05429
9370A49512a31750b669n3033A25697C6979a10480k04855C87879A28399a55621
$$ plain form
9451 -428967 -199857 246987 178098 176693 84595 22526 -172718 11439 212868 260829 -282676
9439 63341 -106008 41529 -135533 243256 -327565 -140448 84700 -312317 -79175 -4456 -123496
9428 -123496 234 110658 -325098 85334 -215323 -243748 -358334 94614 180608 -148421 -17432
9416 -51678 -116926 -150143 -205427 101182 -90166 -59248 97837 -12160 -114949 -116525 -247352
9405 -247352 -99116 -111090 116486 283952 160174 109962 -177903 -1166 236755 297578 -148466
9393 -157728 -8867 -154391 -194204 97774 233656 -166350 -260358 -298743 -178297 185261 -217288
9381 -38130 -309688 161753 280294 -25485 -328541 187806 -51635 124310 -136769 105429
9370 149512 -131750 -2669 -55702 125697 36979 -110480 -315335 387879 128399 -155621
9359b05441b283G8366l2366M7940A2223M6600d8398j5657B43189E8869O7378b28859
9346i4330l3471O087A11002f8716A76861J47071A25988d7269o4079L3134l0353
9335a08567k5069A84757h869B20419F6532c5759I741K16326b9466j83523j01199
9324c14188a29871B03606a11971b077q1978a5924C30384i4120C5225f8135m4943
9313a13078M1067K5930C01397J79107A75125i3915l6393L9824p1611c3702j67746
9302b01448Q2912A70957O8138c06896b5275m3922A24217b60597h7807l66182F8586
9290i3840K3894o9625A02159k5334G116b24569A38851D222L8335J08687a48060
9278G8151L33934B4155f2625j55590P0589k93169C3574J87647p3165G0183J72747
$$ plain form
9359 -205441 -2283 78366 46000 93940 12223 58823 -48398 -64055 243189 58869 126247 -228859
9346 -94330 -127801 -121714 111002 -68716 176861 323932 125988 -47269 -111348 -78214 -108567
9335 -108567 -133636 184757 -8869 220419 66532 -35759 9741 226067 -29466 -212989 -314188
9324 -314188 -129871 203606 -111971 -2077 -84055 -15924 330384 -94120 35225 -68135 -113078
9313 -113078 -72011 -46081 301397 480504 175125 -93915 -130308 -90484 -162095 -33702 -201448
9302 -201448 -118536 170957 239095 -306896 -25275 -69197 124217 -260597 -87807 -453989 68586
9290 -93840 -69946 -139571 102159 76825 7116 -224569 138851 4222 42557 151244 -148060
9278 78151 412085 24155 -62625 -218215 -147626 -440795 33574 221221 148056 70183 242930
9267B42930k9485c17320a3358l03792k28059a05939C01825a54855L5926A13789
9256B24316n2521D9722a41231A15332g6452M717B58144D2571b04602j28692A23464
9244g164E2178c54969d4556j18096p1547r3518B33271b7159r9450n8646A11572
9232d08174d7724j89114M1107K1564B91950e7637B22581a09632m7295B9003k579
9221B6424h0739B02251I9177c5821j388k5782m1664F768i9907A81871G8498P1356
9209A49854a14105l95450B9560a28516n6103A08258k7785F533a71771A28347h7794
9197b66982D4016L7847e0935j33424A39944N5051H4124a67379e6160k7560b4307
9185B85642b58162g5930b9690p8702k01412C11d0402m44599c158F9018f6754q1086
$$ plain form
9267 242930 213445 -317320 -13358 -317150 -545209 -105939 301825 -154855 -118929 113789
9256 224316 171795 49722 -141231 115332 -76452 -71735 258144 42571 -204602 -333294 123464
9244 -7164 52178 -354969 -44556 -162652 -234199 -327717 233271 -27159 -126609 -185255 111572
9232 -408174 -47724 -236838 -195731 -174167 291950 -57637 222581 -109632 -156927 29003 26424
9221 26424 -80739 202251 99177 -35821 -37209 -62991 -104655 6768 -99907 181871 78498 149854
9209 149854 -114105 -509555 29560 -128516 -184619 108258 80473 6533 -171771 128347 -87794
9197 -266982 44016 81863 -50935 -184359 139944 194995 84124 -167379 -56160 -83720 -24307
9185 285642 -258162 -75930 -29690 -108392 -309804 311 -40402 -485001 -3158 69018 -66754 -147840
9173a47840A57214n1618c5976A14614c63773a77728j36076A99751b60549J9546
9163b41003M1179P3455M9382r1148i517C9817b89522E4309b4102H994b94054r665
9151c03719a1219B95500q5401C2675a0667A28023d4482k06224c1833A48216M5944
9140A94160c236A30482b91830e94j95730P9900j18212I6934M7261J6599d9173
9128a34603Q860A11265a00827J8018j49396A32652C5037a46215C4812e9204j5544
9117g4748r5978C21295b00691h6951l92571a76073k9589r9239A69597b94015i1610
9105B4647L25448C7012I549J98462g549H15b20534o8227J15610A66801a17147
9093b39944C7529b28581B4659K71178b72784d6730B99391e9037m7272m4139E0677
$$ plain form
9173 -147840 157214 105596 -35976 114614 -363773 -177728 -313804 199751 -260549 -241003
9163 -241003 -199824 -126369 -76987 -168135 -9517 39817 -289522 54309 -24102 8994 -294054 -303719
9151 -303719 -11219 295500 210099 32675 -10667 128023 -44482 -250706 -31833 148216 194160
9140 194160 -3236 130482 -291830 -594 -196324 -116424 -234636 96934 144195 160794 -49173
9128 -134603 -125743 111265 -100827 -82809 -232205 132652 35037 -146215 34812 -59204 -74748
9117 -74748 -170726 321295 -200691 -86951 -479522 -176073 -205662 -304901 169597 -294015 -91610
9105 24647 350095 37012 9549 208011 -7549 815 -220534 -288761 -173151 166801 -117147
9093 -239944 37529 -228581 24659 295837 -272784 -46730 299391 -59037 -106309 -150448 50677
9081a02101M8498m7664A46768A986i446H1161p548J16411a95272B17214h1224
9069A01377l6290e3913B73467a1338j39365A04165J04019c5147k67552a46226
9058c0293k63655c2089P136A95432c10182A65226a67090f8102A38036N6950b26972
9046B43809I5907K3147b45860a3914A26810e5649k72931A15857j6284c46415A03699
9034i6954a7022B8833h3652j9412j24449R7237A02900I110J99747d854j72973
9023a77827A2431b06801F8733L0315i9054E7036a53377D21220C034b63248J27386
9012a35862o6638A413a57129e2719I4665B6076a23494l3084M3089L4307B63346
9000a73622c7148A24438c29598a40411J2818a0803j15717L1006K0336B18992a52777
$$ plain form
9081 -102101 -53603 -101267 146768 1986 -9446 81161 73613 190024 -195272 217214 -81224
9069 101377 65087 -53913 273467 -11338 -150703 104165 208184 -35147 -302699 -146226
9058 -30293 -293948 -32089 -24953 195432 -310182 165226 -167090 -68102 138036 194986 -226972
9046 243809 95907 119054 -245860 -13914 126810 -55649 -328580 115857 99573 -346415 103699
9034 -96954 -17022 28833 -83652 -103064 -227513 -130276 102900 9110 208857 -4854 -177827
9023 -177827 12431 -206801 68733 99048 -99054 57036 -153377 421220 3034 -263248 -135862
9012 -135862 -202500 1413 -157129 -52719 94665 26076 -123494 -156578 -113489 -79182 263346
9000 -173622 -37148 124438 -329598 -140411 -127593 -10803 -126520 -95514 -75178 218992 -152777
8988i6450J3392H7505c4236G2380c41356A54055A6534a82029h3551j41432c4963
8976b60182A16561a44629b7716J3052A58135a70232n2922A81117n5144m9061a79454
8964a65019g8418j05060B9460K08154b5332E4849N7858d37279A41851J0337d90496
8952A9202K77557j19928A9465h2707j54361e3054k87443n964A84642n8603c2688
8940A43280M8519r945K094o5050b15710g2555C50075F3437a39644a2597A75625
8928g4389k62543A28567Q8397L51617P99794K351719O615074J325486B588204
8918F10118A63686J2221K2195C8727P4096n0354m798M3419a57084h406D82379
8906I9226C990a47968B40023I2773b74689J28346j50363D4489J27915D8821g7228
$$ plain form
8988 -96450 -83058 87505 -34236 72380 -341356 154055 16534 -182029 -83551 -224983 -34963
8976 -260182 116561 -144629 -27716 -14664 158135 -170232 -223154 181117 125973 76912 -179454
8964 -165019 -78418 -183478 29460 237614 -25332 54849 112707 -437279 141851 152188 -490496
8952 19202 296759 176831 19465 -82707 -237068 -53054 -340497 -346461 184642 126039 -32688
8940 143280 191799 181854 183948 118898 -215710 -72555 350075 63437 -139644 -12597 175625
8928 -74389 -336932 128567 216964 568581 1368375 3720094 10335168 11660654 2588204
8918 610118 163686 175907 198102 38727 112823 62469 57671 101090 -157084 -8406 482379
8906 99226 3990 -147968 240023 92773 -274689 -146343 -296706 44489 172404 48821 -77228
8894A13092b14982C42065m8084H9990g2468A85414k3390a34352C11575i6139j92202
8883b88341K9386A71926i4567o5461C52643F2883J48962Q8423I9123p823i8557
8871b12893i9636A04437J74609c16884a2844A57844b15146j11204J02782i2629
8860A75767c00682J22080Q3444A24120m1978i0041B5438d7954m05325f46j21643
8849a22289l84057B9745N1924h2700K9303C83166h1383j44957I2607I50J20043
$$ plain form
8894 113092 -214982 342065 293981 89990 -72468 185414 162024 -134352 311575 -96139 -288341
8883 -288341 -258955 171926 -94567 -160028 352643 62883 211845 300268 99123 91300 -98557
8871 -212893 -99636 104437 279046 -316884 -12844 157844 -215146 -326350 -223568 -92629
8860 175767 -300682 -178602 -95158 124120 82142 -90041 25438 -47954 -453279 -646 -122289
8849 -122289 -506346 29745 81669 -82700 -53397 383166 -81383 -226340 92607 950 120993
$$ [...]
##END NTUPLES=NMR SPECTRUM
##END=
