##TITLE=AC1596_HNAAH13326_8314361_UcJBKv8hGL
##JCAMPDX= 6.0         $$ Bruker NMR JCAMP-DX V2.0
##DATA TYPE= NMR SPECTRUM
##DATA CLASS= NTUPLES
##ORIGIN= BRUKER
##OWNER= Administrator
$$ 1.72 TOPSPIN		Version 2.1
$$ 2013-11-09 13:38:04.373 -0800  Administrator@X
$$ Compression mode = diff/dup
##.OBSERVE FREQUENCY= 400.02188249412
##.OBSERVE NUCLEUS= ^1H
##.ACQUISITION MODE= SIMULTANEOUS (DQD)
##.ACQUISITION SCHEME= undefined
##.AVERAGES= 8
##.DIGITISER RES= 22
##SPECTROMETER/DATA SYSTEM= spect
##.PULSE SEQUENCE= zg30
##.SOLVENT NAME= COFFEE_meoh
##.SHIFT REFERENCE= INTERNAL, COFFEE_meoh, 1, 14.98509
##AUDIT TRAIL= $$ (NUMBER, WHEN, WHO, WHERE, PROCESS, VERSION, WHAT)
$$ ##TITLE= Audit trail, TOPSPIN		Version 2.1
$$ ##JCAMPDX= 5.01
$$ ##ORIGIN= Bruker BioSpin GmbH
$$ ##OWNER= Administrator
$$ $$ E:\/data/COFFEE/nmr/AC1596_HNAAH13326_8314361_UcJBKv8hGL/10/pdata/1/auditp.txt
$$ ##AUDIT TRAIL=  $$ (NUMBER, WHEN, WHO, WHERE, PROCESS, VERSION, WHAT)
(   1,<2013-11-09 13:37:57.576 -0800>,<Administrator>,<X>,<go>,<TOPSPIN 2.1>,
      <created by zg
	started at 2013-11-09 13:36:50.780 -0800,
	POWCHK enabled, PULCHK disabled,
       configuration hash MD5:
       C8 4E 4E 5D D3 5C D8 9E 9F 52 82 E0 59 8A DE 15
       data hash MD5: 64K
       44 A4 62 F4 FD 0D 35 43 7D 6E B7 52 C4 CD 35 31>)
(   2,<2013-11-09 13:38:00.498 -0800>,<Administrator>,<X>,<proc1d>,<TOPSPIN 2.1>,
      <Start of raw data processing
       efp LB = 0 FT_mod = 6 PKNL = 1 PHC0 = 0 PHC1 = 0 SI = 32K 
       data hash MD5: 32K
       0B E9 5E DC A0 C4 80 02 72 FA 91 21 7F 3A BD C8>)
(   3,<2013-11-09 13:38:00.811 -0800>,<Administrator>,<X>,<proc1d>,<TOPSPIN 2.1>,
      <pk PHC0 = 90.28015 PHC1 = 0 
       data hash MD5: 32K
       CF C8 6C A2 E6 A3 D8 A1 17 EF 9D CA 16 12 41 1C>)
(   4,<2013-11-09 13:38:00.920 -0800>,<Administrator>,<X>,<proc1d>,<TOPSPIN 2.1>,
      <abs ABSG = 1 
       data hash MD5: 32K
       35 79 75 FB 52 C2 7C 1E 25 16 CF B8 22 E6 14 78>)
(   5,<2013-11-09 13:38:00.983 -0800>,<Administrator>,<X>,<proc1d>,<TOPSPIN 2.1>,
      <abs ABSG = 2 
       data hash MD5: 32K
       00 35 74 6D D3 27 8A 01 25 6F 94 39 C5 1E 8F 56>)
(   6,<2013-11-09 13:38:01.092 -0800>,<Administrator>,<X>,<proc1d>,<TOPSPIN 2.1>,
      <abs ABSG = 3 
       data hash MD5: 32K
       70 D5 23 CA 3B 4F 0A ED 16 86 FA EB AE 2F 5F 0D>)
(   7,<2013-11-09 13:38:01.170 -0800>,<Administrator>,<X>,<proc1d>,<TOPSPIN 2.1>,
      <abs ABSG = 4 
       data hash MD5: 32K
       A6 83 EE E1 8E 36 23 07 27 C5 2F E5 0D F9 8F 84>)
(   8,<2013-11-09 13:38:01.217 -0800>,<Administrator>,<X>,<proc1d>,<TOPSPIN 2.1>,
      <abs ABSG = 5 
       data hash MD5: 32K
       6C 85 88 0B FF 9C 75 62 98 C4 0A 11 AC BC 2E 88>)
$$ ##END=
$$ 
$$ $$ hash MD5
$$ $$ DA 0B 5F C2 73 32 A1 5B 59 12 F4 BA E7 B0 83 A9
##$RELAX= 
##$RELAX= 
##$RELAX= 
##$RELAX= 
##$RELAX= 
##$RELAX= 
##$RELAX= 
$$ Bruker specific parameters
$$ --------------------------
##$DU= <E:\>
##$EXPNO= 10
##$NAME= <AC1596_HNAAH13326_8314361_UcJBKv8hGL>
$$ [...]
##$TP= (0..7)
150 150 150 150 150 150 150 150
##$TP07= 0
##$TPNAME0= <>
##$TPNAME1= <>
##$TPNAME2= <>
##$TPNAME3= <>
##$TPNAME4= <>
##$TPNAME5= <>
##$TPNAME6= <>
##$TPNAME7= <>
##$TPOAL= (0..7)
0.5 0.5 0.5 0.5 0.5 0.5 0.5 0.5
##$TPOFFS= (0..7)
0 0 0 0 0 0 0 0
##$TUNHIN= 0
##$TUNHOUT= 0
##$TUNXOUT= 0
##$USERA1= <user>
##$USERA2= <user>
##$USERA3= <user>
##$USERA4= <user>
##$USERA5= <user>
##$V9= 5
##$VALIST= <valist>
##$VCLIST= <CCCCCCCCCCCCCCC>
##$VD= 0
##$VDLIST= <DDDDDDDDDDDDDDD>
##$VPLIST= <PPPPPPPPPPPPPPP>
##$VTLIST= <TTTTTTTTTTTTTTT>
##$WBST= 1024
##$WBSW= 4
##$XGAIN= (0..3)
0 0 0 0
##$XL= 0
##$YL= 0
##$YMAX_a= 588372
##$YMIN_a= -511316
##$ZGOPTNS= <>
##$ZL1= 120
##$ZL2= 120
##$ZL3= 120
##$ZL4= 120
##$ABSF1= 14.98509
##$ABSF2= -5.573092
##$ABSG= 5
##$ABSL= 3
##$ALPHA= 0
##$AQORDER= 0
##$ASSFAC= 0
##$ASSFACI= 0
##$ASSFACX= 0
##$ASSWID= 0
##$AUNMP= <proc_prof1d_extract_pilot.lims>
##$AXLEFT= 0
##$AXNAME= <>
##$AXNUC= <1H>
##$AXRIGHT= 0
##$AXTYPE= 0
##$AXUNIT= <>
##$AZFE= 0.1
##$AZFW= 0.1
##$BCFW= 0
##$BC_mod= 0
##$BYTORDP= 0
##$COROFFS= 0
##$CY= 15
##$DATMOD= 1
##$DC= 0
##$DFILT= <>
##$DTYPP= 0
##$F1P= 0
##$F2P= 0
##$FCOR= 0.5
##$FTSIZE= 32768
##$FT_mod= 6
##$GAMMA= 0
##$GB= 0
##$INTBC= 1
##$INTSCL= 1
##$ISEN= 128
##$LB= 0
##$LEV0= 0
##$LPBIN= 0
##$MAXI= 10000
##$MC2= 0
##$MEAN= 0
##$ME_mod= 0
##$MI= 0
##$NCOEF= 0
##$NC_proc= -8
##$NLEV= 6
##$NOISF1= 0
##$NOISF2= 0
##$NSP= 0
##$NTH_PI= 0
##$NZP= 0
##$OFFSET= 14.98509
##$PC= 1
##$PHC0= 90.28015
##$PHC1= 0
##$PH_mod= 1
##$PKNL= yes
##$PPARMOD= 0
##$PPDIAG= 0
##$PPIPTYP= 0
##$PPMPNUM= 2147483647
##$PPRESOL= 1
##$PSCAL= 4
##$PSIGN= 0
##$PYNMP= <proc.py>
##$REVERSE= no
##$SF= 400.02
##$SI= 32768
##$SIGF1= 0
##$SIGF2= 0
##$SINO= 400
##$SIOLD= 32768
##$SPECTYP= <>
##$SREGLST= <1H.CDCl3>
##$SSB= 0
##$STSI= 32768
##$STSR= 0
##$SW_p= 8223.68421052631
##$SYMM= 0
##$S_DEV= 0
##$TDeff= 65536
##$TDoff= 0
##$TI= <>
##$TILT= no
##$TM1= 0
##$TM2= 0
##$TOPLEV= 0
##$USERP1= <user>
##$USERP2= <user>
##$USERP3= <user>
##$USERP4= <user>
##$USERP5= <user>
##$WDW= 1
##$XDIM= 32768
##$YMAX_p= 467435692
##$YMIN_p= -819808
##$CURPLOT= <Network HP LaserJet P1505>
##$CURPRIN= <$Network HP LaserJet P1505>
##$DFORMAT= <normdp>
##$LAYOUT= <+/1D_H.xwp>
##$LFORMAT= <normlp>
##$PFORMAT= <normpl>
##$SURQMSG= 1
$$ End of Bruker specific parameters
$$ ---------------------------------
##NTUPLES= NMR SPECTRUM
##VAR_NAME=  FREQUENCY,     SPECTRUM/REAL,   SPECTRUM/IMAG
##SYMBOL=    X,             R,               I
##VAR_TYPE=  INDEPENDENT,   DEPENDENT,       DEPENDENT
##VAR_FORM=  AFFN,          ASDF,            ASDF
##VAR_DIM=   32768,         32768,           32768
##UNITS=     HZ,            ARBITRARY UNITS, ARBITRARY UNITS
##FACTOR=    0.250966925370066, 1,           1
##FIRST=     8223.43324360094, -233420,      25472
##LAST=      0,             -164711,         -124569
##MIN=       0,             -819808,         0
##MAX=       8223.43324360094, 467435692,    0
$$ Real data points
##PAGE= N=1
##DATA TABLE= (X++(R..R)), XYDATA
$$ [...]
$$ plain form
19588 77778 170029 7669 80832 178101 -95946 181217 -1655 60127 -143747 -290343 121220
19576 -144878 -417138 -45819 -118984 197853 85912 -95817 -127871 274706 -180998 -456066
19566 -456066 71121 -107755 -114558 -69454 -101801 -217737 -242483 20630 -43774 26401 42604
19555 42604 31713 53542 -105501 -153834 198569 -61075 -140328 77357 213858 -246388 60160
19543 -28982 -216473 109497 249416 -126233 -72508 79116 258959 158476 -94185 -39198
19532 -169175 -383946 187917 114145 -174474 -324942 50032 -252928 -1601 -73873 -235069
19522 -235069 195838 -88383 -130905 27603 -325054 -60468 -344256 -12147 -338174 156381
19511 -253676 157226 141078 28677 -223290 -164809 -111264 65676 188843 -311872 -100614
$$ packed form
19588G7778R2251G669P3163R7269i5946A81217a655F0127a43747j46596A21220
19576a44878k72260d5819p3165A97853H5912i5817l2054B74706a80998k75068
19566d56066G1121a07755o803M5104l2347j15936k4746B0630d3774B6401J6203
19555D2604j0891K1829a05501m8333A98569f1075p9253G7357J36501b46388F0160
19543b8982j87491A09497J39919a26233N3725G9116J79843j00483i4185c9198
19532a69175k14771A87917p3772a74474j50468E0032b52928a601p2272j61196
19522b35069A95838h8383m2522B7603c25054f0468k83788a2147l26027A56381
19511b53676A57226j6148B8677b23290N8481N3545F5676J23167c11872a00614
$$ plain form
19500 -105115 193935 42332 62977 -70895 -210197 -194327 257051 -368639 49147 3949 -53579
19488 18229 -197416 2169 143433 156756 -93172 28022 -493030 -352477 32735 -274998 -59652
19476 -269941 70480 -178687 -456784 -242254 -48823 -160503 -402 121454 96162 -100131 50245
19464 45125 -283028 -51917 -206635 121586 -288457 67404 18486 -206651 21569 68081 47599
19453 47599 232639 32903 169657 -55549 90011 5340 -88864 28329 -72151 -157851 313016
19441 -70635 -67882 222978 151888 73078 -297734 175519 -202777 289071 -207596 -59652 126791
19429 147517 23978 -12698 42385 106126 156961 39224 188208 -93283 -172760 20917 -179672
19417 -50675 -3787 141921 -32328 -20206 -161918 160275 -184190 18558 -101233 94406 -26901
$$ packed form
19500a05115A93935D2332K0645g0895j39302J5870B57051c68639D9147C949e3579
19488A8229a97416B169J41264J3323i3172B8022d93030J40553C2735b74998e9652
19476b69941G0480a78687k78097K14530d8823j11680d02A21454k5292a00131E0245
19464D5125b83028e1917j54718A21586b88457F7404A8486b06651B1569M6512k0482
19453D7599J85040C2903J36754e5549I0011E340h8864B8329g2151q5700C13016
19441g0635K753B22978p1090G3078b97734A75519b02777B89071b07596e9652A26791
19429A47517B3978a2698D2385O3741N0835C9224J48984i3283p9477B0917a79672
19417e0675c787A41921c2328J2122j41712A60275a84190A8558a01233I4406b6901
$$ plain form
19405 36657 -415630 -68589 -197566 -336169 149234 -168681 -29050 6029 -91947 -62984 -261223
19394 -261223 -76392 -86933 -248118 76185 69549 178205 172169 -140218 -394868 -29052 -118229
19383 -118229 -235569 -196892 -125067 -105232 -143876 -247335 -201729 46206 -124781 37543 300517
19372 300517 -356930 -294216 -55022 -162943 175000 -259606 -286521 -291212 16796 -183916 177583
19360 -33635 -45619 -89507 187996 -105008 171688 69172 -137521 -225905 -213991 -46359 -246905
19349 -246905 106772 -162115 140918 -58736 -149510 207677 16430 -27359 -196444 126701
19338 -186489 -5791 -131784 -260815 -113234 -42344 -23604 -77600 75528 154435 -189723 -221555
19327 -221555 -143195 -168850 111793 90713 -77128 210099 -306851 185899 83749 -87597 272114
$$ packed form
19405C6657d15630f8589j28977j38603A49234a68681b9050F029i1947K8963j98239
19394b61223g6392j0541j61185G6185o636J08656o036a40218k54650b9052q9177
19383a18229j17340L8677P1825J9835l8644j03459M5606D6206a24781C7543K62974
19372C00517c56930O2714e5022j07921A75000b59606k6915m691A6796a83916A77583
19360c3635j1984m3888A87996a05008A71688F9172a37521q8384J1914d6359k00546
19349b46905A06772a62115A40918e8736r0774B07677A6430b7359j69085A26701
19338a86489e791j25993j29031a13234d2344J8740n3996G5528P8907a89723l1832
19327b21555P8360k5655A11793k1080g7128B10099c06851A85899H3749h7597B72114
$$ plain form
19315 49200 -68651 -41985 -99371 -36744 223596 -551572 16273 94265 -43688 -78043 -63323
19304 -63323 28921 -103790 -201538 -97511 -871 -81190 295629 22117 -98063 -246654 250805
19292 312742 -148505 -180248 171218 -127216 189372 82526 -186 -54037 -748 7701 58844 -165219
19279 -29095 225636 -100137 106635 -95267 -324841 -54210 87038 -316785 -74051 155947
19268 289596 -205800 -185226 -51355 176773 -137853 24524 -109331 -176231 350 -33165 -74399
19257 -74399 -118690 343676 -261953 -113547 -203184 44609 -186028 94611 -91600 -13280 257897
19245 371548 -58998 212535 -20209 -90244 -278888 169061 377404 -1194 13815 -130166 -177634
19234 -177634 90274 -125251 340761 22130 -171787 -219429 221754 -13761 130113 14400
$$ packed form
19315D9200f8651K6666n7386c6744B23596e51572A6273P7992d3688l4355J4720
19304f3323B8921a03790r7748i7511h71q0319B95629B2117i8063j48591B50805
19292C12742a48505l1743A71218a27216A89372H2526a86n3851g48G701N1143a65219
19279b9095B25636a00137A06635i5267k29574e4210H7038c16785g4051A55947
19268B89596b05800K0574e1355A76773a37853B4524a09331o6900C50c3165m1234
19257g4399m4291C43676b61953a13547q9637D4609a86028I4611i1600a3280B57897
19245C71548e8998B12535b0209p0035j88644A69061K08343a194A3815a30166m7468
19234a77634I0274a25251C40761B2130a71787m7642B21754a3761A30113A4400
$$ plain form
19223 -90737 85417 -151726 79207 10864 195585 56214 -337128 357648 3258 61394 -103534
19211 154174 -316626 169037 42114 -394588 -401231 67026 199615 58544 -146050 -7053 -447826
19200 -447826 -73985 131168 86200 -193205 -79994 -96863 278573 -22553 -74919 164545 6931
19188 -97472 -33612 53568 124891 -118071 155183 -100654 66619 -267412 -149555 -339017
19178 -339017 -78745 -145671 -130608 126476 126874 -78970 164147 -407625 -119829 -84484 181007
19166 -85141 -233241 325139 -26202 -164852 -42210 -10751 42218 -389538 -332361 -158610 72203
19154 -93190 62909 -57443 -164702 -43910 247246 -92869 102817 -145725 62737 86700 -458658
19142 85393 71312 -202109 -295159 -77952 30524 113023 -76853 319602 -60040 -64896 -416416
$$ packed form
19223i0737H5417a51726G9207A0864J84721E6214c37128C57648C258N8136a03534
19211A54174c16626A69037D2114c94588o643F7026J32589E8544a46050g053m40773
19200d47826g3985A31168m4968a93205g9994j6869B78573b2553n2366A64545F931
19188i7472c3612E3568P1323a18071A55183a00654F6619b67412J17857j89462
19178c39017g8745o6926J5063A26476L98g8970A64147d07625a19829L5345A81007
19166h5141j48100C25139b6202j38650d2210a0751D2218c89538N7177a58610G2203
19154i3190F2909e7443j07259d3910B47246i2869A02817a45725F2737K3963d58658
19142H5393j4081b02109r3050g7952C0524Q2499g6853C19602f0040m856l51520
$$ plain form
19131 -416416 51037 -125446 32769 90770 -45035 -151893 212300 -410301 257606 -17210
19120 -217917 3065 -221667 -268326 150674 189930 -57183 184659 -65130 -10795 211039 2543
19108 29224 105912 32090 -58806 -72925 -21743 83229 -55445 -158760 -201540 -48843 -203854
19097 -203854 223443 -363381 -74022 -65035 -120609 -143575 -282584 -408508 -151020 -174602 -107501
19086 -107501 37695 -135012 -222547 257287 -82318 -234251 -208018 -115483 -98809 -60627 -84998
19075 -84998 -157149 -173655 -270 17029 -62554 -14086 166321 -114051 -105575 -266371 -17084 -55359
19063 -55359 -127379 -210582 -172682 83184 174265 -256337 -135938 82305 154853 -165237 228313
19051 -246271 -173540 -192989 19358 171080 -82621 -13589 -110077 -131982 -214038 47902 -114292
$$ packed form
19131d16416E1037a25446C2769N8001d5035j06858B12300d10301B57606a7210
19120b17917C065b21667m6659A50674L9256e7183A84659f5130a0795B11039B543
19108B9224P6688C2090e8806j4119b1743H3229e5445j03315m2780d8843j55011
19097b03854B23443c63381g4022Q987n5574k2966j39009j25924a51020k3582O7101
19086a07501C7695a35012q7535B57287h2318j51933K6233R2535J6674L8182k4371
19075h4998p2151j6506b70A7029f2554a4086A66321a14051Q476j60796a7084l8275
19063e5359p2020q3203L7900H3184R1081b56337J20399H2305P2548a65237B28313
19051b46271P2731j9449A9358J51722h2621a3589r6488k1905q2056D7902a14292
$$ plain form
19039 -76688 71511 -50031 70450 86914 -119178 160165 169988 -149997 102292 -175426 -205040
19028 -205040 270167 170752 -19716 -13344 38379 -89446 -50249 54843 48747 151288 -63499
19016 143985 51582 -263241 74106 -185006 -272578 -62541 -92494 15834 -32654 -140111 -37706
19004 -281938 81891 176467 -117835 -269125 84065 -253377 -6366 -405215 -127784 24166 -70153
18992 -184761 -185856 8365 3251 -88115 -316229 -82098 459162 -21948 -202665 -43180 -261297
18981 -261297 75513 -132004 -79742 127355 -169450 238435 192283 91012 205113 58545
18970 -40987 7625 -234927 40240 -143189 -41548 -195232 -164269 55350 -40775 -164987 187870
18958 -196451 212819 -179301 -8497 -295517 -88722 -7432 177332 19991 -47192 -217904 -34552
$$ packed form
19039g6688G1511e0031G0450J6464a19178A60165R823a49997A02292a75426k9614
19028b05040B70167r9415a9716O372C8379h9446L9197E4843o096J02541f3499
19016A43985E1582b63241G4106a85006q7572f2541k9953A5834c2654j07457c7706
19004b81938H1891R4576a17835j51290H4065b53377f366l98849a27784B4166g0153
18992a84761j095H365C251h8115k28114h2098D59162b1948j80717d3180k18117
18981b61297G5513a32004N2262A27355a69450B38435m6152I1012J14101E8545
18970d0987G625b34927D0240a43189d1548j53684L0963E5350d0775j24212A87870
18958a96451B12819a79301h497k87020h8722g432A77332A9991d7192j70712c4552
$$ plain form
18946 109384 70831 -98668 453633 280954 -5741 -256816 -107533 199172 36748 -28661 106112
18934 -42882 -148098 71059 108517 -181639 -122481 99551 -376729 20347 -20858 317291 285230
18923 285230 32905 563025 -87416 -234167 20908 90887 118524 23978 120928 219551 -210866
18911 -50640 -30366 308886 -64347 47331 -1569 58359 -248672 -43786 -263971 183182 242628
18900 242628 -282205 -11160 18760 -459158 30728 82798 -307833 -45330 48564 -65968 -219805
18889 -219805 15881 -168997 -257436 -222828 -208226 116231 14314 -52793 -143529 -349950 7174
18877 166108 -20544 19692 145956 -9724 239000 104102 -494754 -168645 -121910 63383 148500
18866 148500 -26997 -262526 -76925 -229504 -249729 250681 -196499 58660 -75765 -4693 -280140
$$ packed form
18946A09384l8553i8668D53633j72679e741k51075a07533A99172C6748b8661A06112
18934d2882j05216G1059L7458a81639N9158I9551c76729B0347b0858C17291l2061
18923B85230C2905N30120h7416j46751B0908O9979K7637B3978R6950R8623b10866
18911e0640K0274C08886f4347D7331a569E8359b48672d3786k20185A83182N9446
18900B42628b82205a1160A8760d59158C0728N2070c07833d5330D8564f5968j53837
18889b19805A5881a68997q8439L4608J4602A16231A4314e2793r0736k06421G174
18877A66108b0544A9692J26264i724B39000A04102d94754a68645M6735F3383Q5117
18866A48500b6997k35529g6925j52579k0225B50681a96499E8660g5765d693k75447
$$ plain form
18855 -280140 -393104 62727 -71997 -170226 -32518 72918 -289627 -55917 158416 12492 -121934
18843 71895 -256823 -50555 -88797 -283978 41916 -15469 129591 -10390 177408 179481 -48177
18831 -162807 85475 79938 -194381 -42521 84813 -15230 -236609 387680 -1402 39069 -176569
18819 -162116 -30882 119567 159833 311741 -161213 26155 -44661 213741 10973 164949
18809 164949 139768 128075 -170463 68751 -55906 -441184 -128873 20360 123308 24157 244251
18798 244251 65709 -73634 -211813 17834 -346526 -50717 -116446 -26558 52311 -275577 -161646
18787 -161646 -234220 -116496 -86189 126473 -10055 21325 -301531 163652 -512 -39806 -140321
18776 -140321 -65771 150058 200752 23909 11790 -8128 -218150 -156092 -312092 -74381 -77515
$$ packed form
18855b80140j12964F2727g1997r8229c2518G2918b89627e5917A58416A2492a21934
18843G1895b56823e0555l8242j95181D1916a5469A29591a0390A77408K073d8177
18831a62807H5475n537a94381d2521H4813a5230k21379C87680a402C9069a76569
18819a62116c0882A19567M0266J51908a61213B6155d4661B13741A0973J53976
18809A64949k5181j1693a70463F8751e5906l85278a28873B0360J02948B4157K20094
18798B44251F5709g3634j38179A7834c46526e0717o5729b6558E2311b75577J13931
18787a61646p2574a16496L0307A26473a0055B1325c01531A63652e12l9294j00515
18776a40321f5771A50058N0694B3909A1790h128k10022O2058j56000g4381l134
$$ plain form
18765 -77515 147 174917 -314123 -59428 -190345 23272 323842 -178223 193314 167724 20295
18753 51048 -7756 -131420 138784 -205183 -63131 -83096 -233522 -204938 115745 16796 -182052
18741 -269538 -78914 -36977 -367138 308843 -124043 -582986 67026 723 196477 -137010 -313192
18730 -313192 219109 30764 137952 -14449 -234772 -251278 145317 -360022 41638 -45881
18719 319696 221067 385381 35343 -100039 105950 97056 242405 -54143 -262386 -13420 -157197
18708 -157197 -7595 -159225 -282559 272750 13033 -358163 -39022 38819 253338 58754 -373966
18696 -251582 71254 -191548 -280708 60711 -93168 -97537 201938 -19455 -370278 -5250 -36545
18685 -36545 -225657 28780 170401 -277850 -150978 -62078 -31150 -172068 376904 -262843
$$ packed form
18765g7515A47J74770c14123e9428j30917B3272L00570a78223A93314k5590B0295
18753E1048g756j23664A38784b05183f3131j9965j50426K8584A15745A6796a82052
18741b69538g8914c6977l30161C08843a24043m58943F7026G23J95754a37010j76182
18730c13192B19109C0764J07188a4449k20323j6506A45317c60022D1638d5881
18719C19696r8629J64314C5343a00039A05950q894J45349e4143k08243a3420j43777
18708a57197g595j51630j23334B72750A3033c58163c9022C8819K14519E8754c73966
18696b51582G1254a91548q9160F0711i3168m369B01938a9455l50823e250l1295
18685c6545j89112B8780J41621b77850J26872f2078L0928j40918C76904b62843
$$ plain form
18674 129377 -15754 -256085 151672 -328943 35272 200907 -296799 -291248 50025 37473 288928
18663 288928 -141377 -337041 57541 -31989 1476 -159069 122326 -76703 -249870 -151723 -174449
18652 -174449 73463 -85340 38191 17057 68451 -374819 -438768 -267115 -138439 34848 7212
18640 -84455 130173 16094 237050 -81183 5549 -218773 -71384 117794 -322865 20262 10474
18629 10474 -24879 -172991 -211666 2537 -177769 268915 49849 113191 -133550 -151678 -66942
18617 25238 47436 -382128 -237473 -136253 110045 -59298 -204737 -92700 18166 -42885 105169
18605 -4848 370574 -118584 113888 -50687 65657 79052 -103791 -112399 -137379 47347 -169170
18593 149612 -211336 36526 8963 -280191 -38018 170958 -226719 -67091 -61304 -87730 -252390
$$ packed form
18674A29377a5754k40331A51672c28943C5272J65635b96799N551E0025j2552K51455
18663B88928a41377j95664E7541c1989A476a59069A22326g6703j73167R8147k2726
18652a74449G3463h5340C8191A7057N1394c74819o3949J71653J28676C4848G212
18640h4455A30173A6094K20956h1183E549b18773g1384A17794c22865B0262r788
18629A0474b4879j48112l8675B537a77769B68915D9849O3342a33550j8128f6942
18617B5238K2198c82128J44655J01220A10045e9298j45439i2700A8166d2885A05169
18605d848C70574a18584A13888e0687F5657J3395a03791q608k4980D7347a69170
18593A49612b11336C6526H963b80191c8018A70958b26719f7091N787k6426j64660
$$ plain form
18582 -252390 -332442 14258 -465115 100598 -110319 -173090 -107345 -3504 -215180 -201456 164746
18570 -466280 -159293 -314664 -121373 -227629 -16427 -2956 90898 -348258 -11007 22291 28785
18559 28785 -230213 86865 190475 -214271 300228 61020 -176779 165261 -38929 -289624
18549 -289624 -174425 262665 -72932 453153 11472 -141689 -294881 191117 -91851 18888
18538 69683 -167230 16614 -1713 122998 -164624 7789 -65998 50646 -141806 38486 -127107
18526 -154888 -46381 -12427 -60100 -22729 137599 -131458 -92743 232166 -108989 -133444 -488397
18515 -488397 178663 -12610 -29362 91787 -90698 -62445 84233 160663 73907 111039 175583
18504 175583 -105567 121967 -216603 -15480 -299155 77864 -33090 -85335 -63902 33794 451446
$$ packed form
18582b52390q0052A4258d65115A00598a10319o2771O5745c504k11676J3724A64746
18570d66280a59293j55371a21373j06256a6427b956I0898c48258a1007B2291O494
18559B8785b30213H6865J03610b14271C00228F1020a76779A65261c8929k50695
18549b89624J15199B62665g2932D53153A1472a41689j53192A91117i1851A8888
18538F9683a67230A6614a713A22998a64624G789f5998E0646a41806C8486a27107
18526a54888d6381a2427m7673b2729A37599a31458L8715B32166a08989k4455l54953
18515d88397A78663a2610j6752I1787i0698K8253H4233P6430G3907L7132O4544
18504A75583a05567A21967b16603a5480k83675G7864c3090n2245K1433C3794M17652
$$ plain form
18493 451446 17074 7651 -379686 -181661 -103320 61005 235090 105790 18044 85542 -187894
18481 -37503 -191237 -39366 143283 -44634 -120115 -456881 172495 -171437 -42140 -111376 -147818
18470 -147818 30395 -41547 79641 4103 12507 -76301 46850 -330867 67092 -142913 -2621 -54474
18458 -54474 -84901 58739 -66225 -143789 -230990 -76928 -173061 -224526 -148395 317535 205953
18447 205953 109283 -48098 46331 -273999 -94883 17630 -229626 -193218 -109071 -215436 1451
18435 -56244 -258777 172899 -135192 42564 -64773 -86293 -166524 -99775 12780 193613 -171748
18423 -349295 53868 47632 83163 -59655 -76961 -228360 -67478 48306 -94689 53448 -68667
18411 -359129 141191 268683 286464 -157464 101144 25483 304774 -375497 -152967 -260784
$$ packed form
18493D51446A7074G651c79686a81661P8341F1005J74085A05790A8044O7498a87894
18481c7503j53734c9366A43283d4634p5481l36766A72495a71437d2140o9236l6442
18470a47818C0395d1547G9641D103Q404g6301D6850c30867F7092a42913b621n1853
18458e4474l0427E8739f6225p7564q7201g6928r6133n1465P6131C17535j11582
18447B05953r6670d8098D6331b73999i4883A7630b29626L6408Q4147j06365A451
18435e6244k02533A72899a35192D2564f4773k1520q0231O6749A2780J80833a71748
18423c49295E3868o236L5531e9655j7306j51399f7478D8306i4689E3448f8667
18411c59129A41191J27492J7781a57464A01144B5483K79291c75497a52967j07817
$$ plain form
18401 -260784 224982 223129 -188273 -134134 -58419 -249797 -30019 -20083 3149 -190855 591184
18389 -236155 -129362 -73449 300670 7647 67677 -256153 -166277 24365 -56390 47414 -285785
18377 187184 -231397 -309669 70259 -129425 -164161 -317279 -242238 -70632 194904 -208429
18366 -64933 181720 102601 -178783 62098 -233149 174811 -41523 92232 -15588 37544 -51863
18354 -71427 -2257 -405574 168224 -186243 40676 -112965 170558 213179 -131822 -86220 -4031
18342 34475 -111879 -297010 174160 -238432 -15296 190954 -84966 111128 -187536 -174167
18332 -174167 357259 107903 -15375 -164139 57484 389351 96453 -71553 90277 -214464
18321 -42233 46916 -314407 254334 250868 65122 249500 -314856 -258083 261683 18295 244250
$$ packed form
18401b60784B24982j853a88273N4139e8419j91378c0019R936C149a90855E91184
18389b36155J06793N5913C00670G647O0030b56153Q9876B4365e6390D7414b85785
18377A87184b31397p8272G0259a29425l4736j53118P5041g0632A94904b08429
18366f4933A81720p9119a78783F2098b33149A74811d1523I2232a5588C7544e1863
18354g1427b257m03317A68224a86243D0676a12965A70558M2621a31822M5602d031
18342C4475a11879j85131A74160b38432a5296A90954h4966A11128a87536J3369
18332a74167C57259A07903a5375j48764E7484L31867I6453g1553I0277b14464
18321d2233D6916c14407B54334l466F5122J84378c14856N6773B61683A8295K25955
$$ plain form
18310 244250 -369060 20935 -78872 535189 -321455 256463 276183 109446 -201886 -102614
18300 -102614 -211219 -267549 -162279 -199865 5027 -312213 -117754 -69845 -44923 -97332 200092
18288 71942 -97198 -48392 -126503 6814 81327 77486 -155749 339252 67847 102725 -207640
18276 -99836 -229000 34330 221605 -301475 50643 -233511 8934 -66905 135308 214354 -265025
18264 -46204 -21365 324355 -70346 -67702 -193753 -34833 -16624 -141787 -107003 -214677 -251465
18253 -251465 212371 -85759 208573 51634 75788 172917 -43620 386515 145944 4563 6651
18242 6651 -123571 243884 48107 58616 -316278 153925 155196 -158628 -385552 59735 148786
18231 148786 21033 166401 -184804 -298794 23792 2791 -137606 -131496 275430 -113274 26729
$$ packed form
18310B44250c69060B0935g8872E35189c21455B56463J9720A09446b01886R9272
18300a02614j08605n6330J05270l7586E027c12213a17754M7909K4922n2409B00092
18288G1942i7198d8392p8111F814P4513l841a55749C39252F7847L4878b07640
18276i9836j29164C4330J87275c01475E0643b33511H934f6905A35308P9046b65025
18264d6204b1365C24355g0346K644j26051c4833a6624j25163L4784j07674l6788
18253b51465B12371h5759B08573E1634K4154R7129d3620C86515A45944D563K088
18242F651a23571B43884D8107J0509c16278A53925J271a58628k26924E9735Q9051
18231A48786B1033J45368a84804j13990B3792B791a37606O110B75430a13274B6729
$$ plain form
18219 -414581 196045 -65441 18844 218177 92363 -341 -141259 98484 -159646 113804 -301469
18207 284462 45341 -118003 -205210 157699 -257907 -83735 139750 -308015 149355 -117092
18196 46813 348735 -69504 -116763 59259 -17905 -193177 146880 94631 -17171 -88165 -40104
18184 -274488 60948 -54891 -78540 -233579 -233807 12830 -101246 34181 -35765 -45260 71058 -41078
18171 -92950 -257651 409689 -184633 -2454 225528 103655 84124 61206 -152389 -55018 -195363
18160 -195363 -175169 22827 240352 145983 -104737 -41236 -254828 -154608 -25735 179406
18149 56947 240757 157198 -65576 1694 150471 250360 -38448 -17861 155432 62484 -193128
18137 103997 -225924 67509 4 282277 17323 -155834 -42346 -237063 82534 -180050 -173679
$$ packed form
18219d14581A96045f5441A8844J99333I2363c41j40918I8484a59646A13804c01469
18207B84462D5341a18003q7207A57699b57907h3735A39750c08015A49355a17092
18196D6813L01922f9504m7259E9259a7905j75272A46880n2249a7171p0994d0104
18184b74488F0948e4891k3649j55039k28A2830a01246C4181c5765r495G1058d1078
18171i2950j64701D09689a84633b454B25528A03655j9531k2918a52389e5018j40345
18160a95363K0194B2827K17525r4369a04737d1236k13592J00220b5735A79406
18149E6947J83810q3559f5576A694J48777R9889c8448a7861A55432F2484a93128
18137A03997b25924F7509DK82273A7323a55834d2346j94717H2534a80050O371
$$ plain form
18126 -173679 65308 -187170 -299286 -265628 232897 -30085 -309327 -184221 261183 -225253
18115 -141820 88553 187211 -282567 185230 16265 142101 -13596 242149 -10096 45131 -287326
18103 -408659 12704 135389 -543226 137287 107343 73057 72495 62173 -98064 -110046 -20765
18091 -25287 -38911 -111472 -51199 281364 304960 445773 158474 -255598 18889 -367428 -58939
18079 18066 -30020 -12709 -307740 -17616 182488 156546 -129959 -111541 155203 -23635 -159771
18068 -159771 -56465 -154176 150930 157672 -197977 -222701 -205853 -214657 18232 -431659 318248
18056 -223776 342512 -71842 201929 150970 2629 -574830 11536 -80551 -345843 162827 -387323
18044 -124969 -180706 -2006 149390 93945 41539 384123 -166091 -39643 400016 11400 243165
$$ packed form
18126a73679F5308a87170j12116L3658B32897c0085k79242J25106B61183b25253
18115a41820H8553R8658b82567A85230A6265J25836a3596B42149a0096D5131b87326
18103d08659A2704J22685e43226A37287k9944l4286n62j0322i8064j1982b0765
18091b5287j3624p2561e1199B81364K3596J40813A58474b55598A8889c67428e8939
18079A8066c0020a2709k95031a7616A82488k5942a29959J8418A55203b3635j36136
18068a59771e6465r7711A50930O742a97977k4724J6848q804A8232d31659C18248
18056b23776C42512g1842B01929n0959B629e74830A1536h0551k65292A62827c87323
18044a24969n5737b006A49390n5445D1539L42584a66091c9643D00016A1400K31765
$$ plain form
18033 243165 30511 -193738 -297744 -233172 -3971 -77889 211039 -321173 -100102 69930 -198003
18021 229575 26202 -18615 -15176 -16911 86776 -309289 -87756 126673 -300097 -441915 -4008
18009 -138155 -217047 88444 -222465 -60136 202364 -6269 -150230 62345 -83787 50114 43320
17998 43320 -295643 338776 -306118 -71100 -272229 -149082 31891 15416 188945 -76821
17987 -53785 57014 -357450 -211795 -236377 -8540 -106480 17988 -93224 -208831 -114189 37402
17975 330181 -207524 -91453 -111187 376419 -316383 -281281 294115 76053 27203 -32629 -159472
17964 -159472 152581 -96699 85154 -192589 -34585 -41846 13758 -31132 335238 -163494 232666
17952 -247937 526021 -150165 52597 -73879 -132216 88029 436677 538975 -52084 164927
$$ packed form
18033B43165C0511a93738j04006O4572c971p3918B11039c21173a00102F9930a98003
18021B29575B6202a8615L439j735H6776c09289h7756A26673c00097j41818d008
18009a38155p8892H8444b22465f0136B02364f269j43961F2345h3787E0114o794
17998D3320b95643C38776c06118g1100k01129J23147C1891A5416J73529g6821
17987e3785E7014c57450J45655k4582h540r7940A7988i3224j15607R4642C7402
17975C30181b07524i1453j9734C76419c16383L5102B94115G6053B7203c2629j26843
17964a59472A52581i6699H5154a92589c4585p261A3758c1132C35238a63494B32666
17952b47937E26021a50165E2597g3879n8337H8029L48648J02298e2084A64927
$$ plain form
17941 -36624 79302 69768 220535 18427 -136926 198135 -237806 -102846 288172 144190
17931 144190 -1437 -24595 113222 188175 258495 43925 36384 -70592 -63906 -175257 148376
17919 5810 -155243 83335 206483 32073 18445 59292 175415 -167114 57426 -31971 -57070
17908 -57070 129746 -270853 -168740 116263 228930 -109863 -135531 -173336 -205440 30107
17897 73341 36231 52257 -178281 -343490 -71171 -24679 -3497 -160054 211353 88822 -258929
17885 406587 69698 -157726 32347 -34340 -4658 7168 -103702 -143907 60588 -124338 24018
17873 103567 -60976 100195 176493 -7963 -233310 -179260 -15023 -25483 8905 -82815 -227247
17862 -227247 -138014 1672 159236 -150815 -53164 321603 -264086 -125529 -301581 -57880
$$ packed form
17941c6624G9302r534J50767A8427a36926A98135b37806a02846B88172j43982
17931A44190a437k3158A13222P4953P0320D3925p541g0592O686j11351A48376
17919E810a55243H3335J23148C2073j3628M0847J16123a67114E7426c1971k5099
17908e7070A29746b70853J02113A16263J12667a09863k5668l7805l2104C0107
17897G3341C6231J6026a78281j65209g1171b4679c497j56557B11353H8822b58929
17885D06587F9698a57726C2347c4340d658G168a03702m0205F0588a24338B4018
17873A03567f0976A00195P6298g963k25347N4050a5023j0460H905h2815j44432
17862b27247Q9233A672J57564a50815e3164C21603b64086a25529j76052e7880
$$ plain form
17851 10446 -139985 -47818 161838 46376 -58918 35390 66496 50753 -67398 -215307 -53503
17839 40274 -327424 -209300 18700 57383 -122046 -107255 -75164 218680 34787 48660 181924
17828 181924 78725 -252939 -179653 -50425 403003 107115 -115010 177786 -229257 61279
17817 -81001 130723 14750 -136223 29173 50528 58964 85359 130503 -376313 -82422 -16879
17805 -44055 48159 -111433 -95052 -43962 -86546 79011 67715 280870 103155 -159374 -5783
17793 164303 -76057 95654 -120863 56964 201453 51712 -193891 102400 2228 58324 -13689
17781 -145710 -90549 -195034 191559 26737 -129274 -51248 -43741 -81827 -237017 -28328 -57334
17770 -57334 89306 -33603 -143874 -77070 217236 141746 499611 171673 -4305 15290 -96314
$$ packed form
17851A0446a39985d7818A61838D6376e8918C5390L1106j5743f7398j47909e3503
17839D0274c27424J18124A8700L8683a22046J4791L2091B18680C4787J3873J33264
17828A81924G8725b52939P3286e0425D03003A07115a15010A77786b29257F1279
17817h1001A30723A4750a36223B9173K1355Q436K6395M5144c76313h2422a6879
17805d4055D8159a11433J6381d3962m2584G9011j1296K13155A03155a59374e783
17793A64303g6057I5654a20863E6964J44489E1712a93891A02400B228N6096a3689
17781a45710N5161j04485A91559B6737a29274e1248P507l8086j55190b8328k9006
17770e7334H9306c3603j10271O6804B17236p5490L57865A71673d305A5290i6314
$$ plain form
17758 70069 -285310 59104 84067 -152114 85584 -80715 -40263 -69899 -68123 4724 101610 -78042
17745 -21412 246636 83887 164251 -388522 -25087 16104 263395 -95343 100961 -45819 107240
17733 321831 -366409 -62638 107659 -17970 5832 465044 -235370 -192662 -88734 55384 -226779
17721 -89744 19153 37342 97280 -75175 16177 -67261 39152 160264 107765 183805 79163
17709 -314151 88694 -106192 66211 68880 126601 131821 -9192 65801 244912 54295 -13756 -69278
17697 -69278 -142419 64194 55882 187885 133487 -300196 -140375 -152075 174288 -4912 292635
17685 -175066 130224 162954 202151 6241 7493 -47449 -83291 -484012 1958 82585 55697 -142627
17672 24638 259147 -13363 -90304 -131717 -128255 118274 97472 333776 -335054 -4508 -153373
$$ packed form
17758G0069b85310E9104K4963a52114H5584h0715d0263k9636J776D724R6886g8042
17745b1412B46636H3887Q0364c88522b5087A6104K47291i5343A00961d5819A07240
17733C21831c66409f2638A07659a7970E832M59212b35370M2708h8734E5384b26779
17721h9744A9153J8189N9938g5175A6177f7261C9152J21112n2499P6040G9163
17709c14151H8694a06192F6211K669N7721N220i192F5801J79111E4295a3756n5522
17697f9278p3141F4194q312J32003n4398c00196a40375j1700A74288d912B92635
17685a75066A30224L2730L9197F241J252d7449l5842m00721A958Q0627k6888a42627
17672B4638K34509a3363p6941m1413L462A18274k0802K36304c35054d508j48865
$$ plain form
17661 -153373 -7442 -144606 -186718 -33345 229633 -143663 -96988 410531 414215 -163425 129518
17649 326434 -314962 -27634 -62709 -45175 -7551 -83683 258835 24151 -321272 -69339 -383749
17638 -383749 -55599 111730 -245601 159820 231923 10693 -242786 105455 21373 72593
17628 72593 46715 -165254 -183593 118936 -132411 -53063 133942 -260190 77143 -268219
17617 120798 301391 -83536 -67966 49647 -285892 263744 179773 -114639 174411 221763
17607 221763 -148858 -136859 -79243 195628 -37459 132892 280041 41751 25947 378519
17597 378519 459648 23436 -230508 50382 -20797 54548 74309 1621 128940 -147846 -59201
17585 -452617 -99397 221787 137441 -68008 -100021 168595 476489 -149745 -98447 9272 -102084
$$ packed form
17661a53373g442j37164m2112c3345B29633a43663M6675D10531L684a63425A29518
17649C26434c14962b7634l5075J7534g551p6132B58835B4151c21272f9339l14410
17638c83749e5599A11730b45601A59820P2103A0693b42786A05455B1373N1220
17628G2593k5878a65254j8339A18936a32411e3063A33942b60190G7143b68219
17617A20798J80593h3536J5570D9647b85892B63744q3971a14639A74411M7352
17607B21763a48858J1999N7616A95628c7459A32892J47149D1751j5804L52572
17597C78519Q1129B3436b30508E0382b0797E4548J9761A621J27319a47846e9201
17585d52617i9397B21787q4346f8008l2013A68595L07894a49745N1298I272a02084
$$ plain form
17573 -95152 112717 29399 158559 -13246 182848 129064 79915 -77193 266184 -232023 195665
17561 76789 33046 139890 -234487 355429 137502 92144 -45013 236371 -11048 560889
17550 204119 -66321 -255250 168820 191974 -95085 -108507 87407 130043 113162 -188994 222752
17538 -221639 81648 -162937 -111628 54797 -55472 206178 143361 242794 176783 466275 -318237
17526 67341 -77382 37131 63442 -89732 85703 143205 218489 83517 93113 -79793 -188728 345615
17513 -66240 98380 51061 256407 -77658 -181496 45908 179852 61931 -255910 82616 -157194
17501 24574 308869 86334 -85899 -60380 156952 33945 607435 -149998 -178967 -98938 34156
17489 102780 230431 36423 18316 182738 -58550 6086 -80641 -10090 136516 45573 121453
$$ packed form
17573i5152A12717B9399J29160a3246A82848n3784m9149g7193B66184b32023A95665
17561G6789C3046J06844b34487C55429A37502m5358d5013B36371a1048E60889
17550B04119f6321j88929A68820K3154i5085j3422H7407M2636j6881a88994B22752
17538b21639H1648a62937N1309E4797e5472B06178o2817R9433o6011K89492c18237
17526F7341g7382C7131K6311h9732H5703N7502P5284H3517R596g9793j08935C45615
17513f6240I8380m7319K05346g7658j03838D5908J33944F1931b55910H2616a57194
17501B4574K84295H6334h5899K5519A56952C3945N73490a49998k8969Q0029C4156
17489A02780J27651C6423j8107J64422e8550F086h0641a0090A36516D5573P5880
$$ plain form
17478 121453 410874 -34594 -178326 525228 9257 -75288 -248045 257167 -90969 315040
17467 79028 -13541 -57815 -19697 66573 147568 56242 157758 324906 -149276 249747 168878
17456 168878 109298 217158 367838 -4328 284463 191706 182509 101631 95029 401009 113668
17444 100013 129374 -29461 354895 -154078 -55941 -230719 38534 85484 549942 135467
17433 284873 18144 213612 240247 368482 -69910 152104 353569 123174 179045 448287
17423 448287 55707 288202 228507 18599 513680 -213628 515999 282021 -25087 407013
17412 101427 122023 170381 -58743 212305 221944 504187 204464 26153 4498 270758 -77192
17400 12715 349621 -84352 272128 -203662 164963 111473 -3184 -65531 -198342 191947 11292
$$ packed form
17478A21453K89421c4594j43732E25228I257g5288j72757B57167i0969C15040
17467G9028a3541m4274a9697F6573Q0995E6242J01516J67148a49276B49747q0869
17456A68878n9580J07860J50680d328B84463r2757r197q0878o602L05980A13668
17444A00013K9361b9461C54895a54078e5941j74778C8534M6950M64458A35467
17433B84873A8144J95468K6635J28235f9910A52104K01465A23174N5871K69242
17423D48287E5707K32495n9695A8599M95081b13628E15999k33978b5087D07013
17412A01427K0596M8358e8743B12305R639K82243B04464B6153D498K66260g7192
17400A2715L36906h4352B72128b03662A64963n3490c184o2347j32811A91947A1292
$$ plain form
17388 145190 -22404 400832 -4273 -252017 -199513 193512 -153363 119854 233922 -86772
17377 640413 -82504 31340 414680 154308 411957 41438 177482 241652 123770 -264450
17366 48835 90549 386870 -22712 71617 229450 -214727 -295491 137229 -15517 231609 330893
17355 330893 -133753 -6210 23534 135358 -26209 -119060 141353 -109689 23494 104593 118442
17344 118442 127143 6914 -139430 6007 -13719 323111 275817 58771 288461 333268 331429 133369
17331 43610 323739 298487 93732 3597 78965 130307 211728 -161641 97099 -29104 221235
17319 65727 -14353 -329481 10992 223091 414228 124380 19008 504656 215341 368714
17309 368714 239462 102795 77713 -147038 -241107 421481 -142914 59636 109583 -6801 -191262
$$ packed form
17388A45190b2404D00832d273k47744N2504A93512a53363A19854J14068h6772
17377F40413h2504C1340L83340A54308K57649D1438J36044O4170j17882b64450
17366D8835M1714K96321b2712G1617J57833b14727q0764A37229a5517B31609R9284
17355C30893a33753f210B3534J11824b6209r2851A41353a09689B3494Q1099J3849
17344A18442Q701F914a39430F007a3719C23111m7294E8771K29690M4807j839A33369
17331D3610K80129k5252I3732C597P5368N1342Q1421a61641I7099b9104B21235
17319F5727a4353l15128A0992K12099J91137A24380A9008M85648B15341J53373
17309C68714j29252A02795k5082a47038r4069D21481a42914E9636M9947f801j84461
$$ plain form
17298 -191262 212923 109800 124656 179037 391498 231492 14057 72121 318832 471591
17288 471591 103350 150105 92004 334879 272503 250466 134719 135617 141827 308376 432680
17277 432680 -130131 -15831 200589 220286 -84997 210708 187105 -78315 135640 95703 168143
17266 168143 253601 -55394 333296 -82383 212265 172514 328952 152598 224775 99775 353517
17255 353517 8974 389213 136313 206078 212158 199381 123636 25107 -75814 329964 221274
17244 221274 136190 -94884 27919 -136221 304613 175950 435822 10081 -50456 63339 234677
17233 234677 -145181 138618 248370 245473 52214 232537 -95759 235546 137914 186380 -88071
17221 -246717 48912 74013 187015 -46631 271613 359769 -26328 92621 309006 177184 183883
$$ packed form
17298a91262B12923j03123J4856N4381K12461j60006A4057N8064K46711J52759
17288D71591A03350M6755n8101K42875o2376k2037j15747Q98O210J66549J24304
17277D32680a30131a5831B00589J9697h4997B10708k3603g8315A35640l9937P2440
17266A68143Q5458e5394C33296h2383B12265l9751J56438A52598P2177I9775K53742
17255C53517H974L80239A36313O9765O080j2777p5745B5107g5814C29964j08690
17244B21274q5084i4884B7919a36221C04613j28663K59872A0081e0456F3339J71338
17233B34677a45181A38618J09752k897E2214J80323i5759B35546r7632M8466h8071
17221b46717D8912K5101J13002d6631B71613Q8156b6328I2621K16385j31822O699
$$ plain form
17210 183883 588685 67433 352677 -261407 35942 437890 293441 111194 -28724 163017
17199 167159 72131 -69167 178670 252324 56988 162904 341737 339238 470188 257333 450816
17188 450816 11314 231796 304217 307866 485652 -59117 114670 395210 391829 208079 -6822
17176 370016 127378 284046 160187 -115436 258119 142000 60663 231161 373889 200066
17166 200066 115220 110319 455070 101868 468547 20341 -124175 253951 462275 -55807
17155 535291 6442 349569 160051 254418 132816 443079 206715 294126 392325 557388
17145 557388 110082 191323 322940 126493 590389 -25104 196266 265561 336971 324992
17135 324992 209879 386694 251193 373393 539505 169919 171403 303409 238737 101620
$$ packed form
17210A83883M04802F7433K85244b61407C5942M01948j44449A11194b8724A63017
17199A67159G2131f9167A78670P3654E6988J05916J78833k499J30950k12855J93483
17188D50816A1314K20482P2421L649J77786e9117A14670K80540l381j83750f822
17176C70016A27378J56668j23859a15436B58119j16119F0663J70498J42728j73823
17166B00066q4846m901L44751A01868L66679B0341a24175B53951K08324e5807
17155E35291F442L43127A60051R4367j21602L10263B06715Q7411R8199J65063
17145E57388A10082Q1241J31617A26493M63896b5104A96266O9295P1410j1979
17135C24992j15113J76815j35501J22200J66112A69919J484J32006o4672A01620
$$ plain form
17124 195704 516784 582803 260451 481622 226172 138955 59984 451537 276968 241807
17114 241807 130014 461410 727 105990 573590 274277 386050 586630 601160 469431
17104 469431 447965 104552 216676 -133076 135140 247535 25960 303447 131824 232224
17094 232224 384056 134816 349686 538804 152754 432255 174655 342012 474061 346649
17084 346649 528541 -17983 334648 553807 611957 781253 489551 98990 -70546 362124
17073 499128 262687 536169 298974 447733 781998 504517 418297 384000 325731 533463
17063 533463 329650 656432 294191 331479 391451 428488 423802 11815 323346 563127 239503
17051 225814 170941 514887 344342 527541 573316 661640 192401 643129 155437 687727
$$ packed form
17124A95704L21080O6019B60451K21171B26172q7217E9984L91553j74569l5161
17114B41807j11793L31396G27J05263M67600B74277J11773K00580J4530j31729
17104D69431k1466A04552J12124a33076A35140J12395B5960K77487A31824J00400
17094B32224J51832A34816K14870J89118A52754K79501A74655J67357J32049j27412
17084C46649J81892a7983C34648K19159N8150J69296k91702I8990g0546C62124
17073D99128k36441K73482k37195J48759L34265k77481q6220l4297n8269K07732
17063E33463k03813L26782B94191L7288N9972L7037m686A1815L11531K39781B39503
17051B25814n4873L43946j70545J83199M5775Q8324A92401M50728A55437N32290
$$ plain form
17041 687727 657776 230815 368016 736901 680655 406056 452593 283719 212746 352899
17031 352899 494350 382281 519083 602058 358244 310048 611017 302496 319207 383162
17021 383162 341261 203741 538073 808910 481231 73770 580207 500124 735401 393237
17011 393237 894541 1015444 485823 879817 247400 508317 725070 493617 299959 225183
17001 225183 606514 684905 568689 492880 337431 808171 870463 614586 651607 688005
16991 688005 613200 864719 677095 896501 853860 789748 716084 402385 569878 397644
16981 397644 723232 545436 564292 724293 644519 682393 744922 524692 752034 707540
16971 707540 943908 429375 779137 909084 779807 745176 754737 930123 925304 802676
$$ packed form
17041F87727k9951B30815J37201L68885n6246k74599M6537j68874p0973J40153
17031C52899J41451j12069J36802Q2975k43814m8196L00969C02496J6711O3955
17021C83162m1901j37520L34332K70837l27679G3770N06437q0083K35277l42164
17011C93237N01304J20903D85823L93994B47400K60917K16753k31453j93658p4776
17001B25183L81331P8391j16216p5809j55449M70740O2292k55877L7021L6398
16991F88005p4805K51519j87624K19406m2641o4112p3664l13699J67493j72234
16981C97644L25588j77796J8856J60001p9774L7874O2529k20230K27342m4494
16971G07540K36368D29375L49762J29947j29277l4631R561J75386m819j22628
$$ plain form
16961 802676 1178504 706832 491353 550979 922865 876635 713362 1079732 823496 973051
16951 973051 732984 890325 686013 925802 732849 712997 599485 743974 914757 730398
16941 730398 735153 831364 871203 832128 982900 1151758 822341 1128370 1264496 838295
16931 838295 1081774 1066549 1210945 1154078 1065767 954531 948730 1031910 1300875 1079152 1151092
16920 1151092 810284 1274629 1274891 1023097 1283239 1085994 1209794 1514669 1317204 1572776
16910 1572776 1088615 1239734 1142657 1651172 1154051 1347541 1510959 1256370 1361761 1657524
16900 1657524 1691847 1377237 1463247 1529271 1172133 1456461 1278067 1575484 1567459 1769377
16890 1769377 1516632 1436456 1477893 1741457 1887719 1777917 1745814 1708701 1565069 1864946
$$ packed form
16961H02676L75828m71672k15479N9626L71886m6230j63273L66370k56236J49555
16951I73051k40067J57341k04312K39789j92953j9852j13512J44489J70783j84359
16941G30398M755R6211L9839l9075J50772J68858l29417L06029J36126m26201
16931H38295K43479j5225J44396n6867q8311j11236n801Q3180K68965k21723P1940
16920A151092l40808M64345K62k51794K60142j97245J23800L04875j97465K55572
16910A572776m84161J51119r7077N08515m97121J93490J63418k54589J05391K95763
16900A657524L4323l14610Q6010O6024l57138K84328j78394K97417q025K01918
16890A769377k52745q0176M1437K63564J46262j09802l2103l7113j43632K99877
$$ plain form
16880 1864946 2003808 1787447 1739845 1511397 2034012 1658723 2088049 2021415 2007452 2050998
16870 2050998 2051441 2096218 1869465 1905752 2230960 1794568 2233539 2538720 2268055 2233698
16860 2233698 2323663 2005304 2297552 2212259 2404919 2383454 2777265 2595573 2590258 2709866
16850 2709866 2564150 2650784 2552889 2560226 2932619 2719920 2679123 2877287 2936454 3093146
16840 3093146 3028385 3173357 3123126 3012579 2812355 3354545 3307142 3492673 3522910 3693883
16830 3693883 3514584 3641675 3797926 3706678 3973875 3752173 4027933 4053610 4034119 4108867
16820 4108867 3930058 4439184 4394879 4709094 4606273 5123200 4811637 4939834 5041677 5058068
16810 5058068 5379359 5058148 5408946 5412086 5602801 5927829 5832377 6056217 6249744 6115840
$$ packed form
16880A864946J38862k16361m7602k28448N22615l75289M29326o6634j3963M3546
16870B050998M43M4777k26753L6287L25208m36392M38971L05181k70665l4357
16860B233698Q9965l18359K92248q5293J92660k1465L93811j81692n315J19608
16850B709866j45716Q6634r7895P337L72393k12699m0797J98164N9167J56692
16840C093146o4761J44972n0231j10547k00224N42190m7403J85531L0237J70973
16830C693883j79299J27091J56251r1248K67197k21702K75760K5677j9491P4748
16820D108867j78809N09126m4305L14215j02821N16927l11563J28197J01843J6391
16810E058068L21291l21211L50798L140J90715L25028r5452K23840J93527j33904
$$ plain form
16800 6115840 6256247 6455035 6470522 6535620 7147035 7126758 7095599 7686435 7381662 8026565
16790 8026565 8057568 8287151 8620799 8889773 9052820 9544625 9725343 9719642 10210855 10447222
16780 10447222 10987319 10884755 11574955 11943386 12192585 12785742 12942015 13248282 13473538
16771 13473538 14046452 14679094 15266601 15586628 16033087 16593786 17545173 17998719 18649875
16762 18649875 19611272 20039136 20950473 21726198 22251095 23452336 24594782 25839293 26504425
16753 26504425 27734617 28941807 30201267 31402327 33001680 34870858 36602004 37965604
16745 37965604 40313800 41989253 44646662 46979035 49176879 52318979 55682889 58592979
16737 58592979 61676845 65481579 69693273 74484906 79062244 83633646 89427331 95224593
$$ packed form
16800F115840J40407J98788J5487O5098O11415k0277l1159N90836l04773O44903
16790H026565L1003K29583L33648K68974J63047M91805J80718n701M91213K36367
16780A0447222N40097j02564O90200L68431K49199N93157J56273L06267K25256
16771A3473538N72914O32642N87507L20027M46459N60699R51387M53546O51156
16762A8649875R61397M27864R11337P75725N24897J201241J142446J244511O65132
16753B6504425J230192J207190J259460J201060J599353J869178J731146J363600
16745C7965604K348196J675453K657409K332373K197844L142100L363910K910090
16737E8592979L083866L804734M211694M791633M577338M571402N793685N797262
$$ plain form
16729 95224593 101341706 107868063 114805798 121888068 130021238 137603717 145764078 153776455
16721 153776455 161827635 169232444 175927172 181791114 186987135 191031267 193477034 194344095
16713 194344095 194277117 192509022 188881421 184224171 178710120 172078981 164701720 157006218
16705 157006218 148967007 140824588 132662058 124700587 117002696 109400199 102808938 96408375
16697 96408375 90275508 84705205 79051285 74223751 69804874 65613057 61722647 58251124
16689 58251124 54491166 51057394 48627886 45713898 43377225 40727625 39185828 36856744
16681 36856744 35042183 33024557 31615125 30136772 28935038 26853401 26217240 25089637
16673 25089637 23791381 22940623 21761851 21221047 20434635 19221391 18538905 17573953 17403594
$$ packed form
16729I5224593O117113O526357O937735P082270Q133170P582479Q160361Q012377
16721A53776455Q051180P404809O694728N863942N196021M044132K445767Q67061
16713A94344095o6978j768095l627601m657250n514051o631139p377261p695502
16705A57006218q039211q142419q162530p961471p697891p602497o591261o400563
16697I6408375o132867n570303n653920m827534m418877m191817l890410l471523
16689E8251124l759958l433772k429508k913988k336673k649600j541797k329084
16681C6856744j814561k017626j409432j478353j201734k081637o36161j127603
16673B5089637j298256q50758j178772n40804p86412j213244o82486r64952j70359
$$ plain form
16664 17403594 16505295 15796150 15322137 14745091 14348352 13767899 13613962 12824058 12158739
16655 12158739 11984952 11661340 11093351 11154003 10555651 10086032 9829382 9356034 9605361
16646 9605361 9199468 8989583 8524218 8180346 8169690 7826774 7863942 7607119 7561230 7283067
16636 7283067 7040505 6915155 6593351 6214440 6238636 6123510 6046811 5791368 5715013 5628664
16626 5628664 5473361 5436750 5080400 5248163 5165642 4691444 4700452 4581479 4737387 4418967
16616 4418967 4091893 4316306 4058864 4040259 4127389 3872697 3789762 4039204 3767569 3531885
16606 3531885 3596535 3525467 3651478 3306598 3311456 3067726 3271382 3171049 2625595 2887195
16596 2887195 2793969 3006327 2808275 2782403 2820682 2715299 2583325 2694259 2685188 2568621
$$ packed form
16664A7403594q98299p09145m74013n77046l96739n80453j53937p89904o65319
16655A2158739j73787l23612n67989O0652n98352m69619k56650m73348K49327
16646I605361m05893k09885m65365l43872j0656l42916L7168k56823m5889k78163
16636G283067k42562j25350l21804l78911K4196j15126p6699k55443p6355q6349
16626E628664j55303l6611l56350J67763q2521m74198R008j18973J55908l18420
16616D418967l27074K24413k57442j8605Q7130k54692q2935K49442k71635k35684
16606C531885O4650p1068J26011l44880M858k43730K03656j00333n45454K61600
16596B887195r3226K12358j98052k5872L8279j05383j31974J10934r071j16567
$$ plain form
16586 2568621 2473210 2475629 2571839 2224327 2083454 1983337 2221642 2698435 1945600 2344478
16576 2344478 2264566 2163013 2091525 2093552 1984075 2104303 2091623 2097639 2248847 1827588 1830869
16565 1830869 1856630 1759289 1731819 1749996 2038389 1782171 1676012 1850839 1488989 1655264
16555 1655264 1561828 1678015 1448681 1832852 1842409 1614190 1331224 1271606 1531923 1289987
16545 1289987 1416007 1298606 1115159 963335 1429593 1453906 1427945 1374138 1104512 1611058
16535 1611058 948266 1166173 1274276 916924 1145336 1240201 1262397 772184 952418 918244
16525 918244 939701 966756 999469 1016795 1121125 1426035 840988 848207 1005708 960727 940558
16514 940558 794487 657615 859825 963369 1013166 557780 815884 718588 596725 919676
$$ packed form
16586B568621r5411K419R6210l47512j40873j00117K38305M76793p52835L98878
16576B344478p9912j01553p1488K027j09477J20228j2680O016J51208m21259L281
16565A830869K5761r7341k7470J8177K88393k56218j06159J74827l61850J66275
16555A655264r3436J16187k29334L84171R557k28219k82966n9618K60317k41936
16545A289987J26020j17401j83447j51824M66258K4313k5961n3807k69626N06546
16535A611058o62792K17907J08103l57352K28412R4865K2196m90213J80234l4174
16525I18244K1457K7055L2713J7326J04330L04910n85047P219J57501m4981k0169
16514I40558j46071j36872K02210J03544M9797m55386K58104r7296j21863L22951
$$ plain form
16504 919676 533868 678851 793927 690508 671401 687223 991386 617946 788734 633687
16494 633687 879806 739880 565050 855586 672474 941344 602268 747421 597597 589018
16484 589018 805969 472949 760462 622125 902457 368692 698527 529335 591429 699243
16474 699243 733340 440143 694896 427394 462924 550278 538687 665701 805932 590229
16464 590229 588505 728987 598474 689906 335425 650315 94193 596653 560604 354447
16454 354447 338371 429012 161880 712217 636565 519520 234309 291402 521188 381453
16444 381453 333616 697232 322670 489418 560459 169399 432045 378235 524389 235955
16433 353831 308677 440961 316158 393443 467075 360675 353776 220842 584323 474032
$$ packed form
16504I19676l85808J44983J15076j03419j9107J5822L04163l73440J70788j55047
16494F33687K46119j39926j74830K90536j83112K68870l39076J45153j49824q579
16484E89018K16951l33020K87513j38337K80332C68692L29835j69192O2094J07814
16474F99243L4097k93197K54753k67502L5530Q7354j1591J27014J40231k15703
16464E90229j724J40482j30513R1432C35425L14890I4193N02460l6049k06157
16454C54447j6076R0641A61880N50337p5652j17045B34309N7093K29786j39735
16444C81453m7837L63616C22670J66748P1041A69399K62646n3810J46154B35955
16433C53831m5154J32284j24803P7285P3632j06400o899j32934L63481j10291
$$ plain form
16423 474032 238384 538499 444129 408951 172581 423975 472743 38176 334345 557717
16413 557717 307423 385050 -52598 214809 800652 149659 153730 170777 169033 -2670 420120
16401 447785 352633 173388 434629 415044 352079 371248 643639 312500 146831 669473
16391 669473 348867 178664 358603 328800 364398 65737 259253 512328 671571 167627
16380 207045 220026 203424 437907 493784 145607 167390 508331 3227 212818 339576 183165
16369 183165 186973 393972 212343 180089 223295 476724 400808 133226 53979 352350 181715
16358 181715 106730 -152814 177900 270216 253451 125501 225728 147454 -64235 633184
16347 437252 149628 128596 -117887 169237 219242 242784 328159 49897 181392 -36661 188790
$$ packed form
16423D74032k35648L00115r4370l5178A72581K51394M8768C8176K96169K23372
16413E57717k50294P7627e2598B14809N85843A49659M071J7047j744b670D20120
16401D47785r5152A73388K61241j9585o2965J9169K72391C12500A46831N22642
16391F69473l20606j70203J79939k9803L5598F5737J93516K53075J59243A67627
16380B07045J2981j6602K34483N5877A45607K1783L40941C227K09591J26758j56411
16369A83165L808K06999j81629l2254M3206K53429p5916A33226E3979K98371j70635
16358A81715p4985a52814A77900R2316j6765A25501J00227p8274f4235F33184
16347D37252A49628k1032a17887A69237N0005K3542Q5375D9897J31495c6661A88790
$$ plain form
16335 -61600 226355 249947 315040 143739 -6665 -93153 300669 173517 370160 265232 -106379
16323 208363 426258 183422 142422 78836 161287 -83701 356125 247482 12113 -356197
16312 23875 260277 -268843 109726 206962 16982 232666 266052 -50271 106156 -65368 234445
16300 70073 -10178 249371 208701 139431 123594 253133 -1688 -93290 77234 68232 117931 66878
16288 66878 171638 79617 152018 -82725 -46818 157525 283993 77369 144161 281603 87097
16276 313178 -52077 124137 119408 141560 568097 -200109 -93864 -244435 116228 145595 238995
16265 238995 227985 124155 227668 121161 236179 -5616 200085 -86892 -129557 -179882 382024
16253 352808 -40352 149583 -21192 207251 -2809 -15220 443752 -16656 147499 345205 -322566
$$ packed form
16335f1600B26355K3592O5093A43739f665q6488C00669j27152J96643j04928a06379
16323B08363K17895A83422m1000o3586Q2451h3701C56125j08643A2113c56197
16312B3875K36402b68843A09726R7236A6982K15684L3386e0271A06156f5368B34445
16300G0073a0178B49371m0670o9270j5837J29539a688r1602G7234r002M9699n1053
16288F6878J04760G9617P2401h2725L5907A57525J26468G7369O6792J37442H7097
16276C13178e2077A24137m729K2152M26537b00109i3864j50571A16228K9367R3400
16265B38995j1010j03830J03513j06507J15018e616B00085h6892m2665n0325C82024
16253C52808d0352A49583b1192B07251b809j2411D43752a6656A47499J97706c22566
$$ plain form
16241 165646 41221 114073 285428 210984 -11884 -38830 235519 -67535 -67592 177993 -308562
16229 131033 -182320 55879 42329 369613 61404 179699 421262 138670 -8658 172663
16218 -25384 29204 141669 261200 152326 -145891 -141325 132686 -68650 -240028 -311706 55019
16206 -59409 -69551 -12489 -238243 149120 -59861 161654 279076 -283200 -174566 -50096
16195 -13073 302190 269046 -53905 -93087 302066 88901 168778 -8576 189287 164103 179230
16184 179230 659704 106477 -269796 -55133 52388 109247 225247 44922 -6081 58579 -142801
16172 -51300 -50039 20483 5613 -9280 -153105 -233649 19047 -70736 193484 56833 2389 -76801
16159 217446 27916 -33191 89776 -125216 345732 342833 218618 -56500 -126760 -491 -190338
$$ packed form
16241A65646D1221P2852J71355p4444a1884k6946B35519f7535n7A77993c08562
16229A31033a82320E5879j3550L27284F1404J18295K41563A38670h658A72663
16218b5384B9204J12465J19531j08874a45891M566A32686f8650j71378p1678E5019
16206e9409j0142a2489k25754A49120e9861A61654J17422b83200J08634e0096
16195a3073C02190l3144e3905l9182C02066H8901P9877h576A89287k5184J5127
16184A79230M80474A06477b69796e5133E2388N6859J16000D4922f081E8579a42801
16172e1300J261B0483E613i280j43825q0544A9047g0736A93484E6833B389g6801
16159B17446B7916c3191H9776a25216C45732k899j24215e6500p0260d91j89847
$$ plain form
16148 -190338 133085 -115042 -204972 -18374 88647 67773 26400 396660 -26916 159080 -243623
16136 -28992 -250986 81459 111656 -179625 247345 80864 52999 -83029 -96426 134242 166931
16125 166931 17654 54970 -31381 229527 -247881 -30277 161206 58918 -53810 8528 -226396
16113 69988 85421 -163664 -240608 178315 97020 139563 310868 -416170 -135052 171570
16102 61142 271848 -195047 427969 265096 336915 59615 516603 19512 -41480 2527 93581
16091 93581 200867 -131567 16566 37620 -72627 3939 -78176 69979 -6940 131350 19397
16079 59896 -33598 -307966 192554 -3510 -195775 -243657 -132523 92328 -239888 56679 86152
16068 86152 87030 -177310 12759 23753 8893 170885 336791 -209650 -40646 130581 65757
$$ packed form
16148a90338A33085a15042q9930a8374H8647k0874B6400L70260b6916A59080b43623
16136b8992k21994H1459L0197a79625B47345H0864k7865h3029j3397A34242L2689
16125A66931A7654L7316c1381B29527b47881c0277A61206E8918e3810H528b26396
16113F9988J5433a63664p6944A78315q1295M2543J71305d16170a35052A71570
16102F1142K10706a95047D27969j62873P1819E9615M56988A9512d1480B527R1054
16091I3581J07286a31567A6566K1054g2627C939g8176F9979f940A31350A9397
16079E9896c3598k74368A92554c510j92265m7882J11134I2328b39888E6679K9473
16068H6152Q78a77310A2759J0994H893J61992J65906b09650d0646A30581o4824
$$ plain form
16057 65757 263866 -213716 101637 151218 164362 77434 223738 62464 126661 -318112 70441
16045 473147 -252753 -185312 29811 167011 -274097 31984 -134196 -142189 155309 134884 -34521
16033 -294175 -371500 -125676 201317 314800 -138700 -227745 -134446 -5425 -16287 -12538 173423
16021 174589 192416 359789 226489 -39910 -109770 -99816 308174 107163 180330 -243908 -237820
16010 -237820 394887 -191504 -398219 135457 -26614 61810 -139985 -21760 252704 -15005
15999 -11511 1668 -173925 -27487 -1083 50772 -405041 73536 108529 126368 97304 -366610
15987 12845 79381 220028 13871 215342 243227 71942 420916 238445 205623 40386 -264280
15975 -131008 94671 53561 -281050 299575 -20392 -83490 30212 331472 -18436 326961 101050
$$ packed form
16057F5757J98109b13716A01637M9581J3144G7434J46304F2464O4197c18112G0441
16045D73147b52753O7441B9811J37200b74097C1984a34196p993A55309k0425c4521
16033b94175p7325a25676B01317J13483a38700q9045R3299e425j0862L749A73423
16021A74589J7827J67373j33300c9910o9860R954C08174A07163P3167b43908O088
16010b37820C94887a91504k06715A35457b6614F1810a39985b1760B52704a5005
15999a1511A668a73925b7487a083E0772d05041G3536L4993J7839k9064c66610
15987A2845O6536J40647A3871K01471K7885G1942L48974j82471l2822D0386b64280
15975a31008I4671m1110b81050B99575b0392o3098C0212L01260a8436C26961A01050
$$ plain form
15963 335424 7568 -384840 -287288 -57546 -259193 -116233 181638 -105163 67089 47637 -235305
15951 -260190 48866 -156421 72740 232832 -167671 -339771 -11109 -81580 -395196 98916
15940 184699 -124930 -136040 -97379 56423 -99152 -29892 -242838 -83976 -70661 -182882 -159400
15929 -159400 -22220 -132803 22841 -31328 238129 -116629 -77644 -50764 -23392 -28562 269013
15917 144210 -333989 -214012 -227985 -107254 -126305 -141681 -308050 229479 -187374 -88748
15906 88408 180622 150018 -3784 138085 -129102 -192254 -232548 69898 41202 -208101 17201
15894 -227961 -30992 15380 33030 -165675 -180322 71351 -190188 -162711 -331398 -117264 161716
15882 -130516 81565 232989 -356076 -117126 17595 106197 -113102 -61544 -71238 138824 -149302
$$ packed form
15963C35424G568c84840R7552e7546k01647a16233A81638a05163F7089j9452b35305
15951b60190D8866a56421G2740J60092a67671j72100a1109p0471l13616I8916
15940A84699a24930j1110L8661E6423i9152b9892k12946h3976J3315j12221K3482
15929a59400b2220j10583B2841c1328B38129a16629L8985K6880b3392n170B69013
15917A44210c33989J19977j3973a07254j9051j5376j66369B29479a87374h8748
15906H8408R2214l0604c784A38085a29102o3152m0294F9898k8696b08101A7201
15894b27961c0992A5380J7650a65675j4647G1351a90188K7477j68687a17264A61716
15882a30516H1565J51424c56076a17126A7595Q8602a13102N1558r694A38824a49302
$$ plain form
15870 18590 -378160 41061 -334350 248788 272733 -47984 -152055 -178216 115361 100019 50445
15859 50445 18751 20365 -134578 253047 132904 -207182 -135916 165417 -186541 -31351 40197
15847 149774 -226625 152324 13323 -31878 142347 37029 -122844 88843 116608 -178579
15836 -147249 127021 13048 -78346 -47055 42663 48557 -62682 -268972 -83567 -64398 -352025
15825 -352025 82376 29029 -159626 -4226 158795 -198865 -144492 208097 17411 -746 104089
15813 151251 31742 -242700 -175022 -341876 -322296 14830 30231 -145244 -281762 -6967 -135292
15802 -135292 200957 -9935 84525 -84685 -40528 -155409 93389 74277 -6445 167156 210613
15791 210613 -12463 301269 -57032 56508 -216781 -58495 13640 -120377 -132432 -204865 129872
$$ packed form
15870A8590c78160D1061c34350B48788K3945d7984j04071k6161A15361j5342m9574
15859E0445A8751J614a34578B53047j20143b07182P1266A65417a86541c1351D0197
15847A49774b26625A52324A3323c1878A42347C7029a22844H8843K7765a78579
15836a47249A27021A3048g8346L1291D2663N894f2682k06290h3567J9169k87627
15825c52025H2376B9029a59626d226A58795a98865N4373B08097A7411g46A04089
15813A51251C1742b42700O7678j66854J9580A4830J5401a45244j36518f967j28325
15802a35292B00957i935H4525h4685d0528j14881I3389j9112f445A67156M3457
15791B10613a2463C01269e7032E6508b16781e8495A3640a20377j2055p2433A29872
$$ plain form
15779 135738 113382 -164546 -287309 108080 62721 -121322 22985 -100469 -3472 -133332
15769 -133332 -138431 -51942 -74104 -238346 -199053 161982 -376859 -65064 396727 101774 -77500
15757 12238 181976 -176638 407029 7805 50318 26563 -167816 274969 18224 173443 -39937
15745 -26671 -40169 42456 150309 -263336 104097 354607 66576 39316 -197787 -298310
15735 -298310 -106611 100158 -8674 -504832 -224526 55139 -72578 -287541 -4078 145569 -346377
15723 -202574 -249808 401507 -101823 -264174 -43726 182577 83808 -40799 9397 -223182 -104654
15711 -233942 -39345 129728 -48922 126671 286093 226997 -143239 89009 -5118 -199002 -129502
15700 -129502 -89044 -74288 33133 -4439 333679 91593 -25598 -43404 63279 6296 94966 159932
$$ packed form
15779A35738k2356a64546j22763A08080m5359a21322B2985a00469c472j29860
15769a33332n099e1942k2162j64242L9293A61982c76859f5064C96727A01774g7500
15757A2238J69738a76638D07029G805M2513k3755a67816B74969A8224J55219c9937
15745b6671j3498D2456J07853b63336A04097K50510F6576k7260a97787j00523
15735b98310a06611A00158h674m96158b24526E5139g2578k14963d078A45569c46377
15723b02574m7234D01507a01823j62351d3726A82577H3808d0799I397b23182a04654
15711b33942c9345A29728d8922A26671J59422n9096a43239H9009e118j93884O9500
15700a29502M0458J4756C3133d439C33679I1593b5598j7806F3279F296Q8670O4966
$$ plain form
15688 159932 243955 87641 -165022 -194327 26181 -183660 -98412 -37602 296172 -172023 -179109
15677 -179109 -96856 -22684 -56805 -201595 -26144 -155970 -140791 123469 -162223 193668
15666 -45430 15157 165778 -23213 154559 -84515 -51610 -92731 156786 -34262 338313 -220504
15654 76698 -112860 -172670 -57331 -131133 -250366 -69552 -48453 1139 167042 -209824 -218139
15643 -218139 -111985 -91695 198017 9338 -60058 -172170 27787 -91704 8267 -165052 25994
15631 238134 -32032 102009 -81038 -57870 -266098 217617 79834 -7423 -84789 -183574 282036
15619 58429 71270 294229 16080 81924 -47551 113225 -361447 -31967 219791 -166089 371109
15607 198286 87099 82593 -136238 -87626 -252355 -142269 -292569 -195249 51744 -165698 189526
$$ packed form
15688A59932Q4023H7641a65022k9305B6181a83660Q5248c7602B96172a72023p086
15677a79109Q2253b2684l4121j44790b6144j29826J5179A23469a62223A93668
15666d5430A5157J50621b3213A54559h4515L2905m1121A56786c4262C38313b20504
15654G6698a12860n9810e7331p3802j19233f9552K1099A139J65903b09824q315
15643b18139J06154K0290A98017I338f0058j12112B7787i1704H267a65052B5994
15631B38134c2032A02009h1038K3168k08228B17617G9834g423p7366r8785B82036
15619E8429J2841K22959A6080O5844d7551A13225c61447c1967B19791a66089C71109
15607A98286H7099m506a36238M8612j64729J10086j50300R7320E1744a65698A89526
$$ plain form
15595 41187 -219571 -54921 31390 -194735 -23046 16311 232877 -126859 90596 385038 -37754
15583 130000 302762 -213289 -12509 -178353 171858 48937 -24111 -134614 283835 -112408
15572 95590 -126243 15883 -262456 132215 -211875 85269 224807 47222 59966 9430 23436
15561 23436 97963 32242 63028 -48530 -184703 3800 -917 -48467 -118332 89403 -82911 -66141
15549 -66141 -74067 42755 302806 -101451 9838 -117877 37480 -107284 -25386 -84578 -77589
15538 -77589 120163 -125422 -40441 -275165 17016 -50232 -192788 -73866 -383044 -163397
15527 131655 237462 -124703 95917 50472 68054 -15493 -162186 -48855 -292065 158218
15516 8370 50222 -168781 402408 194818 -72799 -133376 131602 71726 -24602 296989 -175013
$$ packed form
15595D1187b19571e4921C1390a94735b3046A6311K16566a26859I0596K94442c7754
15583A30000J72762b13289a2509j65844A71858D8937b4111j10503B83835a12408
15572I5590a26243A5883b62456A32215b11875H5269J39538D7222J2744I430J4006
15561B3436P4527C2242L0786d8530j36173C800i17m7550o9865H9403h2911J6770
15549f6141p926D2755K60051a01451I838a17877C7480a07284b5386n9192O989
15538g7589A20163a25422d0441k34724A7016e0232j42556g3866l09178a63397
15527A31655J05807a24703I5917m5445J7582a5493j46693d8855k43210A58218
15516H370M1852a68781D02408A94818g2799o0577A31602n9876b4602B96989a75013
$$ plain form
15504 -154656 -17146 -172295 264317 110167 -28578 -164108 -91748 54734 23209 -6077 -62192
15493 -62192 -126917 233703 105700 -158981 -151857 -23858 201758 -139462 93815 121059 132454
15482 132454 53698 127054 264963 -12808 -222168 -78341 119177 -88612 -220870 -480135
15472 -480135 -48966 -14581 7044 -48761 -58492 -49873 84377 -197252 -28571 -54763 77397 33407
15459 295064 -128382 -75930 120765 -101754 114524 -37121 25888 24180 -146146 -16941 129697
15447 -78760 112173 46765 -420107 175222 -274655 101513 -162230 -358560 320749 105746
15436 -132410 -62346 156614 -85965 129913 289646 -40069 -165539 38719 -95289 -162869 197167
15424 62141 178974 -11708 133910 104573 41447 -189013 269963 -201898 429253 -71382
$$ packed form
15504a54656a7146j55149B64317A10167b8578j35530P2360E4734B3209f077n6115
15493f2192o4725B33703A05700a58981P124b3858B01758a39462I3815K7244J1395
15482A32454E3698P3356J37909a2808k09360g8341A19177h8612j32258k59265
15472d80135d8966a4581G044d8761r731Q619H4377a97252b8571k6192G7397C3407
15459B95064a28382N2452A20765a01754A14524c7121B5888j708a46146a6941A29697
15447g8760A12173D6765d20107A75222b74655A01513a62230j96330C20749A05746
15436a32410f2346A56614h5965A29913J59733d0069j25470C8719i5289o7580A97167
15424F2141J16833a1708A33910k9337D1447a89013B69963b01898D29253g1382
$$ plain form
15413 -46504 -118833 -87537 -340799 256525 185496 72162 355722 106780 164777 -229126 -248560
15402 -248560 -254597 -206190 -179801 122104 11923 -271553 -33419 -351918 -96127 -180169 209118
15390 71180 93742 -5116 -127927 -183961 -268405 -239237 -369746 1091 -90121 120346 113423 15407
15377 62416 -210467 258958 -79010 -276113 -124624 -331340 22879 186355 147992 -292563
15366 -309276 117260 143933 -267692 300203 -114112 88420 -118066 -195075 -336119 -110677
15355 155834 189653 121635 10072 -23840 225107 -41337 -36387 -102735 223080 -254065 447589
15343 -277745 121552 91150 -111617 -235939 -57381 -79280 110210 200132 96206 -27240 435111
15331 249921 40802 -13251 3592 130672 25314 395699 159159 15295 -93314 172119 -335545
$$ packed form
15413d6504p2329L1296k53262B56525p1029G2162K83560A06780N7997b29126j9434
15402b48560o037M8407K6389A22104A1923b71553c3419l18499i6127q4042B09118
15390G1180K2562e116j22811n6034q4444K9168j30509A091i0121A20346o923A5407
15377F2416b10467B58958g9010j97103a24624k06716B2879J63476l8363b92563
15366c09276A17260K6673b67692C00203a14112H8420a18066p7009j41044a10677
15355A55834L3819o8018A0072b3840B25107d1337M950o6348B23080b54065D47589
15343b77745A21552l0402a11617j24322e7381k1899A10210Q9922I6206b7240D35111
15331B49921D0802a3251C592J27080B5314L70385A59159A5295i3314A72119c35545
$$ plain form
15319 425944 47813 -68260 35409 -304827 197844 -36378 -292032 -18188 -368409 230456
15308 -68476 180512 -131424 65650 124932 -95931 179534 232097 266419 -55642 -45077 222044
15296 -121047 176774 211458 -53365 247080 -10337 -35981 129670 32161 -247 41301 -132036
15284 264891 -16067 -144191 -271129 -33253 -168467 87721 385223 398903 -2893 -19818 162795
15272 -39201 -91484 17167 -61416 172911 -249174 -19117 -241825 74140 -183209 64024 224282
15261 224282 -14332 261855 55765 124295 298331 -49224 -140739 215064 131031 67353 198336
15250 198336 337786 358844 716557 1704996 1119242 1295103 1312876 86492 17563 77808
15240 77808 44103 -159488 154994 11140 35754 -115285 -139892 310561 -183234 -192413 -35854
$$ packed form
15319D25944D7813f8260C5409c04827A97844c6378k55654a8188l50221B30456
15308f8476A80512a31424F5650N9282i5931A79534N2563L4322e5642J0565B22044
15296a21047A76774L4684e3365B47080a0337k5644A29670C2161b47D1301a32036
15284B64891a6067j28124j26938c3253j35214H7721K97502J3680b893j6925A62795
15272c9201n2283A7167f1416A72911b49174a9117k22708G4140a83209F4024J60258
15261B24282a4332B61855E5765O8530J74036d9224r1515B15064q4033o3678J30983
15250A98336J39450K1058L57713R88439n85754J75861J7773H6492A7563O0245
15240G7808l3705a59488A54994A1140K4614a15285k4607C10561a83234r179c5854
$$ plain form
15228 13477 19576 261342 -28082 33787 -123558 332631 -277762 14175 -170944 62929 -205740
15216 -287414 27785 77667 114532 110264 283248 -175567 -6609 153419 513028 -396973 -519430
15205 -519430 193373 -183549 443039 222569 16394 -248349 27487 355109 125276 -177200
15194 180510 53120 -37814 328838 -145599 170397 189590 214907 -186634 176165 -120464
15183 135029 -169716 83942 87688 -206763 -34763 -109746 -231986 21312 377236 324816 -348326
15171 -373852 86381 -66025 277632 -69205 -97394 322099 202971 73182 208275 251041 142984
15160 142984 177214 316054 193108 185619 129741 -177789 90595 203910 96088 155517 271914
15149 271914 -87467 51477 -51307 119058 -2304 409151 93168 393604 -138310 278302 154913
$$ packed form
15228A3477O099K41766b8082C3787a23558C32631b77762A4175a70944F2929b05740
15216b87414B7785M9882L6865m268J72984a75567f609A53419L59609c96973j22457
15205e19430A93373a83549D43039k20470A6394b48349B7487L27622A25276a77200
15194A80510E3120c7814C28838a45599A70397J9193K5317a86634A76165a20464
15183A35029a69716H3942L746b06763c4763p4983j22240B1312L55924n2420c48326
15171c73852H6381f6025B77632f9205k8189C22099j19128G3182J35093M2766j08057
15160A42984L4230J38840j22946p489n5878a77789I0595J13315I6088N9429J16397
15149B71914h7467E1477e1307A19058b304D09151I3168L00436a38310B78302j23389
$$ plain form
15138 154913 173376 15833 141517 92874 479804 113279 -166089 264754 20912 241317
15128 241317 274977 265698 88433 -12563 -148065 12106 309439 163993 29817 83082 385826
15117 385826 79072 174901 157365 556627 28874 186862 -61331 14349 162506 -104599 85265
15105 -92889 -394996 -242099 -34056 -43911 -169739 129841 -35226 -58190 15631 252078 -138560
15093 117280 231975 -49276 132114 138443 250170 -87427 -257568 -200791 -35503 49067 226024
15082 226024 -254754 -209894 -32963 287875 60866 356849 383802 52367 356502 -6130 28452
15070 506499 187603 229189 -118163 341907 53760 51851 210657 51570 106740 138047 188319
15059 188319 -88983 210106 362427 13186 -176420 74454 513978 20057 -31877 -25530 -104543
$$ packed form
15138A54913J8463A5833J25684m8643L86930A13279a66089B64754B0912K20405
15128B41317L3660r279H8433a2563j35502A2106K97333j45446B9817N3265L02744
15117C85826G9072R5829j7536L99262B8874J57988f1331A4349J48157a04599H5265
15105i2889l02107J52897c4056r855j25828A29841c5226k2964A5631K36447a38560
15093A17280J14695d9276A32114O329J11727h7427j70141N6777c5503D9067J76957
15082B26024b54754M4860c2963B87875F0866K95983K6953E2367L04135f130B8452
15070E06499A87603M1586a18163C41907E3760j909J58806E1570N5170L1307N0272
15059A88319h8983B10106J52321A3186a76420G4454M39524B0057c1877O347p9013
$$ plain form
15048 -104543 167078 299186 108502 110034 18237 78106 87076 99692 271281 366118 555979
15037 555979 96967 192722 -32039 356003 514785 270849 49439 117936 -40584 69044 508329
15026 508329 431218 -6910 105525 336953 530837 8860 394658 194405 112787 -156030 85660
15014 206614 101366 300596 126703 -59916 29323 -68131 183664 316821 321391 157581
15003 -164727 172945 419414 171600 50545 298643 428506 151172 226296 -80078 427411
14992 592482 -13924 69317 -21119 422159 280554 69104 309146 -46316 -13259 338459 88285
14980 632373 75340 -110185 266940 262187 240990 71594 262467 77210 -76711 88892 23462
14968 87655 277625 168976 48146 -29492 313502 189564 411541 84614 112454 -187831
$$ packed form
15048a04543A67078J32108A08502J532A8237N9869Q970J2616J71589R4837J89861
15037E55979I6967R5755c2039C56003J58782k43936D9439O8497d0584F9044M39285
15026E08329p7111f910A05525K31428J93884H860L85798A94405q1618a56030H5660
15014B06614A01366J99230A26703e9916B9323f8131A83664J33157M570A57581
15003a64727A72945K46469A71600E0545K48098J29863A51172P5124h0078D27411
14992E92482a3924F9317b1119D22159j41605F9104K40042d6316a3259C38459H8285
14980F32373G5340a10185B66940m753k1197G1594J90873G7210g6711H8892B3462
14968H7655J89970j08649D8146b9492C13502j23938K21977H4614K7840a87831
$$ plain form
14957 95211 383724 68618 166060 113883 54849 265941 660231 302720 424877 49763 411730
14946 411730 322434 167336 296693 466154 127752 7491 139093 274035 -12999 284117
14935 172395 256323 -20715 247880 391431 109688 46035 44583 114868 375351 174830 197606
14924 197606 221764 84071 307557 -23924 522552 350158 176217 -164815 68102 567239
14914 567239 -20814 197414 322801 402935 483494 145637 46334 519103 334697 187799
14904 187799 62981 407195 301390 386112 261018 483941 195881 250076 473414 123671
14893 567945 257227 537798 227376 389273 107445 146615 114416 119531 644254 236886
14882 317995 63973 460282 315950 -23004 466891 251385 150320 169223 352131 175277
$$ packed form
14957I5211K88513F8618R7442n2177E4849K11092L94290C02720J22157D9763L61967
14946D11730q9296j55098J29357J69461A27752G491J31602J34942a2999B84117
14935A72395Q3928b0715B47880J43551A09688D6035j452P0285K60483A74830K2776
14924A97606K4158H4071K23486b3924E22552j72394j73941a64815F8102M99137
14914E67239b0814A97414J25387Q0134Q0559A45637D6334M72769j84406j46898
14904A87799F2981L44214j05805Q4722j25094K22923A95881N4195K23338A23671
14893E67945B57227K80571B27376J61897A07445L9170l2199N115N24723B36886
14882C17995F3973L96309j44332b3004D66891k15506j01065J8903J82908A75277
$$ plain form
14871 288433 66248 -63531 369998 223183 200032 242285 377535 385858 391800 441163 165388
14859 302957 397449 180884 488360 546292 457743 642016 629389 547210 463111 190988 175602
14848 175602 432966 193042 441324 403063 521714 122371 392904 561019 149543 520968
14838 520968 294295 145249 167600 296207 405599 463741 521621 507729 135008 433931
14828 433931 170887 736520 330077 277887 447768 239737 592499 243648 305811 505394
14818 505394 415386 240444 477162 521333 490218 272827 515271 466149 499501 382691
14808 382691 468232 129063 338242 516257 478055 378234 405517 221545 510510 380946
14798 380946 436919 105208 618170 631301 58644 400374 327072 274789 427053 393717 313845
$$ packed form
14871B88433F6248f3531C69998j46815k3151M2253J35250Q323N942M9363A65388
14859C02957R4492A80884L07476N7932q8549J84273j2627q2179q4099A90988j5386
14848A75602K57364A93042K48282l8261J18651A22371K70533J68115A49543L71425
14838E20968k26673A45249K2351J28607J09392N8142N7880j3892A35008K98923
14828D33931A70887N65633C30077n2190J69881k08031L52762B43648O2163J99583
14818E05394r0008j74942K36718M4171l1115k17391K42444m9122L3352j16810
14808C82691Q5541A29063K09179J78015l8202r9821K7283j83972K88965j29564
14798C80946N5973A05208N12962J3131E8644L41730p3302n2283J52264l3336p9872
$$ plain form
14787 313845 605239 391301 638631 234413 377356 245363 626880 421200 361578 396740
14777 396740 711615 585564 605612 753699 788446 515748 487423 359683 483280 325866
14767 325866 513661 409677 430063 765472 727846 599955 550707 690247 298408 415761
14757 415761 530639 468169 618894 217322 234788 1055611 237702 562596 663970 455524
14747 455524 685717 643226 600091 581090 517446 679821 745441 513819 463433 498004 369560
14736 369560 699241 716498 569566 948633 666641 669608 509724 461496 794114 270051
14725 530060 545748 390460 472131 431777 685849 960436 579509 623616 649319 767541
14715 767541 918261 691303 741243 562880 923365 629044 878048 543333 661612 590279
$$ packed form
14787C13845K91394k13938K47330B34413J42943j31993L81517k05680n9622L5162
14777C96740L14875j26051K0048J48087L4747k72698k8325j27740J23597j57414
14767C25866J87795j03984K0386L35409l7626j27891m9248J39540B98408J17353
14757D15761J14878o2470J50725B17322J7466Q20823B37702L24894J01374k08446
14747D55524K30193m2491m3135j9001o3644J62375O5620k31622n0386L4571j28444
14736C69560L29681J7257j46932L79067k81992K967j59884m8228L32618B70051
14725E30060J5688j55288Q1671m0354K54072K74587l80927M4107K5703J18222
14715G67541J50720k26958M9940j78363L60485k94321K49004l34715J18279p1333
$$ plain form
14705 590279 564234 418469 793091 779738 626897 839006 799622 713776 696423 242175
14694 713724 905140 568153 763350 813444 836571 754467 986936 968812 665226 598776
14684 598776 902946 625989 757781 849332 921446 539120 1046027 450620 1040254 789225
14674 789225 1062670 763742 1014537 1056234 1090603 1011292 948936 799617 1025707 961155
14664 961155 895928 677560 867877 969970 809072 902481 1054814 1019739 825620 1012502
14654 1012502 691800 1167813 1109145 921864 1190328 1211319 710478 1047238 919478 1205642
14644 1205642 963935 1159355 1001972 983291 1161886 1361450 1169810 1109651 668371 1284742
14634 1284742 1143295 1318440 1070811 989312 1320459 1279578 1175093 913656 1261174 692353
$$ packed form
14705E90279k6045j45765L74622j3353j52841K12109l9384q5846j7353B42175
14694G13724J91416l36987J95197N0094K3127q2104K32469j8124l03586o6450
14684E98776L04170k76957J31792R1551P2114l82326N06907D50620N89634k51029
14674G89225K73445k98928K50795M1697L4369p9311o2356j49319K26090o4552
14664I61155o5227k18368J90317J02093j60898R3409J52333l5075j94119J86882
14654A012502l20702M76013n8668j87281K68464K0991n00841L36760j27760K86164
14644A205642k41707J95420j57383j8681J78595J99564j91640o0159m41280O16371
14634A284742j41447J75145k47629q1499L31147m0881j04485k61437L47518n68821
$$ plain form
14624 692353 999013 1274197 1255768 1316244 882158 1327702 1434904 965011 999161 1266819
14614 1266819 1307791 1163546 811235 1155414 1371770 1331766 1265923 1328298 1306195 1428725
14604 1428725 1345392 1339403 1658853 1377812 1191685 1264903 1403947 1646507 1093567 1292232
14594 1292232 1617971 1730784 1606709 1723875 1577092 1146769 1473021 1826026 1891249 1457615
14584 1457615 1393356 1540696 1417359 1624003 1594296 1512328 1580086 1618328 1721615 1833814
14574 1833814 1328061 1635407 1711262 1908634 2140179 1858449 1879045 1861066 2163067 2129501
14564 2129501 1696768 2156439 2204305 2611772 2325604 2057472 2360237 2646517 2643811 2798178
14554 2798178 2872988 3180055 3537484 4273513 4861798 5853317 9520922 18620771 37726700
$$ packed form
14624F92353L06660K75184j8429O0476m34086M45544J07202m69893L4150K67658
14614A266819M0972j44245l52311L44179K16356m0004o5843O2375k2103J22530
14604A428725q3333n989L19450k81041j86127P3218J39044K42560n52940J98665
14594A292232L25739J12813j24075J17166j46783m30323L26252L53005O5223m33634
14584A457615o4259J47340j23337K06644k9707q1968O7758L8242J03287J12199
14574A833814n05753L07346P5855J97372K31545k81730K0596j7979L02001l3566
14564B129501m32733M59671M7866M07467k86168k68132L02765K86280k706J54367
14554B798178P4810L07067L57429P36029N88285R91519L667605R099849J9105929
$$ plain form
14545 37726700 43521770 22313391 9652133 4287968 2760234 2263092 1780007 1823201
14537 1823201 1701927 1880679 1556324 1830531 1651992 1637488 1534707 1829168 1930558 2031252
14527 2031252 2014942 2113365 2138071 1865033 1989926 2142948 2334780 1886363 1861044 2454317
14517 2454317 2029109 2402331 2353795 2332078 2256124 2508509 2048519 2356676 2255834 2686881
14507 2686881 2241036 2382814 2365480 2781389 2381194 2776413 2780220 2525405 2734367 2795737
14497 2795737 2762636 2779408 2932522 3008833 2836722 2927519 3076246 3075445 2901111 3381887 3043361
14486 3043361 3406335 3251679 3035933 3742079 3225008 3257058 3598562 3087621 3204243 3549422
14476 3549422 3466992 3815325 3554387 3710277 3646036 3568306 3787851 3739314 3993164 3982524
$$ packed form
14545C7726700N795070k1208379I652133D287968j527734m97142m83085M3194
14537A823201j21274J78752l24355K74207j78539j4504j02781K94461J01390J00694
14527B031252j6310R8423K4706k73038J24893J53022J91832m48417k5319N93273
14517B454317m25208L73222m8536k1717p5954K52385m59990L08157j00842M31047
14507B686881m45845J41778j7334M15909m00195L95219L807k54815K08962O1370
14497B795737l3101J6772J53114P6311j72111R0797J48727q01j74334M80776l38526
14486C043361L62974j54656k15746P06146n17071L2050L41504n10941J16622L45179
14476C549422q2430L48333k60938J55890o4241p7730K19545m8537K53850j0640
$$ plain form
14466 3982524 3856021 4086310 4090610 3977695 3862534 4218247 3947707 4895527 3895320 4352949
14456 4352949 4258055 4569601 4395742 4466385 4387540 4773289 4772117 4462514 4696655 4732025
14446 4732025 5186994 4935988 5215206 4903938 4988995 4826944 5045872 5276265 5465905 5175584
14436 5175584 5454504 5706825 5480429 5775457 5745095 5631958 5784197 6002374 6287430 6112314
14426 6112314 6178108 6444845 6527971 6630516 6278548 6801417 6708901 6729886 6790997 6785377 7050674
14415 7050674 7316230 7326561 7603619 7801496 7711257 7798069 7565714 8087628 8099132 8304718
14405 8304718 8461571 8589505 8714771 8820733 8849262 9275022 9247352 9234567 9634338 9781161
14395 9781161 9669904 10264405 10110781 10243836 10441933 10898770 10799657 10827328 11440834 11717470
$$ packed form
14466C982524j26503K30289M300j12915j15161L55713k70540R47820j000207M57629
14456D352949r4894L11546j73859P0643p8845L85749j172l09603K34141L5370
14446D732025M54969k51006K79218l11268Q5057j62051K18928K30393J89640k90321
14436E175584K78920K52321k26396K95028l0362j13137J52239K18177K85056j75116
14426F112314O5794K66737Q3126J02545l51968N22869r2516K0985O1111n620K65297
14415G050674K65556J0331K77058J97877r0239Q6812k32355N21914J1504K05586
14405H304718J56853J27934J25266J05962K8529M25760k7670j2785L99771J46823
14395I781161j11257N94501j53624J33055J98097M56837r9113K7671O13506K76636
$$ plain form
14385 11717470 11800993 12109431 12314027 12581662 12584339 12998672 13217774 13316449 13640170 13920197
14375 13920197 14250153 14440652 14879795 15056896 15415415 15795642 15977772 16353068 16424948
14366 16424948 17083229 17462207 17756673 18147791 18498720 19020471 19244837 20029021 20325586
14357 20325586 20683360 21230134 21649251 21985875 22725643 23323189 23581394 24457846 25122278
14348 25122278 25715823 26443985 27117312 27659127 28635684 29054279 29968321 31157393 31957950
14339 31957950 32558185 33626468 34734247 35756378 37045090 38122518 39141910 40474168
14331 40474168 41807698 42991100 44497768 45625603 47335167 49078212 50338094 52443717
14323 52443717 54022748 55773059 58161530 60315596 62372631 64733788 67331082 69859627
$$ packed form
14385A1717470Q3523L08438K04596K67635K677M14333K19102R8675L23721K80027
14375A3920197L29956J90499M39143J77101L58519L80227J82130L75296P1880
14366A6424948O58281L78978K94466L91118L50929N21751K24366P84184K96565
14357B0325586L57774N46774M19117L36624P39768N97546K58205Q76452O64432
14348B5122278N93545P28162O73327N41815R76557M18595R14042J189072Q00557
14339C1957950O00235J068283J107779J022131J288712J077428J019392J332258
14331D0474168J333530J183402J506668J127835J709564J743045J259882K105623
14323E2443717J579031J750311K388471K154066K057035K361157K597294K528545
$$ plain form
14315 69859627 72202565 75276359 78495710 81595293 85345067 88638962 92434536 96578322
14307 96578322 100852188 105621101 110312155 115377624 120901750 126772142 133256612 139745045
14299 139745045 146289206 154439289 162075996 170722052 179502279 188932426 199401700 210240391
14291 210240391 221535349 233831656 246990764 260433369 274271086 289285178 304166067
14284 304166067 320477649 336555861 353140048 369426454 386024864 401546936 416075397
14277 416075397 429827312 441791494 451957655 460064236 465737230 467435692 463853849
14270 463853849 458745778 455424958 452288312 445868605 435339293 423144133 409669959
14263 409669959 395571927 379664885 362850121 346171774 329188915 312448234 296402390
$$ packed form
14315F9859627K342938L073794L219351L099583L749774L293895L795574M143786
14307I6578322M273866M768913M691054N065469N524126N870392O484470O488433
14299A39745045O544161Q150083P636707Q646056Q780227R430147J0469274J0838691
14291B10240391J1294958J2296307J3159108J3442605J3837717J5014092J4880889
14284C04166067J6311582J6078212J6584187J6286406J6598410J5522072J4528461
14277D16075397J3751915J1964182J0166161Q106581N672994J698462l581843
14270D63853849n108071l320820l136646o419707j0529312j2195160j3474174
14263D09669959j4098032j5907042j6814764j6678347j6982859j6740681j6045844
$$ plain form
14256 296402390 280887442 266286606 253179168 239767288 226965668 214619833 203338625
14249 203338625 192818445 182668765 173107832 164522862 156004267 148825365 141610164 134332841
14241 134332841 127881804 121810610 116492386 111137398 106620852 101372902 96789997 92890119
14233 92890119 88788763 85186040 82105505 79090020 75395802 72328068 69686057 67156067
14225 67156067 64529780 62102295 59585585 57663264 55791789 53977677 52218911 50154148
14217 50154148 48579150 46904838 45451255 44496786 43344389 41871095 40416984 39114007
14209 39114007 37956350 36830129 36545544 35378714 34317072 32828335 32503558 31051104
14201 31051104 30626808 30195605 29334296 28450118 27630687 26893375 25943512 25419913 25052088
$$ packed form
14256B96402390j5514948j4600836j3107438j3411880j2801620j2345835j1281208
14249B03338625j0520180j0149680r560933q584970q518595p178902p215201p277323
14241A34332841o451037o071194n318224n354988m516546n247950m582905l899878
14233I2890119m101356l602723l080535l015485l694218l067734k642011k529990
14225F7156067k626287k427485k516710j922321j871475j814112j758766k064763
14217E0154148j574998j674312j453583r54469j152397j473294j454111j302977
14209C9114007j157657j126221k84585j166830j061642j488737l24777j452454
14201C1051104m24296m31203q61309q84178q19431p37312r49863n23599l67825
$$ plain form
14192 25052088 24200552 23832618 23247177 22670252 22201501 21869688 20937378 20665699 20453743
14183 20453743 19936174 19482059 18909950 18626840 18023470 17774803 17278007 17158510 16558476
14174 16558476 16337143 16304233 15891214 15562541 14923559 14508435 14617165 13775714 13892503
14165 13892503 13765453 13500484 13278116 13216243 12792640 12530772 12501948 12190025 12100802 11534726
14155 11534726 11275669 11503017 11354707 10937669 11088642 10606052 10265968 10269829 10235282 9903520
14145 9903520 9698130 9309821 9334949 9336454 9398806 9217136 9105734 8814453 8963510 8787567
14135 8787567 8630995 8302446 8196221 8304820 8022994 7838331 7819447 7638412 7788347 7467255
14125 7467255 7547906 7354113 7101803 7238399 7450804 7011052 6993284 7022457 7044368 6741027
$$ packed form
14192B5052088q51536l67934n85441n76925m68751l31813r32310k71679k11956
14183B0453743n17569m54115n72109k83110o03370k48667m96796j19497o00034
14174A6558476k21333l2910m13019l28673o38982m15124J08730q41451J16789
14165A3892503j27050k64969k22368o1873m23603k61868k8824l11923q9223n66076
14155A1534726k59057K27348j48310m17038J50973m82590l40084L861l4547l31762
14145I903520k05390l88309K5128J505O2352j81670j11402k91281J49057j75943
14135H787567j56572l28549j06225J08599k81826j84663j8884j81035J49935l21092
14125G467255Q0651j93793k52310J36596K12405m39752j7768K9173K1911l03341
$$ plain form
14115 6741027 6490848 6272503 6221588 6033848 6086450 6393865 5992761 6196817 6103993 5885486
14105 5885486 5704149 5594558 5624813 5547421 5610292 5611895 5576542 5152132 5186042 4949802 5130842
14094 5130842 5121894 4788952 5336493 4931930 4901551 4643973 4942397 4954769 4559703 4350233
14084 4350233 4355542 4548217 4600078 4582708 4338167 4363871 4025989 4000839 4187092 3908682
14074 3908682 3929880 4129564 3759341 3772138 3650913 3897588 3863793 3432306 3644476 3798741
14064 3798741 3656416 3451506 3504026 3710815 3385242 3617388 3986726 3690437 3608271 3249484
14054 3249484 3272914 3685972 2861403 3313205 3222022 2990013 3166800 2924113 3144454 2801517
14044 2801517 2937536 3051804 2761053 2903331 2836993 3009202 2828284 2853756 2549203 2737048
$$ packed form
14115F741027k50179k18345n0915j87740N2602L07415m01104K04056r2824k18507
14105E885486j81337j09591L0255p7392O2871J603l5353m24410L3910k36240J81040
14094E130842q948l32942N47541m04563l0379k57578K98424J2372l95066k09470
14084D350233N309J92675N1861j7370k44541K5704l37882k5150J86253k78410
14074C908682K1198J99684l70223J2797j21225K46675l3795m31487K12170J54265
14064C798741j42325k04910N2520K06789l25573K32146L69338k96289q2166l58787
14054C249484K3430M13058q24569M51802r1183k32009J76787k42687K20341l42937
14044B801517J36019J14268k90751J42278o6338J72209j80918K5472l04553J87845
$$ plain form
14034 2737048 2941847 2733968 2355715 2684941 2588254 2403169 2682731 2853278 2436986 2506741
14024 2506741 2388197 2304732 2286429 2371668 2380334 2341493 2646685 2360058 2221461 2238125 2346689
14013 2346689 2360454 2102192 2194577 2287853 2182186 2045791 2002575 1953098 2099932 2199708
14003 2199708 2066464 1595949 1624196 2119715 1828834 1866626 1637104 1594948 1967067 2106130
13993 2106130 1837833 1854297 1925432 2352007 2695686 4977107 12532236 31075286 44057740
13984 44057740 26137873 12293777 7191546 5584943 3858040 3780009 3156127 3159778 2860282
13975 2860282 2526449 2502634 2663084 2390391 2141163 2153607 2268713 1940028 2073320 1819797
13965 1819797 1664660 1828273 2156061 1897563 2070783 1947518 1923637 1998427 2148615 1971180
$$ packed form
14034B737048K04799k07879l78253L29226r6687j85085K79562J70547m16292O9755
14024B506741j18544q3465j8303Q5239Q666l8841L05192k86627j38597J6664J08564
14013B346689J3765k58262R2385R3276j05667j36395m3216m9477J46834R9776
14003B199708j33244m70515K8247M95519k90881L7792k29522m2156L72119J39063
13993B106130k68297J6464P1135M26575L43679K281421P555129J8543050J2982454
13984D4057740j7919867A2293777n102231j606603j726903p8031o23882L651k99496
13975B860282l33833k3815J60450k72693k49228J2444J15106l28685J33292k53523
13965A819797j55137J63613L27788k58498J73220j23265k3881P4790J50188j77435
$$ plain form
13955 1971180 1892234 1975431 1855617 1406262 1848814 1950669 1682797 1732711 1967985 2055464
13945 2055464 1553453 1812563 1643975 1491801 1486864 1906088 1541817 1519694 1751798 1597336
13935 1597336 1595259 1528294 1485440 1465937 1660563 1210402 1293353 1813988 1480887 1508038 1244759
13924 1244759 1339965 1550813 1308770 1423878 1334559 1580951 1800022 1591796 1174789 1206885
13914 1206885 1462696 1392888 1429434 1295643 1107563 1320922 1067359 994360 1308439 1079646
13904 1079646 1420837 1049394 1007082 1134110 1157277 1160972 800665 1361306 956069 1307149
13894 1307149 1022002 1313918 1060667 1322428 1105437 1219437 1508075 1238878 1055322
13885 1055322 979554 1016356 867227 1036604 975846 1153355 982181 1404701 943130 1231551
$$ packed form
13955A971180p8946Q3197j19814m49355M42552J01855k67872M9914K35274Q7479
13945B055464n02011K59110j68588j52174m937M19224l64271k2123K32104j54462
13935A597336k077o6965m2854j9503J94626m50161Q2951N20635l33101K7151k63279
13924A244759R5206K10848k42043J15108q9319K46392K19071k08226m17007L2096
13914A206885K55811o9808L6546j33791j88080K13359k53563p2999L14079k28793
13904A079646L41191l71443m2312J27028K3167L695l60307N60641m05237L51080
13894A307149k85147K91916k53251K61761k16991J14000K88638k69197j83556
13885A055322p5768L6802j49129J69377o0758J77509j71174M22520m61571K88421
$$ plain form
13875 1231551 1045624 1155536 1151062 1046559 939979 1023455 843225 900360 1028266 1327636
13865 1327636 1007461 1035195 1359335 783455 788993 975259 935979 956142 1093899 1253281
13855 1253281 811650 907232 779834 837964 883150 752332 669150 632230 959650 756474
13845 756474 369171 767668 1029761 534859 912308 957256 1113067 1092639 721726 753632
13835 753632 905239 1277218 815461 872756 447790 887563 1068010 669993 915166 964520
13825 964520 1004126 913721 826463 878197 632327 943730 890882 613480 915541 762118
13815 762118 991907 836802 815775 611360 411877 1101778 642005 970636 530382 819542
13805 819542 557148 568065 969465 647974 868859 511204 797295 703617 627191 823721
$$ packed form
13875A231551j85927J09912m474j04503j06580Q3476j80230N7135J27906K99370
13865A327636l20175K7734L24140n75880N538J86266l9280K0163J37757J59382
13855A253281m41631R5582j27398N8130M5186j30818q3182l6920L27420k03176
13845G56474C69171L98497K62093m94902L77449M4948J55811k0428l70913L1906
13835G53632J51607L71979m61757N7295m24966M39773J80447l98017K45173M9354
13825I64520L9606r0405q7258N1734k45870L11403n2848k77402L02061j53423
13815G62118K29789j55105k1027k04415j99483O89901m59773L28631m40254K89160
13805H19542k62394J0917M01400l21491K20885l57655K86091r3678p6426J96530
$$ plain form
13795 823721 980299 711748 919921 617806 717567 475129 721722 613316 301211 543429
13785 543429 728726 808316 654573 530050 603237 383412 602202 566717 875991 794004
13775 794004 563737 623699 709077 878462 722976 384491 615087 412512 585220 725465
13765 725465 500216 1193474 368769 397448 476000 685043 420847 434971 575321 742831
13755 742831 626876 395011 933388 508187 244213 532744 397620 428429 631676 460639
13745 460639 675958 838279 564535 555134 786166 249739 968577 265370 623463 632098
13735 632098 647732 722037 780109 409746 754782 1018092 589143 411099 578765 168194
13724 717177 648453 343292 412644 647349 633023 534811 410574 679721 1110866 402845
$$ packed form
13795H23721J56578k68551K08173l02115R9761k42438K46593j08406C01211K42218
13785E43429J85297P9590j53743j24523P3187k19825K18790l5485L09274q1987
13775G94004k30267N9962Q5378J69385j55486l38485K30596k02575J72708J40245
13765G25465k25249O93258C68769K8679P8552K09043k64196J4124J40350J67510
13755G42831j15955k31865N38377m25201B44213K88531j35124L0809K03247j71037
13745D60639K15319J62321k73744r401K31032B49739P18838B65370L58093Q635
13735F32098J5634P4305N8072l70363L45036K63310m28949j78044J67666A68194
13724G17177o8724l05161O9352K34705j4326r8212j24237K69147M31145D02845
$$ plain form
13713 446151 487675 207469 186424 534151 682149 351799 201019 617478 530812 569439
13703 569439 276832 606962 542957 670317 470167 582295 469417 237603 431287 424554
13693 424554 396247 678920 222920 241206 548523 416688 329671 391237 638120 672901
13683 672901 675005 165011 379779 365197 355455 674039 784885 299871 359632 622069 606522
13672 606522 767843 333955 282501 403690 63267 236073 264679 184550 303343 248463
13662 248463 786153 486897 352472 690277 362754 490308 241216 344338 218889 345205
13652 345205 191946 335442 357704 192025 409344 886318 369429 237615 475177 329861
13642 329861 351462 589181 75197 221906 683692 91277 396463 434743 667527 575791
$$ packed form
13713D46151M1524B07469k1045L47727J47998l30350j50780M16459q6666L8627
13703E69439B76832L30130o4005J27360k00150J12128j12878k31814J93684o733
13693D24554k8307K82673B22920J8286L07317j31835q7017O1566K46883L4781
13683F72901K104A65011K14768j4582r742L18584J10846B99871N9761K62437j5547
13672F06522J61321C33955n1454J21189F3267J72806K8606q0129J18793n4880
13662B48463N37690k99256j34425L37805l27523J27554B41216J03122j25449J26316
13652C45205j53259J43496K2262j65679K17319M76974C69429j31814K37562j45316
13642C29861K1601K37719G5197J46709M61786I1277L05186L8280K32784r1736
$$ plain form
13632 575791 336987 303976 324153 369190 270417 370851 261917 112089 163701 458859
13622 458859 539056 355434 379307 191474 445926 199197 312895 126190 399926 167367
13611 127347 340559 364397 412589 449869 397768 261685 429998 252181 33439 457378
13601 457378 631168 190652 567049 533484 246081 341540 182244 586617 597552 244713
13590 406310 316118 37393 487311 538728 347750 350545 406119 283992 324011 507996 210459
13578 222542 534105 100147 164189 692694 127187 271821 177954 379238 143013 579808
13568 579808 582141 192715 179288 42041 427230 1792 27456 583863 471761 167835 254584
13557 254584 121927 167132 -60379 154749 354114 312040 469330 479170 260549 460067
$$ packed form
13632E75791k38804l3011K0177M5037r8773J00434j08934A12089N1612K95158
13622D58859Q0197j83622K3873j87833K54452A99197J13698A26190K73736A67367
13611A27347K13212K3838M8192L7280n2101j36083J68313j77817C3439M23939
13601D57378J73790A90652L76397l3565B46081R5459j59296M04373J0935B44713
13590D06310r0192C7393M49918N1417j90978K795N5574j22127M0019J83985B10459
13578B22542L11563A00147O4042N28505A27187J44634r3867K01284A43013M36795
13568E79808K333A92715j3427D2041L85189A792K5664N56407j12102A67835Q6749
13557B54584A21927M5205f0379A54749J99365m2074J57290R840k18621J99518
$$ plain form
13547 460067 148584 391122 158151 168586 -109899 345517 270219 234374 288038 393970
13537 393970 274259 -53231 315110 165040 290379 359979 495153 249106 443583 263529
13527 263529 323316 315027 303423 195221 473109 409387 21584 -87728 287664 140250 407737
13516 407737 363745 322662 364200 149216 299908 381881 134891 104926 -100968 146871
13505 225896 84701 149424 169846 367835 326574 150704 329539 231293 203235 176001 142522
13494 142522 42298 314600 272177 325547 46266 20552 92717 134379 418666 226050 238137
13483 238137 88506 265206 188417 258917 54941 162574 308260 -6821 425453 194250 -25480
13471 601896 273218 178299 471596 110783 327514 283761 2620 229020 337822 27915
$$ packed form
13547D60067A48584K42538A58151J0435a09899C45517p5298l5845N3664J05932
13537C93970j19711e3231C15110j50070J25339O9600J35174k46047J94477j80054
13527B63529N9787q289j1604j08202K77888o3722B1584h7728B87664A40250K67487
13516D07737m3992m1083M1538A49216J50692Q1973A34891k9965a00968A46871
13505B25896H4701O4723K0422J97989m1261A50704J78835r8246k8058k7234l3479
13494A42522D2298K72302m2423N3370D6266B0552P2165M1662K84287j92616J2087
13483B38137H8506J76700p6789P0500E4941J07633J45686f821D25453A94250b5480
13471F01896B73218r4919K93297A10783K16731m3753B620K26400J08802B7915
$$ plain form
13460 291798 278682 -23510 -62839 215307 159149 524738 44491 -94061 58420 392804 257977
13449 257977 175841 45244 93662 359386 574860 148069 368837 156683 280460 457767
13439 457767 336556 194196 -83742 414985 56524 149861 306433 348704 50510 -220123
13428 -49155 227188 83198 350569 96731 43048 251995 53982 151432 197919 125854 -37203
13416 38289 -22772 432415 30994 90190 46012 21608 248570 342747 286479 151831 -200103
13404 149438 107382 556161 295219 176178 391538 -32263 635660 -65256 92365 96377 173929
13393 173929 97692 -27776 172085 468379 -49459 365585 368434 169052 113285 186252 331966
13382 331966 142238 127704 348117 377614 94067 141509 196378 171823 31290 389031 -41714
$$ packed form
13460B91798j3116b3510l9329B15307n6158L65589D4491i4061E8420L34384j34827
13449B57977q2136D5244M8418K65724K15474A48069K20768A56683J23777J77307
13439D57767j21211j42360h3742D14985E6524R3337J56572M2271E0510b20123
13428d9155B27188H3198K67371I6731D3048K08947E3982R7450M6487p2065c7203
13416C8289b2772D32415C0994N9196m4178B1608K26962R4177n6268j34648b00103
13404A49438m2056M48779k60942j19041K15360c2263F35660f5256I2365M012P7552
13393A73929p6237b7776A72085K96294d9459C65585K849A69052n5767P2967J45714
13382C31966A42238j4534K20413K9497I4067M7442N4869k4555C1290L57741d1714
$$ plain form
13370 618880 251415 110256 215428 457954 129437 377469 158697 133930 97129 265986
13360 265986 61626 287167 60953 393938 176001 351800 -64498 47811 384141 -4144 402293
13348 -25536 493715 112292 458461 45461 102201 -254844 -59068 160960 187526 278416 338619
13337 338619 -156022 117105 440338 -45643 130858 447836 58012 466084 61589 230252
13327 230252 56884 394322 134717 212375 88175 170102 399763 24537 287605 194434 -8297
13315 317659 247550 -161431 155142 210856 54237 43341 165007 273057 110616 -89718
13304 101556 -23760 406546 34235 55783 317619 459521 10312 301757 285688 200898 13567
13292 225509 97857 118345 59346 28260 175493 239911 -134546 33645 -290180 17458 418998
$$ packed form
13370F18880B51415A10256J05172K42526A29437K48032A58697k4767l6801J68857
13360B65986F1626K25541F0953L32985A76001J75799f4498D7811L36330d144D02293
13348b5536D93715A12292L46169D5461N6740b54844e9068A60960K6566R0890O0203
13337C38619a56022A17105L23233d5643A30858L16978E8012M08072F1589J68663
13327B30252E6884L37438A34717P7658H8175Q1927K29661B4537K63068r3171h297
13315C17659p0109a61431A55142N5714E4237j0896J21666J08050A10616h9718
13304A01556b3760D06546C4235K1548K61836J41902A0312K91445j6069q4790A3567
13292B25509I7857K0488n8999B8260J47233O4418a34546C3645b90180A7458M01540
$$ plain form
13281 418998 -32216 205053 310488 156385 194220 194899 179283 323663 -220510 69241 143384
13270 143384 26949 -88893 -121753 431833 23276 104496 -51010 -42534 -137371 254624 136043
13259 136043 -101240 275776 100 11352 16943 392542 215662 182743 -75353 68523 212171
13248 212171 -214592 323240 116115 285935 183079 263262 43452 128334 -16910 -156286
13238 -156286 55006 35304 163096 -183353 -45979 -177971 149266 168640 69936 -53810 -172877
13227 -172877 121823 -54727 197188 103319 126116 371180 355491 97309 185405 150487 -53404
13215 308404 194808 -76243 273998 191939 243711 -24092 -133775 158508 -88191 -58791 179401
13203 207565 -328774 201459 107513 25218 228091 5316 189969 21440 87655 -124456 428817
$$ packed form
13281D18998c2216B05053J05435j54103L7835O79j5616J44380b20510F9241P4143
13270A43384B6949h8893l2860D31833B3276Q1220e1010Q476r4837B54624j18581
13259A36043a01240B75776A00J1252N591L75599j76880l2919g5353F8523J43648
13248B12171b14592C23240A16115J69820j02856Q0183D3452Q4882a6910j39376
13238a56286E5006j9702J27792a83353d5979j31992A49266J9374F9936e3810j19067
13227a72877A21823e4727A97188r3869K2797K45064j5689I7309Q8096l4918e3404
13215C08404j13596g6243B73998q2059N1772b4092j09683A58508h8191K9400A79401
13203B07565c28774B01459r3946B5218K02873E316J84653B1440O6215a24456D28817
$$ plain form
13191 98524 26775 -109796 -346757 241545 140301 419178 338466 193759 228841 298884
13181 298884 167172 -98066 -209630 115358 182926 214837 209633 140577 137872 188949 -35356
13169 -75506 66444 -122468 -2560 221818 12253 163509 206341 -146095 -10980 119190 179563
13158 179563 -252 39542 134497 173903 -1220 65799 415023 178657 -42585 -37764 407559 201573
13145 383050 -355077 -33761 68433 15502 160724 7966 208567 -34323 18813 66651 302680
13134 302680 412253 313829 -124433 -47182 67384 53640 108459 -29704 186583 77244 92367
13123 92367 289221 -55463 19126 51445 116081 103222 160289 -121067 -4739 -193060 16326
13111 155117 297714 327276 164610 -14678 -150844 125056 196761 -228340 45831 -16298
$$ packed form
13191I8524B6775a09796k36961B41545j01244K78877q0712j44707L5082P0043
13181B98884j31712i8066j11564A15358O7568L1911n204o9056k705N1077c5356
13169g5506F6444a22468b560B21818A2253J51256M2832a46095a0980A19190O0373
13158A79563b52C9542R4955L9406a220F5799L49224A78657d2585M821D07559B01573
13145C83050c55077c3761F8433A5502J45222G966K00601c4323A8813M7838K36029
13134C02680J09573r8424a24433d7182F7384j3744N4819b9704A86583G7244J5123
13123I2367J96854e5463A9126L2319O4636j2859N7067a21067d739j88321A6326
13111A55117J42597K9562j62666a4678j36166A25056P1705b28340D5831a6298
$$ plain form
13100 -155651 215906 -48845 -59978 118333 212336 136152 -78268 128025 219334 71195 62987
13089 62987 -76797 401446 -71127 185690 31753 -37455 -209837 78663 -222361 -296646 236457
13077 198675 -239746 -427976 51250 245857 171096 -154277 195660 -78449 88028 165173
13067 165173 -114922 211654 -13466 148371 -24391 -88394 -195896 -117998 248235 -149486
13056 -272034 271031 -192231 78908 91289 -24149 135547 -394666 -103466 -91432 -46572
13046 -46572 -68851 -18955 55938 -111778 133863 25656 9687 45853 117277 151135 44498
13034 4967 301252 -317152 87049 70190 174016 304265 -35831 -53135 329875 9773 349540
13023 349540 259823 339237 496209 87503 494641 198166 121997 177831 346867 77202 84780
$$ packed form
13100a55651B15906d8845j1133A18333R4003p6184g8268A28025R1309G1195q208
13089F2987g6797D01446g1127A85690C1753c7455j72382G8663b22361p4285B36457
13077A98675b39746j88230E1250J94607p4761a54277A95660g8449H8028P7145
13067A65173a14922B11654a3466A48371b4391o4003j07502P7898B48235a49486
13056b72034B71031a92231G8908J2381b4149A35547c94666a03466J2034M4860
13046d6572k2279a8955E5938a11778A33863B5656I687L6166P1424L3858D4498
13034D967K96285c17152H7049j6859J03826J30249c5831j7304C29875I773L39767
13023C49540q9717P9414J56972H7503M07138A98166p6169N5834J69036G7202P578
$$ plain form
13012 84780 -63062 406579 25638 138811 -2599 206574 4741 122030 47631 332964 396372
13001 396372 260189 -73971 -86840 217300 -11286 349727 32320 -1937 -167548 34356 171213
12990 171213 -271634 -7579 50605 333205 252588 -51545 -93114 -4480 18646 446839 29181
12978 76792 256426 -77131 165939 75230 -100421 49157 115437 52240 306493 339777 -52860
12966 289857 78169 321414 47234 -123946 28784 -310781 -175442 334462 149859 -3213
12955 60637 341021 157654 361315 159562 -432947 -40986 -297280 -342621 243105 -300598
12944 -220957 -45217 -115659 15203 183795 84230 108531 -115940 3894 26715 -54770 4469
12932 64303 105476 120440 -110255 107033 -134468 148348 103897 42828 49237 -46435 -190403
$$ packed form
13012H4780f3062D06579B5638J13173b599B06574D741J17289D7631K85333O3408
13001C96372j36183g3971j2869B17300a1286C49727C2320a937j65611C4356J36857
12990A71213b71634g579E0605K82600q0617e1545m1569d480A8646M28193B9181
12978G6792J79634g7131A65939G5230a00421D9157O6280E2240K54253L3284e2860
12966B89857G8169K43245D7234a23946B8784c10781J35339C34462A49859c213
12955F0637K80384A57654K03661A59562d32947d0986k56294m5341B43105c00598
12944b20957d5217p0442A5203J68592H4230K4301a15940C894K2821e4770D469
12932F4303M1173J4964a10255A07033a34468A48348m4451D2828O409d6435j43968
$$ plain form
12921 -190403 374271 -87220 -37356 66595 34348 177077 130137 124616 26861 334831 -8712
12909 216782 -342446 -85450 -290489 100645 125363 -238231 455139 154908 275671 224946
12899 224946 169465 134145 -79689 348531 -21006 242508 -80502 156477 -121147 347989
12888 -44998 462335 143843 -76788 9698 -166280 71679 140048 296568 121228 68580 1769
12876 -87041 69674 -48993 -48062 -201911 190430 -29847 -44365 -48671 286002 179261 148275
12865 148275 -181889 -110620 57204 -67293 157831 1269 -95402 -16182 -120195 -71579 29361
12853 -53453 163349 212085 88644 -324857 -267 213611 186663 115611 -318224 -203313 53923
12841 15040 164552 11340 188886 -72899 79994 6549 41373 107087 274599 21740 46362
$$ packed form
12921a90403C74271h7220c7356F6595l2247J42729m6940n521B6861L07970h712
12909B16782c42446h5450k05039A00645K4718b38231D55139A54908J20763n0725
12899B24946n5481l5320g9689C48531b1006B42508h0502A56477a21147C47989
12888d4998D62335A43843g6788I698a66280G1679O8369J56520A21228n2648A769
12876h7041F9674d8993R31j53849A90430b9847j4518m306B86002j06741l0986
12865A48275a81889P1269E7204f7293A57831A269i5402a6182j04013M8616B9361
12853e3453A63349M8736H8644c24857b67B13611k6948p1052c18224J14911E3923
12841A5040J49512A1340J77546g2899G9994F549L4824O5714J67512B1740K4622
$$ plain form
12830 46362 23993 183382 -463917 97843 -105530 233830 -54800 -161217 185290 133718
12820 133718 125829 346864 -81217 -185243 -259033 131188 27450 85578 -17705 138122 70778
12809 70778 -218165 -218699 -25173 188814 112037 -121428 -52907 -96236 128313 7303 -214897
12797 36184 108428 19999 -47382 -40952 -98086 85580 -288722 94804 205944 317697 31558
12785 69708 465685 59301 74942 37594 -220793 155800 -226855 138458 -156162 225348
12774 -20981 96431 66605 -159560 112150 -39517 302237 -140918 148217 -13503 208243
12763 -35530 -43078 2647 62917 -7423 15514 -96434 113179 -236328 -73907 299703 325824 -21324
12750 938 16352 -189877 -166604 -143715 -37872 -70478 168826 -87132 292102 52225 24061
$$ packed form
12830D6362k2369J59389d63917I7843a05530B33830e4800j06417A85290n1572
12820A33718p889K21035h1217j04026p3790A31188B7450N8128a7705A38122o7344
12809G0778b18165n34b5173A88814p6777a21428e2907m3329A28313G303b14897
12797C6184P2244A9999d7382O430n7134H5580b88722I4804J11140J11753C1558
12785F9708L95977E9301J5641l7348b20793A55800b26855A38458a56162B25348
12774b0981I6431k9826a59560A12150c9517C02237a40918A48217a3503B08243
12763c5530p548B647O0270g423A5514i6434A13179b36328g3907B99703K6121b1324
12750I38J5414a89877K3273K2889c7872l2606A68826h7132B92102E2225B4061
$$ plain form
12738 -36513 31593 41264 3787 1703 -101700 -14764 -198502 325709 -42740 -108645 164621
12726 -84005 272226 165371 4114 50163 -215611 -89443 196445 -54855 70783 -139385 -154978
12715 -154978 142967 62069 -386380 155272 114833 228643 -31292 289549 247313 90696
12704 253128 30215 307899 427803 365984 -77981 105650 104865 262266 -243693 80068 59885
12693 59885 241410 192840 -70278 -13238 -60635 -31513 267315 -229851 -4955 -80869 157378
12681 346172 149871 67962 92019 92499 -195033 -28054 -218778 101309 432504 192817 236285
12670 236285 104242 56626 58651 42813 110868 -60578 345403 292382 -231711 57170 -159234
12658 88598 -213715 -25384 191845 296808 245125 216294 -36112 231568 65626 186636 11761
$$ packed form
12738c6513C1593R671C787A703a01700a4764j83738C25709d2740o5905A64621
12726h4005B72226j06855D114M6049b15611h9443A96445e4855G0783a39385j5593
12715a54978A42967F2069c86380A55272m0439J13810c1292B89549m2236I0696
12704B53128C0215K77684J19904o1819g7981A05650p85J57401b43693H0068k0183
12693E9885J81525m8570g0278a3238m7397K9122B67315b29851d955p5914A57378
12681C46172A49871F7962K4057M80a95033b8054j90724A01309L31195A92817M3468
12670B36285A04242m7616K025j5838O8055f0578C45403n3021b31711E7170a59234
12658H8598b13715b5384A91845J04963n1683k8831c6112B31568F5626J21010A1761
$$ plain form
12646 332714 66881 -103273 22541 -125884 -85126 3262 -23388 189056 -12134 -205453 365156
12634 -84427 214007 -122922 -333070 392304 38637 -183139 75095 160808 77306 280412
12624 280412 273083 -17315 259713 160948 -68585 41929 121170 158658 13015 -359179 90119
12612 -277245 -43221 -296555 -229736 39235 54892 228467 6392 -387158 258575 41475 157336
12601 157336 322684 466344 36654 404721 -125368 15582 6217 250573 307368 -30072 -158959
12590 -158959 -312943 143956 -280267 91902 -170927 -222587 151799 46764 185595 -177715
12579 256697 -5551 31119 -203818 70679 416995 35872 114220 224226 -52332 127137 235774
12568 235774 296692 -299263 -447423 -37981 3604 135414 -43940 36269 -64538 -184046 125765
$$ packed form
12646C32714F6881a03273B2541a25884M0758C262b3388A89056a2134j93319C65156
12634h4427B14007a22922k10148C92304C8637a83139G5095Q5713G7306K03106
12624B80412p329a7315B59713r8765f8585D1929P9241L7488A3015c59179I0119
12612b77245d3221k53334O6819C9235J5657J73575F392c87158B58575D1475J15861
12601A57336J65348J43660C6654L68067a25368A5582F217K44356N6795c0072j28887
12590a58959j53984A43956b80267I1902a70927n1660A51799D6764J38831a77715
12579B56697e551C1119b03818G0679L46316C5872P8348J10006e2332A27137J08637
12568B35774O0918b99263j48160c7981C604J31810d3940C6269f4538j19508A25765
$$ plain form
12556 731612 150779 -44073 62553 79075 -24833 -130962 163415 -209301 166741 -3833 -145892
12545 -145892 -301794 -10624 50811 -137683 47371 -125655 -105184 198620 -94100 -181295 -35291
12533 69776 -139131 60777 91841 -91552 169673 -751 156735 -137347 41376 27023 358688
12522 358688 279971 -284158 186700 55298 223533 -9002 -58359 58147 -113617 -44319 66916
12510 222620 -315126 214241 61329 -113716 -65192 64158 217737 228878 -255024 154093
12499 393480 70827 155085 74790 -144968 -141823 161643 -65476 44255 492852 -125835 247675
12487 -40448 -96640 -126860 -150423 -229894 -78649 -85307 -82784 46061 -1669 -182984 -66162 76661
12474 -136798 -192553 72131 261964 142291 -163517 -183113 118147 -172176 -76313 121236
$$ packed form
12556G31612A50779d4073F2553J6522b4833j06129A63415b09301A66741c833j42059
12545a45892j55902a0624E0811a37683D7371a25655K0471A98620i4100q7195c5291
12533F9776a39131F0777L1064i1552A69673g51A56735a37347D1376j4353L31665
12522C58688p8717b84158A86700E5298J68235i002m9357E8147a13617d4319F6916
12510B22620c15126B14241F1329a13716M8524F4158J53579J1141b55024A54093
12499C93480G0827Q4258G4790a44968L145A61643f5476D4255M48597a25835B47675
12487d0448n6192l0220k3563p9471g8649o658K523D6061a669j81315f6162G6661
12474a36798n5755G2131J89833j19673a63517j9596A18147a72176g6313A21236
$$ plain form
12463 90667 51741 15295 -105452 -94621 1503 -347628 -79718 10898 179604 -14094 405 235440
12451 235440 269872 29549 9513 -19589 -217876 48859 -135476 264747 -43883 205536 -52172
12439 -111417 146411 21027 -11584 17466 -64097 -166061 -22970 -99102 40333 -84435 583332
12427 -171295 91120 199487 131246 24697 -290293 117391 -102437 38734 -62422 -127580 -51598
12415 -155475 -8276 277723 446449 243889 351198 216720 -337581 -34717 219189 -88056
12404 -162057 245583 -104868 -213248 -348677 108092 76308 -119043 167108 38674 99590
12394 99590 117254 80785 -27353 307905 293735 200895 -195918 160358 -27088 -249745 -160365
12383 -160365 141861 193942 150611 -168708 69397 241422 44813 -145499 175993 -24779
$$ packed form
12463I0667l8926A5295a05452J0831A503c47628g9718A0898J68706a4094D05K35035
12451B35440L4432B9549I513a9589j98287D8859a35476B64747d3883B05536e2172
12439a11417A46411B1027a1584A7466f4097j01964b2970p6132D0333h4435E83332
12427a71295I1120J08367o8241B4697b90293A17391a02437C8734f2422o5158e1598
12415a55475h276B77723J68726k02560J07309j34478c37581c4717B19189h8056
12404a62057B45583a04868j08380j35429A08092l1784a19043A67108C8674O0916
12394I9590J7664l6469b7353C07905j4170r2840a95918A60358b7088k22657Q9380
12383a60365A41861N2081m3331a68708F9397J72025D4813a45499A75993b4779
$$ plain form
12372 -139786 -135171 195993 190095 -61485 -181047 163981 -314643 -137900 -76368 -302040 -139306
12360 9499 227398 59401 120887 -37673 24362 25441 88209 145168 -81115 150668 125553 -199856
12347 236158 159034 -220987 218704 -135130 9378 -190595 108895 -9175 -36467 43610 101822
12336 101822 -39088 -387170 95842 103515 -59845 -9942 -127673 143819 102561 41782 112551
12325 112551 -270612 486747 266408 17929 -128903 148699 172976 133536 -109675 -50072
12314 -240455 -93131 -626 -80478 -24279 -40745 -370138 89527 -77500 -78076 106399 107519 25142
12301 -12695 -29784 194577 -138895 32590 91001 -175063 -325515 242869 -188718 182323
12290 -36937 37044 212029 132934 5262 -75037 341563 -140722 -276241 -197296 2001 -21250
$$ packed form
12372a39786M615A95993n898f1485j19562A63981c14643a37900O1532k25672a39306
12360I499K17899E9401O1486c7673B4362J079O2768N6959h1115A50668k5115a99856
12347B36158p7124b20987B18704a35130I378a90595A08895i175k7292D3610N8212
12336A01822c9088l48082I5842P673e9845i942j17731A43819m1258D1782P0769
12325A12551b70612D86747k20339A7929a28903A48699K4277l9440a09675e0072
12314b40455i3131f26p9852b4279j6466l29393H9527g7500n76A06399J120B5142
12301a2695j7089A94577a38895C2590N8411a75063j50452B42869a88718A82323
12290c6937C7044J74985p9095E262g5037C41563a40722j35519P8945B001b1250
$$ plain form
12278 -246220 -45955 239492 34420 412890 350197 -28070 469929 249287 -271849 87903
12267 312903 -127675 303049 90672 152030 153192 153928 -119387 161118 -89246 113775 284641
12256 284641 385488 1290 -239256 246317 -22050 202432 277012 103100 45030 -194012
12245 251925 19106 -64476 -74819 112703 34606 -13059 157039 65829 -69169 140025 -143252
12233 -116130 203103 173973 -78505 -35847 -185817 311231 -49865 118734 88950 -279985
12222 185777 140772 58625 218291 4993 184930 6137 -187701 75957 119170 476277 142169
12210 118269 245597 111255 275957 63494 422697 342171 194371 -218961 204027 375193
12200 375193 193865 -16525 26700 404169 178566 -10986 201 342038 263178 -48589 -21707
$$ packed form
12278b46220d5955B39492C4420L78470o2693b8070D69929k20642b71849H7903
12267C12903a27675C03049I0672O1358J162P36a19387A61118h9246A13775J70866
12256B84641J00847A290b39256B46317b2050B02432P4580A03100D5030a94012
12245B51925A9106f4476j0343A12703C4606a3059A57039F5829f9169A40025a43252
12233a16130B03103k9130g8505c5847j49970C11231d9865A18734k9784b79985
12222A85777m5005E8625J59666D993J79937F137a87701G5957M3213L57107A42169
12210A18269J27328A11255J64702F3494L59203q0526j47800b18961B04027J71166
12200C75193j81328a6525B6700L77469A78566a0986B01L41837p8860d8589b1707
$$ plain form
12188 230489 205278 200151 368692 123423 220282 67264 55170 -130290 -197226 -118987 126521
12176 -196779 73087 -9338 235275 -171169 -136662 343876 -227493 -42271 77362 39213 242198
12165 242198 -106700 61431 221446 -132038 42194 510575 169844 194306 63640 -156915
12154 89093 588070 79283 123599 -67652 194311 368092 -66193 -231728 -25926 26593 -27569
12142 -165293 -153355 -80795 -57334 48007 -76210 -96354 -167719 -50105 7902 -202357 164781
12130 31320 349751 6495 -106921 -159879 -82341 295046 -14484 -78939 154392 -5203 -109641
12119 -109641 139315 13311 70733 -77598 288837 56843 95482 550573 -136144 103601
12108 44435 -29926 -203861 -66873 229121 117645 143603 -201857 268637 -26151 69202 515817
$$ packed form
12188B30489k5211n127J68541A23423R6859F7264j2094a30290o6936P8239A26521
12176a96779G3087i338B35275a71169L4507C43876b27493d2271G7362l8149K02985
12165B42198a06700F1431J60015a32038D2194M68381A69844K4462F3640a56915
12154H9093M98977G9283M4316f7652A94311J73781f6193j65535b5926B6593b7569
12142a65293J1938P2560K3461D8007g6210k0144p1365e0105G902b02357A64781
12130C1320L18431F495a06921n2958P7538B95046a4484o4455A54392e203j04438
12119a09641A39315A3311N7422g7598B88837E6843L8639M55091a36144A03601
12108D4435b9926j73935f6873B29121j11476K5958b01857B68637b6151F9202M46615
$$ plain form
12097 515817 -40986 32301 -31181 61293 -282702 154366 131017 243506 -31355 -6703 -285098
12086 -285098 86168 1229 -65234 -3500 89213 17311 258741 151298 190221 662671 1091867
12075 1091867 1926875 425620 53783 78426 -34158 150780 206524 -14172 236562 -174627
12064 178304 33588 141562 247381 235558 -102700 -110967 166611 124615 345880 84913 -69969
12052 -43341 147061 115496 37796 27164 -9048 -118485 164867 100441 27576 -218261 11915
12040 138004 -309570 87400 -270012 -378884 -194154 26180 50046 -286863 231134 -5082
12029 138264 161776 85067 -138050 -224237 73905 75830 -31713 84984 27130 38226 52643
12018 52643 -94644 -108070 -197268 71737 -172049 42083 327363 281121 19784 121961 125234
$$ packed form
12097E15817d0986C2301c1181F1293b82702A54366k3349J12489c1355f703k78395
12086b85098H6168A229f5234c500H9213A7311K41430j07443L8923M72450M29196
12075A091867Q35008D25620E3783K4643c4158A50780N5744a4172B36562a74627
12064A78304C3588J07974J05819j1823a02700q267A66611m1996K21265H4913f9969
12052d3341A47061l1565C7796j0632i048j09437A64867o4426B7576b18261A1915
12040A38004c09570H7400b70012j08872J84730B6180K3866b86863B31134e082
12029A38264K3512p6709a38050q6187G3905J925c1713H4984B7130J1096J4417
12018E2643i4644j3426q9198G1737a72049D2083K85280m6242A9784J02177L273
$$ plain form
12007 125234 139908 21346 -283799 318629 185062 -129167 -311830 239564 128279 195518
11997 195518 -93626 -137690 108715 42364 -205736 -68908 122989 68497 -23475 -133774 70394
11985 -103747 184769 126405 -152139 -4933 197314 207531 -128706 8061 -99732 -24951 -230612
11974 -230612 -286248 190269 -83826 -163489 -120839 -78073 -216683 -102973 -269489 55283 204932
11963 204932 -13179 -117163 -117452 -409674 -64865 -109024 23825 -107383 -208606 -317671 170963
11951 130112 71438 64511 -127280 -80678 312968 36035 37706 -130291 -163843 184924 138960
11940 138960 -89635 103976 -432870 -288006 -112468 178356 133944 58596 191287 181290
11930 181290 -121391 -69801 -86353 -258036 -194650 -71758 18993 169617 83782 -154187 -36329
$$ packed form
12007A25234J4674B1346b83799C18629j33567a29167j82663B39564j11285O7239
11997A95518i3626m4064A08715D2364b05736f8908A22989n4492b3475j10299G0394
11985a03747A84769n8364a52139d933A97314J0217a28706H061i9732b4951k05661
11974b30612n5636A90269h3826p9663M2650M2766j38610a02973j66516E5283J49649
11963B04932a3179j03984k89k92222f4865m4159B3825a07383j01223j09065A70963
11951A30112n8674o927a27280M6602C12968C6035J671a30291l3552A84924m5964
11940A38960h9635A03976d32870J44864a12468A78356m4412E8596J32691r997
11930A81290a21391N1590j6552j71683O3386g1758A8993J50624H3782a54187c6329
$$ plain form
11918 -60472 -260169 -172461 111236 139654 -95932 -60200 252486 170896 -124895 45534 7959
11906 -262310 -108904 -179977 -177895 185086 7207 -296010 88486 1879 -232963 -158478 -85364
11895 -85364 -33180 -66575 -44348 71185 183682 227920 -236672 69413 -167438 -149288 180552
11883 213904 208934 -17853 110541 -341458 -225119 59283 138522 -184541 123704 192337 -34332
11871 155974 -23642 -100856 -255178 59037 -256885 83349 -134956 -78579 71173 -78802 -382799
11860 -382799 140481 -182940 -121516 -238069 -363560 138059 -167243 26225 390147 4262
11849 -246997 -90242 65344 -172436 -7688 -100022 -33593 -211968 28211 -76635 -320514 42990
11837 127602 -108650 -153573 88801 -132977 -24462 -81807 29015 -325675 -82175 -11906 -294888
$$ packed form
11918f0472j99697Q7708A11236K8418i5932L5732B52486q1590a24895D5534G959
11906b62310a08904p1073K082A85086G207b96010H8486A879b32963P4485P3114
11895h5364c3180l3395K2227G1185J12497M4238b36672F9413a67438J8150A80552
11883B13904m970a7853A10541c41458J16339E9283P9239a84541A23704O8633c4332
11871A55974b3642p7214j54322E9037b56885H3349a34956N6377G1173g8802l03997
11860c82799A40481a82940O1424j16553j25491A38059a67243B6225L63922D262
11849b46997i0242F5344a72436g688r2334c3593j78375B8211g6635k43879D2990
11837A27602a08650m4923H8801a32977b4462n7345B9015c25675h2175a1906k82982
$$ plain form
11826 -294888 30726 177713 -13094 10118 -136929 -46914 -224639 -193701 -3081 -5543 -179680
11815 -179680 -176593 -17148 -141672 334960 -52613 124961 122546 -203049 24195 2690 -104176
11803 107863 18103 99179 -214331 1030 -114972 -81935 46361 16933 -292304 -179846 -501531
11792 -501531 -284164 41215 -119515 288684 -66483 -113306 223973 132497 -45395 31817 -76282
11780 -58855 43738 -132647 -216130 -242673 242997 7015 -42269 217564 -122612 22409 -214168
11768 -125343 48226 -103150 -488063 -200410 -36644 -16902 190353 115910 -302385 142412
11757 -149351 12967 -78486 168022 69310 -232088 5223 -6108 -141958 -41826 171981 -84362
11745 -26805 87433 -112630 16175 -70365 303500 -81561 45602 -205770 53399 111818 -56185
$$ packed form
11826b94888C0726J46987a3094A0118a36929d6914j77725L0938c081k462j74137
11815a79680L087a7148j24524C34960e2613A24961k415b03049B4195B690a04176
11803A07863A8103Q1076b14331A030a14972L3037D6361A6933b92304J12458l21685
11792e01531K17367D1215a19515B88684f6483m6823B23973r1476d5395C1817g6282
11780e8855D3738a32647q3483k6543B42997G015d2269B17564a22612B2409b14168
11768a25343D8226a03150l84913b00410c6644a6902A90353p4443c02385A42412
11757a49351A2967g8486A68022F9310b32088E223f108j35850d1826A71981h4362
11745b6805H7433a12630A6175g0365C03500h1561D5602b05770E3399N8419e6185
$$ plain form
11733 379961 130657 146716 -139090 411290 -187290 159498 71881 -298314 -195227 -32954
11722 84164 19314 -37478 128593 -124744 201987 314610 11162 237914 -324159 288881
11711 -83378 -272822 115957 -53891 -104066 86667 -83613 -120756 68205 -109397 175498 40947
11699 -133966 101207 261750 65903 12786 -137159 156880 -85846 257568 72755 -105226
11688 -4765 161599 81107 -101159 1834 165528 -131272 22772 210673 145057 147434 -4994
11676 124060 22303 291685 -66793 -92292 83146 114920 -40366 35118 -144516 147368 269267
11665 269267 324934 172597 269101 428427 38608 -225844 -62329 -148490 357444 -78103 218392
11653 7276 -106410 -34808 -116142 126922 -312484 -154001 83685 -16206 -15344 68234 -130246
$$ packed form
11733C79961A30657J6059a39090D11290a87290A59498G1881b98314J03087c2954
11722H4164A9314c7478A28593a24744B01987J12623A1162K26752c24159B88881
11711h3378j89444A15957e3891n0175H6667h3613l7143F8205a09397A75498D0947
11699a33966A01207J60543F5903A2786a37159A56880h5846B57568G2755a05226
11688d765A61599q0492a01159A834J63694a31272B2772J87901o5616K377d994
11676A24060B2303K69382f6793k5499H3146L1774d0366C5118a44516A47368J21899
11665B69267N5667j52337R6504J59326C8608b25844f2329q6161C57444g8103B18392
11653G276a06410c4808q1334A26922c12484a54001H3685a6206Q62F8234a30246
$$ plain form
11641 -224367 -261152 103955 -110457 -85516 7567 -9135 244778 -85056 137864 203147 246573
11630 246573 -77191 24947 89408 -30063 22885 119036 312973 100496 -3908 298968 193667
11619 193667 -251656 424809 -85758 126286 -69966 -32085 -373695 -345220 350569 21708
11608 27143 -327047 -97467 61187 -62916 56193 39299 216619 -21942 137895 -177222 -175103
11597 -175103 -147340 -45562 300530 -67710 -138305 334338 -90574 18807 234325 150566 283669
11586 283669 -219623 227261 150798 -41231 -70487 101214 256995 -371325 167140 -102233
11575 329597 -112011 248362 30649 -85460 -360267 123824 -201743 -44009 -176043 206646
11564 156901 257242 -123502 -128530 173666 -54617 -155981 -200662 198069 -201304 84072
$$ packed form
11641b24367l6785A03955a10457K4941G567i135B44778h5056A37864O5283M3426
11630B46573g7191B4947O4461c0063B2885R6151J93937A00496c908B98968j05301
11619A93667b51656D24809h5758A26286f9966c2085l41610K8475C50569B1708
11608B7143c27047i7467F1187f2916E6193j6894J77320b1942A37895a77222K119
11597a75103K7763d5562C00530f7710p0595C34338i0574A8807K15518q3759J33103
11586B83669b19623B27261p6463d1231k9256A01214J55781c71325A67140a02233
11575C29597a12011B48362C0649h5460k74807A23824b01743d4009j32034B06646
11564A56901J00341a23502n028A73666e4617j01364m4681A98069b01304H4072
$$ plain form
11553 109800 -203614 136905 -187000 129667 178201 -250413 10631 215820 87569 205195
11543 205195 162424 95268 -213968 135625 244041 -59688 -139425 38799 -89474 180962 -70609
11531 70731 -296107 178390 79163 34658 143516 -32035 -81204 36298 211513 169946 22304
11519 175106 -65278 -2700 -216612 -20103 224683 97269 125687 -104987 139289 334946 -260323
11507 -20725 331718 616 124605 192250 92015 -70108 -264268 -159772 7145 -134137 18833
11495 206611 228700 92179 127775 35425 30631 -70970 103554 -197883 97680 606632 172425
11483 155969 400629 172092 260859 -173005 511049 401676 -44685 305303 -49411 55380
11472 -155300 142121 37676 215812 112735 -39136 -88692 -16946 160271 290827 -103557
$$ packed form
11553A09800b03614A36905a87000A29667M8534b50413A0631K05189H7569J17626
11543B05195m2771o7156b13968A35625J08416e9688p9737C8799h9474A80962g0609
11531G0731b96107A78390G9163C4658J08858c2035m9169C6298J75215m1567B2304
11519A75106f5278b700k13912b0103B24683I7269K8418a04987A39289J95657b60323
11507b0725C31718F16J23989O7645I2015g0108j94160J04496G145a34137A8833
11495B06611K2089I2179L5596C5425m794g0970A03554a97883I7680N08952A72425
11483A55969K44660A72092Q8767a73005E11049j09373d4685C05303d9411E5380
11472a55300A42121C7676J78136j03077c9136m9556a6946A60271J30556a03557
$$ plain form
11461 -98937 51406 -7092 315496 -165016 17739 2580 -115541 170719 -439314 221320 -100123
11449 519955 -63704 241860 4849 235053 122646 -126318 247309 435655 -125471 227198
11438 233267 175092 190341 339910 -4939 356996 96089 50929 79420 147424 30532 -145895
11426 85008 89624 57237 -171653 -75328 -152532 -22108 151293 -200550 -168098 160777 155122
11415 155122 -216102 254741 98537 -2241 -187961 153576 109097 -205357 87826 306 -193310
11403 150966 55691 -59130 -3122 -147387 58500 -170342 240039 41193 -92740 114351 -144095
11391 115365 -145682 933 -41930 -4857 80798 92518 185628 232325 207317 -103277 222378
11379 -154854 -122536 263023 -43354 27563 -55442 -46818 165370 193372 -297069 -40776 132121
$$ packed form
11461i8937E1406g092C15496a65016A7739B580a15541A70719d39314B21320a00123
11449E19955f3704B41860D849K30204j12407a26318B47309J88346a25471B27198
11438B33267n8175J5249J49569d939C56996I6089m5160K8491O8004C0532a45895
11426H5008M616l2387a71653g5328p7204b2108A51293b00550L2452A60777n655
11415A55122b16102B54741I8537b241j85720A53576m4479b05357H7826C06a93310
11403A50966E5691e9130c122j44265E8500a70342B40039D1193i2740A14351a44095
11391A15365a45682I33d1930d857H0798J1720R3110M6697k5008a03277B22378
11379a54854L2318B63023d3354B7563e5442Q624A65370K8002b97069d0776A32121
$$ plain form
11367 -139285 -105932 192668 -245753 311054 57368 33508 -21120 103959 248697 -73098
11356 -235426 -250656 -214546 -216165 -90548 64048 -29112 74696 198780 -246509 -246042 -196149 298672
11343 -82949 -156925 -99405 -148397 58685 318774 95520 21742 299339 145135 78136 -328812
11331 46049 -210470 188502 5638 254293 -257462 84146 480462 117676 46020 -87189 39040
11319 -187674 -77073 101378 375349 -411404 -89404 129137 -6956 -111885 119953 35251
11308 -403808 -486405 66122 87994 4712 -53822 -211594 -233713 -361165 148061 27202 -210720
11296 -175601 -224650 -102419 -134640 63727 132937 14262 29824 72894 -46637 -86164 135566
11284 18953 -18470 274502 -268251 -19197 -237314 -11564 -2420 -160186 -411265 -71837 69903
$$ packed form
11367a39285L3353A92668b45753C11054E7368k3860b1120A03959J44738g3098
11356b35426j5230L6110j619i0548F4048b9112G4696J24084b46509M67M9893B98672
11343h2949p3976N7520m8992E8685K60089I5520B1742K77597A45135o6999c28812
11331D6049b10470A88502E638K48655b57462H4146L96316A17676D6020h7189C9040
11319a87674g7073A01378K73971d11404h9404A29137f956j04929A19953C5251
11308d03808q2597F6122K1872D712e3822j57772k2119j27452A48061B7202b10720
11296a75601m9049a02419l2221F3727O9210A4262J5562M3070d6637l9527A35566
11284A8953a8470B74502b68251a9197k18117a1564b420j57766k51079g1837F9903
$$ plain form
11272 -132487 55155 -67182 335737 -203384 69809 299354 -179298 158643 -103738 -112685
11262 -112685 103879 56205 139920 154445 -376695 177485 4826 -201498 1341 -90744 131809
11250 172132 -168666 -174998 17366 -3824 -145741 -199312 181402 -71363 -179886 275334 -147790
11238 -339907 -32394 -205972 -191630 88201 -284471 223845 39452 43787 265656 -88896 -101366
11227 -101366 40025 -13336 -329281 -137196 -541415 -287352 445566 263224 -4040 217005
11216 -296200 109193 -139428 -258344 68589 -291509 22369 -30976 -146229 -82828 457693
11205 -36980 -16714 -92025 -101940 16750 -316236 -227278 -351443 79595 -349264 25354 -90961
11193 189595 7996 140255 5184 -105808 -88292 -383211 65377 -32585 36055 -254236 -169148
$$ packed form
11272a32487E5155f7182C35737b03384F9809K29545a79298A58643a03738q947
11262a12685A03879m7674Q3715J4525c76695A77485D826b01498A341i0744A31809
11250A72132a68666o332A7366c824j41917n3571A81402g1363j08523B75334a47790
11238c39907c2394j73578J4342H8201b84471B23845C9452M335K21869h8896j2470
11227a01366D0025a3336l15945a37196m04219K54063D45566j82342d040B17005
11216b96200A09193a39428j18916F8589b91509B2369c0976j15253O3401D57693
11205c6980a6714p5311r915A6750c16236Q8958j24165G9595c49264B5354i0961
11193A89595G996J32259E184a05808J7516k94919F5377c2585C6055b54236Q5088
$$ plain form
11182 -169148 55775 -162347 -173616 14191 44798 -508033 -157994 -262965 -184832 152532
11171 65125 -60671 181833 -250236 85364 13412 -97120 -404000 -172774 -218225 160198 -87950
11159 321150 146241 1889 -222771 250888 109168 446955 93486 85009 127941 155802 -381039
11147 81399 -163019 -145303 -201541 206865 117618 -65671 -114253 -120305 199444 88239 -91297
11135 -27586 -70639 278098 -353959 -20670 223140 148900 90951 73978 219472 -225167 -93551
11123 107188 253194 31827 -185563 96360 -154739 22142 -216242 -75080 89039 1699 -19113
11111 189236 -146648 11193 -223213 199464 -126783 -172912 87837 -335686 203951 80899
11100 66144 411226 108273 385413 72229 -27460 92789 677314 257973 227084 218345 -202452
$$ packed form
11182a69148E5775a62347j1269A4191L0607e08033a57994j04971P8133A52532
11171F5125f0671A81833b50236H5364A3412i7120l06880a72774m5451A60198h7950
11159C21150A46241A889b22771B50888A09168L37787I3486q477M2932K7861c81039
11147H1399a63019J7716n6238B06865q9247f5671m8582o052A99444H8239i1297
11135b7586m3053B78098c53959b0670B23140p4240n7949j6973J45494b25167i3551
11123A07188J46006C1827a85563I6360a54739B2142b16242g5080H9039A699a9113
11111A89236a46648A1193b23213A99464a26783m6129H7837c35686B03951H0899
11100F6144L45082A08273K77140G2229b7460I2789N84525B57973l0889q739b02452
$$ plain form
11088 -160278 295604 -26169 238718 294847 162462 -134211 223447 -78902 271347 263397
11078 263397 269874 98102 176081 163302 107689 -57076 70414 204507 295950 226112 106514
11066 548822 314952 94126 353968 499814 239710 390583 479058 226004 705990 294895
11055 463658 239494 670384 664311 556474 488043 518948 759991 623907 602655 537402 775996
11044 775996 600248 607708 929391 672815 863354 380127 543990 742267 506092 926036
11034 926036 574687 319160 429348 371551 269436 538414 582765 223731 518569 278631
11024 278631 712540 829069 559393 475682 374761 453975 719412 286826 645152 739529
11014 739529 286881 275942 444463 603035 688250 582566 636620 340539 778291 371086
$$ packed form
11088a60278B95604b6169B38718N6129j32385a34211B23447g8902B71347p950
11078B63397O477I8102P7979j2779n5613e7076G0414J34093R1443o9838A06514
11066E48822k33870I4126K59842J45846B39710J50873Q8475B26004M79986B94895
11055D63658k24164M30890o073j07837o8431L0905K41043j36084k1252o5253K38594
11044G75996j75748P460L21683k56576J90539C80127J63863J98277k36175M19944
11034I26036l51349k55527J10188n7797j02115K68978M4351B23731K94838k39938
11024B78631M33909J16529k69676q3711j00921P9214K65437B86826L58326R4377
11014G39529B86881j0939J68521J58572Q5215j05684N4054k96081M37752C71086
$$ plain form
11003 495842 446465 59519 575392 504948 485961 280272 741196 329250 433568 705295
10993 705295 846223 159476 712419 683000 437270 592660 799193 731816 958672 507860
10983 507860 947498 1079304 943686 819200 950404 1437339 1383321 1433648 1791021 1595590
10973 1595590 2206959 2202289 2483551 2113385 2051835 1957611 1804412 1767204 1583421 1607415
10963 1607415 1537398 1363366 1287292 1285645 1402126 1365846 1483493 1380818 1436754 1255444
10953 1255444 1251508 805325 499164 774958 710768 379440 374587 422740 307098 617489
10943 617489 491033 157527 112282 -127669 74392 74412 181850 -41666 -50303 186505 -10324
10931 932 51274 733 -1537 64787 177385 443211 59727 -35802 197396 -185154 214452 -8208
$$ packed form
11003D95842m9377E9519N15873p0444j8987k05689M60924C29250J04318K71727
10993G05295J40928A59476N52943k9419k45730J55390K06533o7377K26856m50812
10983E07860M39638J31806j35618j24486J31204M86935n4018N0327L57373j95431
10973A595590O11369m670K81262l70166o1550r4224j53199l7208j83783K3994
10963A607415p0017j74032p6074j647J16481l6280J17647j02675N5936j81310
10953A255444l936m46183l06161K75794o4190l31328m853M8153j15642L10391
10943F17489j26456A57527m5245a27669G4392K0J07438d1666q637A86505a0324
10931I32N0342G33a537F4787J12598K65826E9727c5802A97396a85154B14452h208
$$ plain form
10918 43883 -206245 225076 -46494 -63335 5500 55914 262839 11797 129249 -76862 -220765
10907 -220765 -110774 81498 -27844 -28885 67417 106101 137843 -334023 -178378 -91153 -184221
10896 -184221 -83005 58325 -90877 -40704 -21218 -48970 -94456 -185781 -134678 -330946 -79158
10884 80707 9425 -431450 -52321 31457 -56325 69790 -297051 97227 -171254 -72358 399887
10872 80501 -110033 -92150 128217 107372 -19465 166923 -69960 140325 94021 -106477 208576
10860 52684 50327 -42022 -43473 147040 -55288 88458 138870 193015 -46098 277029 -106299
10848 -393758 -383389 148179 47274 -61113 41768 37140 148272 -210756 -34088 -12590 200261
10836 234454 -80884 391677 -81573 51529 57001 33686 -13730 -63135 -69037 -294668 285583
$$ packed form
10918D3883b06245B25076d6494j6841E500N0414K06925A1797J17452g6862j43903
10907b20765J09991H1498b7844j041F7417L8684L1742c34023J55645Q7225r3068
10896a84221h3005E8325i0877d0704J9486k7752m5486r1325N1103j96268g9158
10884H0707I425d31450e2321C1457e6325F9790b97051I7227a71254g2358C99887
10872H0501a10033J7883A28217k0845a9465A66923f9960A40325m6304a06477B08576
10860E2684k357d2022j451A47040e5288H8458N0412N4145d6098B77029a06299
10848c93758J0369A48179D7274f1113D1768m628J11132b10756c4088a2590B00261
10836B34454h0884C91677h1573E1529N472k3315a3730m9405n902k25631B85583
$$ plain form
10824 -156818 -230979 50795 220467 -314408 -225441 -178446 248862 104335 79714 -177873
10813 48577 -218678 -38002 78027 -96971 -165968 -186384 -347276 33433 -45371 -228103 -44198
10801 -64306 -101694 126953 -175471 9060 -56803 57488 132527 -33083 137241 -111718 -122660
10790 -122660 305 16463 -285104 -267973 -213738 -61762 59762 -9460 -11924 148440 -233667 63235
10777 -83745 277011 -372119 7025 -177175 260872 -175703 -89858 -118322 42543 -5675 -100065
10766 -100065 74768 -81495 -231503 116120 -106720 -65232 -84894 141057 -115869 -150633
10756 -150633 189819 110945 -116194 -29536 -190822 -55906 -95515 103136 -27732 -124879 271520
10744 145053 6908 292772 67751 157965 -103607 125875 -184333 -154966 278777 244425 95770
$$ packed form
10824a56818p4161E0795J69672c14408Q8967M6995B48862A04335k4621a77873
10813D8577b18678c8002G8027i6971o8997k0416j60892C3433d5371j82732d4198
10801f4306l7388A26953a75471I060e6803E7488P5039c3083A37241a11718j0942
10790a22660C05J6158b85104J7131N4235f1762E9762i460k464A48440b33667F3235
10777h3745B77011c72119G025a77175B60872a75703Q5845k8464D2543e675r4390
10766a00065G4768h1495j50008A16120a06720M1488j9662A41057a15869l4764
10756a50633A89819p8874a16194b9536j61286e5906l9609A03136b7732r7147B71520
10744A45053F908K85864F7751R0214a03607A25875a84333K9367B78777l4352I5770
$$ plain form
10732 -197001 -95754 -24432 52634 -75074 -346460 -222950 -175514 -293587 -9888 3970 3838 172703
10720 172703 -199586 -141984 -65658 -179956 -319469 -83816 -39306 41503 29584 -81443 -36966
10708 -237127 -63368 -65239 -53141 -72755 -352879 20570 -358787 7515 -174279 -38376 157126
10696 3386 -55324 71009 -80685 -402437 130397 132631 158310 523864 -55376 -1865 25748 24325
10684 24325 -91446 166939 157950 58306 267013 -190001 -448080 -133080 25520 -136342 67332
10672 119961 -78906 169753 -220127 -165966 24379 -45355 13693 -85231 134584 69886 143996
10661 143996 -235070 -305028 -279176 -381300 146906 -181573 -247131 -14423 40359 -217994
10650 213700 160151 143887 -63303 2378 257513 -136620 -422508 -64520 -45925 -204846 163736
$$ packed form
10732a97001i5754b4432E2634g5074k71386J23510M7436j18073i888C970j32J68865
10720A72703a99586N7602f5658j14298j39513h3816c9306D1503j1919h1443c6966
10708b37127f3368j871J2098j9614k80124B0570c58787G515a74279c8376A57126
10696C386e5324G1009h0685l21752A30397K234K5679L65554e5376a865B5748j423
10684B4325i1446A66939q989E8306K08707a90001k58079a33080B5520a36342F7332
10672A19961g8906A69753b20127N4161B4379d5355A3693h5231A34584o4698P4110
10661A43996b35070o9958K5852j02124A46906a81573o5558a4423D0359b17994
10650B13700n3549j6264f3303B378K55135a36620k85888f4520J8595j58921A63736
$$ plain form
10638 -117209 -122003 43891 -234350 -372549 -95441 21217 -396328 29328 -59989 145267 -191799
10626 -83098 31336 -101149 87532 277990 -202309 262714 -59613 83831 -58388 -150614 60224
10614 -242332 3524 -210657 170522 -43454 -154138 -73089 -226242 282329 286670 -361270 -197081
10603 -197081 122671 -13594 69687 -243879 88415 -54918 -249513 19223 237665 -300443
10592 -18790 -125608 255948 -253359 -164833 131507 -206732 -100566 -38335 19246 -497716
10581 66919 -202188 -82027 61726 -90564 307202 136663 -193454 -373469 305725 -79183
10570 9215 -73233 120073 -119962 422898 -81579 40141 -169199 65448 -142259 160266 -188120
10558 135828 -9785 360688 -43427 147412 24917 -19489 -228696 145949 130523 119113 -298439
$$ packed form
10638a17209m794D3891b34350j38199i5441B1217c96328B9328e9989A45267a91799
10626h3098C1336a01149H7532J90458b02309B62714e9613H3831e8388r2226F0224
10614b42332C524b10657A70522d3454j10684g3089j53153B82329M341c61270J64189
10603a97081A22671a3594F9687b43879H8415e4918j94595A9223K18442c00443
10592a8790j06818B55948b53359Q8526A31507b06732a00566c8335A9246d97716
10581F6919b02188h2027F1726i0564C07202A36663a93454j80015C05725g9183
10570I215g3233A20073a19962D22898h1579D0141a69199F5448a42259A60266a88120
10558A35828i785C60688d3427A47412B4917a9489k09207A45949j5426j1410b98439
$$ plain form
10546 39326 12700 389085 -117819 -102259 177572 -315533 -66874 -89997 -99247 -5636 -199280
10535 -199280 -1270 -104133 -185331 -189426 -374418 -208811 -24159 -31179 12688 -282683 -210219
10524 -210219 -159284 120402 -100653 302078 -183248 -83673 88002 -79181 124466 118379 -325169
10512 -127506 -227344 -21895 -42882 15458 43153 22191 -30802 48711 -2480 -30765 49054 64492
10500 64492 184992 -65839 -225463 126631 57680 81274 199544 -53303 155429 164543 70417
10488 -113853 -98605 -28482 -54621 -337279 222563 83357 63852 393447 306505 253730 94074
10476 -8373 152413 -48555 -6903 146903 91077 -192559 -100666 260851 91375 -391987 57487
10464 -206011 -220741 -320027 133073 -13839 53677 66738 56266 -166662 -156349 -134243 208072
$$ packed form
10546C9326A2700L76385a17819J5560A77572c15533f6874k3123r250e636j93644
10535a99280a270j02863q1198m095j84992J65607b4159p020A2688b82683P2464
10524b10219N0935A20402a00653C02078a83248h3673H8002g9181A24466o087c25169
10512a27506r9838b1895k0987A5458K7695k0962c0802D8711b480k8285D9054J5438
10500F4492J20500f5839j59624A26631E7680K3594J18270e3303A55429R114G0417
10488a13853J5248b8482k6139k82658B22563H3357j9505L29595q6942n2775I4074
10476h373A52413d8555f903A46903n5826a92559R1893B60851I1375c91987E7487
10464b06011j4730r9286A33073a3839E3677J3061j0472a66662J0313K2106B08072
$$ plain form
10452 -123938 -71817 -192264 41945 -43347 -171637 -243120 -358434 15890 117948 75988 -113848
10440 -140071 -158136 33203 188905 243525 -197165 -61101 60264 176048 -72463 -180848 -266480
10429 -266480 21947 -181126 94648 -17787 -75854 -174425 -150690 -271150 -282960 -119865 130022
10417 12819 262574 403980 167692 507903 42201 223421 297285 48466 53394 -233987 396678
10405 114984 -39132 76041 188833 168048 33671 -60790 171063 46624 -43424 -6381 150224
10393 423285 -50277 168487 54597 36678 383205 186659 -5208 164810 -9634 227054 -59945
10381 -5116 24357 21444 -207272 -129070 218923 257986 77270 265199 57534 199072 -326881
10369 203476 263112 284242 352868 277512 409640 638146 577569 4065 236886 113623 228949
$$ packed form
10452a23938N2121j20447D1945d3347j28290p1483j15314A5890J02058m1960a13848
10440a40071j8065C3203J55702N4620a97165f1101F0264J15784g2463j08385q5632
10429b66480B1947a81126I4648a7787n8067r8571K3735j20460j1810a19865A30022
10417A2819K49755J41406A67692L40211D2201J81220P3864D8466M928b33987C96678
10405A14984c9132G6041J12792k0785C3671f0790A71063D6624d3424f381A50224
10393D23285e0277A68487E4597j7919L46527A86659e208A64810i634B27054e9945
10381e116B4357k913b07272P8202B18923L9063G7270J87929E7534J41538c26881
10369B03476N9636K1130O8626p5356J32128K28506o0577D065K32821A13623J15326
$$ plain form
10358 228949 641013 155761 286992 131670 206061 292806 405215 467125 70805 499532
10348 499532 -78998 407052 313502 579673 306975 257504 21327 -26696 158045 321355
10338 321355 114521 -301046 152089 -26235 -186636 240442 96470 24327 105464 110930 -97271
10326 -60336 -126916 -132021 242448 250370 315151 263994 439266 145802 90241 484704 -174360
10314 221628 -42999 -5240 7635 52291 -416024 318791 -254710 48442 151084 -106128 5208
10302 33463 326700 -248560 30651 174439 152156 22470 -5486 -156679 -207357 -231404 -118688
10291 -118688 87513 -63056 -260101 -82735 -29778 17292 -258992 156548 100998 -60339 -238166
10280 -238166 -348874 -222478 -112245 -439743 -517530 -259832 -158243 7113 239071 51925
$$ packed form
10358B28949M12064A55761J31231A31670P4391Q6745J12409O1910G0805M28727
10348D99532g8998D07052r3550K66171k72698m9471B1327b6696A58045J63310
10338C21355A14521c01046A52089b6235j60401B40442I6470B4327Q1137N466i7271
10326f0336o6580n105B42448P922O4781n1157J75272A45802n5561L94463a74360
10314B21628d2999e240G635M4656d16024C18791b54710D8442J02642a06128E208
10302C3463K93237b48560C0651J43788k2283B2470e486j51193n0678k4047J12716
10291a18688H7513f3056j97045h2735b9778A7292b58992A56548n5550f0339j77827
10280b38166j10708J26396J10233l27498p7787K57698J01589G113K31958E1925
$$ plain form
10269 80853 55920 9906 -385145 -180326 -228107 98582 178114 61251 426371 216533 272275
10258 272275 207333 136546 -69316 -70360 89637 98556 -209877 -61890 -137382 67055 -165868
10246 106099 -3906 428598 282441 -125593 -125 135915 204369 -240501 -20005 187880 269098
10235 269098 -292193 -324091 -128017 -7082 249272 135854 251472 155226 101737 -35413 80932
10223 126019 -40407 15475 -205884 -159635 -38945 14916 116906 39856 53959 92001 212729
10212 212729 68857 -61037 -100467 409274 -245831 -32215 -250843 -130339 97904 191638 -164083
10200 -147091 -145700 202234 204949 57494 107617 41638 -218032 271693 -70585 -88385 -154007
10189 -154007 123 -34300 56921 -232997 128249 110733 -248797 264505 -359158 -37421 68668
$$ packed form
10269H0853k4933I906c85145a80326m7781I8582P9532F1251L65120k09838N5742
10258B72275o4942p0787f9316j044H9637Q919b09877f1890p5492F7055a65868
10246A06099c906D28598j46157a25593a25A35915O8454b40501b0005A87880Q1218
10235B69098b92193l1898a28017g082B49272j13418J15618r6246n3489c5413H0932
10223A26019d0407A5475b05884M6249c8945A4916J01990C9856J4103L8042J20728
10212B12729F8857f1037l9430D09274b45831c2215k18628J20504I7904R3734a64083
10200a47091J391B02234K715E7494N0123D1638b18032B71693g0585j7800o5622
10189a54007A23c4300E6921b32997A28249j7516b48797B64505c59158c7421F8668
$$ plain form
10177 -229511 -43760 -94075 -112845 31673 -243119 -353918 98556 113211 -159346 -99151 102312
10165 39352 -169849 -123911 -195010 -54108 14276 -151116 100541 -47104 178527 -218408 -35397
10153 -429343 -75081 57887 16183 413912 86115 1082 65134 -441468 138913 -87271 2925
10141 -24041 -145149 -93666 25683 -82045 66021 92353 50508 -166329 -80744 55915 27895
10129 154552 -166837 126385 170904 78447 -204293 11708 -25498 -120774 87783 229375 19059
10117 -188518 -200696 -353310 -319733 -280331 -94066 -94453 58086 13560 -95833 -26499 71737 30993
10104 139439 -47728 -118265 110822 -188515 71928 27617 233942 -75111 500927 -173504
10093 -247343 110337 -55635 140417 -65140 108684 -94853 -101803 -49915 127558 -90540 -52916
$$ packed form
10177b29511d3760n0315j8770C1673b43119j10799I8556J4655a59346O0195A02312
10165C9352a69849M5938p1099e4108A4276a51116A00541d7104A78527b18408c5397
10153d29343g5081E7887A6183L97729H6115A082O4052d41468A38913h7271B925
10141b4041j21108N1483B5683h2045F6021K6332m1845a66329h0744E5915B7895
10129A54552a66837A26385M4519G8447b04293A1708b5498r5276H7783J41592A9059
10117a88518j2178j52614L3577L9402i4066l87E8086A3560i5833b6499G1737C0993
10104A39439d7728p0537A10822a88515G1928B7617K06325g5111E00927a73504
10093b47343A10337e5635A40417f5140A08684i4853o950d9915A27558i0540L7624
$$ plain form
10082 -52916 236585 -44645 -166679 -136147 123527 -73950 -1810 -61339 -66191 -150596 -242371
10071 -242371 -43786 -175616 -308121 216137 206576 25683 53504 26193 182996 -229816 54401
10059 76043 -147853 -88174 5708 14471 -231969 -384914 211679 333825 -298298 136990 -221640
10047 116175 -91425 79917 -150555 8937 -36304 231046 68332 160169 66766 -175081 177946
10035 -260527 -137934 77555 -8851 51136 -475486 -122970 103438 56079 167824 -135031
10024 -190569 188595 -99498 7933 -92806 203192 -249833 59602 -284012 -4947 -130116 -325625
10013 -325625 -491870 -221281 155758 199198 103737 -37279 -216800 -34836 -55757 -189698
10003 -189698 108820 37563 -256383 100575 -85585 172363 -113155 67236 372527 9707
$$ packed form
10082e2916B36585d4645j22034L0532A23527g3950a810n9529m852q4405r1775
10071b42371d3786j31830j32505B16137r561B5683K7821B6193J56803b29816E4401
10059G6043a47853N9679E708Q763b31969j52945B11679J22146b98298A36990b21640
10047A16175i1425G9917a50555H937c6304B31046F8332R1837F6766a75081A77946
10035b60527J22593G7555h851E1136d75486a22970A03438m7359J11745a35031
10024a90569A88595i9498G933i2806B03192b49833E9602b84012d947j25169j95509
10013c25625j66245b21281A55758M3440r5461c7279j79521c4836k0921j33941
10003a89698A08820C7563b56383A00575h5585A72363a13155F7236L05291I707
$$ plain form
9992 15880 -225628 139773 -20418 -220032 -80348 -101921 -69987 33496 -113470 -155323 -111365
9981 -111365 -153912 27683 -61371 -244825 -74158 157325 -215665 228270 146972 -206848 411219
9969 -89002 3814 84836 181852 343229 18221 -48819 65738 -170315 -2512 106590 674 -71639
9956 -109729 25794 -141216 50853 -301771 -113324 -72411 -25475 -1368 -417040 156933 -64844
9944 -332844 -407339 178082 -156034 -432319 -130103 -180402 -64303 -204862 -182436 -215230 347421
9932 -173026 273397 48532 -97244 -184444 -67708 -113067 -206446 -77066 6040 -117553 172338
9920 174449 -157808 -169058 -70222 -74498 -110127 -73420 281011 -136517 84023 61817 128935
9909 128935 -90781 55429 135506 337503 -109228 190343 -75387 -215876 -239963 -45607 -119006
$$ packed form
9992A5880b25628A39773b0418j99614h0348k1573L1934C3496a13470m1853M3958
9981a11365m2547B7683f1371j83454g4158A57325b15665B28270q1298b06848D11219
9969h9002C814Q1022R7016J61377A8221d8819F5738a70315b512A06590F74g1639
9956a09729B5794a41216E0853c01771a13324M0913b5475a368m15672A56933f4844
9944c32844p4495A78082a56034k76285a30103n0299f4303j40559K2426l2794C47421
9932a73026B73397D8532i7244q7200f7708m5359r3379g7066F040a17553A72338
9920A74449a57808j1250g0222m276l5629L6707B81011a36517H4023k2206O7118
9909A28935i0781E5429Q0077K01997a09228A90343g5387j40489k4087d5607p3399
$$ plain form
9898 -119006 -33670 -16014 -198073 53595 -197892 -331940 27513 13671 -316808 -102291 -39527
9886 119447 187696 -99277 -331352 -479103 -53666 -234078 13768 -4599 -92892 104633 -29455
9874 194156 134549 -140066 246476 -64793 -245331 201708 -153031 55654 -106510 53437
9863 43603 -120313 113245 189969 1000 -321976 -7061 25107 -22210 -109052 -154145 -40099 -49441
9851 -49441 151064 18958 219406 -116304 -19179 -146759 -57032 -179133 20371 123515 40675
9839 -137802 -84560 -114508 96033 -208888 -223780 -181090 -125712 -87615 62806 -99245 -74073
9828 -74073 -208619 -503307 -32901 -19515 -244275 250345 137606 -62869 238651 -306743
9817 -217606 -51802 -100842 -153713 76035 -112646 -315425 -143960 -86777 294572 227252 -79316
$$ packed form
9898a19006c3670a6014j82059E3595a97892j34048B7513A3671c16808a02291c9527
9886A19447O8249i9277k32075j47751e3666j80412A3768d599q8293A04633b9455
9874A94156n9607a40066B46476f4793j80538B01708a53031E5654a06510E3437
9863D3603a20313A13245P6724A000c21976g061B5107b2210q6842m5093d0099r342
9851d9441A51064A8958K00448a16304a9179j27580e7032j22101B0371J03144D0675
9839a37802N3242k9948I6033b08888j4892M2690N5378L8097F2806i9245K5172
9828g4073j34546k94688c2901J3386k24760B50345j12739f2869B38651c06743
9817b17606e1802m9040n2871G6035a12646k02779a43960N7183B94572o7320g9316
$$ plain form
9805 123364 86284 -99470 85167 44329 -315786 1171 165805 -198937 105085 -90840 -327091
9794 -327091 140175 -1297 120046 104370 -112365 -54385 -209169 -47253 -167084 -264163 90006
9782 786 102181 -78209 -85225 62902 -461130 22675 -122593 16654 -130561 391604 -94518
9770 -197870 -124294 -207068 -232925 -45683 81423 -23370 -438796 -66311 10015 -60410 -110173
9759 -110173 -39972 -331170 -494988 -317944 -122252 235287 -258892 -497446 -429949 271735
9748 -165305 -133697 -124773 41514 150911 -309995 -139349 -79443 -53946 81359 -252579 -243498
9737 -243498 -50479 36956 -53474 125 -205520 160484 -243858 -35482 -52088 181213 106283
9726 106283 -105354 -258935 -127785 -137068 47588 -324483 -29396 186289 -7740 57484 62905
$$ packed form
9805A23364l7080i9470H5167m0838c15786A171J64634a98937A05085i0840k36251
9794c27091A40175a297A20046j5676a12365e4385j54784d7253j19831r7079I0006
9782G86J01395g8209p016F2902d61130B2675a22593A6654a30561C91604i4518
9770a97870P3576q2774k5857d5683H1423b3370m15426f6311A0015f0410m9763
9759a10173c9972k91198j63818J77044a22252B35287b58892k38554O7497B71735
9748a65305L1608Q924D1514J09397c09995a39349N9906K5497H1359b52579R081
9737b43498e0479C6956e3474A25b05520A60484b43858c5482j6606A81213p4930
9726A06283a05354j53581a27785r283D7588c24483b9396A86289g740E7484N421
$$ plain form
9715 62905 -5771 -174503 -88704 -166471 -315042 -31711 -149819 -9999 -136624 108507 56561
9704 56561 92611 30347 -166075 71771 -240666 49420 -234004 -129991 135540 334901 136433
9692 79488 257923 72890 185254 93138 139230 -282728 39322 -180177 133392 -268714 -384200
9681 -384200 -9932 -158793 -168428 -34678 -141718 -79698 18224 59033 179621 107230 -14791
9669 -6471 -200735 -254877 141344 74764 95986 66420 -52052 -229352 154501 -87233 -50012
9658 -50012 -47895 81496 -116518 -77456 -29145 213914 125572 -139880 -233414 147435 -166487
9646 -356944 -118255 -108384 -133953 -334956 -263660 130416 192980 -45362 53335 314755 161435
9635 161435 -436690 124731 -21592 -187163 -356108 -391282 99545 -130241 -87382 146971
$$ packed form
9715F2905e771j68732Q5799p7767j48571c1711j18108i999j26625A08507n1946
9704E6561L6050C0347a66075G1771b40666D9420b34004J04013A35540J99361A36433
9692G9488J78435G2890J12364r2116M6092b82728C9322a80177A33392b68714j15486
9681c84200i932j48861r635c4678j07040O2020A8224M0809J20588p2391a4791
9669f471j94264n4142A41344o6580K1222k9566e2052j77300A54501h7233L7221
9658e0012K117H1496a16518L9062b9145B13914q8342a39880r3534A47435a66487
9646c56944a18255R871k5569k01003P1296A30416O2564d5362E3335K61420j53320
9635A61435d36690A24731b1592j65571j68945l5174I9545a30241M2859A46971
$$ plain form
9624 -97835 -47220 339661 192432 170792 -194750 -435724 117414 -308924 223912 -364530
9613 166303 -415623 49630 -194732 72371 152674 -137033 -62225 -70158 -183378 -246589 83866
9601 -72 233589 -149143 -225985 -61426 108493 -163768 8982 -216422 100371 113410 -22211
9589 226316 -390007 469 62794 -14166 17394 198237 133984 -209205 -147903 -183333 2622 -34011
9576 1994 3039 51555 -202449 -344053 126739 -192167 304913 -106835 -242526 -103988 -266293
9565 -266293 -289915 -73344 94289 -310813 180211 -48173 -200365 -188025 69178 173482 -63449
9553 69762 113044 138826 -370687 97457 -261608 131485 -232283 -65066 73951 -36437 14868
9541 60824 211550 190291 41798 -165164 181297 -132666 -129429 62318 146195 -283574 141829
$$ packed form
9624i7835d7220C39661j47229k1640a94750k40974A17414c08924B23912c64530
9613A66303d15623D9630a94732G2371Q0303a37033f2225p933j13220o3211H3866
9601g2B33589a49143p6842f1426A08493a63768H982b16422A00371J3039b2211
9589B26316c90007D69O2325a4166A7394J80843o4253b09205O1302l5430B622c4011
9576A994J045M8516b02449j41604A26739a92167C04913a06835j35691a03988j62305
9565b66293k3622g3344I4289c10813A80211d8173j52192J2340F9178J04304f3449
9553F9762M3282K5782c70687I7457b61608A31485b32283f5066G3951c6437A4868
9541F0824J50726k1259D1798a65164A81297a32666L237F2318Q3877b83574A41829
$$ plain form
9529 -172047 -161228 273198 -312976 18556 12861 -177424 91464 -126489 -437583 -172129 -23879
9517 -245666 38769 92275 39527 -131784 -57787 215439 -71028 -130145 -16951 99484 -163658
9505 5745 -21916 -169966 87374 -39229 -109890 -127978 199582 101685 -166170 141683 -507935
9493 -221159 -230355 -149681 412713 271463 -9643 -157613 -336599 -236871 112301 -33598 2628
9481 -86464 50577 -189316 140992 -1258 133288 25822 -70934 -180844 112580 26935 -217159
9469 -183193 129020 139375 -138017 48023 -287120 -335472 -41273 -147508 -82285 -169381 -113206
9458 -113206 -84116 46552 -486651 -238707 -94424 167685 285119 -306046 26009 -174105
9447 -113364 -260921 121434 109241 189709 -241802 162048 -169104 -177327 -19704 57160 -153053
$$ packed form
9529a72047J0819B73198c12976A8556n695a77424I1464a26489l11094a72129b3879
9517b45666C8769N3506C9527a31784e7787B15439g1028n9117a6951I9484a63658
9505E745b1916j48050H7374c9229p0661j8088A99582r7897a66170A41683e07935
9493b21159r196Q0674D12713j41250i643j47970j78986R9728A12301c3598B628
9481h6464E0577a89316A40992a258A33288B5822g0934j09910A12580B6935b17159
9469a83193A29020J0355a38017D8023b87120m8352d1273j06235O5223q7096N6175
9458a13206K9090D6552d86651b38707i4424A67685J17434c06046B6009a74105
9447a13364j47557A21434j2193Q0468b41802A62048a69104q223a9704E7160a53053
$$ plain form
9435 -342921 -99450 -11873 130796 -345493 -514413 104184 23471 -185284 -261939 -322036 289310
9423 -128669 -75625 -399697 81499 -117182 109168 81723 9058 -57166 -141222 -53061 2592
9411 -134364 77925 -39231 -115693 141862 88060 -3079 133401 119345 -16729 -41111 -17065
9399 238687 -53559 -256554 117482 -68044 -114671 169200 -333722 -190906 276989 304507
9389 304507 -36573 -267266 112163 -198379 279455 30102 205751 50025 -55848 -194512
9379 -194512 -13941 -244182 -217508 -118358 -162715 136338 -62923 -23957 135578 8358 219037
9368 219037 -226657 -46304 198465 -15710 -172507 -230600 -121566 -277675 -48181 -54129 -66857
9357 -66857 -15989 -96882 197361 318830 -3561 -331930 -81060 -295795 142363 83951 213568
$$ packed form
9435c42921i9450a1873A30796c45493j68920A04184B3471a85284p6655o0097B89310
9423a28669N3044l24072H1499a17182A09168k7445I058e7166q4056e3061B592
9411a34364G7925c9231p6462A41862n3802c079A33401j4056a6729k4382a7065
9399B38687e3559k02995A17482f8044m6627A69200c33722J42816B76989K7518
9389C04507c6573k30693A12163a98379B79455C0102J75649E0025e5848j38664
9379a94512a3941k30241K6674R9150m4357A36338f2923b3957A35578H358K10679
9368B19037b26657d6304A98465a5710j56797n8093J09034j56109d8181n948j2728
9357f6857a5989q0893A97361J21469c561l28369h1060k14735A42363n8412J29617
$$ plain form
9346 213568 -209750 113232 -197044 -326041 -72499 156416 -21765 166992 -22528 -42438
9336 -42438 84020 97991 19433 193070 95722 -123760 -181425 -30547 -237046 111248 -313191
9324 35284 -141001 -322781 -116440 92449 -159521 118567 92077 -112287 -259458 -129034
9313 -139430 -75674 -225123 -78376 143135 58578 -253693 -622469 -160034 -25369 -38050 -93817
9302 -93817 -196468 186250 -26524 -509847 132330 55671 199846 215052 -115956 -364935
9292 -364935 -103781 240186 -112988 -260099 -153432 -74217 -298608 -68503 -110406 108302
9281 -284147 34983 -247563 260162 -96253 -32923 83354 182859 -230980 228674 -63800 -19232
9269 158592 -281742 169540 -40988 73436 183657 36165 -247026 46722 -132914 -133175 114733
$$ packed form
9346B13568b09750A13232a97044j28997g2499A56416b1765A66992b2528j9910
9336d2438H4020J3971A9433J73637I5722a23760n7665c0547k06499A11248c13191
9324C5284a41001j81780a16440I2449a59521A18567k6490a12287j47171a29034
9313a39430O3756j49449g8376A43135E8578b53693l68776a60034b5369j2681n5767
9302i3817j02651A86250b6524m83323A32330E5671J44175J5206a15956k48979
9292c64935a03781B40186a12988j47111J06667g4217k24391f8503m1903A08302
9281b84147C4983b47563B60162i6253c2923H3354R9505b30980B28674f3800a9232
9269A58592b81742A69540d0988G3436J10221C6165b47026D6722a32914k61A14733
$$ plain form
9257 32604 -143234 -166915 -237223 -268198 -60158 -112268 -64819 -470998 -239786 -287228 338718
9245 -230551 197931 -80994 -160183 -445527 -370617 104072 -239002 -96880 -182866 12329 -65995
9233 165567 53620 -259118 -138698 -517878 105487 124304 -135252 61867 -105245 -29195
9222 -71012 -33367 -17194 168828 -31929 -6991 -64434 -111122 144969 129082 -30936 -218690
9211 -218690 -105191 151127 34163 -434479 -291846 -134377 74825 1173 -123420 -28636 -41754
9200 -41754 95106 29547 264125 -325069 106348 -76255 -26373 -249938 9261 -91204 -2700
9188 -187825 -57130 -64636 -317271 135689 -106897 -65400 38064 -90707 2553 -64945 -161451
9177 -161451 -21136 -63266 256594 -491930 -222131 24122 -175566 30033 84007 169880 156562
$$ packed form
9257C2604a43234k3681p0308l0975f0158n2110M7449m06179K31212m7442C38718
9245b30551A97931h0994p9189k85344P4910A04072b39002i6880q5986A2329f5995
9233A65567E3620b59118J20420l79180A05487J8817a35252F1867a05245b9195
9222g1012c3367J6173A68828c1929f991n7443m6688A44969j5887c0936j87754
9211b18690a05191A51127C4163d34479J42633a34377G4825A173a23420b8636j3118
9200d1754I5106B9547K34578c25069A06348g6255b6373k23565I261i1204b700
9188a87825e7130p506k52635A35689a06897M1497C8064i0707B553f4945r6506
9177a61451b1136m2130B56594d91930b22131B4122a75566C0033N3974Q5873j3318
$$ plain form
9166 156562 42485 -582475 244274 72534 -239196 -47699 -120519 323587 275915 -22076 446791
9154 -69556 278907 -31337 232349 37913 -98724 -166275 -91744 -131435 41462 -262879 39659
9142 -168286 41640 -33057 36145 121481 166581 -220729 215979 -61445 86558 -128370 -199404
9131 -199404 71898 198813 123808 207495 -274366 -267933 41237 62910 -95774 197152 110024
9120 110024 11224 -118830 88527 -137574 -278347 -225720 224086 -12808 -200329 113655
9109 -175763 196799 -117508 -43608 -277957 -52058 188025 -21611 -65863 -90777 -117816 -75489
9098 -75489 152421 46452 -85581 -158593 25626 316957 -214619 78846 92495 191167 -268091
9086 300081 -435055 -67907 -357908 -4603 -152964 -200207 3108 1089 -34572 -168982 -232339
$$ packed form
9166A56562D2485e82475B44274G2534b39196d7699p2820C23587m7672b2076D46791
9154f9556B78907c1337B32349C7913i8724o7551P4531l9691D1462b62879C9659
9142a68286D1640c3057C6145Q5336M5100b20729B15979f1445H6558a28370p1034
9131a99404G1898J26915p5005Q3687b74366O433D1237K1673i5774A97152q7128
9120A10024A1224a18830H8527a37574j40773N2627B24086a2808j87521A13655
9109a75763A96799a17508d3608k34349e2058A88025b1611m4252k4914k7039M2327
9098g5489A52421D6452h5581p3012B5626K91331b14619G8846J3649R8672b68091
9086C00081d35055f7907k90001d603j48361m7243C108A089c4572j34410o3357
$$ plain form
9075 -232339 -28143 7393 63721 30241 -3121 -50730 -221513 133886 21427 -108647 241922
9063 201739 153145 3248 -99838 -236832 -189575 -28542 118118 -36000 314118 41495 -111515
9051 -24905 95516 -46714 296349 -77413 156143 65167 -161460 -260211 -38248 -265953 64671
9039 -212 -294656 49153 -130992 -310604 -317441 -143334 -137658 -27696 79726 -180060 4168 182123
9027 182123 -25234 -90971 39904 -215792 -99585 -1496 -193759 215012 -148772 -128131 40860
9015 -264971 94040 -50914 189549 -240462 2090 -301361 -17434 118813 187230 -39619 -216072
9004 -216072 -116247 162801 -169861 -240187 1080 -144128 -195958 -237551 161033 37633 146306
8993 146306 18029 139606 -84405 -210552 234706 -134133 -124705 -112691 186440 249565 102161
$$ packed form
9075b32339b8143G393N6328C0241c121m7609j70783A33886B1427a08647B41922
9063B01739m8594C248i9838j36994M7257b8542A18118c6000C14118D1495a11515
9051b4905I5516d6714B96349g7413A56143F5167a61460r8751c8248k27705F4671
9039b12k94444D9153a30992j79612o837a43334N676b7696G9726a80060D168J77955
9027A82123b5234o5737C9904b15792i9585a496j92263B15012a48772K0641D0860
9015b64971I4040e0914A89549b40462B090c01361a7434A18813O8417c9619j76453
9004b16072R9825A62801a69861p0326A080a44128n1830m1593A61033C7633J08673
8993A46306A8029J21577h4405j26147B34706a34133R428J2014A86440O3125A02161
$$ plain form
8981 -297218 -138036 31377 140620 232313 -16734 -205984 -35047 -106809 7974 -241296 -88593
8969 40855 -211501 -237677 -143969 -96149 40966 -148122 -152515 145064 103149 56034 -70935
8957 88780 -221944 165351 105935 -139027 -275186 -293479 -298786 -43365 -398136 93410 -145859
8945 114941 -328330 -44810 138693 90953 110635 -13216 -169482 131205 -310367 80415 288339
8934 288339 312230 -199636 -54520 -212663 -174499 -48543 101381 331966 46965 433173 651398
8923 651398 2556515 8935231 11600196 3142114 630329 457674 274923 358655 109609
8913 -127642 387413 -55609 98095 277071 507591 282536 372147 -11716 -174023 111961
8902 -392438 -6890 156383 197943 49202 199973 -324070 -260531 -300157 -144663 65806 176512
$$ packed form
8981b97218a38036C1377J09243R1693a6734j89250c5047p1762G974b41296h8593
8969D0855b11501k6176R3708M7820D0966a48122m393A45064m1915m7115g0935
8957H8780b21944A65351n9416a39027j36159j8293n307d3365l54771I3410a45859
8945A14941c28330d4810A38693m7740J9682a3216j56266A31205c10367H0415K07924
8934B88339K3891a99636e4520j58143L8164d8543A01381K30585D6965L86208K18225
8923F51398J905117O378716K664965C142114F30329j72655j82751Q3732A09609
8913a27642C87413e5609I8095J78976K30520k25055Q9611a1716j62307A11961
8902c92438f890A56383M1560D9202J50771c24070O3539l9626a44663F5806J10706
$$ plain form
8891 176512 -272417 -18564 49769 -106609 154575 -9487 -52115 46397 -320140 -48497 -248532
8880 -248532 123688 -269715 -8337 87729 -184287 25402 -112500 106289 73665 -157969 -228685
8869 -228685 -276593 -156672 23221 23382 -219134 158759 -254796 -66938 -81948 -321974 119873
8857 41287 -124104 390307 51351 -220816 -60523 -25660 16084 153709 -66355 16494 -139008
8845 149805 -18886 -144073 67388 -144414 -194927 -281492 64314 187878 184744 297596 -8239
$$ packed form
8891A76512b72417a8564D9769a06609A54575i487m2628D6397c20140d8497k00035
8880b48532A23688b69715h337H7729a84287B5402a12500A06289l2624a57969p0716
8869b28685m7908J19921B3221J61b19134A58759b54796f6938j5010k40026A19873
8857D1287a24104C90307E1351b20816f0523b5660A6084J37625f6355A6494a39008
8845A49805a8886j25187F7388a44414n0513q6565F4314J23564l134J12852h239
$$ [...]
##END NTUPLES=NMR SPECTRUM
##END=
