##TITLE=AC1596_HNAAH13326_8314361_UcJBKv8hGL
##JCAMPDX= 6.0         $$ Bruker NMR JCAMP-DX V2.0
##DATA TYPE= NMR SPECTRUM
##DATA CLASS= NTUPLES
##ORIGIN= BRUKER
##OWNER= Administrator
$$ 1.72 TOPSPIN		Version 2.1
$$ 2013-11-09 13:51:04.302 -0800  Administrator@X
$$ Compression mode = diff/dup
##.OBSERVE FREQUENCY= 400.02188249412
##.OBSERVE NUCLEUS= ^1H
##.ACQUISITION MODE= SIMULTANEOUS (DQD)
##.ACQUISITION SCHEME= undefined
##.AVERAGES= 64
##.DIGITISER RES= 22
##SPECTROMETER/DATA SYSTEM= spect
##.PULSE SEQUENCE= noesygpps1d.comp
##.SOLVENT NAME= COFFEE_meoh
##.SHIFT REFERENCE= INTERNAL, COFFEE_meoh, 1, 14.96098
##AUDIT TRAIL= $$ (NUMBER, WHEN, WHO, WHERE, PROCESS, VERSION, WHAT)
$$ ##TITLE= Audit trail, TOPSPIN		Version 2.1
$$ ##JCAMPDX= 5.01
$$ ##ORIGIN= Bruker BioSpin GmbH
$$ ##OWNER= Administrator
$$ $$ E:\/data/COFFEE/nmr/AC1596_HNAAH13326_8314361_UcJBKv8hGL/12/pdata/1/auditp.txt
$$ ##AUDIT TRAIL=  $$ (NUMBER, WHEN, WHO, WHERE, PROCESS, VERSION, WHAT)
(   1,<2013-11-09 13:50:58.260 -0800>,<Administrator>,<X>,<go>,<TOPSPIN 2.1>,
      <created by zg
	started at 2013-11-09 13:39:29.483 -0800,
	POWCHK enabled, PULCHK disabled,
       configuration hash MD5:
       C8 4E 4E 5D D3 5C D8 9E 9F 52 82 E0 59 8A DE 15
       data hash MD5: 64K
       43 C7 23 43 3E FB B8 E1 8E BA C8 65 E4 18 AE DE>)
(   2,<2013-11-09 13:51:01.798 -0800>,<Administrator>,<X>,<proc1d>,<TOPSPIN 2.1>,
      <Start of raw data processing
       efp LB = 0.3 FT_mod = 6 PKNL = 1 PHC0 = 0 PHC1 = 0 SI = 128K 
       data hash MD5: 128K
       09 78 06 13 C2 54 A6 55 30 32 A3 1E C5 06 27 4E>)
(   3,<2013-11-09 13:51:03.050 -0800>,<Administrator>,<X>,<proc1d>,<TOPSPIN 2.1>,
      <pk PHC0 = -87.46216 PHC1 = 0 
       data hash MD5: 128K
       A1 E4 EB 27 DE D4 7F C7 02 5A A6 52 B3 B8 51 37>)
(   4,<2013-11-09 13:51:03.626 -0800>,<Administrator>,<X>,<proc1d>,<TOPSPIN 2.1>,
      <abs ABSG = 1 
       data hash MD5: 128K
       83 A2 BF BF 5C A2 70 0C A9 E0 7C 2F 38 AC B9 7D>)
(   5,<2013-11-09 13:51:03.765 -0800>,<Administrator>,<X>,<proc1d>,<TOPSPIN 2.1>,
      <abs ABSG = 2 
       data hash MD5: 128K
       A0 F5 B6 41 75 80 42 24 FD 89 C8 49 28 0D 3B 43>)
(   6,<2013-11-09 13:51:03.885 -0800>,<Administrator>,<X>,<proc1d>,<TOPSPIN 2.1>,
      <abs ABSG = 3 
       data hash MD5: 128K
       B4 88 54 78 12 25 4E 14 B5 C8 80 06 6A 60 A4 FA>)
(   7,<2013-11-09 13:51:04.004 -0800>,<Administrator>,<X>,<proc1d>,<TOPSPIN 2.1>,
      <abs ABSG = 4 
       data hash MD5: 128K
       11 D2 BC E7 8C B4 6E 8D 2C 91 5B BD 9A D0 C0 7B>)
(   8,<2013-11-09 13:51:04.083 -0800>,<Administrator>,<X>,<proc1d>,<TOPSPIN 2.1>,
      <abs ABSG = 5 
       data hash MD5: 128K
       D1 8F 16 80 83 54 33 26 4C 50 04 0C DC 31 E1 CB>)
$$ ##END=
$$ 
$$ $$ hash MD5
$$ $$ 9D FE AA FA 4B D6 42 6F 8B 8D DE 0C A7 9E A8 0B
##$RELAX= 
##$RELAX= 
##$RELAX= 
##$RELAX= 
##$RELAX= 
##$RELAX= 
##$RELAX= 
##$RELAX= 
$$ Bruker specific parameters
$$ --------------------------
##$DU= <E:\>
##$EXPNO= 12
$$ [...]
##$TP07= 0
##$TPNAME0= <>
##$TPNAME1= <>
##$TPNAME2= <>
##$TPNAME3= <>
##$TPNAME4= <>
##$TPNAME5= <>
##$TPNAME6= <>
##$TPNAME7= <>
##$TPOAL= (0..7)
0.5 0.5 0.5 0.5 0.5 0.5 0.5 0.5
##$TPOFFS= (0..7)
0 0 0 0 0 0 0 0
##$TUNHIN= 0
##$TUNHOUT= 0
##$TUNXOUT= 0
##$USERA1= <user>
##$USERA2= <user>
##$USERA3= <user>
##$USERA4= <user>
##$USERA5= <user>
##$V9= 5
##$VALIST= <valist>
##$VCLIST= <CCCCCCCCCCCCCCC>
##$VD= 0
##$VDLIST= <DDDDDDDDDDDDDDD>
##$VPLIST= <PPPPPPPPPPPPPPP>
##$VTLIST= <TTTTTTTTTTTTTTT>
##$WBST= 1024
##$WBSW= 4
##$XGAIN= (0..3)
0 0 0 0
##$XL= 0
##$YL= 0
##$YMAX_a= 5458264
##$YMIN_a= -11009977
##$ZGOPTNS= <>
##$ZL1= 120
##$ZL2= 120
##$ZL3= 120
##$ZL4= 120
##$ABSF1= 14.96098
##$ABSF2= -5.597201
##$ABSG= 5
##$ABSL= 3
##$ALPHA= 0
##$AQORDER= 0
##$ASSFAC= 0
##$ASSFACI= 0
##$ASSFACX= 0
##$ASSWID= 0
##$AUNMP= <proc_prof1d_extract.lims>
##$AXLEFT= 0
##$AXNAME= <>
##$AXNUC= <1H>
##$AXRIGHT= 0
##$AXTYPE= 0
##$AXUNIT= <>
##$AZFE= 0.1
##$AZFW= 0.1
##$BCFW= 0
##$BC_mod= 0
##$BYTORDP= 0
##$COROFFS= 0
##$CY= 15
##$DATMOD= 1
##$DC= 0
##$DFILT= <>
##$DTYPP= 0
##$F1P= 0
##$F2P= 0
##$FCOR= 0.5
##$FTSIZE= 131072
##$FT_mod= 6
##$GAMMA= 0
##$GB= 0
##$INTBC= 1
##$INTSCL= 1
##$ISEN= 128
##$LB= 0.3
##$LEV0= 0
##$LPBIN= 0
##$MAXI= 10000
##$MC2= 0
##$MEAN= 0
##$ME_mod= 0
##$MI= 0
##$NCOEF= 0
##$NC_proc= -2
##$NLEV= 6
##$NOISF1= 0
##$NOISF2= 0
##$NSP= 0
##$NTH_PI= 0
##$NZP= 0
##$OFFSET= 14.96098
##$PC= 1
##$PHC0= -87.46216
##$PHC1= 0
##$PH_mod= 1
##$PKNL= yes
##$PPARMOD= 0
##$PPDIAG= 0
##$PPIPTYP= 0
##$PPMPNUM= 2147483647
##$PPRESOL= 1
##$PSCAL= 4
##$PSIGN= 0
##$PYNMP= <proc.py>
##$REVERSE= no
##$SF= 400.020009644086
##$SI= 131072
##$SIGF1= 0
##$SIGF2= 0
##$SINO= 400
##$SIOLD= 131072
##$SPECTYP= <>
##$SREGLST= <1H.CDCl3>
##$SSB= 0
##$STSI= 131072
##$STSR= 0
##$SW_p= 8223.68421052631
##$SYMM= 0
##$S_DEV= 0
##$TDeff= 65536
##$TDoff= 0
##$TI= <>
##$TILT= no
##$TM1= 0
##$TM2= 0
##$TOPLEV= 0
##$USERP1= <user>
##$USERP2= <user>
##$USERP3= <user>
##$USERP4= <user>
##$USERP5= <user>
##$WDW= 1
##$XDIM= 131072
##$YMAX_p= 391277834
##$YMIN_p= -12215
##$CURPLOT= <Network HP LaserJet P1505>
##$CURPRIN= <$Network HP LaserJet P1505>
##$DFORMAT= <normdp>
##$LAYOUT= <+/1D_H.xwp>
##$LFORMAT= <normlp>
##$PFORMAT= <normpl>
##$SURQMSG= 1
$$ End of Bruker specific parameters
$$ ---------------------------------
##NTUPLES= NMR SPECTRUM
##VAR_NAME=  FREQUENCY,     SPECTRUM/REAL,   SPECTRUM/IMAG
##SYMBOL=    X,             R,               I
##VAR_TYPE=  INDEPENDENT,   DEPENDENT,       DEPENDENT
##VAR_FORM=  AFFN,          ASDF,            ASDF
##VAR_DIM=   131072,        131072,          131072
##UNITS=     HZ,            ARBITRARY UNITS, ARBITRARY UNITS
##FACTOR=    0.0627417313425164, 1,          1
##FIRST=     8223.62146879497, 1796,         -51044
##LAST=      0,             2524,            -51557
##MIN=       0,             -12215,          0
##MAX=       8223.62146879497, 391277834,    0
$$ Real data points
##PAGE= N=1
##DATA TABLE= (X++(R..R)), XYDATA
$$ [...]
65265 145737 143641 141153 138924 137454 136550 135710 134672 133381 131720 129664 127624 126364 126469 127896 129942
65250 129942 131598 132106 131395 129985 128439 126974 125617 124567 124123 124231 124295 123584 121881 119693 117836 116812
65234 116812 116570 116768 117108 117453 117785 118178 118730 119442 120242 121158 122310 123639 124803 125485 125670 125486 124977 124228
65216 124228 123464 122764 121845 120489 119044 118149 117996 118236 118551 118946 119479 120064 120577 120884 120752 120101 119342 119095
65198 119095 119565 120514 121759 123190 124344 124647 124256 124066 124577 125302 125630 125754 126251 127201 128285 129436 130785
65181 130785 132136 133106 133746 134553 135806 137257 138530 139521 140352 141141 141857 142269 142091 141315 140323 139513 138981
65164 138981 138775 139275 140961 143738 146705 148725 149330 149197 149720 151905 155652 160240 165274 170728 176256
65149 176256 181256 185808 190836 196923 203691 210854 219142 229424 241469 254432 268190 283160 298970
65136 298970 314347 328437 341373 353464 364671 375113 385300 395413 404889 412985 419254 423249
65124 423249 424374 422422 417828 411163 402821 393385 383603 373583 362577 350089 336737 323477 310416
65111 310416 297043 283373 270130 257859 246509 235904 226037 216737 207565 198357 189661 182306 176602
65098 176602 172074 167946 163821 159847 156308 153168 150072 146774 143422 140500 138598 138137 138998 140370 141273
65083 141273 141351 141005 140739 140701 140915 141505 142393 143091 143182 142874 142761 143134 143796 144443 144933 145238 145403 145593 145990 146619
65063 146619 147328 147857 147830 146872 144981 142739 140903 139792 139187 138776 138493 138438 138696 139286 140183 141315 142577
65046 142577 143819 144804 145289 145265 145050 145019 145305 145793 146316 146708 146730 146141 144888 143147 141151 139063 137012 135155
65028 135155 133616 132324 130991 129395 127691 126260 125163 123973 122386 120785 119824 119568 119441 119020 118442
65013 118442 118014 117945 118575 120255 122655 124696 125624 125881 126487 127881 129807 132035 134560 137166 139378 140954
64997 140954 142120 143311 144923 147185 149880 152301 153889 154840 155730 156666 157359 157929 158922 160382 161617 162287
64981 162287 163102 164925 167573 170117 172115 173905 175699 177047 177391 176655 175005 172400 168824 164793 161229
64966 161229 158679 156943 155484 153948 152151 149891 147162 144412 142191 140548 139153 138034 137706 138283 138961
64951 138961 138806 137822 136788 136216 135964 135767 135552 135157 134295 133049 132007 131601 131597 131529 131370 131498 132130 133101 134095
64932 134095 134855 135236 135326 135503 136136 137162 138087 138419 138007 137013 135749 134610 133994 134060 134560 135065 135421 135918
64914 135918 136868 138076 138920 139021 138659 138398 138505 138915 139641 140888 142777 145161 147748 150219 152328 154161
64898 154161 156312 159400 163356 167487 171420 175568 180397 185597 190473 194977 199754 205100 210298 214308
64884 214308 216825 218402 219645 220601 220955 220562 219604 218322 216796 215025 213067 210966 208652 206089 203446
64869 203446 200937 198525 195976 193305 190865 188904 187272 185784 184628 184059 183787 183072 181492 179294 176875
64854 176875 174235 171168 167742 164248 160823 157447 154210 151218 148204 144756 141165 138662 138303 139741
64840 139741 141513 142457 142447 141819 140764 139581 138909 139137 139827 140241 140257 140276 140445 140595 140901 141801 143071 143710
64822 143710 143191 142280 142082 142707 143541 144478 146100 148675 151731 154767 157795 160977 164323 168042 172717 178662
64806 178662 185441 192431 199619 207342 215405 222969 229318 234311 238027 240363 241143 240299 237760 233394 227303
64791 227303 220040 212406 205140 198788 193633 189574 186284 183642 181810 180683 179592 177938 175990 174625
64777 174625 174230 174235 173843 172901 171921 171505 171982 173444 175915 179474 184229 190087 196584 203233 210030 217325
64761 217325 225086 232644 239390 245375 250873 255694 259424 262198 264650 267036 268934 269950 270304 270446 270456
64746 270456 270192 269780 269502 269252 268481 266797 264373 261572 258315 254039 248317 241412 234123 227109 220464
64731 220464 214017 207901 202697 198948 196642 195199 193921 192438 190856 189553 188855 188816 189229 189770 190179 190476
64715 190476 191072 192531 195115 198628 202741 207274 211977 216243 219397 221248 222085 222148 221406 219844 217664
64700 217664 215033 211950 208465 204830 201224 197566 193755 189918 186240 182780 179661 177199 175507 174147
64686 174147 172554 170857 169925 170477 172362 174772 176944 178498 179348 179613 179698 180272 181959 184967 189071 193981
64670 193981 199628 206005 212840 219716 226579 233895 242059 250673 258544 264377 267420 267626 265436 261444
64656 261444 256092 249605 242203 234349 226713 219903 214252 209810 206478 204150 202720 201968 201550 201266 201290
64641 201290 201891 202991 204341 206252 209705 215393 222930 231365 240252 249796 260101 270859 281809 292967
64627 292967 304134 314538 323272 329908 334524 337259 338048 336642 332773 326468 318413 309844 301824 294537
64613 294537 287407 279975 272643 266514 262435 260152 258486 256458 254141 252295 251307 250778 250071 248849 247013
64598 247013 244433 241009 236796 231920 226526 220938 215667 211105 207351 204394 202227 200593 198851 196444
64584 196444 193464 190620 188756 188417 189640 191929 194659 197741 201739 207118 213546 220142 226194 231390
64570 231390 235638 239080 242076 244698 246371 246469 245152 243069 240261 236037 230067 222996 215677 208346 200924
64555 200924 193751 187577 183019 180253 178931 178126 176741 174466 172108 170630 170092 169890 169735 169844 170339 171053
64539 171053 171935 173115 174517 175883 177272 179017 181032 182623 183220 182900 181874 179897 176690 172767 169312
64524 169312 167147 166137 165649 165307 165165 165358 165880 166720 167985 169708 171630 173363 174775 176040 177278 178424
64508 178424 179529 180859 182417 183754 184675 185842 188086 191249 194439 197512 201569 207660 215559 224239
64494 224239 232984 241534 249570 256763 263157 268841 273239 275296 274460 271169 266374 260950 255552 250553
64480 250553 245932 241429 236931 232579 228603 225348 223268 222424 221900 220275 216927 212570 208360 204836 201993
64465 201993 199940 198968 199098 199941 201104 202469 204057 205847 207757 209706 211591 213302 214819 216282 217922
64450 217922 219838 221779 223202 223737 223611 223496 223912 224842 226003 227326 229107 231742 235440 240171 245794
64435 245794 252121 258812 265354 271502 277877 285798 296157 308633 322402 337533 355208 376551 401795
64422 401795 430831 464126 502740 547699 599691 659155 726135 799921 878886 960686 1042662
64411 1042662 1122453 1198505 1269900 1335548 1393689 1442321 1479803 1504808 1516088 1512917 1495871
64400 1495871 1466787 1427837 1380697 1326440 1265731 1198982 1126677 1049917 970707 891669 815366
64389 815366 743690 677617 617470 563406 515536 473549 436633 404163 376343 353674 335789
64378 335789 321190 308281 296393 285717 276640 269350 263728 259286 255314 251321 247272 243267 239215
64365 239215 235020 230906 227211 223932 220706 217219 213445 209490 205476 201621 198260 195690 194162 193975
64351 193975 195329 197927 200981 203859 206711 210274 215086 221043 227633 234356 240815 246597 251248 254378
64337 254378 255738 255297 253312 250295 246752 242990 239202 235685 232796 230677 229135 227903 227009 226794 227498
64322 227498 228804 229900 230115 229456 228369 227076 225455 223584 221974 220952 220184 219240 218421 218461 219425 220398
64306 220398 220365 219005 216589 213568 210419 207408 204271 200483 196111 191964 188693 186164 184063 182567 181914
64291 181914 181752 181638 181911 183270 185555 187712 189129 190372 192351 195277 198692 202098 205292 208450 212150
64276 212150 216986 222902 229157 235185 241163 247503 254076 260268 265561 269785 273032 275683 278284 280889
64262 280889 282633 282433 280198 277019 274128 272066 270946 270961 272154 273884 275055 274943 273519 270928 267077
64247 267077 261925 255829 249217 242125 234524 227050 220836 216422 213249 210484 207948 205874 204178 202610
64233 202610 201448 201385 202593 204359 205798 206558 206745 206541 206139 205754 205480 205233 204948 204630 204222 203687 203197 202909
64215 202909 202549 201646 200249 198907 197777 196307 194131 191763 189960 188785 187851 187120 186878 187085 187389 187678
64199 187678 188117 188697 189251 189893 190910 192240 193660 195557 198809 203590 208874 213620 218152 223927 232039
64184 232039 242355 253943 265963 278029 289930 301198 311038 318677 323697 325892 324948 320607 313190
64171 313190 303557 292416 280048 266940 254256 243218 234178 226686 220311 214964 210481 206450 202563
64158 202563 198762 194949 191053 187566 185539 185559 186924 188304 189107 189740 190607 191437 191884 192381 193899 196941
64142 196941 201056 205334 209140 212376 215266 218040 220711 223069 224868 225951 226183 225413 223771 221888 220452
64127 220452 219423 218032 215860 213690 212863 213821 215643 217154 218170 219424 221561 224581 228289 232826 238480
64112 238480 245171 252524 260425 269166 278783 288583 297647 305756 313464 321218 328672 335010 339722 342921
64098 342921 345119 346967 349139 352236 356680 362629 369823 377556 385075 392179 399116 405639 410510 412443
64084 412443 411399 408444 404311 398705 391193 382206 372657 362931 352837 342408 332195 322654 313698
64071 313698 305063 296776 289033 281864 275222 269294 264431 260806 258371 257108 257073 258095 259679 261390 263191
64056 263191 265211 267233 268656 269082 268855 268921 270122 272612 275933 279594 283533 287994 293085 298693 304844
64041 304844 311878 320088 329368 339473 350472 362481 374908 386383 395762 402999 408834 413828 417942
64028 417942 420784 421810 420361 416068 409498 402180 395668 390589 386663 383474 380998 379447 378786 378494 377712
64013 377712 375614 371724 366007 358745 350374 341402 332396 323935 316525 310407 305376 300873 296482 292377
63999 292377 289117 286909 285292 283704 282232 281549 282099 283572 285250 286645 287720 288717 289994 291931 294723
63984 294723 298215 302073 306162 310559 315175 319609 323652 327785 332899 339422 346886 354525 362182 370452
63970 370452 379925 390445 401334 412292 423836 436709 451020 466291 482328 499709 519203 541007
63958 541007 564833 590587 618520 648720 680877 714815 751075 790856 835574 886623 945376
63947 945376 1013198 1091498 1181897 1286201 1405960 1541974 1694215 1862071 2044459 2239835
63937 2239835 2446286 2661567 2882796 3106127 3327061 3541135 3744076 3931181 4097038
63928 4097038 4236439 4345638 4422575 4466029 4475146 4449904 4391488 4301678 4182110 4034688 3862709
63917 3862709 3671102 3465441 3251031 3032800 2815195 2601603 2394272 2195352 2007782
63908 2007782 1834564 1677280 1535809 1409443 1297689 1200007 1115416 1042646 980304 926784
63898 926784 880518 840517 806314 777210 752054 729955 710636 693691 678010 662426 646593
63887 646593 630705 614737 598513 582286 566598 551692 537566 524429 512528 501719 491869 483604
63875 483604 477877 474709 473184 472887 474563 478927 485541 493462 502509 513104 525182 538025 551163
63862 551163 564776 579031 593495 607450 620532 632818 644446 655375 665409 674310 681880 688002
63850 688002 692601 695522 696529 695500 692619 688222 682345 674507 664106 651081 636034 619714 602576
63837 602576 584852 566716 548082 528595 508184 487492 467348 447916 428825 410090 392366
63826 392366 376198 361503 347996 335683 324662 314806 305958 298148 291344 285242 279555 274208 268964
63813 268964 263310 257167 251455 247384 245243 244250 243505 242655 241750 240983 240584 240534 240275 239130 237148 235102
63797 235102 233499 231946 229727 226694 223334 220202 217561 215434 213688 212118 210558 208910 207045 204861
63783 204861 202535 200484 198913 197626 196451 195608 195317 195238 194751 193783 192933 192650 192645 192329 191539 190555 189654 189023
63765 189023 188998 189898 191488 192953 193638 193614 193334 192967 192443 191981 192111 192984 194010 194435 194128 193571 193222 193130 193125
63746 193125 193141 193277 193718 194623 195975 197509 198928 200215 201645 203466 205705 208298 211189 214214 217069
63731 217069 219540 221692 223680 225526 227255 229121 231413 234074 236792 239524 242610 246286 250302 254252
63717 254252 258068 261947 265950 269856 273297 275780 276753 276041 274245 272375 270977 269805 268328 266280 263708
63702 263708 260887 258351 256644 255802 255403 255295 255897 257429 259217 260356 260917 261953 264291 267744 271577
63687 271577 275249 278600 281723 284908 288370 291820 294476 295758 295787 295057 293800 291904 289372 286659 284521
63672 284521 283541 283724 284590 285738 287212 289161 291288 293037 294296 295484 296778 297619 297221 295358 292457
63657 292457 289148 285879 282712 279332 275404 271052 266725 262556 258287 254004 250431 248031 246284 244348
63643 244348 242163 240288 238886 237645 236682 236737 238193 240471 242783 245072 247735 250716 253458 255722 258001
63628 258001 260918 264556 268655 273242 278631 284727 290816 296324 301498 306989 313034 319658 327502 337606
63614 337606 350120 363962 378202 393193 409798 428054 447381 467753 489799 513770 539154
63603 539154 565305 591737 617656 641827 663152 680925 694478 703185 707110 707179 704476 699740 693665
63590 693665 687105 680574 673909 666610 658149 647775 634651 618670 600746 581818 561954 540925
63578 540925 519316 498470 479484 462807 448606 436885 427205 418893 411701 405953 401974 399689 398841
63565 398841 399225 400605 402726 405559 409298 414022 419488 425383 431579 438107 445053 452544 460665 469336
63551 469336 478517 488678 500874 516161 534957 557067 582224 610384 641452 674824 709304 743317
63539 743317 775042 802327 822969 835544 840096 837878 830561 819963 808230 797437 788529 781009
63527 781009 773927 766779 759123 749901 737798 722048 702375 678541 650789 620596 590068 560381
63515 560381 531516 503620 477736 454724 434231 415387 398030 382633 369385 358065 348565 340819
63503 340819 334288 328193 322348 317234 313056 309235 305095 300714 296794 293889 292008 290846 290199 290085 290557
63488 290557 291433 292339 293095 293930 295144 296709 298478 300577 303237 306231 308919 310969 312698 314592 316891
63473 316891 319799 323566 327899 331645 333661 333951 333453 332753 331509 329199 325883 321934 317488 312622 307858
63458 307858 303972 301286 299488 298213 297464 297397 298029 299389 301732 305210 309377 313365 316710 319815 323446
63443 323446 327864 332657 337408 342314 348039 355095 363562 373346 384517 397268 411740 428057 446462
63430 446462 467080 489382 512004 533257 551811 566910 578234 585934 590796 594129 597370 601927
63418 601927 609304 620881 637262 658011 682331 709847 740379 773011 805840 836744 864138 886901
63406 886901 904005 914714 919083 917981 912624 904286 894341 884084 874109 863927 852514 839250 824135
63393 824135 806998 786910 762904 735299 705810 676062 646338 616247 586328 558280 533478
63382 533478 511842 492443 474723 458720 444485 431970 421425 413407 408187 405416 404451 404880 406703
63369 406703 410143 415281 421786 429218 437715 448045 460599 474604 488973 503818 520420 539622
63357 539622 560957 583738 608304 635549 665591 697541 730390 763456 795916 826392 853187
63346 853187 874751 890006 898681 901454 899566 894141 885985 875919 864883 853541 841953 829759
63334 829759 816549 802005 785778 767318 745867 720872 692743 663187 634429 607881 583627
63323 583627 561197 540529 522122 506578 494353 485833 481214 480057 480925 481551 479592 473536 463180
63310 463180 449368 433350 416412 399852 384835 371926 360839 350887 341747 333688 327065 321817
63298 321817 317614 314360 312198 310938 309794 308007 305669 303543 302018 300611 298656 296153 293593 291233
63284 291233 288931 286615 284445 282466 280439 278174 275840 273895 272814 272840 273712 274701 275187 275217 275176 275024 274384
63267 274384 273501 273446 274915 277220 279023 279856 280398 281354 282688 284066 285530 287416 289911 292990 296618 300677
63251 300677 304762 308387 311540 314842 319026 324261 330098 336053 342135 348821 356644 365862 376370 387850
63237 387850 400069 413150 427457 443122 459787 476938 494357 512037 529887 547865 566291
63226 566291 585569 605520 625375 644531 662940 680668 697632 714084 730903 748898 768043
63215 768043 787774 807669 827245 845332 860469 872061 880490 885838 887108 883217 874393 862032
63203 862032 847227 829925 809651 786740 762581 738732 715988 694443 674300 656323 641346
63192 641346 629573 620677 614514 611341 611200 613412 617084 622049 629092 639140 652324 667889 684941
63179 684941 703106 722335 742138 761428 779433 796576 813943 831830 849310 865462 880505
63168 880505 895181 909274 921439 930583 936832 940781 942110 939380 931147 917050 897864 874758 848676
63155 848676 820329 790530 760271 730317 700853 671856 643821 617807 594570 573878 554944
63144 554944 537382 521472 507664 496144 486800 479190 472558 466339 460755 456519 453822 451990 450367
63131 450367 449087 448591 448709 448802 448676 448893 450151 452653 456057 459741 463174 466376 469945 474323 479128 483613
63115 483613 487641 491672 495843 499731 503182 506677 510534 514306 517451 520130 522793 525277 526958 527671
63101 527671 527959 528418 529174 529979 530453 530215 529144 527572 526006 524689 523630 522921 522650 522599 522457 522340 522707
63084 522707 523607 524461 524805 524990 525856 527789 530346 532814 534990 537402 540794 545446 551022 557022 563222
63069 563222 569670 576513 584022 592535 602094 612333 623026 634600 647662 662176 677657 694270
63057 694270 713177 735520 761396 790121 821162 854508 890380 928973 970396 1014467 1060521
63046 1060521 1107643 1155130 1202628 1249907 1296743 1343075 1389033 1434694 1479965 1524885 1569942
63035 1569942 1615789 1662479 1709107 1754371 1797382 1837696 1874625 1906866 1932851 1951107 1960139
63024 1960139 1958483 1945472 1921795 1888877 1847778 1799137 1744131 1684843 1623489 1561682 1500750
63013 1500750 1442351 1388317 1339924 1297620 1261484 1231725 1208686 1192538 1183123 1180124 1183271 1192193
63001 1192193 1206172 1224346 1246298 1272134 1301709 1334037 1367796 1402151 1436646 1470517 1502802
62990 1502802 1533207 1562403 1591268 1620079 1648339 1674906 1698293 1717365 1731907 1742031 1746995
62979 1746995 1745146 1735229 1717182 1691438 1658103 1617306 1569895 1517323 1461103 1402672 1343377 1284233
62967 1284233 1225997 1169801 1117204 1069208 1025608 985750 949532 917119 888139 861796 837540
62956 837540 815038 793754 773223 753542 734953 717130 699571 682527 666718 652058 637425
62945 637425 621968 606108 591024 577542 565685 554896 544563 534554 525288 517082 509617 502466
62933 502466 495873 490427 486149 482576 479653 477768 476770 475801 474319 472665 471359 470473 469962 469908 470092 469912
62917 469912 469134 468188 467364 466280 464551 462440 460339 458110 455469 452540 449515 446168 442278 438198 434405
62902 434405 430842 427275 424029 421734 420444 419571 418588 417382 416086 415015 414626 415034 415668 415807 415335 414647
62886 414647 414075 413872 414387 415650 416933 417380 416997 416521 416421 416583 416829 417029 416780 415668 413957 412402 411294
62869 411294 410290 409278 408712 408866 409340 409593 409499 409153 408622 408136 408065 408407 408697 408690 408797 409608 411251 413343 415217
62850 415217 416132 415765 414716 414055 414170 414463 414401 414297 414703 415483 415914 415381 413742 411354 409037 407536 406732
62833 406732 405753 404153 402547 401722 401668 401890 402157 402386 402337 402024 402057 402884 404090 405090 406152 407911 410161
62816 410161 412100 413690 415822 418944 422353 425175 427466 430045 433670 438568 444307 449954 454769 458957
62802 458957 463411 468701 474692 481103 487819 494600 501136 507822 515864 526173 538416 551442 564425
62789 564425 577399 591145 606920 626007 649079 676005 706412 740299 778093 820434 868057
62778 868057 921444 980343 1043918 1111610 1183518 1259547 1338374 1417556 1494531 1567336 1634568
62767 1634568 1694970 1746955 1788400 1817089 1831641 1832022 1819168 1794281 1758439 1712539 1657511 1594857
62755 1594857 1526948 1456346 1384686 1312648 1241010 1171056 1103697 1039035 977301 919567 866765
62744 866765 818547 774017 733256 697170 665972 638715 614457 593046 574506 558366 543927
62733 543927 530771 518700 507619 497722 489402 482731 477271 472587 468579 465256 462569 460744 460363 461769
62719 461769 464565 468009 471729 475872 480754 486542 493191 500502 508419 517382 528267 541815 558217
62706 558217 577328 599091 623678 651345 682277 716513 754078 795338 841117 892063 947870
62695 947870 1007461 1070068 1135704 1204359 1275073 1346125 1415859 1482960 1546059 1603383 1652791
62684 1652791 1691969 1718790 1731891 1731003 1716691 1689856 1651564 1603138 1546117 1482126 1412949 1340603
62672 1340603 1267106 1194147 1123038 1054900 990650 930829 875535 824581 777698 734693 695475
62661 695475 659883 627573 598281 572144 549392 529593 511698 495142 480525 468685 459333 451137
62649 451137 443072 435050 427245 419515 411827 404705 398674 393523 388584 383653 379213 375769 373347 371724
62635 371724 370803 370577 370933 371708 372801 374017 374924 375119 374615 373753 372653 371025 368674 365997 363710 362130
62619 362130 361046 360359 360510 362030 364848 368401 372339 376789 381822 387044 392018 396866 402068 407721 413509
62604 413509 419522 426669 435824 446850 458942 471850 486205 502620 521095 541596 564622 590667
62592 590667 619451 650298 683083 718182 755455 793801 831721 867786 900457 928167 949987
62581 949987 965827 975641 978797 974660 963501 946365 924252 897827 867816 835175 800887 765949
62569 765949 731505 698577 667587 638450 611162 585899 562536 540563 519826 500975 484764
62558 484764 471055 458921 447740 437846 429937 424095 419565 415435 411328 407458 404209 401742 399864
62545 399864 398156 396259 394176 392267 390897 390183 390203 391254 393505 396396 398873 400414 401457 402491 403183
62530 403183 402942 402129 401967 403253 405831 409561 415092 423086 433091 443921 455067 467166 481091 497211
62516 497211 515714 537088 561753 589525 619919 652939 689131 728769 771187 814899 858179
62505 858179 899586 938268 973893 1006071 1033815 1055855 1071486 1080751 1083702 1079991 1069648 1053882
62493 1053882 1034568 1013066 990066 966594 944528 925886 911892 902835 898475 898390 902357 910828 924833
62480 924833 945088 971195 1001867 1035797 1072075 1109940 1148384 1185951 1220681 1250325 1272977
62469 1272977 1287724 1294625 1294032 1285985 1270132 1245974 1213172 1172017 1123962 1071640 1017939 964666
62457 964666 912126 860130 809348 761452 717957 679316 645319 615961 591447 571558 555575
62446 555575 542898 533265 526239 520959 516755 513793 512788 514187 517810 523104 529469 536385 543410 550051
62432 550051 555703 559861 562394 563370 562530 559313 553532 545699 536437 525905 514170 501884 490159 479783
62418 479783 470781 462636 454648 446354 438035 430744 425352 421514 417923 413677 409025 404683 400815 397016
62404 397016 393054 389241 386094 383898 382660 382272 382535 383117 383726 384421 385558 387305 389306 391021 392284
62389 392284 393312 394252 395040 395654 396195 396681 397145 397980 399808 402835 406680 410979 415790 421235 427177 433525
62373 433525 440408 447690 454769 461359 468147 476124 485491 495782 506871 519253 533364 549215 566838
62360 566838 586683 609413 635530 665225 698416 735046 775471 820233 869025 920098 971077
62349 971077 1020202 1066323 1108057 1143769 1172393 1193615 1207151 1212546 1209943 1200500 1185665 1166276
62337 1166276 1142527 1114496 1082585 1047806 1011855 976563 943029 911415 881603 853746 828175
62326 828175 805130 784729 767003 751776 738617 726828 715329 702802 688419 672410 655551
62315 655551 638156 619946 600792 581124 561695 543384 527069 513136 501102 490250 480500 472077
62303 472077 464615 457524 451153 446526 443701 441450 438966 436899 436128 436441 437113 438053 439600 441797 444610
62288 444610 448361 453246 458860 464819 471357 478667 486238 493633 501381 510133 519365 527982 535987 544537
62274 544537 554297 564673 574698 583881 592061 599277 606030 613014 620393 627816 635278 643438 653027 664480
62260 664480 678183 694454 713191 734208 758127 786288 819557 857709 900135 946350 995380
62249 995380 1045258 1093800 1139555 1181535 1218299 1247943 1269041 1281298 1285315 1281915 1271584 1254310
62237 1254310 1229945 1198797 1161802 1120138 1074848 1026905 977382 927401 878067 830585 786176
62226 786176 745654 709142 676341 647010 621188 599057 580686 565777 553633 543438 534599 526751
62214 526751 519587 512990 507284 502996 500216 498391 496826 495172 493358 491351 489182 487069 485353 484421
62200 484421 484655 486203 488730 491629 494626 497971 501958 506528 511508 516926 522868 529297 536342 544535
62186 544535 554251 564954 575499 585277 594720 604512 614686 624781 634477 643550 651401 657404 661916
62173 661916 666335 671671 677475 682780 687889 694645 704986 719757 738908 762103 788907 818988 852470
62160 852470 889545 929364 969746 1008375 1043731 1074495 1098846 1115395 1124620 1128405 1128040 1123321
62148 1123321 1113605 1098948 1079967 1057252 1031312 1002731 972153 940432 908938 879252 852267
62137 852267 827904 805953 786814 771061 758564 748440 739853 732536 726549 721762 717703 713857 710022
62124 710022 706315 702863 699685 696857 694582 692988 692123 692313 694130 697671 702210 706933 711601 715952 718923
62109 718923 719381 717506 714540 711134 706926 701929 697231 693654 690479 686322 680742 674236 667042 658886
62095 658886 649937 641279 634180 629220 626221 624712 624348 625107 627202 630778 635668 641492 647951 654997 662797
62080 662797 671524 681111 691311 702182 714329 728327 743967 760457 777306 794515 811945 829147
62068 829147 845956 862643 879194 895132 910513 926599 944919 965927 988908 1012789 1036499
62057 1036499 1058923 1079166 1096792 1111323 1121691 1126645 1125706 1119348 1108423 1093784 1076160 1055796
62045 1055796 1032224 1004885 974045 940760 906071 870644 835086 800048 765896 732636 700279
62034 700279 669036 639261 611513 586605 565125 546879 531179 517712 506750 498395 492013 486574
62022 486574 481336 476160 471401 467498 464444 461606 458287 454386 450284 446218 442145 438158 434527 431268
62008 431268 428103 424988 422336 420550 419649 419502 420133 421634 424008 427214 431083 435143 438863 442221 445664
61993 445664 449340 452749 455437 457594 459513 460685 460001 456924 452082 446600 441076 435331 428933 421770
61979 421770 414193 406805 400143 394426 389475 384888 380492 376577 373547 371288 369174 366841 364663 363088
61965 363088 361796 360032 357708 355619 354422 353928 353651 353577 354007 354909 355879 356586 356879 356615 355840 355089 355062 355835
61947 355835 356791 357608 359048 362412 368245 375897 384376 393346 403129 413963 425696 438212 451751 466476
61933 466476 481894 497017 511104 524008 535839 546599 556229 564712 571913 577581 581703 584652 586661
61920 586661 587258 585578 581288 574965 567530 559615 551626 544099 537655 532705 529541 528646 530526 535141 541829
61905 541829 549960 559303 569509 579643 588770 596815 604233 610783 615286 616825 615636 612463 607571 600976
61891 600976 593287 585514 578014 570200 561508 552264 543377 535532 528948 523623 519366 515525 511007 504894
61877 504894 497191 488817 480721 472973 464929 456308 447806 440468 434732 430348 427029 424778 423652 423538
61863 423538 424164 425108 425905 426499 427602 430281 435103 441897 450290 460112 471289 483727 497504 512879
61849 512879 529949 548467 568124 588775 610297 632328 654216 675109 694176 710976 725526
61838 725526 737671 746589 751369 752075 749655 744751 737310 727644 717164 707504 699433 693193 689424 688893
61824 688893 691420 695915 701590 708530 716887 726037 734820 742248 747675 750531 750222 746264 738464 727046
61810 727046 712637 695971 677602 658141 638722 620806 605228 591590 578815 566257 554158
61799 554158 543130 533412 524671 516402 508422 500930 494152 488099 482809 478530 475344 472646 469498 465670
61785 465670 461932 459040 456741 454202 451200 448372 446329 445043 444186 443585 443058 442212 440789 439049 437432
61770 437432 436013 434651 433564 433289 434029 435404 436976 438699 440731 443096 445682 448373 450975 453267 455297
61755 455297 457426 459884 462503 465105 467851 470907 473979 476532 478302 479200 478908 477066 473864 470014 466103
61740 466103 462316 458740 455429 452137 448503 444687 441324 438678 436358 434158 432588 432163 432633 433504 434872
61725 434872 437078 439770 442095 443793 445377 447089 448399 448919 449256 450514 453101 456393 459378 461415 462493
61710 462493 463070 463588 463977 463681 462292 460071 457685 455557 453625 451638 449423 446851 443793 440226 436362
61695 436362 432603 429353 426802 424811 422972 420873 418350 415495 412446 409191 405556 401408 396905 392561
61681 392561 388967 386295 384098 381690 378829 375948 373635 371889 370126 367996 365952 364664 363997 363070 361507
61666 361507 360123 359842 360294 360186 359066 357962 357987 359002 360154 361259 362894 365305 367966 370277 372173
61651 372173 373867 375464 377014 378569 380005 381127 382112 383442 385231 387047 388642 390337 392280 393873
61637 393873 394620 395181 396702 399168 401207 401660 400647 398915 396896 394791 392918 391376 389751 387677 385366
61622 385366 383086 380443 376841 372559 368735 366228 364944 364327 363999 363716 363128 361887 359876 357141 353731
61607 353731 349695 345158 340373 335709 331451 327472 323311 318846 314692 311535 309229 307032 304671 302560
61593 302560 300868 299059 296733 294414 292971 292505 292222 291273 289384 286832 284142 281739 279583 277285 274774
61578 274774 272630 271411 270854 270206 269190 268179 267449 266859 266350 266233 266662 267313 267901 268648 269806 271040 271841
61561 271841 272396 273481 275386 277485 279055 280115 281134 282262 283274 284144 285195 286632 288219 289579 290596
61546 290596 291428 292311 293468 295015 296780 298269 299014 298925 298321 297665 297307 297323 297484 297522 297522 297926 299023 300575
61528 300575 302056 303076 303430 302990 301880 300637 299798 299341 298827 298063 297260 296526 295621 294366 292964 291740
61512 291740 290814 290200 289980 290131 290405 290598 290812 291236 291811 292285 292459 292251 291671 290971 290654 291039 291872 292575 292856
61493 292856 292894 292980 293157 293192 292785 291897 291013 290948 292074 293783 295024 295445 295800 297134 299785 303241 306744 309798
61475 309798 312273 314342 316387 318770 321533 324324 326695 328458 329741 330692 331199 331014 330151 329082 328355
61460 328355 328041 327630 326607 325020 323382 322061 320992 320082 319555 319587 319724 319164 317735 316211 315420 315319 315278
61443 315278 315031 314909 315185 315628 315824 315677 315489 315673 316425 317571 318756 319913 321408 323529 326011 328299
61427 328299 330073 331200 331451 330834 330092 330237 331434 332830 333598 333675 333492 333641 334923 337918 342071 345840
61411 345840 348244 349743 351136 352272 352579 352327 352404 353028 353528 353354 352580 351347 349514 347002 344039 341030
61395 341030 338570 337430 337964 339492 340841 341478 341630 341487 341052 340758 341292 342562 343681 344338 345307 347086
61379 347086 348858 349617 349696 350264 351721 353546 355551 358201 361551 364791 367270 369326 371654 374353 377092
61364 377092 379805 382611 385194 386903 387606 388007 388878 390238 391611 392920 394706 397358 400443 403118 405183
61349 405183 407442 410962 416067 422093 427945 432748 436121 438110 439010 439191 438981 438671 438593 439144 440552 442610
61333 442610 444738 446429 447613 448476 449033 449106 448667 447803 446328 443839 440471 437198 434932 433552 432330 431140
61317 431140 430646 431293 432793 434802 437536 441353 446203 451948 458827 467073 476315 485945 496023 507304
61303 507304 520340 534958 550616 566692 582168 595572 605742 612644 617172 620172 621779 621509 618786
61290 618786 613459 606082 597680 589029 580165 570751 560850 551003 541489 531941 521981 512077 503365 496666
61276 496666 491922 488587 486189 484442 483118 482161 481813 482400 483900 485782 487336 488199 488712 489712 491793
61261 491793 494741 497868 500962 504651 509786 516645 524765 533150 540468 545567 548300 549651 550637 551324 551363
61246 551363 551139 551583 552811 553763 553482 552115 550234 547770 544295 540085 536225 533594 532142 531215 530227 528994
61230 528994 527727 526900 526999 528257 530643 534049 538340 543250 548450 553882 559932 567162 575770 585310 594969
61215 594969 604118 612606 620504 627792 634430 640610 646628 652526 658140 663483 668714 673621 677545 680162
61201 680162 682023 684003 686492 689549 693627 699486 707323 716563 726741 738177 751332 765722 779871
61188 779871 792268 802151 809501 814641 817984 819918 820743 820665 819789 818011 815017 810658 805337 799721 793931
61173 793931 787270 779055 769556 759773 750292 740748 730526 719676 708937 699004 689993 681415 672417
61160 672417 662235 650773 638804 627338 616719 606505 596277 586297 577268 569671 563556 558832
61148 558832 555487 553479 552571 552357 552403 552300 551578 549702 546325 541652 536477 531679 527628 524150 520992 518212
61132 518212 516119 515024 515101 516360 518661 521841 525937 531250 538111 546558 556270 566852 578283 591111
61118 591111 606097 623570 643205 664556 687572 712330 738368 764721 790696 816298 841738
61107 841738 866850 891263 914792 937352 958616 978144 995670 1010903 1023164 1031702 1036492 1038226
61095 1038226 1037310 1033246 1025359 1013829 999621 983542 965838 946625 926218 904899 882869 860709
61083 860709 839510 820119 802436 785831 770134 755830 743329 732438 722692 713840 705916 699144
61071 699144 694003 691118 690808 692733 696168 700570 705802 711907 718840 726460 734816 744394 755923 769705
61057 769705 785200 801506 818174 835380 853482 872851 894087 917780 943883 971765 1001129
61046 1001129 1032340 1065558 1100105 1135247 1171283 1209252 1249712 1292203 1335763 1379506 1422867
61035 1422867 1465761 1508603 1551880 1595640 1639447 1682599 1724292 1763997 1801959 1838896 1874886
61024 1874886 1909053 1940832 1971029 2000966 2031104 2061332 2092304 2125643 2163108 2206377 2257346
61013 2257346 2317536 2387233 2466291 2555958 2659344 2780678 2925679 3102910 3323607 3600215
61003 3600215 3946841 4381950 4929381 5615871 6468009 7510446 8762991 10235633 11924036
60994 11924036 13803480 15813299 17834590 19687127 21172775 22154981 22622051 22687110 22530032
60985 22530032 22328916 22216770 22257480 22422132 22576232 22511383 22028271 21025796 19537209
60976 19537209 17697752 15680818 13647532 11723616 9992259 8493739 7232397 6189977
60968 6189977 5338204 4645912 4082850 3622849 3245328 2934078 2675408 2457658 2271396
60959 2271396 2109228 1965731 1837735 1723771 1622524 1532051 1450645 1377793 1313733 1258421
60949 1258421 1211166 1170737 1135326 1102723 1071066 1039486 1007940 976711 946239 917080 889658
60938 889658 864008 839826 816703 794354 772855 752585 733753 716095 699261 683310 668451
60927 668451 654547 641399 629366 619015 610172 602017 594235 587393 581935 577519 573691 570648 568742
60914 568742 567574 566117 563658 560360 556983 554269 552467 551325 550540 550099 549936 549517 548284 546533 545255
60899 545255 544989 545322 545626 545717 545530 544726 542980 540210 536275 530965 524626 518234 512360 506462 499652 491804
60883 491804 483452 475030 466733 458799 451323 444044 436818 430083 424278 419096 413954 409009 404988 402062
60869 402062 399665 397541 396232 396280 397493 399374 401741 404493 407161 409268 411080 413538 417344 422293 427531
60854 427531 432305 436416 440129 443794 447609 451654 456004 460668 465435 469883 473604 476451 478551 480088
60840 480088 480970 480691 478680 474921 470153 465291 460688 456021 450867 445251 439652 434652 430521 427010 423534
60825 423534 419775 416160 413545 412251 411531 410182 407654 404328 400735 396816 392224 387105 382133 377733
60811 377733 373635 369403 365094 361079 357456 354002 350622 347455 344520 341627 338723 336050 333799 331906
60797 331906 330287 329052 328250 327552 326518 325150 324002 323638 324064 324732 325156 325447 326172 327632 329490 331241
60781 331241 332872 334780 337123 339612 341970 344286 346768 349424 352107 354666 356844 358282 358887 359130 359731
60766 359731 360991 362586 363958 364792 365116 365057 364630 363791 362630 361387 360213 358966 357339 355184 352702 350362
60750 350362 348573 347323 346145 344672 343253 342683 343222 344210 344910 345308 345661 345665 344664 342552 339840 336844
60734 336844 333427 329575 325692 322134 318942 316141 313856 311931 309942 307858 306285 305716 305861 306035 305939
60719 305939 305765 305706 305726 305814 306178 307089 308497 309891 310737 311167 311932 313506 315567 317669 319954 322582 324947
60702 324947 326394 327506 329591 332834 335994 338227 340075 342261 344523 346304 347663 348724 348999 348158 346864
60687 346864 345977 345391 344491 343253 342016 340640 338872 337271 336755 337373 338389 339449 340738 342102 343045 343606
60671 343606 344287 344952 344732 343406 342010 341637 342162 342500 341669 339372 336048 332642 329936 327840 325708 323386
60655 323386 321422 320132 319156 318234 317849 318674 320793 323794 327208 330541 333273 335237 336742 338030 338915
60640 338915 339217 339172 339035 338561 337251 334948 331902 328454 324953 321792 319195 317124 315540 314546 314068 313705
60624 313705 313170 312672 312543 312751 313104 313654 314457 315117 315133 314700 314683 315631 317167 318480 319143 319296 319277 319344 319674
60605 319674 320429 321726 323497 325340 326618 326937 326631 326623 327596 329334 330969 331969 332734 334132 336488 339220
60589 339220 341519 343232 344875 346841 348812 350025 349978 348889 347602 347095 347840 349404 350727 351050 350697 350819
60573 350819 352280 354857 357715 360601 364308 369818 377201 385706 394812 404776 415967 427937 439434
60560 439434 449243 456835 462336 466055 468029 467964 465687 461599 456481 450829 444772 438809 434142 431763 431421
60545 431421 432002 432879 434412 437167 441233 446595 453670 462997 474507 487498 501400 516346 532777
60532 532777 550507 568333 584670 598528 609723 618212 623568 625266 623272 618128 610619 601542 591650
60519 591650 581562 571772 562792 555058 548577 542957 538056 534309 532103 531095 530563 530194 530109 530328 530854
60504 530854 532282 535829 542595 553030 566973 583911 603378 625631 651820 682904 718460 757101
60492 757101 797936 840802 884966 928512 969432 1006706 1039857 1067977 1089646 1103394 1107879 1102149
60480 1102149 1086312 1061661 1029684 991291 947370 899646 850284 800932 752731 707005 665109
60469 665109 627551 593972 564115 538232 516339 497699 481398 467075 454695 443969 434492 426248
60457 426248 419498 414071 409191 404181 399058 394197 389664 385232 381020 377624 375371 373724 371773 369235
60443 369235 366640 364584 363103 361860 360598 359239 357788 356393 355378 354950 354837 354371 353061 351098 349238
60428 349238 348130 347791 347790 347818 347779 347350 345939 343444 340825 339418 339782 341457 343692 345951 347874 349308 350467
60411 350467 351616 352547 352867 352849 353446 355179 357500 359517 360928 361965 362820 363538 364243 365110 366268 367932
60395 367932 370367 373505 376800 379700 382080 384121 386108 388489 391638 395271 398531 401010 403221 405634
60381 405634 407811 409182 410230 412008 414560 416775 417937 418639 419801 421475 423109 424578 426336 428669
60367 428669 431211 433276 434503 435198 436124 437820 440018 441861 442854 443457 444585 446642 449329 452355 455985
60352 455985 460747 466767 473636 480826 488018 495035 501724 508003 513805 518783 522270 523773 523409 521632
60338 521632 518685 514652 509982 505482 501654 498307 495008 491657 488400 485233 481942 478364 474485 470277
60324 470277 465632 460586 455616 451543 448876 447177 445408 443139 441142 440425 441044 442403 444483 447986 453246
60309 453246 459773 467095 475327 484638 494828 505819 517836 530564 542726 553165 561887 569366 575214
60296 575214 578345 578176 574918 568776 559736 548226 535337 522168 509386 497464 486938 478262 471708
60283 471708 467314 464588 462417 459825 456857 454304 452601 451459 450497 449530 448186 445961 442972 440049 437686
60268 437686 435393 432483 429159 426288 424339 422974 421546 419616 416998 413726 410091 406539 403391 400688
60254 400688 398287 396077 394185 393001 392871 393702 394920 395908 396459 396860 397599 398916 400488 401637 401995 401891
60238 401891 401860 401910 401682 401256 401232 401805 402284 401997 401316 401234 402065 403164 404013 405049 407107 410417 414472 418634
60220 418634 422478 425720 428333 430797 433813 437549 441533 445546 450216 456300 463574 471010 478045 485116
60206 485116 492802 500971 509055 516762 524119 531075 537478 543349 548818 553864 558432 562717 567040 571349
60192 571349 575085 577644 578951 579512 579895 580074 579345 577137 573887 570788 568468 566233 562838 557774 551550
60177 551550 544973 538547 532465 526769 521457 516580 512202 508211 504372 500741 497703 495373 493217 490660
60163 490660 487866 485547 484115 483393 482989 482554 481776 480566 479287 478423 478057 477953 478113 478831 480188 481806
60147 481806 483162 483962 484321 484801 486004 487833 489381 490074 490681 492537 495924 499933 503981 508667 514779
60132 514779 522101 529644 536615 542766 548149 553009 557779 562765 567823 572448 576173 578885 580963 583109
60118 583109 585806 588934 592164 595630 599788 604628 609558 614234 618921 623750 628107 631154 632579 632457
60104 632457 630696 627197 622405 617260 612562 608617 605346 602392 599187 595337 591009 586774 583043 579813
60090 579813 576999 574786 573528 573327 573759 574039 573567 572346 570857 569545 568544 567786 567137 566385 565330 564010
60074 564010 562611 561031 558717 555092 550063 544052 537627 531215 524990 518916 512919 507003 501198 495517
60060 495517 490061 484988 480113 474811 468762 462737 458034 455083 453137 451519 450546 450753 451728 452402 452369 452415
60044 452415 453716 456891 461845 468091 475062 482244 489207 495555 500956 505322 508937 512300 515806 519546
60030 519546 523231 526329 528428 529497 529655 528750 526495 523054 519068 514852 509884 503473 495665 487077 477989
60015 477989 468115 457385 446546 436738 428608 422043 416646 412219 408688 405820 403265 400937 399116 398027
60001 398027 397443 396857 395964 394816 393685 393006 393292 394742 396925 399126 400991 402569 403869 404815 405724 407337
59985 407337 410207 414298 419235 424565 429617 433611 436268 438091 439761 441342 442206 441579 439101 435184 430902
59970 430902 427217 424116 420863 417185 413779 411373 409824 408597 407732 407773 408946 410966 413550 416568 419681
59955 419681 422335 424312 425908 427373 428368 428229 426685 424303 422273 421663 422709 424750 426932 428936 430948
59940 430948 433005 434634 435243 434736 433540 431990 429897 427001 423794 421475 420881 421778 423506 425975 429552
59925 429552 434198 439366 444709 450252 455809 460827 464973 468320 470779 471935 471704 470582 468959 466804
59911 466804 464379 462649 462440 463608 465429 467346 468945 469876 470459 471858 474792 478368 480895 481626 481052
59896 481052 479868 478483 477386 477050 477387 478015 479106 481303 484784 489117 494106 500028 506849 513988 521109
59881 521109 528483 536230 543845 550927 557811 564964 572146 578712 584461 589724 594730 599260 602815 604807
59867 604807 604713 602394 598342 593458 588548 583957 579538 574917 569997 565268 561421 558593 556236 553798 551252
59852 551252 548821 546491 544175 542240 541661 543538 548358 555515 563491 570830 577061 582515 587268 590693
59838 590693 592251 592328 591909 591722 592092 593331 595611 598367 600384 600716 599293 596529 592724 588112 583157 578412
59822 578412 574142 570384 567269 564862 562665 559730 555518 550440 545313 540500 535839 531192 526644 522251
59808 522251 517996 514034 510597 507581 504556 501337 498208 495429 492904 490619 489013 488400 488224 487366 485261
59793 485261 482318 479196 476059 472727 469303 466307 464268 463327 463208 463390 463254 462287 460450 458399 457072
59778 457072 456781 456805 456163 454826 453911 454577 456927 460105 463260 466258 469530 473381 477526 481328 484448 487069
59762 487069 489410 491341 492790 494268 496541 499840 503857 508349 513227 518156 522774 527401 532805 539039
59748 539039 545192 550599 555656 561047 566786 572457 577797 582591 586582 590065 593917 598340 602137 603983
59734 603983 604030 603485 602988 602328 601379 600346 599164 597640 596243 595910 596921 598595 600150 601165 601250 600113
59718 600113 598188 596459 595347 594377 593128 591885 591006 590222 588984 587122 584858 582512 580479 579203 578919
59703 578919 579547 580880 582618 584265 585437 586314 587444 588985 590529 591731 592818 594391 597013 600880 605482
59688 605482 609659 612408 613625 613786 613166 611928 610638 609828 609117 607592 605142 602627 600650 598944 597057
59673 597057 594737 591439 586537 580456 574636 569749 564840 558902 552562 547352 543926 541831 540572 539973
59659 539973 539767 539680 539893 540807 542450 544586 547215 550478 554246 558328 562796 567613 572148 575659 578083
59644 578083 579747 580500 579774 577421 573837 569262 563641 557247 550759 544503 538174 531647 525615 521043 518206
59629 518206 516600 515571 514714 513784 512666 511510 510581 509748 508252 505324 501080 496501 492343 488392 484102
59614 484102 479655 475840 472961 470531 468139 466004 464361 462935 461537 460801 461664 464125 466943 468648 468739
59599 468739 468055 468113 469863 472751 475130 475770 474900 473719 473189 473460 474123 474609 474570 474206 474060 474267 474215 473270
59581 473270 471641 470134 469168 468431 467451 466132 464628 462942 460849 458172 455074 452010 449286 446789 444335
59566 444335 442216 440980 440636 440508 440042 439361 438839 438548 438436 438608 439027 439274 439026 438580 438491 438909 439635 440597
59548 440597 441879 443422 445117 447057 449340 451802 454382 457682 462747 470237 480078 491853 505267 520231
59534 520231 536655 554016 570831 584690 593262 595532 592188 585130 576661 568751 562464 557965 555133
59521 555133 553979 554348 555569 556797 557597 557927 557731 556818 555013 552146 548030 542716 536628 530184 523428
59506 523428 516297 509090 502400 496649 491835 487586 483377 478962 474692 471096 468038 464815 461299 458354
59492 458354 456720 456066 455712 455725 456554 457988 459335 460529 462234 464890 468286 472024 475806 479329 482530
59477 482530 485957 490275 495337 500279 504528 508188 511462 514282 516579 518340 519349 519426 518982 518770 518993
59462 518993 519244 519344 519530 519696 519267 518362 518395 520863 525824 532086 538640 545400 552630 560185 567522 574265
59446 574265 580539 586637 592323 596631 598570 597916 595139 590687 584733 577636 570196 563229 556996 551213
59432 551213 545511 539954 535149 531732 529634 528093 526652 525850 526599 529117 532972 537920 544182 552034 561744
59417 561744 573785 588468 605333 623517 642766 663459 685602 708541 731768 754961 776601
59406 776601 793357 801863 801156 793049 780493 766172 752432 741549 735378 734742 739220 747347 756702
59393 756702 763923 765298 758399 743695 724385 704205 685397 668706 654551 643332 634850 628362
59381 628362 623419 620055 618141 617161 616786 616985 617477 617747 617814 618295 619352 620278 620525 620506 620877 621626 622415 623220
59363 623220 623947 623919 622650 620925 620279 621375 623542 625937 628513 631732 635922 641241 647925 656211 666057
59348 666057 677090 688793 700864 713496 727197 742049 757306 772029 786044 799821 813354
59337 813354 825660 835718 843535 849802 854586 856893 855701 851038 843757 834556 823736 811741 799268
59324 799268 786584 773255 758970 744310 730258 717195 704872 693160 682259 672220 662776 653749
59312 653749 645135 636747 628232 619614 611413 604081 597680 592226 587959 585118 583810 584310 587071 592208
59298 592208 599266 607732 617510 628576 640264 650916 658101 659369 653523 641535 625977 609214 592321
59285 592321 575750 560459 547891 539003 533682 530996 529821 529437 529769 531106 533586 537235 542436 549900
59271 549900 559880 571758 584605 597805 610956 623567 635331 646429 657109 667008 675148 680559
59259 680559 682799 682118 679279 675044 669659 663055 655601 648248 641717 635975 630849 626681 623879 622141
59245 622141 620753 619536 618980 619484 620997 623474 627213 632510 639185 646566 653822 660317 665843 670560 674690
59230 674690 678320 681563 684582 687175 688494 687555 684092 678689 672063 664498 655991 646638 636703 626444
59216 626444 616103 606025 596618 588072 580186 572641 565488 559234 554256 550306 546747 543241 539981 537315
59202 537315 535397 534193 533551 533224 532990 532776 532550 532262 532149 532912 535131 538499 542098 545435 548802 552549
59186 552549 556570 560652 564896 569520 574567 580036 585990 592314 598673 604821 610661 615914 620161 623348
59172 623348 625859 627916 629359 630192 630840 631603 632299 632772 633338 634322 635522 636425 636676 636030 634230 631264 627463
59155 627463 623038 617821 611672 604794 597402 589494 581195 572858 564546 555906 546927 538298 530606 523651
59141 523651 517000 510759 505264 500452 496021 491827 487703 483431 479386 476615 475540 475139 474192 472893 472378
59126 472378 473083 474556 476611 479588 483462 487697 492091 496975 502480 508368 514727 522034 530327 538977
59112 538977 547464 555845 564300 572791 581250 589541 597208 603870 609899 615914 621477 625123 626153 625718
59098 625718 625606 626442 627539 628082 627843 626989 625693 624019 621988 619775 617825 616499 615608 614616 613370 612252
59082 612252 611481 610599 608888 605963 601759 596239 589417 581579 573270 565123 557590 550674 543961 537222 530888
59067 530888 525550 521071 516731 512362 508735 506530 505348 504149 502337 500063 497640 495125 492487 489931
59053 489931 487899 486651 485821 484552 482329 479580 477141 475290 473803 472910 473408 475477 477987 479548 479931
59038 479931 479876 479802 479391 478474 477650 477690 478741 480489 482823 485923 489752 493910 498198 502994 508848 515903
59022 515903 524025 533317 544033 555943 568252 580366 592347 604247 615320 624314 630469 633880
59010 633880 634970 633978 631043 626542 621196 615890 611327 607783 605242 603805 603809 605467 608613 612893 618008
58995 618008 623609 629223 634470 639129 642905 645412 646570 646722 646190 645073 643639 642369 641300 639834 637655
58980 637655 635359 633680 632603 631837 631718 632844 635189 638451 643076 649977 659200 669625 680184 690747
58966 690747 701765 713662 726697 740723 754891 768112 779981 790828 800742 809101 815200 818908
58954 818908 820458 819942 817121 811475 802470 790130 775424 759788 744341 729723 716274 703821 691565
58941 691565 678895 666255 654686 644654 635944 628371 621785 615640 609526 604098 600468 598629 597477
58928 597477 596468 596142 596779 597719 598524 599733 601728 603758 604858 605115 605276 605626 605948 606131 606186 605982 605500
58911 605500 605027 604749 604540 604518 605239 606997 609497 612657 617094 623270 630775 639093 648457 659190 670751
58896 670751 682281 693726 705585 717793 729713 741112 752443 764335 777494 792879 811028
58885 811028 831123 851495 871252 890673 909758 927128 940956 950668 957185 961548 963712 962788 958337
58872 958337 951163 942755 934007 924702 914230 902567 890403 878568 867521 857311 847792 838836 830351
58859 830351 822090 813632 804742 795630 786564 777318 767384 756723 745911 735572 726055 717589 710232
58846 710232 703526 696759 689642 682332 674823 666954 659084 651958 645652 639331 632367 624978 617413 609290
58832 609290 600402 591591 584129 578535 574478 571379 568635 565725 562779 560781 560658 562361 565160 568475
58818 568475 571980 575366 578622 582330 587144 593061 599528 606019 612280 618373 624646 631207 637198 641234
58804 641234 642904 643161 642816 641508 638726 634997 631130 626965 621877 616009 610024 604046 597830 591577 585607
58789 585607 579559 573019 566635 561513 557686 554353 551537 550204 550691 552268 554519 557962 562826 568234
58775 568234 573178 577508 581421 584609 586430 586378 584088 579455 573151 566407 559906 553333 546313 539178 532486
58760 532486 526396 521019 516802 513994 512136 510643 509571 509349 509969 510935 511846 512653 513485 514509 515850 517322
58744 517322 518441 519015 519663 521447 524949 529798 535019 539770 543911 548006 552734 558173 563712 568608 572511
58729 572511 575548 578223 581249 585135 589704 594217 598101 601461 604834 608649 612951 617496 622020 626588
58715 626588 631678 637760 644786 652288 659876 667364 674437 680650 685841 690169 693483 694926 693421 688484
58701 688484 680496 670367 659002 646788 633383 618252 601642 584852 569257 555192 542075 529560
58689 529560 518131 508445 500495 493743 487839 482692 477924 472841 467220 461686 456873 452550 448124 443797
58675 443797 440554 438972 438683 439122 440215 442089 444672 447909 451934 456605 461342 465839 470688 476852 484664
58660 484664 493556 502486 510365 516377 520227 521981 521597 518966 514519 509208 503645 497823 491937 486733
58646 486733 482454 478135 472746 466631 461073 456780 453550 451106 449456 448549 448326 448991 450641 452797 454963
58631 454963 457441 460784 464587 467623 469201 469624 469363 468540 467334 466074 464686 462748 460372 458506 458081
58616 458081 459345 462171 466480 471986 477979 483720 488936 493770 498409 502755 506298 508383 508899 508575 508307
58601 508307 508381 508720 509521 510979 512485 512950 512108 510892 510223 509890 509020 507357 505764 505460 506890 509470 512553
58584 512553 516538 522591 531166 541335 551843 562228 572456 582109 590698 598350 605382 611527 616442
58571 616442 620751 625758 632166 639808 648459 658235 669446 682861 699855 721249 746015 772053 798292
58558 798292 825094 852537 879296 903464 923663 939074 949233 954248 954746 951449 945248 937584 929945
58545 929945 922864 916033 909373 903168 897097 890045 881105 870042 856681 840717 822358 802368 781263
58532 781263 759269 737303 717037 699598 684901 672517 662369 654172 647063 640371 634214 628923
58520 628923 624437 620602 617455 614812 612053 608700 604862 600976 597501 594869 593169 591892 590536 589381
58506 589381 588919 588746 588018 586914 586456 586792 586923 586398 585954 585959 585598 584321 582985 582679 583348 584384 585726 587521
58488 587521 589511 591628 594515 598669 603703 609245 615903 624531 635107 647119 660497 675322 691128
58475 691128 707286 723685 740267 756223 770304 781506 788893 791350 788409 781073 771157 760104
58463 760104 748928 738710 730208 723317 717722 713956 713080 715438 720348 726987 735084 744783 756238 769204
58449 769204 782729 795318 805634 812864 816368 815516 810222 801278 789814 776786 763154 750032 738197
58436 738197 727770 718602 710690 704045 698707 695110 693939 695324 698664 703393 709418 716599 724481 732803
58422 732803 741667 750912 759871 767961 774979 780663 784577 786477 786136 782855 776164 767016 757250 747712
58408 747712 738063 728568 720553 714573 709518 704359 699541 695843 692975 690269 687822 686084 685224 685641 688000
58393 688000 691889 695541 697994 700518 704770 710386 715608 719548 722598 725207 727533 729994 733117 737035
58379 737035 741809 747920 755768 765066 775080 784850 792975 798302 801469 804741 809565 815292 820946 826916
58365 826916 833951 841725 849641 858068 867601 878043 889197 901634 915462 929307 941751 952863
58353 952863 963109 971802 978035 982200 985173 986880 987089 986808 987361 988804 990603 993087 996810 1001348 1006232
58338 1006232 1012285 1020473 1030210 1040368 1051155 1063318 1076323 1089131 1102170 1116701 1132659 1148832
58326 1148832 1164619 1179868 1193476 1204119 1212181 1219200 1225649 1230850 1234794 1238294 1241507 1244033 1246472
58313 1246472 1250310 1256185 1263470 1271472 1279919 1288620 1297889 1308869 1322240 1337088 1352227 1367849 1384561
58300 1384561 1401677 1418109 1434222 1451109 1468682 1486226 1504163 1523503 1543976 1564382 1584344
58289 1584344 1604254 1624202 1644440 1665992 1689120 1712160 1733626 1754393 1775895 1797354 1817014
58278 1817014 1835037 1852884 1870860 1888760 1908034 1930750 1957143 1986572 2019919 2058526 2101697
58267 2101697 2147946 2197757 2252294 2310378 2369755 2430452 2493777 2558908 2623828 2688823 2755540
58256 2755540 2823201 2889375 2954085 3019529 3086117 3152443 3218946 3287949 3360229 3435130 3513816
58245 3513816 3598716 3689973 3786112 3887775 3996911 4112807 4233170 4358870 4493186 4636613
58235 4636613 4786978 4944527 5112159 5290690 5478864 5678148 5892453 6122850 6367676
58226 6367676 6628136 6908562 7210971 7534881 7882737 8259750 8668093 9107396 9581410
58217 9581410 10097960 10662004 11275539 11944793 12680437 13490509 14381131 15364996 16460978
58208 16460978 17685060 19051414 20584252 22319588 24295171 26551153 29144726 32155039
58200 32155039 35674847 39815095 44727538 50617538 57741302 66416966 77050367 90129266
58192 90129266 106165339 125619766 148834791 175948605 206792136 240791449 276824059
58185 276824059 312946242 346140701 372530308 388346928 391277834 381325916 360626017
58178 360626017 332461645 300192071 266595377 233673573 202727766 174524301 149446025
58171 149446025 127588849 108830160 92910779 79518984 68334427 59034298 51303799
58164 51303799 44861904 39474030 34943104 31103316 27825357 25014057 22593232 20496985
58156 20496985 18673360 17083615 15692399 14464728 13373567 12401653 11532714 10747723
58148 10747723 10032106 9379622 8786002 8244420 7749403 7299200 6891149 6519290 6178778
58139 6178778 5868166 5585298 5325124 5083351 4858126 4646604 4444064 4248244 4060778
58130 4060778 3882870 3713200 3551378 3399483 3258459 3126425 3002020 2886053 2778493
58121 2778493 2677188 2580986 2490934 2407079 2327242 2250344 2177857 2110626 2047151 1986245 1928446
58110 1928446 1873555 1819825 1766979 1717183 1671601 1628742 1587605 1549733 1516543 1487181 1460464
58099 1460464 1436392 1414199 1391383 1366478 1340725 1315508 1290137 1263601 1236352 1208812 1180109
58088 1180109 1149921 1119851 1091440 1064484 1038625 1014879 994091 975307 957029 938868 920936
58077 920936 903038 885424 868896 853195 836794 819165 801715 785677 770717 756454 743498
58066 743498 731890 720350 708331 697153 687878 679602 671176 663055 656083 649822 643423 636849 629948
58053 629948 621641 611436 600632 590736 581743 573143 565419 559185 553915 548830 544171 540295 536442 531716
58039 531716 526561 522020 518121 514115 509763 505336 500838 496033 490771 484661 477057 467996 458473 449229
58025 449229 440064 430816 422014 414009 406465 399405 393637 389360 385432 380931 376463 373025 370499 368219
58011 368219 366054 363980 361394 357901 354073 350474 346708 342309 337875 334313 331572 328991 326326 323610
57997 323610 320598 317258 314318 312576 312050 312360 313405 315213 317712 321070 325498 330351 334355 337170 339711
57982 339711 342411 344359 344849 344483 343849 342366 339608 336664 334799 333603 331807 329283 326993 325520 324877
57967 324877 325208 326398 327418 327257 326305 325747 325912 326212 326416 326887 327658 328165 327857 326423 323643 319754 315705
57950 315705 312336 309506 306607 303597 300985 299168 298345 298618 299552 300145 299920 299702 300688 303219 306970 311704
57934 311704 317153 322728 328165 333941 340386 346861 352489 357044 360387 361813 360941 358629 355915 352570
57920 352570 347770 341722 335499 329562 323551 317335 311153 304871 298191 291606 286242 282611 280222 278396
57906 278396 276876 275683 274954 274832 275086 275097 274630 274145 273928 273529 272711 272230 272829 274097 275341 276973 279915
57889 279915 284047 288357 292317 295961 298943 300799 302035 303805 306487 309600 313000 317008 321298 324801
57875 324801 326847 327529 326894 324855 321984 319310 317062 314549 311521 308665 306446 304363 301859 299176 296799
57860 296799 294644 292293 289686 287261 285741 285880 287947 291346 295094 298724 302295 305646 308309 310271
57846 310271 312207 314738 317856 321089 323801 325388 325747 325608 325862 326518 326818 326399 325766 325529 325743 326127 326484
57829 326484 326781 327199 328082 329393 330270 329735 327963 326377 326265 327604 329266 330068 329650 328631 327990 328146 328729
57812 328729 329259 329590 329424 327938 324397 318776 311335 302159 291722 281305 272010 263753 256018 249115
57798 249115 243744 239725 236270 233236 230976 229133 226811 224017 221751 220496 219689 218920 218549 218793 219232
57783 219232 219751 221108 223977 227974 232098 235711 238817 241850 245409 249765 254534 259199 263806 268531
57769 268531 272787 275745 277695 279816 282299 283747 282904 280198 277061 274451 272613 271610 271374 271475 271387
57754 271387 270906 270199 269659 269754 270715 272349 274405 276937 279901 282753 285027 286979 288888 290127 289937 288870
57738 288870 288252 288221 287597 285839 283859 282538 281630 280653 279729 278991 278161 277334 277255 278217 279504 280445 281148 281683
57720 281683 281556 280699 280035 280262 280884 281234 281627 282656 284053 285161 285906 286433 286367 285367 283937 282809 281953
57703 281953 281034 280337 280332 280689 280672 280303 280287 281008 282337 284218 286538 288499 288871 287014 283219 278182 272622
57686 272622 267265 262607 258644 255147 252064 249440 247270 245826 245818 247870 252063 258323 266948 278543 293884
57671 293884 314115 340519 373593 412852 457711 507717 561189 614172 661344 697501 717973
57660 717973 719080 699915 663637 616068 563021 509206 458546 413851 375992 344372 318313 297431
57648 297431 281002 267989 257679 249602 243007 237232 232438 229149 227203 225952 225262 225393 226033 226464
57634 226464 226662 227260 228374 229386 229934 230180 230079 229427 228784 229168 230437 230967 229499 226468 223019 219604
57618 219604 216258 213441 211570 210067 207761 204286 200570 197881 196720 196631 196818 196876 196962 197298 197694 197775 197518
57601 197518 197198 196882 196381 195671 194915 194113 193145 192181 191534 191002 189845 187536 184184 180167 175839 171697 168368
57584 168368 166177 164979 164469 164399 164529 164757 165329 166441 167680 168240 167670 165951 163001 158862 154389 150943
57568 150943 149054 147949 146639 144890 142942 140978 139336 138625 139086 140146 141040 141530 141746 141804 141996 142873
57552 142873 144571 146335 147315 147679 148421 150078 152068 153332 153318 152264 150816 149491 148476 147788 147483 147614
57536 147614 148097 148811 149736 150767 151539 151785 151739 151751 151598 150740 149271 147999 147400 147140 146915 147147 148370 150334
57518 150334 152277 153812 155168 156776 158959 161764 164751 167190 168835 170245 171929 173446 173891 173215 172531
57503 172531 172955 174473 176096 176884 176636 175703 174370 172568 170183 167422 164707 162322 160401 159086 158328
57488 158328 157641 156556 155330 154692 154777 154861 154369 153624 153205 153088 152868 152511 152361 152612 153175 153873 154392 154262 153282
57469 153282 151804 150279 148752 147150 145803 145103 144799 144209 143157 142218 141899 142033 142143 142102 142163 142497 142941
57452 142941 143161 143039 142914 143339 144546 146217 147889 149425 150906 152265 153306 153988 154401 154566 154574 154845 155804
57435 155804 157204 158185 158254 157967 158321 159626 161301 162727 163912 165143 166321 167026 167207 167442 168378 170131
57419 170131 172349 174608 176568 178010 179019 179929 180850 181475 181696 182097 183302 185081 186777 188517 191118
57404 191118 194641 197926 199982 201083 201936 202468 202210 201433 201040 201512 202692 204457 206844 209551 212039 214326
57388 214326 217007 220323 223692 226425 228472 230254 232204 234775 238401 242968 247506 250882 252778 253790
57374 253790 254644 255591 256499 257183 257523 257448 257010 256472 256248 256696 257944 259886 262286 264847 267268 269411 271508
57357 271508 274065 277395 281230 284957 288244 291288 294432 297708 300925 304031 307151 310237 313013 315386
57343 315386 317646 319986 322047 323356 324180 325425 327573 330186 332729 335377 338590 342307 346179 350350
57329 350350 355313 361039 366856 372222 377063 381346 385013 388506 392696 397864 403297 408281 413041 418308
57315 418308 424320 430697 436997 442982 448648 454383 460822 468051 475176 481192 486135 490920 496179 501773
57301 501773 507450 513502 520533 528896 538475 548785 559164 569041 578251 587110 596133 605594 615285 624819
57287 624819 634305 644558 656296 669248 682479 695621 709255 724073 740306 758117 777575 797396
57275 797396 814324 824917 828261 826697 824160 824221 829098 839212 853160 868687 884174 899232 914045
57262 914045 928670 942990 956829 969894 981961 993363 1004999 1017668 1031570 1046417 1061668
57251 1061668 1076479 1089806 1101054 1110717 1120262 1131233 1144370 1159435 1175783 1193022 1211089 1229841
57239 1229841 1248871 1267836 1286690 1305529 1324374 1343218 1362022 1380594 1398788 1416920 1435517
57228 1435517 1454402 1472479 1488846 1503772 1518217 1532766 1547495 1562473 1577763 1593109 1608223
57217 1608223 1623362 1639188 1656188 1674679 1695223 1718414 1744215 1771887 1800573 1829636 1858557
57206 1858557 1886936 1914588 1941360 1966938 1991014 2013326 2033306 2050252 2064408 2077366 2090595
57195 2090595 2103980 2116632 2128854 2142287 2158216 2176725 2197601 2221019 2247002 2275025 2304586
57184 2304586 2335564 2367705 2400305 2432670 2464446 2495317 2524849 2552700 2578543 2601790 2622067
57173 2622067 2639991 2656724 2672637 2687073 2699606 2710784 2721428 2731910 2742322 2752656 2762506
57162 2762506 2771310 2779141 2786612 2793830 2800304 2806201 2812680 2820327 2828038 2834210 2838555 2842145 2846151 2851140
57148 2851140 2857116 2863562 2869687 2875121 2880200 2885317 2890342 2894965 2899149 2902845 2905658 2907156 2907238 2906063
57134 2906063 2904074 2902214 2901515 2902214 2903832 2906504 2911747 2921735 2938275 2962567 2995211 3036100 3084796
57121 3084796 3141086 3204597 3274077 3348053 3426329 3509944 3599890 3697184 3804244 3924616 4060936
57110 4060936 4214435 4386389 4578076 4789000 5017634 5265394 5538498 5845424 6194967
57101 6194967 6598147 7069969 7628090 8292595 9089660 10054078 11226887 12653288 14384839
57092 14384839 16479931 18996703 21984072 25477650 29496815 34038937 39079092 44581520
57084 44581520 50510458 56826629 63478391 70399957 77497932 84599626 91390865 97420680
57076 97420680 102207256 105378329 106745063 106281960 104069813 100260904 95072258 88782614
57068 88782614 81718873 74231196 66658260 59290018 52343238 45958272 40209429 35117732
57060 35117732 30664206 26804978 23484085 20640049 18209632 16133030 14358019 12839433
57052 12839433 11536810 10414760 9444582 8603377 7871630 7232615 6672970 6181847 5749414
57043 5749414 5366987 5027796 4726194 4456458 4213463 3994039 3796363 3618217 3456866
57034 3456866 3310411 3178201 3059988 2955486 2864607 2787388 2723854 2674478 2640477 2623060
57024 2623060 2622631 2638583 2668009 2702720 2728102 2727405 2689032 2610825 2498995 2364527 2219760
57013 2219760 2075559 1939366 1815149 1704608 1607856 1523539 1449772 1385514 1330495 1283866
57003 1283866 1243811 1208646 1177539 1150052 1125809 1104794 1087101 1072091 1058545 1045921 1034663
56992 1034663 1024945 1016024 1007363 999617 993826 990129 987871 986491 985672 984997 984072 982655 980050 974583 964336
56977 964336 948372 927064 901594 873658 845290 818185 793056 769980 749245 731349 716289
56966 716289 703467 692519 683922 678639 677359 680092 686247 695079 706181 719472 734476 749655 762574
56953 762574 770598 771370 763218 745955 721525 693361 664698 637380 612119 589351 569648 553533
56941 553533 541233 532616 527319 525037 525826 530180 538843 552413 570882 593397 618568 645049 671514
56928 671514 695857 714767 724656 723202 710049 686587 655659 621169 586809 554524 524398 496242
56916 496242 470836 449321 431810 417186 404217 392470 382211 373775 367137 361826 357103 352373
56904 352373 347600 343270 339839 337209 334850 332508 330624 329794 329893 330165 330419 331732 335566 342455 352035
56889 352035 364151 379142 396934 416546 436822 457056 476462 493431 505851 512020 511067 503089
56877 503089 489543 473262 457302 443464 432118 423256 417224 414562 415731 421196 431343 446178
56865 446178 465509 489595 519280 555227 597207 644179 694568 746002 794807 836098 864727
56854 864727 876737 870765 848573 814223 772512 727974 684758 646405 615144 591696 576163 568888
56842 568888 570234 580091 598366 625763 663378 711457 769142 835493 909885 990833 1074584 1154966
56830 1154966 1224160 1273641 1295823 1286689 1247734 1185290 1107768 1023285 938804 859865 790172
56819 790172 731595 684834 649969 626419 613050 608925 613890 628235 651985 684733 725829 774285
56807 774285 828442 885754 942444 993000 1030423 1048050 1042025 1012608 963703 901443 832643 763354
56795 763354 697948 639089 588279 546171 512668 487292 469717 459768 456986 460533 469595 483594
56783 483594 502100 524843 551706 582017 613451 641936 662960 673077 670490 655063 628365 593427
56771 593427 553860 512814 472535 434477 399586 368526 341691 318942 299552 282845 268791
56760 268791 257530 248393 240163 232480 226170 221724 218196 214306 210066 206463 203886 201827 199994 198773
56746 198773 198350 198132 197431 196245 195012 193960 193022 192170 191562 191340 191382 191238 190400 188786 186800 184804 182805
56729 182805 180974 180112 180977 183214 185550 187129 188128 189030 189948 190915 192192 193763 194954 195114 194492 193984
56713 193984 194103 194647 195282 196012 196962 198074 199257 200587 202106 203519 204310 204246 203630 203000 202688 202710 202911 203053
56695 203053 202822 202102 201259 200875 201050 201262 201107 200918 201256 201959 202137 201177 199476 198105 197908 198989 200871
56678 200871 202974 204927 206446 207109 206602 205323 204352 204492 205488 206468 206895 206759 206121 205018 203757 202729
56662 202729 201857 200726 199428 198791 199465 201089 202692 203711 204329 204928 205540 205894 205824 205472 205070 204601 203827
56645 203827 202639 201245 199948 198909 198195 197819 197575 197114 196404 195927 196174 197145 198506 199932 200993 201167
56629 201167 200434 199603 199519 200113 200664 200728 200240 199042 197124 195241 194453 194857 195482 195542 195153 194676 194072 193206 192222
56610 192222 191228 190099 188842 187718 186782 185821 184991 184934 185900 187242 188135 188397 188251 187833 187374 187414 188239 189358
56592 189358 190014 190063 190012 190360 191221 192358 193284 193546 193208 192917 193288 194370 195842 197407 198794 199765 200404 201167
56574 201167 202320 203536 204311 204586 204807 205574 207327 210089 213414 216866 220625 225305 231183 238200 246640
56559 246640 257014 269027 281401 293110 304008 313751 321004 324594 324930 323458 321140 318236 315169
56546 315169 312581 310589 308800 307071 305613 304351 302823 300719 297978 294411 289862 284868 280565 277698
56532 277698 276007 274653 272967 270795 268400 266131 264029 261834 259464 257219 255332 253663 252130 251021
56518 251021 250445 249835 248541 246638 244666 242827 240995 239194 237457 235399 232652 229612 227171 225768 225271
56503 225271 225538 226361 226956 226380 224639 222692 221224 220034 218813 217819 217424 217495 217590 217396 216783 215760 214701
56486 214701 214303 215019 216620 218389 219615 219935 219529 219056 219160 219944 221023 221975 222575 222799 222936 223510 224673
56469 224673 225845 226403 226591 227195 228365 229356 229595 229470 229794 230793 231875 232255 231714 230859 230585 231159 231996 232480
56451 232480 232735 233252 234101 234945 235590 236055 236312 236531 237356 239370 242300 245221 247368 248304 247719 245888 244112
56434 244112 243721 244542 245183 244934 244518 244752 245387 245654 245263 244373 243165 241922 241101 240874 240900 240846 240850 241184 241818
56415 241818 242537 243207 243722 244026 244331 244952 245810 246465 246729 246809 246736 246225 245341 244815 245281 246513 247707 248323 248452
56396 248452 248613 249368 250915 252945 255063 257256 259625 261777 263066 263516 263898 264692 265487 265687 265388 265237
56380 265237 265719 266819 268106 268955 268946 268208 267250 266463 265996 266015 266702 267957 269433 270808 271816 272221 272200 272477
56362 272477 273479 274618 275104 275270 276238 278305 280588 282381 283915 285533 287004 288057 288889 289737 290537 291346
56346 291346 292465 293804 294689 294691 294144 293629 293471 293962 295397 297612 300091 302751 305977 309725 313367 316721
56330 316721 320357 324497 328476 331854 335226 339270 343663 347574 350617 352687 353484 352977 351887 350991 350258
56315 350258 349242 347956 346801 345999 345614 345793 346532 347551 348789 350636 353286 356339 359433 362742 366413
56300 366413 370099 373595 377373 381876 386747 391400 395925 400786 405922 410744 414836 418300 421712 425984
56286 425984 431785 438684 445484 451760 458481 466602 475710 484661 492966 500908 508919 517491 527201 538059
56272 538059 549368 560852 573377 587800 603703 620121 637068 655379 675453 697073 720304
56261 720304 745685 773654 804464 838485 876029 917133 962216 1012659 1070135 1135640 1209756
56250 1209756 1293400 1387523 1492431 1608232 1735590 1875099 2026001 2186293 2354015 2527634
56240 2527634 2705219 2883941 3060352 3230515 3389858 3533524 3657025 3756518 3828886 3872155
56230 3872155 3885633 3869396 3824130 3751903 3656412 3541673 3410835 3266851 3113598 2955354
56220 2955354 2795488 2636507 2480908 2330923 2187601 2051096 1921856 1800858 1688835
56211 1688835 1585921 1491822 1405689 1326260 1252922 1186263 1126725 1073170 1023739 977823 936116
56200 936116 898979 865837 836090 809467 785420 763250 743013 725421 710601 697654 685644
56189 685644 674358 663974 654568 646096 638409 631244 624493 618413 613265 609043 605827 603844 602776 601642
56175 601642 599975 598484 597888 597823 597686 597768 598527 599515 600217 601340 603959 607831 611838 615639 619615 623643
56159 623643 627419 631701 637730 645476 653834 662394 671692 681872 692647 704580 718849 735601 753991
56146 753991 774069 797239 824616 856414 893260 936703 987779 1046199 1111364 1183046 1260445
56135 1260445 1341485 1423503 1503836 1579561 1647712 1706405 1755411 1795750 1829440 1859297 1887602
56124 1887602 1914486 1938293 1957344 1970515 1976542 1974356 1964400 1948433 1927730 1902281 1871588 1834945
56112 1834945 1790922 1738021 1676363 1607930 1535219 1460694 1387289 1317961 1254477 1197657 1148570
56101 1148570 1108068 1075326 1048504 1026864 1010641 998804 988939 979822 972371 967538 964915 964016 965188
56088 965188 968411 972611 977015 982023 988065 994771 1001890 1009830 1018667 1027701 1036515 1045475 1054839 1064472
56074 1064472 1074637 1085837 1097671 1109205 1120674 1133332 1147427 1161902 1176365 1191619 1207861
56063 1207861 1224166 1240369 1257645 1276512 1295912 1315001 1334271 1354101 1373743 1392620 1411143
56052 1411143 1429523 1447183 1464016 1480854 1498047 1515026 1531793 1549312 1567808 1586169 1603568
56041 1603568 1620185 1635937 1650184 1663223 1676356 1690097 1704089 1719179 1737526 1760117 1786185
56030 1786185 1815630 1849911 1889932 1935149 1985304 2040631 2099643 2159140 2217427 2275324 2333362
56019 2333362 2390448 2446197 2502026 2558974 2616929 2676819 2740775 2809049 2879596 2951826 3027849
56008 3027849 3108742 3192664 3278185 3366630 3459584 3556941 3658840 3766645 3880592 3999579
55998 3999579 4124579 4258834 4403174 4554754 4712120 4877761 5053877 5239659 5434976
55989 5434976 5642716 5865050 6101428 6352823 6623859 6918022 7234777 7574032 7939223
55980 7939223 8333449 8757351 9213781 9709789 10251033 10839514 11480020 12183128 12958379
55971 12958379 13810834 14748723 15788283 16946966 18239397 19685986 21319314 23177634
55963 23177634 25301211 27743132 30578199 33898162 37811976 42464110 48050021 54814704
55955 54814704 63058169 73160310 85586318 100839256 119386592 141594643 167652224
55948 167652224 197463575 230534217 265833443 301551681 334824172 361810435 378510044
55941 378510044 382111936 372063300 350156695 319703622 284454631 247817568 212464930
55934 212464930 180188854 151922678 127904909 107911799 91467441 78001445 66961844
55927 66961844 57875685 50355526 44084890 38813016 34350602 30551932 27297049 24489579
55919 24489579 22058125 19946855 18105730 16492732 15077547 13835050 12738732 11765127
55911 11765127 10899181 10129295 9441099 8820860 8260472 7753807 7291990 6867074 6476617
55902 6476617 6119614 5791041 5484943 5199788 4936071 4691165 4460918 4244170 4041695
55893 4041695 3852583 3675263 3510222 3358325 3218054 3087276 2965884 2854070 2750065
55884 2750065 2652388 2562305 2481360 2408354 2341204 2279566 2222812 2167474 2109675 2048599 1985231
55873 1985231 1919607 1851928 1784467 1719507 1656765 1595256 1536036 1480639 1428597 1379249 1334383
55862 1334383 1296166 1263657 1234181 1207024 1182993 1161264 1139504 1116664 1093321 1069760 1045844
55851 1045844 1022159 999091 975189 948475 919051 888723 858641 828984 800366 773734 749233
55840 749233 726664 706536 689218 673708 658739 644495 631771 620154 608568 597068 586569
55829 586569 577293 568859 561395 555203 549800 544427 538992 533446 526989 519066 510378 501778 492947 483373
55815 483373 473672 464636 455823 446535 437463 429980 424444 420500 418197 417406 416895 415600 414311 414714 417233
55800 417233 421125 426092 432297 439187 445654 451120 455379 457860 458199 457058 455212 452317 447641 441439
55786 441439 434556 427369 420254 414301 410184 406903 402871 397605 391155 382810 372086 360458 350366
55773 350366 342764 337131 333510 332870 335516 340554 346944 353752 359433 362125 360835 355565 346600 334722
55759 334722 321711 309305 297752 286372 275200 264998 256072 248420 242754 239931 239438 239681 239787
55746 239787 239962 240153 239617 237969 235619 233064 230625 228826 228103 228177 228443 228780 229142 228765 226842 223761 220663
55729 220663 218012 215555 213253 211115 208428 204447 199684 195257 191164 186507 181335 176921 174098 172544
55715 172544 171801 171842 172472 173352 174820 177591 181515 185621 189530 193695 198070 201697 203959 205247 205979 205796
55699 205796 204043 200357 194614 187092 178843 171165 164526 158677 153727 150197 148027 146532 145528 145518 146550
55684 146550 147833 148821 149864 151476 153677 156350 159534 163055 166424 169243 171232 171867 170742 168298 165471
55669 165471 162538 159067 155059 151293 148341 145945 143624 141281 139116 137454 136727 137130 138340 140073 142629
55654 142629 146238 150219 153686 156810 160357 164228 167575 170236 172750 174942 175789 175006 173549 172174 170598
55639 170598 168473 166057 163466 160273 156426 152633 149300 145893 141873 137508 133343 129658 126816 125217
55625 125217 124329 122697 119648 116290 114167 113529 113571 113708 113886 114096 114352 114821 115387 115381 114242 112234 110075
55608 110075 108168 106505 104989 103468 101739 99887 98369 97503 97126 96912 96714 96405 95822 95069 94488 94119
55592 94119 93522 92414 91139 90372 90575 91808 93657 95274 95903 95539 94801 94201 93851 93734 93748 93574 93157 93291
55574 93291 95115 98896 103817 108954 113948 118862 124062 130142 137205 144241 149913 153876 156524 157639
55560 157639 156435 153019 148637 144176 139463 134365 129495 125356 121684 118134 114760 111472 107952 104529
55546 104529 102134 100872 99665 97904 96437 96140 96435 96133 94977 93487 91980 90682 90166 90736 91749
55531 91749 92392 92735 93287 93924 94056 93556 92774 91843 90605 89002 87085 84949 83034 81971 81643 80988 79306
55514 79306 77210 75618 74389 72787 70845 69339 68701 68728 69163 69811 70273 70220 69790 69199 68261 66869 65630
55497 65630 65353 66073 67157 68105 68739 68931 68809 68922 69562 70173 70048 69352 68822 68771 69006 69433 70053 70613 70941
55478 70941 71373 72185 72937 73175 73457 74737 76845 78532 79023 78639 77890 76813 75444 74128 73112 72320 71698
55461 71698 71228 70633 69658 68674 68344 68619 68760 68446 68191 68480 69135 69725 69976 69635 68606 67516 67437 68619
55443 68619 70049 70690 70681 70851 71492 72204 72659 72899 72965 72728 72199 71670 71416 71396 71358 71213 71213 71648 72303 72456 71688
55422 71688 70621 70446 71602 73236 74112 73804 72787 71653 70714 70313 71037 73132 75846 77826 78438 78418 78922
55405 78922 80128 81223 81606 81445 80995 80111 78846 77924 77913 78318 78162 77285 76410 75979 75597 74753 73560 72540
55387 72540 72024 72009 72304 72630 72748 72690 72737 73072 73547 73904 74131 74479 75097 75674 75600 74590 73107 71944 71428
55368 71428 71295 71358 71880 73078 74579 75694 76055 75789 75259 74892 75024 75630 76279 76565 76432 75967 75125 73935
55350 73935 72761 72088 72080 72576 73324 74059 74502 74550 74423 74502 75019 75796 76196 75550 74051 72975 73315 74274 73947
55331 73947 71691 68972 67561 67776 68959 70621 72233 72763 71677 70062 69665 70916 72682 73793 73957
55316 73957 73322 72151 71002 70438 70356 70174 69700 69290 69212 69478 70241 71652 73322 74569 75181 75331 74865 73481
55298 73481 71609 70265 69850 69828 69799 70072 70882 71793 72326 72594 72870 72984 72655 72056 71681 71833 72498 73474 74485
55279 74485 75378 76336 77589 78920 79838 80281 80637 81016 80988 80334 79562 79344 79708 80068 79898 79238 78674 78795 79469
55260 79469 79815 79242 78274 77754 77488 76566 75068 74394 75440 77317 78561 78916 79100 79287 78896 77831 77022
55243 77022 77346 78503 79366 79243 78466 77806 77653 77902 78402 79174 80160 81093 81734 81985 81636 80429 78672 77356
55225 77356 77161 77635 77876 77664 77348 76973 76319 75625 75395 75479 75218 74575 74288 74734 75493 76213 77029 77848 78110
55206 78110 77718 77357 77413 77403 77034 77026 78055 79549 80406 80421 80162 79835 79220 78505 78252 78532 78839 78880 78832 78770 78487
55185 78487 78010 77736 77843 77971 77732 77272 77155 77774 78955 80050 80526 80568 80980 82310 84202 85757 86371 86061
55167 86061 85246 84419 83865 83467 82973 82519 82552 83027 83167 82430 81403 81226 82339 84190 85914 86840 86574 85185
55149 85185 83307 81651 80467 79715 79499 79855 80370 80605 80784 81479 82677 83819 84718 85685 86627 86811 85918
55132 85918 84741 84308 84682 85121 85144 84898 84651 84394 84048 83741 83789 84504 85945 87661 88790 88699 87631 86502
55114 86502 85993 86015 86147 86342 86881 87736 88328 88153 87424 86887 87042 87769 88670 89499 90171 90599 90750 90817 91175 92105
55094 92105 93559 95146 96418 97252 97911 98624 99224 99426 99348 99444 99849 100196 100207 100132 100339 100749 100961 100751 100186
55075 100186 99421 98734 98603 99372 100776 102102 102887 103216 103337 103297 103120 103049 103293 103594 103384 102450 101209 100144
55057 100144 99148 97731 95821 94012 92872 92345 92062 91950 92157 92464 92237 91135 89632 88698 88961 90130
55041 90130 91245 91640 91695 92312 93584 94502 94324 93621 93336 93273 92510 91063 90017 89951 90294 90564 91182 92408
55023 92408 93438 93405 92731 92663 93801 95742 97803 99394 99958 99298 97889 96365 94825 93142 91633 90804
55007 90804 90583 90453 90313 90545 91235 91949 92419 92963 94012 95524 96959 97652 97294 96335 95785 96298 97548 98800
54989 98800 99845 100859 101625 101601 100837 100178 100378 101433 102863 104154 104783 104386 103174 101813 100659 99440
54973 99440 97918 96483 95763 95896 96489 97119 97604 97942 98261 98831 99925 101573 103447 104938 105491 105058 104240
54956 104240 103767 103866 104284 104866 105726 106803 107585 107547 106770 105951 105811 106490 107441 107918 107665 107093 106727 106616 106467
54937 106467 106196 106013 105993 105902 105540 105056 104842 105207 106150 107313 108254 108942 109876 111472 113516 115507 117441 119787
54919 119787 122802 126332 130355 135172 140886 147112 153387 159470 164976 169123 171211 171087 168907 164802
54905 164802 159197 153122 147627 142926 138577 134471 131105 128729 126738 124322 121467 118913 117238 116336
54891 116336 115864 115777 116196 116991 117804 118398 118734 118750 118422 118096 118437 119851 122144 124868 127805 130925 134145
54874 134145 137403 140841 144676 148975 153741 158978 164349 168934 171761 172586 171880 170093 167259 163291 158278
54859 158278 152434 146182 140346 135874 133042 131159 129324 127296 125458 124148 123344 122827 122302 121297 119287
54844 119287 116163 112500 109122 106436 104310 102630 101681 101773 102625 103462 103768 103705 103702 103880 104010 103846 103325 102602
54826 102602 102025 101943 102389 103077 103777 104460 104928 104635 103219 101104 99283 98497 98689 99135 99030 98212 97486 97971
54808 97971 99891 102287 104102 105208 106084 106885 107317 107155 106454 105417 104495 104320 105028 105884 106094 105837 105886 106407
54790 106407 106818 106768 106590 106727 107347 108576 110424 112312 113305 113119 112439 112038 112020 112120 112246 112489 112920 113571
54772 113571 114345 114973 115486 116690 119506 123801 128472 132864 137430 142801 148926 155448 162149 168579 173908
54757 173908 177703 180325 182030 182271 180539 177358 173660 169563 164566 158719 152750 147151 141829 136718
54743 136718 132029 127861 124107 120905 118637 117361 116693 116394 116648 117534 118545 118926 118397 117440 116922 117378
54727 117378 118571 119775 120585 121262 122282 123863 126205 129734 134649 140403 146167 151672 157071 162086 165897
54712 165897 168014 168674 168225 166586 163618 159570 154867 149774 144598 139905 136155 133233 130649 128093 125547
54697 125547 123022 120589 118621 117617 117596 117935 117969 117562 116953 116304 115684 115347 115605 116366 117140 117570 117644 117271
54679 117271 116113 114196 112395 111721 112243 113113 113632 113782 113744 113462 112861 112028 110952 109560 108239 107822 108576
54662 108576 109611 109826 109250 108911 109428 110252 110377 109427 107940 106771 106368 106506 106654 106586 106535 106805 107434 108350
54644 108350 109509 110671 111331 111236 110833 110855 111507 112331 112744 112441 111417 109964 108597 107673 107122 106772 106827 107550
54626 107550 108567 108991 108446 107557 107183 107432 107710 107525 106985 106587 106716 107302 107839 107856 107454 107280 107816 108810 109600
54607 109600 109932 110209 110914 111969 112830 113084 112799 112338 111996 111892 112009 112215 112314 112238 112135 112219 112515 112872 113129
54588 113129 113152 112787 111990 111042 110443 110581 111485 112811 113900 114036 113009 111431 110282 110041 110505 111354 112517
54571 112517 113869 114963 115387 115181 114719 114248 113720 112986 112069 111292 111101 111641 112595 113588 114583 115601 116249 116104
54553 116104 115517 115408 116078 116787 116773 116212 115841 116023 116607 117384 118316 119468 120895 122405 123374 123259 122405 121846
54535 121846 122070 122544 122734 122857 123195 123317 122713 121699 120996 120821 121042 121759 122921 123787 123697 123127 123034 123330 123038
54516 123038 121924 120886 120541 120437 120033 119515 119183 118788 118086 117433 117232 117263 117162 117189 117882 119096 119932 119631
54498 119631 118252 116482 115032 114192 113787 113524 113356 113457 113922 114652 115493 116262 116746 116995 117491 118654 120217
54481 120217 121450 121992 122090 122073 122133 122633 124004 126084 128002 128993 129039 128639 128337 128561 129401 130335 130657 130444 130577
54462 130577 131559 132826 133663 134270 135330 136875 138160 138607 138381 138062 138062 138279 138102 136964 135138 133719 133463
54445 133463 133856 133760 132788 131482 130267 128866 126986 125065 123868 123585 123729 123905 124290 125177 126321 127100 127297
54428 127297 127289 127380 127332 126842 126167 125833 125970 126416 127306 128952 131149 133162 134511 135230 135351 134804 133997 133742 134210
54409 134210 134598 134314 133858 133915 134176 133886 133220 133160 134053 135120 135565 135433 135196 135109 135365 136291 137885 139422 140081
54390 140081 139957 140052 141143 142928 144371 144727 144052 142907 141844 141189 140970 140878 140543 140068 140127 141220 142967
54373 142967 144450 145147 145223 145047 144892 145052 145749 146830 148026 149539 151878 155039 158468 161916 165660 169556
54357 169556 172663 174338 175119 175846 176397 175990 174361 171981 169302 166466 163590 160647 157294 153460 149999
54342 149999 147974 147242 146476 144760 142547 140881 140250 140463 141089 141649 141780 141573 141481 141622 141454 140459 138946
54325 138946 137837 137763 138553 139599 140525 141427 142487 143420 143537 142522 141013 140077 140129 140659 140940 140694 140056 139206
54307 139206 138227 137048 135473 133435 131275 129513 128310 127432 126797 126726 127528 129064 130859 132450 133550 134123
54291 134123 134474 135067 136064 137095 137568 137120 135809 134101 132681 132005 131917 131925 131903 132338 133751 136095 138793 141160
54273 141160 142711 143316 143251 142997 142895 143124 143903 145373 147108 148151 147830 146433 144911 144078 144202 145071 146151
54256 146151 146823 146766 146158 145452 145099 145516 146965 149202 151440 152967 153718 154045 154077 153636 152666 151412 150166
54239 150166 149002 147762 146117 143846 141337 139644 139572 140716 141843 142320 142702 143721 145213 146463 147265
54224 147265 148036 149011 149891 150374 150568 150593 150169 148959 147195 145610 144739 144516 144540 144540 144467 144343 144180 143998 143839
54205 143839 143752 143777 143915 144061 144059 143872 143668 143695 144068 144744 145663 146817 148141 149395 150249 150504 150153 149218 147691
54186 147691 145798 144258 143948 145143 147190 149131 150603 151947 153553 155333 156899 158044 158892 159614 160068
54171 160068 159805 158529 156583 154834 153935 153782 153830 153722 153390 152760 151801 150801 150151 149777 149155 148043 146733
54154 146733 145454 143973 142179 140709 140467 141553 142989 143595 143011 141903 141307 141722 142778 143789 144505 145142
54138 145142 145805 146375 146925 147689 148382 148182 146794 145101 144250 144469 145255 146321 147579 148439 148087 146634 145293
54121 145293 145096 145877 146805 147463 148020 148575 148804 148353 147468 147079 148053 150292 152762 154625 156087 157821 159787
54104 159787 161148 161351 160860 160700 161609 163705 166634 169917 173281 176723 180130 183041 185044 186217 186779
54089 186779 186438 184643 181441 177572 173682 169978 166723 164460 163423 163175 163153 163286 163831 164919 166495 168479
54073 168479 170766 173296 176155 179347 182427 184748 186170 187121 187800 187799 186706 184671 182153 179521 177184
54058 177184 175638 174998 174803 174601 174393 174241 173937 173502 173570 174733 176731 178799 180574 182204 183817 185491
54042 185491 187643 190803 194914 199273 203292 207036 210988 215569 220868 226642 232578 238659 245080 251678
54028 251678 257800 263039 267696 272051 275588 277699 278925 280642 283380 286242 288206 289266 289931 290240 289889
54013 289889 288897 287500 285534 282597 278827 275013 271671 268367 264249 259051 253326 247748 242521 237595
53999 237595 233150 229508 226602 223882 220889 217691 214614 211733 208880 206041 203487 201509 200131 199083
53985 199083 198035 196918 196010 195536 195221 194529 193459 192720 192868 193572 194044 193891 193245 192363 191600 191490 192253 193272
53967 193272 193691 193589 193987 195578 198021 200786 204120 208661 214470 221038 228195 236382 245754 255291 263235
53952 263235 268434 271027 271627 270185 266151 259840 252991 247503 243904 241489 239719 238826 239118 240432 242494
53937 242494 245334 248967 252987 256804 260099 262878 265280 267515 269766 271993 274053 276163 278983 282965
53923 282965 287768 292572 296881 300878 305141 310185 316135 322628 329063 335141 341130 347574 354856 363027
53909 363027 371789 380420 387906 393497 397192 399563 401102 401816 401425 399848 397455 394872 392492 390169 387454
53894 387454 384153 380562 377066 373577 369441 363926 356893 349030 341337 334283 327590 320879 314267 308092
53880 308092 302262 296371 290379 284747 279867 275785 272536 270255 268683 266939 264139 260114 255416 250830
53866 250830 246962 243925 241217 238184 234739 231366 228316 225340 222398 220120 218967 218373 217232 215064
53852 215064 212175 208976 205772 203114 201599 201128 200835 199906 198201 196046 193842 191967 190697 190028 189759
53837 189759 189787 190077 190390 190440 190368 190737 191946 193873 196146 198415 200279 201314 201407 200877 200114 199299 198527 198023
53819 198023 198050 198696 199760 200743 201139 201024 201210 202461 204634 207021 209395 212076 214926 217156 218508 219969
53803 219969 222704 226729 231219 235762 240677 246324 252690 259574 266590 273039 278291 282376 285811 288902
53789 288902 291617 294035 296412 298714 300610 302050 303381 304715 305553 305319 303936 301695 298850 295586 292080
53774 292080 288298 283881 278557 272590 266641 261232 256505 252335 248482 244711 240928 237255 233920 231123
53760 231123 228972 227346 225777 223729 221147 218573 216565 215110 213751 212075 209982 207667 205521 203884
53746 203884 202706 201618 200565 200079 200572 201528 201898 201388 200879 201378 202857 204402 205307 205685 206063 206641 207068
53729 207068 206836 205815 204451 203479 203409 204164 205198 206018 206621 207395 208573 209930 211134 212273 213730 215515
53713 215515 217066 217921 218376 219209 220858 223080 225378 227514 229581 231738 233975 236111 238023 239845 241816
53698 241816 243907 245808 247401 249019 251065 253601 256504 259777 263361 266814 269555 271316 272099 271955 271237
53683 271237 270791 271127 271473 270419 267707 264695 262756 261895 261289 260474 259390 257880 256042 254749 254928 256286
53667 256286 257495 257723 257390 257272 257517 257793 257903 257809 257377 256490 255316 254223 253558 253578 254342 255522 256510 256958
53649 256958 257067 257199 257428 257640 257817 257932 257772 257279 257031 257962 260419 263723 266794 269091 270824 272463 274204
53632 274204 275939 277595 279386 281663 284431 287211 289596 291942 295130 299472 304125 307908 310535 312689
53618 312689 315043 317731 320799 324507 328786 332896 336151 338799 341622 344857 348105 351267 354850 359094
53604 359094 363388 366936 369632 371854 373696 374859 375206 375024 374755 374684 374812 374884 374640 374217 374121 374626 375374 375765
53586 375765 375481 374383 372256 369138 365682 362672 360265 358167 356361 355098 354176 352948 351240 349663 348732
53571 348732 348194 347545 346745 345907 344683 342589 339793 337020 334670 332508 330413 328999 329102 330727 332858
53556 332858 334441 335394 336417 337860 339179 339678 339444 339093 338825 338366 337862 338120 339588 341598 343127 344005
53540 344005 344907 346388 348495 351258 354941 359586 364665 369499 373927 378438 383708 390065 397322 405077
53526 405077 413200 422000 431881 442866 454535 466305 477733 488708 499615 511232 524217 538620
53514 538620 553988 569908 586323 603363 621103 639571 658843 678989 699946 721523 743551
53503 743551 765975 788773 811716 834278 855884 876235 895324 913243 930211 946777 963575
53492 963575 980656 997325 1012925 1027637 1042193 1056933 1071543 1085718 1099694 1113965 1128699
53481 1128699 1143680 1158740 1173977 1189452 1204740 1219025 1231731 1242919 1252795 1260987 1266758 1269936
53469 1269936 1271122 1270685 1268058 1262531 1254374 1244628 1234020 1222673 1210737 1198541 1186065 1172972 1159363
53456 1159363 1145830 1132407 1118068 1101797 1083812 1065261 1046969 1028938 1010852 992579 974239
53445 974239 956219 939118 923358 908839 895238 882671 871799 863251 857047 852521 848708 845016
53433 845016 841714 839603 839018 839362 839897 840749 842730 846353 851426 857468 864054 870804 877658 885273 894657
53418 894657 906225 919543 934092 949836 966907 985246 1004849 1025899 1048402 1072087 1096949
53407 1096949 1123427 1151693 1181242 1211692 1243490 1277217 1312551 1348752 1385892 1424772 1465609
53396 1465609 1507659 1550335 1593982 1639282 1686408 1734979 1784286 1833354 1881384 1928469 1975332
53385 1975332 2022076 2067828 2111964 2154964 2197379 2238563 2277144 2312346 2344069 2372100 2396202
53374 2396202 2416734 2434139 2447863 2456768 2460691 2460548 2456600 2447658 2432519 2411316 2384811 2353229
53362 2353229 2316738 2276539 2234377 2191096 2146511 2100643 2054291 2008262 1962742 1917677 1873274
53351 1873274 1829916 1787928 1747563 1708949 1671923 1636219 1601726 1568146 1534486 1499620 1463679
53340 1463679 1428344 1395329 1365005 1336852 1310686 1286698 1264578 1243552 1223436 1204969 1188767
53329 1188767 1174475 1161300 1148853 1136889 1124624 1111091 1096243 1081110 1066693 1053171 1040445
53318 1040445 1028820 1018616 1009409 1000380 991443 983436 977056 972114 968153 965343 964180 964512 965480 966577
53304 966577 968366 971893 977662 985439 994844 1005682 1017689 1030438 1043841 1058553 1075456 1094670
53292 1094670 1115364 1136645 1158375 1180950 1204522 1228718 1252913 1276503 1298941 1319832 1339000
53281 1339000 1356284 1371341 1383935 1394286 1402767 1409308 1413460 1415009 1414037 1410368 1403616 1393991 1382433
53268 1382433 1369493 1354624 1337155 1317528 1296912 1275860 1254118 1231629 1208887 1186135 1162903
53257 1162903 1138720 1113787 1088639 1063558 1038774 1014886 992475 971349 950617 929630 908575
53246 908575 887961 867746 847256 825963 804103 782374 761219 740689 720862 701974 684020
53235 684020 666688 650008 634726 621593 610492 600715 591902 584127 577148 570234 562914 555409 548062
53222 548062 540742 533068 524822 515829 505808 494725 483117 471660 460519 449449 438446 427948
53210 427948 418308 409387 400772 392297 384191 376713 369749 362934 356189 349914 344420 339358 334047 328282
53196 328282 322386 316484 310338 304078 298482 293998 289868 284842 278625 272169 266686 262803 260513 259308
53182 259308 258293 256762 254849 253213 251953 250343 247903 245188 243018 241369 239705 238179 237668 238411 239345
53167 239345 239282 238300 237323 236642 235626 233958 232398 231783 231755 231095 229247 226980 225467 225108 225383 225561 225355
53150 225355 225034 225050 225476 225870 225815 225515 225490 225703 225463 224417 223246 222968 223784 224937 225610 225559 224935 223926 222779
53131 222779 221900 221662 222083 222830 223575 224322 225327 226696 228188 229505 230596 231467 231838 231453 230775 230861 232240
53114 232240 234217 235650 236192 236402 236843 237511 238103 238388 238224 237540 236461 235223 233859 232135 229937 227571
53098 227571 225556 224172 223278 222522 221733 221137 221203 222178 223751 225225 226012 226019 225653 225468 225708 226182 226586 226802
53080 226802 226669 225639 223247 220004 217299 216059 215945 216201 216728 217741 218790 219022 218328 217453 216884 216342
53064 216342 215546 214747 214148 213414 212241 210996 210303 210208 210189 209841 209218 208591 208152 207932 207852 207960 208636 210233 212328
53045 212328 213688 213427 212027 210850 210681 211072 211087 210327 209140 208106 207507 207291 207341 207656 208211 208825 209353 209900
53027 209900 210591 211215 211469 211495 211739 212223 212533 212684 213313 214581 215556 215364 214541 214394 215241 216182 216592 216912 217691
53008 217691 218538 218581 217511 215775 214047 212881 212659 213431 214844 216380 217605 218170 217879 216993 216217 216133 216723
52991 216723 217569 218343 218978 219607 220513 221863 223287 224047 223937 223738 224378 225851 227474 229025 231013 233716
52975 233716 236554 238739 240140 241121 241815 241980 241530 240807 240201 239734 239148 238332 237503 236951 236668 236343 235785 235256
52957 235256 235227 235836 236750 237579 238172 238409 237933 236411 234005 231368 229149 227635 226828 226624 226853 227302 227806
52940 227806 228257 228542 228619 228657 228829 228894 228253 226657 224662 223110 222252 221643 220845 219917 219189 218812 218666 218519 218200
52921 218200 217797 217699 218193 218973 219321 218936 218284 217937 217867 217697 217381 217190 217163 217029 216752 216702 217171 218007 218893 219692
52901 219692 220325 220558 220213 219471 218718 218104 217428 216511 215545 215037 215370 216427 217680 218722 219638 220723 221920
52884 221920 222796 223085 223010 222990 223234 223700 224236 224676 224958 225189 225400 225287 224641 224068 224697 226812 229359 231251
52866 231251 232666 234334 236053 236911 236926 237356 239014 241176 242689 243493 244357 245544 246448 246365 245040 242589
52850 242589 239457 236386 233847 231429 228236 224075 219900 216873 215235 214219 212896 210973 208873 207222
52836 207222 206281 205866 205711 205693 205627 205163 204231 203368 203225 203767 204365 204628 204745 204912 204863 204259 203266 202493 202435 203106
52816 203106 204068 204739 204832 204601 204555 204929 205640 206712 208351 210520 212832 215102 217582 220279 222321 222519 220531
52799 220531 217180 213689 210867 208937 207739 207021 206689 206754 206903 206340 204436 201534 198743 196958 196346 196741
52783 196741 198054 200112 202435 204453 205794 206293 205966 205115 204222 203599 203348 203681 204856 206571 207818 207836
52767 207836 206916 205874 204915 203582 201740 199946 198710 197981 197664 198123 199637 201644 203110 203621 203690 203945
52751 203945 204396 204621 204330 203574 202662 202028 201984 202392 202866 203485 205001 207978 211824 215198 217394 218926 220647
52734 220647 222699 224643 226206 227416 228118 227929 226869 225667 225147 225409 225844 225878 225490 224975 224428 223623 222336
52717 222336 220567 218486 216351 214603 213805 214164 215152 215897 216079 216193 216805 217753 218339 218164 217460 216651 215922
52700 215922 215320 215033 215262 215891 216467 216576 216190 215578 214999 214610 214654 215456 216974 218515 219271 219185 218955 219052 219106
52681 219106 218532 217420 216343 215514 214672 213806 213405 213798 214644 215357 215731 215873 215797 215426 214876 214447 214313 214461
52663 214461 214932 215892 217370 219030 220380 221277 222186 223826 226425 229391 231866 233510 234600 235465 236214 237043
52647 237043 238308 239987 241313 241333 239818 237377 234797 232496 230545 228883 227418 226099 225014 224343 224204
52632 224204 224572 225289 226102 226768 227247 227679 228120 228455 228716 229215 230072 230799 230759 230041 229421 229425 229784 230036 230245 230807
52612 230807 231703 232349 232207 231340 230313 229670 229567 229827 230220 230621 230945 231094 231072 231049 231197 231569 232312 233817 236317
52593 236317 239321 241831 243251 243746 243626 242835 241466 240349 240462 241706 242869 242983 242380 242146 242829 244026
52577 244026 245085 245826 246515 247425 248632 250068 251544 252692 253072 252514 251304 249943 248739 247698 246778 246043
52561 246043 245474 244830 243889 242794 241959 241574 241324 240684 239498 238227 237613 238024 239083 239975 240186 239881 239576
52544 239576 239598 239941 240464 240997 241336 241374 241199 240901 240354 239461 238546 238124 238255 238520 238750 239348 240650 242329 243776
52525 243776 244740 245196 244899 243692 242146 241262 241433 242155 242891 243730 244951 246426 247815 249127 250688 252713
52509 252713 255181 258019 261169 264530 268016 271558 274853 277272 278276 277872 276482 274425 271736 268443
52495 268443 264836 261432 258730 256843 255280 253318 250802 248359 246658 245700 245144 244926 245063 245106 244490 243423
52479 243423 242738 242834 243331 243956 245003 246570 248044 248923 249626 250829 252325 253320 253657 253997 254745 255605 256417
52462 256417 257803 260479 264335 268569 272517 275957 278787 280794 281790 281679 280356 277772 274193 270263 266653
52447 266653 263645 261058 258586 256188 254168 252880 252390 252445 252693 252838 252539 251366 249084 246087 243410 242048
52431 242048 242123 242766 242955 242518 242237 242973 244751 246721 247871 247781 246936 246463 247381 249761 252542 254373 254766
52414 254766 254397 254309 255011 256319 257845 259392 261026 263057 266048 270632 277047 284828 293128 301385 309494
52399 309494 317213 323587 327364 328055 326307 323133 319034 314072 308530 303075 298263 294178 290657 287622
52385 287622 285107 283182 282006 281796 282568 283966 285505 286949 288359 289800 291196 292535 294099 296307 299314
52370 299314 302886 306729 310846 315445 320534 325752 330592 334575 337247 338270 337709 336036 333712 330882
52356 330882 327701 324758 322805 322046 322003 322183 322636 323686 325285 326890 327951 328398 328653 329279 330605 332563
52340 332563 334780 336898 338932 341374 344857 349607 355236 361157 367138 373346 379949 386946 394409 402629
52326 402629 411895 422384 434381 448262 463934 480506 496911 512808 528553 544394 560124 575566
52314 575566 590908 606318 621508 636022 649832 663397 677147 691121 705199 719556 734673
52303 734673 750754 767183 782775 796650 808792 819744 829994 839711 848735 856518 862348 865949
52291 865949 867705 867933 866177 861691 854554 845842 836686 827646 818980 810930 803594 796994 791520 787851
52277 787851 786223 786192 787360 789877 793847 798743 803870 809158 815064 821952 829967 839268 849794 860904
52263 860904 871729 881953 891945 902183 912821 923725 934607 945161 955423 965927 977176 988991
52251 988991 1000704 1011851 1022295 1031713 1039467 1045162 1048913 1050822 1050507 1047417 1041533 1033592 1024654 1015515
52237 1015515 1006446 997349 988101 978675 969062 959305 949710 940679 932123 923374 914026 904651 896222 889017
52223 889017 882597 876728 871693 867635 864230 861243 858922 857570 857124 857463 858702 860877 863724 867104 871306
52208 871306 876470 882016 887131 891703 896225 900880 905228 908922 912256 915774 919617 923508 927241 930929
52194 930929 934854 939226 944094 949370 954877 960396 965768 970984 976096 980914 984851 987271 987986 987151 984673
52179 984673 980140 973571 965889 958175 950596 942515 933623 924515 916046 908595 902171 896857 892783 889834
52165 889834 887754 886475 886123 886793 888514 891339 895124 899294 903162 906588 909983 913510 916542 918170 918118
52150 918118 916985 915746 915144 915352 915876 915900 915083 914068 913921 915022 916788 918478 919835 920760 920881 919959 918607
52133 918607 918066 919166 921762 925298 929685 935527 943575 954063 966483 980001 994251 1009803 1027815
52120 1027815 1049155 1073754 1100618 1128323 1155619 1181840 1206916 1230994 1254076 1275958 1296357
52109 1296357 1314909 1331197 1344972 1356387 1365871 1373772 1380202 1385148 1388605 1390701 1391787 1392345 1392656
52096 1392656 1392592 1391823 1390089 1387186 1382898 1377136 1369892 1360794 1349041 1334240 1317153 1299150 1281009
52083 1281009 1262807 1244848 1228057 1213268 1200715 1190415 1182502 1176885 1173133 1171069 1171072 1173355 1177347
52070 1177347 1182266 1188061 1195310 1204403 1215230 1227528 1240975 1254995 1268857 1282058 1294432 1306012
52058 1306012 1317054 1328023 1339129 1349879 1359439 1367440 1374155 1379916 1384640 1387916 1389337 1388719 1386142
52045 1386142 1381683 1374940 1365092 1351777 1335744 1318215 1299785 1280384 1260206 1240028 1220450 1201433
52033 1201433 1182830 1164975 1148393 1133271 1119625 1107741 1098011 1090282 1083614 1076804 1069141 1060692
52021 1060692 1051950 1043212 1034317 1025030 1015508 1006229 997479 989115 980823 972451 964115 956139 948821 942031
52007 942031 935076 927170 918006 907633 895946 882721 868106 852584 836394 819441 801994 785009
51995 785009 769415 755338 742251 729661 717470 705942 695572 686700 679004 671621 663963 656141
51983 656141 648374 640388 631755 622441 612551 601818 589942 577275 564597 552275 540132 528132
51971 528132 516661 506085 496604 488623 482762 479249 477792 478285 481171 486686 494061 501896 509184 515675
51957 515675 521478 526678 531178 534483 535690 534101 529948 524312 518311 512592 507475 503206 499936 497845
51943 497845 497434 499475 504466 512342 522854 535952 551564 569268 588582 609387 631636 654695
51931 654695 677417 698846 718322 734692 746002 750491 747629 737860 721698 699725 673384 644993
51919 644993 616690 589614 564191 540689 519190 499417 481091 464338 449505 436755 426158
51908 426158 417960 412319 408818 406708 405733 406393 409194 413870 419603 425845 432591 439835 446965 452937 457060
51893 457060 459422 460399 459848 457027 451382 443226 433560 423425 413568 404558 396914 391107 387525 386317
51879 386317 387119 389133 391795 395344 400443 407250 415156 423466 431958 440606 449039 456534 462422 466339
51865 466339 468221 468254 466745 463885 459740 454600 449172 444172 439776 435747 432088 429281 427819 427786 429102
51850 429102 431852 435973 440646 444486 446563 446997 446308 444374 440494 434478 427256 420116 413626 407537 401586
51835 401586 395905 390681 385795 381081 376748 373346 371395 371120 372419 374888 377887 380735 382915 384125
51821 384125 384216 383172 381090 378112 374425 370431 366890 364669 364194 365084 366378 367211 367372 367321 367645 368508 369569
51804 369569 370367 370693 370590 370150 369444 368611 367840 367233 366820 366746 367277 368436 369697 370249 369652 368102 366041 363751
51786 363751 361460 359593 358536 358219 358276 358688 359900 362097 364699 366840 368232 369233 370223 371236 372174 373112
51770 373112 374321 376189 379117 383300 388607 394876 402250 410885 420267 429258 436957 443272 448362 451828
51756 451828 452796 450720 445798 438685 430055 420480 410448 400373 390630 381623 373777 367428 362653 359048
51742 359048 355773 352174 348604 346322 346231 347913 350329 353257 357429 363241 370009 376784 383304 389590 395078
51727 395078 398903 400946 401984 402733 403289 403644 404179 405287 406823 408209 408834 408177 405863 402034 397489 393088
51711 393088 389082 385275 381652 378457 375775 373448 371379 369554 367847 366288 365517 366391 368905 371978 374571
51696 374571 376584 378359 379779 380384 380069 379185 378117 377198 376857 377373 378505 379792 381065 382216 382638 381527
51680 381527 378797 375149 371174 366992 362938 359898 358534 358638 359674 361574 364545 368488 373144 378539
51666 378539 384697 391067 396880 402157 407757 414237 421007 426813 430686 432210 431257 427948 422851 416927
51652 416927 411192 406489 403496 402724 404384 408260 413677 419504 424322 426879 426629 423845 419142 412945 405538
51637 405538 397493 389757 383129 377839 373767 370865 369125 368279 367871 367593 367254 366530 365131 363304 361743
51622 361743 360749 359781 358091 355574 352735 350028 347548 345171 342617 339424 335263 330451 325885 322326 319818
51607 319818 317906 316358 315505 315773 316935 318041 318306 317957 318006 319254 321833 325679 330949 337753 345817 354671
51591 354671 363868 372794 380594 386657 390887 393160 392869 389593 384069 377914 372366 367728 364061 361802
51577 361802 361486 363209 366689 371731 378471 387244 398191 410901 424480 438179 451908 466016 480818
51564 480818 496617 513909 532954 553096 573130 592659 612781 635273 661231 690519 722139
51553 722139 754805 787205 817780 844291 864011 874884 876531 869898 856081 835934 810568 781361
51541 781361 749333 715189 680223 646485 615643 588246 564408 544523 528747 516418 506748 499585
51529 499585 494698 490699 485700 479042 471562 464136 456755 449145 441441 433867 426381 419053 412258 406000
51515 406000 399518 392157 384435 377687 372661 368911 365579 362341 359389 356811 354366 351838 349324 347078
51501 347078 345206 343680 342547 341879 341524 341160 340752 340704 341308 342209 342786 342981 343424 344691 346772 349355 352276
51484 352276 355372 358101 359727 359950 359190 358119 357034 355718 353862 351523 349169 347281 345901 344609 343003
51469 343003 341168 339541 338225 336623 334004 330395 326584 323157 319875 316241 312411 309077 306617 304828
51455 304828 303534 302938 303204 304077 305242 306757 308854 311489 314338 317189 320128 323505 327827 333533 340682
51440 340682 349037 358578 369633 382173 395107 406644 415412 421169 424597 426577 427561 427444 426073 423823
51426 423823 421403 418992 415952 411616 406055 399823 393350 386945 380972 375497 369998 364061 358178 353287
51412 353287 349638 346735 344351 342908 342734 343503 344645 345893 347199 348547 350033 351803 353749 355565 357180
51397 357180 358833 360689 362750 365167 368158 371592 375187 379262 384682 391818 400168 409388 420183 433619
51383 433619 449947 468597 489163 512017 538144 568682 604244 644296 687451 732743 780243
51372 780243 829875 879831 926757 967388 999544 1021767 1032824 1031972 1019366 996046 963670 924268
51360 924268 879871 832210 782860 733480 685519 639757 596547 556551 520830 490089 464223
51349 464223 442726 425223 411418 400834 392868 386826 381807 376880 371678 366571 362012 357929 354073
51336 354073 350696 348361 347155 346607 346449 346998 348499 350459 352024 352801 352959 352670 351868 350604 349183 347752
51320 347752 346062 343858 341293 338699 336143 333528 331042 329127 327930 327054 325981 324670 323753 324229 326774
51305 326774 330963 335183 337661 337781 336327 334497 332968 331897 331319 331119 330845 329908 328065 325572 322886
51290 322886 320330 317999 315934 314370 313737 314293 315825 317901 320345 323262 326620 330213 334098 338665 344084
51275 344084 349864 355160 359253 361762 362760 362915 363139 363823 364673 365499 366730 368802 371386 373697 375335 376351
51259 376351 376706 376196 374899 373149 371004 368112 364258 359786 355381 351575 348470 345838 343476 341507 340106
51244 340106 338867 336894 333844 330574 328284 327226 326724 326184 325493 324598 323515 322820 323367 325189 327279 328834
51228 328834 330202 332186 334753 337008 338252 338563 338308 337540 336108 334175 332295 330832 329441 327464 324986
51213 324986 323176 323242 325178 327877 330293 332104 333393 334401 335721 338069 341417 344749 347123 348786 350835
51198 350835 353897 357503 360755 363260 365265 367040 368415 369087 369236 369463 369920 369884 368606 366388 364309 362963
51182 362963 362052 361280 360966 361407 362128 362228 361247 359477 357708 356867 357475 359037 360256 360342 359913 360186 361445
51165 361445 362782 363233 362668 361528 360202 358952 358124 358069 358834 360083 361333 362212 362509 362137 361176 359940 358794
51148 358794 357756 356438 354583 352517 350793 349492 348269 347049 346176 345741 345306 344557 343848 343741 344296 345177
51132 345177 346152 347120 347832 348079 348070 348314 349085 350266 351637 353095 354629 356234 357779 358922 359370 359386 359749
51115 359749 360894 362373 363521 364453 365942 368440 371598 374735 377366 379286 380503 381259 381901 382677 383792
51100 383792 385505 387866 390421 392479 393753 394569 395469 396734 398186 399232 399200 397953 396104 394419 393142
51085 393142 392122 391397 391228 391638 392368 393271 394384 395584 396545 397133 397549 398055 398817 399928 401303 402631 403799
51068 403799 405224 407354 409999 412757 416054 421019 428162 436890 446606 457630 470584 485434 501649
51055 501649 518873 536737 554299 570282 583965 595511 605591 614991 624337 633698 642375 649422
51043 649422 654327 657013 657336 654955 649658 641612 631411 620144 609213 599715 591993 585894 581092 576805
51029 576805 571556 563987 553901 542058 529086 515346 501855 490402 482222 477046 473898 472344 472440
51016 472440 473965 476563 480472 486384 494386 503605 513172 523088 533805 545202 556400 566622 575948
51003 575948 585065 594295 603030 610190 615205 618331 620020 620273 618895 616141 612705 609055 605172 600975
50989 600975 596656 592449 588514 585291 583697 584538 587864 593214 600376 609578 620975 634258 648841 664224
50975 664224 680048 695978 711609 726574 740851 755086 770463 788129 808872 833356 862222
50964 862222 895580 932762 973142 1016981 1064831 1116228 1169773 1224566 1280754 1338268 1395776
50953 1395776 1451435 1504224 1553934 1600218 1642252 1679186 1710488 1736000 1756058 1771436 1782916
50942 1782916 1791118 1797018 1802083 1807368 1812779 1817657 1821672 1824480 1825045 1822375 1816815 1809596 1800999 1789904
50928 1789904 1775348 1757476 1736564 1712065 1683389 1650880 1615126 1575687 1531461 1482319 1429758
50917 1429758 1375874 1322144 1269267 1217796 1168602 1122723 1080722 1042308 1006832 974219 945054
50906 945054 919611 897197 876747 857753 840259 824244 809438 795655 782900 771197 760553
50895 760553 751032 742679 735455 729413 724742 721430 719085 717277 715855 714747 713758 712917 712755 713773 715789
50880 715789 718186 720688 723454 726532 729715 733000 736784 741531 747531 754950 763789 773673 784040 794678
50866 794678 805939 818423 832634 848889 867239 887412 909077 932243 957287 984685 1014938
50855 1014938 1048678 1086475 1128492 1174651 1225283 1281445 1344491 1415445 1494707 1582098 1677165
50844 1677165 1779582 1889269 2005939 2128545 2255355 2384524 2514410 2643393 2769573
50835 2769573 2890494 3002892 3102960 3187415 3254566 3304320 3337463 3355347 3359986 3353624 3337995
50824 3337995 3314617 3286041 3256260 3229437 3208450 3194732 3188797 3190234 3197402 3207675 3218022 3225157
50812 3225157 3225515 3215727 3193356 3157065 3106240 3040709 2960831 2867569 2762451 2647527 2525304
50801 2525304 2398553 2270157 2143046 2019924 1902836 1793129 1691955 1600568 1519880 1449893
50791 1449893 1389792 1338510 1295090 1258813 1229301 1206347 1189349 1177038 1168041 1161584 1157395 1155064
50779 1155064 1153844 1152964 1151803 1149850 1146874 1143073 1138670 1133388 1126695 1118558 1109519 1099938 1089596 1078170
50765 1078170 1065722 1052453 1038379 1023573 1008547 994016 980297 967184 954363 941820 929840
50754 929840 918715 908554 899433 891830 886687 884736 885746 888861 893780 901240 912128 926526 944085
50741 944085 965030 990146 1019712 1053031 1089259 1128297 1170503 1215783 1263581 1313749 1366916
50730 1366916 1423658 1483533 1545283 1607832 1670654 1733243 1794866 1855180 1914524 1972983 2029310
50719 2029310 2081471 2128278 2169819 2205993 2235169 2254788 2263023 2259543 2245019 2220680 2188468 2151238
50707 2151238 2112422 2075402 2042862 2016364 1996437 1983214 1976863 1977177 1982894 1991847 2001773 2010664 2016423
50694 2016423 2016748 2009675 1993886 1968358 1932142 1884930 1827727 1762644 1692182 1618900 1545492 1474566
50682 1474566 1408176 1347658 1293864 1247281 1207917 1175383 1149303 1129613 1116444 1109792 1109232 1113889
50670 1113889 1122809 1135492 1151923 1171892 1194465 1218337 1242451 1265861 1287261 1305422 1320304
50659 1320304 1333143 1345123 1356397 1366765 1376796 1387665 1400081 1413881 1428586 1443887 1459621
50648 1459621 1475805 1492810 1511172 1531168 1552889 1576718 1603282 1632816 1664927 1699181 1735525
50637 1735525 1773912 1813821 1854432 1895035 1935074 1974120 2012221 2050061 2088303 2126755 2164499
50626 2164499 2200885 2236221 2271418 2306835 2340911 2369510 2386998 2389003 2374838 2347470 2311581
50615 2311581 2272055 2233715 2200850 2175847 2158523 2147373 2141306 2139737 2141453 2144225 2145633 2143721
50603 2143721 2136887 2123805 2103685 2076099 2040378 1995761 1942541 1882593 1818370 1751715 1684002
50592 1684002 1616824 1551669 1489059 1428853 1371473 1318025 1268940 1223275 1179962 1139262 1102326
50581 1102326 1069619 1040541 1014555 991932 973035 957392 943993 932397 923185 917304 915175 916466
50569 916466 920528 926890 935344 945624 957212 969608 982801 997320 1013696 1031898 1051390 1071731
50557 1071731 1093043 1115827 1140356 1166289 1192914 1219702 1246391 1272562 1297424 1320416 1341924
50546 1341924 1363015 1384311 1405415 1425655 1445098 1464532 1484712 1506165 1529800 1557186 1589832
50535 1589832 1628285 1672148 1720886 1774399 1832938 1896726 1965746 2039742 2118334 2201259 2288587
50524 2288587 2380659 2477609 2578761 2682485 2786766 2890000 2991104 3088759 3180676 3263906
50514 3263906 3335818 3394456 3438072 3464998 3474386 3466615 3442500 3402401 3346736 3277175 3196718 3108720
50502 3108720 3016567 2924247 2836172 2755865 2685434 2626744 2582335 2554363 2543118 2547329 2565515
50491 2565515 2596029 2635956 2681016 2726736 2768929 2802917 2823412 2825944 2808094 2769154 2709346
50480 2709346 2630075 2534510 2427073 2312281 2194221 2076622 1962668 1854584 1753772 1661286
50470 1661286 1577870 1503575 1437732 1379418 1327782 1281932 1240805 1203330 1168782 1136984 1108184
50459 1108184 1082645 1060410 1041589 1026705 1016344 1010476 1008491 1009916 1014591 1022115 1031766 1043225
50447 1043225 1056676 1071833 1087714 1104082 1122433 1144529 1170231 1197629 1225027 1251827 1277549
50436 1277549 1301048 1320909 1335968 1345368 1348984 1348054 1344683 1340398 1335624 1330540 1325619 1321145 1317050
50423 1317050 1313642 1311817 1312192 1314689 1319316 1326613 1336872 1349742 1365288 1384794 1409742 1440430 1476220
50410 1476220 1516607 1561176 1608923 1658581 1709488 1761397 1813617 1865125 1915392 1964111 2010029
50399 2010029 2050944 2085254 2112824 2133953 2147966 2153246 2148238 2132068 2104564 2066285 2018627 1963598
50387 1963598 1903329 1839737 1774629 1710121 1648865 1593643 1546520 1508423 1479517 1459658 1448348
50376 1448348 1444634 1447546 1456487 1470792 1488979 1508736 1527507 1542823 1552317 1554016 1546784 1530294
50364 1530294 1504730 1470838 1430118 1384577 1336306 1287411 1239857 1194821 1152520 1113298 1078590
50353 1078590 1049913 1027031 1008039 991384 976899 964607 953499 942081 929451 915218 898939
50342 898939 880397 860259 839927 820872 804315 791192 781892 776170 773572 773785 776426 780843 786400
50329 786400 792655 799106 805229 811082 817388 824574 832190 839687 847285 855480 864130 872723 881185 889642
50315 889642 897573 904052 908850 912586 915693 917892 918834 918656 917767 916596 915770 916021 917663 920495 924358
50300 924358 929386 935667 943172 952211 963492 977456 993965 1012930 1034958 1061058 1091961 1127837
50288 1127837 1168331 1212668 1259850 1308486 1355543 1395009 1418969 1421517 1402180 1365653 1318699
50277 1318699 1267579 1217319 1171565 1132247 1099735 1073637 1053291 1037675 1025576 1016125 1008804 1002984
50265 1002984 998041 994119 992015 991862 992572 993180 994244 997223 1002807 1010637 1020415 1032271 1045891 1060096
50251 1060096 1073743 1086523 1098617 1110151 1121391 1132929 1145062 1157245 1168594 1178649 1187114
50240 1187114 1193085 1195219 1192694 1185679 1174992 1161861 1147873 1134464 1122244 1111246 1101828 1094681
50228 1094681 1089671 1085272 1079502 1070933 1058527 1041177 1018329 990939 961164 931009 901572 873497
50216 873497 847507 824232 803740 785509 768873 753577 739987 728642 719474 711633 704314 697611
50204 697611 692227 688445 685722 683322 680998 678957 677387 676118 674687 672682 670147 667481 664774 661476
50190 661476 657146 652408 648609 646316 644559 641815 637478 632165 626884 622279 618491 615277 612144 608632
50176 608632 604689 600772 597505 595206 593663 592338 590841 589278 588173 588045 588981 590580 592316 594009 595916
50161 595916 598292 600933 603409 605702 608292 611483 615067 618928 623623 629944 638161 648147 659965 673717
50147 673717 688932 704839 721331 739063 758476 779297 801205 824319 848724 874094 900222
50136 900222 927399 955777 984830 1013946 1043174 1072838 1102742 1132361 1161443 1189748 1216275
50125 1216275 1239417 1257668 1269684 1273960 1269490 1256850 1237814 1213733 1185072 1152715 1118706 1085043
50113 1085043 1052447 1021063 991799 966024 944111 925158 908235 893229 880247 868728 857546
50102 857546 845805 833354 820762 808949 798580 789584 781265 773018 764903 757526 751479 746994 744029
50089 744029 742528 742519 743903 746241 748900 751546 754397 757845 761880 766182 770780 776251 782969 790310 796997
50074 796997 802353 806937 811708 816685 820757 822848 823002 822093 820708 818701 815833 812410 808959 805521 801602
50059 801602 796875 791639 786503 781763 777201 772412 767254 762088 757619 754455 752738 752228 752742 754406 757403
50044 757403 761626 766676 772238 778361 785441 793938 804043 815449 827454 839426 851257 863299 875825
50031 875825 888616 901138 913071 924546 935893 947274 958629 969929 981418 993597 1006920
50020 1006920 1021468 1036835 1052366 1067579 1082384 1096789 1110343 1121995 1130745 1136494 1140064 1142269
50008 1142269 1143175 1142430 1140031 1136178 1130299 1120811 1106355 1087034 1064062 1038459 1010693 981660 953317
49995 953317 927852 906427 888907 874563 862696 852810 844520 837288 830096 821738 811829 801362 791722
49982 791722 783117 774329 764029 751852 738170 723441 708195 693208 679068 665667 652582 639961
49970 639961 628659 619371 611961 605771 600432 596139 593117 590954 588578 585047 580399 575675 572009 569801
49956 569801 568733 568387 568656 569739 571996 575785 581239 588233 596666 606654 618168 630535 642571 653284
49942 653284 662339 669913 676348 681918 686588 689927 691500 691407 690085 687488 682827 675378 665271 653186
49928 653186 639622 624884 609704 595325 582811 572497 564158 557431 551996 547666 544522 542826 542573
49915 542573 543211 544028 544836 546123 548399 551449 554399 556653 558649 561456 565653 570866 576490 582502 589282
49900 589282 596971 605469 614917 625624 637479 649897 662373 674550 685613 694244 699647 702196 702707
49887 702707 701499 698671 694767 690297 684767 677068 666942 655356 643268 630762 617719 604564 591869
49874 591869 579807 568623 559112 551856 546279 541286 536693 533287 531469 530683 530349 530601 531760 533774
49860 533774 536664 540914 546805 553670 560527 567368 575334 585576 598252 612504 627015 640637 652910
49847 652910 664078 674351 683231 689863 694004 696135 696621 695239 691730 686388 679716 671800 662426 651725
49833 651725 640389 629236 618767 609138 600392 592663 586180 581064 577179 574276 572275 571259 571192 571880
49819 571880 573285 575676 579383 584612 591564 600409 610916 622366 634030 645538 656527 666258 674041
49806 674041 679892 684382 687875 690332 691769 692427 692391 691445 689450 686504 682590 677381 670594 662323 652884
49791 652884 642582 631699 620442 608775 596639 584491 573291 563754 555948 549832 545659 543401
49779 543401 542235 541193 540114 539327 538662 537597 536419 536392 538428 542204 546891 552220 558361 565285 572813
49764 572813 581011 589870 598705 606454 612671 617871 622829 627794 632429 636167 638624 639836 640086 639247 636456
49749 636456 630829 622517 612687 602476 592378 582723 574147 567256 562160 558591 556201 554534 553154 552165
49735 552165 552172 553241 554327 554418 554050 554884 557814 562226 567243 572741 578664 584131 588129 590904 593952 598635
49719 598635 605251 613426 622825 633310 644812 657213 670121 682634 693569 702069 707833 710781 710778
49706 710778 707883 702617 695745 687942 679767 671809 664623 658609 654140 651630 651143 651853 652160 650628 646835
49691 646835 641373 635192 629065 623477 618713 614904 612225 611161 612459 616505 622804 630305 638357 647136
49677 647136 657086 668286 680642 694488 710552 729201 749803 770720 789719 804598 814010 818006
49665 818006 817710 814393 809092 803059 798010 795458 795911 799009 804283 811314 818997 825001 826344 820781 807931
49650 807931 789282 767218 743943 721116 700104 682009 667228 655321 645681 638234 633212 630406
49638 630406 629095 628730 629240 630539 632153 633613 634943 636368 637699 638350 637863 636103 632976 628365 622486
49623 622486 615952 609218 602201 594734 587253 580687 575661 572078 569544 567919 567259 567404 567910 568320 568347 567855
49607 567855 566971 566256 566503 568134 570834 573896 576788 579294 581285 582690 583761 585044 586813 588633 589779
49592 589779 590147 590456 591415 592896 594239 595215 596291 597833 599451 600424 600526 600111 599512 598782 598096 597928 598592
49575 598592 599780 600892 601751 602802 604574 607152 610299 614023 618853 625423 633838 643573 653992 664709
49561 664709 675338 685204 693630 700385 705463 708515 708986 706888 702981 697965 691913 684843 677525 671243
49547 671243 666838 664290 663111 662829 663108 663749 664676 665800 666963 668147 669585 671409 673295 674781 675936
49532 675936 677472 680153 684282 689759 696425 704396 714212 726598 741838 759385 778332 798121 818413
49519 818413 838257 855861 869441 878221 882558 883485 882295 880337 878848 878899 881356 886662 894555 904204
49505 904204 914603 924677 933018 938026 938572 934337 925419 911940 894304 873598 851418 829403 809005
49492 809005 791320 776716 764755 754822 746741 740533 735794 731836 728409 725868 724527 724233 724652 725620
49478 725620 726995 728460 729739 730814 731761 732565 733317 734393 736086 738126 739915 741304 742872 745298 748652
49463 748652 752474 756354 760210 764068 767835 771338 774414 776891 778657 779855 780797 781534 781602 780455 778080
49448 778080 774995 771650 768113 764377 760704 757472 754865 752906 751687 751343 751801 752709 753718 754780 756202
49433 756202 758407 761610 765710 770498 775968 782329 789802 798629 809321 822668 839249 858970 881224
49420 881224 905421 931180 958055 985181 1011063 1033387 1049035 1054927 1049583 1034411 1013509 991972
49408 991972 973824 960922 953245 950029 950792 955584 964453 976818 991414 1006920 1022553 1037994 1052899
49395 1052899 1066801 1079578 1091677 1103581 1115149 1125693 1134617 1141697 1146847 1149929 1150852 1149583 1146007
49382 1146007 1140003 1131786 1121933 1110978 1099193 1086848 1074447 1062579 1051704 1042219 1034528 1028896
49370 1028896 1025439 1024313 1025624 1028950 1033300 1037888 1042736 1048144 1053712 1058257 1060742 1060946 1059258 1056095
49356 1056095 1051697 1046250 1040042 1033421 1026578 1019418 1011864 1004398 998066 993700 991226 989944 989257 988873
49342 988873 988452 987523 985792 983224 979706 974888 968455 960425 951208 941558 932420 924535 918107 913014 909343
49327 909343 907516 907974 910995 916780 925391 936516 949645 964577 981336 999361 1016946 1031764 1041889
49314 1041889 1046323 1044927 1038249 1027470 1014154 999810 985404 971151 956771 942205 928097 915413
49302 915413 904574 895225 886975 880089 875226 872631 871820 872046 872922 874633 877573 881660 886021 889556 891928
49287 891928 893756 895649 897278 897703 896451 893936 890803 887200 882849 877645 872014 866758 862672 860283
49273 860283 859802 861168 864094 868129 872774 877604 882272 886413 889644 891688 892509 892306 891405 890082 888468
49258 888468 886675 885056 884261 884936 887523 892524 900705 912653 928083 945868 964754 983739 1001727
49245 1001727 1017254 1028874 1035603 1036886 1032514 1022901 1009260 993181 976102 959284 943864 930469
49233 930469 918918 908793 900309 894274 891273 891215 893597 897727 902648 907437 911886 916519 921673 926868
49219 926868 931402 935267 939087 943391 948327 953942 960238 966934 973616 980260 987300 995031 1003240 1011547
49205 1011547 1019899 1028562 1037877 1048197 1059778 1072483 1085801 1099385 1113353 1127736 1141900 1155015
49193 1155015 1166972 1178320 1189286 1199427 1208343 1216187 1223227 1229436 1234842 1239838 1244612 1248746 1251964
49180 1251964 1255143 1259966 1267634 1278354 1291948 1308396 1327783 1350309 1376449 1406623 1440578 1477591
49168 1477591 1517322 1559814 1604239 1648005 1687397 1718876 1739911 1749555 1749055 1741669 1731107 1719898
49156 1719898 1709227 1699851 1692503 1687577 1684927 1684076 1684290 1684539 1683890 1682169 1680108 1678792 1679090 1681409 1685675
49141 1685675 1691523 1698760 1707605 1718247 1730269 1742803 1755240 1767558 1780079 1793227 1807426 1822765
49129 1822765 1838740 1854725 1870744 1887365 1904793 1922555 1940217 1957924 1975937 1994155 2012567
49118 2012567 2031782 2052527 2074802 2098064 2122304 2148505 2178091 2212430 2252955 2301294 2359036
49107 2359036 2427618 2508688 2604054 2714576 2838686 2971802 3107129 3237647 3358868 3470726
49097 3470726 3575918 3674237 3757435 3810830 3822003 3789169 3721576 3632298 3530707 3420322 3301416
49086 3301416 3174547 3042603 2910977 2786120 2673313 2575266 2492438 2424072 2368681 2324162
49076 2324162 2288318 2259470 2236356 2217635 2201948 2188405 2176631 2166319 2157039 2148426 2140199 2132065
49064 2132065 2123989 2116482 2110157 2104931 2100171 2095664 2091949 2089527 2088254 2087780 2088041 2088909 2089805 2090237 2090505
49049 2090505 2091389 2093284 2096130 2099996 2105107 2111219 2117597 2123920 2130683 2138247 2145750 2151451 2154133 2153848
49035 2153848 2151366 2147434 2142775 2138454 2135693 2135226 2136912 2139951 2143368 2146391 2148594 2149814 2149909 2148649 2145981
49020 2145981 2142356 2138584 2135326 2132866 2131351 2130988 2131906 2134047 2137365 2141924 2147638 2154095 2160821 2167554
49006 2167554 2174142 2180449 2186657 2193384 2201067 2209278 2217004 2223546 2228875 2233214 2236710 2239472 2241501 2242508
48992 2242508 2242151 2240519 2237997 2234609 2229909 2223706 2216513 2209093 2201921 2195276 2189439 2184493 2180175 2176252
48978 2176252 2172812 2169959 2167539 2165489 2164160 2163851 2164195 2164323 2163567 2161678 2158654 2154787 2150748 2147129 2143908
48963 2143908 2140772 2137878 2135857 2135106 2135616 2137470 2140851 2145360 2150027 2154519 2159890 2167619 2178125 2190649
48949 2190649 2204369 2219142 2235269 2253094 2272823 2294338 2317057 2340322 2364020 2388536 2414091
48938 2414091 2440438 2467286 2494681 2522838 2551964 2582494 2615170 2650586 2688862 2729993 2774143
48927 2774143 2821154 2870002 2919386 2968955 3019537 3072018 3126390 3182035 3238440 3295240 3351899
48916 3351899 3407878 3463081 3517717 3571620 3623957 3673760 3720579 3764525 3805800 3844468 3880723
48905 3880723 3915175 3948506 3980685 4010768 4037834 4062117 4084885 4107091 4128503 4148331 4166323
48894 4166323 4182760 4197463 4209405 4217523 4221722 4222851 4221816 4218870 4213728 4206195 4196539 4185253 4172537
48881 4172537 4158139 4141609 4122590 4100981 4077017 4051203 4023857 3994644 3962856 3928227 3891156
48870 3891156 3851998 3810528 3766367 3719586 3670565 3619705 3567769 3516113 3465870 3417034 3368984
48859 3368984 3321879 3276837 3234703 3195356 3158444 3124188 3093058 3065136 3040153 3017749 2997442
48848 2997442 2978749 2961748 2947157 2935413 2925878 2917415 2909607 2903125 2899084 2898367 2901333 2907677 2916503
48835 2916503 2926896 2938480 2951330 2965542 2981159 2998366 3017236 3037198 3057117 3076141 3094346
48824 3094346 3112452 3130932 3149480 3167347 3184178 3200518 3217368 3235231 3253688 3271899 3289328
48813 3289328 3305971 3322174 3338433 3355102 3372000 3388456 3404092 3419450 3435581 3453004 3471372
48802 3471372 3490204 3509626 3530190 3552082 3574785 3597640 3620595 3644140 3668384 3692468 3715188
48791 3715188 3736018 3755150 3772571 3787705 3800184 3810540 3819777 3828542 3836857 3844296 3849996 3852788
48779 3852788 3851780 3846743 3837667 3824176 3805734 3782221 3753947 3721242 3684469 3644311 3601665 3557283
48767 3557283 3511774 3465722 3419415 3372653 3325294 3277903 3231339 3185857 3141188 3097445 3055260
48756 3055260 3014944 2976177 2938772 2903183 2869914 2838963 2810193 2783810 2760064 2738820 2719836
48745 2719836 2703167 2688836 2676391 2665290 2655657 2648219 2643449 2641139 2640825 2642269 2645329 2649501 2653804
48732 2653804 2657203 2659233 2660267 2661134 2662473 2664482 2667157 2670455 2674121 2677636 2680553 2682769 2684378 2685445
48718 2685445 2686045 2686284 2686087 2685179 2683553 2681768 2680482 2679762 2679164 2678401 2677618 2677003 2676519 2676123 2676007 2676420 2677350
48701 2677350 2678570 2679959 2681683 2684068 2687277 2691116 2695225 2699446 2703948 2708904 2714266 2719999 2726370 2733607
48687 2733607 2741238 2748119 2753402 2757315 2760809 2764495 2768208 2771577 2774798 2778655 2783858 2790447 2797752 2804810
48673 2804810 2810825 2815442 2818798 2821348 2823580 2825820 2828245 2830886 2833414 2834890 2833917 2829147 2819578 2804368
48659 2804368 2782756 2754580 2720847 2683370 2643640 2602302 2559837 2517314 2476003 2436435 2398433
48648 2398433 2362171 2328696 2299076 2273387 2250847 2230761 2212886 2196974 2182366 2168117 2153291
48637 2153291 2137212 2119778 2101625 2083639 2066174 2048978 2031933 2015523 2000255 1985888 1971528
48626 1971528 1956400 1940275 1923261 1905596 1887765 1870580 1854855 1840927 1828562 1817387 1807401
48615 1807401 1799022 1792674 1788537 1786691 1787170 1789579 1792879 1796038 1798893 1801922 1805154 1807766 1808923 1808555
48601 1808555 1807107 1804988 1802655 1800824 1800095 1800516 1801810 1803829 1806430 1809096 1811094 1811846 1810840 1807441 1801335
48586 1801335 1793039 1783507 1773182 1761830 1749230 1735541 1721008 1705828 1690481 1675749 1662122 1649479
48574 1649479 1637570 1626588 1617012 1609014 1602267 1596386 1591531 1588503 1588186 1590802 1595756 1602110 1608953 1615248
48560 1615248 1619786 1621714 1620965 1617815 1612180 1603687 1592318 1578633 1563496 1547936 1533140 1520064 1508930
48547 1508930 1499272 1490379 1481474 1471815 1461056 1449383 1436971 1423624 1409395 1395142 1381701 1368763
48535 1368763 1355464 1341990 1329659 1319379 1310965 1304185 1299430 1296911 1296119 1296742 1299401 1304842 1312917
48522 1312917 1322950 1334436 1346549 1357308 1364075 1364951 1359432 1348154 1332609 1314820 1296663 1279459
48510 1279459 1264363 1252638 1244935 1240723 1239167 1240424 1245466 1254790 1267940 1284195 1302958 1323421
48498 1323421 1344512 1365263 1384609 1400660 1410874 1413546 1408876 1398379 1383556 1365489 1345351 1324691
48486 1324691 1304962 1286931 1270589 1255514 1241240 1227399 1213755 1200307 1187381 1175468 1164848
48475 1164848 1155452 1147088 1139719 1133424 1128182 1123721 1119567 1115311 1110991 1107132 1104209 1102186 1100855 1100516
48461 1100516 1101831 1104900 1109012 1113496 1118413 1124073 1130264 1136409 1142220 1147715 1152637 1156261 1157866 1157273
48447 1157273 1154919 1151520 1147572 1143117 1138037 1132519 1127014 1121780 1116761 1111906 1107167 1102129 1096060 1088596
48433 1088596 1080031 1070791 1061039 1050999 1041276 1032530 1025102 1019028 1013987 1009058 1003150 996096 988856 982218
48419 982218 975705 968257 959634 950679 942466 935584 929969 924987 919942 914835 910356 906904 904032 901231
48405 901231 898638 896445 894069 890645 886086 881050 876126 871640 867898 864904 861960 858205 853536 848568
48391 848568 843838 839499 835554 831875 828173 824475 821429 819640 818840 818202 817314 816390 815673 815129 814575 813798
48375 813798 812716 811748 811632 812522 813614 814085 814012 814066 814813 816715 820128 824759 829742 834832 840901 848736
48359 848736 858215 869305 882781 899006 916958 935542 954676 973650 989518 999184 1002637 1002403
48347 1002403 1000319 996778 992829 990677 991621 995209 1000883 1008977 1019772 1033033 1048903 1067990 1090254
48334 1090254 1114949 1141899 1171770 1205107 1242192 1283736 1330545 1382899 1441641 1509351 1588785
48323 1588785 1680735 1785418 1905547 2046157 2212316 2409729 2647409 2937676 3295176 3740088
48313 3740088 4302169 5017709 5921608 7043742 8408447 10028637 11897464 13985099 16227494
48304 16227494 18487828 20516759 21980873 22584945 22210469 20959725 19082372 16863425
48296 16863425 14552202 12339675 10352444 8651653 7245072 6108834 5204391 4487489
48288 4487489 3916060 3457056 3086533 2785201 2537053 2331096 2160378 2018522 1899033
48279 1899033 1797394 1711261 1638401 1576225 1523076 1478122 1440071 1407527 1380302 1358742 1341963
48268 1341963 1328229 1316724 1307491 1299958 1293113 1286949 1282214 1278788 1275761 1273138 1272046 1273076 1275626
48255 1275626 1279076 1283495 1288909 1294840 1300897 1307133 1313574 1319829 1325031 1327615 1325523 1317578 1304694 1289168
48241 1289168 1272924 1256983 1242137 1229063 1217811 1207979 1199356 1191796 1184754 1177776 1171223 1165598 1160353
48228 1160353 1154287 1147066 1139406 1131767 1123828 1115357 1106694 1098085 1089254 1079846 1069642 1058244 1045232
48215 1045232 1030822 1015740 1000241 983752 965657 945946 925054 903620 882464 862200 842684
48204 842684 823316 803979 785242 767635 751279 736250 722658 710172 698072 686104 674906
48193 674906 665395 657933 652166 647288 642459 637378 632525 628518 625264 622082 618592 614987 611537 608347
48179 608347 605621 603551 601930 600387 599019 598197 597677 596664 594987 593533 593078 593241 593064 592243 591301 590728
48163 590728 590421 589981 589246 588436 587807 587329 586850 586582 586996 588038 588872 588917 588711 589106 589868 589990 589330 589020 589991
48144 589991 591872 593711 595109 596153 596801 596925 596703 596544 596738 597359 598290 599174 599701 600094 601009 602781 605081
48127 605081 607424 609657 611824 613946 616116 618425 620660 622486 624101 626239 629284 632852 636445 640006
48113 640006 643566 646904 650068 653769 658744 665026 672238 680257 689100 698448 707835 717139 726491 735882
48099 735882 745340 755255 765994 777220 788089 798222 808194 818996 831134 844191 857138 869218
48087 869218 880613 892044 903630 914555 924123 932692 941140 949766 958249 966427 974473 982341 989579
48074 989579 995788 1000932 1005291 1009511 1014600 1021308 1029337 1037523 1044918 1051448 1057542 1063570 1069748 1076186
48060 1076186 1082730 1088956 1094482 1099154 1102834 1105148 1105591 1103908 1100391 1095772 1090634 1084790 1077443 1068145
48046 1068145 1057384 1046035 1034445 1022466 1010086 997529 984771 971519 957634 943090 927510
48035 927510 910413 892157 874129 857612 842747 828811 815105 801351 787649 774504 762567
48024 762567 751872 741523 730612 719320 708702 699427 691168 683159 674904 666249 657289 648450 640408
48011 640408 633545 627611 622132 617051 612761 609506 606957 604416 601370 597845 594334 591415 589315 587723
47997 587723 586070 584043 581860 579981 578566 577314 575844 574141 572479 570981 569471 567864 566458 565538
47983 565538 564811 563540 561362 558707 556207 553952 551642 549363 547716 547004 546633 545646 543727 541418 539469
47968 539469 538197 537464 536964 536480 536024 535820 535982 536263 536292 536130 536355 537497 539518 541923 544209 546125 547758
47951 547758 549524 551876 554819 557900 560854 564151 568590 574432 581218 588395 595781 603369 611001 618505
47937 618505 625977 633663 641558 649293 656462 662935 668796 674093 678830 683152 687238 690903 693484 694438
47923 694438 693989 692949 691877 690671 688977 686608 683368 678772 672343 664193 655151 646311 638413 631451
47909 631451 624758 617676 610343 603598 597998 593262 588981 585518 583612 583205 583265 582972 582606 582992 584395 586314
47893 586314 588279 590503 593625 597908 602866 607786 612484 617345 622627 628153 633870 640240 647577 655282
47879 655282 662362 668583 674524 680428 685659 689513 692048 693801 695083 695855 695973 695249 693524 690930 687789
47864 687789 684003 678876 671802 662951 653061 642886 633013 623785 615002 606055 596766 587788 579794 572623
47850 572623 565746 559215 553465 548440 543679 539268 535892 533884 532907 532751 533724 535853 538352 540418 542257
47835 542257 544773 548459 552926 557389 561282 564511 567401 570369 573482 576392 578758 580593 582144 583675
47821 583675 585505 587965 591109 594641 598301 602156 606412 611210 616774 623403 631101 639525 648643 659176
47807 659176 672060 687630 705595 725498 746817 768862 791083 813367 835621 857209 877199
47796 877199 895019 910371 922667 931209 935954 937544 936438 932619 926258 918072 908739 898464 887436
47783 887436 876178 865047 853888 842690 832223 823393 816159 809681 803497 798000 793701 790416 787333
47770 787333 783597 778797 773135 767173 761181 754728 747186 738641 729932 721668 713556 704955 695902 687246
47756 687246 679798 673640 668372 663847 660432 658534 658069 658495 659280 660143 660923 661554 662273 663677 666336 670438
47740 670438 675855 682408 689936 698288 707468 717662 728868 740624 752345 763947 775888 788581
47728 788581 801902 815271 828042 839773 850310 859654 867709 874170 878752 881408 882251 881356 878800
47715 878800 874708 869003 861254 851106 838896 825508 811620 797387 782908 768597 754885 741784
47703 741784 729066 716778 705430 695647 687740 681584 676915 673758 672452 673094 675048 677318 679465 681939
47689 681939 685447 690206 695975 702593 710259 719265 729570 740717 752264 764296 777207 790756 803689
47676 803689 814892 824806 835069 846524 858124 868089 875616 881065 884889 887051 887328 885680 882269
47663 882269 877477 871853 865734 858942 851097 842149 832348 821848 810735 799387 788354 777825 767587
47650 767587 757633 748421 740316 733109 726391 720221 715054 711075 707962 705506 704179 704708 706994 709808
47636 709808 711905 713317 715151 718194 722232 726895 732596 740109 749598 760662 773224 787744 804558
47623 804558 823504 844303 866840 890848 915713 940768 965463 989097 1010758 1029748 1045750
47612 1045750 1058332 1066622 1069831 1067868 1061077 1049570 1033218 1012218 987259 959096 928274 895391
47600 895391 861341 827118 793494 760988 730070 701284 675173 652058 631833 613992 598028
47589 598028 583820 571537 561125 552067 543744 535920 528717 522243 516520 511811 508568 506737 505341
47576 505341 503235 500346 497760 496406 496093 496095 496263 496996 498267 499316 499395 498389 496600 494383 492154 490329
47560 490329 488977 487840 486900 486527 486748 486808 485912 484172 482266 480356 477933 474729 471199 468002 465488 463816
47544 463816 463063 462880 462475 461342 459825 458725 458540 459245 460474 461561 461707 460592 458753 456992 455519 454116
47528 454116 452897 452300 452266 452131 451560 451042 451088 451442 451537 451362 451369 451840 452822 454441 456676 458994 460815 462249
47510 462249 463756 465164 465840 465875 466175 467063 467644 467137 466038 465229 464584 463414 461873 460876 460700 460642 460176 459578
47492 459578 459192 458822 458207 457472 456792 456196 455989 456771 458591 460634 462222 463678 465681 468211 470759 473216
47476 473216 475828 478468 480725 482744 485257 488598 492234 495496 498277 500718 502629 503699 504146 504704 505889
47461 505889 507467 508762 509429 509770 510238 510757 510815 510256 509669 509729 510412 511192 511910 513067 515264 518648 522944
47444 522944 527753 532839 538453 545401 554527 566030 579493 594451 610558 627324 644301 661770
47432 661770 680727 701800 724510 747825 771015 793491 814238 832077 846541 857966 866655 872368
47420 872368 874721 873688 869585 862881 854180 844116 833010 820734 807104 792326 777035 761890
47408 761890 747163 732641 718062 703729 690489 678822 668161 657553 646947 637214 628883 621545
47396 621545 614795 609052 604846 601839 599289 597177 596078 596088 596728 597937 600289 603977 608380 613064 618525
47381 618525 625340 633076 640665 647572 654021 660331 666592 672812 678834 684196 688525 691918 694458 695578
47367 695578 694541 691422 686862 680881 672814 662662 651651 640908 630223 618733 606387 593971
47355 593971 581967 570134 558217 546500 535459 525258 515794 506969 498815 491421 484819 478930 473689
47342 473689 469233 465736 462955 460198 457020 453735 450987 449003 447620 446843 446907 447731 448802 449701 450527 451676
47326 451676 453457 455913 458772 461552 463949 466215 468871 471981 475018 477564 479811 482103 484269 485776
47312 485776 486422 486472 486050 484751 482183 478799 475836 474298 474137 474545 474833 474750 474153 472963 471651 471266 472490
47295 472490 474923 477666 480461 483817 488189 493580 499922 507240 515169 522813 529477 535452 541778 549300
47281 549300 558054 567473 577127 587289 598722 611796 625963 640397 655035 670534 687116 703898
47269 703898 719481 732699 742499 747651 747255 741598 732123 720514 707948 695085 682356 670150 658879
47256 658879 648920 640342 632694 625249 617581 609865 602575 595948 589841 584124 579066 575047 571835 568454
47242 568454 564133 559291 555255 553040 552676 553606 555287 557390 559887 563145 567546 572839 578272 583525 589067
47227 589067 595466 602837 611203 620755 631286 641925 652106 662348 673366 684687 694935 703363
47215 703363 710375 716563 721968 726365 729598 731437 731642 730340 727858 724124 718782 711991 704470 696555
47201 696555 687873 678303 668659 659935 652379 645798 640320 636228 633324 631137 629689 629524 630987 633870
47187 633870 637787 642565 648213 654787 662358 670970 680609 691260 702891 715308 728327 742260 757831
47174 757831 775270 793703 811830 829019 845344 860780 875010 888013 900219 911825 922312
47163 922312 930807 936708 939858 940537 939439 937292 934243 929774 923441 915473 906530 897116 887437 877616
47149 877616 867748 857823 847784 837626 827452 817571 808591 801089 795012 789717 784875 781111 779409
47136 779409 780076 782651 786634 791745 797473 802937 807514 811349 815046 819062 823474 827942 831630 833475
47122 833475 833009 830807 827771 823984 818743 811713 803533 794999 786013 775878 764517 752926 742284
47109 742284 732949 724465 716201 707706 698673 689058 679227 669648 660392 651281 642602 635149 629180 623674
47095 623674 617276 609905 602896 597490 593718 590938 588877 587640 587106 586992 587410 588789 591166 593996 596829
47080 596829 599802 603319 607585 612611 618294 624208 629630 634101 637845 641361 644746 647687 649954 651587
47066 651587 652689 653366 653822 654218 654452 654325 653918 653513 653205 652900 652721 653039 654050 655651 657818 660763 664572
47049 664572 669027 673897 679103 684434 689568 694652 700400 707151 714170 720464 726065 731857 738178 744343
47035 744343 749712 754585 759678 765220 771064 777340 784406 792230 800324 808341 816297 824110 831255 837190
47021 837190 841954 846091 850002 853523 856115 857351 857183 855838 853572 850544 846828 842478 837558 832165
47007 832165 826472 820751 815305 810391 806217 802936 800588 799040 798063 797485 797239 797319 797811 798972 801139 804330
46991 804330 808020 811515 814630 817876 821854 826590 831671 836948 842824 849760 857668 866020 874425 882933
46977 882933 891791 901203 911394 922661 935065 948059 960672 972157 982414 991761 1000436 1008390
46965 1008390 1015419 1021376 1026350 1030793 1035320 1040102 1044410 1047114 1047807 1047247 1046530 1046071 1045613 1044970 1044249 1043498
46949 1043498 1042715 1042351 1043245 1045688 1048923 1051969 1054718 1057784 1061541 1065918 1071076 1077501 1085151 1093079 1100443
46934 1100443 1107588 1115567 1124718 1134300 1143604 1152856 1162640 1172726 1181944 1189204 1194329 1197830 1200119 1201052
46920 1201052 1200049 1196517 1190256 1181707 1171717 1160919 1149291 1136441 1122372 1107776 1093534 1080050
46908 1080050 1067229 1055030 1043867 1034396 1027009 1021581 1017752 1015392 1014779 1016292 1020031 1025879 1033881
46895 1033881 1044370 1057600 1073348 1090948 1109718 1129325 1149812 1171241 1193211 1214725 1234803
46884 1234803 1253292 1270814 1287720 1303364 1316731 1327591 1336570 1344136 1350076 1354207 1357191 1360156
46872 1360156 1363629 1367208 1370367 1373264 1376611 1380913 1386108 1391968 1398585 1406301 1415327 1425709 1437557
46859 1437557 1450895 1465191 1479458 1493138 1506546 1520046 1533103 1544754 1554827 1563944 1572195 1578611
46847 1578611 1582354 1583837 1584035 1583101 1580352 1575481 1569105 1562088 1554886 1547629 1540300 1532588 1524071 1514931
46833 1514931 1506258 1499328 1494727 1492378 1492126 1493876 1497312 1502015 1508014 1515891 1526098 1538260 1551282
46820 1551282 1564055 1576103 1587747 1599737 1612432 1625130 1636322 1644910 1651032 1655473 1658426 1659311
46808 1659311 1657779 1654292 1649457 1643304 1635755 1627375 1619011 1610787 1602097 1592658 1582980 1573652 1564711 1555992
46794 1555992 1547592 1539675 1532225 1525366 1519554 1515041 1511485 1508575 1506677 1506310 1507247 1508803 1510870 1513915
46780 1513915 1517946 1522258 1526371 1530508 1534814 1538830 1542263 1545703 1549882 1554560 1558842 1562513 1566378 1571268
46766 1571268 1577291 1584161 1591762 1600107 1609108 1618703 1629030 1640201 1652049 1664330 1677082 1690605
46754 1690605 1705093 1720413 1736189 1752014 1767586 1782792 1797614 1811887 1825095 1836549 1845858
46743 1845858 1853290 1859559 1865236 1870325 1874415 1877169 1878571 1878738 1877757 1875884 1873778 1872240 1871651 1871847 1872601
46728 1872601 1874049 1876491 1879962 1884208 1889069 1894689 1901259 1908683 1916464 1923826 1929950 1934352 1937237 1939388
46714 1939388 1941457 1943253 1943787 1942027 1937538 1930441 1920982 1909284 1895424 1879555 1861948 1843026 1823345
46701 1823345 1803344 1782998 1761791 1739184 1715180 1690460 1665982 1642449 1620024 1598416 1577224
46690 1577224 1556266 1535636 1515500 1495963 1477194 1459589 1443572 1429189 1416004 1403498 1391431
46679 1391431 1379711 1368140 1356690 1345986 1337069 1330376 1325216 1320580 1316267 1312848 1310587 1308991 1307606
46666 1307606 1306819 1307552 1310363 1315184 1321661 1329355 1337684 1346139 1354684 1363609 1372925 1382184 1390983 1399245
46652 1399245 1406799 1413049 1417460 1420169 1421668 1421975 1420647 1417700 1414025 1410547 1407313 1403872 1400455 1398246
46638 1398246 1398361 1400895 1405230 1410998 1418414 1427819 1439258 1452598 1467792 1484879 1503804 1524217 1545345
46625 1545345 1566103 1585537 1603195 1618896 1632213 1642498 1649436 1653176 1653697 1650459 1643066 1632047
46613 1632047 1618538 1603285 1586349 1567757 1548004 1527743 1507325 1486842 1466464 1446548 1427491
46602 1427491 1409593 1393013 1377842 1364162 1351954 1340928 1330654 1321040 1312426 1305001 1298337 1291837
46590 1291837 1285431 1279336 1273282 1266571 1259006 1251224 1243924 1237220 1230902 1224821 1218750 1212358 1205696 1199319
46576 1199319 1193576 1188153 1182745 1177829 1174200 1171968 1170534 1169435 1168651 1168139 1167641 1167079 1166799 1167271 1168758
46561 1168758 1171212 1174193 1176924 1178837 1180181 1181814 1184316 1187514 1190860 1193992 1196900 1199854 1203330 1207823
46547 1207823 1213597 1220683 1228960 1238061 1247323 1256240 1264985 1274240 1284468 1295638 1307611 1320385 1333916
46534 1333916 1348107 1363138 1379475 1397349 1416492 1436552 1457524 1479618 1502965 1527580 1553375
46523 1553375 1580006 1606962 1633977 1661147 1688469 1715487 1741592 1766439 1789825 1811416 1830844
46512 1830844 1847917 1862566 1874746 1884633 1892724 1899411 1904539 1907613 1908387 1907087 1904239 1900460 1896284
46499 1896284 1891953 1887412 1882692 1878064 1873621 1868972 1863670 1857741 1851380 1844282 1835798 1825747 1814586
46486 1814586 1802656 1789674 1775094 1758550 1739737 1718292 1694152 1667809 1639881 1610602 1580019
46475 1580019 1548576 1517106 1486231 1456054 1426482 1397647 1369858 1343373 1318415 1295374 1274790
46464 1274790 1257076 1242322 1230508 1221861 1216812 1215419 1216931 1220243 1224992 1231978 1242267 1255901 1271741
46451 1271741 1288519 1305647 1322890 1339749 1355645 1370531 1384737 1398117 1409867 1419446 1427244 1433941
46439 1433941 1439480 1443171 1444603 1443943 1441390 1436994 1431155 1424752 1418406 1412022 1405407 1398991 1393496 1389159
46425 1389159 1385797 1383527 1382885 1384190 1387260 1391944 1398542 1407464 1418741 1432181 1447881 1466258 1487509
46412 1487509 1511200 1536557 1563170 1591333 1621589 1653973 1687848 1722514 1757706 1793272 1828520
46401 1828520 1862247 1893411 1921605 1946840 1969201 1988749 2005480 2019153 2029366 2035934 2039043 2038824
46389 2038824 2034950 2026935 2014776 1999130 1980858 1960660 1939139 1916871 1894155 1870876 1846981 1823230
46377 1823230 1801220 1782399 1767031 1754267 1743273 1734181 1727959 1725508 1727048 1732253 1740861 1753061
46365 1753061 1769357 1790086 1815097 1844040 1876961 1914461 1957058 2004440 2055515 2109170 2164804
$$ [...]
##END NTUPLES=NMR SPECTRUM
##END=
