##TITLE=AC1597_PERAH13327_8314405_hGBvvv1ZsV
##JCAMPDX= 6.0         $$ Bruker NMR JCAMP-DX V2.0
##DATA TYPE= NMR SPECTRUM
##DATA CLASS= NTUPLES
##ORIGIN= BRUKER
##OWNER= Administrator
$$ 1.72 TOPSPIN		Version 2.1
$$ 2013-11-09 16:43:21.967 -0800  Administrator@X
$$ Compression mode = diff/dup
##.OBSERVE FREQUENCY= 400.02188249412
##.OBSERVE NUCLEUS= ^1H
##.ACQUISITION MODE= SIMULTANEOUS (DQD)
##.ACQUISITION SCHEME= undefined
##.AVERAGES= 8
##.DIGITISER RES= 22
##SPECTROMETER/DATA SYSTEM= spect
##.PULSE SEQUENCE= zg30
##.SOLVENT NAME= COFFEE_meoh
##.SHIFT REFERENCE= INTERNAL, COFFEE_meoh, 1, 14.98509
##AUDIT TRAIL= $$ (NUMBER, WHEN, WHO, WHERE, PROCESS, VERSION, WHAT)
$$ ##TITLE= Audit trail, TOPSPIN		Version 2.1
$$ ##JCAMPDX= 5.01
$$ ##ORIGIN= Bruker BioSpin GmbH
$$ ##OWNER= Administrator
$$ $$ E:\/data/COFFEE/nmr/AC1597_PERAH13327_8314405_hGBvvv1ZsV/10/pdata/1/auditp.txt
$$ ##AUDIT TRAIL=  $$ (NUMBER, WHEN, WHO, WHERE, PROCESS, VERSION, WHAT)
(   1,<2013-11-09 16:43:15.186 -0800>,<Administrator>,<X>,<go>,<TOPSPIN 2.1>,
      <created by zg
	started at 2013-11-09 16:42:09.202 -0800,
	POWCHK enabled, PULCHK disabled,
       configuration hash MD5:
       C8 4E 4E 5D D3 5C D8 9E 9F 52 82 E0 59 8A DE 15
       data hash MD5: 64K
       C4 82 4D 2B 15 C9 8A 64 77 CA 1D 90 0C 90 48 59>)
(   2,<2013-11-09 16:43:17.999 -0800>,<Administrator>,<X>,<proc1d>,<TOPSPIN 2.1>,
      <Start of raw data processing
       efp LB = 0 FT_mod = 6 PKNL = 1 PHC0 = 0 PHC1 = 0 SI = 32K 
       data hash MD5: 32K
       58 74 3C D8 3F E6 26 B1 7A 12 DA 27 97 1F 0F 2B>)
(   3,<2013-11-09 16:43:18.358 -0800>,<Administrator>,<X>,<proc1d>,<TOPSPIN 2.1>,
      <pk PHC0 = 90.60974 PHC1 = 0 
       data hash MD5: 32K
       4F BB 35 0D 26 1C 7F D7 10 B0 3C 8A F5 5D 56 26>)
(   4,<2013-11-09 16:43:18.467 -0800>,<Administrator>,<X>,<proc1d>,<TOPSPIN 2.1>,
      <abs ABSG = 1 
       data hash MD5: 32K
       71 6C B0 C4 B4 E3 B2 A3 D6 75 41 2E CC 49 67 E1>)
(   5,<2013-11-09 16:43:18.530 -0800>,<Administrator>,<X>,<proc1d>,<TOPSPIN 2.1>,
      <abs ABSG = 2 
       data hash MD5: 32K
       30 44 9E B7 86 2F 35 73 FC 07 8C D6 CA B8 AE 72>)
(   6,<2013-11-09 16:43:18.577 -0800>,<Administrator>,<X>,<proc1d>,<TOPSPIN 2.1>,
      <abs ABSG = 3 
       data hash MD5: 32K
       02 57 67 70 BD 07 73 C5 A1 10 1E 72 D1 44 FB B8>)
(   7,<2013-11-09 16:43:18.671 -0800>,<Administrator>,<X>,<proc1d>,<TOPSPIN 2.1>,
      <abs ABSG = 4 
       data hash MD5: 32K
       60 E5 E3 5A C3 44 19 84 66 86 FF 52 AE 2A D9 F1>)
(   8,<2013-11-09 16:43:18.858 -0800>,<Administrator>,<X>,<proc1d>,<TOPSPIN 2.1>,
      <abs ABSG = 5 
       data hash MD5: 32K
       28 58 FA 2D 40 2B 25 4C 0F A7 8C E4 F3 8F B7 92>)
$$ ##END=
$$ 
$$ $$ hash MD5
$$ $$ A3 E5 FB 40 9E 73 77 0E 8A 0E 20 4F C4 BD AC DE
##$RELAX= 
##$RELAX= 
##$RELAX= 
##$RELAX= 
##$RELAX= 
##$RELAX= 
##$RELAX= 
$$ Bruker specific parameters
$$ --------------------------
##$DU= <E:\>
##$EXPNO= 10
##$NAME= <AC1597_PERAH13327_8314405_hGBvvv1ZsV>
$$ [...]
##$TP= (0..7)
150 150 150 150 150 150 150 150
##$TP07= 0
##$TPNAME0= <>
##$TPNAME1= <>
##$TPNAME2= <>
##$TPNAME3= <>
##$TPNAME4= <>
##$TPNAME5= <>
##$TPNAME6= <>
##$TPNAME7= <>
##$TPOAL= (0..7)
0.5 0.5 0.5 0.5 0.5 0.5 0.5 0.5
##$TPOFFS= (0..7)
0 0 0 0 0 0 0 0
##$TUNHIN= 0
##$TUNHOUT= 0
##$TUNXOUT= 0
##$USERA1= <user>
##$USERA2= <user>
##$USERA3= <user>
##$USERA4= <user>
##$USERA5= <user>
##$V9= 5
##$VALIST= <valist>
##$VCLIST= <CCCCCCCCCCCCCCC>
##$VD= 0
##$VDLIST= <DDDDDDDDDDDDDDD>
##$VPLIST= <PPPPPPPPPPPPPPP>
##$VTLIST= <TTTTTTTTTTTTTTT>
##$WBST= 1024
##$WBSW= 4
##$XGAIN= (0..3)
0 0 0 0
##$XL= 0
##$YL= 0
##$YMAX_a= 628911
##$YMIN_a= -541172
##$ZGOPTNS= <>
##$ZL1= 120
##$ZL2= 120
##$ZL3= 120
##$ZL4= 120
##$ABSF1= 14.98509
##$ABSF2= -5.573092
##$ABSG= 5
##$ABSL= 3
##$ALPHA= 0
##$AQORDER= 0
##$ASSFAC= 0
##$ASSFACI= 0
##$ASSFACX= 0
##$ASSWID= 0
##$AUNMP= <proc_prof1d_extract_pilot.lims>
##$AXLEFT= 0
##$AXNAME= <>
##$AXNUC= <1H>
##$AXRIGHT= 0
##$AXTYPE= 0
##$AXUNIT= <>
##$AZFE= 0.1
##$AZFW= 0.1
##$BCFW= 0
##$BC_mod= 0
##$BYTORDP= 0
##$COROFFS= 0
##$CY= 15
##$DATMOD= 1
##$DC= 0
##$DFILT= <>
##$DTYPP= 0
##$F1P= 0
##$F2P= 0
##$FCOR= 0.5
##$FTSIZE= 32768
##$FT_mod= 6
##$GAMMA= 0
##$GB= 0
##$INTBC= 1
##$INTSCL= 1
##$ISEN= 128
##$LB= 0
##$LEV0= 0
##$LPBIN= 0
##$MAXI= 10000
##$MC2= 0
##$MEAN= 0
##$ME_mod= 0
##$MI= 0
##$NCOEF= 0
##$NC_proc= -8
##$NLEV= 6
##$NOISF1= 0
##$NOISF2= 0
##$NSP= 0
##$NTH_PI= 0
##$NZP= 0
##$OFFSET= 14.98509
##$PC= 1
##$PHC0= 90.60974
##$PHC1= 0
##$PH_mod= 1
##$PKNL= yes
##$PPARMOD= 0
##$PPDIAG= 0
##$PPIPTYP= 0
##$PPMPNUM= 2147483647
##$PPRESOL= 1
##$PSCAL= 4
##$PSIGN= 0
##$PYNMP= <proc.py>
##$REVERSE= no
##$SF= 400.02
##$SI= 32768
##$SIGF1= 0
##$SIGF2= 0
##$SINO= 400
##$SIOLD= 32768
##$SPECTYP= <>
##$SREGLST= <1H.CDCl3>
##$SSB= 0
##$STSI= 32768
##$STSR= 0
##$SW_p= 8223.68421052631
##$SYMM= 0
##$S_DEV= 0
##$TDeff= 65536
##$TDoff= 0
##$TI= <>
##$TILT= no
##$TM1= 0
##$TM2= 0
##$TOPLEV= 0
##$USERP1= <user>
##$USERP2= <user>
##$USERP3= <user>
##$USERP4= <user>
##$USERP5= <user>
##$WDW= 1
##$XDIM= 32768
##$YMAX_p= 454781264
##$YMIN_p= -677184
##$CURPLOT= <Network HP LaserJet P1505>
##$CURPRIN= <$Network HP LaserJet P1505>
##$DFORMAT= <normdp>
##$LAYOUT= <+/1D_H.xwp>
##$LFORMAT= <normlp>
##$PFORMAT= <normpl>
##$SURQMSG= 1
$$ End of Bruker specific parameters
$$ ---------------------------------
##NTUPLES= NMR SPECTRUM
##VAR_NAME=  FREQUENCY,     SPECTRUM/REAL,   SPECTRUM/IMAG
##SYMBOL=    X,             R,               I
##VAR_TYPE=  INDEPENDENT,   DEPENDENT,       DEPENDENT
##VAR_FORM=  AFFN,          ASDF,            ASDF
##VAR_DIM=   32768,         32768,           32768
##UNITS=     HZ,            ARBITRARY UNITS, ARBITRARY UNITS
##FACTOR=    0.250966925370066, 1,           1
##FIRST=     8223.43324360094, 163349,       -2455
##LAST=      0,             -211355,         97770
##MIN=       0,             -677184,         0
##MAX=       8223.43324360094, 454781264,    0
$$ Real data points
##PAGE= N=1
##DATA TABLE= (X++(R..R)), XYDATA
$$ [...]
19530f8377C789J1042a36246b5216k84366H0131l8250b73279A90621b18948f3726
19518D8824a6274B52810a90482Q0317L2767g449j82752b8961H2025a1294l6354
19507d7648j54099D728b5266l25376A59075g3001A55910o3159l0582a30381M4480
19496h5901C6052a06686p966j95885G5395f8227I2528a26129N0391A50037J5574
19485A65611c11230O5905a05351q9838G8599d060l93469j0658K1022B16075b71626
19473G4178R435a7141I6617Q1233M7551r722b00947o4796J09687j01038a05240
19461B09334m0662i142m29033A28619g1110j50988G1730d68614a26922b5105k28013
19450b53118F0889K96799a14168k3719j51459H3010c04061B87122b05168A13241
$$ plain form
19530 -68377 3789 14831 -136246 -25216 -309582 80131 41881 -273279 190621 -218948 -63726
19518 48824 -16274 252810 -190482 -110165 -77398 -7449 -190201 -28961 82025 -11294 -47648
19507 -47648 -201747 4728 -25266 -350642 159075 -73001 155910 92751 62169 -130381 -85901
19496 -85901 36052 -106686 -114652 -310537 75395 -68227 92528 -126129 -75738 150037 165611
19485 165611 -311230 -245325 -105351 -195189 78599 -4060 -397529 -408187 -387165 216075 -271626
19473 74178 83613 -17141 96617 177850 225401 215679 -200947 -265743 -156056 -257094 -105240
19461 209334 168672 -9142 -438175 128619 -71110 -222098 71730 -468614 -126922 -25105 -253118
19450 -253118 60889 357688 -114168 -137887 -289346 83010 -304061 287122 -205168 113241
19439d2921B95631a66708C7713a74509l9999B27023l5793m9827n0949L19647f7520
19427h3166A09105d01043a56326A07692b20597A83669K33700f1751a8087G1306
19416A08814J908c30150M360b3964F204b79452M3644i9097l12639a60558a0707
19404d03706D4191N2294m4933a16652M6793B6123R76a30842A04974G369J48797
19393A56166a64103M8236A01966g7740B83835f1407p6905q0125h2590H434J18569
19382A27003c61450B51899d9454l87551H2631A9135e761A40295d06690O9128a4682
19370b26382A22637d09782J99989r0311A21255a18612l2547o461L5190j3879L6599
19359i9710L1081H6380c03412m0975A26986L065a48022G2437g9339j23549A92590
$$ plain form
19439 -42921 295631 -166708 37713 -174509 -214508 227023 191230 141403 90454 410101 -67520
19427 -83166 109105 -401043 -156326 107692 -220597 183669 417369 -61751 -18087 71306
19416 108814 110722 -330150 -325790 -23964 6204 -279452 -235808 -99097 -411736 -160558 -10707
19404 -403706 44191 96485 51552 -116652 -69859 26123 27099 -130842 104974 7369 156166
19393 156166 -164103 -115867 101966 -77740 283835 -61407 -138312 -218437 -82590 8434 127003
19382 127003 -361450 251899 -49454 -437005 82631 19135 -5761 140295 -406690 -337562 -14682
19370 -226382 122637 -409782 -209793 -300104 121255 -118612 -151159 -157620 -122430 -136309 -99710
19359 -99710 -68629 86380 -303412 -344387 126986 130051 -148022 72437 -79339 -202888 192590
19347G3338j1827d568B45712b04665g1680A79883p8056C6968a74026A61368d5845
19335b26063a9041j61504F4560a02326K3561A0610e8311F4840b01678C20908a2754
19323B7041K4590K4194c87392Q1321J06800H6134b75658a00542p9243P8658B22214
19311c53894A14623a0931E9943c15799a38895j49199J23610M9284A38540k2792
19301A15748N295b98901A61244a80902j99801a22475m1546c674j68028p259l8117
19290b17078B56938b1021l90379P6581a49021L0874q6104A70758F3791c05774
19279A11437B4021a73812L6307m261p0432b392n40072d1017k2620d253C0723K40504
19267B71227i8853J0048b0251k93754i6145M7254C6962C349f7569F1456a64199
$$ plain form
19347 73338 61511 -4568 245712 -204665 -71680 179883 101827 36968 -174026 161368 -45845
19335 -226063 -19041 -180545 64560 -102326 -78765 10610 -58311 64840 -201678 320908 -12754
19323 27041 51631 75825 -387392 -306071 -199271 86134 -275658 -100542 -179785 -101127 222214
19311 -353894 114623 -10931 59943 -315799 -138895 -288094 -164484 -115200 138540 115748
19301 115748 121043 -298901 161244 -180902 -380703 -122475 -164021 -3674 -171702 -178961 -217078
19290 -217078 256938 -21021 -411400 -334819 -149021 -118147 -204251 170758 63791 -305774
19279 111437 24021 -173812 -137505 -141766 -212198 -2392 -542464 -41017 -63637 -4253 30723 271227
19267 271227 -98853 -88805 -20251 -314005 -96145 -48891 36962 3349 -67569 61456 -164199
19255e7552o3978k3084A05244a24036d1664j90789b863A3225I50f8372j20840
19244a89212q5024M9758i9965A44774e6229A8165i2601C5937c5106j32686b7560
19232A63606G7819b35024A00281l5046a13356q226D4377a78335A1524e1113k98092
19221c49205J15136g4897c3699F4216b53010a13563d3971j6713F7880A9091L23894
19210C42985c7961a6667j63142a8616q308C77R9990J15165a64199M079O7120K6433
19198f6567j09527I4130a56404J9318k45717Q6034R3198O0065o4807N8390f2115
19186C2039J94614J8359h7955l0454i988H2357O8788n8695C3275h8413c1420C28612
19173B83469b55034j768h4743H0903a44751q7059e5316B10488d1458k1950L0363
$$ plain form
19255 -57552 -121530 -144614 105244 -124036 -41664 -232453 -2863 13225 950 -68372 -189212
19244 -189212 -274236 -224478 -99965 144774 -56229 18165 -92601 35937 -35106 -167792 -27560
19232 163606 77819 -235024 100281 65235 -113356 -121582 44377 -178335 11524 -51113 -349205
19221 -349205 -234069 -74897 -33699 64216 -253010 -113563 -43971 -60684 67880 19091 342985
19210 342985 -37961 -16667 -179809 -18616 -26924 377 100367 215532 -164199 -160120 -93000 -66567
19198 -66567 -176094 94130 -156404 -137086 -382803 -296769 -203571 -143506 -208313 -149923 -62115
19186 32039 226653 245012 -87955 -118409 -9988 82357 151145 92450 33275 -88413 -31420 328612
19173 283469 -255034 -256802 -84743 80903 -144751 -231810 -55316 210488 -41458 -63408 -33045
19162c3045j10316A02757c24846B3091c03463l5220F319O235b21370k4416b6889
19150B405K06043b263I3514d8140k38512A32550A0908b00612e1883o25301h2616
19138c08068A97396c70112a11929E5549J49812R8790E4453J80776a58386B66424
19127B02461C6339a59584B0866L9196L13125b67488j15361g4070e157A04365a50620
19115A33421J59840d2054r1930C4535a05641a8189r61B57424d7379k74178o1501
19104c83058C46419D1279J23309Q5832G7664K47596a11372j76287B26648p1517
19094A55131b22123M1516c6354m8563j31718D7126h9283M0240H2925M6265g9633
19082G4249a39773p3808g7419c0666D9651a09855n3810h1351j19178B38273a62724
$$ plain form
19162 -33045 -143361 102757 -324846 23091 -303463 -338683 6319 12554 -221370 -245786 -26889
19150 2405 208448 -2263 93514 -48140 -286652 132550 10908 -200612 -51883 -677184 -82616
19138 -308068 197396 -370112 -111929 55549 205361 304151 54453 235229 -158386 266424
19127 202461 36339 -159584 20866 60062 373187 -267488 -382849 -74070 -5157 104365 -150620
19115 133421 293261 -42054 -133984 34535 -105641 -18189 -19150 257424 -47379 -321557 -383058
19104 -383058 346419 41279 164588 250420 77664 325260 -111372 -287659 226648 155131
19094 155131 -222123 -180607 -36354 -84917 -216635 47126 -89283 -49043 82925 129190 -79633
19082 74249 -139773 -213581 -77419 -30666 49651 -109855 -163665 -81351 -200529 238273 -162724
19070b03664A56476b31775k12495a6720q1612k1083m5471a3643B10424G2030k4723
19059D7307a50194B76157a6982j89708g4182m5190M6903K149j14829O3737A3873
19047g9464l4756j15830d2592j07079j4326p9899e8663G0180J12266i5548j67960
19036b63508k3142J22829d5115B10471r2769a06744B0658J76438a31247l1789
19026a63036P1041D9767K19599e2898A1241J96168a06247J0001C59256j55995
19016B03261g4183k45599E0890a46898K843j58054c9641j21521p6972J16365J6276
19005a05493A66107a55524k6162A56243b90929d6438D0716M293R1246a4168k1442
18994c5610A28441b74244P8752A81227B2050J6640b348j18353j94995H3492J97619
$$ plain form
19070 -203664 156476 -231775 -444270 -16720 -98332 -119415 -164886 -13643 210424 72030 47307
19059 47307 -150194 276157 -16982 -206690 -74182 -119372 -72469 -70320 -185149 -121412 13873
19047 -79464 -114220 -230050 -42592 -149671 -163997 -243896 -58663 70180 182446 -95548 -263508
19036 -263508 -286650 -163821 -45115 210471 117702 -106744 20658 197096 -131247 -163036
19026 -163036 -91995 49767 269366 -52898 11241 207409 -106247 -96246 359256 203261
19016 203261 -74183 -319782 50890 -146898 -144055 -302109 -39641 -161162 -238134 -121769 -105493
19005 -105493 166107 -155524 -181686 156243 -290929 -46438 40716 45009 136255 -14168 -35610
18994 -35610 128441 -274244 -195492 181227 22050 38690 -2348 -120701 -315696 83492 281111
18983B81111a03233E3417a6747k72565G2482J8979B3820J12520c65708J55097
18973b10611F8597L866e15239b43995d833F7905g4883F8385N4867G176c9539A23641
18960f6638k4274C3036N3019a12506E8344i58A53275a85052d9968J4970j64491
18949a99489C65044B7940L3131h3990C37707A57243m0076a45445j73605C7622
18938c6937A58210m2796Q5264A3379a24996J9756A7069a23377I6958g1000B43370
18926H2466C6907b20302f6277F622g8908r3342M5731f394p3587G8763h0209k39427
18914c19636C5165c27612J43961E019J23483C6018a51207L4722B44174b66765
18903b13211L1870g1205p827n1081n0556G0294i6981A08784a92826n7446F5469
$$ plain form
18983 281111 -103233 53417 -16747 -289312 72482 91461 23820 136340 -365708 -210611
18973 -210611 68597 72463 -515239 -243995 -4833 67905 -74883 68385 123252 7176 -39539 123641
18960 -66638 -90912 33036 86055 -112506 58344 -958 153275 -185052 -49968 -34998 -199489
18949 -199489 365044 27940 61071 -83990 337707 157243 117167 -145445 -319050 37622
18938 -36937 158210 115414 200678 13379 -124996 -105240 17069 -123377 96958 -71000 243370
18926 82466 36907 -220302 -66277 6622 -78908 -172250 -126519 -6394 -79981 78763 -80209 -319636
18914 -319636 35165 -327612 -183651 5019 128502 36018 -151207 -116485 244174 -266765
18903 -213211 -181341 -71205 -79032 -130113 -180669 70294 -96981 108784 -192826 -250272 65469
18891a5123B4597a91052B98869b90424a33020p914c4183j3964j58049m0873J19424
18880a27645E3252J34266J08866d22698J43597B35021A6116b87796J27538A50910
18869e987D68489I5003N5668o7440B3954a49459D8952h8062j138B9164L91409
18858D20573H7537j287b52277E1835c32778J50117j63430a13677G5753J31570
18848B07323g0292h598j37539A68922c7205l2823j67675I0059c0313l30857B9831
18836A60628D9421f6890q9938A9196L8460K9473b23555A79138N2187a3744m9140
18825f2884j48234j85416a4817j23859B40341L8694i6355o0537J713B07817c4879
18813B9268f4597A72290d19293F4135n516L14734C9557c7833A9291a52786k40288
$$ plain form
18891 -15123 24597 -191052 298869 -290424 -133020 -140934 -34183 -48147 -206196 -247069 -127645
18880 -127645 53252 187518 296384 -422698 -279101 235021 16116 -287796 -160258 150910
18869 -5987 468489 95003 150671 83231 23954 -149459 48952 -88062 -89200 29164 420573
18858 420573 87537 86250 -252277 51835 -332778 -182661 -346091 -113677 75753 207323
18848 207323 -70292 -8598 -146137 168922 -37205 -70028 -237703 90059 -30313 -361170 29831
18836 160628 49421 -66890 -156828 19196 57656 87129 -223555 179138 231325 -13744 -62884
18825 -62884 -211118 -396534 -14817 -138676 240341 279035 -96355 -156892 -155179 207817 -34879
18813 29268 -64597 172290 -419293 64135 58619 373353 39557 -37833 19291 -152786 -393074
18802c93074A79406b9964A5690a3404j32929B61178c21649C66690A40911a36928
18791B25492d8759A64498B6944b37945B64815a63504A20449a45512b4205C0555
18780h8810n9045k35200J35837l4274J15217j4223F4805a44648C35477A23865
18769b8813j21530B840J8047K30479M830A24708c65332J10733E8236a61772N0059
18758a11713l5938F7463g3792J5564A06514O5966j5157n8045a8790e292k06891
18747b12183B05006a50523k10141A10992e4970j47308e6419r1594A97515a01859
18736a18814b042C8422c8341E0433b65255k15014a52058d5608B88858D6246d48424
18724E4686P4903h3567P422A56850K263B9787J2313d5829j29041l3132A37653
$$ plain form
18802 -393074 179406 -29964 15690 -13404 -146333 261178 -321649 366690 140911 -136928
18791 225492 -48759 164498 26944 -237945 264815 -163504 120449 -145512 -24205 30555
18780 -88810 -147855 -383055 -247218 -281492 -166275 -180498 64805 -144648 335477 123865
18769 -28813 -150343 2840 20887 251366 256196 124708 -365332 -254599 58236 -161772 -111713
18758 -111713 -147651 67463 -73792 -58228 106514 172480 157323 99278 -18790 -5292 -212183
18747 -212183 205006 -150523 -360664 110992 -54970 -202278 -56419 -148013 197515 -101859
18736 -118814 -2042 38422 -38341 50433 -265255 -480269 -152058 -45608 288858 46246 -448424
18724 54686 129589 -83567 -76145 156850 159113 29787 42100 -45829 -174870 -208002 137653
18712f6226l52143i0527A0775b9005B23304a55186j03249F9039e1449C95911A0551
18700a93369h9534j00834A52603a39129B5482a30125A18602c08193B40578a34907
18689b38949D5946J57932i2898n9425m6052j99441a13193P438D741b8454j54929
18678a83383e9718k79710A57504K3557N67b84923G0982d7477q9877A13854b38748
18666a01171j17700A9341J81130f0212j56693J9085o3589A80690b56070f2316
18655F8318j854a48466l7104b4845A19544G007h0012j85629B18182A5436c8557
18643a44210B41556i0388k65039h3316l63355b1046A21952e8586l0938L5875k13481
18632b67130m9030D6009a96931c3918k06883K649o619j24568a05973N483d9112
$$ plain form
18712 -66226 -418369 -90527 10775 -29005 223304 -155186 -258435 69039 -51449 395911 10551
18700 -193369 -89534 -190368 152603 -139129 25482 -130125 118602 -308193 240578 -134907
18689 -238949 45946 203878 -92898 -152323 -198375 -397816 -113193 -105755 4741 -28454 -183383
18678 -183383 -59718 -339428 157504 181061 181628 -284923 70982 -47477 -137354 113854 -238748
18666 -101171 -218871 19341 200471 -60212 -216905 -197820 -261409 180690 -256070 -62316
18655 68318 66464 -148466 -185570 -24845 119544 7007 -80012 -265641 218182 15436 -38557
18643 -144210 241556 -90388 -355427 -83316 -446671 -21046 121952 -58586 -89524 -53649 -267130
18632 -267130 -316160 46009 -196931 -33918 -240801 -238152 -244771 -369339 -105973 -100490 -49112
18620G7182a65176j36480Q7899C09691f8214E9064a07964H0039a06051M2624A07598
18608A81411H138R6060b30792j14995g9110E8262a22640r4708O4515G9936h3495
18596A61551b24498A41950l0950J59924a97793A72044i4142m5165M5506A98760
18585a68245l0184D03138A9859K09997c1002B88180I4992b29782P1041k63847
18575d22588A10276i1254H7370g9723C9957b47958r2609a56732r9440k0179R8252
18564a78099C52921a22735A03951e871k20838j11155a36704A5804O3363G632f8598
18552E0675k1360J69391G2323a44796A4010d2754j16209G922a70929f1557K9725
18541c1832B845K8012b6096C4908J08392a0934B75014a55594A63592f8485j4937
$$ plain form
18620 77182 -165176 -301656 -213757 309691 -68214 59064 -107964 80039 -106051 -63427 107598
18608 181411 8138 104198 -230792 -345787 -79110 58262 -122640 -217348 -152833 79936 -83495
18596 161551 -224498 141950 111000 270924 -197793 172044 -94142 -139307 -93801 198760
18585 -168245 -198429 403138 19859 229856 -31002 288180 94992 -229782 -158741 -422588
18575 -422588 110276 -91254 87370 -79723 39957 -247958 -340567 -156732 -256172 -276351 -178099
18564 -178099 352921 -122735 103951 -5871 -226709 -337864 -136704 15804 79167 7632 -68598
18552 50675 29315 198706 72323 -144796 14010 -42754 -158963 7922 -170929 -61557 -31832
18541 -31832 2845 30857 -26096 34908 143300 -10934 275014 -155594 163592 -68485 -83422
18530h3422K5753A01200C0655f9187B48244a51214k10148f900n7472G2507l921
18519F8586f8264A53069d2452J0254k27350c8063R054l6890j25366O4857j71795
18508b98203a05944j02983g9283A85651b02237p4981A14717b58373b0032o6086
18498h6118A45589c05733J22639j66187J07523B05164E6349o432d00192n4089
18488d54281F4467L7107e7834A08515a48861f8152A97935K8469b20855M6782m6048
18477b20121F5439K69573e2237J2311A31124m5972i2681j14554Q267C14372d3751
18465g9619j85739k22144c8797o0777a867F8235a58117D227b27610I8640f22D8955
18452e9816C256R2335d5451g813p6512K2435o5603A33129i9764q486C0417e5726
$$ plain form
18530 -83422 -57669 101200 30655 -69187 248244 -151214 -361362 -6900 -64372 72507 68586
18519 68586 -68264 153069 -42452 -32198 -259548 -38063 -29009 -65899 -191265 -126408 -298203
18508 -298203 -105944 -208927 -79283 185651 -202237 -277218 114717 -258373 -20032 -86118
18498 -86118 145589 -305733 -183094 -349281 -241758 205164 56349 49917 -400192 -454281
18488 -454281 64467 101574 -57834 108515 -148861 -68152 197935 226404 -220855 -174073 -220121
18477 -220121 65439 335012 -52237 -39926 131124 85152 -92681 -207235 -198968 314372 -43751
18465 -79619 -265358 -487502 -38797 -99574 -1867 68235 -158117 4227 -227610 98640 -622 48955
18452 -59816 3256 95591 -45451 -7813 -84325 -61890 -127493 133129 -99764 -108250 30417 -55726
18439B8400K04319p0643B4307b61984r4913G3523G184b69514i6430d2509m6622
18428h9131o1746J7923k7299g6484b1716A94055J54793G4488a05458m1974A95812
18416B42602E9120b13039r6088D52724D484N1045d23033a83537D637i5432q0036
18405a75468A70976J1425j8892a171A90556o9299a43242D5795b58009B91681a57055
18393f1036q052k7063K0493A19252a99777A0164R7848a72927O7241k57456i817
18381A92367a01510n9006a4169B32887r1471b14058b1364A55885e42470H8099
18370A8164L8261a85478e0375j72026F5605c6181I3431D3040b63328B43158m8475
18359A94683E8992L34318b94417E2636a89915B40475a69872A89259b1368q0459
$$ plain form
18439 28400 232719 162076 24307 -261984 -356897 73523 7184 -269514 -96430 -42509 -89131
18428 -89131 -150877 -132954 -160253 -76484 -21716 194055 348848 74488 -105458 -147432 195812
18416 242602 59120 -213039 -309127 452724 4484 55529 -423033 -183537 4637 -95432 -175468
18405 -175468 170976 182401 163509 -1171 190556 121257 -143242 45795 -258009 291681 -157055
18393 -61036 -69088 -96151 -75658 119252 -199777 10164 108012 -172927 -105686 -363142 -9817
18381 192367 -101510 -160516 -14169 232887 141416 -214058 -21364 155885 -542470 88099
18370 18164 56425 -185478 -50375 -222401 65605 -36181 93431 43040 -263328 243158 194683
18359 194683 58992 393310 -294417 52636 -189915 240475 -169872 189259 -21368 -101827
18349a01827d4666K469I8420a1113n3864A14821b1964j74966q1023f827j14039
18338a20866j4743l5988e371j35242d9444j8489A26719a98606L9270C27795A59013
18326A96381m0143a26712J1987j777I8877a89648k1592L0404B11512b10698J7727
18315a92971Q7011c6628E4884B4740c0592j84256B68185J00353a78846k43985
18305d22831b849n1632A98582c22493A42870a89182B23559k6808F8962B7034g5871
18293c4997P785j60119n4842K9099C2458P8033b63888J03926A34499a80603B65677
18281a15880n4221H3969b67719j15548a85150I0541b30897a6498j38340A19421
18270A28172O2826b56337B14424d7396n7528e0585m7206A82326N2622j16207k094
$$ plain form
18349 -101827 -44666 -42197 98420 -11113 -64977 114821 -21964 -196930 -277953 -6827 -120866
18338 -120866 -135609 -171597 -5371 -140613 -49444 -67933 126719 -198606 -159336 327795 159013
18326 196381 156238 -126712 -114725 -116502 98877 -189648 -211240 -180836 211512 -210698 -192971
18315 -192971 -105960 -36628 54884 24740 -30592 -214848 268185 368538 -178846 -422831
18305 -422831 -2849 -54481 198582 -322493 142870 -189182 223559 196751 68962 27034 -75871
18293 -34997 -27212 -187331 -242173 -213074 32458 110491 -263888 -159962 134499 -180603 265677
18281 -115880 -170101 83969 -267719 -383267 -185150 90541 -230897 -16498 -154838 119421
18270 128172 190998 -256337 214424 -47396 -104924 -50585 -97791 182326 234948 118741 116647
18259A16647c13260f5219q7133C31894a6326M688F0305a20820A82478c17242g9419
18247A34383b62008P8778g8518A68875j2380b6856q4683a6954n7020j44809C51178
18235C6834h0336A52231J9105n3650a67405I7468a13640I426J21850c06861b6981
18223b13702A80633A0475e5314a6083J676k74437f6415D0548b4545k96914A69207
18211D6981c13463R6833H3325a99460j0275H0448a41954k02375d6471j5696r1883
18200a54050j05244k44874A18583Q4382e6594F9126a80952A77135b06581j22363
18190c28944Q332C2948a56761r9347a00776A82982J50285E3346a05924G3487a06445
18178D79104A45989a1920B1255b4234k9747o3914B07279a67541B1665e5563B2960
$$ plain form
18259 116647 -313260 -65219 -152352 331894 -16326 -11638 60305 -120820 182478 -317242 -79419
18247 134383 -262008 -183230 -78518 168875 156495 -26856 -111539 -16954 -73974 -218783 351178
18235 36834 -80336 152231 171336 117686 -167405 97468 -113640 9426 131276 -306861 -26981
18223 -213702 180633 10475 -55314 -16083 -14407 -288844 -66415 40548 -24545 -321459 169207
18211 46981 -313463 -216630 83325 -199460 -209735 80448 -141954 -344329 -46471 -62167 -154050
18200 -154050 -259294 -504168 118583 202965 -56594 69126 -180952 177135 -206581 -328944
18190 -328944 -320612 32948 -156761 -256108 -100776 182982 333267 53346 -105924 73487 -106445
18178 479104 145989 -11920 21255 -24234 -53981 -117895 207279 -167541 21665 -55563 22960
18166b0724h203p4504r7702n4892A88420J22609b53878a4008k3993D70720A0900
18154I624P5048L2811N2527O2180q4876d63788i5285j0280J0362M6476j60490
18143b09217C69818d6670Q765j79567B61627F0306c43618c9212C4493c9724H3937
18131G1097a59778G5146a07237A33835d1502A15870d9257k40127B87229b32315
18120a69180D61278A09270a4574B82153b71513G8158b24798d8084B60480b15097
18109b88278A68003G399e51384a15995A26508a3276A08310B1479f4269A58117
18098D8320h4320A82828b28205b6962r2099M5720j81627g2172I719R7311a50958
18086g5270G7171a60793I694Q9230a89979J2056F0387a18519E491a49732A63219
$$ plain form
18166 -20724 -8203 -82707 -180409 -235301 188420 311029 -253878 -14008 -38001 470720 10900
18154 9624 84672 117483 170010 232190 147314 -463788 -95285 -105565 -95203 -48727 -209217
18143 -209217 369818 -46670 -37905 -217472 261627 60306 -343618 -39212 34493 -39724 83937
18131 71097 -159778 75146 -107237 133835 -41502 115870 -49257 -289384 287229 -232315
18120 -169180 461278 109270 -14574 282153 -271513 78158 -224798 -48084 260480 -215097
18109 -288278 168003 7399 -551384 -115995 126508 -13276 108310 21479 -64269 158117
18098 48320 -84320 182828 -228205 -26962 -119061 -73341 -254968 -72172 9719 107030 -150958
18086 -75270 77171 -160793 9694 98924 -189979 -177923 60387 -118519 5491 -149732 163219
18074A38792b02760h3723A04212h0849L4285A35554P8692O714a94914B38996m2760
18063A96236e158j86173l362B1481h4084B40499b06875M3028N3022D10821j35545
18052B75276a00805l272k72210J72792H4868b08506g0410a5843p24o0288K4295
18041e2560E1702b2007D3920K1632C0226K07610b07387l524R4853B44093b31230
18029H4650K1719a57453e3316l35167h2429p630q8835a716j28723j36839H7849
18017D7664d5222I0866R7698d2065H8834k0545l1565L7498B2463P6278c66530
18005a47099F7411c561C6044L5375c15845B32720C2753J2221h9512k10790J33604
17994a66698k9927B99982j4683a70116A38341h0908E3956J6631J21859d3553l04719
$$ plain form
18074 138792 -202760 -83723 104212 -80849 -46564 135554 214246 220960 -194914 238996 196236
18063 196236 -5158 -191331 -194693 21481 -84084 240499 -206875 -163847 -110825 410821 275276
18052 275276 -100805 -104077 -376287 -203495 84868 -208506 -70410 -15843 -16567 -76855 -52560
18041 -52560 51702 -22007 43920 65552 30226 237836 -207387 -210911 -116058 244093 -231230
18029 84650 106369 -157453 -53316 -388483 -82429 -90059 -178894 -1716 -130439 -267278 87849
18017 47664 -45222 90866 188564 -42065 88834 68289 36724 74222 22463 98741 -366530
18005 -147099 67411 -3561 36044 71419 -315845 232720 32753 44974 -89512 -300302 -166698
17994 -166698 -196625 299982 285299 -170116 138341 -80908 53956 70587 192446 -43553 -348272
17983c48272B44091c43981A10685a93661h7412B95053D8977a00265I1478M8731
17973A40209a80816A6250K29191A19539M912c45370d4382n1789j15789o940E4111
17961i0666a0582q3433C18456C3212J38819h9056m1111j32924m1304A46017l8915
17950A07102m1511j5803b42673j60199A40666J0634b15402A21299c97361G1524
17939c16724j19781a9074l196D2335i3959k6072l1881K5037H0805k6699a39780
17927A13549b1207o7039q8131M5593H8317k8982a9593C11414a50184e2249G8867
17915b4813A89903N2646q3089J61173a174A76438k0645D2223a5573j40235A60397
17903I1925a07501C327b67057N4487c1179l9355k3607D4621K73684f7890G3594
$$ plain form
17983 -348272 244091 -343981 110685 -193661 -87412 295053 48977 -100265 91478 140209
17973 140209 -180816 16250 245441 119539 124451 -345370 -44382 -96171 -211960 -218900 54111
17961 -90666 -10582 -94015 318456 33212 172031 -89056 -130167 -263091 -304395 146017 107102
17950 107102 65591 49788 -242673 -402872 140666 151300 -215402 121299 -397361 71524
17939 -316724 -436505 -19074 -22270 42335 -93959 -120031 -151912 -126875 80805 54106 -139780
17927 113549 -21207 -88246 -176377 -130784 88317 59335 -19593 311414 -150184 -52249 78867
17915 -24813 189903 242549 159460 320633 -1174 176438 155793 42223 -15573 -155808 160397
17903 91925 -107501 3327 -267057 -212570 -31179 -70534 -94141 44621 318305 -67890 73594
17891c4715m6597A64600b15020B54840n1737h5041m8713A600a39905B01181q8634
17880A12547J6521c5881C0690a24428G6864O7733m3968a31668a2222k8925B30110
17868B21696b2300C86731A07616Q6183G0441F677a80699J1218B73747e5783A07884
17856B35975a80468D805c59557a11219B03495B3395a2162k33087A10915N430b6992
17844a12508L1121j14728J0879g5242a6947I1581b52959G0677k6399p543Q3880
17833A20615b28139a04336A23390Q6502a39316M9913A95449q1626g5689C4010
17822a48932B6807K12256C69J7025a70794O0378A34270e9237l4161p6909P2270
17811i8037A61085n5622k4891b85372A02108P5383b09354h5340A74084f7784l34068
$$ plain form
17891 -34715 -81312 164600 -215020 254840 203103 -85041 -133754 1600 -139905 201181 112547
17880 112547 129068 -35881 30690 -124428 76864 144597 100629 -131668 -12222 -41147 230110
17868 221696 -22300 386731 107616 193799 70441 6677 -180699 -169481 273747 -55783 107884
17856 235975 -180468 4805 -359557 -111219 203495 23395 -12162 -245249 110915 116345 -26992
17844 -112508 -81387 -196115 -185236 -75242 -16947 91581 -252959 70677 44278 36735 120615
17833 120615 -228139 -104336 123390 209892 -139316 -89403 195449 113823 -75689 34010
17822 -148932 26807 239063 369 17394 -170794 -110416 134270 -59237 -93398 -170307 -98037
17811 -98037 161085 105463 80572 -285372 102108 177491 -209354 -85340 174084 -67784 -401852
17800d01852a18617B8402a80474j29338J50757N0110b0265B03199b5285j64199
17790a89484C0328a69977E63660f5333j96228A2833M3269L3441J06295a80233
17779b51644B67617f652A2654R6794J11953b81091j4859A45948g3134C04378q0209
17768B24169F3007O9855a57580j706H6651c14629a48692A37475a25883j6677A33164
17756i6881F221f8885A51393R784a27099A28261A3262L25886E4119B6605R4433
17745A21038Q6638e3904I2073a5413A8008J46373d2206A63963a44955c9092k8721
17734f7813A85364G6191a0961j62204o5424M9309e3009n0568A8229M50444D1748
17722i7955d074j46924H6707l0873d0830J0058I9458a76813B12587a89322a2857
$$ plain form
17800 -401852 -118617 28402 -180474 -309812 -159055 -108945 -20265 203199 -25285 -189484
17790 -189484 30328 -169977 563660 -65333 -261561 12833 56102 89543 195838 -180233
17779 -251644 267617 -6652 12654 109448 221401 -281091 -295950 145948 -73134 304378 224169
17768 224169 63007 132862 -157580 -159286 86651 -314629 -148692 137475 -125883 -142560 133164
17756 -96881 6221 -68885 151393 161177 -127099 128261 13262 339148 54119 26605 121038
17745 121038 207676 -53904 92073 -15413 18008 164381 -42206 163963 -144955 -39092 -67813
17734 -67813 185364 76191 -10961 -173165 -238589 -189280 -53009 -103577 18229 468673 41748
17722 -97955 -4074 -150998 86707 55834 -40830 -30772 99458 -176813 212587 -189322 -12857
17710E7245M2003B8669Q1377a2250q8210n4227N3627K4097j68751f3014r9123
17699a62137C24280b50550f3447o8676f1077A49016d7564j8318C30094c27322
17688b66689C40824c23316b3882B49156o6102b12651b0494m02490B00802r5206
17678A05596d9679A56382K6690b5775j04571M1500A23854b1006A13141C0066K58972
17667B89038a5810j43811b7239C45040A6281J27395C0031J27159a22037p470O1549
17656f7958j47083A6208b97742C60878K5880a50646j1577P2386A40274P1239J15819
17645C27332a79868A06127i0448j86314A20275L8285A166O6698d0262A28739i4732
17633I7553O9679f0538r617r1818A26035c98778J96801a2361E0562J23760a89991
$$ plain form
17710 57245 99248 28669 110046 -12250 -100460 -154687 -101060 -76963 -245714 -63014 -162137
17699 -162137 324280 -250550 -63447 -132123 -61077 149016 -47564 -65882 330094 -327322
17688 -266689 340824 -323316 -23882 249156 183054 -212651 -20494 -422984 200802 105596
17678 105596 -49679 156382 183072 -25775 -130346 -88846 123854 -21006 113141 30066 289038
17667 289038 -15810 -159621 -27239 345040 16281 143676 30031 157190 -122037 -129507 -67958
17656 -67958 -215041 16208 -297742 360878 386758 -150646 -162223 -89837 140274 211513 327332
17645 327332 -179868 106127 -90448 -276762 120275 158560 1166 67864 -40262 128739 -94732
17633 97553 167232 -60538 -70155 -161973 126035 -398778 -201977 -12361 50562 174322 -189991
17621a84313b7550m7875A14774J20986I5995O5836M7207l6685d0890j48088A02843
17609b3537A32754b48745C54509n5477g2754B4575K6284L1914b89692B09883a05134
17597A18275J26859b88968F9357K05132J40532r2998b42006D0717N573d1282B16965
17585C942Q0801h8459E4603j9539K18798b19161D1798d8841B4853a3637k78707
17574b92344D27680D86c57663A04928b08235E5031b5875C22031a74140D2612J49654
17563A92266N0172d9166j1048I5691a42581E49473g7696C05762c1960f47C15084
17551e4623C30330J10750k11747b04264I9853k1143a04776e2378B8180d3872a3438
17539B10502B6071a22305A38213h1772J5462A66163K32518k6159D8893J81907
$$ plain form
17621 -184313 -27550 -75425 114774 235760 95995 161831 209038 172353 -40890 -188978 102843
17609 -23537 132754 -248745 354509 299032 -72754 24575 50859 82773 -289692 209883 -105134
17597 118275 245134 -288968 69357 274489 415021 322023 -242006 40717 46290 -41282 216965
17585 3942 84743 -88459 54603 35064 253862 -219161 41798 -48841 24853 -13637 -292344
17574 -292344 427680 486 -357663 104928 -208235 55031 -25875 322031 -174140 42612 192266
17563 192266 242438 -49166 -60214 95691 -142581 549473 -77696 305762 -31960 -647 315084
17551 -54623 330330 441080 229333 -204264 99853 78710 -104776 -52378 28180 -43872 -13438
17539 210502 26071 -122305 138213 -81772 -66310 166163 398681 372522 48893 230800
17529B30800e8094D3074a4861j70030k1915h3789A81079E041f3622B93318L61407
17518F54725A71784J00454j13446b4228B47009h0933A2549L66086B6768J24186
17508A50954J4095J2383p5281h3673F0247a09566A26218e6223j59270B30802A09435
17496C10557A1816M59730j34219i3327A27980R4983J54652A01141R0900M133O8178
17485B64352j13211Q3963G3940K87141b9849A89950p9110J44324p0063I1144k6993
17474F4151g275B06898c8697j01246B56212J54699a54503B60839J00566A62114
17463F0965a13971B26657a23995B25771h109G5293K64409h7294D36775a27530
17452A67840J6102J17827D6219L59444l0977k6876e5176C21070A57515J96878
$$ plain form
17529 230800 -58094 43074 -14861 -184891 -206806 -83789 181079 5041 -63622 293318 654725
17518 654725 171784 272238 158792 -24228 247009 -80933 12549 378635 26768 150954
17508 150954 165049 177432 102151 -83673 60247 -109566 126218 -56223 -215493 230802 109435
17496 310557 11816 471546 337327 -93327 127980 222963 377615 101141 192041 196174 264352
17485 264352 151141 235104 73940 361081 -29849 189950 110840 255164 185101 91144 64151
17474 64151 -7275 206898 -38697 -139943 256212 410911 -154503 260839 361405 162114
17463 60965 -113971 226657 -123995 225771 -8109 75293 339702 -87294 436775 -127530
17452 167840 183942 301769 46219 405663 374686 347810 -55176 321070 157515 354393
17442C54393I2793M37193C9369L5618O0800J92873I5710l9584J1263a1152B47570
17430B54491C4404L10411p8504k1031A6464J18916J73461A49618J06162K98531
17420E54311B30335K17087O6184k29989i917D51282k25479C7602c8288D2024J85999
17409B28023C3732a52184A43878o5943L31758o9473b0049B3688R5095J84842j3896
17398B89729a9548C7934L6184M5380R5066j6415J41712j25346P1232a80263A42874
17386B57523d653D21362G2362K55102j58684K8733H2682L4168Q8228c24121a40190
17374C68787e5254A59079N8594n8283D6308L56598p25d561C06972j06640G4184
17362A7161Q8696M4756A6689J36807a18692A27662L04346b33277C83812F3572
$$ plain form
17442 354393 92793 529986 39369 74987 135787 328660 95710 56126 67389 -11152 247570
17430 254491 34404 344815 266311 245280 16464 135380 308841 149618 255780 554311
17420 554311 230335 447422 513606 283617 -9917 451282 225803 37602 -38288 42024 228023
17409 228023 33732 -152184 143878 77935 409693 340220 -20049 23688 118783 303625 289729
17398 289729 -19548 37934 74118 119498 214564 198149 339861 214515 285747 -180263 142874
17386 257523 -4653 421362 72362 327464 168780 197513 82682 116850 205078 -324121 -140190
17374 368787 -55254 159079 217673 159390 46308 402906 402181 -4561 306972 200332 74184
17362 17161 105857 150613 16689 153496 -118692 127662 432008 -233277 383812 63572
17351A16054c8868q7554C8981J01491j7729M549m6522L20764H5396C3495c3871
17339F34333a39118A21100J12378A13517E1460J21645b26252A13873J17556r7864
17329A33565M21996i6039B44159j03157B7256a74744A1694K99328A45624k0753
17319A24871a1669C86596j72463e3134D24458o1011O7995j34187H0877C8112d0241
17307A02163K76848g691G8162C1055a09523A14592M7725b13219B34662j00617
17297A34045n8505l1338M1824b87934C34141E923L68745e3664B09477J60756G362
17285C11798L1891r9002Q3150a76294B11421K33724j46027r4591b2580C3489J62550
17274A96039E0935L75623a18006G9425K8468J31420j0570D7229b7225C96672j09860
$$ plain form
17351 116054 -38868 -126422 38981 140472 122743 127292 80770 401534 85396 33495 -33871
17339 634333 -139118 121100 233478 113517 51460 173105 -226252 113873 231429 133565
17329 133565 555561 -96039 244159 141002 27256 -174744 11694 311022 145624 124871
17319 124871 -11669 386596 214133 -53134 424458 363447 431442 297255 80877 38112 -40241
17307 102163 379011 -7691 78162 31055 -109523 114592 162317 -213219 234662 134045
17297 134045 75540 44202 86026 -287934 334141 5923 374668 -53664 209477 370233 7362
17285 311798 343689 244687 327837 -176294 211421 445145 299118 204527 -22580 33489 196039
17274 196039 50935 426558 -118006 79425 107893 239313 228743 47229 -27225 396672 286812
17263B86812j38698h8573A59638B922f6038A05268N4434J97103a11674D95972
17252B06386J63002A65177a20501A38175a06493j04786F50888H8559J29057K9865
17242B47481j13348E4871Q6117R1889O9486j19830H6321J89229A13576C9462K36541
17231B76003k8611L0866b2614D7218q004L18966G9635J77044j17155M7417C9652
17219I9514K20865r2508J73132A42485L10470C5122H036L3439L8942K78372l5813
17208C22976A21937O4373J03585k9794K2657M603o5803R967o5313L71195j74907
17197C62500A31015J62616O2003j04108i5415a9570F00919a15888B63664p7943
17187A85721J64008b2765B05098J8361K99161q0770B5923J50582k4813K0401N4268
$$ plain form
17263 286812 148114 -88573 159638 2922 -66038 105268 159702 356805 -111674 495972
17252 206386 369388 165177 -120501 138175 -106493 -211279 650888 88559 217616 247481
17242 247481 134133 54871 140988 232877 302363 182533 86321 275550 113576 39462 276003
17231 276003 247392 278258 -22614 47218 39214 358180 79635 256679 139524 186941 39652
17219 99514 320379 227871 401003 142485 452955 35122 8036 41475 80417 358789 322976
17208 322976 121937 186310 289895 260101 282758 287361 221558 231525 166212 537407 362500
17197 362500 131015 293631 355634 251526 -95415 -19570 600919 -115888 263664 185721
17187 185721 349729 -22765 205098 223459 522620 441850 25923 176505 151692 172093 226361
17176B26361M7205O4877C7543Q583K58901G5965J44209Q1226j43910K61156j81148
17165B37498D8732P5757Q3909m2595h160C40262p7314A23776a9011A0058K79768
17154B89826O6915A22179K60867j58096P1100n2806n8510n177K34898I3524C4507
17142F58892k01636E6234K12082L69405e3013B98525J80754i5982D38027l6553
17132D01474A12454K25697r1438J9680o2106L94371k87124K22073k40253j3923
17122B79431Q9764J63125k03480m2807J95657j1500B30470J53890A08906N0475
17112A59381K86483j43158p5957K74344k21494L9590K38137j83290A69966L15363
17102D85329k13412J08985M2894j46623J63008l7166N3494j09217R8883D6619
$$ plain form
17176 226361 273566 338443 37543 46126 305027 75965 220174 301400 157490 418646 237498
17165 237498 48732 124489 208398 165803 -8160 340262 262948 123776 -19011 10058 289826
17154 289826 356741 122179 383046 224950 296050 243244 184734 179557 414455 93524 34507
17142 658892 457256 56234 268316 637721 -53013 298525 479279 -95982 438027 401474
17132 401474 112454 338151 246713 266393 204287 598658 311534 533607 293354 279431
17122 279431 369195 532320 328840 286033 481690 470190 230470 384360 108906 159381
17112 159381 445864 302706 226749 501093 279599 319189 557326 374036 169966 485329
17102 485329 271917 380902 423796 277173 440181 403015 456509 347292 446175 46619
17091D28336j28917M32377l15036j89496K51248k9636A88777m0640K93734j22870
17081C19001K03829p0422j88344L12659O6536B33875J04756A22981J42199J0182
17071B75362P5377J98178L5336N4246k59955K4295K09258k03420P7571k16925
17061B69323m9462L53636A87836K75130K271k16081K94670j17521m89j6896M02811
17050H11731r9389B36201J35342J86194l8495B41410L2223J69835J46182A52055
17039F58144K7296A82701K97319J18800P3852k18437M5820N3289j88508K99756
17029F64592k83358K99831j33244J39840k27610J60704J76309k33670L0597j06917
17019D87074J05662J33296k17778L16513J4424k57071j396K4386J03835K9808
$$ plain form
17091 428336 299419 731796 416760 227264 478512 448876 188777 148137 441871 319001
17081 319001 522830 452408 264064 576723 643259 233875 338631 122981 265180 275362
17071 275362 350739 548917 584253 638499 378544 402839 612097 408677 486248 269323
17061 269323 219861 573497 187836 462966 465237 249156 543826 426305 425816 408920 811731
17050 811731 712342 236201 371543 557737 519242 241410 273633 443468 589650 152055
17039 658144 685440 182701 480020 598820 672672 454235 500055 553344 364836 664592
17029 664592 381234 681065 547821 687661 460051 620755 797064 563394 593991 487074
17019 487074 592736 726032 508254 824767 839191 582120 580724 605110 708945 738753
17009G38753j28060K32486j85097j68467j7401J04601q6687L60567O1421l18941
16999E93175r5587K54966J05293j3956l58855L97689r1170j76026N50518n53759
16989F12288j08330J16156K451B43874L77270J16195r1482R0891J52939N6297
16979I45984C24774N45299k01405p3851L2566J11393J61511j33564k04448N31601
16969A093876k36652R7583K15779m49218L87907q0959k72370J46047K34278l50633
16959G85638K73674l87246K63512K3416J03272j61266j55788N32392j64240j02898
16949A010466m2905m6465k67331O15908j60246k97211M71250K3530j21971L10309
16939A495334m55787m1329J12135m5591R0815q1491K11265P1687k87009L43940
$$ plain form
17009 738753 610693 843179 658082 489615 472214 576815 490128 850695 912116 593175
16999 593175 497588 752554 857847 843891 485036 882725 791555 615529 1166047 612288
16989 612288 503958 620114 622565 243874 621144 737339 645857 736748 889687 945984
16979 945984 324774 870073 668668 594817 627383 738776 900287 766723 562275 1093876
16969 1093876 857224 954807 1170586 721368 1109275 1028316 755946 901993 1136271 785638
16959 785638 1059312 672066 935578 958994 1062266 901000 745212 1277604 1113364 1010466
16949 1010466 967561 921096 653765 1269673 1109427 812216 1283466 1306996 1185025 1495334
16939 1495334 1039547 998218 1110353 1064762 1155577 1074086 1285351 1357038 1070029 1413969
16929A413969k28769j15831N7285M85819o9412n35985R9569L62224r4303j07368
16919A267198N5069K47189k0979k49302K66665j13037j88042K55708r0035K3793
16909A454227k07678M0465J90826J96851l2239K70290n36560p9957J93087K65709
16899A755021K3579P5438k43406q8223K82437J30559j64299p1489r342k79734
16889A410541N30035k14478M06149k76512K3057j15019R1358M9989N0105j7378
16879A937847L00832k54624J96056j27787N8251L4397J11786j03958j58139K88538
16869B283199J03939k27723K97054o5319L85323l67815L70795j66083l51700M05624
16859B667294K3391k02169K34643J89948j46346j65636M13992O3077j46305r9349
$$ plain form
16929 1413969 1185200 1069369 1126654 1612473 1543061 1007076 1106645 1468869 1374566 1267198
16919 1267198 1322267 1569456 1548477 1299175 1565840 1452803 1264761 1520469 1430434 1454227
16909 1454227 1246549 1287014 1477840 1674691 1642452 1912742 1376182 1296225 1489312 1755021
16899 1755021 1778600 1854038 1610632 1522409 1804846 1935405 1771106 1699617 1690275 1410541
16889 1410541 1940576 1726098 2132247 1855735 1878792 1763773 1855131 1905120 1955225 1937847
16879 1937847 2238679 1984055 2180111 2052324 2110575 2144972 2256758 2152800 1994661 2283199
16869 2283199 2387138 2159415 2456469 2391150 2776473 2408658 2779453 2613370 2261670 2667294
16859 2667294 2690685 2488516 2723159 2913107 2766761 2601125 3015117 3078194 2931889 2832540
16849B832540K89791o1784R5257k24725L58624L0749o6M7348J84502j11673l4437
16838C406126K62050j29853j5875N55599l42721K0759J58251M6147J55377j77721
16828C938139L75231q0695K58210k4996Q2077L28706j31399J73847k6915J39995
16818E032200N6581j62032K73580N75503j26781J99854j13974R4074j4686M11352
16808F225671L98148k04418L43845j90482J78570j10350O21268J5163j32321O72909
16798G818003M7144L19735k366K60856o3457N37313N4658N99988j57329O83751
16788A0098296K5945M12772J13424J52435N52940J01020M83142M54551K35777
16779A2630302Q44902J27775R3284R64762J84764N18106O21478K92307N37186
$$ plain form
16849 2832540 3122331 3060547 3155804 2931079 3289703 3320452 3320386 3367734 3552236 3440563 3406126
16838 3406126 3668176 3538323 3522448 4078047 3735326 3756085 3914336 3960483 4115860 3938139
16828 3938139 4313370 4232675 4490885 4465889 4547966 4876672 4745273 4919120 4892205 5032200
16818 5032200 5088781 4926749 5200329 5775832 5649051 5848905 5734931 5829005 5814319 6225671
16808 6225671 6623819 6419401 6763246 6572764 6751334 6640984 7262252 7277415 7145094 7818003
16798 7818003 7865147 8184882 8182516 8443372 8379915 8917228 8971886 9571874 9414545 10098296
16788 10098296 10124241 10537013 10650437 10802872 11355812 11456832 11939974 12394525 12630302
16779 12630302 13475204 13602979 13696263 14661025 14845789 15363895 15985373 16277680 16814866
16770A6814866Q02653O09980M65894O06765P69293P94255Q24636R15894O63387
16761B3267623Q42961J180930M71008J343526J242981J027836J563656J098788
16753C2039309J070944J748793J749561J621959J634957J926222J991935K006293
16745D5789973K721214K396489K709610K731268L038199L288440L565698L549811
16737F9790702L509977M354482M358390M865350M909919N379683N708919N653791
16729A08531213O239560O029638O923903O859351O831817P055595O811836P029288
16721A62312201N682059N830770M643184M394873K987448K014926Q95035p16312
16713A88044184j422901k153208l911147m827925n308464o407288o456750p137709
$$ plain form
16770 16814866 17617519 18227499 18693393 19300158 20069451 20863706 21688342 22604236 23267623
16761 23267623 24110584 25291514 25762522 27106048 28349029 29376865 30940521 32039309
16753 32039309 33110253 34859046 36608607 38230566 39865523 41791745 43783680 45789973
16745 45789973 48511187 50907676 53617286 56348554 59386753 62675193 66240891 69790702
16737 69790702 73300679 77655161 82013551 86878901 91788820 97168503 102877422 108531213
16729 108531213 114770773 120800411 127724314 134583665 141415482 148471077 155282913 162312201
16721 162312201 167994260 173825030 178468214 182863087 185850535 187865461 188760496 188044184
16713 188044184 186621283 184468075 180556928 175729003 170420539 164013251 157556501 150418792
16705A50418792p136841o981215p599335p019567o580636o915982o256823n793184
16697I6135209n959168m984042n213797m726745l715899m520516l537171l743109
16689E9734762l064139l353842k957371k441035k626353k402089k213701j604475
16681C9071757j945013j588773j847247j572348j681138j021619j205009j529101
16673B6681509r14106j393550o88473r60546r88190n73433m44382j306895o90098
16664A8721836m40267p39086m31159o17190o99283o06176m10395p60774k72232
16655A3745274k87463n54005m70122k58235l26045n98401J22169q20860J79579
16646A0731891m96251l37798j40746k89698n04501M3389j97265j53465j68318
$$ plain form
16705 150418792 143281951 136300736 128701401 121681834 115101198 108185216 101928393 96135209
16697 96135209 90176041 85191999 79978202 75251457 71535558 67015042 63477871 59734762
16689 59734762 56670623 53316781 50359410 47918375 45292022 42889933 40676232 39071757
16681 39071757 37126744 35537971 33690724 32118376 30437238 29415619 28210610 26681509
16673 26681509 25767403 24373853 23685380 22724834 21736644 21163211 20718829 19411934 18721836
16664 18721836 18281569 17542483 17111324 16494134 15794851 15188675 14778280 14017506 13745274
16655 13745274 13457811 12903806 12433684 12175449 11849404 11251003 11373172 10552312 10731891
16646 10731891 10235640 9897842 9757096 9467398 8962897 9006286 8809021 8655556 8487238
16637H487238o58696L82392n80188L76610o33279o3279l29571j57946j77075p9338
16627F566868n57591J59964j19195m304j21249n14818J98586j78629m0243j83091
16617E206298j06968O8406l03629k82786j80411K43742j73993J2471j41388q2606
16607D259136Q5399r6218k14400J85718m72347J96995j89302M0579k49295J23896
16597C670161j2798m7028k29255j05413j25171k1412j36573J75853l37357K95497
16587C126504k13172m6821R1353k11272n8893J18371p0780N4985J5094j14176
16577B691193j73392l03823J68117q3728K26684l28828L47054j34876J33211m36105
16567B105507L0035M4006j16383r2512M1794J12887m13274Q1431L55374k09102
$$ plain form
16637 8487238 7828542 8210934 7630746 8007356 7374077 7310798 6981227 6823281 6646206 6566868
16627 6566868 6009277 6169241 6050046 6045742 5924493 5409675 5608261 5429632 5389389 5206298
16617 5206298 5099330 5167736 4864107 4581321 4400910 4644652 4470659 4483130 4341742 4259136
16607 4259136 4344535 4248317 4033917 4219635 3747288 3944283 3754981 3795560 3546265 3670161
16597 3670161 3657363 3610335 3381080 3275667 3150496 3129084 2992511 3168364 2831007 3126504
16587 3126504 2913332 2866511 2957864 2746592 2687699 2806070 2735290 2790275 2805369 2691193
16577 2691193 2517801 2213978 2382095 2298367 2525051 2196223 2543277 2408401 2541612 2105507
16567 2105507 2135542 2179548 2063165 1970653 2012447 2125334 1712060 1793491 2148865 1939763
16557A939763J78410m16238R6170L39348l58493j00277J27656k4511n8260J8679
16547A742247k57126L97697l94610J73605q8770j89796n7193N2424J69383o4836
16537A483025j21101K67500j0004k78738m0076j56696J67440j88569l651J0838
16527A129968K60540j77285q6726K3527J45839q2684L13981o14456N95151J48553
16517A656408o21114J85035J24520l73941L04512L6554k98713j0342k98684K25907
16507I30142L90495j42792K4244k44126J53211m0412k18240M71342m15658P5934
16497I84140Q932k57334R0618j5074J26681k24854Q9336L9276P6101o239k11383
16486G00200L98968l95550K7270K601K91805p8823J31943Q1094k70292k93634
$$ plain form
16557 1939763 2118173 1701935 1798105 2137453 1778960 1678683 1806339 1781828 1723568 1742247
16547 1742247 1485121 1882818 1488208 1661813 1573043 1383247 1326054 1378478 1547861 1483025
16537 1483025 1361924 1629424 1619420 1340682 1300606 1143910 1311350 1122781 1119130 1129968
16527 1129968 1390508 1213223 1126497 1150024 1295863 1213179 1527160 912704 1507855 1656408
16517 1656408 1035294 1220329 1344849 970908 1275420 1311974 1013261 1002919 704235 930142
16507 930142 1320637 1177845 1202089 957963 1111174 1070762 852522 1323864 908206 984140
16497 984140 993072 735738 826356 811282 937963 713109 802445 841721 917822 911583 700200
16486 700200 1099168 703618 730888 733489 1025294 946471 1078414 1159508 889216 595582
16476E95582k5256J6207M22508j19643J45788m78343J30546J86481J04995l01
16466I78564j39676j08631k57126R9725L0626K74386n3666l06274M59753l11150
16456F66531P7382n3032R9205k58596N2056L35767l45719q5568L4168r9231J44953
16445E67916J912l699j93682R0363k01397K33581J34494K11042k71368j21033
16435D48129J83369J12555m2419j48236A38044N40344k42263j27630P6869O4786
16425D50150O0312J651K12612k54289R1747j33561j47943K58042B47724O3459
16415C11183K20167k55220M22923j49182o8310K16629k46616k5694p6697L79128
16405G28311C39774K2610j00386J83635K34335k53436j5876J44646A80138l7703
$$ plain form
16476 595582 570326 586533 1009041 889398 1035186 556843 687389 873870 978865 978564
16466 978564 838888 730257 473131 572856 603482 877868 824202 517928 977681 666531
16456 666531 743913 690881 790086 531490 583546 919313 573594 488026 522194 422963 567916
16445 567916 569828 566129 372447 462810 261413 494994 629488 840530 569162 448129
16435 448129 631498 744053 701634 553398 138044 678388 436125 308495 385364 450150
16425 450150 510462 512113 724725 470436 562183 428622 280679 538721 247724 311183
16415 311183 531350 276130 699053 549871 481561 698190 451574 425880 349183 728311
16405 728311 339774 362384 261998 445633 679968 426532 410656 555302 180138 142435
16395A42435L70827H6138N17975K00625j83529k83443j45570L52373k22420M53191
16385G75340C7161Q9734O04918j86195n5614K17645k62954J90888j05937A12454
16374D12522A33732K46548O0647J94018r6211j85924j37273q0227M41772J16455
16364F93537N330j43183j79216A5805J72548L59220H9314J68229K86850I2439
16353A75323E7122L9614c1028C20515G3887J42418J44401A20399O0336J93468
16343C74203J43547j72400K02066B47110n6791J46309l6164j42236K52511M3146
16333D53885A20480a2557B49605m0008O2770e4741H15225C90020j79136j9768
16323A91116L25068g919C68651f9763A68427K03110O4640k12931m8871J23601
$$ plain form
16395 142435 513262 86138 604113 804738 621209 337766 192196 544569 322149 775340
16385 775340 37161 126895 731813 545618 490004 707649 444695 635583 529646 112454
16374 412522 133732 380280 440927 634945 538734 352810 215537 135310 577082 693537
16364 693537 698867 555684 376468 15805 188353 547573 89314 257543 544393 92439
16353 175323 57122 96736 -31028 320515 73887 216305 360706 120399 180735 374203
16343 374203 517750 345350 547416 247110 190319 336628 300464 158228 410739 453885
16333 453885 120480 -12557 249605 209597 272367 -54741 815225 390020 210884 191116
16323 191116 516184 -7919 368651 -69763 168427 371537 436177 223246 174375 297976
16313B97976A45061J47916k7536j0844H6456K62883K33433k89618J73879r3560
16303C73473A39767J98654A09608K41470I129K10805Q3176J19974j62722D6904
16292B65810J45970b3148E33978j58448P720A72447J98356R1954B07144J90033
16282C97177r3298n6409J13002J69929j65248A52878K39213A73582L8368k1654
16272A90296g814C55884j24232N7824n4140B0204J92696J13617j01301o3690L62765
16261E24291A85287C9393R7944K38965a16624a0759A06447Q6573C977R4689P4064
16250A72730k3380P2392F2518P6041J36288J36670A29435f9820B31259k0135A7793
16238b78456a8935r457G576N40360D4602K1053a54587F8537C0507Q3492J08160
$$ plain form
16313 297976 145061 292977 265441 254597 86456 349339 582772 293154 467033 373473
16303 373473 139767 338421 109608 351078 9129 219934 303110 423084 260362 46904
16292 265810 411780 -23148 533978 375530 383250 172447 370803 462757 207144 397177
16282 397177 303879 247470 360472 530401 365153 152878 392091 173582 211950 190296
16272 190296 -7814 355884 231652 289476 235336 20204 212900 326517 225216 161526 524291
16261 524291 185287 39393 137337 376302 -116624 -10759 106447 193020 3977 98666 172730
16250 172730 149350 221742 62518 138559 274847 411517 129435 -69820 231259 211124 17793
16238 -278456 -18935 -28392 7576 547936 44602 65655 -154587 68537 30507 113999 222159
16227B22159p6506N4562R6793f0788B74483b5714J0394H6135a4056A89106J98139
16216C87245C7483J42280K19742g921q8946C61889a8932B1022J25569J48518j37330
16205A57779K17320G6464c7763B4850Q7510k7916b1560C56240j35241r8641J00014
16194B22372p0284i2500E748L66032E9997J3623l746J13239k3230L24955A61222
16182F175J28907d8000j35862k25172A93325R344I1610b00311B29568a98690H2517
16170H6630J54663g1065b4904j4590j81669R0928B22232e2536B9584J96588l5060
16159A91112b1268B19423a4162k89524A39932b70480C48259J2288A7300n948M02807
16148D14159b1833D03402G4597g2679J7736C28065a51220D3692K30371l6457a49223
$$ plain form
16227 222159 145653 200215 297008 -60788 274483 -25714 -15320 86135 -14056 189106 387245
16216 387245 37483 179763 399505 -7921 -96867 361889 -18932 21022 146591 295109 157779
16205 157779 375099 76464 -37763 24850 112360 84444 -21560 356240 220999 122358 222372
16194 222372 152088 -92500 5748 371780 59997 73620 69874 183113 159883 484838 161222
16182 6175 135082 -48000 -183862 -409034 193325 202669 91610 -200311 229568 -198690 82517
16170 86630 241293 -71065 -24904 -39494 -221163 -130235 222232 -52536 29584 226172 191112
16159 191112 -21268 219423 -14162 -303686 139932 -270480 348259 360547 17300 11352 414159
16148 414159 -21833 403402 74597 -72679 -54943 328065 -151220 43692 274063 237606 -149223
16136C74J2937K2511b26042d0315B7107N6364b1956B1030N474K51928A28335E5082
16123B90125c0036j01179A78205p5051R8744Q1970a95214b5691B08791H5495J5061
16112A00556m2830K8769K3825l833j5396l6737M1730D1069K6548b09307D17560
16100A4258K28229B6661L13647e9803k07150J16276C14730A12007O9465a14256
16089a36702j4043n7935H9741J32522a48436E3531e4378l278m9068A99628E7810
16077i0068j7421D2618b27697A82463c09373M3564a762A09471b14766G4134g4630
16065a55174B03235r9447f5157p3374O8921A38097b25520i920A13247J11769c5702
16053a01505A79279b09382F1065d1500k72579a45317j3581C47573r6696I3908
$$ plain form
16136 374 13311 35822 -226042 -40315 27107 83471 -21956 21030 26504 278432 128335 55082
16123 290125 -30036 -131215 178205 103154 201898 283868 -195214 -25691 208791 85495 100556
16112 100556 57726 86495 110320 106487 91091 54354 96084 41069 67617 -209307 417560
16100 14258 242487 26661 340308 -59803 -266953 -150677 314730 112007 181472 -114256
16089 -136702 -150745 -208680 89741 222263 -148436 53531 -54378 -57656 -106724 199628 57810
16077 -90068 -107489 42618 -227697 182463 -309373 -265809 -1762 109471 -214766 74134 -74630
16065 -155174 203235 103788 -65157 -138531 -69610 138097 -225520 -9920 113247 225016 -35702
16053 -101505 179279 -209382 61065 -41500 -314079 -145317 -158898 347573 250877 93908
16042a00127G6762b1480q5140B0125Q0915f4981B53031A4469e8989k35451C60028
16030E9802J0877J50066D1765f3018m5528A98447J47087f1184n3851B03081I2612
16018H6705l7677K3328d0971j22583C5441d6157C79687a4920A8550b93445b6906
16006H6333a825m7909C04136h2356D32952j50461a06809d3484G1796a70020A27572
15994C2511a28702A67190b5659l67327Q6169b5410B46837B350c59580A99722a14263
15982A77291o3854J87179d9109C07152k0914J28224A63540Q6378E7767a74784
15971B8199a74998A09901L2191J449o2751e7308j5686H6773k2335a92790q0853
15960b73643j6332J10108D301J36455n7332l0475A0412K1550a19663A33347E1106
$$ plain form
16042 -100127 76762 -21480 -106620 20125 101040 -64981 253031 14469 -58989 -294440 360028
16030 59802 70679 220745 41765 -63018 -108546 198447 345534 -61184 -115035 203081 92612
16018 86705 49028 72356 -40971 -163554 35441 -46157 379687 -14920 18550 -293445 -26906
16006 86333 -1825 -49734 304136 -82356 432952 282491 -106809 -43484 71796 -170020 127572
15994 32511 -128702 167190 -25659 -392986 -306817 -25410 246837 2350 -359580 199722 -114263
15982 177291 113437 300616 -49109 307152 286238 414462 163540 249918 57767 -174784
15971 28199 -174998 109901 142092 143541 80790 -57308 -72994 86773 64438 -192790 -273643
15960 -273643 -289975 -179867 4301 140756 83424 52949 10412 31962 -119663 133347 51106
15948A15846a2827k57250i5782a6865A699d9028C88525a92225c7444j7195J5482
15937c9157a5233A62275c5037j21009k21854j0708a54652o1981J06391B6431c39320
15925a92675g9535j43389j05144d3658j04922D1432h5745j67772c9451k30444
15915b69895e4044I5197a13177k28320a48868N4310l30249a783A1035a0324A8193
15903G0097a68576n3250O3602p0574D2396n018d7280j45744J9692A38101b90029
15891A13762e7200p4864a4664G2260d0910B16014j07313a0027o1358E9873J77539
15880B37412b10661h6202q8437A34390c87790a34004f6638F2506R9046m8882D8866
15868A55237b8646k10078c0723k19480f1071p8590j38299o5652g1913c0997k4155
$$ plain form
15948 115846 -12827 -270077 -95782 -16865 1699 -49028 388525 -192225 -37444 -54639 -39157
15937 -39157 -15233 162275 -35037 -156046 -377900 -388608 -154652 -216633 -110242 26431 -339320
15925 -192675 -79535 -222924 -328068 -43658 -148580 41432 -85745 -253517 -39451 -269895
15915 -269895 -54044 95197 -113177 -341497 -148868 -94558 -424807 -1783 11035 -10324 18193
15903 70097 -168576 -221826 -158224 -228798 42396 37378 -47280 -193024 -173332 138101 -290029
15891 113762 -57200 -132064 -14664 72260 -40910 216014 108701 -10027 -71385 59873 237412
15880 237412 -210661 -86202 -174639 134390 -387790 -134004 -66638 62506 161552 112670 48866
15868 155237 -28646 -238724 -30723 -250203 -61071 -139661 -277960 -343612 -71913 -30997 -55152
15857e5152q1525E4939a87872G6366a69287O419E5195A8597P1083O9149a46337
15845b06979I5091c47059N5382a04063C3944N0245b50868M7909D85591f5935A750
15833c94501A71292m2449a46294H2586B2017N0097b49448g1182q385A72696p6010
15822I6686c85025B6598I150b2405A37098b53513A45056c05963i4111C48266j2597
15811C35669a71994f1343j1178k26406J00989n984O6770j16851B24846D4840c8910
15799B35c92069O7449H227J73467a0912k25024q09A95323a16642D2725a77124
15787b0270j36713E2130N3774d7873C23019E8912M0509a31657A01370J43401b78753
15775d4898j84220n7012B97907b20287A22970K0115J66237d83078A88866b5697
$$ plain form
15857 -55152 -136677 54939 -187872 76366 -169287 -162868 55195 18597 89680 158829 -146337
15845 -206979 95091 -347059 -291677 -104063 33944 84189 -250868 -202959 485591 -65935 1750
15833 -394501 171292 128843 -146294 82586 22017 72114 -249448 -71182 -79567 172696 96686
15822 96686 -385025 26598 9150 -22405 137098 -253513 145056 -305963 -94111 348266 335669
15811 335669 -171994 -61343 -72521 -298927 -197938 -203922 -137152 -254003 224846 44840 -38910
15799 235 -392069 -324620 8227 181694 -10912 -235936 -236745 195323 -116642 42725 -177124
15787 -20270 -156983 52130 105904 -47873 323019 58912 99421 -131657 101370 244771 -278753
15775 -44898 -229118 -286130 297907 -220287 122970 143085 309322 -483078 188866 -25697
15764b09449c2677j47983N6613C8685J8334K9067O595P5895J04079o3517L5809
15753B44947D795b35600b3142k40838L0137C13515j23024H7743h8184G260d6038
15741B40961a49224O0124m4228m0440R613j08293D0256o247A5733b03174F053
15729E9724K87643D3612M00560E6245L1166c8743j68240B62599D8900J23114e3484
15717I0403B4409e69848i2293A76081a22371M2872k093k62140H9993m2415b98043
15705a30334o4585c3292r7647M5379p592A99563a5899A98148p5730d5527D698
15693I6214R805e3185A99927l724K96530j79435a04146B08344D3670b86179e7896
15681b97728H1743Q767f8095C7366A0180J52702e8754k4792p2429M87I2473a096
$$ plain form
15764 -209449 -32677 -180660 -124047 38685 57019 86086 92681 168576 272655 209138 244947
15753 244947 4795 -235600 -23142 -263980 -233843 313515 190491 87743 -88184 7260 -46038
15741 240961 -149224 -89100 -133328 -173768 -164155 -272448 40256 34009 15733 -203174 6053
15729 59724 347367 43612 444172 56245 87411 -38743 -206983 262599 48900 172014 -53484
15717 90403 24409 -569848 -92293 176081 -122371 -79499 -81592 -343732 89993 47578 -298043
15705 -130334 -194919 -33292 -130939 -85560 -93152 199563 -15899 198148 122418 -45527 4698
15693 96214 106019 -53185 199927 196203 492733 313298 -104146 208344 43670 -286179 -57896
15681 -297728 81743 90510 -68095 37366 10180 162882 -58754 -83546 -155975 -155488 92473 -1096
15668A36229l8560N4386c4870r6661m2499o4742J11017J1808k41916a76809j39619
15657c16428a35532G6410b33061A05168a92866H0095J01125p5184f938j7334A66323
15645B77266F5061N6607J947e9864k09688a10002j86304J36169G5148R7215K5504
15634A97867A6393a37712D1548Q2868c02336A48468b89411J9777g2246o2745k62882
15623c97873J05529A11695l8569a43873c3564g706A78763a84783A25328b28350
15612b17269h408E683K28578a36936d2339A63443b83768n0326H3499b48221g8961
15600a3600A56245B6867g8897k56325a28357o8835M4640e9335j07614C9761K46323
15589B86084A39769g7994k34852B01991e356B48450c0913G6163l7517a66504F6366
$$ plain form
15668 136229 97669 152055 -34870 -131531 -174030 -238772 -127755 -115947 -357863 -176809 -316428
15657 -316428 -135532 76410 -233061 105168 -192866 80095 181220 106036 -6938 -24272 166323
15645 277266 65061 121668 123615 -59864 -269552 -110002 -296306 -160137 75148 172363 197867
15634 197867 16393 -137712 41548 124416 -302336 148468 -289411 -269634 -72246 -134991 -397873
15623 -397873 -292344 111695 73126 -143873 -33564 -7706 178763 -184783 125328 -228350
15612 -217269 -8408 5683 234261 -136936 -42339 163443 -283768 -334094 83499 -248221 -78961
15600 -13600 156245 26867 -78897 -335222 -128357 -197192 -152552 -59335 -166949 39761 286084
15589 286084 139769 -77994 -312846 201991 -5356 248450 -30913 76163 38646 -166504 66366
15577A38385a82120a397B18266c84736m2463f3756A09825e4079j65422i5173q949
15566a04122A12286J96073A33054k8081i0185B05795A7954d6304B5169n678I659
15554A34199L4464a94792n7876d3238o8637q1338l835A3325J0684i9915B0995
15542a05550L3307A7938b67471Q5950G9442C6923L23982a82443m6676L8717A47133
15530h392A53447b27931I0020a93028l8973a12641c7575I9815m2087A8600h3408
15518B33405F098K73628A7054k011J94172K2843a25609N5296n3096k65668a23251
15506a5225k4467k03949a21535G6563a9518k72465J03344A56615a88739G2245
15495b06611E8305b42029E723a03683N1280j48770A76945k3449h6239a4756j89891
$$ plain form
15577 138385 -182120 -1397 218266 -384736 -427199 -63756 109825 -54079 -219501 -95173 -104122
15566 -104122 112286 308359 133054 104973 -90185 205795 17954 -46304 25169 19491 9659
15554 134199 168663 -194792 -252668 -43238 -111875 -193213 -197048 13325 24009 -99915 20995
15542 -105550 -72243 17938 -267471 -181521 79442 36923 360905 -182443 -229119 -190402 147133
15530 -8392 153447 -227931 90020 -193028 -232001 -112641 -37575 99815 57728 18600 -83408
15518 233405 6098 279726 17054 15043 209215 232058 -125609 -70313 -123409 -389077 -123251
15506 -15225 -39692 -243641 -121535 76563 -19518 -291983 -188639 156615 -188739 72245
15495 -206611 58305 -242029 5723 -103683 -52403 -201173 176945 153496 -86239 -14756 -204647
15484b04647B512J31441J39468d03405B82910j31914F4206J60964b06095b2900
15473A33340J61503b72009f5875o8187d4255B61350a84171B67750H0975a65065
15462g1407m4996A415e3783B36315J58833I4524J19423a2370n1847A15403b22544
15450A73771a39559J169A13419C0255K89510h9746D34028f7390j19140A49668
15439h5580B06920F6094J46653J76346b13769A45810a0606A58729q140c9726k71775
15428c11501A99474C1257J69927a96823k9543a10881A63755a42997A47319a4061
15417c20138B16451n3703N7997c4468r5009K7630H2090J24634n2176J36575j22485
15406A68638b68620a0675A82829o7684c7321b027k42395B4632a3337B4217b7741
$$ plain form
15484 -204647 2512 133953 273421 -403405 282910 150996 64206 225170 -206095 -22900
15473 133340 294843 -272009 -65875 -134062 -44255 261350 -184171 267750 80975 -165065
15462 -71407 -116403 1415 -53783 236315 395148 94524 213947 -12370 -64217 115403 -222544
15450 173771 -139559 -138390 113419 30255 319765 -89746 434028 -67390 -186530 149668
15439 -85580 206920 66094 212747 389093 -213769 145810 -10606 158729 150589 -39726 -311501
15428 -311501 199474 31257 201184 -196823 -226366 -110881 163755 -142997 147319 -14061
15417 -320138 216451 162748 220745 -34468 -129477 -101847 82090 206724 154548 291123 168638
15406 168638 -268620 -10675 182829 115145 -37321 -2027 -244422 24632 -13337 24217 -27741
15394B48957F183a02977A05321g0864A50209i4287k13646A29181D3165a28678
15383A65189Q9063a15881j48763j23260d7951C69830c3151q8177B62934F3397
15372e1946j06836C2270J4580f646A87083i3934B6505N5293O7716F9468e5806
15360a12027A51383i0156k72711A53483K7800m6994d8511H4185c6626B06357a41825
15348A10930e2769j11812O8003G4053K83714c7700J8847j05175n0338E4403A7849
15336B08485j3998Q1621j37822l6424L24107F5774J26149J3514b62564P5127g5162
15324A66432a88047A3048J23859c4871k00559B9898a48140A83618E6832a54160
15313A25544Q3928E0868a87749B57848C4142n092a50915D05084g8251B91282c94101
$$ plain form
15394 248957 6183 -102977 105321 -70864 150209 -94287 -307933 129181 43165 -128678
15383 165189 254252 -115881 -264644 -387904 -47951 369830 -33151 -121328 262934 63397
15372 -51946 -158782 32270 46850 -6646 187083 -93934 26505 81798 149514 69468 -55806
15360 -112027 151383 -90156 -362867 153483 181283 134289 -48511 84185 -36626 206357 -141825
15348 110930 -52769 -164581 -96578 74053 357767 -37700 -18853 -124028 -174366 54403 17849
15336 208485 194487 276108 138286 101862 425969 65774 191923 205437 -262564 -187437 -75162
15324 166432 -188047 13048 136907 -34871 -235430 29898 -148140 183618 56832 -154160
15313 125544 209472 50868 -187749 257848 34142 29050 -150915 405084 -78251 291282 -394101
15301b13436D09577f5860B1398K591b51400Q6610j6386D2496J75839L2656P3314
15290C24305D3192J66052g1451J0778G3839k1584O9651D9341R4797a4968A12682
15278A71172b14875F5271a38824m6602A97107h2386C0300a21007r3780C17995
15267a41964B09370b37519A69817J26193k1391a3312G5213B0830J1297a23871
15256D8102a0204A2409Q9027D2425M4672L97595K38159J10163M18136p6400K54622
15245A429372o27141j88594f8928C0906Q6001n4562k7831h0543G2381L8887R2900
15234B04168N0064A05857J99626a40332n6474C32688c55309a0981j46163B88227
15223b44709A22750D2983N1569R0399G7683P335b61819D3720c677k05054B19583
$$ plain form
15301 -213436 409577 -65860 21398 23989 -251400 -164790 -181176 42496 218335 250991 324305
15290 324305 43192 209244 -71451 -60673 73839 52255 121906 49341 144138 -14968 112682
15278 171172 -214875 65271 -138824 -185426 197107 -82386 30300 -121007 -214787 317995
15267 -141964 209370 -237519 169817 296010 274619 -13312 75213 20830 32127 -123871
15256 48102 -10204 12409 101436 42425 87097 484692 722851 833014 1251150 1174750 1429372
15245 1429372 802231 613637 -68928 30906 116907 62345 34514 -80543 72381 111268 204168
15234 204168 254232 105857 305483 -140332 -196806 332688 -355309 -10981 -157144 288227
15223 -244709 122750 42983 94552 184951 77683 85018 -261819 43720 -3677 -208731 219583
15211b11824D73720F8229a101A55201F8766a71504H4820J28295I166M9259a8670
15199B29042P1353C1299a48368B33376j1296r5961b77713c6280B07827q9150K29540
15188C48217g4607A8224J0785J18612J33129b2228C49736o686j69725a33812R241
15177a24571M0397L0218k0612B67232g3976A72436b37096I3623a83142K2853P6768
15166h3521A18382d0694A29276E4620F642K53282h9619A6203J78243A0247K21379
15155B31626o2446a19333B1527r970a21697A87746i4840q6668B78040h6145c3083
15143B12144J09706E6299R9861P2942O5351A00288e908C4630M9639d57338B09897
15131A25410f7047C11721A33610K01820j49331h56B96132j8758Q7364j34504L7384
$$ plain form
15211 -211824 473720 68229 -1101 155201 68766 -171504 84820 213115 9166 58425 -18670
15199 229042 300395 31299 -148368 233376 222080 126119 -277713 -36280 207827 118677 348217
15188 348217 -74607 18224 29009 147621 280750 -22228 349736 343050 173325 -133812 -124571
15177 -124571 -84174 -53956 -74568 267232 -73976 172436 -237096 93623 -183142 -160289 -83521
15166 -83521 118382 -40694 129276 54620 6642 259924 -89619 16203 194446 10247 231626
15155 231626 169180 -119333 21527 11557 -121697 187746 -94840 -181508 278040 -86145 -33083
15143 212144 321850 56299 156160 229102 294453 100288 -5908 34630 84269 -457338 209897
15131 125410 -67047 311721 133610 335430 186099 -856 296132 277374 364738 230234 267618
15120B67618E0547j3498c5763B16352E0834B2902P6130J03334C7073Q0365O3492
15109A80930o8646J13560l7631i431A59611N6694b00385A27806n178d5033B27369
15097g6492C46947A60364J4647K60062A58590a01207K996A61886R3500A09698
15086b0521p1491B36427O9069B2551L93813c2519p6646C28267e0207a4030B81845
15074B97739h1401C47447D7479j801K51647j22262b7563B46159j21244K59138
15064C84053a17937l0920B03676d4241C50115l0422l9101O2430j51260m2617n1949
15053I7196N34664k79540G2190K26355p0551p1178J68563b06729R7026D56514
15042b3908A66881L4935b23747D00238H1686K38947a02900E5800P394k8130a01286
$$ plain form
15120 267618 50547 37049 -35763 216352 50834 22902 99032 202366 37073 117438 180930
15109 180930 112284 225844 188213 -9431 159611 216305 -200385 127806 122628 -45033 227369
15097 -76492 346947 160364 175011 435073 158590 -101207 -98211 161886 255386 109698
15086 -20521 -92012 236427 305496 22551 416364 -32519 -109165 328267 -50207 -14030 281845
15074 297739 -81401 347447 47479 45678 297325 175063 -27563 246159 124915 384053
15064 384053 -117937 -148857 203676 -44241 350115 319693 280592 343022 191762 149145 97196
15053 97196 631860 352320 72190 298545 227994 156816 325379 -206729 -109703 456514
15042 -23908 166881 201816 -223747 400238 81686 320633 -102900 55800 63194 35064 -101286
15030A44844Q7821J07842j30364K94450G1642l5247J35411K04791Q4221C0578
15019a75016B54859K57797A35162K22204Q5570b60751D34702j88605A21885M8336
15009A70221m1893K13467I6478N7289f974C88948E6664P6026Q981J1014E1189
14997D41269A65995K95226j62171D3331J34025R6861H2081M53174A17271J49846
14987B67117C7113L88495A076M77173c9029r0908A78201J77603q0638K11999a09759
14975A82992J57330J81338k7844j7020l7497q6930A50181J36646j21326O6000
14965B31501r0309a43366G9316K37653l0143K254N1785j47871K6576a03854A44457
14953C32998m2986h0624D48098B10239H1909Q7320K29704A62618K85612A09362
$$ plain form
15030 144844 232665 340507 210143 504593 71642 36395 171806 376597 460818 30578
15019 -175016 254859 512656 135162 357366 442936 -260751 434702 246097 121885 170221
15009 170221 128328 341795 96478 153767 -6974 388948 56664 132690 141671 152685 51189
14997 441269 165995 461221 299050 43331 177356 274217 82081 535255 117271 267117
14987 267117 37113 425608 1076 478249 -39029 -129937 178201 355804 275166 487165 -109759
14975 182992 340322 521660 493816 476796 439299 352369 150181 286827 165501 231501
14965 231501 141192 -143366 79316 316969 286826 289080 340865 192994 219570 -103854 144457
14953 332998 290012 -80624 448098 210239 81909 169229 398933 162618 448230 109362
14942e520C06117Q650j37765i7812A92084O08557C63597J17200A34505J02033
14932B36538M7182N5277j51136J51711I3528L81265j9886j20773N673F9056M24514
14921D93570A30843J55738J23039A59040J49853a05860G9784L13637q313K59580
14911F44688j77789H4351K97620q7519P5037j05604J68959J0514k20019q9361
14901A33978K96633G5323M69538N140B61450A28339a2649B79718k8068J45691
14891C97341A85512L0459K97846k4781A25391N01908C03422j27858L30354j46852
14881C59066A22961N09116H8056J30052L96002k16565p8226J9942r6744L81252
14871F23769B92633K04868j31218J05765k08117J99873j25125j06175J06197A03696
$$ plain form
14942 -5520 306117 314767 177002 -97812 192084 800641 363597 480797 134505 236538
14932 236538 283720 338997 187861 339572 93528 474793 454907 334134 339807 69056 493570
14921 493570 130843 286581 409620 159040 308893 -105860 79784 393421 385108 644688
14911 644688 466899 84351 381971 294452 369489 263885 432844 443358 223339 133978
14901 133978 430611 75323 544861 550001 261450 128339 -12649 279718 251650 397341
14891 397341 185512 215971 513817 489036 125391 627299 303422 175564 505918 359066
14881 359066 122961 632077 88056 218108 614110 397545 319319 339261 242517 623769
14871 623769 292633 497501 366283 472048 263931 463804 338679 232504 338701 103696
14860C11234k7747M3758a69841F56931A03897M60097q6538j49187D8459O99877
14850G48336l09208J45949k73675M7202A46029J25917M08560k40578l7488K58666
14840F61106l00175J23388j04804I1942L11837j6175m3382P2211p4162P3103j68971
14829B46403o00N90636C35732K15315J72805B52766N0486o8230M09492n3230k10521
14818C80763K13931K1648q6669J50078R9077q1716B85667J85942J57481B59548
14807F82952k63941J4561l2929A63222M67395B11007O09839j33882C38656K27772
14797E66428R9499n6582J24829l38979A89667O37073l81607M40862k94833L868
14787E95030P7336n97j89571M14J80935k66883J46851j33643K31509J09660l58515
$$ plain form
14860 311234 283487 327245 -169841 656931 103897 563994 477456 328269 48459 748336
14850 748336 439128 585077 311402 358604 146029 271946 680506 439928 402440 661106
14840 661106 360931 484319 379515 91942 403779 387604 344222 416433 342271 415374 246403
14829 246403 245803 836439 335732 551047 723852 252766 303252 235022 644514 591284 380763
14818 380763 594694 616342 529673 679751 778828 697112 285667 471609 629090 259548
14807 682952 419011 433572 400643 163222 630617 211007 820846 686964 338656 566428
14797 566428 665927 609345 734174 395195 189667 826740 445133 885995 591162 595030
14787 595030 672366 671769 482198 482612 663547 396664 543515 409872 641381 751041 392526
14776C92526J25209J0547K09913l10302J63037L57584l32205L4766J45488j44352
14766F52211J89426k70313J60015j6886l38921K05918j25627J50585j16551L36625
14756H26482Q7386l42490J66536K8000C72629N63708l22040K76925j95572j72942
14746E22708l2266K60232j95424k31429L62719K69123m56239M8493K47639l67197
14736D28359L72901k83071K87324L5899o9179j46122J40386j1523j81832J79028
14726G52170J60793l60671j80160M56257k0048k65478M14507D43580M19693j0199
14716H53074J42778N5397P138l90982M29591l75749j5328J01859l0718j34061
14706F42999L52187l72124J17190L5535l373p8145J88180K38005k01761K3778
$$ plain form
14776 392526 517735 528282 738195 427893 590930 948514 616309 651075 796563 652211
14766 652211 841637 571324 731339 714453 375532 581450 455823 606408 489857 826482
14756 826482 913868 571378 737914 765914 372629 936337 614297 891222 695650 522708
14746 522708 490442 750674 555250 323821 686540 955663 499424 547917 795556 428359
14736 428359 801260 518189 805513 841412 772233 626111 766497 754974 573142 752170
14726 752170 912963 552292 372132 828389 808341 542863 957370 443580 863273 853074
14716 853074 995852 1051249 1058387 667405 1096996 721247 705919 807778 777060 642999
14706 642999 995186 623062 740252 775787 772414 694269 882449 1120454 918693 942471
14696I42471J2159n7294l76682N61575k16667k01568J27369J0053M18626n22796
14686F97246M69923j75638k86661L07332L8359k7601j42485L36078m32796L65367
14676A149124K87122k11513K10293l59850J76995l12467J10075K8472J50085q6087
14666A142249j63742q7388K56984K56305l08018J01236j29138P3058N493J45215
14656A292254j36460K11288j10854m90916J89037M14410k97383L54492j15598
14647A310270k5434j13894L5655K12508K9568k30238l81989K61345J34461L4515
14637A266767k88412N57893k85001j7399M9333M7030j53752R2870r1220J56752
14627A334861O4800J71647K90345n74892k16004K39777K92990P5282R8791j9783
$$ plain form
14696 942471 954630 897336 520654 1082229 865562 663994 791363 801416 1220042 697246
14686 697246 1167169 991531 704870 1012202 1050561 1022960 880475 1216553 783757 1149124
14676 1149124 1436246 1224733 1435026 1075176 1252171 939704 1049779 1078251 1228336 1142249
14666 1142249 978507 891119 1148103 1404408 1096390 1197626 1068488 1141546 1147039 1292254
14656 1292254 1155794 1367082 1256228 765312 954349 1368759 1071376 1425868 1310270
14647 1310270 1284836 1170942 1206597 1419105 1448673 1218435 836446 1097791 1232252 1266767
14637 1266767 978355 1536248 1251247 1233848 1283181 1330211 1176459 1269329 1178109 1334861
14627 1334861 1399661 1571308 1861653 1286761 1070757 1310534 1603524 1678806 1777597 1757814
14617A757814n40967L26213q0760J17105J1430l28382K47474J2288K03570j0501
14607A715284k80869K50375J79197l00114j63263K53404j01482K35263M67k63499
14597A524763K81480M8921K00314k94573k48547J07952K30691k53214M21218j90683
14587A828322j3634n5372L68705j16228j83994j48101M61057r6267K803O6327
14577B113618j73772O8080M14156l01365J42403P8638q8034J21783o2614J35852
14567B448745j4952L94166m58674j00627K62851K43383j46181J64638K23764k71603
14557B745510M66491k63478L64921L04730R62879J58229O83204J137495J643974
14548H203955M333712R477315J3226307J160341j4857149A0132558m308321j933768
$$ plain form
14617 1757814 1216847 1543060 1462300 1579405 1590835 1262453 1509927 1522215 1725785 1715284
14607 1715284 1434415 1684790 1863987 1563873 1400610 1654014 1552532 1787795 1788262 1524763
14597 1524763 1806243 1855164 2055478 1760905 1512358 1620310 1851001 1597787 2019005 1828322
14587 1828322 1814688 1759316 2128021 2011793 1827799 1679698 2140755 2044488 2047291 2113618
14577 2113618 1939846 2007926 2422082 2120717 2263120 2341758 2253724 2375507 2312893 2448745
14567 2448745 2433793 2827959 2369285 2268658 2531509 2774892 2628711 2793349 3017113 2745510
14557 2745510 3212001 2948523 3313444 3618174 4581053 4739282 5422486 6559981 8203955
14548 8203955 12537667 22014982 35241289 36401630 21544481 10132558 5824237 3890469
14540C890469p59494n58674n4600K4446j81260r2786j7637k77501l05158K78600
14530A946405m8562K11330Q6829M39792l29333J13583Q2266n3704p6202l749L48872
14519B717527l13804J38716J13601p3066m0363Q9282K07361r4992L69585L4895
14509C148742l4306l78569J313L94755r8340q604J64600L7829M0165k4809j24420
14498C118356J12043j20531N06603q6729P8950j05007j91315K77449R801j47283
14488C452337M78989l02742J98184k56973K42445K10202j7651J13630k93680K81338
14478D106079o1239R0578n1416J35603R1901M24741m55507j07020L2471O70356
14468D876547l25060J60007q9597K83515j75724J28192K21045j65267P0788k81356
$$ plain form
14540 3890469 3130975 2572301 2517701 2542147 2360887 2268101 2250464 1972963 1667805 1946405
14530 1946405 1897843 2109173 2196002 2635794 2306461 2420044 2502310 2448606 2372404 2368655 2717527
14519 2717527 2403723 2542439 2656040 2582974 2542611 2631893 2839254 2744262 3113847 3148742
14509 3148742 3114436 2735867 2737180 3131935 3033595 3024991 3189591 3227420 3267585 3242776 3118356
14498 3118356 3230399 3109868 3616471 3529742 3608692 3503685 3312370 3589819 3599620 3452337
14488 3452337 3931326 3628584 3826768 3569795 3812240 4022442 4004791 4118421 3824741 4106079
14478 4106079 4044840 4135418 4084002 4219605 4311506 4736247 4280740 4173720 4206191 4876547
14468 4876547 4551487 4711494 4621897 4905412 4729688 4857880 5078925 4913658 4984446 4703090
14458D703090J74171N91406o59095O86324j12361l50145K99495J51951K65571
14449E750407j23298n0780K80347J5099K19773j70181K16085P3233o2177M64558
14439F613066l03462K55850J37905R4131n6998J98233J509n33224N72337N4380
14429G033727M77014l7555J35642l5224r1095M93595k71981N23948j45042k3618
14419H059411L37263J26988J68036l04572L17136J20836K08999L322R3907J96035
14409I327361K43153O7905J38807N618L88753o2729L05228k6957M61235L61912
14399A1210286k48033K29176q6563M05883L4327K68923J10213O68137J33735J16927
14389A2843011j61153N48136K0987L83903J21217M34579J81674K35292J20120
$$ plain form
14458 4703090 4877261 5468667 4809572 5495896 5383535 5033390 5332885 5484836 5750407
14449 5750407 5627109 5576329 5856676 5871775 6091548 5921367 6137452 6210685 6148508 6613066
14439 6613066 6309604 6565454 6703359 6797490 6740492 6938725 6940234 6407010 6979347 7033727
14429 7033727 7510741 7473186 7608828 7573604 7482509 7976104 7704123 8228071 8083029 8059411
14419 8059411 8396674 8523662 8691698 8387126 8704262 8825098 9034097 9037419 9131326 9327361
14409 9327361 9570514 9638419 9777226 9782844 10171597 10108868 10414096 10387139 10848374 11210286
14399 11210286 10962253 11191429 11104866 11510749 11545076 11813999 11924212 12592349 12726084 12843011
14389 12843011 12681858 13229994 13250981 13634884 13756101 14190680 14372354 14607646 14727766
14380A4727766L68511O21764J94566N19676l2731L21566R9304O84727q4454Q95399
14370A8316094L38262N34653J73224K12513M65159O65581K03299L38658Q15532
14361B2062975N88418K64308O04393O61787J31188P12227M38941O72525J198545
14352B7335307O9982N15763J083851O13440Q15335O12077Q59724J265090R09768
14343C4080337P51604J172247N81566J101010J365341R18860R03306J482068J349412
14334D3705751J440405J223821J652989J377276J496115J669310J951142J402860
14326E5919669J846664K192504J609312K275050K061929K807598K215228K649813
14318G3577767K593646K949022L180357K916555L387547L472718L511989L807449
$$ plain form
14380 14727766 15096277 15718041 15912607 16432283 16399552 16721118 16820422 17505149 17420695 18316094
14370 18316094 18654356 19189009 19362233 19574746 20039905 20705486 20908785 21247443 22062975
14361 22062975 22651393 22915701 23520094 24181881 24313069 25025296 25464237 26136762 27335307
14352 27335307 27405289 27921052 29004903 29618343 30433678 31045755 31905479 33170569 34080337
14343 34080337 34831941 36004188 36585754 37686764 39052105 39970965 40874271 42356339 43705751
14334 43705751 45146156 46369977 48022966 49400242 50896357 52565667 54516809 55919669
14326 55919669 57766333 59958837 61568149 63843199 65905128 68712726 70927954 73577767
14318 73577767 76171413 79120435 82300792 85217347 88604894 92077612 95589601 99397050
14310I9397050M646818L588719M608489M894896N247264N089918N590725O161799
14302A39225678O377955O479277O828847P646123P698052Q145070Q921530R504719
14294B00827251R250815J0159807J0695872J1022687J1888004J1850378J2723362
14287B78418176J2991583J3453801J3829595J4187144J4020276J4423421J3577791
14280C74901787J3523854J2832351J2610979J0999719R329962P709644O207108
14273D48115404N044235J621625k564051l882736l009712l980528n568033q341769
14265D27434435r489622j0907486j2014546j2884442j4312856j4952731j4752622
14258C38120130j5548393j5083222j4528827j3956087j4209385j3159080j2967413
$$ plain form
14310 99397050 104043868 107632587 112241076 117135972 122383236 127473154 133063879 139225678
14302 139225678 145603633 152082910 158911757 166557880 174255932 182401002 191322532 200827251
14294 200827251 210078066 220237873 230933745 241956432 253844436 265694814 278418176
14287 278418176 291409759 304863560 318693155 332880299 346900575 361323996 374901787
14280 374901787 388425641 401257992 413868971 424868690 434198652 441908296 448115404
14273 448115404 453159639 454781264 452217213 448334477 445324765 441344237 435776204 427434435
14265 427434435 417944813 407037327 395022781 382138339 367825483 352872752 338120130
14258 338120130 322571737 307488515 292959688 279003601 264794216 251635136 238667723
14251B38667723j1776123j1641209j0607345j0265405r545246r150258q128432
14244A67553705p929523p344239p343525o851207o483813n485308n623795m877040
14236A15615255n112930m756149m387378m125523l980765l473285l166861l704283
14228H2908081l327640k884624k714171k932530k730338k207570k382493j975187
14220F1753528j921618k059770j908950j782179j943469j532015j220765j274740
14212D8110022j544148j685818j616008j093314p38423j008828q70622j198368
14204C8354493j383162j077628q12037q81921o32522p47770j053959j123043n90418
14195C0052033o03347o32175o14132q65581o27722n68624m45191r31478m70694
$$ plain form
14251 238667723 226891600 215250391 204643046 194377641 184832395 175682137 167553705
14244 167553705 159624182 152279943 144936418 138085211 131601398 126116090 120492295 115615255
14236 115615255 110502325 105746176 101358798 97233275 93252510 89779225 86612364 82908081
14228 82908081 79580441 76695817 73981646 71049116 68318778 66111208 63728715 61753528
14220 61753528 59831910 57772140 55863190 54081011 52137542 50605527 49384762 48110022
14212 48110022 46565874 44880056 43264048 42170734 41432311 40423483 39552861 38354493
14204 38354493 36971331 35893703 35081666 34199745 33567223 32819453 31765494 30642451 30052033
14195 30052033 29448686 28816511 28202379 27336798 26709076 26140452 25695261 24763783 24293089
14186B4293089n38735l96416n15027r32905k57057n82578n39673j22417n04268
14177A9904013o27011m35275m36275j50353l17714l36445j83850l00454l63261
14168A6753375n46131j63198j54646m57061l33041k66024j74645P421o29272l83965
14158A3652813k33051K82397m44411l26135j23493q0845j75105K6487m67845k60861
14148A1849951j77945k71836j34862l82987m7520j77411L17626m44878k37358
14139A0292780k57544j35178k85740K03441l73741j27176k56781k64673j02474
14130H692914J0605K0246J21051m68737L27711l40407l99429l707M204j44491
14120G819960J36692n78613Q0301n3393k55693O3378r4598J21886j44616n21524
$$ plain form
14186 24293089 23754354 23357938 22842911 21910006 21652949 21070371 20530698 20408281 19904013
14177 19904013 19277002 18841727 18405452 18255099 17937385 17600940 17417090 17116636 16753375
14168 16753375 16207244 16044046 15889400 15432339 15099298 14833274 14658629 14666050 14036778 13652813
14158 13652813 13419762 13702159 13257748 12931613 12808120 12727275 12552170 12578657 12110812 11849951
14148 11849951 11672006 11400170 11265308 10882321 10834801 10657390 10975016 10530138 10292780
14139 10292780 10035236 9900058 9614318 9817759 9444018 9316842 9060061 8795388 8692914
14130 8692914 8703519 8723765 8844816 8376079 8703790 8363383 7963954 7960247 7964451 7819960
14120 7819960 7956652 7378039 7458340 7404947 7149254 7212632 7118034 7239920 7095304 6573780
14110F573780l6311J48523N0443k46748l52431K04408j15831k6321k64049k62179
14100E673284P61522p60208L11948l77008K26297m67634K9598Q5839k31678K45481
14090E497441k08986l3151j6840j96100P0290J33875m58600l637o7680O098Q8720
14079D811430n34319K25281K47640l96793j57322K80938m42755K77246J09505
14070D420851o69710L36702o7054M30123k44522j03525k48970l5246n0552m8944
14060C719153K4442K65369N878o15760M43574j40434o52465R03073m19047p5891
14050C457892K12375j98258N9053r5501p114l86042O22973k91682j26335j2327
14040C235034j95051J31179J06132j20700k41859L00185j38487n7182O2439N1336
$$ plain form
14110 6573780 6537469 6685992 6736435 6489687 6137256 6341664 6225833 6199512 5935463 5673284
14100 5673284 6434806 5674598 5986546 5609538 5835835 5368201 5397799 5483638 5251960 5497441
14090 5497441 5288455 5255304 5238464 5042364 5112654 5246529 4787929 4784292 4716612 4722710 4811430
14079 4811430 4277111 4502392 4750032 4353239 4195917 4476855 4034100 4311346 4420851
14070 4420851 3751141 4087843 4020789 4450912 4206390 4102865 3853895 3818649 3768097 3719153
14060 3719153 3743595 4008964 4014842 3399082 3842656 3702222 3049757 3952830 3533783 3457892
14050 3457892 3670267 3472009 3531062 3435561 3428447 3042405 3665378 3373696 3247361 3235034
14040 3235034 3039983 3171162 3277294 3156594 2914735 3214920 3076433 3019251 3081690 3133026
14030C133026m39296K68590k31849k8888M01169j73015j40798K5756J21093k57905
14020B677883L5503J67576l22524k44816k4838K64884p1387M9393M5635k43944
14010B333365M47640k92508k33339J86426j16700L64335l87746o7202m0586k37436
14000A956249M75410m2119n2334K50429l70540J41344j38809O58282l07289M66607
13990C037230M52727J010016K856501Q165779J3876326N676140j0902129r900825
13982A4271765n283827k563868j059940o98477p23900l25127j43746j55170l68703
13973B949007l49043M665k03175J48940l98381O77887l92571j79022l9314k94877
13963A924116J37569L7729J01401j40131k5549j07869K23576k06532J77568o4646
$$ plain form
14030 3133026 2693730 2962320 2730471 2701583 3102752 2929737 2788939 2814695 2935788 2677883
14020 2677883 2713386 2880962 2558438 2313622 2288784 2553668 2482281 2531674 2577309 2333365
14010 2333365 2781005 2488497 2255158 2441584 2324884 2689219 2301473 2234271 2193685 1956249
14000 1956249 2431659 2389540 2337206 2587635 2217095 2358439 2219630 2877912 2570623 3037230
13990 3037230 3489957 4499973 7356474 15522253 29398579 35074719 24172590 14271765
13982 14271765 8987938 6424070 5364130 4665653 3941753 3616626 3472880 3317710 2949007
13973 2949007 2599964 2604629 2401454 2550394 2152013 2829900 2437329 2258307 2218993 1924116
13963 1924116 2061685 2099414 2200815 2060684 2035135 1927266 2150842 1944310 2121878 2057232
13953B057232k7911L55766o93471K74281k5284J52489n27634O1810J96002L0511
13943A853791R1082p3639j42737J71761j32553l2187J62713R0135n41068n63K2114
13932A468849O28678m26904k44190j13347J94202K48596q6841m32521M02189L47063
13922A985774m10945K04131l28013J51483k5832l7179l9354j07316r1900M1177
13912A342026p2219J85012j12426K0339n5823L5174J68058j57753Q1384j11355
13902A322417J90304k25766K90478j68104n1304j71303J05587O1694n3160p0968
13892A229875L56072n73386L60321J04794k83980J28526j28781K24242m08491
13883A009192o5066L12509m0217r9151K25380j49756j81516K70282j10906N194
$$ plain form
13953 2057232 2029321 2385087 1691616 1965897 1940613 2093102 1565468 1627278 1823280 1853791
13943 1853791 1944873 1871234 1728497 1900258 1767705 1735518 1898231 1988366 1447298 1446735 1468849
13932 1468849 2097527 1670623 1426433 1313086 1507288 1755884 1669043 1236522 1638711 1985774
13922 1985774 1574829 1778960 1450947 1602430 1576598 1539419 1500065 1392749 1300849 1342026
13912 1342026 1269807 1454819 1342393 1362732 1306909 1342083 1510141 1352388 1433772 1322417
13902 1322417 1512721 1286955 1577433 1409329 1358025 1186722 1292309 1354003 1300843 1229875
13892 1229875 1585947 1012561 1372882 1477676 1193696 1322222 1193441 1417683 1009192
13883 1009192 944126 1256635 1216418 1117267 1342647 1192891 1011375 1281657 1170751 1175945
13873A175945K44323j72148k29450P02557q45497J1054K73230l01107M77012m38669
13863H97250J55393Q8417R6933r0594N7525k37380Q216o8212Q3624j19243J08605
13852I80534p0925J49983k09229j08256M12246j00686j05941J29165j97451J88871
13842A068311J598l67847P0307L0361J96704n972k11667R3280j6733l13733M91802
13831A036411j14621Q1473l83470L40842J33116r3738j26547K46864l06121K8092
13821H42301J9372L5359K3170k6964k05466P7633j65150M89890j72544j7573k05025
13810F95003K4763J35647K87253n12536J99420J39593j36744O2975j60633J10439
13800H45180J36834k7966q7468k18281L2074m2861J21667M7000k97379R8858K18927
$$ plain form
13873 1175945 1420268 1248120 1018670 1721227 875730 886784 1160014 858907 1335919 897250
13863 897250 1052643 1141060 1237993 1147399 1204924 967544 975760 907548 991172 871929 980534
13852 980534 909609 1059592 850363 742107 1154353 1053667 947726 1076891 879440 1068311
13842 1068311 1069909 702062 772369 802730 999434 993462 781795 875075 858342 544609 1036411
13831 1036411 921790 1003263 619793 960635 1093751 1000013 873466 1120330 814209 842301
13821 842301 861673 897032 920202 893238 687772 765405 600255 1090145 917601 900028 695003
13810 695003 719766 855413 1142666 630130 829550 969143 832399 895374 734741 845180
13800 845180 982014 954048 866580 648299 680373 637512 759179 806179 508800 607658 826585
13789H26585K1429k933k6153C83163L85257p113m7415J50797j42643J48160m2590
13778H27616l79399K13622q8846Q1746n5382J07671J8373K52987l88996o5020
13768E24372M1582Q2289L13961D59156N33454k87502k86452L59393l18895J19311
13758E78465L3929l6831j36846L19007k06224Q5227J31316B57271M17694j58051
13748E16914Q2628K32119r7962Q9768j41397j8146k15191r245J09048j6916r0185
13737D41435M05455k24227J41048M817L1349n781B35647K76888Q2719q4814R3490
13726F03930p2694p8817P2813J56113k81621L68108l08519j46464M21280j64364
13716E69765l8494J37866m972k35907K35633K3820k82841n5216K86164m8371K49576
$$ plain form
13789 826585 848014 845081 818928 383163 768420 761307 713892 864689 722046 870206 827616
13778 827616 448217 661839 572993 654739 599357 707028 725401 978388 589392 524372
13768 524372 565954 648243 962204 459156 992610 705108 418656 778049 459154 578465
13758 578465 612394 575563 438717 757724 551500 636727 768043 257271 674965 516914
13748 516914 599542 831661 733699 823467 682070 663924 448733 439488 548536 531620 441435
13737 441435 846890 622663 763711 768528 799877 794096 235647 512535 595254 510440 603930
13726 603930 531236 452419 525232 681345 399724 767832 459313 312849 734129 569765
13716 569765 531271 669137 664165 428258 663891 687711 404870 349654 635818 587447 837023
13705H37023C60477J92628B48532G5858Q69037l52976k62003K59255k09499P768
13695C87440n6922L54060k33302J45973B49644K87665o5208J47379n2341j55138
13685D12001O1231Q0334N6506k89272J98387M2099B33313J40158J48716p3380
13675D48807J44234A64685L01488J2349A35741M668K76805J34674j40378r4190
13665C17320L14632j85519L61241D00070J26230B45226K84513j4308o6790o8456
13655C80185j78995M02017j97248m3577K16921k89144K68457J02794A83327L98284
13645E81611B79395L69141k92177R9217J03867k13041m469M3166j12958j18966
13635A53175K49869J8535I1655J14240K16093P7122h624D83152n7506K29393C22596
$$ plain form
13705 837023 360477 553105 248532 75858 944895 591919 329916 589171 379672 387440
13695 387440 330518 684578 451276 597249 249644 537309 472101 619480 567139 412001
13685 412001 473232 553566 610072 320800 519187 561286 233313 373471 522187 448807
13675 448807 593041 164685 466173 478522 135741 140409 417214 551888 411510 317320
13665 317320 631952 446433 807674 400070 526300 245226 529739 515431 448641 380185
13655 380185 201190 603207 405959 362382 579303 290159 558616 661410 183327 581611
13645 581611 279395 648536 356359 455576 559443 346402 341933 385099 272141 153175
13635 153175 403044 421579 91655 205895 421988 499110 -8624 483152 425646 655039 322596
13623E04054B22773L13303O1556k34808K39603B22620m7978C2107L23908A65087
13612B59314L17083q1013j65025J75719q5449J09603k53192K61987m1682A990
13601A72747L41432K60115C21983J73914A35678K26117A75841M82498k81801m2590
13591C33948K8715L1392K1251L0931A804L19516j50407M2246O1327N03K66319
13580E41308j50398A91752M04515j95868j30836N47796j69778j39184P2211k1749
13570E58859A88371K85493Q014Q3412r7840H0946k8173Q048J90158p886O0284
13559C03377J22561A70077L57522A59391J39428N6216J46684j46320K84803A45796
13548C2240M26310j24861r7852J40706p3637J31391m518A30736J64088o9394J49661
$$ plain form
13623 504054 222773 536076 597632 362824 602427 222620 174642 32107 356015 165087
13612 259314 576397 495384 330359 506078 420629 530232 277040 539027 497345 1990
13601 172747 514179 774294 321983 495897 135678 361795 175841 658339 376538 333948
13591 333948 362663 394055 415306 446237 1804 321320 170913 213159 274486 274989 541308
13580 541308 390910 191752 596267 400399 269563 817359 647581 508397 580608 558859
13570 558859 188371 473864 481878 565290 467450 80946 52773 60821 250979 243093 303377
13559 303377 425938 170077 527599 159391 298819 355035 501719 355399 640202 145796
13548 32240 458550 333689 235837 376543 302906 434297 429779 130736 294824 225430 375091
13537C75091D4918K40436J66393K04484A64929o4456K79798g5120b9515D27481
13526B18515n1812J34797o3268l6125C5952J80276M3780J27342d6173D02510j59331
13515B43179K42492o6984i9874M6948A49320J48181L62728j69945j89363I4190
13504C21828P6654f4332E13298G5970L57676j77656p0456O1046O3923j05469J19802
13493C24836H0903L1426n1550K64912j27391L1537J77837B00647H6552b0274B35122
13481C36252k9160j5053Q2813A02203J40884N4814b6658B23040B5309h6910C63079
13469A18633D5596K38654n0814M2233g2269A51340m5020M25813m5058B27364g4480
13457B33947J41649h778B12376H4637b2943A61583b4590A91998c550A55225a953
$$ plain form
13537 375091 44918 285354 451747 656231 164929 100473 380271 -75120 -29515 427481
13526 218515 166703 301500 238232 202107 35952 216228 260008 387350 -46173 402510 243179
13515 243179 485671 418687 -99874 -52926 149320 297501 660229 490284 300921 94190
13504 321828 398482 -64332 513298 75970 433646 255990 185534 246580 310503 205034 324836
13493 324836 80903 112329 60779 325691 198300 229837 407674 200647 86552 -20274 235122
13481 336252 307092 292039 374852 102203 243087 297901 -26658 223040 25309 -86910 363079
13469 118633 45596 284250 233436 275669 -72269 151340 106320 532133 487075 227364 -74480
13457 233947 375596 -8778 212376 84637 -22943 161583 -24590 191998 -3550 155225 -1953
13445D27993B05478b2370G5055J80205j7353p1004K22515c7631A53250B2009b80317
13433A90818J78140K8904A87119J81676B2723N20832j3749A99878J97730K180
13423C99788q7744J15135k4383G7908J26219I2997L28757j71253J50754A08873
13412C32720I5428K84980A75653m4738A4497a2134I9263l7410J59405b7877o4687
13401i2564A01308j6835C230J55716B773L2797L0113J822c1637C03391k8796f2766
13388G0378b11094A44291K01496m6670j40662p633Q4955n7650F2251K61564A42824
13376B01533D7149K71659A27588n5825J03132j2484K90042n32B03291K06500J11708
13365E21499A99489J16553a05055A17280N4474N8173r9449J95242b8151C88379
$$ plain form
13445 427993 205478 -22370 75055 255260 237907 166903 389418 -37631 153250 22009 -280317
13433 190818 368958 397862 187119 368795 22723 543555 529806 199878 397608 399788
13423 399788 312044 427179 402796 77908 204127 92997 421754 250501 401255 108873
13412 332720 95428 380408 175653 130915 14497 -12134 99263 61853 221258 -27877 -92564
13401 -92564 101308 84473 3230 158946 2773 35570 65683 67505 -31637 303391 274595 -62766
13388 70378 -211094 144291 345787 299117 158455 150822 235777 178127 62251 323815 142824
13376 201533 47149 318808 127588 71763 174895 162411 452453 451921 203291 409791 521499
13365 521499 199489 316042 -105055 117280 171754 229927 130478 325720 -28151 388379
13354A3583J02173J47131o1380L08655f8514C44399Q3575C3033M16891H4749N80167
13343F64916k2095I7706M1147M19432B00746K27872A27140K97664q0170A41668
13332a8692C14332j3210q7384k8428K18575j60065J61275A84251J83068F3442
13321G9447K64299m5131j34165F5596J25848P6891k9750H3599j3996L01588d6670
13309A17522a62526Q321B76066o6110G5805J41964g8652D1514L12172A53095l108
13298A49987D0610g9954I4619j8207B1772N5318K65608A12244N3996K53267g3954
13286A36686Q1861K3179J23865j03601A20811b10460A42806J16799f1694G3934
13275A23986J2539a9568G5533J98866F1548Q662b32356O0819C70387Q691J26442
$$ plain form
13354 13583 115756 262887 201507 510162 -68514 344399 427974 33033 449924 84749 664916
13343 664916 642821 97706 138853 558285 200746 428618 127140 424804 344634 141668
13332 -18692 314332 301122 213738 185310 403885 243820 405095 184251 367319 63442
13321 79447 343746 298615 164450 65596 191444 268335 238585 83599 69603 371191 -46670
13309 117522 -162526 -154205 276066 209956 75805 217769 -78652 41514 353686 153095 149987
13298 149987 40610 -79954 94619 76412 21772 77090 342698 112244 166240 419507 -73954
13286 136686 218547 241726 365591 261990 120811 -210460 142806 259605 -61694 73934
13275 123986 136525 -19568 75533 274399 61548 70210 -232356 -171537 370387 379078 505520
13264E05520j00491A64516c3958j93809F2307K84288J26707I9499R0201M7849
13254B37549c8618m6524k7453C2977a72437G2621J95099h6481A01894J59141A28076
13242A14743L27931r9564a80470A31609g8150l9033C04158A00406n254R5773R1173
13231B82098l4172C4901K11894I406c9738E9661Q700K52558j13860B8498Q9353
13220A17851C7214c9496B08984i6401C31510a8390A83241D9959f5163H4446M2995
13209A27441J28503a66101B36883I1415J63225M2681a14625b2525G1732c36832
13198F5989N3894j8108B356J11178l6165L60147A1133L80483I0446a8004B80639
13186B69096P649b08768h7543J0166a4589B97472b663B2333c00196E4814a50680
$$ plain form
13264 505520 405029 164516 -33958 -227767 62307 346595 473302 99499 189700 237549
13254 237549 -38618 -85142 -112595 32977 -172437 72621 267720 -86481 101894 261035 128076
13242 114743 442674 343110 -180470 131609 -78150 -117183 304158 100406 95152 190925 282098
13231 282098 247926 34901 246795 9406 -39738 59661 68361 320919 207059 28498 117851
13220 117851 37214 -39496 208984 -96401 331510 -18390 183241 49959 -65163 84446 127441
13209 127441 255944 -166101 236883 91415 254640 297321 -114625 -22525 71732 -336832
13198 65989 119883 101775 2356 113534 77369 437516 11133 391616 90446 -18004 280639
13186 269096 276745 -208768 -87543 -77377 -14589 297472 -2663 22333 -300196 54814 -150680
13174A09875d0041B39969k7289J6260c64009A5649J04404N959f6550m193A92843
13162d3941C97564E9256k0105i6937H1260J15225d6043A83230l4559J7313f2800
13150h903B28050a75177C07189A06906e4070A15322P5199b10931B38686J7192
13140B55878K45252A33383i751B40142a61263D10039b54012B17261Q3163a8176
13129B07200L2899E7168d6404B405P3065a11312c4223p5296D935a87993a7597
13117h3110A24966E3505a51103A94325g8155B4241g8045E26211I4159g0618D5150
13105B25292J22453j22560I9615J01336H1807L4425b5648B26240A4527c68001
13094B09521d8143E03303A13216a86866A39701L3953H5892A8751R1296H007K11985
$$ plain form
13174 109875 -40041 239969 212680 228940 -364009 15649 120053 126012 -66550 -70743 192843
13162 -43941 397564 59256 39151 -96937 81260 196485 -46043 183230 148671 165984 -62800
13150 -8903 228050 -175177 307189 106906 -54070 115322 190521 -210931 238686 255878
13140 255878 501130 133383 -9751 240142 -161263 410039 -254012 217261 300424 -18176
13129 207200 240099 57168 -46404 2405 75470 -111312 -34223 -109519 4935 -187993 -17597
13117 -83110 124966 53505 -151103 194325 -78155 24241 -78045 526211 94159 -70618 45150
13105 225292 347745 225185 99615 200951 81807 116232 -25648 226240 14527 -368001
13094 209521 -48143 503303 113216 -186866 139701 173654 85892 18751 110047 8007 219992
13083B19992n5415M436J35099G0897j766O1764L98934A77672c01792g2054A83765
13071A28221D1524l619j1492R79K90299A37964k8949J1331C3707K49676c5894
13059B26129F5055o474a28732C55401B0340J47977L2970J31144e4674m4619C57797
13047a73000A67311J74313H479J3648J70404a65465P8437k35215D45126A8275
13036A01117O666Q4514n7034J88995G0295a0179C83391f7437C58880j55221F3776
13024B98305r1707i943D34751f1675B27019B2983J6291L65188c5228A54084J7193
13013A71277E2711J19370M00927B11934J67411A73674n6160g9745A6495i7965
13002b27699e1007m5201A11601P051i0925I1172e937B08508h3259D1330b6172
$$ plain form
13083 219992 164577 169013 304112 70897 69131 130895 529829 177672 -301792 -72054 183765
13071 128221 41524 37905 26413 27392 317691 137964 109015 120346 33707 283383 -35894
13059 226129 65055 58581 -128732 355401 20340 168317 201287 332431 -54674 -99293 357797
13047 -173000 167311 341624 8479 22127 192531 -165465 -87028 -322243 445126 18275
13036 101117 107783 192297 135263 324258 70295 -10179 383391 -67437 358880 203659 63776
13024 298305 206598 -9943 434751 -61675 227019 22983 39274 404462 -35228 154084 171277
13013 171277 52711 172081 573008 211934 379345 173674 117514 -79745 16495 -97965
13002 -227699 -51007 -96208 111601 118652 -90925 91172 -5937 208508 -83259 41330 -26172
12990H9710J2966J78134H3953J62830a91794O5026e7176B61077H1480J05160p2046
12979A14594b73874a25774C55740j14749c2134e528G8621a897o4060k69105D643
12967b34453E1176j8594F008M81a65378B89198b68855g000C42554d8895B03664
12955B19551J17215A10028m8680R2255m8987B6467d4074p4334A6672K52754C8548
12943I6340g3365C04436D2859n748k429g066l2922A33445a82623h8252K0763D2476
12930H5846l8939a43562O4819n5865D7191a29645b9731i734k4286d775D48974
12918F3474c6535A78022b12037A72583i1828H1666a33775A31726n0061f1667m9130
12907a10797e2326k7540A90148q4106C4038f5683q4334A18333h7188o1502M469
$$ plain form
12990 89710 102676 280810 83953 246783 -191794 -126768 -57176 261077 81480 186640 114594
12979 114594 -273874 -125774 355740 240991 -32134 -5528 78621 -1897 -65957 -335062 4643
12967 -234453 51176 32582 6008 6489 -165378 289198 -268855 -7000 342554 -48895 203664
12955 219551 336766 110028 61348 153603 104616 26467 -44074 -118408 16672 269426 38548
12943 96340 -73365 304436 42859 37111 34682 -7066 -39988 133445 -182623 -88252 -67489 42476
12930 85846 46907 -143562 -78743 -134608 47191 -129645 -29731 -9734 -34020 -4775 448974
12918 63474 -36535 178022 -212037 172583 -91828 81666 -133775 131726 81665 -61667 -110797
12907 -110797 -52326 -79866 190148 106042 34038 -65683 -150017 118333 -87188 -148690 -144221
12896a44221A61466K44722C5706O8643k155C5628d3366A00869a82315n0357B0058
12884H6854L0067K5439a60876J0371A72516o2884M402C1189g2834k1149B23124
12872A116J3882a40516a8772j0292R768A36659K08720b3609j74440B70927D0387
12860E706J15579b88789H5261J08999m0970c94020Q1357L1242L5848A21173C8910
12848a20752G5546a22476A29024b26305B77422b84795E0228R6624J39840a16182
12837c4215m3994a3675q7861L2382C9167J79211a8431G9092b22491A39285d31964
12825a72548A90283K57954a18094D9589a2288E5783b80569C5703I513a01246j83736
12814b84982a04626p8055A29712a26104j24786g3295A65603a95038A64031q1600
$$ plain form
12896 -144221 161466 406188 35706 104349 102194 35628 -43366 100869 -182315 -232672 20058
12884 86854 116921 142360 -160876 -150505 172516 109632 114034 31189 -72834 -93983 223124
12872 1116 14998 -140516 -18772 -29064 -19296 136659 345379 -23609 -198049 270927 40387
12860 5706 121285 -288789 85261 194260 153290 -394020 -312663 -281421 -245573 121173 38910
12848 -120752 75546 -122476 129024 -226305 277422 -284795 50228 146852 286692 -116182
12837 -34215 -78209 -13675 -101536 -69154 39167 218378 -18431 79092 -222491 139285 -431964
12825 -172548 190283 448237 -118094 49589 -12288 55783 -280569 35703 9513 -101246 -284982
12814 -284982 -104626 -182681 129712 -126104 -250890 -73295 165603 -195038 164031 82431
12804H2431A5941J84383I5567b3444A25718a11725L976B64501A104h29j07817
12793a08646M4971b0018H6116a54341A18395n8023a07272A81048a47388k16630
12783c64018A66971o2776K58183A8388N3961a8821A98766a4374A86258j929f6522
12771A56682K45023A37400o5495O1537b3908l0525D4947b50069B34084G7515b10756
12759B82328G0106J5534k9329J22272D0185A7808K13714o6831n4814b27470i8815
12747A78598q0372b30056A12867J9102k4083n2652f5845I3207K9166a92519n25
12736a93044B78149g0510D5933a08935F3626a21539B18498H3497C3883J81371
12726B15254h3991q2173A08858k5631e5302A17517b2660j0828A69143c26188A02016
$$ plain form
12804 82431 15941 200324 95567 -23444 125718 -111725 -107749 264501 1104 -829 -108646
12793 -108646 -63675 -20018 86116 -154341 118395 60372 -107272 181048 -147388 -364018
12783 -364018 166971 104195 362378 18388 72349 -18821 198766 -14374 186258 184329 -66522
12771 156682 401705 137400 71905 133442 -23908 -54433 44947 -250069 234084 77515 -210756
12759 282328 70106 85640 56311 178583 40185 17808 231522 164691 109877 -227470 -98815
12747 178598 98226 -230056 112867 131969 107886 55234 -65845 93207 122373 -192519 -193044
12736 -193044 278149 -70510 45933 -108935 63626 -121539 218498 83497 33883 215254
12726 215254 -83991 -166164 108858 83227 -55302 117517 -22660 -33488 169143 -326188 102016
12714d6571j49038i0401c6799B03722n3221i4469B73109J30443C3005Q8716M2884
12703A64605l4746J64231r3899K0275l1553C0449h8985K3712j28391O2508j22882
12692b54038H942R8745f9941R773K777B03021j00807a4422o0829A18336c40603
12680a8607B1659a39542C59511C8135f096G2023Q2083C1166K12926B1502h1028
12668B92321j17939a3034A5780J25399M1603e4099B08847K7135A13212m2411f8334
12656I6889J60361a6343n22G04215h5071j10410J2596B30024j06907K29741E2475
12644a05517A49280m5817d2621A55237A0069Q6950J77001a81124m2153i0024C59633
12632G6618P2426J08622b8193C77398F589K26398e3295a5397E1448K957J18591
$$ plain form
12714 -46571 -195609 -90401 -36799 203722 150501 -94469 273109 403552 33005 121721 164605
12703 164605 129859 294090 200191 220466 188913 30449 -88985 -65273 -193664 -131156 -254038
12692 -254038 8942 107687 -69941 -60168 -57391 203021 102214 -14422 -75251 118336 -340603
12680 -18607 21659 -139542 359511 38135 -6096 72023 154106 31166 244092 21502 -81028
12668 292321 174382 -13034 15780 141179 182782 -54099 208847 235982 113212 70801 -68334
12656 96889 257250 -16343 -16865 704215 -85071 -195481 -182885 230024 123117 352858 52475
12644 -105517 149280 103463 -42621 155237 10069 97019 274020 -181124 -223277 -90024 359633
12632 76618 149044 257666 -28193 377398 6589 232987 -53295 -15397 51448 54405 172996
12621A72996M8168c9760m5463n5597B55659d2420B19891r2784m378J46600A20173
12609a99019B58673A27897L7854B0015g2007K7688B59094f3839k02319A9933c79453
12597A10880m5794M5452J32687D3513c7667A92099g7649A52367b81127C7525K54181
12586B91706A32385R520o9265d9816n1915A32415a98596c6929J994B78056I0952
12574a80076h8903A8682a82696A47146l100J88030c4631A85640a38129C2086J00737
12563A32823J41514D0835P4661j6109b37897a11285A91334f9030A31208K02959
12553C34167I3382e7328k4582A37533J8480b6248A50817h1731K0268C2552P24
12542C3276a84135D0876a15530j47648k3065A34726a99163b9672c747l62429d2797
$$ plain form
12621 172996 221164 -39760 -85223 -140820 255659 -42420 219891 127107 122729 269329 120173
12609 -199019 258673 127897 165751 20015 -72007 -44319 259094 -63839 -266158 19933 -379453
12597 110880 65086 110538 243225 43513 -37667 192099 -77649 152367 -281127 37525 291706
12586 291706 132385 141905 72640 -49816 -101731 132415 -198596 -36929 -34935 278056 90952
12574 -180076 -88903 18682 -182696 147146 144046 332076 -34631 185640 -138129 32086 132823
12563 132823 274337 40835 115496 99387 -237897 -111285 191334 -69030 131208 334167
12553 334167 93382 -57328 -81910 137533 156013 -26248 150817 -81731 -61463 32552 33276
12542 33276 -184135 40876 -115530 -263178 -286243 134726 -199163 -29672 -3747 -366176 -42797
12530A18645C5261L90686A11047n3461N130d3259B14589j1899l4494B531L93012
12519C95543H1239i4466A29807A789a61710o583A12863d3789A26400e783m1034
12508d6817j13613n5956B82564Q9258A49571a25545A149R441a16865k33291B15923
12496b27626K6275G2875O6298R27m0824C4719J45177m6652a55083E2451c21464
12484H623Q6725a58265J9145b6565j28465N7551A32834a70885j69816I5751m5662
12473E0089a02661A2695Q610K788d0459A95669c06332E14460B09043a88328O809
12462a81519A26899d5588H9707c99433A99928J89029b8878A1167a51461C22731
12451B31327l8196e9010A11947J92271a88309P3414K0176A45329j3969i2632i244
$$ plain form
12530 118645 35261 425947 111047 57586 62716 -43259 214589 202690 168196 2531 395543
12519 395543 81239 -94466 129807 1789 -161710 -168293 112863 -43789 126400 -5783 -46817
12508 -46817 -160430 -216386 282564 371822 149571 -125545 1149 10590 -116865 -350156 215923
12496 -227626 -201351 72875 139173 140100 99276 34719 179896 133244 -155083 52451 -321464
12484 8623 95348 -158265 -139120 -26565 -155030 -97479 132834 -170885 -340701 95751 50089
12473 50089 -102661 12695 21305 24093 -40459 195669 -306332 514460 209043 -188328 -181519
12462 -181519 126899 -45588 89707 -399433 199928 388957 -28878 11167 -151461 322731
12451 231327 193131 -59010 111947 304218 -188309 -114895 -94719 145329 131360 -92632 -9244
12439C41842a35884A13012J5208J30896c6895n1281j68661g7937A65445m5428
12429A20017g6802C70805A40804E8587b60309h1261j35575f3480p751B32827d708
12417F2198g5971q4346j12454P6646A03797c04900m8665a18512A74472p5424J44381
12406B43429d1839j51993E1373c7722k02516B14650M9966q0303R4156a7688B27743
12394F968a1414l43277m8271A59945C7727J24331n9236i0189l0722B46921C4548
12382a46739A23582M958a37666r969F8445a12756M8625F4221g2215J1771r5723
12371a56167A28996o4281J48832b65431a0629B52718k2553g2318K4927I3121B0062
12359C6741K5861b30269A73567d72147F5458a63737N1687I6844e7718B2588a35471
$$ plain form
12439 341842 -135884 113012 128220 259116 -36895 -88176 -256837 -77937 165445 120017
12429 120017 -76802 370805 140804 58587 -260309 -81261 -216836 -63480 -71231 232827 -4708
12417 62198 -75971 -160317 -272771 -196125 103797 -304900 -353565 -118512 174472 99048 243429
12406 243429 -41839 -193832 51373 -37722 -240238 214650 264616 184313 278469 -17688 227743
12394 6968 -11414 -354691 -402962 159945 37727 162058 102822 -90189 -120911 246921 34548
12382 -146739 123582 128540 -137666 -147635 68445 -112756 -64131 64221 -72215 -60444 -156167
12371 -156167 128996 64715 213547 -265431 -10629 252718 230165 -72318 -47391 93121 20062
12359 36741 62602 -230269 173567 -472147 65458 -163737 -112050 96844 -57718 22588 -135471
12347A24456k5456f0834I0242C0864J47846D1670g3569B93970h53m7044H0046
12335a36585A36943b3741j70939N7911B53995k5178i0036j68699O456Q7495F294
12323D6131M7404K06168f2722l7380B79021H1532A5299g9264R032r1141A64033
12311B97739h1817j00022A89261o8028A9334a26677M5456I9860R3624a36261d1645
12299A07270c3093j33608F1958K1190a48001B27587c98238a30038o2221L6690
12289a55569D4421D886J18031K70275H8174b19518B26209C7965f1984B04084m525
12278A99559F3384c9510C15539b15546A18683J58923p0985d1194p9532L7798k6033
12267a08961B31314a44704B65905e15j44124H7301H616L2260a8884o5899D67501
$$ plain form
12347 124456 99000 -60834 90242 30864 178710 41670 -73569 293970 -853 -47897 80046
12335 -136585 136943 -23741 -194680 -136769 253995 228817 -90036 -258735 -252279 -164784 6294
12323 46131 93535 299703 -62722 -100102 279021 81532 15299 -79264 -70232 -161373 164033
12311 297739 -81817 -181839 189261 121233 19334 -126677 -81221 99860 193484 -136261 -41645
12299 107270 -33093 -166701 61958 83148 -148001 227587 -398238 -130038 -192259 -155569
12289 -155569 44421 4886 122917 393192 88174 -219518 226209 37965 -61984 204084 199559
12278 199559 63384 -39510 315539 -215546 118683 277606 206621 -41194 -120726 -82928 -108961
12267 -108961 231314 -144704 265905 -515 -144639 87301 8616 40876 -18884 -84783 467501
12255D048J44428C9587f8869B74391q2931m880p8476b53462A3930K68837j10005
12244A72762C8686a1734A07347i6825H2239R3592A1140J66256P520h5167B2925
12232e9660A22132B5682a00413G1912J39815o6991J20581j05803Q2912R4038K9536
12221C66000Q525k362A76034J12417P519J4437J19230K779n8730J5905D1003M7347
12209H8350A141a15028D765g6213B97504f1203B80277a15828D37673B01417n1438
12198A49979o9405l0055K69897p4626p0723N2232K3646b5606C6802K93921J51281
12187D82004a77397H7203J19208r3213N766A9111g5778B65533K0745j39329P2102
12176B19051C4333J91783A3734c1385B61564A09233e5388C41931E7832N4290E1529
$$ plain form
12255 4048 148476 39587 -68869 274391 191460 186580 108104 -253462 13930 282767 172762
12244 172762 38686 -11734 107347 -96825 82239 175831 11140 177396 184916 -85167 22925
12232 -59660 122132 25682 -100413 71912 211727 144736 265317 159514 242426 336464 366000
12221 366000 374525 372163 176034 288451 295970 310407 429637 432416 373686 389591 41003 88350
12209 88350 1141 -115028 4765 -76213 297504 -61203 280277 -115828 437673 201417 149979
12198 149979 80574 50519 320416 245790 175067 227299 250945 -25606 36802 330723 482004
12187 482004 -177397 87203 206411 113198 118964 19111 -75778 265533 286278 146949 219051
12176 219051 34333 226116 13734 -31385 261564 109233 -55388 341931 57832 112122 51529
12164A01765a62872B28676j8224C2527L8295K76798j54039c8266A49920e1741
12153g6191b7345q5230C32402B4276J91090b52815B48329A14676J11330J00022
12143C26028g3710c2944B39514j867j16531a27197j28821b2375o5943a8389F3057
12131A21J29768a36281B46172b32395F7186K25412a20903C72770b97722I1517
12120f1744j0622I4466O7607m8451P2478d8261G4624J78049b59550A64103a33183
12108A03524R2269E2931a54702r3705R2743e1048F5725C0353a84966C949Q7579
12097I1528h607m8416c193I1006a23961B6524R8858f6925D2414a36588A66823
12085g7607D0981L9973K36311i9471M2941A6432d311n8645A43997a65241O9729
$$ plain form
12164 101765 -162872 228676 210452 32527 70822 347620 193581 -38266 149920 -51741
12153 -76191 -27345 -112575 332402 24276 215366 -252815 248329 114676 226006 326028
12143 326028 -73710 -32944 239514 237647 121116 -127197 -256018 -22375 -88318 -18389 63057
12131 121 129889 -136281 246172 -232395 67186 292598 -120903 372770 -297722 91517
12120 -61744 -72366 94466 162073 113622 186100 -48261 74624 252673 -259550 164103 -133183
12108 103524 195793 52931 -154702 -248407 -155664 -51048 65725 30353 -184966 3949 91528
12097 91528 -8607 -57023 -3193 91006 -123961 26524 125382 -66925 42414 -136588 166823
12085 -77607 40981 80954 317265 -99471 -56530 16432 -4311 -62956 143997 -165241 -95512
12074i5512A77333b28167A0007f7939j80975F1553L1059J34933P19809J51943
12064A099297n37718D3596a49085B11087E8253b46507A29568K0947o3643A8932
12053E1288a99148B07487C2551e5216p0266A23053c16866C05514c35511J39510
12043a96001A81403J23206l6724I5124a76362e5285l49527A98196b4462o17B24557
12031A47070a24549J523B19640b04155G7759a59408m4281A211a57042H7960c85464
12019b08024B71703b23948i8471l6402E6272b22369j23654A48826G3562J10629
12009A84191C1681a58290N9695B01420D7139b01609b0225n4458J226L5527J1670
11998b6260B35306a05859B72877a99668k711B55049e4758B28435J55950i0844
$$ plain form
12074 -95512 177333 -228167 10007 -67939 -248914 61553 92612 227545 947354 1099297
12064 1099297 561579 43596 -149085 211087 58253 -246507 129568 150515 86872 18932
12053 51288 -199148 207487 32551 -55216 -125482 123053 -316866 305514 -335511 -196001
12043 -196001 181403 304609 267885 95124 -176362 -55285 -404812 198196 -24462 -25079 224557
12031 147070 -124549 -123026 219640 -204155 77759 -159408 -203689 1211 -157042 87960 -385464
12019 -208024 271703 -223948 -98471 -134873 56272 -222369 -346023 148826 73562 184191
12009 184191 31681 -158290 -98595 201420 47139 -201609 -20225 -74683 -73457 -37930 -26260
11998 -26260 235306 -105859 272877 -199668 -202379 255049 -54758 228435 384385 -90844
11987b6013A13084l2573J5771a45674A24927J82038E3518k6441P5511Q5429M3451
11976B31468C0521N7485A8274a05962A92589a67476l1624i3961D3031c60766a565
11964a62589A13276l8733j5469R6235l0314B269h5444A64118p9697K14988A11850
11952D9654J80077i3765C05911a96276O6994a8581j21925C44116I1577e9933A28916
11940c02122B08654a25605D03338a7768e047l1018k97011J35541d698r9811B1346
11928b33656A57139m2007R7780R2664a85169h5364k27504d7409e035F0784a89176
11916b2397l42317A07050n3444Q3855a74936Q7236r4879B45403A20516a201A70542
11904a35358A58227E8926K26740b3704B08794E5414b47050N9487B02259h5581
$$ plain form
11987 -26013 113084 80511 96282 -145674 124927 306965 53518 27077 102588 188017 231468
11976 231468 30521 88006 18274 -105962 192589 -167476 -199100 -93961 43031 -360766 -1565
11964 -162589 113276 74543 59074 155309 124995 2269 -85444 164118 84421 299409 111850
11952 49654 229731 -93765 305911 -196276 -129282 -18581 -140506 344116 91577 -59933 128916
11940 -302122 208654 -125605 403338 -17768 -5047 -36065 -333076 -197535 -4698 -104509 21346
11928 -233656 157139 115132 212912 305576 -185169 -85364 -312868 -47409 -5035 60784 -189176
11916 -22397 -364714 107050 53606 137461 -174936 -87700 -182579 245403 120516 -1201 170542
11904 -135358 158227 58926 285666 -23704 208794 55414 -247050 -187563 202259 -85581
11893b2399m630B56572A6136b32622k8475M914a05077l0887I0229A5076J7378
11882C2454J25180G5251c38444a30782N2077B8731b63433h7362l9448c2932r6065
11871a28997j8065k36380f7009k44065A52582d77527b03697B48449c56400B19814
11860a99164O2229A39883b2173A97795a8126h973l3273A06237a81310j23138H2608
11848b9017j36221G5990d9913F4614b79412A39690K0482e3253A11301J7610j5001
11837A13910a90031A0423a2928k5815j70375L6838A5958f0802C82661e6060j97102
11826b53162j06316A5254g2621K8315j89402h8165A79144a56751f7352A5343a31215
11814a68632E0659e5003C56986a73747r9868e3492l71679A49345F0576K42324
$$ plain form
11893 -22399 -27029 256572 16136 -232622 -261097 -256183 -105077 -135964 90229 15076 32454
11882 32454 157634 75251 -338444 -130782 -78705 28731 -263433 -87362 -126810 -32932 -128997
11871 -128997 -147062 -383442 -67009 -311074 152582 -477527 -203697 248449 -356400 219814
11860 -199164 -136935 139883 -22173 197795 -18126 -8973 -42246 106237 -181310 -304448 82608
11848 -29017 -165238 75990 -49913 64614 -279412 139690 160172 -53253 111301 128911 113910
11837 113910 -190031 10423 -12928 -38743 -209118 -172280 15958 -60802 382661 -56060 -253162
11826 -253162 -359478 15254 -72621 -44306 -233708 -88165 179144 -156751 -67352 15343 -131215
11814 -168632 50659 -55003 356986 -173747 -273615 -53492 -425171 149345 60576 302900
11804C02900j04003G9377b27532A5671b1624A29605f5642B16437f5418J318k67681
11793c31781D15577A35180p386a0845b519D5035b06709B00692a76813o061Q4301
11782i8573A60462N8900D8123b23231J03224a3461k17104D7438g6780E900b32379
11770a91832a9154j33354H3773M9501n3163B477f9352N195n0651E3777b32069
11758C02307j38221a19788M0903a6980E4933a5903l14813E8339b67100f2065j69462
11747b31527a06266j24090n5561a17629b3774B53229k3371B9502h9196j4907H4196
11735A11353c12979O4168I8983L41347H8591M8101J11259o4660b28110A41699
11724c49750d0841C04500a63821B28553d4412k6847B58116j02040o5550a094A65974
$$ plain form
11804 302900 198897 79377 -227532 15671 -21624 129605 -65642 216437 -65418 -64100 -331781
11793 -331781 415577 135180 127794 -10845 -2519 45035 -206709 200692 -176813 -182874 -98573
11782 -98573 160462 219362 48123 -223231 -120007 -13461 -230565 47438 -76780 5900 -232379
11770 -191832 -19154 -152508 83773 133274 80111 2477 -69352 -64157 -114808 53777 -232069
11758 302307 164086 -119788 -78885 -16980 54933 -15903 -330716 58339 -267100 -62065 -231527
11747 -231527 -106266 -230356 -285917 -117629 -23774 253229 229858 29502 -89196 -104103 84196
11735 111353 -312979 -248811 98983 440330 88591 136692 247951 183291 -228110 141699
11724 -349750 -40841 304500 -163821 228553 -44412 -71259 258116 156076 90526 -1094 165974
11712A6852K23862F1648R5909d5522A87704J74159b16756a7456E2190h6757j32179
11701b18936B34602a66000B38662p2464a42703C6215b38564B42354o0326D6961
11690A73329g3622n3322A2498J26705F4981b47318G4836K6600C6512b05759J01063
11679a04696A24654J97983q3936H6180O6200J18387m0971a9812j98345B50147
11668D09881B0460f3915I3401a7347q4800F5295J11094b41218g9947G3194O6114
11657A39308a57211I8841N22740A42835a935k60693F3534N6397b29332A54379
11646d547B0243P1763k7997a41476p8830B322a02746Gd95142D850a90567E9486
11633f4316H40a8395j47065C1015a77059c8975C62268A59672a78766L3594B977
$$ plain form
11712 16852 240714 61648 157557 -45522 187704 361863 -216756 -17456 52190 -86757 -218936
11701 -218936 234602 -166000 238662 166198 -142703 36215 -238564 242354 182028 46961
11690 173329 -73622 -126944 12498 139203 64981 -247318 74836 101436 36512 -205759 -104696
11679 -104696 124654 322637 238701 86180 152380 270767 229796 -19812 -218157 250147
11668 409881 20460 -63915 93401 -17347 -102147 65295 176389 -241218 -79947 73194 139308
11657 139308 -157211 98841 621581 142835 -1935 -262628 63534 119931 -229332 154379
11646 -4547 20243 92006 64009 -141476 -220306 2322 -102746 7 -495142 4850 -190567 59486
11633 -64316 840 -18395 -165460 31015 -177059 -38975 362268 159672 -178766 -145172 2977
11621A74796R59C3857J5297N869N1919f4265J1330F0454O6541E7409J07425m7379
11609A17455i2560A61456a62772B53592a37013a4405H528R4567h3220c1443A40814
11597B11923a56829A09411b1992A85655c60129C5798O0821a7916B47663F7054
11586A56431a47508I8652J2084r299m7923a3050B47621D685d6607A42977c3820
11574C56928a735G0115J65048J92416f612G4913A2988Q5262b15715C17298k8088
11563B89210E0841B5369K04244J96842j46988j22574J27670n0293b8178A07109
11552a42720K2850N74A27047c37246D86304H3640a12675D4976j4214c0282j2652
11541d2934E2096K2521c01924g6433A27625k9504f6149b3199C6362L71178g5845
$$ plain form
11621 174796 175755 33857 49154 55023 106942 -64265 -52935 60454 126995 57409 164834 117455
11609 117455 -92560 161456 -162772 253592 -137013 -14405 8528 103095 -83220 -31443 140814
11597 211923 -156829 109411 -21992 185655 -360129 35798 96619 -17916 247663 67054
11586 156431 -147508 98652 110736 101437 53514 -13050 247621 4685 -46607 142977 -33820
11574 356928 -1735 70115 235163 427579 -6612 74913 12988 98250 -215715 317298 289210
11563 289210 50841 25369 229613 426455 279467 156893 284563 234270 -28178 107109
11552 -142720 -119870 -119296 127047 -337246 486304 83640 -112675 44976 30762 -30282 -42934
11541 -42934 52096 74617 -301924 -76433 127625 98121 -66149 -23199 36362 407540 -75845
11529F3929a30548B13241m0556E9942l744g7256q0534j64050B36253q0373c3466
11517A38587a2860F4588M0748J5711m0497b63531H8281b5376C58754A43383o3284
11506H0099C6765K66300c7099D1923J30558p1277e0934j65235O8858m3865A34954
11494B87555K3311c06363C22361G8065f3419H8128K78050I2796J42011p4102f0832
11482B36139b4012G3816i2263D610J78615K31698L9034A55865J0517L38981I2231
11470B23696J21101H0450a23887K3290A57221o015j7809o1363P1748P1010b31644
11458E3210M09255D0184L89736j94636r4200L8791b38044D52294b04030B22164
11447b18305A86474J94785c2034A8454L2321K094J22393q3173A4493O6522J62382
$$ plain form
11529 63929 -130548 213241 172685 59942 56198 -77256 -157790 -321840 236253 155880 -33466
11517 138587 -12860 64588 105336 121047 80550 -263531 88281 -25376 358754 143383 80099
11506 80099 36765 303065 -37099 41923 172481 101204 -50934 -216169 -147311 -191176 134954
11494 287555 310866 -306363 322361 78065 -63419 88128 366178 92796 234807 160705 -60832
11482 236139 -24012 73816 -92263 4610 183225 414923 453957 155865 166382 505363 92231
11470 223696 344797 80450 -123887 -100597 157221 151206 133397 72034 143782 214792 -231644
11458 53210 462465 40184 429920 235284 141084 179875 -238044 452294 -204030 222164
11447 -218305 186474 381259 -32034 18454 50775 52869 175262 92089 14493 81015 243397
11436B43397a29713C2857K8153J8475J47536j12960b00875m8384A7974P514q893
11425A6595b6038F3331J17031a14244D04193b20357P4410F9176a47035H4504d0453
11413f3572K5886A28826J98035f344j53984A48382a96523J1552h4392A89104a00644
11401A38803o0384C4198K1349N930R628E8b58800a3701C7108K29362N2558g0199
11388B57964f4052J3884A96462a71234f7842b6764q7473C7129a93626C68219C6122
11376G8710g6739j0336I6345L7536b6382k9617o1771D6878h1477A198J3885g8776
11363H0300a88310P5599F491j445c9347E9749a22988B20659a55760B16367d49854
11351F2628g8803B22731i4358L2713A30563a39488B43742b9391o2040L2554A26363
$$ plain form
11436 243397 -129713 32857 61010 79485 227021 114061 -200875 -249259 17974 25488 16595
11425 16595 -26038 63331 180362 -114244 404193 -220357 -145947 69176 -147035 84504 -40453
11413 -63572 -37686 128826 326861 -6344 -160328 148382 -196523 -184971 -84392 189104 -100644
11401 138803 78419 34198 55547 61477 71105 58 -258800 -13701 37108 266470 319028 -70199
11388 257964 -64052 -50168 196462 -171234 -67842 -26764 -114237 37129 -193626 368219 36122
11376 78710 -76739 -87075 96345 133881 -26382 -55999 -117770 46878 -81477 1198 15083 -78776
11363 80300 -188310 -112711 6491 5046 -39347 59749 -122988 220659 -155760 216367 -449854
11351 62628 -78803 222731 -94358 -61645 130563 -139488 243742 -29391 -91431 -58877 126363
11339c72990F404f23525I7723b04404c1922A54090a35140N6158C1385K13163o4775
11328A79773A9784a57359j7908e2858q5755G0644b45694Q9542F1613M6169I732
11316B60476h3738j3010b4022m4786A36811b09095B1951e45415e8770A15441J6845
11305A32286n5078j9904K29722D7756J51147q8005b81915F5776a19077H2049i005
11293a24192r2895A58564a5346k26878P3493h524j50443A19833g2116A30107E7535
11281D557K2126f23111F6754d87753J40994P3255A3613b60473g8180B8630M1618
11270G0248a43033l8613h4274b4799G683a0739B977a14801k8577e0336B05365
11258G6759L8180K2242B8709n983J31348i2591a0152A2850J07040a92524A77674
$$ plain form
11339 -372990 6404 -623525 97723 -204404 -31922 154090 -135140 -78982 31385 244548 179773
11328 179773 19784 -157359 -175267 -52858 -138613 70644 -245694 -156152 61613 107782 9732
11316 260476 -83738 -96748 -24022 -68808 136811 -209095 21951 -545415 -58770 115441 132286
11305 132286 77208 57304 287026 47756 198903 110898 -281915 65776 -119077 82049 -9005
11293 -124192 -217087 158564 -15346 -242224 -168731 -8524 -158967 119833 -72116 130107 57535
11281 4557 26683 -623111 66754 -487753 -346759 -273504 13613 -260473 -78180 28630 70248
11270 70248 -143033 -181646 -84274 -24799 7683 -10739 2977 -114801 -143378 -50336 205365
11258 76759 114939 137181 28709 22726 154074 -92591 -10152 12850 119890 -192524 177674
11246a09087K4282OB23664I5381a63824c6760A49590K1659g842F1791g6593B07251
11233f8627i353j22029j6709k3438k8464d3607E9318b69017F6662e455A36456
11221F4681B0567L27109E2345N1272c76476F2125K5271a21402d6299j11135A19893
11209B82266b62761P5789b7829E0433A2890K07356G5149c53369A65166b05484
11198g0928A26086E8749k8978b01150b5227C31563d63256A7770h2428B2797c10296
11186B82987H1702O7674b94268B99624b3618I8343f4363l31844O9409Q3765A46018
11174a0863o4583A23772J08820c6523A32757a50227i913l9083k43556I290a03715
11162a68132A42965b94820A8926a34402L5145D3230C2a20969j9342d7524k32645
$$ plain form
11246 -109087 -84805 -84799 223664 95381 -163824 -36760 149590 171249 -7842 61791 -76593 207251
11233 -68627 -9353 -131382 -148091 -171529 -199993 -43607 59318 -269017 66662 -5455 136456
11221 64681 20567 347676 52345 103617 -376476 62125 87396 -121402 -46299 -157434 119893
11209 282266 -262761 -186972 -27829 50433 12890 220246 75149 -353369 165166 -205484
11198 -70928 126086 58749 29771 -201150 -25227 331563 -463256 17770 -82428 22797 -310296
11186 282987 81702 149376 -294268 299624 -23618 98343 -64363 -396207 -326798 -243033 146018
11174 -10863 -75446 123772 232592 -36523 132757 -150227 -9913 -48996 -292552 9290 -103715
11162 -168132 142965 -294820 18926 -134402 -99257 43230 32 -120969 -140311 -47524 -280169
11151b80169l40797b348B5715a45458E9623a48306F4298A3604a7555r7409e0096
11139A18604b62748G9088a33117H5561Q960a97577F655J73834l5629B5435g0948
11127A67914D7625g2190n863G528b0686B25470a25408F0204E178P7049a76096
11115a54355f8212I7494J61433R1181A67063c23922J22310B99756P3316a752j3275
11104a5027I9688K43444j53345q0647h7622B61551J7135p4211O1952p0J9189h2148
11091B51391d137I3056L987K47183O0085j19595h121j2888C41499H9730A3020
11079B47730J86477F9450R245Q2495o1114J53063K80073q9156n1892r6304l6110
11068B59750l4857n9550M51401j64761c085F48590l21844J15068O5419N8042j31864
$$ plain form
11151 -280169 -620966 -2348 25715 -145458 59623 -148306 64298 13604 -17555 -114964 -50096
11139 118604 -262748 79088 -133117 85561 94521 -197577 6655 180489 144860 25435 -70948
11127 167914 47625 -72190 -78053 7528 -20686 225470 -125408 60204 5178 82227 -176096
11115 -154355 -68212 97494 258927 350108 167063 -323922 -201612 299756 373072 -1752 -15027
11104 -15027 99688 343132 189787 109140 -87622 261551 278686 204475 266427 266357 285546 -82148
11091 251391 -4137 93056 97043 344226 404311 284716 -8121 -21009 341499 89730 13020
11079 247730 434207 69450 78695 161190 100076 253139 533212 444056 392164 295860 259750
11068 259750 224893 165343 616744 451983 -3085 648590 326746 441814 507233 565275 433411
11057D33411K63005n2299j28330p232J81728Q8534o573j46126j05323o5071J98159
11046F53883N7447n687m7943k8480J83599K3047k80319k0849O3239j86735J90412
11035F01614B69538L35884j31577K39130r9911j24809J5894L57618D03190Q3819
11025D87009K78427R7281j64954O8840k10305A38806N06928k84344N4914o0146
11015C56158J0102J63871k14462K1641L6961K11185R4585q7633k02279J49377
11005E39506m8963N3987K96426l73309J66465J61356k19187L38819m32701K20016
10995G02415J05797l48930K60704k61213O19556k79011j04101K39689J55788k96060
10985G94634L08851k43069L84279j57264j22330K78480j10229J82746J23919J1185
$$ plain form
11057 433411 696416 644117 515787 508555 690283 778817 772244 626118 520795 455724 653883
11046 653883 711330 705643 657700 629220 812819 835866 555547 534698 597937 411202 601614
11035 601614 269538 605422 473845 712975 613064 488255 504149 861767 403190 487009
11025 487009 765436 862717 697763 766603 556298 138806 645734 361390 416304 356158
11015 356158 366260 530131 315669 337310 374271 585456 680041 592408 390129 539506
11005 539506 490543 544530 840956 467647 634112 795468 576281 915100 482399 702415
10995 702415 808212 459282 719986 458773 1078329 799318 695217 934906 1090694 794634
10985 794634 1103485 860416 1244695 1087431 965101 1243581 1133352 1316098 1440017 1451202
10975A451202O25179J40336J84004o1564K00382L35802k46181l25877k09911j46195
10965A947177P2246m27334J65085l58939R5989K00419J33873l76407N57970m56648
10955A553431k7016J11170l55688j05726l45211J93085l13316L09826m39997J65054
10945G45612j84420k53168L71497B14992J1593l6713K0498J02852f3015K5483
10935c7532C47583I3749e0577A18066a14421B20388r8023J50486k7739p8048k8677
10924A38387E6388P2957M4710o3586h8832B10156D0843J28147L7358b2347G00542
10912a7563D7906J67582a76221C25997B9593h6427A56916c1272j86774d9652B30907
10900H9235g0775A89551a26694p2315f1125F4378h385k9301m8747k7409K5734
$$ plain form
10975 1451202 2076381 2216717 2400721 2339157 2539539 2875341 2629160 2303283 2093372 1947177
10965 1947177 2019423 1592089 1757174 1398235 1494224 1694643 1828516 1452109 2010079 1553431
10955 1553431 1526415 1637585 1281897 1176171 830960 1024045 710729 1020555 580558 745612
10945 745612 561192 308024 679521 214992 226585 189872 210370 313222 -63015 -37532
10935 -37532 347583 93749 -50577 118066 -114421 220388 122365 272851 245112 167064 138387
10924 138387 56388 129345 174055 110469 -88832 210156 40843 168990 206348 -22347 700542
10912 -17563 47906 215488 -176221 325997 29593 -86427 156916 -31272 -218046 -49652 230907
10900 89235 -70775 189551 -126694 -199009 -61125 64378 -8385 -37686 -86433 -113842 -88108
10889h8108L5308A14658J49235Q9594E7360K3166k9286b95404B67113f7538j26503
10878a94041A16675k9286l8743a03117A86504a73799c2535C36918b19932j19123
10868c39055g9353A51045F1944l0591J38879b18466r7199B92235d7141j44495
10858a91636N5487I5015B9889a29562D5265f9101p4060g562n5409H5025b27048
10846F437J16313d3148j52525A70762h2979j58449A28474i8700C9945R5475c1720
10834A04081f2500l90802a98288A22375A8685J66241e2065k83565H0317K900B3732
10822a55521j20053L1789i3664k71693c3986p5997n6862g7113F4850d7651k25442
10811b73093i0835j3436j22616f0819B60783b8169B1460c8491j12663A57300a39802
$$ plain form
10889 -88108 -52800 114658 263893 353487 57360 80526 51240 -295404 267113 -67538 -194041
10878 -194041 116675 87389 48646 -103117 186504 -173799 -32535 336918 -219932 -339055
10868 -339055 -79353 151045 61944 31353 170232 -218466 -315665 292235 -47141 -191636
10858 -191636 -136149 95015 29889 -129562 45265 -69101 -143161 -7562 -62971 85025 -227048
10846 6437 122750 -43148 -195673 170762 -82979 -241428 128474 -98700 39945 135420 -31720
10834 104081 -62500 -453302 -198288 122375 18685 184926 -52065 -335630 80317 83217 23732
10822 -155521 -275574 -243785 -93664 -365357 -33986 -109983 -166845 -77113 64850 -47651 -273093
10811 -273093 -90835 -104271 -226887 -60819 260783 -28169 21460 -38491 -151154 157300 -139802
10799c9061a8075F158A207K48903b63048G0223b81494g7338k9485A50452b0091
10787c31539J10259A68766m8048c2501p2216a7926K075j32626C37300a1746p5143
10776h6889D3166P9773a47977b9718k13280B9420K74230f0904B94848A7419N0173
10765F7592b26717k30609B96269a02235I5924d8492D9952a52178I1723a46651
10754d381k5505C7810c9171F0839b2920k27021A78723C4645b45183Q7322C771
10742c33007D0407J95441a04762b2136A34966g1540B46486p0324a08797j56992
10732b65789B7161g7688k9713k4603O451j500l26577c6602D5217A6636A861b55463
10719F0852a02145d671H0384d5454r3866A58504K4457E5690a8588G8078b16852
$$ plain form
10799 -39061 -18075 6158 1207 250110 -263048 70223 -281494 -77338 -106823 150452 -20091
10787 -331539 -221280 168766 120718 -32501 -104717 -17926 -15851 -148477 337300 -11746 -86889
10776 -86889 43166 122939 -147977 -29718 -242998 29420 303650 -60904 294848 17419 67592
10765 67592 -226717 -457326 296269 -102235 95924 -48492 49952 -152178 91723 -146651
10754 -4381 -29886 37810 -39171 60839 -22920 -249941 178723 34645 -245183 -157861 3771
10742 -333007 40407 235848 -104762 -22136 134966 -71540 246486 176162 -108797 -265789
10732 -265789 27161 -77688 -107401 -132004 -125553 -127053 -453630 -36602 45217 16636 1861 -255463
10719 60852 -102145 -4671 80384 -45454 -139320 158504 182961 55690 -18588 78078 -216852
10707c24790b3845f87j55134P7010J8707J0729D44159b29472M8813k21555f0832
10695e1520A70176a1688j59829r3598j53936J69222F4049b15675a01833F907k569
10684D338a50079j19091o3752B65481b7373F8192q772O5043D2626d1875j73334
10673b15209A13772P8437d5617q9653j94911Q7334A44428a1859A66466a54259
10662g2940j26921O1018A30254a30287l4376g3858k53144M8723D07247E3796b93798
10650a80499d3058A35905k0067a0553l08771j02742a56947D2256B0576c55809
10639a24098Q69q4503A13338f1358E8967d04140O5832J08233A11328c1920k8120
10628f0040b0773A12924c6084H9822a37358o2384c9528q7587j08191g4443b1134
$$ plain form
10707 -324790 -23845 -687 -155821 -78811 -60104 -49375 444159 -229472 -180659 -402214 -60832
10695 -51520 170176 -11688 -171517 -265115 -419051 -249829 64049 -215675 -101833 6907 4338
10684 4338 -150079 -269170 -332922 265481 -27373 68192 59420 124463 42626 -41875 -215209
10673 -215209 113772 192209 -45617 -135270 -330181 -242847 144428 -11859 166466 -154259
10662 -72940 -199861 -138843 130254 -130287 -164663 -73858 -327002 -278279 407247 53796 -293798
10650 -180499 -43058 135905 115838 -10553 -319324 -422066 -156947 42256 20576 -355809
10639 -124098 -123229 -207732 113338 -61358 58967 -404140 -338308 -230075 111328 -31920 -60040
10628 -60040 -20773 112924 -36084 89822 -137358 -199742 -39528 -127115 -235306 -74443 -21134
10616a05758N2742k9779C8347f5873c2226C53064p8122H4293M2894b05268j14335
10605c19603a31933G3826a06868j70845A8692a96768C02481f2904B92331D8227
10594B39755r3539d91214A47122d5582A0135a62078P8361B47444C8537K13279
10584B51816q3744F9538b64619B08266b7444B1967J1105J52926B1820b79600e6315
10572h797j51824d7340a7089j6904k83916A66071a25575J358A66639E1452J02312
10561A53764J19255G9923a48822G3326L31024E6805h5635A75038g2996A63543
10550C22942b1862A91934L2042E9921L347a52343P1511B12011G4323b39218j9260
10539b58478g3170j46764r4864h0262G5624d6173k06783H0197J22749a6635p898
$$ plain form
10616 -105758 -53016 -82795 38347 -65873 -32226 353064 274942 84293 127187 -205268 -319603
10605 -319603 -131933 73826 -106868 -277713 18692 -196768 302481 -62904 292331 48227
10594 239755 146216 -491214 147122 -45582 10135 -162078 -83717 247444 38537 251816
10584 251816 168072 69538 -264619 208266 -27444 21967 33072 185998 21820 -279600 -56315
10572 -8797 -160621 -47340 -17089 -33993 -317909 166071 -125575 -124217 166639 51452 153764
10561 153764 273019 79923 -148822 73326 404350 56805 -85635 175038 -72996 163543
10550 322942 -21862 191934 223976 59921 63268 -152343 -80832 212011 74323 -239218 -258478
10539 -258478 -73170 -219934 -314798 -80262 75624 -46173 -252956 80197 202946 -16635 -24533
10528b4533C6096J53454b33133h9176A82659a91439E6431a12023m2880k30877
10518c85780B59738a69174a05H8178K6306a44919c7183k55597i1500P014A292
10506B58810f3044D78420I3934f3279n2990b4771E0267g3212j1700c7520A67400
10494a23623r9927A12469M7135b15483B27720K31854A51720E1975b66494N2793
10484b13701A17710n284J93330R7829r2836a2182C09815K5128i2749A72933a09001
10472f2257j55333F4309d1601e26j33677C08448a2591o9975k07725j03514A91735
10460i5458C7879a49975b6077m0000j45917i2278J069b6064a1466n17223B489
10448G9722N6383i7872j72462m969A21323b1152J838C7319N8481c07324B4107
$$ plain form
10528 -24533 36096 189550 -233133 -89176 182659 -191439 56431 -112023 -154903 -385780
10518 -385780 259738 -169174 -105 88178 114484 -144919 -37183 -292780 -91500 -84486 1292
10506 258810 -63044 478420 93934 -63279 -116269 -24771 50267 -73212 -84912 -37520 167400
10494 -123623 -223550 112469 159604 -215483 227720 459574 151720 51975 -266494 -213701
10484 -213701 117710 112426 305756 403585 310749 -12182 309815 334943 -92749 172933 -109001
10472 -62257 -217590 64309 -41601 -526 -134203 308448 -12591 -82566 -290291 -393805 191735
10460 -95458 37879 -149975 -26077 -66077 -211994 -92278 -91209 -26064 -11466 -528689 2489
10448 79722 136105 -97872 -270334 -275303 121323 -21152 -19314 37319 95800 -307324 24107
10436c56165F8001a94575b1010p6722A6692a55055q5552D9915a81522B60912d1051
10424i0535F3571O4344C87L25529a40730E9520f3537K9484C16200a69016B37406
10412b34959B91809A17462a25493p4953n090d6665n909N737A56779d5755B34648
10400b69916A12414J6819B6684b26464F2604L17638j75464b4624A59832J49927
10390C09759q2695b5398A07708l690Q5865a43191H2017C4875K97393I4704C5877
10378H2165J39002j05189J89832l4970m7257A04661N884J04024m2978M77068g752
10366C24416J83543j48359P8387j03989L7422a92144F13178j67514B19278r3637
10356A25641a28421F9045J24812K35280j28853J85103M6631o971B23900J56574
$$ plain form
10436 -356165 68001 -194575 -21010 -97732 16692 -155055 -240607 49915 -181522 260912 -41051
10424 -90535 63571 127915 387 325916 -140730 59520 -63537 -34053 316200 -169016 237406
10412 -234959 291809 117462 -125493 -200446 -205536 -46665 -52574 -46837 156779 -45755 234648
10400 -269916 112414 129233 26684 -226464 62604 380242 204778 -24624 159832 309759
10390 309759 227064 -25398 107708 104018 189883 -143191 82017 34875 332268 94704 35877
10378 82165 221167 115978 305810 270840 223583 104661 110545 214569 171591 648659 -7752
10366 324416 507959 359600 437987 333998 371420 -192144 613178 445664 219278 125641
10356 125641 -128421 69045 193857 429137 300284 485387 532018 525047 223900 380474
10346C80474F5348P7970J28798L70812b17028h9507f289A73461J0281G2929N3005
10335A25934O8120F7254a13000D00374j88075e2905B15350O0430i8818j6434A90286
10323A75204J93247j45855n8915J63404A43254n3884a00328C53778A48120Q5576
10313B33696b50891g6059l2810I7224l5770K09157i3725A29194F4428d14104h7136
10301A19884C5786P1020J86309j24894a01903B31704q5988d4580m8651M2085D2215
10289i2138E5578c11336J12150B06692n5514K17708b5616C4150K66310a45777
10278a0737j0226E5276a80778j998I9514R7267k9379l0147D5906c63817B1398
10266c93424A74432c7117k83119a26791I85J57989K44999D6601K96700Q8696j02406
$$ plain form
10346 380474 65348 143318 272116 642928 -217028 -89507 -6289 173461 183742 72929 125934
10335 125934 194054 67254 -113000 400374 212299 -52905 215350 275780 -98818 -115252 190286
10323 175204 368451 222596 163681 327085 143254 89370 -100328 353778 148120 233696
10313 233696 -250891 -76059 -108869 97224 61454 270611 -93725 129194 64428 -414104 -87136
10301 119884 35786 106806 293115 168221 -101903 231704 145716 -44580 -93231 -51146 42215
10289 -92138 55578 -311336 -199186 206692 151178 368886 -25616 34150 300460 -145777
10278 -10737 -20963 55276 -180778 -182776 99514 196781 167402 137255 45906 -363817 21398
10266 -393424 174432 -37117 -320236 -126791 985 158974 403973 46601 343301 431997 329591
10255C29591d3425A37196e141j5203j06482O2688E4650h0638a6518C54567B0766
10243h3960B4024a30457k89253A76915a10401I5419a94587F0469b938l71078H4758
10231A70242h1192L2958A33162f9541j9042M1920A55401a68290j53747R7591d510
10219C0943M9695K09490B8234b59115J22366e9319j10539j11775e8854n493c1861
10207a51578j08975E7646q992b80427a05776k1188I3770j9192f21943b3292k70355
10196b93647g7454A35953g5910J2673A47239E5916i6290k4310B8247a93479m9517
10185b42996H1673a40356e6325A9608F054N7871J82416g3161K0662k39677K5293
10174b66883A04957b82500l2890a06853a3721j43194E1510b112m7546A06564m6443
$$ plain form
10255 329591 -43425 137196 -5141 -20344 -126826 -64138 54650 -80638 -16518 354567 20766
10243 -83960 24024 -130457 -419710 176915 -110401 95419 -194587 60469 -2938 -374016 84758
10231 170242 -81192 -48234 133162 -69541 -88583 -46663 155401 -168290 -322037 -224446 -4510
10219 30943 80638 290128 28234 -259115 -136749 -59319 -169858 -281633 -58854 -64347 -31861
10207 -151578 -260553 57646 48654 -280427 -105776 -126964 93770 74578 -621943 -23292 -293647
10196 -293647 -77454 135953 -75910 -63237 147239 55916 -96290 -120600 28247 -193479 -242996
10185 -242996 81673 -140356 -56325 19608 6054 63925 246341 -73161 -52499 -292176 -266883
10174 -266883 104957 -282500 -315390 -106853 -13721 -156915 51510 -2112 -49658 106564 60121
10163F0121N6566a0555j65523I998N2938b50702A10039R86B1299J84324B4115
10151B20365G3724a30677d1476k49132F16188A3324b11525P3822K8302k57324
10141c66725R4688j46891K00104A55234m735P3480a18172j19565e3807j02022
10131a55829e6965D9302Q8914i4104G6237a26088J4018A97215d08726C46099a39732
10119a35548j0114f4709P113H567L78414A91973d30979B38745a34929N3550l031
10108h4410C3984K5936b75545a08016L7533B98122d16639C3958g8777r222K3421
10097f4578D9848d6467G1572a78325k10970D1448J8107q919i5298d889B02221
10085H6918K35749b19501A35357F2536c0991p0430L5999q2996B53519h6770k05026
$$ plain form
10163 60121 116687 -10555 -176078 9998 62936 -250702 110039 111025 21299 205623 24115
10151 220365 73724 -130677 -41476 -290608 616188 13324 -211525 -137703 -109401 -366725
10141 -366725 -272037 -418928 -218824 155234 150499 223979 -118172 -237737 -53807 -155829
10131 -155829 -56965 49302 138216 -94104 76237 -126088 -112070 197215 -408726 346099 -139732
10119 -135548 -145662 -64709 -57596 8567 386981 191973 -430979 238745 -134929 -81379 -84410
10108 -84410 33984 59920 -275545 -108016 -70483 298122 -416639 33958 -78777 -87999 -64578
10097 -64578 49848 -46467 71572 -178325 -389295 41448 59555 50636 -95298 -4889 202221
10085 86918 322667 -219501 135357 62536 -30991 -101421 -65422 -148418 253519 -86770 -291796
10074b91796i910q1832j46034B16152A05478a68962B33236b03908R8353F5700
10063d6070j92165A20929a64129M4644j78306J03968g4701l1436I8925C1697R9945
10052A31642b78530C60362c04434b1867m38129E2867K9481i7526E5031c01049
10041a66633I1284b57655C8073K00365E0881c985A77947D9929B4096K63814b66085
10029B4977b76491D718a11664P128j80106R7362P2312c947r2049B198L55563b17952
10016E6645R3723e8857B47967i2324F4373j5591M6851M6666d7097k07836E9780
10004d0940A04969i1703G8446e01235c9524n6216k6889c5338C2059b8637A20555
9992a63984r427B89994a7862A90635b86981A4787b10053b0822c051k27604A82537
$$ plain form
10074 -291796 -9910 -91742 -237776 216152 105478 -168962 233236 -203908 -105555 65700
10063 -46070 -238235 120929 -164129 -119485 -297791 -193823 -74701 -106137 98925 31697 131642
10052 131642 -278530 360362 -304434 -21867 -459996 52867 82348 -97526 55031 -301049
10041 -166633 91284 -257655 38073 238438 50881 -3985 177947 49929 24096 287910 -266085
10029 24977 -276491 4718 -111664 -104536 -284642 -187280 -114968 -3947 -95996 2198 357761 -217952
10016 56645 150368 -58857 247967 -92324 64373 48782 95633 142299 -47097 -254933 59780
10004 -40940 104969 -91703 78446 -501235 -39524 -95740 -122629 -35338 32059 -28637 120555
9992 -163984 -173411 289994 -17862 190635 -286981 14787 -210053 -20822 -3051 -230655 182537
9980G7538E890P397b57409o1827F4646b49504a12151H7992k1814J26039C8301
9968b57717P6283P8357m8306P4362E522i3047B18883a23477P788H8538E967b35122
9955a40659J3913q1494o2264g8514m47106a25016c4614D0709b40567B4343b07896
9943b6749D2026d16060A49205F4042b03132d3385A61810N123a08421L1987m82418
9932e58852b63423G1705J45769a10370b831j75992A9750a92019B07022b35214
9921D4252a3797k34053Q3613f205A48106b65806N6304N919a4713d782j6760n65794
9909e87336J25477p9394F3465c03025A83461d7014r3514B6070b07277j44610c5936
9897E5268i6634j10914A74497a49890n5445a02041E8645j0789J40005J06028a18918
$$ plain form
9980 77538 5890 13287 -257409 -319236 64646 -249504 -112151 87992 66178 192217 38301
9968 -257717 -181434 -103077 -151383 -77021 5522 -93047 218883 -123477 -115689 88538 5967 -235122
9955 -140659 -126746 -208240 -270504 -78514 -525620 -125016 -34614 40709 -240567 24343 -207896
9943 -26749 42026 -416060 149205 64042 -203132 -43385 161810 166933 -108421 -76434 -558852
9932 -558852 -263423 71705 217474 -110370 -2831 -178823 19750 -192019 207022 -235214
9921 44252 -13797 -247850 -164237 -6205 148106 -265806 -209502 -203583 -14713 -4782 -21542 -587336
9909 -587336 -461859 -541253 63465 -303025 183461 -47014 -140528 26070 -207277 -351887 -35936
9897 55268 -96634 -207548 174497 -149890 -205335 -102041 58645 47856 187861 293889 -118918
9885A282O4643K55437a86621j1895O7393A50957a70709F1411O9719d11343a0660
9873a72328o6587a06478E4082j3383c9107H7980a51227r6383A17870P2484B7310
9861g0258c2667l08478c0644C9751O2961a04416A88634b12213h4765A4621b18591
9849a82079d6646l16068I1126A9403a31999B41464E6541P6077i4660F9779N5100
9838A24879d8382A6293J63790M508g6782n5036d054A1926J3284e4432a0562k2502
9826c3064k5136E9302f2230l8319j78007h9503e374B5056b70741e5043b0505o6985
9814h7490c6614k9683k9428k10852a17637l717c5971F9238b50683h8450C01130
9802e52204h9457A97248J3426b50356A74850h1439n5501C6279c0831C21790a36940
$$ plain form
9885 1282 65925 321362 -186621 -198516 -131123 150957 -170709 61411 131130 -411343 -10660
9873 -172328 -238915 -106478 54082 40699 -39107 87980 -151227 -247610 117870 190354 27310
9861 -70258 -32667 -341145 -30644 39751 102712 -104416 188634 -212213 -84765 14621 -218591
9849 -182079 -46646 -362714 91126 19403 -131999 241464 56541 132618 -94660 69779 124879
9838 124879 -48382 16293 180083 184591 -76782 -131818 -4054 11926 25210 -54432 -10562 -33064
9826 -33064 -58200 59302 -62230 -100549 -278556 -89503 -5374 25056 -270741 -55043 -20505 -87490
9814 -87490 -36614 -66297 -95725 -306577 -117637 -121354 -35971 69238 -250683 -88450 301130
9802 -552204 -89457 197248 210674 -250356 174850 -81439 -136940 36279 -30831 321790 -136940
9790B27176c7270j6694C7888a92533A18965g5054j60685A51226b62613C3232J37253
9779A70485a32384k4232C9403b51216k2745d5688P13n6106B5784J24199a69972
9767a4649j02503q5942o1958j07173h9653A32235o6104e55645A87272a91003k99038
9756d90041b8310l6058j51278j08019l6694i9608r2822c9361E2245b29099H2517
9744e7286j59268G6082h5648r3473d5302q1491h005A26104D2781BL4021J3578
9732D7601g1975A16008b09407p1492J29971d9074A75329b80240m0132a48734A36494
9720B36335G8569a08404C87522a7540G62b96463B2080d136m394k65436a11020
9708a58107a015n0018j36438B23497F5174e7586A5262d8006j10128g8339a3098
$$ plain form
9790 227176 -37270 -53964 37888 -192533 118965 -75054 -235739 151226 -262613 33232 170485
9779 170485 -132384 -156616 39403 -251216 -273961 -45688 -44975 -101081 25784 149983 -169972
9767 -14649 -117152 -203094 -265052 -372225 -89653 132235 66131 -555645 187272 -191003 -490041
9756 -490041 -28310 -64368 -215646 -323665 -360359 -99608 -192430 -39361 52245 -229099 82517
9744 -57286 -216554 76082 -85648 -179121 -45302 -126793 -8005 126104 42781 2 34023 47601
9732 47601 -71975 116008 -209407 -280899 -150928 -49074 175329 -280240 -320372 -148734 136494
9720 236335 78569 -108404 387522 -17540 762 -296463 22080 -4136 -8530 -273966 -111020
9708 -158107 -1015 -51033 -187471 223497 65174 -57586 15262 -48006 -158134 -78339 -13098
9696A97070J1204a95810j59043e4619F3807a78215k8048A835K3284a51452F202
9684A74940b79094G1946l0636b73953g6182A73794b80090R0762A0727a8927p2508
9673i1435e451B189b66142A49487f0377k58476G0005J32106o6026P5364a71640
9661A88808e5633A15894c7815k03638Q443B49818a37794l7039M9963a7817B17948
9649a45523f3314B48486d04708D7870a27084j27276d5055l23823F7949k8950Q8106
9638A27105b22937f29k4589k05623B11952b35665j26882D966i8129k25604A7723
9626I651P3932b66867a10136j16291l8229i5733I1142a24801m4031b0163B9926
9614e3105H10R2561L6605b8847l85399e7089A81420j0059b79785i8461B31460
$$ plain form
9696 197070 208274 -195810 -354853 -54619 63807 -178215 -206263 1835 25119 -151452 6202
9684 174940 -279094 71946 41310 -273953 -76182 173794 -280090 -189328 10727 -18927 -91435
9673 -91435 -5451 2189 -266142 149487 -60377 -318853 70005 202111 136085 211449 -171640
9661 188808 -55633 115894 -37815 -241453 -233010 249818 -137794 -174833 -124870 -17817 217948
9649 -145523 -63314 248486 -404708 47870 -127084 -254360 -45055 -368878 67949 38999 127105
9638 127105 -222937 -629 -25218 -230841 211952 -235665 -362547 4966 -98129 -323733 17723
9626 9651 83583 -266867 -110136 -226427 -264656 -95733 91142 -124801 -168832 -20163 29926
9614 -53105 810 93371 129976 -28847 -414246 -57089 181420 171361 -279785 -98461 231460
9602a21646e3845A97763c45094c3782A29872a09230j30702J5730J2556N2698m3634
9591b02582j79527A15839a98947A59055c21383h7349A61274i9384j015P784N590
9580h7025G6391l0149R5687d93948b43390P2106A12372b62605a3623l49151F4737
9568i5407E5823e1039B46861e1109k2311j24198B2157c05481A33029A2550a41939
9556A98909D9459c05014A67023a2725F9185b5234I810d6449k41938K386O3103
9545b22898J5923C1498g0805r5800e6649j22585A91377a24956F1935b49383c2009
9533A00231c68524a83155G7718c03085A88730G1001j4298a68568L8446j70087
9523c00209A3645a54619r8768j5585J24595D8699i3523k85348C7667b1975B08824
$$ plain form
9602 -121646 -53845 197763 -345094 -33782 129872 -109230 -239932 -224202 -211646 -158948 -202582
9591 -202582 -382109 115839 -198947 159055 -321383 -87349 161274 -99384 -100399 -92615 -87025
9580 -87025 76391 46242 141929 -493948 -243390 -171284 112372 -262605 -13623 -362774 64737
9568 -95407 55823 -51039 246861 -51109 -73420 -197618 22157 -305481 133029 12550 -141939
9556 198909 49459 -305014 167023 -12725 69185 -25234 9810 -46449 -288387 -286001 -222898
9545 -222898 -206975 31498 -70805 -166605 -56649 -179234 191377 -124956 61935 -249383 -32009
9533 100231 -368524 -183155 77718 -303085 188730 71001 56703 -168568 -130122 -300209
9523 -300209 13645 -154619 -253387 -268972 -144377 48699 -93523 -378871 37667 -21975 208824
9511e9894A04027b84150d4310j67439b3766A58860f8527i09A03382a11585A75454
9499b60721B923b20500j13354m8985J35492A08979a22526L8094C7910J8876J57865
9488B14651h6937k147m8091f1989k30991b3916G0707N4477i8425K8975j39526
9477b08976N1603A8074J9649b63874F3089A8017e17589a61576B28080f2565c0411
9465g9103k1302b4316E6914J72206A00140h7275j56993A45092i0187j60289l57303
9454f07779a20710B3981e0127j18789A40777b3719j9012B35581c62790a58521
9443c8333p7152A19878c53189q892c1885a2206H5190N0214Q0080b42867M4898
9432a97969B008c19956G5099d8972B8049a00425q027n4121k59533a129A77629
$$ plain form
9511 -59894 104027 -284150 -44310 -211749 -23766 158860 -68527 -909 103382 -111585 175454
9499 -260721 2923 -220500 -333854 -382839 -247347 108979 -122526 -84432 37910 56786 214651
9488 214651 -86937 -89084 -137175 -61989 -292980 -23916 70707 125184 -98425 -69450 -208976
9477 -208976 -157373 18074 37723 -263874 63089 18017 -517589 -161576 228080 -62565 -30411
9465 -79103 -100405 -24316 56914 229120 100140 -87275 -244268 145092 -90187 -250476 -607779
9454 -607779 -120710 23981 -50127 -168916 140777 -23719 -42731 235581 -362790 -158521
9443 -38333 -115485 119878 -353189 -362081 -31885 -12206 85190 135404 215484 -242867 -197969
9432 -197969 2008 -319956 75099 -48972 28049 -100425 -108452 -162573 -422106 -1129 177629
9420B8122e5077C54474F6510a37820A18710L3002P9864F9016J37280E6093b9845
9408a83926A56976b2167j16911I9564N0758C4673e3514H3937l4181Q3169D0345
9396a97316B52208b7360B1936L25177e8304j94166e4032q6045M3375K6485r49
9385g1166D9253a62194I3209a29153A5629a58645a3636A70053b17595F4516c44944
9373B41515a14547r0227j26874A96K34110m9546b82738K7613g5280q1755O0229
9362i6806a3818m5890A5780J10004C3538L95549e9473B66768I2800P6592a6444
9350G9869a51012k16662J81421k0150f6248n9868h468A52215J71112h7072A5755
9338a09040F2091C499f6412m1537a6051j99319o2037J19216q9686h9001j37994
$$ plain form
9420 28122 -55077 354474 66510 -137820 118710 151712 231576 69016 206296 56093 -29845
9408 -183926 156976 -22167 -139078 99564 150322 34673 -53514 83937 49756 132925 40345
9396 -197316 252208 -27360 21936 347113 -58304 -252470 -54032 -140077 -96702 -70217 -71166
9385 -71166 49253 -162194 93209 -129153 15629 -158645 -13636 170053 -217595 64516 -344944
9373 241515 -114547 -204774 -331648 196 234306 184760 -282738 -255125 -75280 -157035 -96806
9362 -96806 -13818 -59708 15780 125784 33538 429087 -59473 266768 92800 169392 -16444
9350 79869 -151012 -367674 -186253 -206403 -66248 -126116 -8468 152215 323327 -87072 15755
9338 -109040 62091 3499 -66412 -107949 -16051 -215370 -277407 -158191 -247877 -89001 -226995
9327b26995d4076j08168K625j07139A9206b58968I3269a04454C2810h3659I7290
9315A46032H93g6018l6976A62610b00214B2735N9692h2965b8006n1758C0565J22488
9303A53053f4830n890j74832Q8954j0512B680J63812A0789c90978J30364h0507
9291C625M5530J35075f2519k9679k32617a27871A66768b94184J26799I4509j7972
9280G6537J82895A4391h0176A06571b49674A6467g9305k75977c7133j09818l4247
9269a81198O4361a4009q9602p280j30797B731f2337B2142c94349f1324l44858
9258d06182b8728A38653d15452A1684b87046b7835k97533f3181A38544J64653
9248C03197b98481c6471r9873A04340k4095J14925h4212p7234f792k54344B52210
$$ plain form
9327 -226995 -44076 -152244 -149619 -256758 19206 -258968 93269 -104454 32810 -83659 97290
9315 146032 893 -76018 -112994 162610 -200214 22735 82427 -82965 -28006 -79764 30565 153053
9303 153053 -64830 -70720 -245552 -156598 -167110 2680 166492 10789 -390978 -260614 -80507
9291 3625 49155 184230 -62519 -92198 -324815 -127871 166768 -294184 -167385 94509 76537
9280 76537 259432 14391 -80176 106571 -249674 16467 -79305 -355282 -37133 -146951 -181198
9269 -181198 -116837 -14009 -103611 -110891 -241688 2731 -62337 22142 -394349 -61324 -406182
9258 -406182 -28728 138653 -415452 11684 -287046 -27835 -325368 -63181 138544 303197
9248 303197 -298481 -36471 -136344 104340 80245 195170 -84212 -161446 -6792 -261136 252210
9236a58902g5580j98594A41972l7442m3764P0153d2234C0054a97362A8215J83027
9225B01242q9770d21125C49471C053a59776D4922L2097h3949C17470D3304O937
9214E0241J33000d43453a25075A50343F081a91701j31886A49720a08183r4510
9204b02693A11868J62223a22010M14k07510J57557A00269c27202I7345a21283
9193A92738m2218a39925J1219j06035Q4898M7774A57490c79013A0970h0946J225
9182g9721C21740A13052a07648D7588a74923A28586F2849K14960b33039l7392
9172b70431B54867c72j72734N0727k74865i3764j64471A23105a03859G777b51882
9160a02508j67325D3158O1659D9120a72368a8309I7850l0366K33572A469K37513
$$ plain form
9236 -158902 -75580 -274174 141972 104530 60766 130919 -42234 30054 -197362 18215 201242
9225 201242 111472 -421125 349471 3053 -159776 44922 77019 -83949 317470 43304 50241
9214 50241 183241 -443453 -125075 150343 6081 -191701 -323587 149720 -108183 -202693
9204 -202693 111868 274091 -122010 -121596 -329106 -171549 100269 -327202 97345 -121283
9193 192738 150520 -139925 -128706 -234741 -149843 -102069 157490 -379013 10970 -80946 -79721
9182 -79721 321740 113052 -107648 47588 -174923 128586 62849 277809 -233039 -270431
9172 -270431 254867 -372 -173106 -122379 -397244 -93764 -258235 123105 -103859 7777 -251882
9160 -102508 -269833 43158 104817 49120 -172368 -18309 97850 67484 301056 1469 238982
9149B38982h434B09968I648a65978l0613i0046L9871j01809r3889Q1051C5220
9137B03182a63614J2417E4525a32375A10134j666C9501a24652G9536N906h4829
9125G2791L15377a13175K0507l46715i3488b5544k7842j72207j3488k4149d4136
9113A27107b55550J15749A7106J2491a32295N1416k7282b0654C0004J14727J03177
9102B47908B1905c7657B35377b66912m708C72734c55821J15123d9101j09895a4366
9090b9746B4791J03760J7634H355a58129A76388P9605a58220G430i8429k03317
9079c01746a07152j41621P2698j31025G7545N7090l8681a36849k95980a67076
9068A3593a99564A67980f9559j54472f1695j24397L6853N9518a7518B7318K0791
$$ plain form
9149 238982 -8434 209968 9648 -165978 -196591 -90046 -50175 -151984 -245873 -164822 35220
9137 203182 -163614 -151197 54525 -132375 110134 108468 39501 -124652 79536 85442 -84829
9125 72791 388168 -113175 -92668 -439383 -93488 -25544 -53386 -225593 -239081 -263230 -44136
9113 127107 -255550 -139801 17106 29597 -132295 -80879 -108161 -20654 30004 144731 247908
9102 247908 21905 -37657 235377 -266912 -271620 372734 -355821 -240698 -49101 -158996 -14366
9090 -29746 24791 128551 146185 8355 -158129 176388 255993 -158220 7430 -98429 -301746
9079 -301746 -107152 -248773 -176075 -307100 77545 134635 95954 -136849 -432829 -167076
9068 13593 -199564 167980 -69559 -224031 -61695 -186092 -149239 -89721 -17518 27318 48109
9057D8109Q6749b22571A30605a27341B5966i6315F9104c32972Q306a51974N873
9046a46101l016G1963b00948A10380P5253A2221a96414H8231a47949N9599k35233
9035c23583l8171i7498E2765g8599j0108j27898N3653q5575a24228p3036B14452
9023B3887b32081A15347b89307k80943J63566e9537A66994b03893f0681A80772
9012e8956k65136R3810M7881B64739I9917R0585A5846g1823k23552R3523k66906
9001d68758C28721a77503j91040B1046f8667b7516F8506e1230A23272d8654p4467
8990a23121F6798c03883h9709C7832L038e1111B6580J62908a94341b2021k63069
8979b85090A36574J11268o3382C8053b37827o2011A16332a17524E61218b11738
$$ plain form
9057 48109 134858 -222571 130605 -127341 25966 -96315 69104 -332972 -324666 -151974 -146101
9046 -146101 -149117 71963 -200948 110380 185633 12221 -196414 88231 -147949 -88350 -323583
9035 -323583 -361754 -97498 52765 -78599 -88707 -216605 -162952 -248527 -124228 -197264 214452
9023 23887 -232081 115347 -289307 -570250 -406684 -59537 166994 -203893 -60681 180772
9012 -58956 -324092 -230282 -182401 264739 99917 190502 15846 -71823 -295375 -201852 -468758
9001 -468758 328721 -177503 -368543 21046 -68667 -27516 68506 -51230 123272 -48654 -123121
8990 -123121 66798 -303883 -89709 37832 40870 -51111 26580 189488 -194341 -22021 -285090
8979 -285090 136574 247842 184460 38053 -237827 -299838 116332 -117524 561218 -211738
8968D7453a23713N3411j42458B53048H335b36033J08499A79963m0271a64292O1595
8957a02697B4494a07847A49787c06920j0968A87538M420q1735l3515a68810E3220
8945d9629B3564b4114B17235a37140b6256j0940B66106B530L8098R8245K73891
8934D12764A87331i2123A37182a7045A85401i6467C30342K651J23913j40800J043615
8923A359721K630390N976908k597643B834436F93684o2540A97025P1377a8810
8913B28470f5050j41872A33566N5136K66562E9760g5432i17j71926L0p5768A38079
8900b95924D6550c75814L4848a0719j56338B25040g3080j1047B15414A7121g2170
8888B89458a29461c6125H9591k4503e0348n5925m432B90197a14520A77887c34896
$$ plain form
8968 47453 -123713 -70302 -212760 253048 8335 -236033 -127534 179963 139692 -164292 -102697
8957 -102697 24494 -107847 149787 -306920 -317888 187538 191958 110223 76708 -168810 53220
8945 -49629 23564 -24114 217235 -137140 -26256 -37196 266106 2530 40628 138873 412764
8934 412764 187331 -92123 137182 -17045 185401 -96467 330342 332993 456906 316106 1359721
8923 1359721 3990111 9967019 7369376 2834436 693684 631144 197025 268402 -18810
8913 228470 -65050 -206922 133566 188702 455264 59760 -75432 -917 -172843 -172813 -248581 138079
8900 -295924 46550 -375814 -340966 -10719 -167057 225040 -73080 -84127 215414 17121 -72170
8888 289458 -129461 -36125 89591 65088 -50348 -106273 -110705 290197 -114520 177887 -334896
8876b7469B43935m6319p7036d73760A09341a80056j67894F4120d2589C6517L3540
8865G0057A7302K1565L7184a12873k04309a37502D890a6548k26333R5136B38025
8853d2385j40075N0501J3453j22761a8323I2965i4345C1886d5378B5261J9497
8842D4758c3018j34464F9808b01860E3044a78869l7615H7524b45187K6197D293
$$ plain form
8876 -27469 243935 197616 120580 -473760 109341 -180056 -347950 64120 -42589 36517 70057
8865 70057 17302 38867 76051 -112873 -317182 -137502 4890 -16548 -242881 -147745 238025
8853 -42385 -182460 -131959 -118506 -241267 -18323 92965 -94345 31886 -45378 25261 44758
8842 44758 -33018 -167482 69808 -201860 53044 -178869 -216484 87524 -245187 -218990 4293
$$ [...]
##END NTUPLES=NMR SPECTRUM
##END=
