##TITLE=AC1597_PERAH13327_8314405_hGBvvv1ZsV
##JCAMPDX= 6.0         $$ Bruker NMR JCAMP-DX V2.0
##DATA TYPE= NMR SPECTRUM
##DATA CLASS= NTUPLES
##ORIGIN= BRUKER
##OWNER= Administrator
$$ 1.72 TOPSPIN		Version 2.1
$$ 2013-11-09 16:56:20.015 -0800  Administrator@X
$$ Compression mode = diff/dup
##.OBSERVE FREQUENCY= 400.02188249412
##.OBSERVE NUCLEUS= ^1H
##.ACQUISITION MODE= SIMULTANEOUS (DQD)
##.ACQUISITION SCHEME= undefined
##.AVERAGES= 64
##.DIGITISER RES= 22
##SPECTROMETER/DATA SYSTEM= spect
##.PULSE SEQUENCE= noesygpps1d.comp
##.SOLVENT NAME= COFFEE_meoh
##.SHIFT REFERENCE= INTERNAL, COFFEE_meoh, 1, 14.96076
##AUDIT TRAIL= $$ (NUMBER, WHEN, WHO, WHERE, PROCESS, VERSION, WHAT)
$$ ##TITLE= Audit trail, TOPSPIN		Version 2.1
$$ ##JCAMPDX= 5.01
$$ ##ORIGIN= Bruker BioSpin GmbH
$$ ##OWNER= Administrator
$$ $$ E:\/data/COFFEE/nmr/AC1597_PERAH13327_8314405_hGBvvv1ZsV/12/pdata/1/auditp.txt
$$ ##AUDIT TRAIL=  $$ (NUMBER, WHEN, WHO, WHERE, PROCESS, VERSION, WHAT)
(   1,<2013-11-09 16:56:14.312 -0800>,<Administrator>,<X>,<go>,<TOPSPIN 2.1>,
      <created by zg
	started at 2013-11-09 16:44:47.374 -0800,
	POWCHK enabled, PULCHK disabled,
       configuration hash MD5:
       C8 4E 4E 5D D3 5C D8 9E 9F 52 82 E0 59 8A DE 15
       data hash MD5: 64K
       C4 5D 0B 2D BD 84 94 34 5E 2B 0E 37 6A D9 A9 C6>)
(   2,<2013-11-09 16:56:17.666 -0800>,<Administrator>,<X>,<proc1d>,<TOPSPIN 2.1>,
      <Start of raw data processing
       efp LB = 0.3 FT_mod = 6 PKNL = 1 PHC0 = 0 PHC1 = 0 SI = 128K 
       data hash MD5: 128K
       2C EC 5B B7 E6 DE 47 AA B5 18 A4 AF 49 FF 2F AA>)
(   3,<2013-11-09 16:56:18.859 -0800>,<Administrator>,<X>,<proc1d>,<TOPSPIN 2.1>,
      <pk PHC0 = -87.1106 PHC1 = 0 
       data hash MD5: 128K
       EC 57 D3 03 1D C9 3F 24 44 A5 75 DA 26 1F BD 9E>)
(   4,<2013-11-09 16:56:19.347 -0800>,<Administrator>,<X>,<proc1d>,<TOPSPIN 2.1>,
      <abs ABSG = 1 
       data hash MD5: 128K
       B1 FA 47 39 B8 47 86 BA BB 6B D4 24 E4 D1 8B 1E>)
(   5,<2013-11-09 16:56:19.455 -0800>,<Administrator>,<X>,<proc1d>,<TOPSPIN 2.1>,
      <abs ABSG = 2 
       data hash MD5: 128K
       8C F1 A1 57 BF 22 5B 77 44 D3 87 AF 35 18 D4 60>)
(   6,<2013-11-09 16:56:19.527 -0800>,<Administrator>,<X>,<proc1d>,<TOPSPIN 2.1>,
      <abs ABSG = 3 
       data hash MD5: 128K
       53 8D A0 4E 2A 46 10 FB 0D 09 1F 21 5B BD 68 52>)
(   7,<2013-11-09 16:56:19.654 -0800>,<Administrator>,<X>,<proc1d>,<TOPSPIN 2.1>,
      <abs ABSG = 4 
       data hash MD5: 128K
       79 6E E9 22 3A 5F 8F 7F 79 ED F7 E5 2E 2E C8 99>)
(   8,<2013-11-09 16:56:19.762 -0800>,<Administrator>,<X>,<proc1d>,<TOPSPIN 2.1>,
      <abs ABSG = 5 
       data hash MD5: 128K
       7E EB 36 0A 6E 2F D4 F3 62 DD C2 59 A9 E7 C9 96>)
$$ ##END=
$$ 
$$ $$ hash MD5
$$ $$ A2 59 9C 90 03 A7 38 6E 85 9D FC 17 A3 F6 E7 42
##$RELAX= 
##$RELAX= 
##$RELAX= 
##$RELAX= 
##$RELAX= 
##$RELAX= 
##$RELAX= 
##$RELAX= 
$$ Bruker specific parameters
$$ --------------------------
##$DU= <E:\>
##$EXPNO= 12
$$ [...]
150 150 150 150 150 150 150 150
##$TP07= 0
##$TPNAME0= <>
##$TPNAME1= <>
##$TPNAME2= <>
##$TPNAME3= <>
##$TPNAME4= <>
##$TPNAME5= <>
##$TPNAME6= <>
##$TPNAME7= <>
##$TPOAL= (0..7)
0.5 0.5 0.5 0.5 0.5 0.5 0.5 0.5
##$TPOFFS= (0..7)
0 0 0 0 0 0 0 0
##$TUNHIN= 0
##$TUNHOUT= 0
##$TUNXOUT= 0
##$USERA1= <user>
##$USERA2= <user>
##$USERA3= <user>
##$USERA4= <user>
##$USERA5= <user>
##$V9= 5
##$VALIST= <valist>
##$VCLIST= <CCCCCCCCCCCCCCC>
##$VD= 0
##$VDLIST= <DDDDDDDDDDDDDDD>
##$VPLIST= <PPPPPPPPPPPPPPP>
##$VTLIST= <TTTTTTTTTTTTTTT>
##$WBST= 1024
##$WBSW= 4
##$XGAIN= (0..3)
0 0 0 0
##$XL= 0
##$YL= 0
##$YMAX_a= 6184574
##$YMIN_a= -11954428
##$ZGOPTNS= <>
##$ZL1= 120
##$ZL2= 120
##$ZL3= 120
##$ZL4= 120
##$ABSF1= 14.96076
##$ABSF2= -5.597422
##$ABSG= 5
##$ABSL= 3
##$ALPHA= 0
##$AQORDER= 0
##$ASSFAC= 0
##$ASSFACI= 0
##$ASSFACX= 0
##$ASSWID= 0
##$AUNMP= <proc_prof1d_extract.lims>
##$AXLEFT= 0
##$AXNAME= <>
##$AXNUC= <1H>
##$AXRIGHT= 0
##$AXTYPE= 0
##$AXUNIT= <>
##$AZFE= 0.1
##$AZFW= 0.1
##$BCFW= 0
##$BC_mod= 0
##$BYTORDP= 0
##$COROFFS= 0
##$CY= 15
##$DATMOD= 1
##$DC= 0
##$DFILT= <>
##$DTYPP= 0
##$F1P= 0
##$F2P= 0
##$FCOR= 0.5
##$FTSIZE= 131072
##$FT_mod= 6
##$GAMMA= 0
##$GB= 0
##$INTBC= 1
##$INTSCL= 1
##$ISEN= 128
##$LB= 0.3
##$LEV0= 0
##$LPBIN= 0
##$MAXI= 10000
##$MC2= 0
##$MEAN= 0
##$ME_mod= 0
##$MI= 0
##$NCOEF= 0
##$NC_proc= -2
##$NLEV= 6
##$NOISF1= 0
##$NOISF2= 0
##$NSP= 0
##$NTH_PI= 0
##$NZP= 0
##$OFFSET= 14.96076
##$PC= 1
##$PHC0= -87.1106
##$PHC1= 0
##$PH_mod= 1
##$PKNL= yes
##$PPARMOD= 0
##$PPDIAG= 0
##$PPIPTYP= 0
##$PPMPNUM= 2147483647
##$PPRESOL= 1
##$PSCAL= 4
##$PSIGN= 0
##$PYNMP= <proc.py>
##$REVERSE= no
##$SF= 400.020009732807
##$SI= 131072
##$SIGF1= 0
##$SIGF2= 0
##$SINO= 400
##$SIOLD= 131072
##$SPECTYP= <>
##$SREGLST= <1H.CDCl3>
##$SSB= 0
##$STSI= 131072
##$STSR= 0
##$SW_p= 8223.68421052631
##$SYMM= 0
##$S_DEV= 0
##$TDeff= 65536
##$TDoff= 0
##$TI= <>
##$TILT= no
##$TM1= 0
##$TM2= 0
##$TOPLEV= 0
##$USERP1= <user>
##$USERP2= <user>
##$USERP3= <user>
##$USERP4= <user>
##$USERP5= <user>
##$WDW= 1
##$XDIM= 131072
##$YMAX_p= 360016629
##$YMIN_p= -11479
##$CURPLOT= <Network HP LaserJet P1505>
##$CURPRIN= <$Network HP LaserJet P1505>
##$DFORMAT= <normdp>
##$LAYOUT= <+/1D_H.xwp>
##$LFORMAT= <normlp>
##$PFORMAT= <normpl>
##$SURQMSG= 1
$$ End of Bruker specific parameters
$$ ---------------------------------
##NTUPLES= NMR SPECTRUM
##VAR_NAME=  FREQUENCY,     SPECTRUM/REAL,   SPECTRUM/IMAG
##SYMBOL=    X,             R,               I
##VAR_TYPE=  INDEPENDENT,   DEPENDENT,       DEPENDENT
##VAR_FORM=  AFFN,          ASDF,            ASDF
##VAR_DIM=   131072,        131072,          131072
##UNITS=     HZ,            ARBITRARY UNITS, ARBITRARY UNITS
##FACTOR=    0.0627417313425164, 1,          1
##FIRST=     8223.62146879497, -1535,        -62575
##LAST=      0,             810,             -62467
##MIN=       0,             -11479,          0
##MAX=       8223.62146879497, 360016629,    0
$$ Real data points
##PAGE= N=1
##DATA TABLE= (X++(R..R)), XYDATA
$$ [...]
63959D93695J8963K1006K2857K4727K6734K9067L2385L7342M3714N0569N7471
63948H58530O5053P4162Q4752R5952J07037J18045J29286J40459J50538J58586
63938A982400J64466J68531J70772J70520J66927J59415J47802J32398J14046
63929C377277R3677P1769M8420K3910j225k6587n1838p6181r8369j17408j32894
63918C110551j44658j52663j57360j59528j59458j56822j51617j44667j36824
63909A746954j28231j18784j08833r8934q9284p9917p1081o2913n5167m7722m1102
63898H44986l5779l1312k6775k2001j7756j4729j2897j1900j1468j1347j1171
63887F37851j0667r824q843p995p383o718n459l357o20K453N705Q855J1496J3617
$$ y = [493695, 512658, 533664, 556521, 581248, 607982, 637049, 669434, 706776, 750490, 801059, 858530, 923583, 997745, 1082497, 1178449, 1285486, 1403531, 1532817, 1673276, 1823814, 1982400, 2146866, 2315397, 2486169, 2656689, 2823616, 2983031, 3130833, 3263231, 3377277, 3470954, 3542723, 3591143, 3615053, 3613828, 3587241, 3535403, 3459222, 3360853, 3243445, 3110551, 2965893, 2813230, 2655870, 2496342, 2336884, 2180062, 2028445, 1883778, 1746954, 1618723, 1499939, 1391106, 1292172, 1202888, 1122971, 1051890, 988977, 933810, 886088, 844986, 809207, 777895, 751120, 729119, 711363, 696634, 683737, 671837, 660369, 649022, 637851, 627184, 617360, 608517, 600522, 593139, 586421, 580962, 577605, 576985, 579438, 585143, 593998, 605494, 619111]
63873F19111J5633J7657J9339K0796K2866K5784K8288K9022K8316K7580K7213
63862H81605K6280K4099K1111J8010J5031J2254R718P048L689k33m002p339j0525
63849I96746j3502j5794j7544j9573k2012k3915k4755k5314k6477k7991k9127
63838G50742k9814l0316l0420k9788k8631k7329k5895k4427k3471k3146k2507
63827D54998k0733j8415j6704j5622j4341j2762j1571j0893j0141r234q786q841
63815B96955q610p780o992o605o040m924l951l847m246m330l997l618l195k479
63801B26341j609r54o21o46j251k302k928k504j611j221j261r17k02p5q73j635
63785B05731j487p97m84p48j105j146p35J26J088J416P18m88j410j883k156k092
$$ y = [619111, 634744, 652401, 671740, 692536, 715402, 741186, 769474, 798496, 826812, 854392, 881605, 907885, 931984, 953095, 971105, 986136, 998390, 1008108, 1015156, 1018845, 1018612, 1014610, 1007271, 996746, 983244, 967450, 949906, 930333, 908321, 884406, 859651, 834337, 807860, 779869, 750742, 720928, 690612, 660192, 630404, 601773, 574444, 548549, 524122, 500651, 477505, 454998, 434265, 415850, 399146, 383524, 369183, 356421, 344850, 333957, 323816, 314582, 305796, 296955, 288345, 280565, 273573, 266968, 260928, 256004, 252053, 248206, 243960, 239630, 235633, 232015, 228820, 226341, 224732, 223778, 223157, 222511, 221260, 218958, 216030, 213526, 211915, 210694, 209433, 208516, 208314, 208239, 207366, 205731, 204244, 203447, 202963, 202215, 201110, 199964, 199229, 199355, 200443, 201859, 202577, 202089, 200679, 198796, 196640, 194548]
63769A94548j322j21N94L56l53q59j092j231j090l93N57R99O09j16m49k29J01
63752A90509R1k66o38p75o73m49j70J00K97N05R06J453J711J426J032J263K156
63735A98478K887K744J905J056O07O35J232K392L644M270L981L158K423K174K531
63720B34117L294L959M057L638L172K900K602K078J542J309J274J052M51m43j469
63705B63533k417k901k646j962j619j959k400k070q72L78Q58N57J09Q7O25J492
63689B48793K270K579K420K297K699L457L955L972L902L939L549K230M59o57o82
63674B85182k19K7RJ8Q6R3J30L74P40R64R50P62M03j06m68l32J06P2r87k686m054
63653B81064m522m373m215m210m015l378k492j774j427j346j414j587j723j477
$$ y = [194548, 193226, 193105, 193699, 194055, 193702, 192843, 191751, 190520, 189430, 189037, 189594, 190593, 191202, 191086, 190637, 190408, 190509, 190600, 190334, 189696, 188921, 188248, 187799, 187629, 187729, 188026, 188531, 189437, 190890, 192601, 194027, 195059, 196322, 198478, 201365, 204109, 206014, 207070, 207677, 208312, 209544, 211936, 215580, 219850, 223831, 226989, 229412, 231586, 234117, 237411, 241370, 245427, 249065, 252237, 255137, 257739, 259817, 261359, 262668, 263942, 264994, 265445, 265002, 263533, 261116, 258215, 255569, 253607, 251988, 250029, 247629, 245559, 244687, 245065, 245923, 246480, 246589, 246676, 247301, 248793, 251063, 253642, 256062, 258359, 261058, 264515, 268470, 272442, 276344, 280283, 283832, 286062, 286521, 285864, 285182, 284963, 284990, 284999, 285017, 285103, 285196, 285326, 285700, 286440, 287404, 288354, 289116, 289519, 289413, 288945, 288613, 288719, 288791, 287804, 285118, 281064, 276542, 272169, 267954, 263744, 259729, 256351, 253859, 252085, 250658, 249312, 247898, 246311, 244588, 243111]
63639B43111n93O86J648J758J305J241K219L791M777M489L441K741K973L843M727
63624B82157N313N680O019O472P148Q166R500J0772J1360J1005J0366J0596J2210
63611C96764J4560J6655J8253J9804K1552K3143K4134K4528K4624K4502K3769
63600F32288K1764J8147J3402Q594M458R93j916l886m602m696n305o759q328r348
63586F54806r985j0805j2188j4336j7140j9720k0765j9845j7964j6351j5217j4084
63574D66406j2778j1395r754p680n587m048k879j411M13J897K715L417M589O023
63560D29928P083P486P426P232P221P658Q596R810J1091J2512J4287J6525J9160
63547E66015K2069K5069K7967L0614L2818L4067L3424K9988K3636J5500P494J156
$$ y = [243111, 242518, 243204, 244852, 246610, 247915, 249156, 251375, 255166, 259943, 264432, 267873, 270614, 273587, 277430, 282157, 287470, 293150, 299169, 305641, 312789, 320955, 330455, 341227, 352587, 363592, 373958, 384554, 396764, 411324, 427979, 446232, 466036, 487588, 510731, 534865, 559393, 584017, 608519, 632288, 654052, 672199, 685601, 694195, 698653, 699646, 697730, 693844, 689242, 684546, 679241, 672482, 664154, 654806, 644821, 634016, 621828, 607492, 590352, 570632, 549867, 530022, 512058, 495707, 480490, 466406, 453628, 442233, 432479, 424799, 419212, 415164, 412285, 410874, 411287, 413184, 415899, 419316, 423905, 429928, 437011, 444497, 451923, 459155, 466376, 474034, 482630, 492440, 503531, 516043, 530330, 546855, 566015, 588084, 613153, 641120, 671734, 704552, 738619, 772043, 802031, 825667, 841167, 848661, 849817]
63535H49817l239o350q672j0008j0032q986p592o548o332p180q977j1356j4180
63522G40365j7568k1218k4169k5714k6212k6423k6411k5819k4859k4084k3220
63511D74668k1354j8532j6094j4942j4308j3021j1241j0017r526q838p406n884
63499C23505n110m989m801m148l180k123j090l67l38r54j533j458r10n58o30p34
63483B90582n83k97K27J525L608N338N620M872M408M547M335L308K299K024J854
63468C33667P72j079k662l410l563l432l106k835k881k989k543j439k70M16O75
63453C05321Q64J152J498J845K133K323K493K824L409M182N050O037P316R014
63439C55461J0996J2882J4527J6392J8979K1913K4174K5378K6116K6544K5465
$$ y = [849817, 846578, 840228, 831556, 821548, 811516, 802530, 794938, 788390, 782058, 774878, 765901, 754545, 740365, 722797, 701579, 677410, 651696, 625484, 599061, 572650, 546831, 521972, 497888, 474668, 453314, 434782, 418688, 403746, 389438, 376417, 365176, 355159, 345633, 336795, 329389, 323505, 318395, 313406, 308605, 304457, 301277, 299154, 298064, 297697, 297359, 296405, 294872, 293414, 292504, 291946, 291316, 290582, 289999, 289702, 289929, 291454, 295062, 300400, 306020, 310892, 315300, 319847, 324182, 327490, 329789, 331813, 333667, 334439, 333360, 330698, 327288, 323725, 320293, 317187, 314352, 311471, 308482, 305939, 304500, 304230, 304646, 305321, 306185, 307337, 308835, 310680, 312813, 315136, 317629, 320453, 323862, 328044, 333094, 339131, 346447, 355461, 366457, 379339, 393866, 410258, 429237, 451150, 475324, 500702, 526818, 553362, 578827]
63428E78827K1701J5942J0231N802K443r1j226n09J513M053P091J0973J5488J9913
63414F92151K3713K6678K8578K9149K8321K6121K2526J7782J2607P689L107j304
63402I17118n191p864r229j0027j0954j2040j3107j4464j6649j9666k2809k5289
63390G49829k6776k7398k7475k7350k7185k6750k5514k3198k0229j7419j5217
63379D85318j3404j1591r752q174p005o058m942l292r98J618L925N550O701P815
63365D45711Q983R997J0888J2012J3543J5317J7259J9627K2521K5424K7657K9146
63353F58085L0393L1635L2356L1814K9734K6305K1694J5972R592L618q75l611
63341H86712n209o436p551q409q973r574j0678j2525j4934j7450j9758k1915k3997
$$ y = [578827, 600528, 616470, 626701, 632503, 634946, 634855, 633629, 633120, 634633, 638686, 645777, 656750, 672238, 692151, 715864, 742542, 771120, 800269, 828590, 854711, 877237, 895019, 907626, 915315, 918422, 917118, 911927, 904063, 894834, 884807, 873853, 861813, 848706, 834242, 817593, 797927, 775118, 749829, 723053, 695655, 668180, 640830, 613645, 586895, 561381, 538183, 517954, 500535, 485318, 471914, 460323, 450571, 442397, 435392, 429334, 424392, 421100, 420102, 421720, 425645, 431195, 437896, 445711, 454694, 464691, 475579, 487591, 501134, 516451, 533710, 553337, 575858, 601282, 628939, 658085, 688478, 720113, 752469, 784283, 814017, 840322, 862016, 877988, 887580, 891198, 890323, 886712, 881503, 875067, 867516, 859107, 850134, 840560, 829882, 817357, 802423, 784973, 765215, 743300, 719303]
63328G19303k5517k5649k4191k1978j9952j8065j5613j2483r443p100n179l240
63316E30893j788k103m930r522j4076j7028j8013j7681j6770j5577j4242j3104
63304C86059j2386j1711j0507q839p339o226m995l371j983j564j874k024j729
63291C11511j532j760j902j390n66m05j322k659l400l174k483k081k243k625k663
63276B81306k097j125j56N33Q62P94L44j85k32L85J044R23J46k01N45J759K418
63259B87063K469K637L181L606L610L557L773M038M131M356N085O093O826P145
63245C47570P468Q251R559J1008J2065J2545J2977J4088J5844J7393J8155J8571
63233E05494J9372K0577K1684K2568K3546K4691K5612K5936K5652K4981K4249
$$ y = [719303, 693786, 668137, 643946, 621968, 602016, 583951, 568338, 555855, 546412, 539312, 534133, 530893, 529105, 527002, 522072, 512550, 498474, 481446, 463433, 445752, 428982, 413405, 399163, 386059, 373673, 361962, 351455, 342616, 335277, 329051, 324056, 320685, 318702, 317138, 315264, 313240, 311511, 309979, 308219, 306317, 304927, 304361, 303956, 302634, 299975, 296575, 293401, 290918, 288837, 286594, 283969, 281306, 279209, 278084, 277928, 278461, 279323, 280117, 280461, 280276, 280044, 280429, 281473, 282396, 282542, 282341, 282886, 284645, 287063, 289532, 292169, 295350, 298956, 302566, 306123, 309896, 313934, 318065, 322421, 327506, 333599, 340425, 347570, 355038, 363289, 372848, 383856, 395921, 408466, 421443, 435531, 451375, 468768, 486923, 505494, 524866, 545443, 567127, 589695, 613241, 637932, 663544, 689480, 715132, 740113, 764362]
63222G64362K3842K3972K4445K4903K5213K5364K5178K4453K3269K1741J9585
63211A026327J6317J1900O785J379m213r959j5714k1231k6036k9458l1228l1883
63199H92986l2036l1433k9458k6479k3816k2049k0221j7192j3132r083n545k267
63187F60275R43L921O609R163J1528J3498J5164J6852J8494J9537J9720J9490
63175H15194J9392J9335J8858J7944J7143J6855J6846J6520J5415J3222R696M943
63163A001363k91n044r077j2974j7207k1419k4931k7605k9748l1349l2041l1782
63151G57895l1072l0343k9535k8409k6834k4674k1882j8932j6580j4866j2910
63140E01858j0229p767o855p340p628o610m871l714l627m078m338m053l240k258
$$ y = [764362, 788204, 812176, 836621, 861524, 886737, 912101, 937279, 961732, 985001, 1006742, 1026327, 1042644, 1054544, 1061329, 1062708, 1058495, 1048536, 1032822, 1011591, 985555, 956097, 924869, 892986, 860950, 829517, 800059, 773580, 749764, 727715, 707494, 690302, 677170, 668087, 662542, 660275, 661218, 665139, 671748, 680911, 692439, 705937, 721101, 737953, 756447, 775984, 795704, 815194, 834586, 853921, 872779, 890723, 907866, 924721, 941567, 958087, 973502, 986724, 996420, 1001363, 1001072, 996028, 986951, 973977, 956770, 935351, 910420, 882815, 853067, 821718, 789677, 757895, 726823, 696480, 666945, 638536, 611702, 587028, 565146, 546214, 529634, 514768, 501858, 491629, 483862, 477007, 469667, 462039, 455429, 450558, 446844, 443217, 439139, 434801, 430748, 427508, 425250]
63126D25250j649j585j501o56Q79K175K477J994J489J422J709K171K716L180L311
63111D43382L097K841K805K895K815K396J691R94Q16J511K678L240K507J041N6
63096D74765J07O92J139J338J546J907K402K929L168K685J477K57j12N90J854
63081D96744K967L522L598L686M279N288O043O113N971O528Q011R705J0854J1440
63067E84749J1920J2485J2986J3442J4196J5466J7062J8814K1007K4037K7709
63056G73873L1314L4461L7395M0297M2829M4773M6764M9638N3215N6363N8319
63045A269241N9366O0018O0200N9638N8631N7969N8217N9355O0924O2320O3039
63034A928918O2936O2047O0164N6835N1861M5432L7564K7916J6412L725r269k2157
$$ y = [425250, 423601, 422016, 420515, 419859, 420738, 422913, 425390, 427384, 428873, 430295, 432004, 434175, 436891, 440071, 443382, 446479, 449320, 452125, 455020, 457835, 460231, 461922, 462916, 463732, 465243, 467921, 471161, 473668, 474709, 474765, 474872, 475564, 476703, 478041, 479587, 481494, 483896, 486825, 489993, 492678, 494155, 494412, 494300, 494890, 496744, 499711, 503233, 506831, 510517, 514796, 520084, 526127, 532240, 538211, 544739, 552750, 562455, 573309, 584749, 596669, 609154, 622140, 635582, 649778, 665244, 682306, 701120, 722127, 746164, 773873, 805187, 839648, 877043, 917340, 960169, 1004942, 1051706, 1101344, 1154559, 1210922, 1269241, 1328607, 1388625, 1448825, 1508463, 1567094, 1625063, 1683280, 1742635, 1803559, 1865879, 1928918, 1991854, 2053901, 2114065, 2170900, 2222761, 2268193, 2305757, 2333673, 2350085, 2353810, 2344541, 2322384]
63022B322384l4709m6277n6072o3842o9770p3801p5582p5094p2848o9352o4774
63011A620263n9186n2794m5792l8268l0409k2562j5055q048j603M257R596J4544
62999A374943J9186K3457K7078K9637L1038L1855L2868L4075L4640L4183L3550
62988A706510L3743L4372L3876L1156K6428K0574J4306P860R99o852j5903k5474
62976A861595l4575m2859n0441n6940o1560o4160o5439o5790o4839o2464n9455
62965A233073n6595n3682n0019m5541m0869l6659l3238l0631k8500k6388k4314
62954H06637k2771k1780k0631j8973j7598j7347j7738j7546j6433j5126j4106
62943F06588j3085j1915j1062j0796j0628j0032r191q552q019p122n828m648l969
$$ y = [2322384, 2287675, 2241398, 2185326, 2121484, 2051714, 1977913, 1902331, 1827237, 1754389, 1685037, 1620263, 1561077, 1508283, 1462491, 1424223, 1393814, 1371252, 1356197, 1348149, 1346546, 1350803, 1360399, 1374943, 1394129, 1417586, 1444664, 1474301, 1505339, 1537194, 1570062, 1604137, 1638777, 1672960, 1706510, 1740253, 1774625, 1808501, 1839657, 1866085, 1886659, 1900965, 1908825, 1909824, 1902972, 1887069, 1861595, 1827020, 1784161, 1733720, 1676780, 1615220, 1551060, 1485621, 1419831, 1354992, 1292528, 1233073, 1176478, 1122796, 1072777, 1027236, 986367, 949708, 916470, 885839, 857339, 830951, 806637, 783866, 762086, 741455, 722482, 704884, 687537, 669799, 652253, 635820, 620694, 606588, 593503, 581588, 570526, 559730, 549102, 539070, 529879, 521327, 513308, 506186, 500358, 495710, 491741]
62930D91741l617l198k600j997j513j121q85j026j576k127k220j930j782k020
62916D64129k346k425k253j879j227n35m42j216k223k731k884l311m021m376m094
62901D28166l538l055k715k695l200l789l556k355j154p80q46m67M26J117J181
62886D02740R13P46P52P33N20J92J08O37J558K030J457K90l90j2J005J830J950
62869D17059J413O47N8l47q70j546j928j682j122p35n31k65o2j58k30K02P72N83
62851D11258k99o53J67J227J392R11P08P89M71j86l49J22M17P6m33o98r50j209
62833D12761r12J0N82J40n43l50N30J072J062J128J414J447J326J822K938L515
62817D27942K821J752J753L114M809N636N143L922L338M444O752Q566Q881Q431
$$ y = [491741, 488124, 484926, 482326, 480329, 478816, 477695, 476810, 475784, 474208, 472081, 469861, 467931, 466149, 464129, 461783, 459358, 457105, 455226, 453999, 453464, 453022, 451806, 449583, 446852, 443968, 440657, 436636, 432260, 428166, 424628, 421573, 418858, 416163, 412963, 409174, 405618, 403263, 402109, 401329, 400483, 400016, 400442, 401559, 402740, 403653, 404399, 405151, 405884, 406404, 406596, 406704, 407341, 408899, 410929, 412386, 412676, 412286, 412274, 413279, 415109, 417059, 418472, 419119, 419177, 418830, 417960, 416414, 414486, 412804, 411682, 410947, 410416, 410151, 410089, 409931, 409701, 409903, 410675, 411258, 410959, 410306, 410473, 411700, 413092, 414003, 414711, 415500, 415971, 415785, 415436, 415558, 415975, 416051, 415618, 414920, 413970, 412761, 411849, 411859, 412441, 412581, 412038, 411688, 412218, 413290, 414352, 415480, 416894, 418341, 419667, 421489, 424427, 427942, 430763, 432515, 434268, 437382, 442191, 447827, 452970, 456892, 460230, 464674, 471426, 479992, 488873, 497304]
62803D97304Q409Q939R451R900J0608J1400J1899J2431J3581J4974J5677J5843
62791F40416J6845J9372K2528K5355K8286L2253L7077M1784M6121N0784N6217
62780A017038O2057O7907P3924Q0227Q6214R0895R3776R5093R5236R4103R1008
62769A947478Q5170P6305O4826N1431L6603K0631M094j2027k6967m0775n3859
62758B152910o5891p5597q1969q5473q7537q8922q9108q7432q4228q0407p6348
62747A249998p1847o6940o2166n7826n3550m8872m3932l9339l5488l2222k9127
62736G08689k6045k3239k0992j9063j6800j3982j1249r374q268p172n753m494
62724E42258l898l751l356k220m11J483K741L235L860N725Q759J1590J3088J3654
$$ y = [497304, 505713, 514652, 524103, 534003, 544611, 556011, 567910, 580341, 593922, 608896, 624573, 640416, 657261, 676633, 699161, 724516, 752802, 785055, 822132, 863916, 910037, 960821, 1017038, 1079095, 1147002, 1220926, 1301153, 1387367, 1478262, 1572038, 1667131, 1762367, 1856470, 1947478, 2032648, 2108953, 2173779, 2225210, 2261813, 2282444, 2286538, 2274511, 2247544, 2206769, 2152910, 2087019, 2011422, 1929453, 1843980, 1756443, 1667521, 1578413, 1490981, 1406753, 1326346, 1249998, 1178151, 1111211, 1049045, 991219, 937669, 888797, 844865, 805526, 770038, 737816, 708689, 682644, 659405, 638413, 619350, 602550, 588568, 577319, 567945, 559677, 552505, 546752, 542258, 538360, 534609, 531253, 529033, 528622, 530105, 532846, 536081, 539941, 545666, 554425, 566015, 579103, 592757]
62710E92757J4586J6484J8801K0832K2687K5120K8668L3091L7660M1944M6142
62699H98772N0579N5109N9390O3558O8033P2544P5973P7414P6922P4918P1322
62688A644534O5723N8045M8529L7349K4677J1048k772j6170k8726m0112n0148
62677A751977n8781o5754p0646p3500p4954p5369p4340p1641o8113o4828o1618
62666I92433n7433n2091m6776m2625l9517l6595l3328k9817k6522k3960k2290
62655E81479k0906j8930j6201j3511j1685j0863j0706j0752j0415r334q006p448
62643D32722p785p844o687m965l951l760l470k732k133j863j143M52J932J994
62629C90767P92k77m17k46o16j329j553j023k57L42R14J649K354K807L168L736
$$ y = [592757, 607343, 623827, 642628, 663460, 686147, 711267, 739935, 773026, 810686, 852630, 898772, 949351, 1004460, 1063850, 1127408, 1195441, 1267985, 1343958, 1421372, 1498294, 1573212, 1644534, 1710257, 1768302, 1816831, 1854180, 1878857, 1889905, 1887133, 1870963, 1842237, 1802125, 1751977, 1693196, 1627442, 1556796, 1483296, 1408342, 1332973, 1258633, 1186992, 1118879, 1054051, 992433, 935000, 882909, 836133, 793508, 753991, 717396, 684068, 654251, 627729, 603769, 581479, 560573, 541643, 525442, 511931, 500246, 489383, 478677, 467925, 457510, 448176, 440170, 432722, 424937, 417093, 410406, 405441, 401490, 397730, 394260, 391528, 389395, 387532, 386389, 386841, 388773, 390767, 391559, 391282, 390865, 390619, 390003, 388674, 387121, 386098, 385841, 386183, 387097, 388746, 391100, 393907, 397075, 400811]
62613D00811M485N140N509N639N757O237P341Q768R830J0363J1055J2508J4457
62600E07900J6419J8660K1664K5032K7950L0621L4084L8402M2207M4441M5552
62589H52932M6273M6311M5023M2563L9234L4422K7417J9023J0995L917l196j0948
62577A153966j8416k4479k9338l3864l8059m0963m2002m1682m0926m0080l8855
62566G65302l6929l4401l1680k9057k6602k4405k2614k1093j9315j6900j4135
62555D88171j1673r877q727q138p894p450o357m901l833l348k875k032j227j018
62541D08821j271j322p65J91R72J122P30M55Q85J779K362K415K578L315M243M887
62525D31397N598O995Q884J0510J1749J3314J5662J8440K1193K4040K7251L0620
$$ y = [400811, 405296, 410436, 415945, 421584, 427341, 433578, 440919, 449687, 459517, 469880, 480935, 493443, 507900, 524319, 542979, 564643, 589675, 617625, 648246, 682330, 720732, 762939, 807380, 852932, 899205, 945516, 990539, 1033102, 1072336, 1106758, 1134175, 1153198, 1164193, 1168110, 1164914, 1153966, 1135550, 1111071, 1081733, 1047869, 1009810, 968847, 926845, 885163, 844237, 804157, 765302, 728373, 693972, 662292, 633235, 606633, 582228, 559614, 538521, 519206, 502306, 488171, 476498, 466621, 457894, 449756, 441862, 434412, 428055, 423154, 419321, 415973, 413098, 411066, 409839, 408821, 407550, 406228, 405463, 405654, 406626, 407748, 408478, 408933, 409818, 411597, 413959, 416374, 418952, 422267, 426510, 431397, 436995, 443990, 452874, 463384, 475133, 488447, 504109, 522549, 543742, 567782, 595033, 625653]
62513F25653L3685L6317L8702M0904M2747M4032M4534M3818M1397L7182L1650
62502A060621K5418J8814J1800M316l445j0956j7533k2649k6181k8416k9742l0319
62490I51728l0033k8754k6599k3893k0893j7655j4172j0550o996l665n56K474
62478G70436N586Q775J1744J4029J5313J5612J5050J3572J1047P624L860L85k547
62465H90486n173q009j1509j5749k0237k4108k6702k8030k8621k8901k8837k8147
62453F36463k6674k4474k1768j8953j6543j4757j3281j1605r607p556n630l770
62441D61845k091q97j64N97J605K322K244J820J918K479K374Q51j519l556m722
62426D65106n264n586n923o410p053p606p800p630p272o774o090n331m768m611
$$ y = [625653, 659338, 695655, 734357, 775261, 818008, 862040, 906574, 950392, 991789, 1028971, 1060621, 1086039, 1104853, 1116653, 1120969, 1117524, 1106568, 1089035, 1066386, 1040205, 1011789, 982047, 951728, 921695, 892941, 866342, 842449, 821556, 803901, 789729, 779179, 772183, 768518, 767962, 770436, 776022, 784797, 796541, 810570, 825883, 841495, 856545, 870117, 881164, 888788, 892648, 893033, 890486, 885313, 877304, 865795, 850046, 829809, 805701, 778999, 750969, 722348, 693447, 664610, 636463, 609789, 585315, 563547, 544594, 528051, 513294, 500013, 488408, 478801, 471245, 465615, 461845, 459754, 458857, 458693, 459290, 460895, 463217, 465461, 467281, 469199, 471678, 474052, 474903, 473384, 469828, 465106, 459842, 454256, 448333, 441923, 434870, 427264, 419464, 411834, 404562, 397788, 391698, 386367, 381599, 376988]
62412C76988m821n120n066m412l487k979l118l280k750j683r32r62j365j458j011
62397C34544k62N28J255J868K253K273J932J486J266J331J441J429J407J490J583
62382C55824J713K232L289M331M672M440M422M972N651O060O434P166Q193R267
62368D28666J0379J1616J2829J3846J4792J5832J6901J7962J9346K1435K4208
62357F07812K7430L1103L5281L9547M3144M5582M6721M6325M4082M0179L5301
62346A042507K9914K3925J7350J0762M717r74o880j2987j8624k3293k7104l0267
62334A009046l2556l3574l3346l2398l1199k9754k7742k5005k1828j8787j6372
62323G06485j4751j3779j3206j2840j2650j2801j3483j4598j5672j6219j6182
$$ y = [376988, 372167, 367047, 361981, 357569, 354082, 351103, 347985, 344705, 341955, 340272, 339340, 338378, 337013, 335555, 334544, 334282, 334810, 336065, 337933, 340186, 342459, 344391, 345877, 347143, 348474, 349915, 351344, 352751, 354241, 355824, 357537, 359769, 363058, 367389, 372061, 376501, 380923, 385895, 391546, 397606, 404040, 411206, 419399, 428666, 439045, 450661, 463490, 477336, 492128, 507960, 524861, 542823, 562169, 583604, 607812, 635242, 666345, 701626, 741173, 784317, 829899, 876620, 922945, 967027, 1007206, 1042507, 1072421, 1096346, 1113696, 1124458, 1129175, 1128201, 1121321, 1108334, 1089710, 1066417, 1039313, 1009046, 976490, 942916, 909570, 877172, 845973, 816219, 788477, 763472, 741644, 722857, 706485, 691734, 677955, 664749, 651909, 639259, 626458, 612975, 598377, 582705, 566486, 550304]
62312E50304j5873j5526j5065j4326j3301j2157j1164j0564j0241r570p997n898
62300D08622m406m063m102l530k455j720j480j057j61O22Q91J108J719K313K329
62285C94630K079K311L054L638L752L744L905M073M062L926L696L353L130L410
62271D42763M158M962N650O486P602Q760R844J1116J2786J4714J6836J9435K2677
62258E87789K6180K9460L2509L5639L8937M2185M5108M7426M8739M8583M6549
62247A029104M2407L6478K9789K3397J7292J0567K911m697j1241j7031k3023k9267
62235A106686l4828l9157m2616m5502m7327m7433m5812m3086l9921l6728l3601
62224F50675l0388k6967k3588k0717j8525j6769j5196j3795j2606j1568j0582
$$ y = [550304, 534431, 518905, 503840, 489514, 476213, 464056, 452892, 442328, 432087, 422517, 414520, 408622, 404216, 400153, 396051, 392521, 390066, 388346, 386866, 385809, 385648, 386270, 387161, 388269, 389988, 392301, 394630, 396709, 399020, 402074, 405712, 409464, 413208, 417113, 421186, 425248, 429174, 432870, 436223, 439353, 442763, 446921, 451883, 457533, 464019, 471621, 480381, 490225, 501341, 514127, 528841, 545677, 565112, 587789, 613969, 643429, 675938, 711577, 750514, 792699, 837807, 885233, 933972, 982555, 1029104, 1071511, 1107989, 1137778, 1161175, 1178467, 1189034, 1191945, 1187248, 1176007, 1158976, 1135953, 1106686, 1071858, 1032701, 990085, 944583, 897256, 849823, 804011, 760925, 721004, 684276, 650675, 620287, 593320, 569732, 549015, 530490, 513721, 498525, 484730, 472124, 460556, 449974]
62213D49974r484q005o087m313l518l785m200l846k791j793j342j282j191q12
62199C97525j14P71J640K362K994L682M479N304O057O695P273P829Q289Q542Q696
62184D72024R162J0189J1390J2049J1909J1423J1058J0677R930R009Q658R324
62172E96802J0663J2047J3348J4889J6794J8882K1307K4713K9220L3610L6338
62161H28613L7261L7611L7965L7153L3756K8049K1687J5830J0392M915o56o109
62149A086467j1118j5277j8530k1591k5195k8842l1149l1600l1091l0429k9184
62138H12461k6714k3496k0530j7892j4838j1204p821n411l860k681j653o19P52
62125F76494K622M555N956O810P725R127J0578J1098J0088P866N303L095J457
$$ y = [449974, 440490, 432485, 426398, 422085, 418567, 414782, 410582, 406736, 403945, 402152, 400810, 399528, 398337, 397525, 397411, 398182, 399822, 402184, 405178, 408860, 413339, 418643, 424700, 431395, 438668, 446497, 454786, 463328, 472024, 481186, 491375, 502765, 514814, 526723, 538146, 549204, 559881, 569811, 578820, 587478, 596802, 607465, 619512, 632860, 647749, 664543, 683425, 704732, 729445, 758665, 792275, 828613, 865874, 903485, 941450, 978603, 1012359, 1040408, 1062095, 1077925, 1088317, 1093232, 1092576, 1086467, 1075349, 1060072, 1041542, 1019951, 994756, 965914, 934765, 903165, 872074, 841645, 812461, 785747, 762251, 741721, 723829, 708991, 697787, 689966, 684555, 680695, 678014, 676361, 675742, 676494, 679116, 683671, 689627, 696437, 704162, 713289, 723867, 734965, 745053, 752919, 758222, 761317, 762774]
62112G62774L11m34q27j005j336k357m312o690q502r319r716j0337j0840j0336
62098F87074q692o708m953l093o49K146M577O087O531O159N648N754O591P522
62084G13994P954P897P652P381P270P638Q614R967J1482J3090J4468J5130J5166
62071H47703J5344J6001J6506J6273J5833J6167J7361J8636J9408J9727J9856
62060A038815K0019K0356K0606K0034J8195J5498J2531R216N283J175k392n506
62048A173830q892j2763j6701k0521k4364k7902l0385l1698l2546l3382l3899
62037I00777l3788l3291l2624l1562k9916k7972k6020k3986k1790j9604j7496
62026F02728j5326j3200j1538j0465r624q769q040p491o955o607o876p552p711
$$ y = [762774, 763085, 762651, 761824, 760819, 759483, 757126, 752814, 746124, 737622, 728303, 718587, 708250, 697410, 687074, 678382, 671674, 666721, 663628, 662979, 665125, 669702, 675789, 682320, 688479, 694127, 699881, 706472, 713994, 721948, 729845, 737497, 744878, 752148, 759786, 768400, 778367, 789849, 802939, 817407, 832537, 847703, 863047, 879048, 895554, 911827, 927660, 943827, 961188, 979824, 999232, 1018959, 1038815, 1058834, 1079190, 1099796, 1119830, 1138025, 1153523, 1166054, 1175270, 1180553, 1181728, 1179336, 1173830, 1164938, 1152175, 1135474, 1114953, 1090589, 1062687, 1032302, 1000604, 968058, 934676, 900777, 866989, 833698, 801074, 769512, 739596, 711624, 685604, 661618, 639828, 620224, 602728, 587402, 574202, 562664, 552199, 542575, 533806, 525766, 518275, 511320, 504713, 497837, 490285, 482574]
62013D82574o991o144n710n051l559k065j898k854l318k383p71M88J304K051K691
61998D48364K956K945K929K876K614K273K060J689N61j370l290m384m762n243
61984D50218o342p761q862r321r153q510p662o959o453n824m894m042l702l693
61970C57040l536l189k907k546j698n68P4k0j93J33P17J024R53O73K35j48M2J010
61952C47096K184K875L120L522M418N607O657P237P351P532Q440J0109J1924J3549
61938D41621J5243J7009J8129J8211J8067J8710J9851K0177J9046J7110J5365
61927F38539J4187J3303J2143J0216P637N177L415J961Pk575n236p479r009r411
61913F72875q504o854n125l020K28M348P972J0298J1795J3045J3782J3665J3048
$$ y = [482574, 475583, 469439, 463729, 458678, 455119, 453054, 451156, 448302, 444984, 442601, 441830, 442318, 443622, 445673, 448364, 451320, 454265, 457194, 460070, 462684, 464957, 467017, 468706, 469267, 467897, 464607, 460223, 455461, 450218, 443876, 436115, 427253, 417932, 408779, 400269, 392607, 385648, 379195, 373371, 368477, 364435, 360733, 357040, 353504, 350315, 347408, 344862, 343164, 342596, 342670, 342650, 342457, 342590, 343307, 344331, 345284, 345957, 346192, 346044, 346086, 347096, 349280, 352155, 355275, 358797, 363215, 368822, 375479, 382716, 390067, 397599, 406039, 416148, 428072, 441621, 456864, 473873, 492002, 510213, 528280, 546990, 566841, 587018, 606064, 623174, 638539, 652726, 666029, 678172, 688388, 696025, 701202, 704617, 706578, 706585, 704010, 698774, 691295, 682286, 672875, 664371, 657517, 652392, 649372, 649600, 653948, 661920, 672218, 684013, 697058, 710840, 724505, 737553]
61900G37553J2322J1060Q565M956J062k431n326p622r429j0981j2369j3352j3723
61887G00285j3659j3461j3270j3177j3219j2998j1835r843q342q515r848j0644
61875E61474j0037q860q340q557q585p759o404n307m764m331l456k158q60L00
61861D82356J562K934L968M506N256P105J0002J2985J5324J7177J9073K1183K3201
61848F26632K4812K5983K6902K7645K7995K7633K6508K4818K2512J9207J4804
61837H95451R899N181P11l709p646j0220j1174j1173j0831r945q017n031j423
61824H32073K318N689Q183R785J1054J2244J2522J0741O861K040k717p360j2106
61811H91327j6646k0461k3500k6003k7930k8908k8692k7415k5509k3614k2272
$$ y = [737553, 749875, 760935, 769500, 774456, 775518, 773087, 767761, 760139, 750710, 739729, 727360, 714008, 700285, 686626, 673165, 659895, 646718, 633499, 620501, 608666, 598823, 590481, 581966, 572118, 561474, 551437, 542577, 534237, 525680, 517095, 509336, 502932, 497625, 492861, 488530, 485074, 482916, 482056, 482356, 483918, 486852, 490820, 495326, 500582, 507687, 517689, 530674, 545998, 563175, 582248, 603431, 626632, 651444, 677427, 704329, 731974, 759969, 787602, 814110, 838928, 861440, 880647, 895451, 905350, 910531, 911242, 907533, 899887, 889667, 878493, 867320, 856489, 846544, 838527, 833496, 832073, 834391, 840080, 848263, 858048, 869102, 881346, 893868, 904609, 911470, 913510, 910793, 903433, 891327, 874681, 854220, 830720, 804717, 776787, 747879, 719187, 691772, 666263, 642649, 620377]
61800F20377k1351k0030j7696j4798j2364j0829r778q750p751o910o119n245m355
61787D74401l558k935k675k939l392l301k361j134m25n02j108j899k621l038l074
61772D39439k776k136j210n19p66j831k533j953n33O22J210J760K480K849K355
61757D36458J106l72j421j398j86J363K026J470M59k39o55j166j810k328k560
61742D30747k511k329k294k525k666k196j192l84k53n00n35j98K77O48P74O32
61726D15495L93K59J45j46l93L1J307K792L658L667L108K354J755J561J724J968
61710D39678K189K347J969M19j967l762l974l214k714k768k863k924l379m113
61696D14924m379l905l300l063k878k323j677j476j666j700j398j184j377j678
$$ y = [620377, 599026, 578996, 561300, 546502, 534138, 523309, 513531, 504781, 497030, 490120, 484001, 478756, 474401, 470843, 467908, 465233, 462294, 458902, 455601, 453240, 452106, 451681, 451179, 450071, 448172, 445551, 442513, 439439, 436663, 434527, 433317, 432798, 432032, 430201, 427668, 425715, 425182, 425804, 427014, 428774, 431254, 434103, 436458, 437564, 437192, 435771, 434373, 434187, 435550, 437576, 439046, 439505, 439266, 438611, 437445, 435635, 433307, 430747, 428236, 425907, 423613, 421088, 418422, 416226, 415034, 414650, 414397, 413897, 413362, 413164, 413441, 414089, 414863, 415495, 415888, 416147, 416292, 416146, 415753, 415784, 417091, 419883, 423541, 427208, 430316, 432670, 434425, 435986, 437710, 439678, 441867, 444214, 446183, 446602, 444635, 440873, 436899, 433685, 430971, 428203, 425340, 422416, 419037, 414924, 410545, 406640, 403340, 400277, 397399, 395076, 393399, 391923, 390257, 388557, 387159, 385975, 384598, 382920]
61682C82920j568j081q67j384k220k454j668m03M46N31K57J97M48N41j4j035j708
61665C70938j485p43j83J75Q20J643J882J355Q99J075J299Q54J18j21Qk11p45
61648C77578r05n75l08j71M36J627K673L120L362L668L533K571J351O69M70K00
61632C99299k76o98j078j683k459l056l293l248k969k523k124j919j771j586j557
61617C69059j748j724j123m46o01j689k771k973k413j886k001k783l782m430m433
61602C34256l998l586l495l697l941l880l310k622k681l796n023n081l945k827
61588B82374k530k560k119j292p23p00j101j849k765l265k841j780q85m97l42
61573B57125k25l04o27r21r91q76n67LN70O22P2o02j035j306j430j114l27M04
$$ y = [382920, 381352, 380271, 379404, 378020, 375800, 373346, 371678, 371275, 371721, 372252, 372509, 372706, 373154, 373695, 373681, 372646, 370938, 369453, 368710, 368527, 368702, 369522, 371165, 373047, 374402, 375301, 376376, 377675, 378529, 378647, 378526, 378534, 378323, 377578, 376673, 376098, 375790, 375619, 376055, 377682, 380355, 383475, 386837, 390505, 394038, 396609, 397960, 398629, 399099, 399299, 399023, 398325, 397247, 395564, 393105, 390049, 386756, 383508, 380539, 378016, 375892, 373973, 372202, 370616, 369059, 367311, 365587, 364464, 364018, 363417, 361728, 358957, 355984, 353571, 351685, 349684, 346901, 343119, 338689, 334256, 330258, 326672, 323177, 319480, 315539, 311659, 308349, 305727, 303046, 299250, 294227, 289146, 285201, 282374, 279844, 277284, 275165, 273873, 273150, 272450, 271349, 269500, 266735, 263470, 260629, 258849, 257964, 257467, 257125, 256900, 256596, 255969, 255048, 254057, 253181, 252614, 252617, 253187, 253809, 253881, 253279, 252244, 250938, 249508, 248394, 248067, 248471]
61555B48471O97Q23J104J265R87O05N77O32K69k01k9O75J016P85P88J417J842
61538B61723J268J87l49j36K85P18J407K173K301J508M28j45j46j85p67j742k503
61521B66025k614k214j715j303r52q60j289j944k036j314n41m39o60m02K68N46
61505B48556J88j13J67O41O72K95O1K61O43P49K87o59j657k191k044j397o11j0
61487B43838K67L57O05J105J495J393R48O28N71N66N92Q87J405J743J723J632
61471B59755J654J512R61K86o6q1j17l68p12r00p10q1O84J018O89J35k1L42Q70
61452B64850J238J305R50J71o18q56m52J30N00P45J096J517J883K255K610K483
61436B79807J433l2n83N31K452L532L079J897J116J058J355J684J910J844J364
$$ y = [248471, 249168, 249991, 251095, 252360, 253347, 253952, 254529, 255161, 255430, 255229, 255200, 255875, 256891, 257676, 258464, 259881, 261723, 262991, 263178, 262829, 262693, 262978, 263696, 265103, 267276, 269577, 271085, 271513, 271368, 271222, 271037, 270270, 268528, 266025, 263411, 261197, 259482, 258179, 257227, 256367, 255078, 253134, 251098, 249784, 249243, 248804, 248144, 247742, 248010, 248556, 248744, 248631, 248798, 249439, 250111, 250406, 250467, 250728, 251371, 252120, 252407, 251748, 250091, 247900, 245856, 244459, 243848, 243838, 244105, 244462, 245067, 246172, 247667, 249060, 250008, 250636, 251207, 251773, 252365, 253252, 254657, 256400, 258123, 259755, 261409, 262921, 263882, 264168, 264102, 264021, 263904, 263536, 262824, 261924, 261214, 261133, 261817, 262835, 263524, 263659, 263638, 263980, 264850, 266088, 267393, 268343, 268514, 267896, 267040, 266588, 266718, 267218, 267963, 269059, 270576, 272459, 274714, 277324, 279807, 281240, 281208, 280625, 281156, 283608, 287140, 290219, 292116, 293232, 294290, 295645, 297329, 299239, 301083, 302447]
61421C02447P75O31J105J810K222K176J889J669J623J609J473J350J455J588J179
61406C25001R6j028j617j921k418k880k686j932j443j626k033k182k141k005j508
61391B97677n44M12Q35P66N99N98R02J540K136K051J234N33O84J337J597J182
61375C13539N64J93J93O22J437K199K377J961J437J182J241J559J976K066J552
61360C34098Q28N85Q95J169J113J140J657K506L418M477N712O622O632N868N027
61345C81747M564M324M004L593L319L372L736M144M223L851L417L461M040M594
61331D36389M519L728K599J503N11n13j642k657l110k693j650o77k76k74j38L19
61315D35938Q21J140J364J650K006K586L772N610P328P979P604P414Q526J0695
$$ y = [302447, 303222, 303853, 304958, 306768, 308990, 311166, 313055, 314724, 316347, 317956, 319429, 320779, 322234, 323822, 325001, 325097, 324069, 322452, 320531, 318113, 315233, 312547, 310615, 309172, 307546, 305513, 303331, 301190, 299185, 297677, 297133, 297545, 298380, 299146, 299745, 300343, 301245, 302785, 304921, 306972, 308206, 308739, 309423, 310760, 312357, 313539, 314103, 314296, 314489, 315111, 316548, 318747, 321124, 323085, 324522, 325704, 326945, 328504, 330480, 332546, 334098, 334926, 335511, 336406, 337575, 338688, 339828, 341485, 343991, 347409, 351886, 357598, 364220, 370852, 376720, 381747, 386311, 390635, 394639, 398232, 401551, 404923, 408659, 412803, 417026, 420877, 424294, 427755, 431795, 436389, 440908, 444636, 447235, 448738, 449249, 448736, 447094, 444437, 441327, 438634, 436984, 436307, 436031, 435757, 435619, 435938, 436759, 437899, 439263, 440913, 442919, 445505, 449277, 454887, 462215, 470194, 477798, 485212, 493738, 504433]
61301E04433J2440J2377J0450P876N943M860L845K284M86q89j744k477l214l705
61287E52965l935m325n149o153o910p190o887o024m973m288m018l536k345p88
61273D86444L31O04K79j15j53K99J023J646K011K179K178K044K153K964M294N285
61257E13466N431N112M896M794M602M406M222L593K286R80O05J107J596J547J201
61242E59844Q18K82m62j176j712k180k588k734k556k265k077k143k622l393l718
61227E31318k791p26J412K707L160L331L686M397N353O191O604O703O769O803
61213E84917O662O585O915P352P126O080M960M361M077L770L669M056M601M782
61199F59913M735N121O258P793R150J0022J0498J0882J1302J1449J0934R870Q742
$$ y = [504433, 516873, 529250, 539700, 547576, 553519, 558379, 562224, 564508, 564994, 564105, 562361, 559884, 556670, 552965, 549030, 544705, 539556, 533403, 526493, 519303, 512416, 506392, 501419, 497131, 493113, 489577, 487232, 486444, 486775, 487379, 487658, 487543, 487390, 487689, 488712, 490358, 492369, 494548, 496726, 498770, 500923, 503887, 508181, 513466, 518897, 524009, 528905, 533699, 538301, 542707, 546929, 550522, 552808, 553788, 554393, 555500, 557096, 558643, 559844, 560662, 560944, 560482, 559306, 557594, 555414, 552826, 550092, 547536, 545271, 543194, 541051, 538429, 535036, 531318, 528527, 527801, 529213, 531920, 535080, 538411, 542097, 546494, 551847, 558038, 564642, 571345, 578114, 584917, 591579, 598164, 605079, 612431, 619557, 625637, 630597, 634958, 639035, 642805, 646474, 650530, 655131, 659913, 664648, 669769, 676027, 683820, 692970, 702992, 713490, 724372, 735674, 747123, 758057, 767927, 776669]
61186G76669P614O057M011K184J200Q25M92Q6k37o56j510k700l810m631n194n485
61170G74915n560n752o306p031p621q087q505q682q538q522r001r623r884j0058
61156F61745j0691j1455j1396j0376r242q487p652o365n107m443m220m043l959
61143E64309m183m618n092n625o076o063n658n576o057o170m952k799r63qM28
61128E00897P03R63J644L182N134O626P748R412J1651J3183J3357J3449J5040
61115F02989J7806K0010K0838K1128K1894K3111K4163K4664K4490K3578K2124
61104H46795K0590J9214J7787J6117J4358J2626J0560P617L781k42l545n705p112
61091I52841q602j0664j2954j4786j5990j6916j7678j7954j7712j7614j8171j8875
$$ y = [776669, 784283, 790340, 794351, 796535, 797735, 798560, 799052, 799138, 798901, 798245, 796735, 794035, 790225, 785594, 780400, 774915, 769355, 763603, 757297, 750266, 742645, 734558, 726053, 717371, 708833, 700311, 691310, 681687, 671803, 661745, 651054, 639599, 628203, 617827, 608585, 600098, 592446, 586081, 580974, 576531, 572311, 568268, 564309, 560126, 555508, 550416, 544791, 538715, 532652, 526994, 521418, 515361, 509191, 504239, 501440, 500477, 500469, 500897, 501600, 502563, 504207, 507389, 512523, 519149, 526897, 536309, 547960, 561143, 574500, 587949, 602989, 620795, 640805, 661643, 682771, 704665, 727776, 751939, 776603, 801093, 824671, 846795, 867385, 886599, 904386, 920503, 934861, 947487, 958047, 965664, 969445, 969203, 965658, 959953, 952841, 944239, 933575, 920621, 905835, 889845, 872929, 855251, 837297, 819585, 801971, 783800, 764925]
61079G64925j8766j7696j6432j5488j4501j3015j1341j0120r341q386p046n883
61067F16910n349n005m111k690j416n29M37J694K723L194L718N004O639P582P718
61052F36519Q006R098J0608J2012J3382J4879J6217J7183J8099J9310K0666K1994
61040H17973K3618K5798K8149L0187L2089L4326L6860L9366M1906M4731M7600
61029A202603N0036N2057N3976N5696N7049N8687O1837O6990P3530Q0756Q8562
61018A901779R7071J06287J16345J27683J40979J57506J79430K08893K46908K94260
61008C577141L53680M30175N28786O52646Q02508R75683J164270J355830J535729
60999A1376448J684384J768479J740666J562625J241376Q44611M72800K07047
$$ y = [764925, 746159, 728463, 712031, 696543, 682042, 669027, 657686, 647566, 638225, 629839, 622793, 616910, 611561, 606556, 602445, 599755, 598339, 597810, 598247, 599941, 602664, 605858, 609576, 614580, 621219, 628801, 636519, 644525, 653623, 664231, 676243, 689625, 704504, 720721, 737904, 756003, 775313, 795979, 817973, 841591, 867389, 895538, 925725, 957814, 992140, 1029000, 1068366, 1110272, 1155003, 1202603, 1252639, 1304696, 1358672, 1414368, 1471417, 1530104, 1591941, 1658931, 1732461, 1813217, 1901779, 1998850, 2105137, 2221482, 2349165, 2490144, 2647650, 2827080, 3035973, 3282881, 3577141, 3930821, 4360996, 4889782, 5542428, 6344936, 7320619, 8484889, 9840719, 11376448, 13060832, 14829311, 16569977, 18132602, 19373978, 20218589, 20691389, 20898436]
60991B0898436P5572N9067J14108J84680K02080R8100j60096n41096r59009j318914
60981A8652928j561136j673971j677848j603711j480590j331586j173366j017328
60973G133392q71442p40966o27976n31749m50497l82684l26918k81533k44683
60964B674944k14596j89618j68417j50169j34274j20049j06998r5139q4570p4883
60954A336231o5656n7346n0962m6826m4177m2073m0021l7724l4957l1898k9006
60943H55585k6375k3743k1241j9484j8588j7750j6313j4714j3866j3905j4151
60932F55455j4121j3959j3818j3371j2207j0464q834p907p642p542p219o698o160
60919E25513n693n417n537o013o285n778m577l300k332j586j033j011j759k919
$$ y = [20898436, 20974008, 21033075, 21147183, 21331863, 21533943, 21632043, 21471947, 20930851, 19971842, 18652928, 17091792, 15417821, 13739973, 12136262, 10655672, 9324086, 8150720, 7133392, 6261950, 5520984, 4893008, 4361259, 3910762, 3528078, 3201160, 2919627, 2674944, 2460348, 2270730, 2102313, 1952144, 1817870, 1697821, 1590823, 1495684, 1411114, 1336231, 1270575, 1213229, 1162267, 1115441, 1071264, 1029191, 989170, 951446, 916489, 884591, 855585, 829210, 805467, 784226, 764742, 746154, 728404, 712091, 697377, 683511, 669606, 655455, 641334, 627375, 613557, 600186, 587979, 577515, 568681, 560774, 553132, 545590, 538371, 531673, 525513, 519820, 514403, 508866, 502853, 496568, 490790, 486213, 482913, 480581, 478995, 477962, 476951, 475192, 472273]
60905D72273l767l818l149k216j444r23n02j18R3J54L78Q46R92K48j070j944j817
60888D54216j033k00M05O85N62K07J7P5mm45r09r84p08k48N40J804L177M104M625
60869D65886N327O382P173P120O633O778P996R542J0413J0451J0151R652Q694
60856E72198P645P644R130J0925J1598J1277J1169J1590J1706J1163J0736J0966
60844F97747J1292J1149J0957J1227J1532J1281J0841J0836J0823R845Q102O916
60832H22548O896P153O611N150L167Q78j462l316m556n883p912j0226j1962j3101
60818G93985j4336j5786j6676j6564j6102j6081j6269j5912j5074j4683j5119
60807F21383j5507j4857j3354j1957j1043j0093q713p302o511o422o610o703o606
$$ y = [472273, 468506, 464688, 461539, 459323, 457879, 456956, 456454, 456336, 456429, 456583, 456961, 457807, 458799, 459047, 457977, 456033, 454216, 453183, 452983, 453388, 454073, 454635, 454842, 454859, 454934, 454930, 454485, 453576, 452592, 451884, 451636, 452176, 453980, 457157, 461261, 465886, 471213, 477595, 484768, 491888, 498521, 505299, 513295, 522837, 533250, 543701, 553852, 563504, 572198, 579843, 587487, 596617, 607542, 619140, 630417, 641586, 653176, 664882, 676045, 686781, 697747, 709039, 720188, 731145, 742372, 753904, 765185, 776026, 786862, 797685, 807530, 815632, 822548, 829444, 836597, 843208, 848358, 851525, 852403, 850941, 847625, 843069, 837186, 829274, 819048, 807086, 793985, 779649, 763863, 747187, 730623, 714521, 698440, 682171, 666259, 651185, 636502, 621383, 605876, 591019, 577665, 565708, 554665, 544572, 535859, 528557, 522046, 515624, 509014, 502311, 495705]
60794D95705o294n672m741l738l060k917l089l175l131l309l763l868l100j974
60780D43874j569k128k775k729k247k001k103k178k112k154k487k981l331l228
60766D09851k598j838j586k066k873l570m144m633m760m348l751l448l374l137
60752C63725k692k389k410k525k365j716o67L04O38L26k0K9J75K4k03j52j16o53
60734C49313j586k178k167j968j833j535r46k47N25J464K156J846N74n67p50m15
60718C41686m65r96j495j850k407l085l261k717k203k621l856m753m361k965j743
60703C02908j437j653j578j083p38r14j335j572j562j513j593j840k111j994j166
60688B80819Q5R89J150R76J031J321J494J462J465J707K190K804L303L299K618
$$ y = [495705, 489411, 483739, 478998, 475260, 472200, 469283, 466194, 463019, 459888, 456579, 452816, 448948, 445848, 443874, 442305, 440177, 437402, 434673, 432426, 430425, 428322, 426144, 424032, 421878, 419391, 416410, 413079, 409851, 407253, 405415, 403829, 401763, 398890, 395320, 391176, 386543, 381783, 377435, 373684, 370236, 366862, 363725, 361033, 358644, 356234, 353709, 351344, 349628, 348961, 349265, 349903, 350229, 350209, 350238, 350413, 350437, 350234, 350082, 349966, 349313, 347727, 345549, 343382, 341414, 339581, 338046, 337100, 336853, 337378, 338842, 340998, 342844, 343418, 342851, 342101, 341686, 341221, 340225, 338730, 336880, 334473, 331388, 328127, 325410, 323207, 320586, 316730, 311977, 307616, 304651, 302908, 301471, 299818, 298240, 297157, 296419, 295505, 294170, 292598, 291036, 289523, 287930, 286090, 283979, 281985, 280819, 280904, 281893, 283043, 284019, 285050, 286371, 287865, 289327, 290792, 292499, 294689, 297493, 300796, 304095, 306713]
60673C06713J636J022J098J574J942J982J866J856J969K004J899J865K010K066
60659C31502J768J392J438J870K154K055J935K094K386K694L208L896M226L864
60645C66482L225K781K267J191k05j216j731k297l144l857m117m135m173m124
60631C46947l820l357k853k259j645j311j431j740j847j602j070l79K19L90P3
60616C24315m36q46j126j319j341j142q21m07J80P79R18M28j77l05j32k54o51
60599C17663n87K77J291J639J410J300J516J557J078M52K15K77J20m20r32r95
60583C25861o88m61o67j257j753j572n04R69K102K657L043L712M663N627O447
60568C48179P076P565Q250R488J0896J1238R722P100M851L405J961P7j538k214
$$ y = [306713, 308349, 309371, 310469, 312043, 313985, 315967, 317833, 319689, 321658, 323662, 325561, 327426, 329436, 331502, 333270, 334662, 336100, 337970, 340124, 342179, 344114, 346208, 348594, 351288, 354496, 358392, 362618, 366482, 369707, 372488, 374755, 375946, 375741, 374525, 372794, 370497, 367353, 363496, 359379, 355244, 351071, 346947, 343127, 339770, 336917, 334658, 333013, 331702, 330271, 328531, 326684, 325082, 324012, 323633, 323852, 324242, 324315, 323879, 323033, 321907, 320588, 319247, 318105, 317284, 316877, 317057, 317836, 318754, 319182, 319005, 318700, 318568, 318314, 317663, 317076, 317353, 318644, 320283, 321693, 322993, 324509, 326066, 327144, 327596, 327811, 328088, 328208, 327788, 326856, 325861, 325173, 324712, 324045, 322788, 321035, 319463, 318959, 319928, 322030, 324687, 327730, 331442, 336105, 341732, 348179, 355255, 362820, 371070, 380558, 391454, 402692, 412414, 419514, 424365, 427770, 429731, 429808, 428270, 426056]
60554D26056k466l237m442n101m648l390j725K59K281L624L975M050M905O685
60540D26826Q497R557J0054J0710J1667J2124J1231R100O734M945L553J842m63
60527E26377k787m308m726m467m227m396m731m625l796k689k016j869j565n18
60513D79657R60J968K078J809J994K832L727M111M249N099P337J0568J3702J6047
60499E56138J7913K0071K2870K6071K9294L2318L4844L6358L6362L4689L1471
60488H78399K6947K1342J4740P035j785j1153j9907k7043l2360l6182l8635l9530
60476G41868l8847l6945l4248l0983k7383k3834k0712j8256j6590j5572j4618
60465D63880j3098j1137r606r039q900q227o752n027l744l314l809m801n357m858
$$ y = [426056, 423590, 420353, 415911, 410810, 406162, 402772, 401047, 401306, 403587, 407211, 411186, 415236, 420141, 426826, 435323, 444880, 454934, 465644, 477311, 489435, 500666, 509766, 516500, 521445, 524998, 526840, 526377, 523590, 519282, 514556, 510089, 505862, 501466, 496735, 492110, 488314, 485625, 483609, 481740, 480175, 479657, 480617, 482585, 484663, 486472, 488466, 491298, 495025, 499136, 503385, 508484, 515821, 526389, 540091, 556138, 574051, 594122, 616992, 643063, 672357, 704675, 739519, 775877, 812239, 846928, 878399, 905346, 926688, 941428, 948463, 946678, 935525, 915618, 888575, 856215, 820033, 781398, 741868, 703021, 666076, 631828, 600845, 573462, 549628, 528916, 510660, 494070, 478498, 463880, 450782, 439645, 430039, 421000, 412100, 403873, 397121, 392094, 388350, 385036, 381227, 376426, 371069, 366211]
60451C66211l770l110l205l423l201k576j700n84L85M11o50j738j793j106q26
60436C39325j303j718j342m92L8j3k66k94n8K11K89J73P1J36K42P8m39r78j007
60417C32653k74Q67J701J875J826K206K893L041K200R76K18L4k8j38j57j64l28
60400C49401l64J71J056J545J483J532K036K326J686N01j46K66J267K050K143
60385C66953J644J114J188J928K711K965K818K724K670K260J449P35N48P98J160
60370C93665J459J681J800J757J512J094P13P47J351K079K172J371K71k30K15
60355D11657J216K154K765L247L937M960O129P114P612P487O850O036N320M626
60341D81110L600K087L64j158k330l299m237n129n756n784n073l966l140k989
$$ y = [366211, 362441, 359331, 356126, 352703, 349502, 346926, 345226, 344642, 345027, 345438, 344788, 343050, 341257, 340151, 339325, 338022, 336304, 334962, 334470, 334508, 334495, 334229, 333935, 333877, 334088, 334377, 334550, 334621, 334757, 334999, 335077, 334638, 333660, 332653, 332379, 333246, 334947, 336822, 338648, 340854, 343747, 346788, 348988, 349964, 350182, 350216, 350188, 350050, 349893, 349729, 349401, 349037, 349208, 350264, 351809, 353292, 354824, 356860, 359186, 360872, 361373, 361227, 361493, 362760, 364810, 366953, 368597, 369711, 370899, 372827, 375538, 378503, 381321, 384045, 386715, 388975, 390424, 391159, 391707, 392505, 393665, 395124, 396805, 398605, 400362, 401874, 402968, 403681, 404428, 405779, 407858, 410030, 411401, 411672, 411442, 411657, 412873, 415027, 417792, 421039, 424976, 429936, 436065, 443179, 450791, 458278, 465128, 471164, 476484, 481110, 484710, 486797, 487161, 486003, 483673, 480374, 476137, 471008, 465252, 459468, 454395, 450429, 447289, 444300]
60327D44300l309l658l812l715l291k598k045k019k356k497k188j729j479j364
60313D08240r94p9J341K943M358N422O240P032P927R048J0570J2507J4468J5817
60299E04840J6086J5097J2841R503N515J385k614o421r913j2787j4648j5115j4085
60286D89684j2088j0196r153q643p816o411n043m334m229m250m082l716l284k923
60272D03516k656k353j995j851k135k536k519k143k028k420k781k618k196k041
60258C71244k063j805j287j041j261j428r95j07N96P54O62Q66J526K249K477J994
60242C72381J100L72K47O54J009P46km42m0Q52J509J738J834J906J789J544J467
60225C88664J552J479J231J160J338J398J284J519K367L266L576L428L335L351
$$ y = [444300, 440991, 437333, 433521, 429806, 426515, 423917, 421872, 419853, 417497, 415000, 412812, 411083, 409604, 408240, 407246, 407167, 408508, 411451, 415809, 421231, 427471, 434503, 442430, 451478, 462048, 474555, 489023, 504840, 520926, 536023, 548864, 558367, 563882, 565267, 562653, 556232, 546319, 533532, 518884, 503769, 489684, 477596, 467400, 458247, 449604, 441788, 435377, 430334, 426000, 421771, 417521, 413439, 409723, 406439, 403516, 400860, 398507, 396512, 394661, 392526, 389990, 387471, 385328, 383300, 380880, 378099, 375481, 373285, 371244, 369181, 367376, 366089, 365048, 363787, 362359, 361364, 361257, 361853, 362607, 363269, 364135, 365661, 367910, 370387, 372381, 373481, 373853, 374100, 374754, 375763, 376509, 376507, 376065, 376025, 376877, 378386, 380124, 381958, 383864, 385653, 387197, 388664, 390216, 391695, 392926, 394086, 395424, 396822, 398106, 399625, 401992, 405258, 408834, 412262, 415597, 418948]
60211D18948L201L015L242L954M710N149N307N350N356N359N280M952M375L922
60197D82120L953M291M403M001L233K373J588J020P62P11O36M11P9l00p51j435
60181E07095k485l654m201l629k538k181k898l647l441k680k419k852l268l174
60167D64028k681j964j164p43j126j990k567k696k865l146k911j849n53K31M12
60152D38416L26K28L72J036K082K851K936K673K597K718K747K722K906L301L647
60137D71558L844M009M155M111L768L270K862K659K588K485K281K048J803J430
60123E12871Q60K57j85m25m00J41J170K020J950J088K95J26L49N76P58R40J009
60106E23400Q84O22K16l37p99r16r43j327j898k022j709j757k434k846k183r37
$$ y = [418948, 422149, 425164, 428406, 432360, 437070, 442219, 447526, 452876, 458232, 463591, 468871, 473823, 478198, 482120, 486073, 490364, 494767, 498768, 502001, 504374, 505962, 506982, 507744, 508455, 509091, 509502, 509581, 509281, 508530, 507095, 504610, 500956, 496755, 493126, 490588, 488407, 485509, 481862, 478421, 475741, 473322, 470470, 467202, 464028, 461347, 459383, 458219, 457476, 456350, 454360, 451793, 449097, 446232, 443086, 440175, 438326, 437773, 438004, 438416, 438742, 438970, 439342, 440378, 442460, 445311, 448247, 450920, 453517, 456235, 458982, 461704, 464610, 467911, 471558, 475402, 479411, 483566, 487677, 491445, 494715, 497577, 500236, 502824, 505309, 507590, 509638, 511441, 512871, 513731, 513988, 513803, 513378, 512978, 513119, 514289, 516309, 518259, 519347, 519642, 519768, 520117, 520693, 521451, 522391, 523400, 524284, 524906, 525122, 524785, 523986, 523070, 522127, 520800, 518902, 516880, 515171, 513414, 510980, 508134, 505951, 505014]
60090E05014k24l28o41o02q1R05K071K692K280J391J129J833K777L175K911K244
60074E26546J358M26l46r81j748k769l819m709n589o588p328p159o016m773m445
60059D72060n047n612n424m863m683m873m790m225l572k991k198j168l33J72O88
60044D23141J292J615J736K303L309L703K923J918J767K170K282K255K657L035
60030D56106K464J222M47K55l24j556k601l083l663m688n593o086o562o840n927
60015D13571l857k388k720l637l277j825r58j199j474j115p92j154j780j931j503
60000C83961q21j46K96K75r0l38k06J46M92P33P89P50J071K064L165L383K652
59983C98176K065K452L277L423K594J496Q73Q19Q79M75n76j758k241j789j030
$$ y = [505014, 504790, 504462, 503821, 503219, 503138, 504043, 506114, 508806, 511086, 512477, 513606, 515439, 518216, 521391, 524302, 526546, 527904, 528330, 527984, 527003, 525255, 522486, 518667, 513958, 508369, 501781, 494453, 487294, 481278, 476505, 472060, 467013, 461401, 455977, 451114, 446431, 441558, 436768, 432543, 428971, 425980, 423782, 422614, 422281, 422453, 423141, 424433, 426048, 427784, 430087, 433396, 437099, 440022, 441940, 443707, 445877, 448159, 450414, 453071, 456106, 458570, 459792, 460239, 460494, 460170, 458614, 456013, 452930, 449267, 444579, 438986, 432900, 426338, 419498, 413571, 409714, 407326, 404606, 400969, 397692, 395867, 394909, 393710, 392236, 391121, 390329, 389175, 387395, 385464, 383961, 383140, 382994, 383290, 383565, 383475, 383137, 382931, 383077, 383569, 384302, 385091, 385841, 386912, 388976, 392141, 395524, 398176, 400241, 402693, 405970, 409393, 411987, 413483, 414356, 415175, 416054, 416529, 415953, 414195, 411954, 410165, 409135]
59968D09135n78k93J74N30K36m08l91O65J912K304J779J113R63J373J952K167
59952D22633J664O65j32k61m7r2m08m49J0M49K55m97j127j080m68Q7M5o01j467
59933D19179k327l251m096m230l194j515l05k3j52j44j18l28m88j56N54J164J472
59916D02042J600J555J357J496K625M591O294O839O483O173O327O442N902M843
59902D64569L972L640L335K344P83l72m41J22L03k66j051j406j202o83r2L99O77
59885D74631Q58J236J879K388K304J721J324J703K737L695M003L750L368K990
59871E08587K395J520O48n4p94j733k608l077l168l102k866k339j627r29k06O49
59855D91296J479K118K798L858N219O530P696Q644Q743P214M263J135j101k290
$$ y = [409135, 408557, 408264, 408438, 408968, 409204, 408796, 408405, 409070, 410982, 413286, 415065, 416178, 417141, 418514, 420466, 422633, 424297, 424962, 424830, 424569, 424522, 424430, 424022, 423573, 423583, 424032, 424287, 423790, 422663, 421583, 421115, 421202, 421247, 420646, 419179, 416852, 413601, 409505, 405275, 402081, 400566, 400261, 400238, 400086, 399942, 399824, 399496, 399008, 398852, 399406, 400570, 402042, 403642, 405197, 406554, 408050, 410675, 415266, 421560, 428399, 434882, 441055, 447382, 453824, 459726, 464569, 468541, 472181, 475516, 477860, 478643, 478271, 477830, 477952, 478255, 477989, 476938, 475532, 474330, 473647, 473555, 473954, 474631, 475489, 476725, 478604, 480992, 483296, 485017, 486341, 488044, 490781, 494476, 498479, 502229, 505597, 508587, 510982, 512502, 513150, 513096, 512302, 510569, 507961, 504884, 501716, 498614, 495748, 493409, 491782, 490853, 490647, 491296, 492775, 494893, 497691, 501549, 506768, 513298, 520994, 529638, 538381, 545595, 549858, 550993, 549892, 547602]
59841E47602k596k007q71k13q48k472m179n541o651p346p213o334n527n470n891
59826D84443n819m689l023j994k144k706k492j416o71j183k389l021k649j854
59812D48393j134m16K76M90Q1k75J26R80J312Q02J26j47m76j606l326m530m545
59795D36131l786k996k394j936j841k324l027l364l231k929k528j877j222j085
59781D01591j490j829j709j353j057p53l97k14k33l4N74J141J231J134J419K024
59765D00045K366K163J693J291J078J112J382J648J558J120Q10J194K425M042
59751D23927N143N004L792K566K338L215M525N563O010N833N183M363L643L072
59737D84177K570K136J797J459R87L64k22m49n5P96J429J299P03M45P46R67N91
$$ y = [547602, 545006, 542999, 542128, 541915, 541067, 538595, 534416, 528875, 522224, 514878, 507665, 501331, 495804, 490334, 484443, 478624, 473935, 470912, 468918, 466774, 464068, 461576, 460160, 459489, 458306, 455917, 452896, 450247, 448393, 447259, 446843, 447119, 447609, 447690, 447415, 447541, 448521, 449833, 450635, 450761, 450614, 450138, 448532, 445206, 440676, 436131, 432345, 429349, 426955, 425019, 423178, 420854, 417827, 414463, 411232, 408303, 405775, 403898, 402676, 401591, 400101, 398272, 396563, 395210, 394153, 393400, 393003, 392789, 392556, 392522, 393096, 394237, 395468, 396602, 398021, 400045, 402411, 404574, 406267, 407558, 408636, 409748, 411130, 412778, 414336, 415456, 416266, 417460, 419885, 423927, 429070, 434074, 437866, 440432, 442770, 445985, 450510, 456073, 462083, 467916, 473099, 477462, 481105, 484177, 486747, 488883, 490680, 492139, 493126, 493490, 493268, 492819, 492764, 493560, 494989, 496288, 496991, 497436, 498182, 499149, 499740]
59720D99740j14o46r74j250j383j376j598k147k375j664l82O10J097J436J594
59705D90568J204M71K25P57J409J488J097P19N20M09M03N90R06J249J596J856
59689E05467J760J085k4r92j131k23J105J825J565R76P77P89L73m79j165j437
59673E10271j704k311l094l733m046l842l040k103j834k467l319l593l189k586
59659D69410k219k141k029j467m21N96J112J308J638K021K018J728J789K360K774
59644D78477K446J541N45k95q52j073j306k051l089l518l058k609l010l788l810
59629D54550k719j151J50Q02O99J8q16j546k267k908l027k531k086k268k732k872
59613D29296k778k818k728k054j189r19j076p42J99P95N92L28O35R33L53q79j705
$$ y = [499740, 499626, 498980, 498006, 496756, 495373, 493997, 492399, 490252, 487877, 486213, 485831, 486441, 487538, 488974, 490568, 491772, 492243, 492468, 493225, 494634, 496122, 497219, 497938, 498458, 498867, 499270, 499860, 500766, 502015, 503611, 505467, 507227, 508312, 508288, 507296, 506165, 505942, 507047, 508872, 510437, 511413, 512190, 512979, 513352, 512873, 511708, 510271, 508567, 506256, 503162, 499429, 495383, 491541, 488501, 486398, 484564, 482097, 478778, 475185, 471996, 469410, 467191, 465050, 463021, 461554, 461133, 461729, 462841, 464149, 465787, 467808, 469826, 471554, 473343, 475703, 478477, 480923, 482464, 483009, 482714, 481862, 480789, 479483, 477432, 474343, 470825, 467767, 465158, 462148, 458360, 454550, 451831, 450680, 450830, 451632, 452331, 452349, 451533, 449987, 447720, 444812, 441785, 439254, 437168, 434900, 432168, 429296, 426518, 423700, 420972, 418918, 417729, 416810, 415734, 414992, 415191, 415986, 416578, 416906, 417541, 418474, 418827, 417948, 416243]
59596D16243j515o37J70L10k59q80p14K71J200J396J125Q34K92q14j952k253j769
59579D11048j341j336j377j344j729k619l211k813j826j131r72j011j055j074
59565C88209q12o5P40Q98M15L3J61M23M52N36J030J598J569Q63J18n8L97J207
59547C97714K150L119L985M544M706M801N497P170R325J1007J1894J2621J3753
59534D92286J4733J4206J1254O238N86l951o288o669o339o286o367n814m280k110
59520D91199O8J683K368K184J546O80n21j829k508k362k374l472n073n844n601
59505D70144n309n398n349n041n159n795n903m803l233k213j754j486j646k440
59491D14615l118k723j371J26J453K688L379K923J733J047J416K164K443K114
$$ y = [416243, 414728, 414091, 414261, 414571, 414312, 413432, 412718, 412989, 414189, 415585, 416710, 417544, 417836, 417022, 415070, 412817, 411048, 409707, 408371, 406994, 405650, 403921, 401302, 398091, 395278, 393452, 392321, 391349, 390338, 389283, 388209, 387397, 387332, 388072, 388970, 389385, 389418, 389579, 390002, 390454, 390990, 392020, 393618, 395187, 396050, 396168, 396110, 396507, 397714, 399864, 402983, 406968, 411512, 416218, 421019, 426516, 433686, 443011, 454018, 465912, 478533, 492286, 507019, 521225, 532479, 538717, 539303, 535352, 529064, 522395, 516056, 509770, 503403, 497589, 493309, 491199, 491267, 492950, 495318, 497502, 499048, 499728, 499207, 497378, 494870, 492508, 490134, 486662, 481589, 475745, 470144, 464835, 459437, 454088, 449047, 443888, 438093, 432190, 427387, 424154, 421941, 420187, 418701, 417055, 414615, 411497, 408774, 407403, 407529, 408982, 411670, 415049, 417972, 419705, 420752, 422168, 424332, 426775, 428889]
59477D28889J520J078J193K015L098L740L753L464L110K673K241J940J585R73
59463D61272M94P28J455J778J372R12J095J894L012M350N696O549O738O690O763
59448E10798O723O323N915N911N986N348L659J315j097l224m889n950o308n974
59434E24536n185m480m414n029n751n911n268l987k449j168m75n6R37K913N231
59419D89444O917P878R040J1206J4134J6802J8487J9406K0257K1101K0817J7926
59407F73415J2092M749j900o388q592r169q701p315m959j902R93K541J846j205
59393F45505n818j0669j4635j7382j9147j9904j9133j6701j3587j1081r437p974
59381D80037o453n522n505n566m681k934j265k13M53J050J581K005K393K688K684
$$ y = [428889, 430409, 431487, 432680, 434695, 437793, 441533, 445286, 448750, 451860, 454533, 456774, 458714, 460299, 461272, 461766, 462494, 463949, 465727, 467099, 468011, 469106, 471000, 474012, 478362, 484058, 490607, 497345, 504035, 510798, 517521, 523844, 529759, 535670, 541656, 547004, 550663, 551978, 550881, 547657, 542768, 536818, 530510, 524536, 519351, 514871, 510457, 505428, 499677, 493766, 488498, 484511, 482062, 480894, 480419, 480363, 481300, 484213, 489444, 496361, 504239, 513279, 524485, 538619, 555421, 573908, 593314, 613571, 634672, 655489, 673415, 685507, 690256, 688356, 681968, 673376, 664207, 655506, 648191, 643232, 641330, 642323, 644864, 646710, 645505, 639687, 629018, 614383, 597001, 577854, 557950, 538817, 522116, 508529, 497448, 488011, 480037, 473584, 468062, 462557, 456991, 452310, 449376, 448111, 447898, 448351, 449401, 450982, 452987, 455380, 458068, 460752]
59366D60752K424K299K640L336L994M306M263M120M219M648N107N309N509O350
59352E19276P982R676J0589J0822J1236J2259J3255J3412J2810J2215J2029J2073
59340F57634J2255J2731J3164J2612J0638P972N545L303P14k024m161n650p187
59327G17546q960j0270j0648j0587j0713j0894j0694j0102r397q717q215q157
59315F00192q336p868o212m071k692k305j910n69J564L632N120O397Q222J0814
59301F01978J3377J4640J3865J1096O680J101m586r020j1626j2944j3510j3036
59289E98015j1258q951p276o458n952n491n132m500l087j280j01K74P69J852K697
59274E44121K474J751J879L281N098O334O801O950P154P354P205O481N317M013
$$ y = [460752, 463176, 465475, 468115, 471451, 475445, 479751, 484014, 488134, 492353, 497001, 502108, 507417, 512926, 519276, 527258, 536934, 547523, 558345, 569581, 581840, 595095, 608507, 621317, 633532, 645561, 657634, 669889, 682620, 695784, 708396, 719034, 727006, 732551, 735854, 736568, 734544, 730383, 724733, 717546, 708586, 698316, 687668, 677081, 666368, 655474, 644780, 634678, 625281, 616564, 608349, 600192, 591856, 583988, 577776, 573705, 571013, 568708, 566798, 566229, 567793, 571425, 576545, 582942, 591164, 601978, 615355, 629995, 643860, 654956, 661636, 662737, 658151, 649131, 637505, 624561, 611051, 598015, 586757, 577806, 570530, 564072, 558120, 552629, 547497, 542997, 539910, 538630, 538529, 538803, 539572, 541424, 544121, 546595, 548346, 550225, 553506, 558604, 564938, 571739, 578689, 585843, 593197, 600402, 606883, 612200, 616213]
59260F16213K662J162n24k322m146n808o882p120o912o926p253p365o986o446
59246E51347o017n462m526l445k584j918j214m67J76O18P02K91k12P8J420K778
59230E31565K858J701N57K58L77R9p55j834k882l839m570m992n247n500n613n327
59214D96856m763m393m404m299l404j734j48M81J56l01j84M51J110J586K076K598
59198D81684K712K130J350J228J878K454K305J877J999K571K746K332K170K791
59184E12227L582L832L873M331M787M322L171K589K962L164K287R94N34J125K052
59169E55832K811L326L497L272L012L113L444L699M042M679N046M281K495P84
59155F03333j52o88j338j951k237k479l136m104m832n041m874m545m188l950l945
$$ y = [616213, 618875, 620037, 619513, 617191, 613045, 607237, 600355, 593235, 586323, 579397, 572144, 564779, 557793, 551347, 545330, 539868, 535342, 531897, 529313, 527395, 526181, 525714, 525890, 526508, 527210, 527501, 527289, 527367, 528787, 531565, 534423, 536124, 536681, 536939, 537316, 537415, 536660, 534826, 531944, 528105, 523535, 518543, 513296, 507796, 502183, 496856, 492093, 487700, 483296, 478997, 475593, 473859, 473711, 474192, 474348, 474047, 473863, 474314, 475424, 477010, 479086, 481684, 484396, 486526, 487876, 489104, 490982, 493436, 495741, 497618, 499617, 502188, 504934, 507266, 509436, 512227, 515809, 519641, 523514, 527845, 532632, 536954, 540125, 542714, 545676, 548840, 551127, 552121, 552655, 553780, 555832, 558643, 561969, 565466, 568738, 571750, 574863, 578307, 582006, 586048, 590727, 595773, 600054, 602549, 603333, 603181, 602493, 601155, 599204, 596967, 594488, 591352, 587248, 582416, 577375, 572501, 567956, 563768, 559818, 555873]
59140E55873m069m065l739l066k232j629j570j863j965j719j658k256l093l248
59126E19701k413j248m81j05L78J170J953K427K797L532M726N864O404O455O602
59111E57762P091P467P225O484N668M766L453J972J266J850K966L366K820K267
59097F16423K383K628K075P68l37o48n71p24j131j470j703j998k263k315k318
59082F08799k617l108l334l247l393m115n043n659n964o192o278o056n794n936
59068E42063o326o297n599m814m557m607m179k962j553r00j400k527l255k948
59054D90139j973j384j867k988l580k947j536m39l17q58j278j127o26k64k38l22
59038D68395k07J29M42N98P78J165J587J707J610J785K382K873K874K961M007
$$ y = [555873, 551804, 547739, 544000, 540934, 538702, 537073, 535503, 533640, 531675, 529956, 528298, 526042, 522949, 519701, 517288, 516040, 515559, 515454, 515832, 517002, 518955, 521382, 524179, 527711, 532437, 538301, 544705, 551160, 557762, 564853, 572320, 579545, 586029, 591697, 596463, 599916, 601888, 603154, 605004, 607970, 611336, 614156, 616423, 618806, 621434, 623509, 624277, 623940, 623292, 622721, 621997, 620866, 619396, 617693, 615695, 613432, 611117, 608799, 606182, 603074, 599740, 596493, 593100, 588985, 583942, 578283, 572319, 566127, 559849, 553793, 547999, 542063, 535737, 529440, 523841, 519027, 514470, 509863, 505684, 502722, 501169, 500269, 498869, 496342, 493087, 490139, 488166, 486782, 484915, 481927, 478347, 475400, 473864, 473425, 473108, 472250, 470972, 469845, 469219, 468955, 468717, 468395, 468188, 468317, 468759, 469357, 470135, 471300, 472887, 474594, 476204, 477989, 480371, 483244, 486118, 489079, 493086]
59023D93086N829P264P751Q071R105J0520J1324J1186J0485R358P581N367L474
59010F00401K294J423L85o94j380j471j033k49N44R52R06P19O79Q38J281K130
58994F07725L170L827L780L294K766K217J493N73m49j446k157k396k466k878l470
58979F13583l429k430j191m00K11J198K420L436M365N542O732P577Q452R868J1320
58964F67254J1784J1334J1060J1297J1090R775Q042O804N924M727L097J333n67
58951G62954k759n041o993q491r679j0660j1520j2281j2684j2365j1465j0540
58939F48476r701q534p121o295o434o733o362n549m806l890k514j327r96q90k6
58924E77298J031P69q08j893j420m61m37j143j460j118p06n18l62k16k55k35M08
$$ y = [493086, 498915, 506179, 513930, 522001, 531106, 541626, 552950, 564136, 574621, 583979, 591560, 596927, 600401, 602695, 604118, 604503, 603809, 602429, 600958, 599925, 599676, 600220, 601172, 602078, 602797, 603476, 604314, 605595, 607725, 610895, 614722, 618502, 621796, 624562, 626779, 628272, 628845, 628396, 626950, 624793, 622397, 619931, 617053, 613583, 610154, 607724, 606533, 606133, 606344, 607542, 609962, 613398, 617763, 623305, 630037, 637614, 646066, 655934, 667254, 679038, 690372, 701432, 712729, 723819, 733594, 741636, 748440, 754364, 759091, 762188, 763521, 762954, 760195, 755154, 748161, 739670, 729991, 719331, 707811, 695530, 682846, 670481, 659016, 648476, 638775, 630241, 623120, 616825, 610391, 603658, 597296, 591747, 586941, 583051, 580537, 579210, 578214, 577324, 577298, 578329, 579098, 578290, 576397, 574977, 574516, 574079, 572936, 571476, 570358, 569652, 569134, 568772, 568556, 568301, 568066, 568474]
58907E68474J821L462M664N282N784O790Q388R894J0574J0529J0463J0569J0318
58894F67012R500Q765Q757R282R914J0766J2037J3261J3808J3885J4211J4829
58882H06027J5029J4440J3440J2311J0740Q416N611K776m0k932n627p709r140
58869H63342j0203j1010j1419j1447j1348j1139j0458r189q024p868q640r182
58857G43415q611p429o824p190p838q112q112q205q380q399q170p680o912o096
58843F35457n655n657n652n382n182n356n575n419n161n346n899o283o412o589
58829E55889o655n961m413k862k081j872j546q59p0O51J413K291L124L675L858
58814E44582L808L775L963M397M979N487N530M709L115J519O83O27P58O01P8q13
$$ y = [568474, 570295, 573757, 578421, 583703, 589487, 596277, 604665, 614559, 625133, 635662, 646125, 656694, 667012, 676512, 685277, 694034, 703316, 713230, 723996, 736033, 749294, 763102, 776987, 791198, 806027, 821056, 835496, 848936, 861247, 871987, 880403, 886014, 888790, 888750, 885818, 880191, 872482, 863342, 853139, 842129, 830710, 819263, 807915, 796776, 786318, 777129, 769105, 761237, 752597, 743415, 734804, 727375, 720551, 713361, 705523, 697411, 689299, 681094, 672714, 664315, 656145, 648465, 641553, 635457, 629802, 624145, 618493, 613111, 607929, 602573, 596998, 591579, 586418, 581072, 575173, 568890, 562478, 555889, 549234, 543273, 538860, 535998, 533917, 532045, 530499, 529640, 529570, 530221, 531634, 533925, 537049, 540724, 544582, 548390, 552165, 556128, 560525, 565504, 570991, 576521, 581230, 584345, 585864, 586547, 587174, 587932, 588533, 588611, 587798]
58798E87798k035l289m197m760n251n609n501m961m431m116l818l557l647l922
58784E28704l594k271n69P40J586K178K321J903J493J677K025J605L22j014j870
58769E35236k455k994l369l607m019m608m934m782m432m066l537k930k677k759
58755D84067k428j250Q2O17M42M33J015J783K314K646K895K913K576K075J765
58740E01945J892K553L649M808N536N540M953M225L901M253N022N616N722N513
58726E65128N081M134K631J365J281K299L375L745L476K925K375K273L064M402
58712F07554N246N145M798M887N019M513L567K806K069O31j509l516m932o170
58698F30108p692r415j1059j2375j2961j2587j1863j1740j2064j1536r645p655
$$ y = [587798, 585763, 582474, 578277, 573517, 568266, 562657, 557156, 552195, 547764, 543648, 539830, 536273, 532626, 528704, 525110, 522839, 522270, 523010, 524596, 526774, 529095, 530998, 532491, 534168, 536193, 537798, 538120, 537106, 535236, 532781, 529787, 526418, 522811, 518792, 514184, 509250, 504468, 500036, 495970, 492433, 489503, 486826, 484067, 481639, 480389, 480471, 481088, 481530, 481963, 482978, 484761, 487075, 489721, 492616, 495529, 498105, 500180, 501945, 503837, 506390, 510039, 514847, 520383, 525923, 530876, 535101, 539002, 543255, 548277, 553893, 559615, 565128, 570209, 574343, 576974, 578339, 579620, 581919, 585294, 589039, 592515, 595440, 597815, 600088, 603152, 607554, 612800, 617945, 622743, 627630, 632649, 637162, 640729, 643535, 645604, 646235, 644726, 641210, 636278, 630108, 622416, 613001, 601942, 589567, 576606, 564019, 552156, 540416, 528352, 516816, 507171, 499516]
58686D99516o928p066o649n318l981l278k939k731k914l463l749l400k838k560
58672D41702k365j752o54O25J901L105M103M830N444O030O352O205N794N442M977
58657D91739L849J872l76j977k471k202j949k176k674k972k974k922k831k366
58643D69570j479p37o98j213j669j734j509j114n40J01N95R48J399J980K347K240
58627D68487J907J848K185K456K123J210L52J88P00J354J829K378L327M423N031
58612D99798M877M342L956L846L775L563L240K844K276J477O38N1l05q12j625
58597E31941k206j812n08O33N90n28j688j965j209J29J511K645L619M681N802
58582E41635O547O659O549O872P611Q054P745P043O577O427O206N739N376N569
$$ y = [499516, 492588, 485522, 478873, 473555, 469574, 466296, 463357, 460626, 457712, 454249, 450500, 447100, 444262, 441702, 439337, 437585, 436931, 437556, 439457, 442562, 446665, 451495, 456939, 462969, 469321, 475526, 481320, 486762, 491739, 495588, 497460, 497084, 495107, 492636, 490434, 488485, 486309, 483635, 480663, 477689, 474767, 471936, 469570, 468091, 467354, 466656, 465443, 463774, 462040, 460531, 459417, 458877, 458978, 459573, 460521, 461920, 463900, 466247, 468487, 470394, 472242, 474427, 476883, 479006, 480216, 480568, 480756, 481456, 482810, 484639, 487017, 490344, 494767, 499798, 504675, 509017, 512973, 516819, 520594, 524157, 527397, 530241, 532517, 533994, 534632, 534683, 534378, 533566, 531941, 529735, 527923, 527415, 528048, 528638, 528110, 526422, 524457, 523248, 523377, 524888, 527533, 531152, 535833, 541635, 548182, 554841, 561390, 568262, 575873, 583927, 591672, 598715, 605292, 611719, 617925, 623664, 629040, 634609]
58568F34609O373P448Q465R456J0658J2134J3710J5382J7384J9609K1151K1034
58556G97413J9350J7209J5395J3587J1164Q190N200K372l75k756m216m727m879
58543H72927n088n292n597o613q657j1013j2642j3420j4137j5238j6159j6173
58531G42898j5359j4311j3204j1727r861q150o945n892m556l249k678k880l011
58518F41075k334r94L72J334J785J672J118N51L00J45k93q56j022p70o86j084
58502F40313j587j853k166k816l406l396l019k896k899k219p09O55J038Q25R45
58487F16810J559K149K519L021L827M662N441O553Q205R905J0954J1252J1275
58474F98132J1381J1424J0958R667P614N169K667J47k484m933o491o678n770m515
$$ y = [634609, 640982, 648430, 656895, 666351, 677009, 689143, 702853, 718235, 735619, 755228, 776379, 797413, 816763, 833972, 849367, 862954, 874118, 882308, 887508, 889880, 889505, 886749, 882533, 877806, 872927, 867839, 862547, 856950, 850337, 841680, 830667, 818025, 804605, 790468, 775230, 759071, 742898, 727539, 713228, 700024, 688297, 678436, 670286, 663341, 657449, 652893, 649644, 646966, 644086, 641075, 638741, 637747, 638119, 639453, 641238, 642910, 644028, 644579, 644879, 645024, 644731, 643875, 642853, 642083, 641397, 640313, 638726, 636873, 634707, 631891, 628485, 625089, 622070, 619174, 616275, 614056, 613347, 614002, 615040, 615865, 616810, 618369, 620518, 623037, 626058, 629885, 634547, 639988, 646541, 654746, 664651, 675605, 686857, 698132, 709513, 720937, 731895, 741562, 749176, 754345, 757012, 757159, 754675, 749742, 743251, 736573, 730803, 726288]
58460G26288l409k515j715q57L06J971L969N828P190P950Q043P370O074M623L366
58445G74482K175O21j454l671n353o035n851n407n153m898m128k788j398l33O25
58430G31434J831L142M120M663N069N641O542P843R309J0240J0059R062Q028P107
58416H24090N751L862K231J353N80q52k528l497l811m345n271n842n829n957o402
58401G93533o030m069j665o00q89q21O57K754M128M412M079L574L130K949L049
58386H08191L136K966K611K224J830J512J462J627J680J549J626K190K999L714
58372H39317M405N250O142O970P927R123J0121J0464J0407J0633J1330J2031J2343
58359I56463J2320J2150J1936J1838J1945J1982J1487J0356Q898P385N992N098
$$ y = [726288, 722879, 720364, 718649, 717792, 718098, 720069, 724038, 729866, 737056, 745006, 753049, 760419, 766493, 771116, 774482, 776657, 777278, 775824, 772153, 766800, 760765, 754914, 749507, 744354, 739456, 735328, 732540, 731142, 730809, 731434, 733265, 736407, 740527, 745190, 750259, 755900, 762442, 770285, 779594, 789834, 799893, 808955, 816983, 824090, 829841, 833703, 835934, 837287, 837867, 837015, 834487, 830990, 827179, 822834, 817563, 811721, 805892, 799935, 793533, 787503, 783434, 781769, 781169, 780280, 779459, 780116, 782870, 786998, 791410, 795489, 799063, 802193, 805142, 808191, 811327, 814293, 816904, 819128, 820958, 822470, 823932, 825559, 827239, 828788, 830414, 832604, 835603, 839317, 843722, 848972, 855114, 862084, 870011, 879134, 889255, 899719, 910126, 920759, 932089, 944120, 956463, 968783, 980933, 992869, 1004707, 1016652, 1028634, 1040121, 1050477, 1059375, 1066760, 1072752, 1077850]
58347A077850N035N439N494N044M916N791P234Q319Q878R468J0430J1522J2513
58334A177933J3521J4614J5524J5989J6138J6301J6611J7003J7408J7681J7413
58323A356136J6166J4043J1804J0234R487R195R030Q944Q941R018R324J0095J1241
58310A493658J2365J3341J4496J5992J7375J8136J8510J9188K0391K1680K2654
58299A687786K3389K4059K4606K4912K5095K5416K6074K7094K8249K9163K9741
58288A975584L0418L1641L3169L4328L5004L5899L7567L9632M1259M2203M3033
58277B379737M4397M6272M7965M8846M9092M9630N1148N3271N4955N5751N6338
58266B937402N7792O0563O4288O8286P2070P5546P8840Q1958Q4676Q6866Q8800
$$ y = [1077850, 1082885, 1088324, 1093818, 1098862, 1103778, 1109569, 1116803, 1125122, 1134000, 1143468, 1153898, 1165420, 1177933, 1191454, 1206068, 1221592, 1237581, 1253719, 1270020, 1286631, 1303634, 1321042, 1338723, 1356136, 1372302, 1386345, 1398149, 1408383, 1417870, 1427065, 1436095, 1445039, 1453980, 1462998, 1472322, 1482417, 1493658, 1506023, 1519364, 1533860, 1549852, 1567227, 1585363, 1603873, 1623061, 1643452, 1665132, 1687786, 1711175, 1735234, 1759840, 1784752, 1809847, 1835263, 1861337, 1888431, 1916680, 1945843, 1975584, 2006002, 2037643, 2070812, 2105140, 2140144, 2176043, 2213610, 2253242, 2294501, 2336704, 2379737, 2424134, 2470406, 2518371, 2567217, 2616309, 2665939, 2717087, 2770358, 2825313, 2881064, 2937402, 2995194, 3055757, 3120045, 3188331, 3260401, 3335947, 3414787, 3496745, 3581421, 3668287, 3757087]
58255C757087R0917R3381R6060R8856J01794J04982J08689J13239J18517J23891
58245D807413J29071J34738J41770J50038J58651J67160J75811J84815J94208
58236F243675K04406K16047K29114K43005K57532K73204K90353L08858L28842
58227H595036L50837L75030M01162M29350M60280M94364N31605N72466O18035
58218A2828165O69097P25943P89275Q60451R40694J031051J133127J248753J379068
58209B1605624J525320J690504J878597K092477K335086K613247K938472L324170
58201D0003497L785384M342497N022689N857561O883956Q149351R711432J1625219
58193I5381586J3924559J6602990J9589334K2722436K5744127K8310059K9985398
$$ y = [3757087, 3848004, 3941385, 4037445, 4136301, 4238095, 4343077, 4451766, 4565005, 4683522, 4807413, 4936484, 5071222, 5212992, 5363030, 5521681, 5688841, 5864652, 6049467, 6243675, 6448081, 6664128, 6893242, 7136247, 7393779, 7666983, 7957336, 8266194, 8595036, 8945873, 9320903, 9722065, 10151415, 10611695, 11106059, 11637664, 12210130, 12828165, 13497262, 14223205, 15012480, 15872931, 16813625, 17844676, 18977803, 20226556, 21605624, 23130944, 24821448, 26700045, 28792522, 31127608, 33740855, 36679327, 40003497, 43788881, 48131378, 53154067, 59011628, 65895584, 74044935, 83756367, 95381586, 109306145, 125909135, 145498469, 168220905, 193965032, 222275091, 252260489]
58186B52260489L0221409K8395967K4015968J7037609Q085187j642884j0769817
58179C47603928j8200574k3389268k6328394k7356658k6940883k5532010k3509459
58172A76346682k1176133j8764031j6436299j4291861j2377710j0704407r259432
58165G3336809q018388o954371o043138n263738m597898m029959l545962l132137
58157C1751218k775531k466454k198713j966899j764765j586743j429306j289807
58149A6273000j165158j052696r51257q60450p79471p07392o43801n88326n40103
58140H984346m98252m62272m31362m03957l78488l54163l30727l08116k86657
58131E530352k66856k48626k31294k14675j99347j85670j73311j62013j51877
$$ y = [252260489, 282481898, 310877865, 334893833, 351931442, 360016629, 358373745, 347603928, 329403354, 306014086, 279685692, 252329034, 225388151, 199856141, 176346682, 155170549, 136406518, 119970219, 105678358, 93300648, 82596241, 73336809, 65318421, 58364050, 52320912, 47057174, 42459276, 38429317, 34883355, 31751218, 28975687, 26509233, 24310520, 22343621, 20578856, 18992113, 17562807, 16273000, 15107842, 14055146, 13103889, 12243439, 11463968, 10756576, 10112775, 9524449, 8984346, 8486094, 8023822, 7592460, 7188503, 6810015, 6455852, 6125125, 5817009, 5530352, 5263496, 5014870, 4783576, 4568901, 4369554, 4183884, 4010573, 3848560, 3696683]
58122C696683j42548j33259j24125j16393j10610j05618j00081r4143q8720q4057
58112B597129p9877p6166p2759o8797o3848n9045n5980n4660n3610n1871m9903
58101A910613m8529m7900m7600m7178m6413m5530m5026m4872m4161m2073l8946
58090A412385l5800l3042l0338k7592k5217k3463k2098k0899j9936j9256j8769
58079A135975j8474j8391j8293j7906j7327j6872j6567j6238j6030j6293j6954
58068I46630j7466j7446j7014j6432j5758j4888j3676j2081j0437r420r343r642
58056G83027r562r236r452j0292j0769j0163r189r210j0407j1352j0613q447o501
58043F57834n909o176o208n875n900o440o717o282n746n802o207o396o507p059
$$ y = [3696683, 3554135, 3420876, 3296751, 3180358, 3069748, 2964130, 2864049, 2769906, 2681186, 2597129, 2517252, 2441086, 2368327, 2299530, 2235682, 2176637, 2120657, 2065997, 2012387, 1960516, 1910613, 1862084, 1814184, 1766584, 1719406, 1672993, 1627463, 1582437, 1537565, 1493404, 1451331, 1412385, 1376585, 1343543, 1313205, 1285613, 1260396, 1236933, 1214835, 1193936, 1174000, 1154744, 1135975, 1117501, 1099110, 1080817, 1062911, 1045584, 1028712, 1012145, 995907, 979877, 963584, 946630, 929164, 911718, 894704, 878272, 862514, 847626, 833950, 821869, 811432, 802012, 792669, 783027, 773465, 764229, 754777, 744485, 733716, 723553, 714364, 705154, 694747, 683395, 672782, 664335, 657834, 651925, 645749, 639541, 633666, 627766, 621326, 614609, 608327, 602581, 596779, 590572, 584176, 577669, 570610]
58029E70610p966q718r234r716r924r370q251p400p196p197o930o448n952n437
58015D60871m881m341l763l073k465k200k149k005j873k112k576k683k256j690
58001D22804j223p22k40p8j22R5N06M70p9l24J26N22J78m45p40j203k599m294
57983D12632m775l772k705k704l271l359k959k835l272l808m058m060l855l257
57969C63942k321j551j331j358j020k05N90R64R96Q22K94n45j064p13K6O7q32
57952C56761j664j504o22J03L89N28O24M92K99N98J586K863M022N068O008O485
57936C82036O170N330M666M656N210N844N980N246L756K086P62k91j621l490n506
57921D20834p021p762p909p755p521p423p581p826p777p244o356n250l898k432
$$ y = [570610, 562644, 553926, 544692, 534976, 525052, 515682, 507431, 500031, 492835, 485638, 478708, 472260, 466308, 460871, 455990, 451649, 447886, 444813, 442348, 440148, 437999, 435994, 434121, 432009, 429433, 426750, 424494, 422804, 421581, 420859, 420619, 420541, 420419, 420514, 421020, 421490, 421411, 421087, 421213, 421735, 421913, 421468, 420728, 419525, 416926, 412632, 407857, 404085, 401380, 398676, 395405, 392046, 389087, 386252, 382980, 379172, 375114, 371054, 367199, 363942, 361621, 360070, 358739, 357381, 356361, 356156, 356746, 357710, 358706, 359528, 359822, 359277, 358213, 357500, 357526, 357593, 356761, 355097, 353593, 352971, 353074, 353463, 353991, 354615, 355107, 355406, 356004, 357590, 360453, 364475, 369543, 375551, 382036, 388206, 393536, 398202, 402858, 408068, 413912, 419892, 425138, 428894, 430980, 431742, 431451, 429830, 426340, 420834, 413813, 406051, 398142, 390387, 382866, 375443, 367862, 360036, 352259, 345015, 338659, 333409, 329511, 327079]
57907C27079j355j082j377j590j491j494j902k325k121j248k91K67N01O07M77
57892C12655k1n08l01P30J869K341K155J859J672J321O86P0l48q98j909l094l850
57875C14429l978l806l686l711l841m041m258m442m572m462l784k528j277p14
57861B65329q60j134j104q24m50M9O57J179J487J736K121K639L123L401L321K870
57845B83540K264J760J377R39M09j08o35j271j831j921j468r01n81l86k7M26O11
57828B82197L64n4j46M74J776L308M548N263N499N266M594L782L275L126K893
57813C26165K180J012m08j989l619m986n784n974n760n420n267n450n741n662
57799B73297n013m037l104k459k329k822l529l654k836j592p15n09p70j168j326
$$ y = [327079, 325724, 324642, 323265, 321675, 320184, 318690, 316788, 314463, 312342, 311094, 310803, 311070, 311571, 312178, 312655, 312634, 312126, 311825, 312555, 314424, 316765, 318920, 320779, 322451, 323772, 324458, 324528, 324180, 323282, 321373, 318279, 314429, 310451, 306645, 302959, 299248, 295407, 291366, 287108, 282666, 278094, 273632, 269848, 267320, 266043, 265329, 264469, 263335, 262231, 261407, 260957, 261006, 261663, 262842, 264329, 266065, 268186, 270825, 273948, 277349, 280670, 283540, 285804, 287564, 288941, 289880, 290289, 290181, 289546, 288275, 286444, 284523, 283055, 282154, 281573, 281187, 281160, 281586, 282197, 282561, 282507, 282361, 282835, 284611, 287919, 292467, 297730, 303229, 308495, 313089, 316871, 320146, 323272, 326165, 328345, 329357, 328949, 326960, 323341, 318355, 312571, 306597, 300837, 295417, 290150, 284700, 278959, 273297, 268284, 264247, 261143, 258684, 256355, 253533, 250004, 246350, 243514, 241922, 241207, 240698, 239928, 238760, 237434]
57784B37434q91J38J340K379L316M167M583M374M022M099M403M319L853L670M053
57769B85259M427M121L074J653K05r89j702k043k470l232l989m254m048l779l630
57754B68603l350k724j912j233p94n52n85r99j558j755j444j155j432k047k254
57739B44809j832j384j510k017k216j741q31k8K41o6m46k05P98J862K082J292
57723B38808J93l29N7R38J499J218L01n73r73j007r81j039j238j532j668j439
57707B32235j164j427k157k504j973j122p18p32o66m80m50m90k62J68M21L85J95
57690B19259j68o84r31o04j60j88k79N41K249L670M104M210M899O129P367Q632
57674B58046J0449J3199J6931K1504K6493L1205L5134L8145L9881L9365L5502
$$ y = [237434, 236543, 236681, 238021, 240400, 243716, 247883, 252466, 256840, 260862, 264961, 269364, 273683, 277536, 281206, 285259, 289686, 293807, 296881, 298534, 298739, 297750, 296048, 294005, 291535, 288303, 284314, 280060, 276012, 272233, 268603, 265253, 262529, 260617, 259384, 258590, 258038, 257453, 256454, 254896, 253141, 251697, 250542, 249110, 247063, 244809, 242977, 241593, 240083, 238066, 235850, 234109, 233278, 233250, 233491, 233425, 232979, 232774, 233572, 235434, 237516, 238808, 239001, 238672, 238729, 239667, 241166, 242384, 242685, 242112, 241139, 240132, 239151, 238112, 236874, 235342, 233674, 232235, 231071, 229644, 227487, 224983, 223010, 221888, 221170, 220438, 219772, 219292, 218842, 218352, 218090, 218258, 218679, 219064, 219259, 219091, 218407, 217476, 216872, 216712, 216524, 216245, 216786, 219035, 222705, 226809, 231019, 235918, 242047, 249414, 258046, 268495, 281694, 298625, 320129, 346622, 377827, 412961, 451106, 490987, 530352, 565854]
57663E65854K7849J6825L633r771k1206k9317l4029l5850l5173l2504k8832k5075
57651C62404k1459j7933j4878j2813j1564j0349q722o953n465m336l391k463j473
57638B40605n27M4k8o12j234j431r16K87J577J967J033m34j213j007n61m85o04
57621B36461o10p14j239j922k117j472k35R98J598J199Nj226j788j612j144p82
57605B25400n68l29Q3O33J016Q21J0q48j139r35r20j438k024j998j337o78n43
57588B15206r24j503j997k190j879j071j24M43L39k93j026j427j358r74m92MM60
57571B01194P04N95K53j23o13j414k264k442j632m08L73M76K99K52M85J012J686
57554A98433K142K159J949J825J734J501J324J496J830J835J449R98N37j26o98
$$ y = [565854, 593703, 610528, 614161, 604390, 583184, 553867, 519838, 483988, 448815, 416311, 387479, 362404, 340945, 323012, 308134, 295321, 283757, 273408, 264686, 257733, 252268, 247932, 244541, 242078, 240605, 240078, 240122, 240094, 239482, 238248, 236817, 235901, 236188, 237765, 239732, 240765, 240331, 239118, 238111, 237550, 237065, 236461, 235851, 235137, 233898, 231976, 229859, 228387, 228152, 229150, 230748, 231947, 231952, 230726, 228938, 227326, 226182, 225400, 224832, 224503, 224586, 225219, 226235, 227056, 227066, 226218, 225079, 224144, 223224, 221786, 219762, 217764, 216427, 215749, 215206, 214282, 212779, 210782, 208592, 206713, 205642, 205518, 205961, 206300, 206007, 204981, 203554, 202196, 201222, 200730, 200734, 201194, 201898, 202493, 202746, 202623, 202010, 200596, 198332, 195890, 194258, 193850, 194223, 194699, 194998, 195250, 195735, 196747, 198433, 200575, 202734, 204683, 206508, 208242, 209743, 211067, 212563, 214393, 216228, 217677, 218675, 219212, 219086, 218388]
57539B18388m80N86J640J999J881J717J453R98P06P77P08J36k76L18J495J977
57523B34023J440R34J322K146K451K052J483J155J138J459K065K616K744K504
57509B59532K269K204K149J979J781J588J199M77l22p38o33l10j50k14l43m65
57493B70003n88o31n00l62m62o36l94L25Q52O49J52K13Q35J128O66K22P29J964
57475B74165K830K816K454K317K193J646Q82M94N34M97J94N2L53Q00J162J689
57459B95078K399K538J593M80O92K205L374L113K184J785J854J633J188J295K067
57444C23478K827L227L582L971L895L171K412K208K374K410K285K279K364K252
57430C62735J955J878K316L100L798M088L933L523L112K964L274L975M515M208
$$ y = [218388, 217908, 218494, 220134, 222133, 224014, 225731, 227184, 228182, 228888, 229665, 230373, 230509, 230233, 230551, 232046, 234023, 235463, 236397, 237719, 239865, 242316, 244368, 245851, 247006, 248144, 249603, 251668, 254284, 257028, 259532, 261801, 264005, 266154, 268133, 269914, 271502, 272701, 273178, 272856, 272118, 271485, 271175, 271025, 270811, 270468, 270003, 269415, 268784, 268284, 267922, 267460, 266824, 266430, 266755, 267607, 268256, 268408, 268621, 269456, 270584, 271250, 271472, 272201, 274165, 276995, 279811, 282265, 284582, 286775, 288421, 289303, 289797, 290331, 290828, 291022, 291074, 291427, 292227, 293389, 295078, 297477, 300015, 301608, 302088, 302780, 304985, 308359, 311472, 313656, 315441, 317295, 318928, 320116, 321411, 323478, 326305, 329532, 333114, 337085, 340980, 344151, 346563, 348771, 351145, 353555, 355840, 358119, 360483, 362735, 364690, 366568, 368884, 371984, 375782, 379870, 383803, 387326, 390438, 393402, 396676, 400651, 405166, 409374]
57416D09374L053K014K003K766L280L180L123L624M337M803N308O288P331P542
57402D68026O747N673M897M334L848L812M581N816O748O977O744O492O439O547
57388E47681O678O784P001P524Q326R063R381R262Q962Q715Q634Q796R139R339
57374F65285R029Q285P668P730Q520R620J0476J0668J0192R636R820J0964J2393
57361G90286J3235J3320J3170J3309J3857J4684J5525J6097J6461J7159J8613
57350I55716K0454K1928K2850K3562K4024K3714K2618K1559K1156K1146K1165
57339A199892K1505K2416K3296K3430K3099K3114K3470K3375K2467K1157J9765
57328A446986J8207J6589J5342J4565J3943J3489J3566J4032J4159J3734J3413
$$ y = [409374, 412427, 414441, 416444, 419210, 422490, 425670, 428793, 432417, 436754, 441557, 446865, 453153, 460484, 468026, 474773, 480446, 485343, 489677, 493525, 497337, 501918, 507734, 514482, 521459, 528203, 534695, 541134, 547681, 554359, 561143, 568144, 575668, 583994, 593057, 602438, 611700, 620662, 629377, 638011, 646807, 655946, 665285, 674314, 682599, 690267, 697997, 706517, 716137, 726613, 737281, 747473, 757109, 766929, 777893, 790286, 803521, 816841, 830011, 843320, 857177, 871861, 887386, 903483, 919944, 937103, 955716, 976170, 998098, 1020948, 1044510, 1068534, 1092248, 1114866, 1136425, 1157581, 1178727, 1199892, 1221397, 1243813, 1267109, 1290539, 1313638, 1336752, 1360222, 1383597, 1406064, 1427221, 1446986, 1465193, 1481782, 1497124, 1511689, 1525632, 1539121, 1552687, 1566719, 1580878, 1594612, 1608025]
57317A608025J3558J3558J2880J2087J2033J2695J3584J4790J6678J8764J9997
57306A768649K0082J9762J9692J9815J9999K0500K1460K2502K3198K3583K4011
57295B003253K4776K5937K7211K8014K8112K8180K9128L0756L1806L1656L1201
57284B320030L1553L2541L3229L3437L3839L4764L5797L6565L7155L7650L7948
57273B704508L8218L8896L9960M0882M1547M2541M4095M5409M5622M4970M4291
57262C170939M3805M3234M2828M3273M4498M5557M5933M6248M7237M8764N0354
57251C672670N2127N4429N6964N8965O0179O1012O1672O1767O0905N9262N7392
57240D317344N5720N4407N3432N2682N2067N1622N1386N1246N1069N1002N1374
$$ y = [1608025, 1621583, 1635141, 1648021, 1660108, 1672141, 1684836, 1698420, 1713210, 1729888, 1748652, 1768649, 1788731, 1808493, 1828185, 1848000, 1867999, 1888499, 1909959, 1932461, 1955659, 1979242, 2003253, 2028029, 2053966, 2081177, 2109191, 2137303, 2165483, 2194611, 2225367, 2257173, 2288829, 2320030, 2351583, 2384124, 2417353, 2450790, 2484629, 2519393, 2555190, 2591755, 2628910, 2666560, 2704508, 2742726, 2781622, 2821582, 2862464, 2904011, 2946552, 2990647, 3036056, 3081678, 3126648, 3170939, 3214744, 3257978, 3300806, 3344079, 3388577, 3434134, 3480067, 3526315, 3573552, 3622316, 3672670, 3724797, 3779226, 3836190, 3895155, 3955334, 4016346, 4078018, 4139785, 4200690, 4259952, 4317344, 4373064, 4427471, 4480903, 4533585, 4585652, 4637274, 4688660, 4739906, 4790975, 4841977, 4893351]
57229D893351N2281N3489N4846N6532N8733O1216O3334O4418O4118O2494N9934
57218E544746N7016N4343N2281N0648M8722M5933M2706M0297L9469L9595L9382
57207F055138L8358L7181L6667L7041L8045L9215L9833L9282L7763L6294L5587
57196F470404L5222L4313L2702L1060K9899K8988K7798K6188K4431K2712K0785
57185F784502J8340J5635J3596J2996J3511J3855J3007J1107R077P579O620N966
57173F925791N504N214M963M567L977L337K843K523K195J674R89K78m41j264k171
57158F959979l037l964n371p684j0951j4869j9062k3274k7364l1175l4427l6791
57146F742010l8130l8518l7857l5769l2225k8114k4705k2458k0843j9332j8057
$$ y = [4893351, 4945632, 4999121, 5053967, 5110499, 5169232, 5230448, 5293782, 5358200, 5422318, 5484812, 5544746, 5601762, 5656105, 5708386, 5759034, 5807756, 5853689, 5896395, 5936692, 5976161, 6015756, 6055138, 6093496, 6130677, 6167344, 6204385, 6242430, 6281645, 6321478, 6360760, 6398523, 6434817, 6470404, 6505626, 6539939, 6572641, 6603701, 6633600, 6662588, 6690386, 6716574, 6741005, 6763717, 6784502, 6802842, 6818477, 6832073, 6845069, 6858580, 6872435, 6885442, 6896549, 6905626, 6913205, 6919825, 6925791, 6931295, 6936509, 6941472, 6946039, 6950016, 6953353, 6956196, 6958719, 6960914, 6962588, 6963577, 6963855, 6963414, 6962150, 6959979, 6956942, 6952978, 6947607, 6939923, 6928972, 6914103, 6895041, 6871767, 6844403, 6813228, 6778801, 6742010, 6703880, 6665362, 6627505, 6591736, 6559511, 6531397, 6506692, 6484234, 6463391, 6444059, 6426002]
57135F426002j7335j7081j7039j7164j7405j7361j6596j5051j2974j0765r048
57124F258183q413q559q083n676j456L468Q522J4242K1387L0052L9773N0090O0914
57111F454444P2499Q5186R8988J13677J29399J47034J67660J92118K21620K58546
57101G941171L06036L66902M43478N38318O54395P94582R61398J156918J381846
57092A4545044J634290J909524K200258K495934K782001L041861L260831L428537
57084C5298280L538687L588535L577294L498986L331742L036573K575880J942310
57076F0388287J174374L45106m66671j201498j828275k338724k735983l025379
57068E0311237l211458l300251l302032l231028l103053k933821k738204k529108
$$ y = [6426002, 6408667, 6391586, 6374547, 6357383, 6339978, 6322617, 6306021, 6290970, 6277996, 6267231, 6258183, 6249770, 6241211, 6233128, 6227452, 6225996, 6229464, 6237986, 6252228, 6273615, 6303667, 6343440, 6393530, 6454444, 6526943, 6612129, 6711117, 6824794, 6954193, 7101227, 7268887, 7461005, 7682625, 7941171, 8247207, 8614109, 9057587, 9595905, 10250300, 11044882, 12006280, 13163198, 14545044, 16179334, 18088858, 20289116, 22785050, 25567051, 28608912, 31869743, 35298280, 38836967, 42425502, 46002796, 49501782, 52833524, 55870097, 58445977, 60388287, 61562661, 61907767, 61441096, 60239598, 58411323, 56072599, 53336616, 50311237, 47099779, 43799528, 40497496, 37266468, 34163415, 31229594, 28491390, 25962282]
57060B5962282k316381k107134j906970j720092j548459j392042j250469j123912
57052A2596823j012143r13605q26074p47907o78111o15584n58968n07270m60167
57043F276994m17625l79475l45252l14356k86344k61163k38896k19094k00607
57034C614182j82274j63657j44884j26000j06877q7780o9984n6016m9299n2678
57024B574733o6129q5615j04856j18816j25805j26759j23352j16899j08342r8507
57014A499653q8296p8717p0466o3361n6635n0059m4327l9946l6260l2274k8207
57003I11105k5266k3826k2753k0942j8717j7030j5887j4532j2905j1907j1985
56992G15355j2328j1891j0611r142p913o992o421o105n610m685l891m094n449
$$ y = [25962282, 23645901, 21538767, 19631797, 17911705, 16363246, 14971204, 13720735, 12596823, 11584680, 10671075, 9845001, 9097094, 8418983, 7803399, 7244431, 6737161, 6276994, 5859369, 5479894, 5134642, 4820286, 4533942, 4272779, 4033883, 3814789, 3614182, 3431908, 3268251, 3123367, 2997367, 2890490, 2802710, 2732726, 2676710, 2627411, 2574733, 2508604, 2422989, 2318133, 2199317, 2073512, 1946753, 1823401, 1706502, 1598160, 1499653, 1411357, 1332640, 1262174, 1198813, 1142178, 1092119, 1047792, 1007846, 971586, 939312, 911105, 885839, 862013, 839260, 818318, 799601, 782571, 766684, 752152, 739247, 727340, 715355, 703027, 691136, 680525, 671383, 663470, 656478, 650057, 643952, 638342, 633657, 629766, 625672, 620223]
56979F20223p453r805j2455j4903j6337j6664j6595j6407j5515j3662j1687j0367
56967D58373r244p404m900k462k52K104M483O392Q021J0113J2528J3851J2808
56954E04411R471M862L8m263p728j0591j3160j5052j5497j4555j3317j2516j1677
56941D00426j0014p499m540j297K014M775O723Q663J1497J4800J7095J7500J6309
56928D76452J3890R897L981l192j0069j5226j8164j9313j9474j9189j8499j7290
56916C63804j5703j4110j2750j1584j0489r484q704q188p666o694n138l421k130
56903B47743j427j059q56p85o08J9J034K076L164M740O833Q769J0013J0788J1522
56888C01966J2299J3113J4138J5180J5386J3998J1146P433L266r80m602o995q151
$$ y = [620223, 612770, 602965, 590510, 575607, 559270, 542606, 526011, 509604, 494089, 480427, 468740, 458373, 449129, 441725, 436825, 434363, 434111, 436215, 440698, 447090, 455111, 465224, 477752, 491603, 504411, 513882, 518744, 518782, 514519, 506791, 496200, 483040, 467988, 452491, 437936, 424619, 412103, 400426, 390412, 382913, 378373, 377076, 379090, 383865, 390588, 399251, 410748, 425548, 442643, 460143, 476452, 490342, 500239, 504220, 501028, 490959, 475733, 457569, 438256, 418782, 399593, 381094, 363804, 348101, 333991, 321241, 309657, 299168, 289684, 280980, 272792, 265126, 258432, 253294, 249873, 247743, 246316, 245257, 244401, 243616, 243008, 243027, 244061, 246137, 249301, 254041, 260874, 269643, 279656, 290444, 301966, 314265, 327378, 341516, 356696, 372082, 386080, 397226, 404659, 407925, 406945, 402343, 395348, 387197]
56875C87197q244p224n305l293j754k28K003M872P947J1354J5369J9517K3178
56862D45389K6690L0721L4677L6890L6356L3159K7260J8363P338l478j2089j8083
56850F63193k1749k3062k2216k0170j7732j4632j0288m936P22O616J3317K1112
56838E70175K9624L8120M5845N2200N6844N9337N8535N2886M1804K6510R201q115
56826A032966k3787l6282m4622m8944n0058m8602m4903l9470l3108k6549k0176
56815F16465j3924p342n5P659J5072K1845K8222L4037L8115L9034L6099K9210
56803H44437J8417M440j0630k3988l3690l9448m2052m2431m1177l8586l4991l0966
56791E29335k6930k2626j7515j1841o653k451J556O245J1196J5192J7610J8552
$$ y = [387197, 378953, 371729, 366424, 363131, 361377, 361149, 363152, 368024, 375971, 387325, 402694, 422211, 445389, 472079, 502800, 537477, 574367, 610723, 643882, 671142, 689505, 696843, 693365, 681276, 663193, 641444, 618382, 596166, 575996, 558264, 543632, 533344, 528408, 529130, 535746, 549063, 570175, 599799, 637919, 683764, 735964, 792808, 852145, 910680, 963566, 1005370, 1031880, 1041081, 1032966, 1009179, 972897, 928275, 879331, 829273, 780671, 735768, 696298, 663190, 636641, 616465, 602541, 595199, 595144, 602803, 617875, 639720, 667942, 701979, 740094, 779128, 815227, 844437, 862854, 867294, 856664, 832676, 798986, 759538, 717486, 675055, 633878, 595292, 560301, 529335, 502405, 479779, 462264, 450423, 443770, 441319, 442875, 449120, 460316, 475508, 493118, 511670]
56779E11670J7850J4876R435K243n555j2922j9097k3716k6849k8577k8698k7254
56767C83406k5061k3085k1371j9232j6482j3866j2115j1081j0114q906p707o859
56755B07527o354n853n101m299l885l904l944l749l537l483l342l001k817k942
56741A51316k764j711l31K28l21j154j406q85R9R79J102M09j62K40J083J037p3
56724A47686r49o89O8L32J45J49M57P35R62J407J993K304K091J454O56M1j00J51
56706A58893L37J85j08k93m36o10o00l20n9k8O8M48O49J21p16p98J16R53O91k75
56686A58218p29l15Q7j98n26R6J331J701N73q77j218n54m2j20k48j20j14l86n20
56667A56039l94n46j171j558j032O1R24J337J558J632J439J173J168J376J536
$$ y = [511670, 529520, 544396, 553831, 556074, 550519, 537597, 518500, 494784, 467935, 439358, 410660, 383406, 358345, 335260, 313889, 294657, 278175, 264309, 252194, 241113, 230999, 222093, 214386, 207527, 201173, 195320, 190219, 185920, 182035, 178131, 174187, 170438, 166901, 163418, 160076, 157075, 154258, 151316, 148552, 146841, 146510, 146738, 146417, 145263, 143857, 142972, 143071, 144050, 145152, 145561, 145399, 145639, 146722, 147759, 147686, 146737, 146048, 146116, 146448, 146593, 146742, 147199, 147934, 148896, 150303, 152296, 154600, 156691, 158145, 158801, 158842, 158742, 158893, 159230, 159415, 159307, 159014, 158578, 157968, 157368, 157048, 156989, 156961, 157029, 157477, 158126, 158247, 157531, 156733, 156849, 157802, 158493, 158218, 157489, 157174, 157261, 157063, 156537, 156633, 157964, 159665, 160238, 159361, 158143, 157589, 157547, 157427, 157179, 157059, 156945, 156559, 156039, 155645, 155099, 153928, 152370, 151338, 151399, 152323, 153660, 155218, 156850, 158289, 159462, 160630, 162006, 163542]
56652A63542J655J926K287K495K477K238J647P14j23m37l59k85k21J02N80P39
56636A78977M05l8j54R7M29N67N31O88J303J976J925J054K82L24O96M29n82j658
56618A87251k398k842k829k112j126p17j050j527j777j983k068j590p12k89n64
56603A63667o23K17J273J467Q37K95K36K47j3l50l89K0O81J052O65j63m53J74
56585A68840Q83P93K44J39M73M80Kl01j14J32J99M77J188J877K111K054K033K014
56567A83524J923J992K422L038L586M077M640N347O350P695Q815Q781P362N408
56553B54960L858K827K012J449J353J557J642J379P30k41j139j376j003r21j669
56538B65418k517k470j736j390j818k438k793l019l148k875k221j742j784k087
$$ y = [163542, 165197, 167123, 169410, 171905, 174382, 176620, 178267, 178981, 178858, 178421, 178062, 177777, 177556, 177658, 178238, 178977, 179382, 179344, 179190, 179287, 179716, 180283, 180814, 181502, 182805, 184781, 186706, 187760, 188042, 188366, 189062, 189491, 188909, 187251, 184853, 182011, 179182, 177070, 175944, 175227, 174177, 172650, 170873, 168890, 166822, 165232, 164520, 164231, 163667, 163044, 163261, 164534, 166001, 166838, 167133, 167369, 167616, 167603, 167253, 166864, 166884, 167565, 168617, 169282, 169119, 168666, 168840, 169723, 170516, 170760, 170899, 171372, 171852, 171854, 171553, 171439, 171571, 171770, 172247, 173435, 175312, 177423, 179477, 181510, 183524, 185447, 187439, 189861, 192899, 196485, 200562, 205202, 210549, 216899, 224594, 233409, 242190, 249552, 254960, 258818, 261645, 263657, 265106, 266459, 268016, 269658, 271037, 271767, 271526, 270387, 269011, 268008, 267087, 265418, 262901, 260431, 258695, 257305, 255487, 253049, 250256, 247237, 244089, 241214, 238993, 237251, 235467, 233380]
56524B33380k334k519k536k076j192n04n37j189j963k321j810n17N65L02j097
56509B13652k136j855q68k13K9K44K25m26j266j346n18L61N70J38n87j354j792
56492B02858j470m16P38J368J338Q67K08l45m68p9N23Q67O94J31m62p82p89n69
56474B04212j42M61R76J072P71M54L52L26K25N0k17n24m36M85J745K104J149N2
56456B13115R1R98J470R58Q7m41n03k32K27N02K45l43o81n30j63J74M21M95L90
56437B16280M17Q24J288J315J015Q31P04K35m20o83n21m38m30N5R19J208N96O4
56419B23259M57J183J157M56Q4M28Q49P09J19m13n64l68l8K56O22J286K093K428
56401B34003J929J010M71O53J271J829J981J618R64M68M38P29R17P29K90N2L67
$$ y = [233380, 231046, 228527, 225991, 223915, 222723, 222219, 221682, 220493, 218530, 216209, 214399, 213882, 214447, 214749, 213652, 211516, 209661, 208793, 208580, 208609, 208853, 209078, 208652, 207386, 206040, 205522, 205883, 206453, 206591, 206004, 204650, 202858, 201388, 200972, 201710, 203078, 204416, 205283, 205491, 205146, 204678, 204599, 205122, 205989, 206683, 206814, 206352, 205570, 204781, 204212, 204070, 204531, 205507, 206579, 207350, 207804, 208156, 208482, 208707, 208757, 208540, 208016, 207580, 208065, 209810, 211914, 213063, 213115, 213206, 214204, 215674, 216632, 216719, 216278, 215775, 215543, 215770, 216272, 216517, 216174, 215493, 214963, 214800, 214974, 215395, 215890, 216280, 216697, 217521, 218809, 220124, 221139, 221970, 222674, 222909, 222489, 221806, 221285, 220847, 220417, 220472, 221391, 222599, 223195, 223259, 223716, 224899, 226056, 226512, 226596, 227024, 227873, 228582, 228701, 228288, 227724, 227356, 227318, 227574, 228196, 229482, 231575, 234003, 235932, 236942, 237413, 238066, 239337, 241166, 243147, 244765, 245729, 246197, 246635, 247364, 248281, 249010, 249300, 249352, 249719]
56384B49719R84J175O93L20Q56J774J744O06k06L18J274J151l6q81m88O72J662
56367B61337K058J920J476R99O48L51J01K20R19J702J773R80m0o44p16m20J47
56350B72811R26J803K604L006K625J490L28q9J77M60N23Q15J562K227K195J604
56334B95067J150J245J801K572L407M105M417M258L796L264K809K488K275K024
56320C34678J565R62N38M82M97J06o55j100o48M96J580K097K095J799J350R52
56304C46794R38J496K437L364L960M223M435M851N276N126M225L281L163L811
56290C97380M413M558M626M981N421N738O179P014Q029Q837R294R317Q752P800
56276D92339P236P717R093J0708J2098J3099J3645J3963J4624J5900J7294J8209
$$ y = [249719, 250703, 251878, 252571, 252891, 253747, 255521, 257265, 257871, 257665, 257983, 259257, 260408, 260372, 259491, 259003, 259675, 261337, 263395, 265315, 266791, 267790, 268438, 268789, 268890, 269110, 270029, 271731, 273504, 274484, 274444, 273800, 273084, 272664, 272811, 273737, 275540, 278144, 281150, 283775, 285265, 285593, 285504, 285681, 286141, 286664, 287479, 289041, 291268, 293463, 295067, 296217, 297462, 299263, 301835, 305242, 309347, 313764, 318022, 321818, 325082, 327891, 330379, 332654, 334678, 336243, 337205, 337743, 338225, 338722, 338828, 338173, 337073, 336425, 336921, 338501, 340598, 342693, 344492, 345842, 346794, 347732, 349228, 351665, 355029, 358989, 363212, 367647, 372498, 377774, 382900, 387125, 390406, 393569, 397380, 401793, 406351, 410977, 415958, 421379, 427117, 433296, 440310, 448339, 457176, 466470, 475787, 484539, 492339, 499575, 507292, 516385, 527093, 539191, 552290, 565935, 579898, 594522, 610422, 627716, 645925]
56264F45925J8918K0285K2643K5496K8309L1055L3888L6856M0156M4319M9762
56253I97612N6295O3297P0339P7572Q5467R4222J03362J12015J19637J26412J32779
56242B039009J38526J42471J43137J39831J32970J23283J10879R5439P7192N7136
56232C199873L6002J3738r432l2054n2414p0111q5703r9070j09302j16257j20918
56221B554352j23822j24340j22081j18062j13646j09083j03874r7900r1427q4642
56211A465475p7908p1932o6910o2059n6728n1405m6854m2779l8380l3816l0097
56200H86607k7629k5820k4023k2082j9997j7824j5887j4481j3369j2071j0564
56189F82860r157p883o589n400m582m078l726l578l518k979j722m63Pm6K01Q89
$$ y = [645925, 664843, 685128, 707771, 733267, 761576, 792631, 826519, 863375, 903531, 947850, 997612, 1053907, 1117204, 1187543, 1265115, 1350582, 1444804, 1548166, 1660181, 1779818, 1906230, 2039009, 2177535, 2320006, 2463143, 2602974, 2735944, 2859227, 2970106, 3065545, 3142737, 3199873, 3235875, 3249613, 3240181, 3208127, 3155713, 3085602, 2999899, 2900829, 2791527, 2675270, 2554352, 2430530, 2306190, 2184109, 2066047, 1952401, 1843318, 1739444, 1641544, 1550117, 1465475, 1387567, 1315635, 1248725, 1186666, 1129938, 1078533, 1031679, 988900, 950520, 916704, 886607, 858978, 833158, 809135, 787053, 767056, 749232, 733345, 718864, 705495, 693424, 682860, 673703, 665820, 659231, 653831, 649249, 645171, 641445, 637867, 634349, 631370, 629648, 629185, 629192, 629146, 629347, 630236]
56173F30236J583K184K819L171K921K565K794L315L393L280L864N132O160O754
56159F80171P608Q784R359Q992Q688R423J1024J2846J4630J6219J7365J8411K0391
56146H43911K3890K8382L3115L8102M3747N0045N6552O2778O8280P2644P5393
56135A396839P5742P2796O6643N9002N1939M6179M1428L7812L5550L3493K9673
56124A947096K3703J7154J1221N449o29o226j0664j4785j9934k6437l3999m2525
56112A849424n1454n9061o3629o4993o4067o1445n7272n1951m6029l9709l3183
56101A256631k7023k1624j6695j1978p938n085l078j264L88J576K484L489M487
56088A174370N173N714O431P108P378P478P953Q717R144R017Q872R395J0813J2743
$$ y = [630236, 631819, 634003, 636822, 639993, 642914, 645479, 648273, 651588, 654981, 658261, 662125, 667257, 673417, 680171, 687779, 696563, 705922, 714914, 723602, 733025, 744049, 756895, 771525, 787744, 805109, 823520, 843911, 867801, 896183, 929298, 967400, 1011147, 1061192, 1117744, 1180522, 1248802, 1321446, 1396839, 1472581, 1545377, 1612020, 1671022, 1722961, 1769140, 1810568, 1848380, 1883930, 1917423, 1947096, 1970799, 1987953, 1999174, 2004623, 2003994, 1997768, 1987104, 1972319, 1952385, 1925948, 1891949, 1849424, 1797970, 1738909, 1675280, 1610287, 1546220, 1484775, 1427503, 1375552, 1329523, 1289814, 1256631, 1229608, 1207984, 1191289, 1179311, 1171373, 1166288, 1163210, 1161946, 1162334, 1163910, 1166394, 1169883, 1174370, 1179543, 1185257, 1191688, 1198796, 1206174, 1213652, 1221605, 1230322, 1239466, 1248483, 1257355, 1266750, 1277563, 1290306]
56074A290306J4371J5010J4813J4709J5378J6536J7490J7991J8272J8639J9331
56063A472846K0432K1645K2460K2813K3212K4068K5214K6267K7029K7446K7613
56052A741045K7907K8620K9498L0125L0658L1490L2355L2619L2365L2366L3053
56041B082101L4379L6459L9150M1250M1559M0760M0709M1877M3085M3918M5363
56030B530610M7754N0048N1895N4346N7663O0454O2100O4042O7309P0751P3210
56019C190182P5627P9126Q2806Q5439Q7947R1903R6752J00743J03829J07514J12404
56008D214272J17852J23586J29900J36526J42866J49059J55610J62406J69264
55999E501341J76852J85891J96176K07295K19412K32386K45398K58505K73174
$$ y = [1290306, 1304677, 1319687, 1334500, 1349209, 1364587, 1381123, 1398613, 1416604, 1434876, 1453515, 1472846, 1493278, 1514923, 1537383, 1560196, 1583408, 1607476, 1632690, 1658957, 1685986, 1713432, 1741045, 1768952, 1797572, 1827070, 1857195, 1887853, 1919343, 1951698, 1984317, 2016682, 2049048, 2082101, 2116480, 2152939, 2192089, 2233339, 2274898, 2315658, 2356367, 2398244, 2441329, 2485247, 2530610, 2578364, 2628412, 2680307, 2734653, 2792316, 2852770, 2914870, 2978912, 3046221, 3116972, 3190182, 3265809, 3344935, 3427741, 3513180, 3601127, 3693030, 3789782, 3890525, 3994354, 4101868, 4214272, 4332124, 4455710, 4585610, 4722136, 4865002, 5014061, 5169671, 5332077, 5501341, 5678193, 5864084, 6060260, 6267555, 6486967, 6719353, 6964751, 7223256, 7496430]
55990G496430K90069L07979L26228L46408L69992L96111M23522M53057M86114
55981A0895910N22560N62211O06524O56609P11571P71131Q37842R14227J000088
55972A7478673J095382J203246J327126J467526J625180J804767K012020K250328
55964C0264248K524743K846599L229907L687094M234150M897014N708034O701658
55956F4093447P921935R428689J1282588J3518251J6126698J9041219K2112063
55949A63524890K5089236K7635766K9337772K9674072K8021529K3842596J7045322
55942C44171183Q252007j303390j0229168j7467323k2528931k5434302k6509605
55935B48950471k6190794k4899411k2993273k0764437j8444792j6199928j4126007
$$ y = [7496430, 7786499, 8094478, 8420706, 8767114, 9137106, 9533217, 9956739, 10409796, 10895910, 11418470, 11980681, 12587205, 13243814, 13955385, 14726516, 15564358, 16478585, 17478673, 18574055, 19777301, 21104427, 22571953, 24197133, 26001900, 28013920, 30264248, 32788991, 35635590, 38865497, 42552591, 46786741, 51683755, 57391789, 64093447, 72015382, 81444071, 92726659, 106244910, 122371608, 141412827, 163524890, 188614126, 216249892, 245587664, 275261736, 303283265, 327125861, 344171183, 352423190, 351119800, 340890632, 323423309, 300894378, 275460076, 248950471, 222759677, 197860266, 174866993, 154102556, 135657764, 119457836, 105331829]
55928A05331829j2265507j0630360r213904p995002o946868o047066n277936m621220
55920D2333966m058153l573792l156967k796928k483641k210332j972253j763681
55912B0318219j578953j415303j271733j145883j034479r35827q49288p73098
55904A1313655p05037o44396n91155n44101n01687m63759m30383l99988l70813
55895F662336l43257l18690k96772k75986k55985k37321k19604k02046j85336
55886D327339j70967j59021j48475j39321j32523j28058j24638j21245j17640
55877C085451j13531j08619j03251r8005r2945q8128q4138q1115p8039p4137p0130
55866B093413o6914o4002o0640n7436n5280n3583n1331m9051m7777m6852m4757
$$ y = [105331829, 93066322, 82435962, 73222058, 65227056, 58280188, 52233122, 46955186, 42333966, 38275813, 34702021, 31545054, 28748126, 26264485, 24054153, 22081900, 20318219, 18739266, 17323963, 16052230, 14906347, 13871868, 12936041, 12086753, 11313655, 10608618, 9964222, 9373067, 8828966, 8327279, 7863520, 7433137, 7033149, 6662336, 6319079, 6000389, 5703617, 5427631, 5171646, 4934325, 4714721, 4512675, 4327339, 4156372, 3997351, 3848876, 3709555, 3577032, 3448974, 3324336, 3203091, 3085451, 2971920, 2863301, 2760050, 2662045, 2569100, 2480972, 2396834, 2315719, 2237680, 2163543, 2093413, 2026499, 1962497, 1901857, 1844421, 1789141, 1735558, 1684227, 1635176, 1587399, 1540547, 1495790]
55855A495790m1723l9338l7786l5644l2499k9760k8421k7795k6918k5780k4714
55844A145412k3813k3297k3352k3403k2636k1347k0562k0289j9435j7686j6127
55833I13465j5623j5717j5594j5123j4497j3727j2831j1995j1269j0689j0609
55822G65791j1237j2055j2444j2610j3006j3251j2789j2204j2501j3253j2934
55811F27507j1187r291q241p782p494p377o992n519l209j465r43p78k21K84K59
55796E57551J42L50N17L99M25O31K81o51q37M67J961J915L88j408l138n442q438
55779E45113j1395j3606j4675j4325j2809j1119r929q685o660m324k737j995j508
55766D31346j415k427m298n689n765n016m287l865l704l714l570k975k337k520
$$ y = [1495790, 1454067, 1414729, 1376943, 1341299, 1308800, 1279040, 1250619, 1222824, 1195906, 1170126, 1145412, 1121599, 1098302, 1074950, 1051547, 1028911, 1007564, 987002, 966713, 947278, 929592, 913465, 897842, 882125, 866531, 851408, 836911, 823184, 810353, 798358, 787089, 776400, 765791, 754554, 742499, 730055, 717445, 704439, 691188, 678399, 666195, 653694, 640441, 627507, 616320, 607029, 598788, 591006, 583512, 576135, 569143, 563624, 560415, 558950, 558007, 557229, 557008, 557292, 557551, 557693, 558043, 558560, 558959, 559384, 560015, 560296, 559645, 558808, 559275, 561236, 563151, 563539, 562131, 558993, 553551, 545113, 533718, 520112, 505437, 491112, 478303, 467184, 457255, 448570, 441910, 437586, 434849, 432854, 431346, 429931, 427504, 423206, 417517, 411752, 406736, 402449, 398584, 394880, 391166, 387596, 384621, 382284, 379764]
55752C79764l696n021n628n460n018m891n578p090q540q914q372q085q457q402
55738B86612o906m553k784k159k108k064k006j996j952j950k248k905l696m405
55724B44880m837m703l925l033k683k794k720k370k419l044l188j780P05K735
55710B10824L547L741L975L982L248K080J310J228J295Q66j76j473k588l342l949
55695B24568m725n576n944n482m555l728l047k247j516j387j767j736o41J001
55681A83218K084K146J658J276J216J328J424J360J007L32m70j049j221j144j148
55666A92017j295j321j061p52o88p91p40m90l14l39l93l06j31O1K88N24O42O43
55648A85554P26R72J159R96M01m36j194j591j646j704j990k249k189k124k589
$$ y = [379764, 376068, 371047, 365419, 359959, 354941, 350050, 344472, 337382, 328842, 319928, 311556, 303471, 295014, 286612, 279706, 275153, 272369, 270210, 268102, 266038, 264032, 262036, 260084, 258134, 255886, 252981, 249285, 244880, 240043, 235340, 231415, 228382, 225699, 222905, 220185, 217815, 215396, 212352, 209164, 207384, 208089, 210824, 214371, 218112, 222087, 226069, 229317, 231397, 232707, 233935, 235230, 236096, 235920, 234447, 231859, 228517, 224568, 219843, 214267, 208323, 202841, 198286, 194558, 191511, 189264, 187748, 186361, 184594, 182858, 182217, 183218, 185302, 187448, 189106, 190382, 191598, 192926, 194350, 195710, 196717, 197049, 196579, 195530, 194309, 193165, 192017, 190722, 189401, 188340, 187588, 186900, 186109, 185369, 184879, 184565, 184226, 183833, 183527, 183396, 183457, 183745, 184269, 184911, 185554, 186280, 187252, 188411, 189407, 189808, 189372, 188178, 186587, 184941, 183237, 181247, 178998, 176809, 174685, 172096]
55633A72096l362l589l080k736l194l828l723l087k786k855k486j473o53o76j171
55618A33397j503j652j803j676r92k38k80j206k146k304j774j256j243j661k046
55603A11617j972j434q80p35q99q96m59J54N26M52o3r14j797k210j894j192p23
55586I6681o79o41j73O09J185J265J074R64R26O07j54j016j472j366q65k7J263
55569I8181K781L786L713K893K160J861J508N41r03k120k558k340k099k316k766
55554A02322k797k239j720j832k209j992j026J5O34R46J027N56m88j359j309m52
55538H8077M95J015R85N30K7n8K32L93L15N58J247J453M40j012j524r79l93k35
55520I1566o4J57k94j541k487k186j085l02k83o88j111j368j413j408j551j623
$$ y = [172096, 168734, 165145, 162065, 159329, 156135, 152307, 148584, 145497, 142711, 139856, 137370, 135897, 135244, 134568, 133397, 131894, 130242, 128439, 126763, 125771, 125533, 125253, 124047, 121901, 119597, 117823, 116567, 115324, 113663, 111617, 109645, 108211, 107331, 106596, 105697, 104801, 104342, 104496, 105022, 105474, 105411, 104497, 102700, 100490, 98596, 97404, 96681, 96002, 95361, 95188, 95797, 96982, 98247, 99321, 100285, 101211, 101818, 101664, 100648, 99176, 97810, 96945, 96918, 98181, 100962, 104748, 108461, 111354, 113514, 115375, 116883, 117424, 116521, 114401, 111843, 109503, 107404, 105088, 102322, 99525, 97286, 95566, 93734, 91525, 89533, 88507, 88522, 89156, 90102, 91129, 91685, 91197, 89838, 88529, 88077, 88572, 89587, 90572, 91102, 91129, 91071, 91303, 91696, 92011, 92569, 93816, 95269, 95709, 94697, 93173, 92194, 91801, 91566, 91502, 91659, 91365, 89824, 87337, 85151, 84066, 83764, 83481, 82793, 81682, 80314, 78901, 77493, 75942, 74319]
55504G4319j093j1P87O58p9o90q68o36l0O43P61J33o09q78q84r85q59j44N93M43
55484G0571l87p14N0J232J933J981J647J115N61K32J14j10n39q40p67n49m78m26
55466G4626q0M87Q37O80J35n11j138j764k305k518k236j576p94m7M59L29n51j440
55448F2593j258J1J084R31N7l33L5M42M29K72K32J91J48L43O77N99k3n01j43Q95
55428F6681J882K283J996J123m2r89j298r87m66j29m8L7M35J045J273O66m47j298
55410G1717j575j571j464j031k84K15R7j83%M18K56o33j312q22O15J725J491J63
55392F7822j062j228l85P39J503J638J129K44l89l30J28K62p7l11p1K18O6k92
55374F9604k81J15L88L24J99K04J07k88o85o37k01K4l59r58r69j84O48O99N0m95
$$ y = [74319, 73226, 73215, 74002, 74660, 74581, 73891, 73023, 72387, 72357, 73000, 73761, 73894, 73285, 72407, 71523, 70538, 69679, 69535, 70128, 70571, 70184, 69470, 69520, 70752, 72685, 74666, 76313, 77428, 77989, 78221, 78335, 78225, 77686, 76846, 76079, 75530, 75052, 74626, 74546, 75033, 75870, 76550, 76685, 76174, 75036, 73272, 70967, 68449, 66213, 64637, 63843, 63796, 64255, 64584, 64033, 62593, 61335, 61346, 62430, 63361, 63418, 63085, 63120, 63562, 63991, 64263, 64495, 64686, 64834, 65177, 65854, 66453, 66430, 65929, 65786, 66681, 68563, 70846, 72842, 73965, 73923, 72934, 71636, 70649, 70183, 70054, 70006, 70043, 70478, 71523, 72796, 73462, 73015, 71717, 70142, 68571, 67107, 66076, 65792, 66007, 66104, 65921, 65921, 66339, 66595, 65962, 64650, 63828, 64443, 66168, 67659, 67822, 66760, 65532, 65147, 65886, 67389, 69027, 70156, 70400, 70011, 69681, 69809, 70071, 69994, 69683, 69612, 69830, 69896, 69604, 69323, 69438, 69826, 70150, 70349, 70553, 70660, 70372, 69687, 69050, 68849, 68873, 68514, 67556, 66587, 66403, 67051, 67750, 67800, 67305]
55354F7305m77k03q6o1Q6K69K80J54O1J6k1L8K51M35L57J6m64r61j227r63k79
55333F4526J56q2n16l24N26J245J303R75P20N49L14K12M88Q09M57o96j723j544
55315F7395k06J090J350Q44M97N62M82k3m75m33j51jJ78O47J049P93o6r20j411
55296G1201j583j377o44L28R36R76P66N21J64j83j80J17J70k16n62m47o0L13Q26
55277G1066J609K240K116J142k59j522j999j231L42J392J118L37M26J361J713
55262G9851O43r02j389m84P75J231O48k78o62k44L69M03j56o03n07k74m64r02
55244G7055q62n7R47J318Q30pn41o26n90o86p64o04l69m32q21j170j161p69r1
55225G0600O58J039P33J07n6L67N77Pp90q91k99J52J7l22l46L6O64J384J950K048
$$ y = [67305, 66828, 66625, 66539, 66478, 66564, 66833, 67113, 67267, 67328, 67344, 67323, 67361, 67612, 68047, 68404, 68420, 67956, 66995, 65768, 64805, 64526, 64682, 64600, 64084, 63760, 64286, 65531, 66834, 67809, 68529, 69078, 69392, 69604, 70092, 70901, 71358, 70662, 68939, 67395, 67189, 68279, 69629, 70473, 70970, 71532, 72014, 71991, 71516, 71083, 70932, 70931, 71109, 71756, 72805, 73598, 73532, 72612, 71201, 69618, 68241, 67597, 67925, 68861, 69837, 70603, 71124, 71288, 71105, 70925, 71042, 71212, 70996, 70434, 69987, 69927, 70240, 71066, 72675, 74915, 77031, 78173, 77914, 76392, 74393, 73162, 73504, 74896, 76014, 76351, 76777, 78138, 79851, 80494, 79592, 78203, 77719, 78494, 79725, 80373, 80095, 79433, 79189, 79558, 79961, 79805, 79202, 78695, 78421, 77957, 77055, 76193, 76136, 77083, 78401, 79231, 79224, 78683, 78057, 77467, 76781, 76017, 75413, 75044, 74612, 73791, 72621, 71460, 70691, 70600, 71258, 72297, 73030, 73137, 73081, 73448, 74025, 74032, 73242, 72351, 72052, 72204, 72221, 71899, 71553, 71589, 72253, 73637, 75587, 77635]
55205G7635J625R05P5p74j435j714j782j968k149j854j069m04k36k26k6J22r2
55188F6633l16K3P91J259J072O15M64P80J255J365P50l41j158j214p88l82n9L10
55170G1059M71J91k7N53J667K148J440L00k78k28o1j9m3j52l17k66J11M67M97
55151G7513M65P29J066R62M06j27l45l09n3L97O47K16o89j208q39l3M69N43N67
55132H0377P09O76K07n20j041j108q79o55m98k76QJ10j13n24r33j263j263n21
55114G2493Q89K071K181J494R79R09O30k35j107j344j133r25n74K58J146J168
55098G8900J86q51j029m39K44O45Q33Q98Q14O63O19O34M45j2l22j6P87J363J200
55079H5562O51N15R49J183N15o17j029k35R21J285O90o5l54l50m85p08o31j30
$$ y = [77635, 79260, 80165, 80240, 79466, 78031, 76317, 74535, 72567, 70418, 68564, 67495, 67091, 66855, 66629, 66603, 66725, 66633, 66317, 66340, 67131, 68390, 69462, 70077, 70541, 71321, 72576, 73941, 74691, 74350, 73192, 71978, 71190, 70808, 70749, 71059, 71530, 71721, 71694, 72247, 73914, 76062, 77502, 77802, 77524, 77296, 77235, 77216, 77173, 77021, 76704, 76438, 76549, 77016, 77513, 77978, 78707, 79773, 80735, 81141, 81014, 80669, 80360, 80307, 80704, 81351, 81567, 80878, 79670, 78831, 78798, 79267, 79810, 80377, 81086, 81762, 81969, 81449, 80408, 79300, 78421, 77766, 77268, 76992, 77000, 77110, 76997, 76473, 75540, 74277, 73014, 72493, 73382, 75453, 77634, 79128, 80107, 81016, 81646, 81411, 80304, 78960, 77827, 76902, 76328, 76586, 77732, 78900, 79086, 78235, 77206, 76767, 77011, 77656, 78489, 79387, 80201, 80864, 81483, 82117, 82562, 82550, 82228, 82212, 82999, 84362, 85562, 86213, 86728, 87677, 88860, 89375, 88758, 87729, 87494, 88415, 89700, 90390, 90325, 89971, 89621, 89136, 88428, 87797, 87667]
55061H7667M79Q48Q54M75k76j170j774j766j230m83K04P06R75J035R48P19L63
55044H8574N3j8M7q5m21m98j0O25P48L02j39j17K58N86N55R8n29q39n99j86j72
55023H8233n98j007j085q20j72Q25J599J354J24j071j423j165q75n48P1P28R49
55006H5119P51N09L35K32N67J575K544K330R41k59k15N49Q19K30n74r98j007p64
54988I2684l06L28R61J403J523J230N85q8m41m53m61p07j038j068o12P6N22N25
54970I4663L66M71Q60J151J124J013J081J163R36N10L32M97N24J7p74j260j247
54953A01427j017q42o82m79m13o58r60p53K44J547K142J388k26j348j025K87J208
54936I9840R65R6n08p57j081j337p68P57K159K284J192p6p17o90k40M95J336K015
$$ y = [87667, 88146, 88994, 89848, 90323, 90047, 88877, 87103, 85337, 84107, 83624, 83828, 84534, 85509, 86544, 87492, 88211, 88574, 88627, 88609, 88656, 88571, 88150, 87652, 87642, 88267, 89015, 89317, 89178, 89061, 89319, 89905, 90460, 90558, 90029, 89190, 88591, 88405, 88233, 87635, 86628, 85543, 84723, 84551, 85376, 86975, 88329, 88453, 87382, 85959, 84794, 83919, 83371, 83442, 84170, 85119, 85870, 86379, 86714, 86946, 87513, 89088, 91632, 93962, 94903, 94644, 94429, 94978, 95797, 96027, 95453, 94455, 93448, 92684, 92378, 92706, 93667, 95070, 96593, 97823, 98408, 98320, 97879, 97426, 96965, 96258, 95220, 94152, 93540, 93616, 94138, 94663, 95029, 95500, 96360, 97511, 98635, 99648, 100729, 101892, 102828, 103338, 103670, 104167, 104691, 104708, 103934, 102674, 101427, 100410, 99568, 98886, 98407, 97994, 97336, 96376, 95623, 95867, 97414, 99556, 100944, 100718, 99370, 98345, 98632, 99840, 100805, 100901, 100393, 99636, 98555, 97218, 96450, 97207, 99366, 101650, 102842, 102766, 102049, 101359, 101119, 101614, 102950, 104965]
54918A04965K468K950L680M554N248N450N016M053K942K043J365P03Lo67j418
54903A43355k454l568m170m020l594l445l478l204k515j805j406j224r51l71M84
54888A07634J279J489Q68k02j021j241j021n88K5P61J425J970K610L443M158M397
54872A25986M233M061M127M366M569M402L456J713n7q76p33p48j855l691n148
54857A43805n715n748n621n213m426l573l039k822k684k472k091j452o66n3K63
54842I8493M79N85J70q63j726j551n72J46J27r6l9pl97q77q36l00J56J84m4k30
54822I2802k27j4K82M23M04O09J256J821J557N52k65k99J2n1m87p43n79k56k8
54803I6769R3L7l63r56j160o19K56O84M36K6K4M27Q54J062J114J149J241J403
$$ y = [104965, 107433, 110383, 114063, 118617, 123865, 129315, 134331, 138384, 141326, 143369, 144734, 145437, 145440, 144773, 143355, 140901, 137333, 133163, 129143, 125549, 122104, 118626, 115422, 112907, 111102, 109696, 108472, 107521, 107150, 107634, 108913, 110402, 111270, 111068, 110047, 108806, 107785, 107197, 107222, 107983, 109408, 111378, 113988, 117431, 121589, 125986, 130219, 134280, 138407, 142773, 147342, 151744, 155200, 156913, 156856, 155980, 155247, 154499, 152644, 148953, 143805, 138090, 132342, 126721, 121508, 117082, 113509, 110470, 107648, 104964, 102492, 100401, 98949, 98283, 98230, 98493, 98972, 99557, 99727, 98864, 97138, 95587, 95015, 95161, 95288, 95192, 95153, 95146, 94749, 93872, 93036, 92736, 92892, 93076, 93032, 92802, 92575, 92561, 92843, 93266, 93670, 94279, 95535, 97356, 98913, 99465, 99200, 98901, 98913, 98862, 98375, 97632, 97053, 96797, 96769, 96862, 96899, 96536, 95580, 94420, 93801, 94057, 94741, 95177, 95203, 95227, 95654, 96508, 97570, 98684, 99833, 101074, 102477]
54785A02477J522J299N73l21p16l05N00J010Q93L25l10o42m38K42R57J230J039
54768A09335Q34J021J592K341L240M371N524O193O084N419M595L699K625J550
54754A58423Q06K96n06j753k835l235l328l787m411m356l479k685k602k703k197
54739A21648j252o41n80o73p99j249j875j860p90N86J106N14l69o82l06M06J267
54722A14451K320L359L896L762L478L661M163M261L709L027K618K113J004n06
54708A55316j799k694l379l799l756l564l762m139l772k382r40m94r24j351j369
54693A17192j283j346j404j291j088r06p18m82k37m8Kj47l85m38k18j1r5k85k33
54674A06579l3j64q02j533j875j739j280o20M4L64K37R9M60J166J474J007K49
$$ y = [102477, 103999, 105298, 105871, 105550, 104834, 104529, 105029, 106039, 106932, 107257, 106947, 106305, 105867, 106109, 107066, 108296, 109335, 110169, 111190, 112782, 115123, 118363, 122734, 128258, 134451, 140535, 145954, 150549, 154248, 156873, 158423, 159229, 159525, 159019, 157266, 154431, 151196, 147868, 144081, 139670, 135314, 131835, 129150, 126548, 123845, 121648, 120396, 119755, 119175, 118502, 117703, 116454, 114579, 112719, 111929, 112515, 113621, 114135, 113766, 113084, 112778, 113184, 114451, 116771, 120130, 124026, 127788, 131266, 134927, 139090, 143351, 147060, 150087, 152705, 154818, 155822, 155316, 153517, 150823, 147444, 143645, 139889, 136325, 132563, 128424, 124652, 122270, 121330, 120836, 119912, 118561, 117192, 115909, 114563, 113159, 111868, 110780, 109874, 109156, 108674, 108437, 108389, 108391, 108244, 107859, 107421, 107203, 107192, 107097, 106812, 106579, 106546, 106382, 105580, 104047, 102172, 100433, 99153, 98533, 98577, 98941, 99178, 99277, 99737, 100903, 102377, 103384, 103633]
54657A03633j10p6j89n86p10j27P35J009M18n11j087j014l34P16J644J839J157
54640A06407J67m07m07k43k82m65m91k20J43J97k61q87r82j90R97J657J331M18
54622A06482l36n43l96l67p41j408j928j809q94M12J323J301O42K97Q77J928K378
54605A07218J710M60m40n62k38j14n62j299j611j145m51l43q08j012m44M75J171
54588A02005J599J767J258r4j458j788j133m64l04l50l19l33k69L38J455K271
54572A04181K226J695J219O99j21q39q40k52J94J36j72m84p68q81n59J13O55P72
54554A06974N95L22qk72k46K7J94J21J41N11R49J042Q20O22N33M09L65P57J568
54535A15424K185K051J268L79k58n77m91O7P63R20K72o19r83p90o63q83r17k06
$$ y = [103633, 103523, 103447, 103258, 102672, 101962, 101835, 102570, 103579, 103997, 103486, 102399, 101385, 101051, 101767, 103411, 105250, 106407, 106574, 106167, 105760, 105517, 105235, 104770, 104279, 104059, 104202, 104399, 104138, 103251, 102269, 102079, 103076, 104733, 106064, 106482, 106146, 105603, 105207, 104840, 104099, 102691, 100763, 98954, 98060, 98472, 99795, 101096, 101738, 102035, 102912, 104840, 107218, 108928, 109388, 108948, 108386, 108148, 108034, 107472, 106173, 104562, 103417, 102966, 102623, 101815, 100803, 100359, 100834, 102005, 103604, 105371, 106629, 106535, 105077, 103289, 102156, 101692, 101388, 101038, 100719, 100386, 100117, 100455, 101910, 104181, 106407, 108102, 109321, 110020, 109899, 109060, 108220, 107968, 108162, 108298, 108126, 107642, 106874, 105993, 105434, 105547, 106202, 106974, 107569, 107891, 107883, 107611, 107365, 107392, 107586, 107707, 107848, 108359, 109308, 110350, 111170, 111792, 112325, 112734, 113099, 113856, 115424, 117609, 119660, 120928, 121307, 121049, 120472, 119981, 120048, 120811, 121731, 122003, 121384, 120401, 119611, 118948, 118065, 117148, 116942]
54517A16942R55J646J357L99o25j425j971k187j974j416p74k85q5j88m15m16j
54500A09537O08R89J036J003J062R99N30l18j214j819j928j547j037r79j509j946
54484A03467j392K08J932K846K743J918P89q4m4R71K021K020J014J42K36Q17P66
54467A20370l06j620k072j313M3J163J765K084K218J878R63Rl43j56j31o84j524
54450A22344k125k288k154j898j587j120l08P58J505J376N55k01m75n02n10l43
54434A13027J7J73l5o2N84J447J607Q87K4l18j64J76N61R49J203J200R44M95l3
54415A22682m13n10m87n64n62q9Q18J560J691J372J009O78K42k60n79o21n01l00
54397A25166P4O79J313J611J392Q87N36N42O93P46P91J071J451J357L98j034j988
$$ y = [116942, 117897, 119543, 120900, 121299, 120674, 119249, 117278, 115091, 113117, 111701, 110927, 110642, 110557, 110369, 109954, 109538, 109537, 110145, 111134, 112170, 113173, 114235, 115234, 115764, 115446, 114232, 112413, 110485, 108938, 107901, 106922, 105413, 103467, 102075, 102283, 104215, 107061, 109804, 111722, 112511, 112427, 112383, 113354, 115375, 117395, 118409, 118551, 118787, 119604, 120370, 120064, 118444, 116372, 115059, 115102, 116265, 118030, 120114, 122332, 124210, 125173, 125182, 124839, 124683, 124552, 123868, 122344, 120219, 117931, 115777, 113879, 112292, 111172, 110864, 111622, 113127, 114503, 115058, 114857, 114382, 113880, 113370, 113027, 113044, 113217, 113182, 113120, 113704, 115151, 116758, 117645, 117669, 117351, 117187, 117363, 117924, 118873, 120076, 121276, 122220, 122715, 122682, 122269, 121759, 121272, 120708, 120146, 120057, 120875, 122435, 124126, 125498, 126507, 127185, 127427, 127167, 126588, 125967, 125466, 125166, 125240, 125919, 127232, 128843, 130235, 131122, 131658, 132200, 132893, 133639, 134430, 135501, 136952, 138309, 138707, 137673, 135685]
54380A35685j855r74k57j63k10K73J094J309N01n27o85R7Q92R26K58n61j003p56
54362A34044Q1R12J083N52j33n29n96l14M20J340J686R50m33j460j485o75K90
54345A35733Q12Q59R44J487K205K448K150J975K384K978L042K369J274K31k94
54330A60597q7L57J2j466l084l569k793j664r22o90r14j478j922j802j391j364
54314A37820j711j701j004j63K50K87J04m34j228j666j469j179j259j251n23N35
54298A25408J033R27R61J316J310N92k37n12l11j8L06O76Q48P01N75O90P01K65
54280A35231k61l21q9k02p14j014p53k00L94J121J898K199J709P63j42q85j424
54263A37310j496j048o38q01j236j178m41M49J076J508J761J576R54M31M77Q66
$$ y = [135685, 133830, 132856, 132599, 132436, 132226, 132499, 133593, 134902, 135403, 134876, 134191, 134288, 135180, 136106, 136364, 135803, 134800, 134044, 134125, 135037, 136120, 136672, 136539, 136010, 135414, 135100, 135520, 136860, 138546, 139496, 139063, 137603, 136118, 135443, 135733, 136545, 137404, 138348, 139835, 142040, 144488, 146638, 148613, 150997, 153975, 157017, 159386, 160660, 160891, 160597, 160510, 160867, 160879, 159413, 156329, 152760, 149967, 148303, 147381, 146691, 145777, 144299, 142377, 140575, 139184, 137820, 136109, 134408, 133404, 133241, 133491, 133778, 133882, 133448, 132220, 130554, 129085, 127906, 126647, 125396, 124873, 125408, 126441, 127368, 128329, 129645, 130955, 131547, 131310, 130798, 130487, 130469, 130775, 131451, 132299, 133000, 133575, 134265, 134966, 135231, 134970, 134649, 134560, 134358, 133644, 132630, 131877, 131677, 132071, 133192, 135090, 137289, 138998, 139761, 139619, 138734, 137310, 135814, 134766, 134128, 133327, 132091, 130913, 130472, 130921, 131997, 133505, 135266, 136842, 137796, 138227, 138704, 139570]
54247A39570J002O10j02q41j434j715j526r10j89K56K83N0j88l47m64m85k83J7
54229A33304L7l32o54n18j58p0k25k10p4l55j099j512r28L79J596K221K122J308
54211A34832M9j048j558j629j524j136m02J80Q5l42j93Q45K115K790K613J860
54195A37537J034O26P08P08Oj235k160k220j666j042o25m41m24l72q6L41O10O02
54177A31901L88o7o97r60k99Q92J434Q46l8k84p7j34m73n67l89m49p96q01j68
54158A29262N46O98L99J72J46J4l64p48r20q88o77j72O03J268J420J111P76O88
54140A33334P23O04J81n61j396j766j199mR32J250J480J868J671M04p98l65J353
54123A37711K234J188m98j179j029j224j891k088j391l25O41J437J825J447O60
$$ y = [139570, 140572, 141182, 141080, 140239, 138805, 137090, 135564, 134654, 134465, 134721, 135004, 135054, 134866, 134519, 134055, 133570, 133287, 133304, 133341, 133009, 132355, 131837, 131679, 131609, 131384, 131174, 131100, 130745, 129646, 128134, 127206, 127585, 129181, 131402, 133524, 134832, 134881, 133833, 132275, 130646, 129122, 127986, 127584, 127764, 127849, 127507, 127314, 128159, 130274, 133064, 135677, 137537, 138571, 139197, 139905, 140613, 140619, 139384, 137224, 135004, 133338, 132296, 131671, 131230, 130806, 130434, 130348, 130689, 131299, 131901, 132289, 132222, 131525, 130565, 130266, 131158, 132592, 133438, 133400, 133116, 133039, 132905, 132432, 131865, 131476, 131027, 130231, 129430, 129262, 129808, 130506, 130905, 131077, 131223, 131237, 130873, 130125, 129205, 128317, 127640, 127468, 128071, 129339, 130759, 131870, 132646, 133334, 134057, 134661, 134842, 134281, 132885, 131119, 129920, 129916, 130848, 132098, 133578, 135446, 137117, 137521, 136723, 136358, 137711, 139945, 141133, 140635, 139456, 138427, 137203, 135312, 133224, 131833, 131508, 132149, 133586, 135411, 136858, 137518]
54108A37518M17R58J363Q48j18m56J17Q84J139R41P88Q53P69J77p07j277j281
54091A42933j042q60n80n3L56K54q3q6J69J03l50n25m0O55R47P72L47k39q22r78
54071A40878n53J5L01N43J176J948K114J483P33N61R45J388J555J399R86M42Q8
54054A56002K49Q79J526J768J610J392J402J752K473L495M434M734M238L484L214
54039A92652L678M563N442O096O502O874P602Q842J0133J0744J0383R322P887
54026B90720O166M276K505R83m82j980l238l972m336m732n247n540n291m588l891
54011B61353l663l993m568n035n337n592n739n528m875m008l253k841k887l307
53997B00727l698l533k674j543p26m82o52r06j059j199j467j700j542j049q44
$$ y = [137518, 137935, 138893, 140256, 141104, 140986, 140530, 140647, 141531, 142670, 143611, 144399, 145252, 146021, 146198, 145491, 144214, 142933, 141891, 141031, 140451, 140398, 140754, 141008, 140925, 140839, 141008, 141111, 140761, 140236, 140196, 140851, 141798, 142570, 142917, 142678, 141856, 140878, 140325, 140340, 140641, 141184, 142360, 144308, 146422, 147905, 148638, 149199, 150144, 151532, 153087, 154486, 155472, 155914, 156002, 156251, 157130, 158656, 160424, 162034, 163426, 164828, 166580, 169053, 172548, 176982, 181716, 185954, 189438, 192652, 196330, 200893, 206335, 212431, 218933, 225807, 233409, 242251, 252384, 263128, 273511, 282833, 290720, 296886, 301162, 303667, 304650, 304168, 302188, 298950, 294978, 290642, 285910, 280663, 275123, 269832, 265244, 261353, 257690, 253697, 249129, 244094, 238757, 233165, 227426, 221898, 217023, 213015, 209762, 206921, 204034, 200727, 197029, 193496, 190822, 189279, 188553, 188071, 187419, 186513, 185454, 184255, 182788, 181088, 179546, 178497, 177653]
53982A77653j279j789j552o51J01K44J2m01r98j392r60J12P23K92m39n04L1M85
53964A69688N69L77p3n59m72L79J163J115P27J049K031K651K442J942J598J300
53948A85927J082J331J968K310K096J914K175K517K590K736L275L831M079M533
53934B22364N718O926O812N253L681L363M022M542M435M047L651L052K197J574
53920B81637J682K380L133L719M287M759M793M448M344M832N405N405M942M566
53906C40332M290L598K372J148L50j70o87j127j270j058o24k45l26r67j600j502
53890C42514p62k20l20o45p62q28r45n47R28L046M749N574N989O520O965O478
53874C77734M199o3n449j0394j3704j5322j5937j5950j5188j3523j1410r608q484
$$ y = [177653, 176374, 174585, 173033, 172382, 172483, 172727, 172739, 172338, 171340, 169948, 168988, 169100, 169823, 170115, 169676, 169172, 169203, 169688, 170257, 170634, 170561, 170002, 169530, 169909, 171072, 172187, 172914, 173963, 175994, 178645, 181087, 183029, 184627, 185927, 187009, 188340, 190308, 192618, 194714, 196628, 198803, 201320, 203910, 206646, 209921, 213752, 217831, 222364, 228082, 235008, 241820, 247073, 250754, 254117, 258139, 262681, 267116, 271163, 274814, 277866, 280063, 281637, 283319, 285699, 288832, 292551, 296838, 301597, 306390, 310838, 315182, 320014, 325419, 330824, 335766, 340332, 344622, 348220, 350592, 351740, 352090, 351920, 351233, 350106, 348836, 347778, 347154, 346909, 346583, 345616, 344016, 342514, 341752, 341532, 341212, 340567, 339805, 338977, 338032, 337485, 338413, 341459, 346208, 351782, 357771, 364291, 371256, 377734, 381933, 381870, 376421, 366027, 352323, 337001, 321064, 305114, 289926, 276403, 264993, 255385, 246901]
53861B46901p768o990o052n272m837m461l805l057k698k747k682k191j593j298
53847A91450j239j143j036j125j367j465j202o77k40k41o69j027q73l98r1J9K53
53830A78929L88j66j124j176K28J773J846O58j66J73R06J096P65M21K56K31L91
53813A85429P29J066J325J614K039K608L351M163M617M380L789L599M028M512
53799B27249M504M091L653L346L126K984K921K845K655K281J692J030O78Q41J115
53784B65011Q19j63j158j410q15J2J66r20k921m692n266m775m155m000m112m100
53768B27521l901l696l601l627l608l219k372j470j036j155j608k244k821k848
53754A90315k234j766k071k441j741k98L42k49p39j51O98P02K29K60O27M20l47
$$ y = [246901, 239133, 232143, 226091, 220819, 215982, 211521, 207716, 204659, 201961, 199214, 196532, 194341, 192748, 191450, 190211, 189068, 188032, 186907, 185540, 184075, 182873, 182196, 181956, 181715, 181046, 180019, 179146, 178748, 178657, 178676, 178929, 179317, 179151, 178027, 176851, 177079, 178852, 180698, 181356, 181190, 181363, 182269, 183365, 184130, 184551, 184807, 185038, 185429, 186158, 187224, 188549, 190163, 192202, 194810, 198161, 202324, 206941, 211321, 215110, 218709, 222737, 227249, 231753, 235844, 239497, 242843, 245969, 248953, 251874, 254719, 257374, 259655, 261347, 262377, 263055, 263896, 265011, 265830, 265667, 264509, 263099, 262284, 262296, 262462, 261542, 258621, 253929, 248663, 243888, 239733, 235733, 231621, 227521, 223620, 219924, 216323, 212696, 209088, 205869, 203497, 202027, 200991, 199836, 198228, 195984, 193163, 190315, 188081, 186315, 184244, 181803, 180062, 179764, 180106, 179857, 179118, 178967, 179665, 180367, 180596, 180856, 181483, 181903, 181556]
53737A81556o88j51O84J184J315J297J298J495J845J814Q90n56j449j117Q6J246
53721A90749J673J391J108J479K224K314J414N36O76J414J658J292J127J438J628
53706B12121J432J364J751K201K394K594L038L399L349L144L187L291K882J800
53692B47947O55L59J274K696L407K968K162J803J549O30o42j115n39O2l6l68l43
53675B62469k38m57o09k00L59K62m90j156j339j278j196j002p24o90j123j755
53659B50833j981j383l02K31n11j864k162n97J741L077K806J716P49J93o5j27
53643B52354n0J27M58J004J652K177K362K051J285N04K06K75L1p05j106l36J274
53626B63563K667L257L197K716J948J315J320J847K248K238K213K602L351M178
$$ y = [181556, 180868, 180717, 181401, 182585, 183900, 185197, 186495, 187990, 189835, 191649, 192539, 191983, 190534, 189417, 189503, 190749, 192422, 193813, 194921, 196400, 198624, 200938, 202352, 202888, 203564, 204978, 206636, 207928, 209055, 210493, 212121, 213553, 214917, 216668, 218869, 221263, 223857, 226895, 230294, 233643, 236787, 239974, 243265, 246147, 247947, 248602, 248961, 250235, 252931, 256338, 259306, 261468, 263271, 264820, 265450, 264808, 263693, 263154, 263216, 263180, 262812, 262469, 262231, 261774, 261165, 260965, 261324, 261586, 261096, 259940, 258601, 257323, 256127, 255125, 254401, 253711, 252588, 250833, 248852, 247469, 247167, 247398, 246887, 245023, 242861, 242264, 244005, 247082, 249888, 251604, 252353, 252546, 252481, 252354, 252304, 252431, 252889, 253893, 255545, 257722, 260084, 262135, 263420, 263924, 264130, 264405, 264436, 263731, 262625, 262289, 263563, 266230, 269487, 272684, 275400, 277348, 278663, 279983, 281830, 284078, 286316, 288529, 291131, 294482, 298660]
53612B98660M857N069M489L283K190J835K202K894L616M143M195L648K844K371
53598C46296K465K700K440J570P00M57P48R94J037J252J630J425K04j241j738
53583C60939j125j99M61Q26Q69N57L78Q62J434P94j271l324m051l756l473l451
53567C46470l299l065l109l194k656j494n09k38m07n32n06l52L6O34J075J044
53551C29898O76L51K86N05J032J852K694L128K974K552K439K953L882M695N024
53536C64941M935M808N032N718O610P302P681Q037Q645R325R676R739J0052J0940
53522D73441J2028J2650J2594J2290J2381J3238J4682J6102J6972J7363J7842
53511F31583J8802K0070K1194K1915K2233K2289K2273K2321K2377K2329K2290
$$ y = [298660, 303517, 308586, 313075, 316358, 318548, 320383, 322585, 325479, 329095, 333238, 337433, 341081, 343925, 346296, 348761, 351461, 353901, 355471, 356171, 356628, 357376, 358370, 359407, 360659, 362289, 363714, 363918, 362677, 360939, 359814, 359615, 360076, 360902, 361771, 362328, 362706, 363568, 365002, 365796, 364525, 361201, 357150, 353394, 349921, 346470, 343171, 340106, 336997, 333803, 331147, 329653, 329144, 328906, 328499, 327967, 327461, 327109, 327145, 327779, 328854, 329898, 330574, 330925, 331211, 331716, 332748, 334600, 337294, 340422, 343396, 345948, 348387, 351340, 355222, 359917, 364941, 369876, 374684, 379716, 385434, 392044, 399346, 407027, 415064, 423709, 433034, 442710, 452449, 462501, 473441, 485469, 498119, 510713, 523003, 535384, 548622, 563304, 579406, 596378, 613741, 631583, 650385, 670455, 691649, 713564, 735797, 758086, 780359, 802680, 825057, 847386, 869676]
53500H69676K2413K2469K2000K1067K0296J9967J9568J8620J7514J7008J7180
53489A087778J7483J7552J7392J6888J5887J4761J4257J4544J4981J4958J4531
53478A261012J3960J3122J1857J0549R781R376Q289N710K065j319l512m660n422
53465A330808o147o882p851r272j0771j1588j1640j1810j2804j4210j5190j5664
53453A196979j6236j7149j8006j8398j8224j7480j6386j5643j5904j6780j7005
53442A009768j5795j3537j0961q350n888m120l389l118k424j290n73p48j145p18
53428I37712P29K404L490M006M605N758P343R005J0570J2045J3451J4842J6298
53415A042258J7663J8586J9052J9609K0714K2135K3365K4479K5955K7894K9954
$$ y = [869676, 892089, 914558, 936558, 957625, 977921, 997888, 1017456, 1036076, 1053590, 1070598, 1087778, 1105261, 1122813, 1140205, 1157093, 1172980, 1187741, 1201998, 1216542, 1231523, 1246481, 1261012, 1274972, 1288094, 1299951, 1310500, 1320281, 1329657, 1337946, 1343656, 1345721, 1344402, 1340890, 1336230, 1330808, 1324661, 1317779, 1309928, 1300656, 1289885, 1278297, 1266657, 1254847, 1242043, 1227833, 1212643, 1196979, 1180743, 1163594, 1145588, 1127190, 1108966, 1091486, 1075100, 1059457, 1043553, 1026773, 1009768, 993973, 980436, 969475, 961125, 955237, 951117, 947728, 944610, 942186, 940896, 940323, 939575, 938430, 937712, 938441, 940845, 944335, 948341, 952946, 958704, 966047, 975052, 985622, 997667, 1011118, 1025960, 1042258, 1059921, 1078507, 1097559, 1117168, 1137882, 1160017, 1183382, 1207861, 1233816, 1261710, 1291664]
53404A291664L1933L3841L5457L6593L7762L9770M2442M4597M5581M6032M6760
53393A732432M7652M8269M8796M9580N0288N0327M9724M8844M7529M5325M2423
53382B261189L9658L7583L6084L4767L3158L0665K7085K3016J9186J5464J1180
53371B569035O320J553k966p883j3486j9113k4148k8837l3528l7756m0771m2652
53359B325768m4125m5445m6087m5636m4410m3085m2012m1087m0079l8942l7858
53348A857002l7052l6511l5993l5378l4962l5163l5933l6559l6185l4516l1977
53337A466773k9286k6853k4598k2221j9606j7039j5119j4315j4480j4828j4727
53326A253701j4440j4743j5712j6383j5911j4661j3667j3271j2940j2238j1367
$$ y = [1291664, 1323597, 1357438, 1392895, 1429488, 1467250, 1507020, 1549462, 1594059, 1639640, 1685672, 1732432, 1780084, 1828353, 1877149, 1926729, 1977017, 2027344, 2077068, 2125912, 2173441, 2218766, 2261189, 2300847, 2338430, 2374514, 2409281, 2442439, 2473104, 2500189, 2523205, 2542391, 2557855, 2569035, 2575355, 2576908, 2573942, 2566059, 2552573, 2533460, 2509312, 2480475, 2446947, 2409191, 2368420, 2325768, 2281643, 2236198, 2190111, 2144475, 2100065, 2056980, 2014968, 1973881, 1933802, 1894860, 1857002, 1819950, 1783439, 1747446, 1712068, 1677106, 1641943, 1606010, 1569451, 1533266, 1498750, 1466773, 1437487, 1410634, 1386036, 1363815, 1344209, 1327170, 1312051, 1297736, 1283256, 1268428, 1253701, 1239261, 1224518, 1208806, 1192423, 1176512, 1161851, 1148184, 1134913, 1121973, 1109735, 1098368]
53315A098368j0616r850q814p543o241m985l700k355j021N8O86J187K460N046
53301A052680Q187J0484J1554J2400J3859J5511J6604J7428J8913K1161K3190
53290A221971K4172K4188K3703K2865K1719K0575J9716J8866J7391J5069J2469
53279A442704J0385Q992P681N704K947o1k732m906o804q697j0656j2527j4108
53266A417922j5457j6932j8747k0517k1618k1967k2209k2956k4131k5154k5537
53255A182697k5196k4426k3723k3339k2912k1857k0351j9424j9841k1134k2181
53244I38313k2399k1957k1142k0092j9086j8458j8147j7728j6970j6030j5011
53233G31293j3734j2097j0387r109q589q805r358r672r478r148r275r933j0655
$$ y = [1098368, 1087752, 1077902, 1069088, 1061545, 1055304, 1050319, 1046619, 1044264, 1043243, 1043301, 1043987, 1045174, 1047634, 1052680, 1060867, 1071351, 1082905, 1095305, 1109164, 1124675, 1141279, 1158707, 1177620, 1198781, 1221971, 1246143, 1270331, 1294034, 1316899, 1338618, 1359193, 1378909, 1397775, 1415166, 1430235, 1442704, 1453089, 1462081, 1469762, 1475466, 1478413, 1478352, 1475620, 1470714, 1463910, 1455213, 1444557, 1432030, 1417922, 1402465, 1385533, 1366786, 1346269, 1324651, 1302684, 1280475, 1257519, 1233388, 1208234, 1182697, 1157501, 1133075, 1109352, 1086013, 1063101, 1041244, 1020893, 1001469, 981628, 960494, 938313, 915914, 893957, 872815, 852723, 833637, 815179, 797032, 779304, 762334, 746304, 731293, 717559, 705462, 695075, 685966, 677377, 668572, 659214, 649542, 640064, 630916, 621641, 611708, 601053]
53220F01053j1178j1774j2692j3653j4189j4179j3825j3276j2571j1814j1117
53209D60785j0438r678q948q466q237p975p451o757o285o390p077p903q286q043
53195C48851p586p492p777p837p149n930m907m469m311l930l262k618k217k027
53181B77339j994k082k091j806j383j279j589j831j607j239j280j696j880j516
53167B54066r16n46m96n39m33j01K70K41m68j478j941j446n48k11p67j631k025
53150B41031j800j476j484j663j605j345j282j475j391o87K24P20P97Q26P82K80
53134B30452o37j380j510j141n66j7K58J09r5K06R04J235Q54L00Q8k3m03p88p77
53115B27069o18p47r00m81K84L94n91j882k389j850q89l18m95j070j272p62j34
$$ y = [601053, 589875, 578101, 565409, 551756, 537567, 523388, 509563, 496287, 483716, 471902, 460785, 450347, 440669, 431721, 423255, 415018, 407043, 399592, 392835, 386550, 380160, 373083, 365180, 356894, 348851, 341265, 333773, 325996, 318159, 311010, 305080, 300173, 295704, 291393, 287463, 284201, 281583, 279366, 277339, 275345, 273263, 271172, 269366, 267983, 266704, 265115, 263284, 261677, 260438, 259158, 257462, 255582, 254066, 253150, 252604, 252108, 251569, 251136, 251035, 251305, 251546, 251078, 249600, 247659, 246213, 245665, 245454, 244687, 243056, 241031, 239231, 237755, 236271, 234608, 233003, 231658, 230376, 228901, 227510, 226823, 227047, 227767, 228564, 229390, 230172, 230452, 229815, 228435, 226925, 225784, 225218, 225201, 225459, 225568, 225473, 225679, 226583, 227818, 228672, 228972, 229060, 229037, 228634, 227846, 227069, 226451, 225704, 224804, 224323, 224607, 225001, 224410, 222528, 220139, 218289, 217400, 217082, 216587, 215517, 214245, 213483, 213349]
53098B13349j71p29q82k89L81N96Q04J476J975J250m74j688j446m65N0K5L19J234
53080B15315K013J923J150L30l68j101j596j281k43N30K67o16j039n72K47P63
53064B15722Q63P46N01J80k6J9J50J11q8k42k61k60l18m45p33j258j712j434j53
53045B11362J407K050J307q8j087j345j214j039q26n33k04J49M35L19l93j190
53029B09110j251o06k66q32j533j230PJ061J222P70J66m51q57n91M00J454J935
53012B08508J868J576J069K54n80r39o73n9O06J104J227Q72L03j3J39M92N70J43
52994B16467m55n79J7P49P87J28l42L3Q94J497J606J418R71K60l37l59L3K21J7
52975B23026j20K01Q03J321J638J776J719J506J306J240J358J749K372K778K453
$$ y = [213349, 213178, 212449, 211567, 211278, 211659, 212255, 213059, 214535, 216510, 217760, 217286, 215598, 214152, 213687, 213737, 213762, 214081, 215315, 217328, 219251, 220401, 220731, 220363, 219262, 217666, 216385, 216142, 216672, 216939, 216323, 215284, 214712, 214959, 215722, 216585, 217331, 217832, 218012, 217986, 218005, 218155, 218266, 218178, 217936, 217675, 217415, 217097, 216652, 215919, 214661, 212949, 211515, 211362, 212769, 214819, 216126, 216038, 214951, 213606, 212392, 211353, 210527, 209994, 209790, 209939, 210374, 210693, 210300, 209110, 207859, 207253, 206987, 206155, 204622, 203392, 203399, 204460, 205682, 206452, 206618, 206167, 205310, 204719, 205119, 206573, 208508, 210376, 211952, 213021, 213275, 212695, 211756, 211083, 211024, 211630, 212734, 213961, 214833, 215136, 215123, 215262, 215754, 216324, 216467, 216012, 215433, 215450, 216199, 216986, 217114, 216772, 216805, 217699, 219196, 220802, 222220, 223191, 223451, 223114, 222755, 222788, 223009, 223026, 222906, 223107, 223910, 225231, 226869, 228645, 230364, 231870, 233176, 234416, 235774, 237523, 239895, 242673, 245126]
52960B45126J510N76j44j101k381l055k198l12J007Q10l47j319j664j725j832
52945B32951j882j635j095m90l7J14j57q01j420j525j162r70j347j763j405l29
52929B17047N71Q01P91R94J116O86n0m73m34k47r4j7k56r46j582j504q48l76l14
52910B14865j12N32J124J188R02N63k0r64j735j758j302j056j055p12J47R66J281
52893B12854J267J272J254J037P11N18M63L52R9j68k67p3M03R41J171Q50J46m43
52875B22387n12j75M2j56l68J12J336K488K787K380J916J515O78o95j793j777
52859B30165q39l7j17q22j388j424j222j298j760k195k155j654j096q32r40j343
52843B11043j870k137j681n15O06P99p1j261j936j872j373p25j7O33R27O76J07
$$ y = [245126, 246636, 247212, 247068, 245967, 243586, 240531, 238333, 238021, 239028, 239838, 239491, 238172, 236508, 234783, 232951, 231069, 229434, 228339, 227849, 227812, 227926, 227769, 226968, 225548, 224023, 222861, 221891, 220544, 218781, 217376, 217047, 217618, 218419, 219210, 220204, 221320, 222006, 221956, 221483, 221049, 220802, 220708, 220691, 220435, 219489, 217907, 216403, 215555, 215179, 214865, 214753, 215285, 216409, 217597, 218499, 219062, 219042, 218078, 216343, 214585, 213283, 212227, 211172, 210460, 210607, 211573, 212854, 214121, 215393, 216647, 217684, 218395, 218913, 219376, 219728, 219827, 219659, 219392, 219319, 219722, 220663, 221834, 222684, 222830, 222387, 221875, 221700, 221742, 221586, 221218, 221330, 222666, 225154, 227941, 230321, 232237, 233752, 234430, 233735, 231942, 230165, 229326, 229289, 229172, 228350, 226962, 225538, 224316, 223018, 221258, 219063, 216908, 215254, 214158, 213326, 212386, 211043, 209173, 207036, 205355, 204840, 205446, 206245, 206174, 204913, 202977, 201105, 199732, 199007, 198990, 199623, 200550, 201226, 201333]
52826B01333l45n23o39q60r95p41j56L09K43l18r19j046n53K26Q24J156J503K001
52808B00500K403K473K362K287K063J365L76l19n00n64q84j248j242q52n09n88
52792B07123j056j496j483j032o63q00j171j131n56m6n8l26l42l8L36P16J140
52775A99117J412J238O91J78LJ65N12Q19Q00L64k31o71r53j227j373j113n10n2
52757A99169j31n98r01n87K10P46L59o83j283p57L00P83M41j0J7M18Q62J217J342
52738B00914J067O34O03J065J395J186R32J324K171K640K432K079K050K063J603
52723B24158P81J84J4k65j162k334k893k535j893j617j484q63K06R80R43L06m61
52706B12065r89r77l57L09L11j53n0R35J673J020n45j492j105j4Q64J104O47k20
$$ y = [201333, 200988, 200465, 199826, 198966, 197971, 197230, 197074, 197383, 197626, 197308, 196389, 195343, 194790, 195016, 195840, 196996, 198499, 200500, 202903, 205376, 207738, 210025, 212088, 213453, 213829, 213510, 213010, 212446, 211562, 210314, 209072, 208220, 207711, 207123, 206067, 204571, 203088, 202056, 201393, 200593, 199422, 198291, 197735, 197689, 197631, 197305, 196963, 196925, 197261, 197977, 199117, 200529, 201767, 202458, 202636, 202639, 202804, 203316, 204135, 204935, 205299, 205068, 204397, 203444, 202217, 200844, 199731, 199221, 199169, 199038, 198440, 197539, 196952, 197162, 197908, 198267, 197584, 196301, 195544, 195844, 196627, 197068, 197058, 197075, 197493, 198355, 199572, 200914, 201981, 202615, 203218, 204283, 205678, 206864, 207796, 209120, 211291, 213931, 216363, 218442, 220492, 222555, 224158, 224939, 225123, 225137, 224872, 223710, 221376, 218483, 215948, 214055, 212438, 210954, 210091, 210297, 211277, 212220, 212526, 212065, 211076, 210099, 209742, 210051, 210362, 210209, 210159, 211094, 212767, 213787, 213242, 211750, 210645, 210631, 211495, 212599, 213246, 213026]
52688B13026p17j73J016J695J399Q36P35R14Q46N18J96j38o53j225j632j822j709
52671B13112j049P3J005J303J296J388J292O53QJ60P67O70k54p28L8J110J177
52654B22021L73j14J84O20N83K81K43O74J372J863J576L71j052j735j456q62m91
52637B24451k26K06O58Q33Q07R73J627K698L766M324M283M262M967O135O554N347
52621B71665K933M39j437k736l757m719n615o039n362l465j181M10Q96N53k46
52606B42339j141j607j357q30o94q61o42J72R83J273J171R36M89k00p24o83j74
52589B38450M49R74J241J042M93J54M07R11J070Q04M95L66K83R9j60l42k30K81
52571B46787Q43P96q2j199j869k077k122j866j003O1L81l62j402j765j176k6J062
$$ y = [213026, 212309, 212136, 213152, 214847, 216246, 217082, 217817, 218731, 219577, 220095, 220291, 220153, 219500, 218275, 216643, 214821, 213112, 212063, 212136, 213141, 214444, 215740, 217128, 218420, 219073, 219081, 219241, 220008, 220678, 220424, 219696, 219734, 220844, 222021, 222394, 222280, 222464, 223084, 223667, 223948, 224191, 224865, 226237, 228100, 229676, 230047, 228995, 227260, 225804, 224942, 224451, 224225, 224431, 225089, 225922, 226729, 227702, 229329, 232027, 235793, 240117, 244400, 248662, 253629, 259764, 266318, 271665, 274598, 275037, 273600, 270864, 267107, 262388, 256773, 250734, 245372, 241907, 240726, 241136, 242032, 242585, 242339, 241198, 239591, 238234, 237404, 236710, 235849, 235207, 235379, 236362, 237635, 238806, 239742, 240231, 240031, 239307, 238624, 238450, 238899, 239873, 241114, 242156, 242649, 242803, 243210, 244121, 245191, 245995, 246490, 246856, 247139, 247238, 247078, 246736, 246506, 246787, 247630, 248426, 248344, 247145, 245276, 243199, 241077, 239211, 238208, 238269, 238650, 238288, 236886, 235121, 233945, 233919, 234981]
52554B34981J455Q28l83j208j132o06l14k88r0M23R52J221J217J000O11J94o4
52537B38797j80k83l44k20K3J26O7J51M92P02M32k0l0M28O35J40n61o70k03O1
52517B39543l54j041j331j053n07K3M43P81J144J634K134K384K350K258K149J748
52501B52305J015M09K18J8p23j758k418k534k453k215j546o53k12l73m90j16L79
52484B38853N73P41J294J972K199J889J361P77K14m1J21K08k10o54k91O83J116
52467B50805M67m53o36m6Q25J860L078L908L575K186P95K28K99K53l56j393k379
52450B63016k782k347j351m61j09j65l03m29n70n80l67k96q64j865k298j503j01
52433B46625N91O1q89j200p59k99l68p24q22m76Q3O60J236J683J677J105M06J84
$$ y = [234981, 236436, 237264, 236881, 235673, 234541, 233935, 233621, 233333, 233243, 233666, 234618, 235839, 237056, 238056, 238667, 238861, 238797, 238617, 238334, 237990, 237770, 237793, 237919, 237986, 238137, 238629, 239331, 239763, 239743, 239713, 240141, 240776, 240916, 240355, 239685, 239482, 239543, 239189, 238148, 236817, 235764, 235257, 235280, 235723, 236504, 237648, 239282, 241416, 243800, 246150, 248408, 250557, 252305, 253320, 253729, 253947, 253965, 253242, 251484, 249066, 246532, 244079, 241864, 240318, 239665, 239453, 239080, 238590, 238474, 238853, 239426, 240167, 241461, 243433, 245632, 247521, 248882, 249659, 249873, 249832, 249953, 250161, 249951, 249297, 249006, 249689, 250805, 251272, 250819, 250183, 250137, 250962, 252822, 255900, 259808, 263383, 265569, 266364, 266592, 266891, 267144, 266788, 265395, 263016, 260234, 257887, 256536, 256075, 255966, 255801, 255498, 255069, 254499, 253919, 253552, 253256, 252392, 250527, 248229, 246726, 246625, 247216, 247277, 246388, 245188, 244429, 244130, 243762, 243038, 242216, 241740, 241823, 242483, 243719, 245402, 247079, 248184, 248590, 248774]
52415B48774N41J037J318J473J737K175K869M046N681P177P920Q045Q217Q627
52401C09637Q562P155M282O63k677m965o029o306o355o306n904n044l965k871
52387B79877j795q89m28l13J7Q36J646J862J659J654J959K117J951J843K094K473
52371B96563K673K828L233L850M345M486M278L771L012K135J301N27k41q34q76
52356C31051k10P79J477J638J540J483J417J238J187J570K194K521K481K681L600
52341C56647M909N908O333O436O472O580O974P923R427J1148J2605J3395J3394
52328D68151J3068J3328J4782J7070J9293K0928K2038K2782K3177K3312K3341
52317F81270K3178K2592K1644K0698J9949J9249J8442J7532J6555J5662J5249
$$ y = [248774, 249315, 250352, 251670, 253143, 254880, 257055, 259924, 263970, 269651, 276828, 284748, 292793, 301010, 309637, 318199, 325354, 329636, 330299, 327622, 322657, 316628, 310322, 303967, 297661, 291757, 286713, 282748, 279877, 278082, 277193, 276765, 276452, 276469, 277305, 278951, 280813, 282472, 284126, 286085, 288202, 290153, 291996, 294090, 296563, 299236, 302064, 305297, 309147, 313492, 317978, 322256, 326027, 329039, 331174, 332475, 333002, 332761, 331927, 331051, 330841, 331620, 333097, 334735, 336275, 337758, 339175, 340413, 341600, 343170, 345364, 347885, 350366, 353047, 356647, 361556, 367464, 373797, 380233, 386705, 393285, 400259, 408182, 417609, 428757, 441362, 454757, 468151, 481219, 494547, 509329, 526399, 545692, 566620, 588658, 611440, 634617, 657929, 681270, 704448, 727040, 748684, 769382, 789331, 808580, 827022, 844554, 861109, 876771, 892020]
52306H92020J5527J5908J5420J3878J2099J0795R811Q730P585O522N319L750K026
52293A019390L49j519l708n624o620p054p884r274j0292j0122q983p638o451n190
52279I29380l455j111J503L775N411O707Q116R644J1062J2443J3980J5411J6197
52266A029063J6276J6090J5854J5384J4720J4189J3717J2794J1426J0414J0208
52255A180135J0104R188P571O024M839L759K755K033J316p9k375n089p752j0213
52241A202216j2172j3104j3023j2767j3080j3731j3891j3190j2056j1165j0807
52230A063230j0668j0120q856p361o413o096n686m717l731l443l582l182j898
52217I87477l38R36K050L217M096M272M050M229N152O303O911O684N976N306M868
$$ y = [892020, 907547, 923455, 938875, 952753, 964852, 975647, 985458, 994188, 1001773, 1008295, 1013614, 1017364, 1019390, 1019739, 1018220, 1014512, 1008888, 1002268, 995214, 987330, 978056, 967764, 957642, 948659, 941021, 934570, 929380, 925925, 924814, 926317, 930092, 935503, 942210, 950326, 959970, 971032, 983475, 997455, 1012866, 1029063, 1045339, 1061429, 1077283, 1092667, 1107387, 1121576, 1135293, 1148087, 1159513, 1169927, 1180135, 1190239, 1199427, 1206998, 1213022, 1217861, 1221620, 1224375, 1226408, 1227724, 1227645, 1225270, 1220181, 1212429, 1202216, 1190044, 1176940, 1163917, 1151150, 1138070, 1124339, 1110448, 1097258, 1085202, 1074037, 1063230, 1052562, 1042442, 1033586, 1026225, 1019812, 1013716, 1008030, 1003313, 999582, 996139, 992557, 989375, 987477, 987139, 988075, 990125, 993342, 997438, 1001710, 1005760, 1009989, 1015141, 1021444, 1028355, 1035039, 1041015, 1046321, 1051189]
52202A051189M402L668K915K670L057L613L878L842L617L110K418K126K622L351
52188A096478L389K705K109J933J579N93o43j725k960m576n899o164n851o231
52174A074737p559q656q425p119n782n030m677m191l169j660k09O28R02J164J717
52159A022671K337K778L024L017K647K221K274K693K589J540L85J94R22J629J781
52144A052702J601J401J240J169J269J442J626K050K828L475L498L361M142O201
52130A088005Q802J1157J3189J5089J6840J8520K0522K2997K5452K7244K8258
52119A296075K8827K9263K9664K9960K9892K9210K7926K6195K3949K1145J8278
52108A590384J6072J4460J2588R999P169M548J888r51l303m586n279o209p281
$$ y = [1051189, 1055591, 1059259, 1062174, 1064844, 1067901, 1071514, 1075392, 1079234, 1082851, 1085961, 1088379, 1090505, 1093127, 1096478, 1099867, 1102572, 1104681, 1106614, 1108193, 1108786, 1108143, 1106418, 1103458, 1098882, 1092983, 1086819, 1080968, 1074737, 1067178, 1058522, 1050097, 1042978, 1037196, 1032166, 1027489, 1023298, 1020129, 1018469, 1018260, 1018888, 1019790, 1020954, 1022671, 1025008, 1027786, 1030810, 1033827, 1036474, 1038695, 1040969, 1043662, 1046251, 1047791, 1048176, 1048370, 1049292, 1050921, 1052702, 1054303, 1055704, 1056944, 1058113, 1059382, 1060824, 1062450, 1064500, 1067328, 1070803, 1074301, 1077662, 1081804, 1088005, 1096807, 1107964, 1121153, 1136242, 1153082, 1171602, 1192124, 1215121, 1240573, 1267817, 1296075, 1324902, 1354165, 1383829, 1413789, 1443681, 1472891, 1500817, 1527012, 1550961, 1572106, 1590384, 1606456, 1620916, 1633504, 1643503, 1650672, 1655220, 1657108, 1656157, 1652854, 1648268, 1642989, 1636780, 1629499]
52095A629499p873q071q545r407j0207j0981j2257j3883j4922j5036j4990j5320
52083A488007j5308j3920j1165p910m825k076K98K341M289O319Q311J0189J2163
52070A476713J4265J6013J6964J7306J7430J7235J6422J5286J4465J4029J3426
$$ y = [1629499, 1621626, 1613555, 1605010, 1595603, 1585396, 1574415, 1562158, 1548275, 1533353, 1518317, 1503327, 1488007, 1472699, 1458779, 1447614, 1439704, 1434879, 1432803, 1433101, 1435442, 1439731, 1446050, 1454361, 1464550, 1476713, 1490978, 1506991, 1523955, 1541261, 1558691, 1575926, 1592348, 1607634, 1622099, 1636128, 1649554]
$$ [...]
##END NTUPLES=NMR SPECTRUM
##END=
