##TITLE=AC1598_PERAH13328_8314459_ReeslgHcy3
##JCAMPDX= 6.0         $$ Bruker NMR JCAMP-DX V2.0
##DATA TYPE= NMR SPECTRUM
##DATA CLASS= NTUPLES
##ORIGIN= BRUKER
##OWNER= Administrator
$$ 1.72 TOPSPIN		Version 2.1
$$ 2013-11-09 17:19:26.795 -0800  Administrator@X
$$ Compression mode = diff/dup
##.OBSERVE FREQUENCY= 400.02188249412
##.OBSERVE NUCLEUS= ^1H
##.ACQUISITION MODE= SIMULTANEOUS (DQD)
##.ACQUISITION SCHEME= undefined
##.AVERAGES= 8
##.DIGITISER RES= 22
##SPECTROMETER/DATA SYSTEM= spect
##.PULSE SEQUENCE= zg30
##.SOLVENT NAME= COFFEE_meoh
##.SHIFT REFERENCE= INTERNAL, COFFEE_meoh, 1, 14.98509
##AUDIT TRAIL= $$ (NUMBER, WHEN, WHO, WHERE, PROCESS, VERSION, WHAT)
$$ ##TITLE= Audit trail, TOPSPIN		Version 2.1
$$ ##JCAMPDX= 5.01
$$ ##ORIGIN= Bruker BioSpin GmbH
$$ ##OWNER= Administrator
$$ $$ E:\/data/COFFEE/nmr/AC1598_PERAH13328_8314459_ReeslgHcy3/10/pdata/1/auditp.txt
$$ ##AUDIT TRAIL=  $$ (NUMBER, WHEN, WHO, WHERE, PROCESS, VERSION, WHAT)
(   1,<2013-11-09 17:19:19.779 -0800>,<Administrator>,<X>,<go>,<TOPSPIN 2.1>,
      <created by zg
	started at 2013-11-09 17:18:14.384 -0800,
	POWCHK enabled, PULCHK disabled,
       configuration hash MD5:
       C8 4E 4E 5D D3 5C D8 9E 9F 52 82 E0 59 8A DE 15
       data hash MD5: 64K
       50 1A F5 E7 3F 27 06 2E 20 3A A8 92 CB 34 A4 20>)
(   2,<2013-11-09 17:19:22.733 -0800>,<Administrator>,<X>,<proc1d>,<TOPSPIN 2.1>,
      <Start of raw data processing
       efp LB = 0 FT_mod = 6 PKNL = 1 PHC0 = 0 PHC1 = 0 SI = 32K 
       data hash MD5: 32K
       77 A4 61 C6 31 DB A4 80 66 38 F4 2C 59 F8 B6 56>)
(   3,<2013-11-09 17:19:23.061 -0800>,<Administrator>,<X>,<proc1d>,<TOPSPIN 2.1>,
      <pk PHC0 = 91.8512 PHC1 = 0 
       data hash MD5: 32K
       5B 98 62 73 3A 82 E8 3E 8B 2C 51 BD AB 3F 35 86>)
(   4,<2013-11-09 17:19:23.186 -0800>,<Administrator>,<X>,<proc1d>,<TOPSPIN 2.1>,
      <abs ABSG = 1 
       data hash MD5: 32K
       62 B2 27 F9 59 3D 34 6C 45 BD 7C 8C 78 CC A4 2E>)
(   5,<2013-11-09 17:19:23.248 -0800>,<Administrator>,<X>,<proc1d>,<TOPSPIN 2.1>,
      <abs ABSG = 2 
       data hash MD5: 32K
       0B E6 78 F1 10 A4 A8 53 2B 29 41 14 C7 8F 28 10>)
(   6,<2013-11-09 17:19:23.311 -0800>,<Administrator>,<X>,<proc1d>,<TOPSPIN 2.1>,
      <abs ABSG = 3 
       data hash MD5: 32K
       7B 09 A3 8A 6B 39 43 91 54 86 25 EB 0A FB 43 E3>)
(   7,<2013-11-09 17:19:23.389 -0800>,<Administrator>,<X>,<proc1d>,<TOPSPIN 2.1>,
      <abs ABSG = 4 
       data hash MD5: 32K
       71 21 3D 7B CF F4 63 72 3A 18 E8 D1 2D 33 88 56>)
(   8,<2013-11-09 17:19:23.451 -0800>,<Administrator>,<X>,<proc1d>,<TOPSPIN 2.1>,
      <abs ABSG = 5 
       data hash MD5: 32K
       DE EC EE 5B 82 57 E1 E2 0F 8E A4 40 35 43 21 0B>)
$$ ##END=
$$ 
$$ $$ hash MD5
$$ $$ 6B 03 73 F6 64 F5 2E D8 7F FA 32 57 86 62 BD 62
##$RELAX= 
##$RELAX= 
##$RELAX= 
##$RELAX= 
##$RELAX= 
##$RELAX= 
##$RELAX= 
$$ Bruker specific parameters
$$ --------------------------
##$DU= <E:\>
##$EXPNO= 10
##$NAME= <AC1598_PERAH13328_8314459_ReeslgHcy3>
$$ [...]
##$TP= (0..7)
150 150 150 150 150 150 150 150
##$TP07= 0
##$TPNAME0= <>
##$TPNAME1= <>
##$TPNAME2= <>
##$TPNAME3= <>
##$TPNAME4= <>
##$TPNAME5= <>
##$TPNAME6= <>
##$TPNAME7= <>
##$TPOAL= (0..7)
0.5 0.5 0.5 0.5 0.5 0.5 0.5 0.5
##$TPOFFS= (0..7)
0 0 0 0 0 0 0 0
##$TUNHIN= 0
##$TUNHOUT= 0
##$TUNXOUT= 0
##$USERA1= <user>
##$USERA2= <user>
##$USERA3= <user>
##$USERA4= <user>
##$USERA5= <user>
##$V9= 5
##$VALIST= <valist>
##$VCLIST= <CCCCCCCCCCCCCCC>
##$VD= 0
##$VDLIST= <DDDDDDDDDDDDDDD>
##$VPLIST= <PPPPPPPPPPPPPPP>
##$VTLIST= <TTTTTTTTTTTTTTT>
##$WBST= 1024
##$WBSW= 4
##$XGAIN= (0..3)
0 0 0 0
##$XL= 0
##$YL= 0
##$YMAX_a= 599646
##$YMIN_a= -513999
##$ZGOPTNS= <>
##$ZL1= 120
##$ZL2= 120
##$ZL3= 120
##$ZL4= 120
##$ABSF1= 14.98509
##$ABSF2= -5.573092
##$ABSG= 5
##$ABSL= 3
##$ALPHA= 0
##$AQORDER= 0
##$ASSFAC= 0
##$ASSFACI= 0
##$ASSFACX= 0
##$ASSWID= 0
##$AUNMP= <proc_prof1d_extract_pilot.lims>
##$AXLEFT= 0
##$AXNAME= <>
##$AXNUC= <1H>
##$AXRIGHT= 0
##$AXTYPE= 0
##$AXUNIT= <>
##$AZFE= 0.1
##$AZFW= 0.1
##$BCFW= 0
##$BC_mod= 0
##$BYTORDP= 0
##$COROFFS= 0
##$CY= 15
##$DATMOD= 1
##$DC= 0
##$DFILT= <>
##$DTYPP= 0
##$F1P= 0
##$F2P= 0
##$FCOR= 0.5
##$FTSIZE= 32768
##$FT_mod= 6
##$GAMMA= 0
##$GB= 0
##$INTBC= 1
##$INTSCL= 1
##$ISEN= 128
##$LB= 0
##$LEV0= 0
##$LPBIN= 0
##$MAXI= 10000
##$MC2= 0
##$MEAN= 0
##$ME_mod= 0
##$MI= 0
##$NCOEF= 0
##$NC_proc= -8
##$NLEV= 6
##$NOISF1= 0
##$NOISF2= 0
##$NSP= 0
##$NTH_PI= 0
##$NZP= 0
##$OFFSET= 14.98509
##$PC= 1
##$PHC0= 91.8512
##$PHC1= 0
##$PH_mod= 1
##$PKNL= yes
##$PPARMOD= 0
##$PPDIAG= 0
##$PPIPTYP= 0
##$PPMPNUM= 2147483647
##$PPRESOL= 1
##$PSCAL= 4
##$PSIGN= 0
##$PYNMP= <proc.py>
##$REVERSE= no
##$SF= 400.02
##$SI= 32768
##$SIGF1= 0
##$SIGF2= 0
##$SINO= 400
##$SIOLD= 32768
##$SPECTYP= <>
##$SREGLST= <1H.CDCl3>
##$SSB= 0
##$STSI= 32768
##$STSR= 0
##$SW_p= 8223.68421052631
##$SYMM= 0
##$S_DEV= 0
##$TDeff= 65536
##$TDoff= 0
##$TI= <>
##$TILT= no
##$TM1= 0
##$TM2= 0
##$TOPLEV= 0
##$USERP1= <user>
##$USERP2= <user>
##$USERP3= <user>
##$USERP4= <user>
##$USERP5= <user>
##$WDW= 1
##$XDIM= 32768
##$YMAX_p= 455761425
##$YMIN_p= -667972
##$CURPLOT= <Network HP LaserJet P1505>
##$CURPRIN= <$Network HP LaserJet P1505>
##$DFORMAT= <normdp>
##$LAYOUT= <+/1D_H.xwp>
##$LFORMAT= <normlp>
##$PFORMAT= <normpl>
##$SURQMSG= 1
$$ End of Bruker specific parameters
$$ ---------------------------------
##NTUPLES= NMR SPECTRUM
##VAR_NAME=  FREQUENCY,     SPECTRUM/REAL,   SPECTRUM/IMAG
##SYMBOL=    X,             R,               I
##VAR_TYPE=  INDEPENDENT,   DEPENDENT,       DEPENDENT
##VAR_FORM=  AFFN,          ASDF,            ASDF
##VAR_DIM=   32768,         32768,           32768
##UNITS=     HZ,            ARBITRARY UNITS, ARBITRARY UNITS
##FACTOR=    0.250966925370066, 1,           1
##FIRST=     8223.43324360094, 83355,        -43282
##LAST=      0,             -14295,          -103782
##MIN=       0,             -667972,         0
##MAX=       8223.43324360094, 455761425,    0
$$ Real data points
##PAGE= N=1
##DATA TABLE= (X++(R..R)), XYDATA
$$ [...]
19543B82928a57837j37028h1798J7480B2732R5103b7052k45115i5704A86461f0023
$$ 282928 -157837 -294865 -81798 -64318 22732 117835 -27052 -272167 -95704 186461 -60023
19531a39007n6120A13263a0628k0195j6247n0150k8003b9708B74973b19645L7337
$$ -139007 -195127 113263 -10628 -30823 -47070 -97220 -125223 -29708 274973 -219645 -182308
19520a82308B44397I9947N3400b82429J26037l08116b19771C7509e8238b2315
$$ -182308 244397 99947 153347 -282429 -156392 -464508 -219771 37509 -58238 -22315
19509A57109A6868i9715j17500A71596a24567A50226b79601A08014L65937j70465
$$ 157109 16868 -99715 -217215 171596 -124567 150226 -279601 108014 473951 303486
19499C03486a12382A8585f0222k0890k17405a30102o4336C7717J27200a93088
$$ 303486 -112382 18585 -60222 -81112 -298517 -130102 -194438 37717 164917 -193088
19488c61155i1005j21934A82360a98920P7894B43732I6866h7029K3812b3351A00818
$$ -361155 -91005 -212939 182360 -198920 -121026 243732 96866 -87029 -63217 -23351 100818
19476i5437a5073l4894r5009C40455a2627l56330h743j89582C62552B1818d2667
$$ -95437 -15073 -49967 -144976 340455 -12627 -368957 -8743 -198325 362552 21818 -42667
19464c10026N3674A7912b515j57522A52584b96814f6264j3753k89722l1196g8691
$$ -310026 -256352 17912 -2515 -160037 152584 -296814 -66264 -80017 -369739 -400935 -78691
19452d3716k37376a27173j26710Q4765m5020F3978a1507k33216d2524J0313j0057
$$ -43716 -281092 -127173 -253883 -169118 -214138 63978 -11507 -244723 -42524 -32211 -42268
19441d2268C7258a59524F1508a6262B3085a16063I2131c98021G0094C842d3940
$$ -42268 37258 -159524 61508 -16262 23085 -116063 92131 -398021 70094 3842 -43940
19429F889d8544l24827B3864b18947I8734b43885O8588A45883i2842J1764j78815
$$ 6889 -48544 -373371 23864 -218947 98734 -243885 -175297 145883 -92842 -81078 -259893
19418b59893A08135a40681f1174C9133a51256n2758f4269A23790c13006C4145
$$ -259893 108135 -140681 -61174 39133 -151256 -204014 -64269 123790 -313006 34145
19407A82743c3288B34720d5250F2400e3652A74730b64581F9563K5928D2631a48114
$$ 182743 -33288 234720 -45250 62400 -53652 174730 -264581 69563 95491 42631 -148114
19395e362q9342L8043q5229a9168B6685K76929b19063A99691a05906k6477L7148
$$ -5362 -94704 -56661 -141890 -19168 26685 303614 -219063 199691 -105906 -132383 -95235
19384i5235F9816A8184b6992a3319m3319E3563a27273N06j28786h07j96096Q2242
$$ -95235 69816 18184 -26992 -13319 -56638 53563 -127273 -126767 -255553 -807 -196903 -114661
19372a14661j89713a13028q0770j35881J24068K0607c5718A35353b88198k83561
$$ -114661 -304374 -113028 -193798 -329679 -205611 -185004 -35718 135353 -288198 -571759
19362e71759E3989P603c8430l5807A58148O7914H256d05033D8133c09771p3217
$$ -571759 53989 61592 -38430 -74237 158148 226062 8256 -405033 48133 -309771 -382988
19351c82988b5581l48558A03833b54494b1682l64719f6216k31709C31111a47403
$$ -382988 -25581 -374139 103833 -254494 -21682 -386401 -66216 -297925 331111 -147403
19340a63315j7366C8878b21408a04680q7007a8271k73857a41120G7001b6360k67758
$$ -163315 -180681 38878 -221408 -104680 -191687 -18271 -292128 -141120 77001 -26360 -294118
19329b94118A80790O4389j08885h2029A31692n1034J62879F0753d6878j33069
$$ -294118 180790 245179 136294 -82029 131692 80658 243537 60753 -46878 -179947
19319a79947A09949b05861f8792k01041f6529I7514d4319J103I343d9720F1905
$$ -179947 109949 -205861 -68792 -269833 -66529 97514 -44319 -43216 9343 -49720 61905
19307e5782h092k78911j07762F0530b91083J29856P6261J6435H5691c07375A25107
$$ -55782 -8092 -287003 -394765 60530 -291083 -161227 -84966 -68531 85691 -307375 125107
19295a3606k35113J01164O2647A22153D6259i9599k58714A08581i9166A55731
$$ -13606 -248719 -147555 -84908 122153 46259 -99599 -358313 108581 -99166 155731
19284D9831e3194e315E678R4669b65030M7198G143d2448o2779j43711E1243A5584
$$ 49831 -53194 -5315 5678 100347 -265030 -217832 7143 -42448 -105227 -248938 51243 15584
19271f9513A65177d79424C0156K23185b58308N4093H3585G07J21381E353L2516
$$ -69513 165177 -479424 30156 253341 -258308 -204215 83585 707 122088 5353 37869
19260C7869g2513q4184A2781J76349G2444N969a38285D2114n094b42514B6438
$$ 37869 -72513 -156697 12781 189130 72444 78413 -138285 42114 37020 -242514 26438
19248b20665H9694f9568A78830f1507k54251I5506b84100A04930l9803c43066
$$ -220665 89694 -69568 178830 -61507 -315758 95506 -284100 104930 65127 -343066
19237B25217a14130r8344G4862c26559E6594A6602a90653c5507a4215k3959k89047
$$ 225217 -114130 -212474 74862 -326559 56594 16602 -190653 -35507 -14215 -38174 -327221
19226c27221F052P8577a39523A01637A9784a80220A96062e36866B83830c73688
$$ -327221 6052 84629 -139523 101637 19784 -180220 196062 -536866 283830 -373688
19215a23967B0421i5439A64120p3122a1177B7776a33516m4257O0979e0173j00126
$$ -123967 20421 -95439 164120 90998 -11177 27776 -133516 -177773 -116794 -50173 -150299
19204a50299c0195m0654J1692k17984A8466a99581h9180B81394I4713d5780j95829
$$ -150299 -30195 -70849 -59157 -277141 18466 -199581 -89180 281394 94713 -45780 -241609
19193b41609B6896a82431e6176H9443e6272C0203R7392J07191A14975K33811m5813
$$ -241609 26896 -182431 -56176 89443 -56272 30203 127595 234786 114975 348786 302973
19182C02973j18583a06644p541D1609N3692a7071J029k96014a05335B7844b52941
$$ 302973 184390 -106644 -114185 41609 95301 -17071 -16042 -312056 -105335 27844 -252941
19170C45475A66774a84122j4610D01351A74069e1786g02o4611K8858J5786B6663
$$ 345475 166774 -184122 -198732 401351 174069 -51786 -702 -65313 -36455 -20669 26663
19158A30218J90698I1798b06882A39038F0144g9919j61097M8661c2690k51980
$$ 130218 320916 91798 -206882 139038 60144 -79919 -241016 -192355 -32690 -284670
19148b84670R618b8015H7881d03919Q6512J24785d5007j75583A68278b36925A39995
$$ -284670 -275052 -28015 87881 -403919 -317407 -192622 -45007 -220590 168278 -236925 139995
19136a73778O509M8877j86445B439O17a18642p1499b0820o5664h115A25115d5399
$$ -173778 -167269 -118392 -304837 2439 3056 -118642 -190141 -20820 -86484 -8115 125115 -45399
19123A07320a20965a3761k28799R0924J8d3831j36433B688g8082K8674k71885
$$ 107320 -120965 -13761 -242560 -151636 -151618 -43831 -180264 2688 -78082 -49408 -321293
19112c21293J16879k00464A1611J74613J0975A2419N5108a14901q7675D6332b74909
$$ -321293 -204414 -404878 11611 186224 197199 12419 67527 -114901 -202576 46332 -274909
19100i6448j43643A28806c28627k5631P1675l3835J33851A21680a96503k13114
$$ -96448 -240091 128806 -328627 -354258 -282583 -316418 -182567 121680 -196503 -409617
19090d09617g2058k47807a48412f3315A2100J5859J8546L39492c7330j02140j40012
$$ -409617 -72058 -319865 -148412 -63315 12100 27959 46505 385997 -37330 -139470 -279482
19079b79482F0623b16567j11816A65858D8563c19077c4895B7872O0545K17429
$$ -279482 60623 -216567 -328383 165858 48563 -319077 -34895 27872 88417 305846
19069C05846A05781a95382G3306a92985g8558A20955k1327f4420L2191j83500
$$ 305846 105781 -195382 73306 -192985 -78558 120955 99628 -64420 -32229 -215729
19059b15729l7891A82386c18934k4781F2304b19816d6046H2074c35547E9174b19109
$$ -215729 -253620 182386 -318934 -343715 62304 -219816 -46046 82074 -335547 59174 -219109
19047I1190J43356E2916d65451B3288K4160J27170a89513B27080a710A45983a38517
$$ 91190 234546 52916 -465451 23288 47448 174618 -189513 227080 -1710 145983 -138517
19035F120J07429b65733J07904j2560d4149j41049K6950A55085L9485a24822d2377
$$ 6120 113549 -265733 -157829 -170389 -44149 -185198 -158248 155085 194570 -124822 -42377
19023A55982N5108P1288Q5051j19153a74986C2484c098j27251L3591a5484o4461
$$ 155982 211090 282378 367429 248276 -174986 32484 -3098 -130349 -96758 -15484 -79945
19012g9945C45884d3131j20405A66830a55014j30237C12276j48896J5222p1211
$$ -79945 345884 -43131 -163536 166830 -155014 -285251 312276 163380 178602 107391
19002A07391A8108g2716k40062P0875O9359h3099D0077c0534A12542b48676a10974
$$ 107391 18108 -72716 -312778 -241903 -172544 -83099 40077 -30534 112542 -248676 -110974
18990h822o8115H3253i8589l13415C6261J16168k1042b89354F4416b93840D567
$$ -8822 -76937 83253 -98589 -412004 36261 152429 131387 -289354 64416 -293840 4567
18978G3808b27193g5952k67011B67920b5898n2637m8715c5019D0464J71558e5336
$$ 73808 -227193 -75952 -342963 267920 -25898 -78535 -127250 -35019 40464 212022 -55336
18966e6658k92524B56346a88901A95120H8769K75927A07774b41720A02269b42434
$$ -56658 -349182 256346 -188901 195120 88769 364696 107774 -241720 102269 -242434
18955C21375C4710L516J4687R7414a12403j91519B33790D0068A6089N9171a48257
$$ 321375 34710 38226 52913 150327 -112403 -303922 233790 40068 16089 75260 -148257
18943c3886G0222d59518B06327D0249Q8476d7675o7287L0056K0774j31m9482d7822
$$ -33886 70222 -459518 206327 40249 128725 -47675 -114962 -84906 -64132 -64263 -113745 -47822
18930d950A83999Q3119D9293L9085L6128N9269d50761B76230b8161j7212l842
$$ -4950 183999 267118 49293 88378 124506 183775 -450761 276230 -28161 -45373 -49215
18919d9215E6888a6737B585L05049a01555n4719N2056n9745l1329p4098i0172
$$ -49215 56888 -16737 2585 307634 -101555 -156274 -104218 -163963 -195292 -269390 -90172
18907a05999j47765e2424R540j23523B38667G8402b61991I82L76389B727K33621
$$ -105999 -253764 -52424 -42884 -166407 238667 78402 -261991 982 377371 2727 236348
18896B36348k1247b25926R0692J9323F8050j6144A6353c17911I1359d8263j51784
$$ 236348 215101 -225926 -135234 -115911 68050 51906 16353 -317911 91359 -48263 -200047
18885b00047r1834g5976c0427o8024b9352q6857A2042J42447a31875c0608A10748
$$ -200047 -291881 -75976 -30427 -98451 -29352 -116209 12042 154489 -131875 -30608 110748
18873B89224c44720J52840B3232P3415D2377b0492E3176d0679j47859B00536N1979
$$ 289224 -344720 -191880 23232 96647 42377 -20492 53176 -40679 -188538 200536 252515
18862B52515a03940D8280a01153A20105c45371g1120c1142B08064A00616b48502
$$ 252515 -103940 48280 -101153 120105 -345371 -71120 -31142 208064 100616 -248502
18851A78338q1587o148K24671a7304k59594g6350r0333c8085J4396k31834Q0327
$$ 178338 96751 90603 315274 -17304 -276898 -76350 -166683 -38085 -23689 -255523 -175196
18840a75196j3192l38674A21937a01876d7311A60976b25466F6808b49260P9844
$$ -175196 -188388 -527062 121937 -101876 -47311 160976 -225466 66808 -249260 -169416
18830a69416A51249g7485j26909B02618d04845a53717A1909e7893l18746J35429
$$ -169416 151249 -77485 -204394 202618 -404845 -153717 11909 -57893 -376639 -241210
18820b41210K3248j67400A57058p0620K70559b5049F0683L11216P8787H4978K34355
$$ -241210 -217962 -385362 157058 86438 356997 -25049 60683 371899 450686 84978 319333
18809C19333a3061A10333L8043K6393a99414j33755B12681q7240h2895A54942
$$ 319333 -13061 110333 148376 174769 -199414 -333169 212681 125441 -82895 154942
18798d63111K12706i4407A29433a55973m6665B39900b84629h9216a2874j34626
$$ -463111 -250405 -94407 129433 -155973 -202638 239900 -284629 -89216 -12874 -147500
18788a47500d5959p8384m20680d6670A0962e4314j96137f9576a4347r4623O480
$$ -147500 -45959 -124343 -545023 -46670 10962 -54314 -250451 -69576 -14347 -108970 -102490
18777a02490k87043a79478A9080c27311a29016C7258K8869d5473D1163d1352m0156
$$ -102490 -389533 -179478 19080 -327311 -129016 37258 66127 -45473 41163 -41352 -81508
18766h1508c1518p5296H8331k5618h4594F259O1543b20787c201j27670b6135D4845
$$ -81508 -31518 -106814 88331 62713 -84594 6259 67802 -220787 -3201 -130871 -26135 44845
18753a20518n5757A1023b66526d5172j87706A21841b5358e302k04160f747j56678
$$ -120518 -176275 11023 -266526 -45172 -232878 121841 -25358 -5302 -209462 -6747 -163425
18742a63425M7085b3535n804B4771f8385n5146a9782j03469k1296j4515A14344
$$ -163425 -116340 -23535 -29339 24771 -68385 -123531 -19782 -123251 -144547 -159062 114344
18730A10738D7908O2589B2179J45818D0992c1096j07184m1963A82098d51762h7595
$$ 110738 47908 110497 22179 167997 40992 -31096 -138280 -180243 182098 -451762 -87595
18718a0068A44010a14563m5073m673g4335j27448g0645B6684J61190d0083k45898
$$ -10068 144010 -114563 -159636 -164309 -74335 -201783 -70645 26684 187874 -40083 -285981
18707b85981Q5877I2785B3472a15575j7651A53437a09383D5800Q5444P214a77693
$$ -285981 -200104 92785 23472 -115575 -133226 153437 -109383 45800 131244 138458 -177693
18695a5280l1538A64967R1167E5980a54164g648j31125A32103A76N5443b75229
$$ -15280 -46818 164967 256134 55980 -154164 -7648 -138773 132103 176 55619 -275229
18683b62555c8494A67800R455a9906j63601k7355k9739i3968D5548K0020K73087
$$ -262555 -38494 167800 177255 -19906 -183507 -210862 -240601 -93968 45548 65568 338655
18672C38655b21646a4580k46136c1149l8164l33833a72463L864f225D9827h4498
$$ 338655 -221646 -14580 -260716 -31149 -69313 -403146 -172463 -168599 -6225 49827 -84498
18660a69235b7104B87020B0488b55284G3633e42102A06699G447b9237j43862k38666
$$ -169235 -27104 287020 20488 -255284 73633 -542102 106699 7447 -29237 -173099 -411765
18649d11765a97421P0199J8444n4524O7635r718C29795j57912C3214a52639B54753
$$ -411765 -197421 -127222 -108778 -163302 -95667 -105385 329795 171883 33214 -152639 254753
18637b7679p5293k92470a95523C1782K68599d1296j40429j88704k7487B3481a58554
$$ -27679 -102972 -395442 -195523 31782 300381 -41296 -181725 -370429 -397916 23481 -158554
18625i8954B8449b15443A19802J77838h5836B7280d96260a53592N3284A48546
$$ -98954 28449 -215443 119802 297640 -85836 27280 -496260 -153592 -100308 148546
18614a3617j72372G1017b36417B54731A18595h7426j50241h631k04285B31468
$$ -13617 -185989 71017 -236417 254731 118595 -87426 -237667 -8631 -212916 231468
18603F1672a17895I9853J62645A27525a93711G5638J76661l98J6637a43956A86017
$$ 61672 -117895 99853 262498 127525 -193711 75638 252299 251901 268538 -143956 186017
18591a24760j73111J35025B50758c27669B4281J45717H1913a33735G3470a97053
$$ -124760 -297871 -162846 250758 -327669 24281 169998 81913 -133735 73470 -197053
18580b33992A52416J14317g5212b7998k54588B51764h9192o6279A90158e8515
$$ -233992 152416 266733 -75212 -27998 -282586 251764 -89192 -155471 190158 -58515
18569b2524r1219D21450a8837o2841a4164j42584A08753K07429a64198P5459A1369
$$ -22524 -113743 421450 -18837 -81678 -14164 -156748 108753 316182 -164198 -88739 11369
18557A12581C269L340J85052P6248p9498R97b02876K7120B584J1735a19326C21298
$$ 112581 3269 6609 191661 267909 188411 189408 -202876 -175756 2584 14319 -119326 321298
18544b96293a10845l151a0744E2555e7484l35738a4298B29384C1938a09384C8490
$$ -296293 -110845 -113996 -10744 52555 -57484 -393222 -14298 229384 31938 -109384 38490
18532F4388b69128M8351n3537j42926O3780A3925b47664o5281a42123c3773I8910
$$ 64388 -269128 -220777 -274314 -417240 -353460 13925 -247664 -312945 -142123 -33773 98910
18520e9414p3312b3152p3258E1800a96070B38039F800J87175m7137K4115a0525
$$ -59414 -132726 -23152 -96410 51800 -196070 238039 6800 193975 146838 170953 -10525
18508b60210Q6521L521O5302A4920d9919J0149p6965L3354A76510c95557a04924
$$ -260210 -173689 -170168 -104866 14920 -49919 -39770 -116735 -83381 176510 -395557 -104924
18496C22503a96306h8459B54658J18070c35686f8235A29497a34891k48722a69265
$$ 322503 -196306 -88459 254658 372728 -335686 -68235 129497 -134891 -383613 -169265
18485C5749Q4293f655I5637e3072A9068N6253k8173J12785j7689F0117e9269k18576
$$ 35749 120042 -6655 95637 -53072 19068 75321 47148 159933 142244 60117 -59269 -277845
18473b77845P0263A14390J8781O6725C693N7988j9846A1448J13595E2258K2996
$$ -277845 -207582 114390 133171 199896 3693 61681 41835 11448 125043 52258 75254
18462G5254g0300j0228I7336h4211B24333j05928a69490j98258P4064d5092p9152
$$ 75254 -70300 -80528 97336 -84211 224333 118405 -169490 -367748 -293684 -45092 -124244
18451a24244k3804A3770b38608Q8106a6642j12685B6523b4486q6701J8029A09855
$$ -124244 -148048 13770 -238608 -150502 -16642 -129327 26523 -24486 -111187 -93158 109855
18439B28485d8295A6323a83093P3787G1714a59707C5682b3650j55090r4837A03546
$$ 228485 -48295 16323 -183093 -109306 71714 -159707 35682 -23650 -178740 -273577 103546
18427I0729a50471A58757a7731A9513a3319k025k35461a01924m6357c0829q8413
$$ 90729 -150471 158757 -17731 19513 -13319 -15344 -250805 -101924 -148281 -30829 -119242
18416a19242R172e1595j51834A14473b20349j4921c0020k80169e2917A08802d3675
$$ -119242 -110070 -51595 -203429 114473 -220349 -235270 -30020 -310189 -52917 108802 -43675
18404a48598A18307d9620B43476q2208L0637d706A72220b05304n1313a22262I2168
$$ -148598 118307 -49620 243476 161268 191905 -4706 172220 -205304 -256617 -122262 92168
18392i332j33703j80159f7241j32453M2093l44608K49081a5994F667h9078A03824
$$ -9332 -143035 -323194 -67241 -199694 -157601 -502209 -253128 -15994 6667 -89078 103824
18380B83985j6269H1469J02943b74820A39629g043A25792A9547a49422A62822
$$ 283985 267716 81469 184412 -274820 139629 -7043 125792 19547 -149422 162822
18369a21731E3408A7631J53848P0024A04789a5648k13783M6904O5169B6870c15257
$$ -121731 53408 17631 171479 241503 104789 -15648 -229431 -182527 -117358 26870 -315257
18357B3525K20118r5034b1988j20068H9295d9394j19354C25882N4159a95546A52554
$$ 23525 243643 148609 -21988 -142056 89295 -49394 -168748 325882 380041 -195546 152554
18345c38744I3158d1522B48390b24514j50560A68172D7011J56862j1015b0791
$$ -338744 93158 -41522 248390 -224514 -375074 168172 47011 203873 192858 -20791
18334H6230g9825j04739E9955e2958l58962e8872A0116e01519a06730l938A08966
$$ 86230 -79825 -184564 59955 -52958 -411920 -58872 10116 -501519 -106730 -110668 108966
18322A27889m7133a44306e7672k7054I1376J31128a33722d5416K0612a123B94108
$$ 127889 80756 -144306 -57672 -84726 91376 222504 -133722 -45416 -24804 -1123 294108
18310A27999M1526d5253a9226B07102h3128j25866L217B68043a2426A00869D1778
$$ 127999 169525 -45253 -19226 207102 -83128 -208994 -205777 268043 -12426 100869 41778
18298F3254J5288j3058a6740A02752b22756A99905L6435a7818k2428k5937A13601
$$ 63254 78542 65484 -16740 102752 -222756 199905 236340 -17818 -40246 -66183 113601
18286A04158b40239A60320C5327L4291a52822f4921B99216b83371e447k19337
$$ 104158 -240239 160320 35327 69618 -152822 -64921 299216 -283371 -5447 -224784
18276b24784R228A02556h2015B86886J41698b01636j44503n1101a92891E7079
$$ -224784 -215556 102556 -82015 286886 428584 -201636 -346139 -397240 -192891 57079
18265A8763L26180d3858H5055k5283o541b53399D8682i3563c1392k00815B43555
$$ 18763 344943 -43858 85055 59772 53231 -253399 48682 -93563 -31392 -232207 243555
18253A33281f2167K8526o97k4776A53194a14722A12627c16092d4234C82084b93479
$$ 133281 -62167 -33641 -34338 -59114 153194 -114722 112627 -316092 -44234 382084 -293479
18241A15320B0940c32828A06794g3500j54630A76595i9482m40052H6143b11083
$$ 115320 20940 -332828 106794 -73500 -228130 176595 -99482 -539534 86143 -211083
18230g5995H6317j8697N5917L4987b707A36611b5711j19422f2137l28074e3404
$$ -75995 86317 67620 123537 158524 -2707 136611 -25711 -145133 -62137 -390211 -53404
18218d7588j40676A43657M5436c22707G4505P5354a46489K6199A99296E7925g2171
$$ -47588 -188264 143657 189093 -322707 74505 149859 -146489 -120290 199296 57925 -72171
18206A91764a90102A35440i2223o3422d045m31664g8602B9508C36i9642m4113
$$ 191764 -190102 135440 -92223 -155645 -4045 -435709 -78602 29508 336 -99642 -143755
18195a43755A94698E2165a25352A31848b65703f0317k69236j68338a08454n0112
$$ -143755 194698 52165 -125352 131848 -265703 -60317 -329553 -497891 -108454 -158566
18185a58566H2706C6623b95255g7288C3984d2071k08466f4764B56739G7397f264
$$ -158566 82706 36623 -295255 -77288 33984 -42071 -250537 -64764 256739 77397 -6264
18173H6830b63918e2910k0858a3083n5512A59021g2096m2702C80466a49812o9122
$$ 86830 -263918 -52910 -73768 -13083 -68595 159021 -72096 -114798 380466 -149812 -218934
18162b18934i6606m6250b3864D2545K42149E4998N0366b57769B83208a27068J7349
$$ -218934 -96606 -142856 -23864 42545 284694 54998 105364 -257769 283208 -127068 -109719
18151a09719H2771K06114a76467B30089D9743E997Q8880q931b84k32859p767P7534
$$ -109719 82771 288885 -176467 230089 49743 5997 94877 85946 -284 -233143 -240910 -163376
18139a63376D26645a29128b2277M155B85631B1802p361b95832D3983a95317j23292
$$ -163376 426645 -129128 -22277 -18122 285631 21802 14441 -295832 43983 -195317 -318609
18128c18609A61567a51791J8412c9434r2167a2893A3279a80523A7164N000J95467
$$ -318609 161567 -151791 -133379 -39434 -131601 -12893 13279 -180523 17164 22164 217631
18117B17631C6851c26822B3940a27737A18688L39548A30975i546F1912a29282
$$ 217631 36851 -326822 23940 -127737 118688 458236 130975 -9546 61912 -129282
18106A370J28507f6240j81772P0908k25464g4362L4265p5523H2957i6099A09916
$$ 1370 129877 -66240 -248012 -177104 -402568 -74362 -40097 -115620 82957 -96099 109916
18094I2912a75880k5157A64839l3625J84564A55344b16414G0333f3662k55922
$$ 92912 -175880 -201037 164839 131214 315778 155344 -216414 70333 -63662 -319584
18084c19584A08370a73007k6961C2323b43390a2716B57929A95M0040a30900A29741
$$ -319584 108370 -173007 -199968 32323 -243390 -12716 257929 195 40235 -130900 129741
18072d546A60282h7241a0765j40395j99237l2246B52691I618K5857R20e0183j24357
$$ -4546 160282 -87241 -10765 -151160 -350397 -382643 252691 9618 35475 36395 -50183 -174540
18060a74540j88750J49652K7522j8869D2664d4218n4637A02621K1386b122j7824
$$ -174540 -363290 -213638 -186116 -204985 42664 -44218 -98855 102621 124007 -2122 -19946
18049a9946F7235N4867a626k34217A61075h5857J1170b7697C0762e7954k81728
$$ -19946 67235 122102 -1626 -235843 161075 -85857 -74687 -27697 30762 -57954 -339682
18038c39682F9391a41782A20002i3353B2322K19633a42953A78649b0196j12633
$$ -339682 69391 -141782 120002 -93353 22322 241955 -142953 178649 -20196 -132829
18028a32829o6901F8499A265b4869j01118c9836n5630A6036Q7603b33014A88907
$$ -132829 -199730 68499 1265 -24869 -125987 -39836 -95466 16036 103639 -233014 188907
18016b8278j45882B21698p3251m4965l2816d15555g6330A98220G8132L277a96238
$$ -28278 -174160 221698 148447 103482 70666 -415555 -76330 198220 78132 81409 -196238
18004a31802m5915r280B58939f0290J4570j61392Q5849K8830l635B37162A9239
$$ -131802 -177717 -186997 258939 -60290 -45720 -207112 -121263 -92433 -96068 237162 19239
17992a74220F827b17031A40312J31715a39662A3643J58535d9379B34180f6525
$$ -174220 6827 -217031 140312 272027 -139662 13643 172178 -49379 234180 -66525
17981b2633A11414c04233B20934c06696h7235n7728O1413j4731F6633B0638L07962
$$ -22633 111414 -304233 220934 -306696 -87235 -144963 -83550 -98281 66633 20638 328600
17970C28600j62939f08l58566J25860B60531i2294a3606r5567D4589R864a39960
$$ 328600 165661 -608 -359174 -233314 260531 -92294 -13606 -109173 44589 54453 -139960
17958A33060J8385O9537b43660B123J59575l9499b25046A06779e0401r6001A61015
$$ 133060 151445 220982 -243660 2123 161698 122199 -225046 106779 -50401 -146402 161015
17946A99356j1701f1412B11386a07880k25402B96603f2584B01077I3782g5721
$$ 199356 187655 -61412 211386 -107880 -333282 296603 -62584 201077 93782 -75721
17935b51387E8995a24020L0238k6794A59946q402b0682A04437a65805f392B11134
$$ -251387 58995 -124020 -93782 -120576 159946 151544 -20682 104437 -165805 -6392 211134
17923H0178f2684B91477a60057J8890N6548l40097C1703b03934A56819e3742j31125
$$ 80178 -62684 291477 -160057 -141167 -84619 -424716 31703 -203934 156819 -53742 -184867
17912a84867a7248j2836j26957A8910d9957k9935B35492b8109k1654O389A68433
$$ -184867 -17248 -30084 -157041 18910 -49957 -79892 235492 -28109 -49763 -43374 168433
17900a72260H452e8897l9087E0230M7118a61263c0429E5052b3182B06046j2463
$$ -172260 8452 -58897 -97984 50230 97348 -161263 -30429 55052 -23182 206046 193583
17889A93583b84083B26553J39813f8727D2600c5125l82709E6426d3803E1602j7220
$$ 193583 -284083 226553 366366 -68727 42600 -35125 -417834 56426 -43803 51602 34382
17878C4382c6678C78265E3189J47669d14370B84244b02954L6174A06862j423J6182
$$ 34382 -36678 378265 53189 200858 -414370 284244 -202954 -166780 106862 105439 121621
17867A21621a12863m6616q6650A524c8362l6956l81594B31023h1414j11841B16682
$$ 121621 -112863 -159479 -246129 1524 -38362 -75318 -456912 231023 -81414 -193255 216682
17855A1415i1232A58093B4904b34441a7700H6662c9528J550n4688B12797E7617
$$ 11415 -91232 158093 24904 -234441 -17700 86662 -39528 -37978 -92666 212797 57617
17843A2474P5416L2923a95231a7630G9855J32119j05376a43872O3404l2137m8993
$$ 12474 87890 120813 -195231 -17630 79855 211974 106598 -143872 -80468 -112605 -161598
17832a61598B13865h9948a19j21007A52565r829a55977d5250B6737b13767E612
$$ -161598 213865 -89948 -119 -121126 152565 142736 -155977 -45250 26737 -213767 5612
17820A0964J2764R8838D299a01792C45953b76667E1439e6069j8181A84084a07494
$$ 10964 23728 122566 4299 -101792 345953 -276667 51439 -56069 -74250 184084 -107494
17808b75933B49949c4294k93591J63752A05007D684L3643K28456a59382E26985
$$ -275933 249949 -34294 -327885 -164133 105007 4684 38327 266783 -159382 526985
17797a24694A77757c8655j55444I5358a7576l0017J3345r0083j7215K3390N1667
$$ -124694 177757 -38655 -194099 95358 -17576 -47593 -34248 -124331 -141546 -118156 -66489
17786f6489m8540j82620C7755a77820d7194j55613A02274L9461B8466K02112b5998
$$ -66489 -115029 -297649 37755 -177820 -47194 -202807 102274 141735 28466 230578 -25998
17774G6577b9047l6973B25948e2302o0049G3092J75238Q672G4801a46806N568
$$ 76577 -29047 -66020 225948 -52302 -112351 73092 248330 257002 74801 -146806 -141238
17763a41238a8362E3643K32687a02347j39275A34770n6808a92217A61826j0978
$$ -141238 -18362 53643 286330 -102347 -241622 134770 77962 -192217 161826 150848
17753A50848D6819N1717c784r1795B98351p5640a74816A87837c34505D2460b62763
$$ 150848 46819 98536 -3784 -95579 298351 222711 -174816 187837 -334505 42460 -262763
17741B36790p6388a4077j45120B13084l5074g7721a8574k07839I4220M8571e906
$$ 236790 160402 -14077 -159197 213084 178010 -77721 -18574 -226413 94220 142791 -5906
17729A76257b28218B9427b79820c4268j00367B76563b84830L2646C20656H733
$$ 176257 -228218 29427 -279820 -34268 -134635 276563 -284830 -252184 320656 8733
17718A02674f8282A5311a94465o1965B89025a24289B965K93732n6768e58815K18564
$$ 102674 -68282 15311 -194465 -256430 289025 -124289 2965 296697 239929 -558815 -340251
17707c40251A31270c34080A56614J01349a2495k9180C5680b32546e1565m5880
$$ -340251 131270 -334080 156614 257963 -12495 -41675 35680 -232546 -51565 -97445
17697i7445D5582a01013M1730p9177A18831b58762A40783B5413J59257l426J8708
$$ -97445 45582 -101013 -59283 -138460 118831 -258762 140783 25413 184670 181244 199952
17686A99952a53971A34411h2307k59261a61467A23914a35959b5728B11060a05706
$$ 199952 -153971 134411 -82307 -341568 -161467 123914 -135959 -25728 211060 -105706
17675B38416D7867J66887a08918n4662A07247a42414d9033j40188B0034b75673
$$ 238416 47867 214754 -108918 -163580 107247 -142414 -49033 -189221 20034 -275673
17664A8047M5522J02886k2612P4690a19236I8085a78044f5163C6879b26337c8728
$$ 18047 63569 166455 143843 218533 -119236 98085 -178044 -65163 36879 -226337 -38728
17652A95349a3376j09327I3520b70270a6442j5587n7234j15278e6519B7738L07464
$$ 195349 -13376 -122703 93520 -270270 -16442 -32029 -89263 -204541 -56519 27738 335202
17641C35202l5765I0825c5176m4749G1835M1420N1279a95300A45415h4371A76083
$$ 335202 299437 90825 -35176 -79925 71835 113255 164534 -195300 145415 -84371 176083
17629a29233l6058k3127a5070j9880p8740C89827a1345m1237L036B46568a62442
$$ -129233 -165291 -188418 -15070 -34950 -113690 389827 -11345 -52582 -49546 246568 -162442
17617a21638A13217f0709A47873n1882B439a55801B36932j17360d9678j56583
$$ -121638 113217 -60709 147873 95991 2439 -155801 236932 119572 -49678 -206261
17607b06261c1799A8173l34L68629C7366a39945j42225a18827L279A24085l2294
$$ -206261 -31799 18173 17839 386468 37366 -139945 -282170 -118827 -115548 124085 91791
17596I1791J03579J6887a27476B90310d2571F689n54J69268h697A42019n0694
$$ 91791 195370 212257 -127476 290310 -42571 6689 6135 175403 -8697 142019 91325
17585I1325K46463d1251A32199L92260A89352a09388R756A87398C0458a10058
$$ 91325 337788 -41251 132199 524459 189352 -109388 -99632 187398 30458 -110058
17574B7692K2309K76301b3810B69135A17025b18806J06356A06307g944C7552O8402
$$ 27692 50001 326302 -23810 269135 117025 -218806 -112450 106307 -7944 37552 105954
17563A05954j6003O3518o2158b88314I7642b03694n8390O7241j85701e2560j68486
$$ 105954 89951 153469 91311 -288314 97642 -203694 -262084 -194843 -380544 -52560 -221046
17552b21046R9304A58034h4001B31256d3337m06432B08707G9122L720K64524h1041
$$ -221046 -121742 158034 -84001 231256 -43337 -449769 208707 79122 82842 347366 -81041
17540a30220j92911B62314a66369g4496m4131e5114B48589b2286F2228J15789
$$ -130220 -323131 262314 -166369 -74496 -118627 -55114 248589 -22286 62228 178017
17530A78017J37830m1908f6024G3314A1292J3821G173K78290b8650l03562B37008
$$ 178017 315847 273939 -66024 73314 11292 25113 7173 285463 -28650 -332212 237008
17518c00569F5664R1627e9127o3498d3821j53356B28900i5286f881l41870A51053
$$ -300569 65664 157291 -59127 -122625 -43821 -197177 228900 -95286 -6881 -348751 151053
17506C22413q6626b04777e8028a9905E1797a39857D8557b01217o247C7205K29498
$$ 322413 235787 -204777 -58028 -19905 51797 -139857 48557 -201217 -207464 37205 266703
17495B66703A10051P5504d5260k24196A41179M84168A07998A7876e19949B56445
$$ 266703 110051 185555 -45260 -269456 141179 625347 107998 17876 -519949 256445
17484B05900e3357l702k15044H694a69444I5051J95327j36840a298B11811f5295
$$ 205900 -53357 -57059 -272103 8694 -169444 95051 290378 153538 -1298 211811 -65295
17472D10079A47453E0829a62340B77829l5952b1401A0083L57499h2172r0134J867
$$ 410079 147453 50829 -162340 277829 241877 -21401 10083 367582 -82172 -172306 -170439
17461a70439E7155L27462F661Q4985a00091a2900B49429d0783A35758n4047L08455
$$ -170439 57155 384617 6661 91646 -100091 -12900 249429 -40783 135758 81711 390166
17450C90166j53315J45040n6654A50926Q3075q9113K70720O6171A07486a0547
$$ 390166 236851 381891 325237 150926 234001 144888 415608 481779 107486 -10547
17439E8836J07178H2848C6758a51802B08070K84319G2639N3461J27753A00261
$$ 58836 166014 82848 36758 -151802 208070 492389 72639 126100 253853 100261
17428B84742A16243J8642K46044c7103C08445Q7347A11786J01719Q3453e9481
$$ 284742 116243 134885 380929 -37103 308445 395792 111786 213505 296958 -59481
17417B81315K59366j84290d7298E30883j73983m4101J20902r6618D459K95694
$$ 281315 540681 356391 -47298 530883 356900 312799 433701 337083 4459 300153
17407C00153J93087B32527b23405A70976c4735F6352J08520h0268B68002j1541
$$ 300153 493240 232527 -223405 170976 -34735 66352 174872 -80268 268002 256461
17397B56461K87342B56940c33637b2436D06702B6058G212f78k1358A69551j4904
$$ 256461 543803 256940 -333637 -22436 406702 26058 7212 -678 -22036 169551 154647
17386A54647J34084A30548M9153J85809b0912a485j48464I5064J14619a93641
$$ 154647 288731 130548 179701 365510 -20912 -1485 -149949 95064 209683 -193641
17375B50250j20486o1305L03049J43401A55022L03980A59008n0397K86964A41384
$$ 250250 129764 68459 371508 514909 155022 459002 159008 108611 395575 141384
17364a04697k24290a22275D1777P492J80814A02052L7381c4519F0190J22777E7604
$$ -104697 -328987 -122275 41777 49269 230083 102052 139433 -34519 60190 182967 57604
17352A62589a52037A79317E5537d0316A51459f4096A25054b11947A83246j3155
$$ 162589 -152037 179317 55537 -40316 151459 -64096 125054 -211947 183246 170091
17342A70091o6380n759K12884j3423j15730J16440d3859g573A9905J81238c0814
$$ 170091 103711 97952 310836 297413 181683 298123 -43859 -7573 19905 201143 -30814
17330a38725B13220L4295I2266L16814c86248I4100Q2774A4482d1055l0830A50889
$$ -138725 213220 247515 92266 409080 -386248 94100 176874 14482 -41055 -71885 150889
17318A4327L68031G1008j6235L51452I9295J02959h90p301E230a31526E9423L74493
$$ 14327 382358 71008 54773 406225 99295 202254 -890 -8191 5230 -131526 59423 433916
17306D33916A96296P4636A24869J09692o2236b28179A69338F8241L46568i504
$$ 433916 196296 270932 124869 234561 172325 -228179 169338 68241 414809 -9504
17295b37576a7313D55470J26756A88233C9440K46690r671I8129J7591E0250g4128
$$ -237576 -17313 455470 582226 188233 39440 286130 276459 98129 115720 50250 -74128
17283C09762a7139B60115P6508A27648m9653K6700A2402J15736d5865B63216o9216
$$ 309762 -17139 260115 336623 127648 77995 104695 12402 128138 -45865 263216 194000
17272A94000J09819A05004J18668R7275F013J39554j368M94917j96481K62798
$$ 194000 303819 105004 223672 320947 6013 145567 144199 639116 442635 705433
17262G05433G0427J01550J3305M05533k58177m6909a66656A96124p722J53795
$$ 705433 70427 171977 185282 590815 332638 285729 -166656 196124 188402 342197
17252C42197I8600L9308o1937K67701J51950A04788a7337q5310I6519L07593F5703
$$ 342197 98600 137908 75971 343672 495622 104788 -17337 -102647 96519 404112 65703
17240f4465C85107F9414O8570l4558K70197E9213j690J1428J40182b2273A95830
$$ -64465 385107 69414 137984 103426 373623 59213 57523 68951 209133 -22273 195830
17228E4007J49835l2726l890K25127j32348p8848D608M9688k5394J12161J53220
$$ 54007 203842 171116 167226 392353 260005 181157 4608 54296 28902 141063 294283
17217B94283H314J02892J17536p325E1472J28479K3018I0167M76382A11609K15487
$$ 294283 8314 111206 228742 221417 51472 179951 202969 90167 566549 111609 327096
17206C27096n7211A27359o2437K70870b517C39290j7532a39606A77837K66538
$$ 327096 269885 127359 64922 335792 -2517 339290 321758 -139606 177837 444375
17196D44375B16387n0539O1696K35159C5331N8041J75713b02760A20980k520M2049
$$ 444375 216387 165848 227544 462703 35331 93372 269085 -202760 120980 118460 160509
17185A60509R2465A09050l6373a38187B06733C0482L63761A4078L16931I0215
$$ 160509 252974 109050 72677 -138187 206733 30482 394243 14078 331009 90215
17174A19791j5528J12352Q9374j31675K00237A79904m5257a33853A44142K70611
$$ 119791 104263 216615 305989 174314 374551 179904 134647 -133853 144142 414753
17164D14753k06768p7776J46506n7794K72448A246J39762J40613J78355A84220
$$ 414753 207985 130209 276715 218921 491369 1246 141008 281621 459976 184220
17153C03228A38381L07118J1874B03421N1680q457m6024L955J959K9092b2822
$$ 303228 138381 445499 457373 203421 255101 246644 200620 204575 206534 235626 -22822
17141D08323j93640J46180j35006J66309A85279J34028j03651J8319J75722c03035
$$ 408323 214683 360863 225857 392166 185279 319307 215656 233975 409697 -303035
17130C60539J44747o8648A48123J04372n8830J66483n5640P8229O3175j32621
$$ 360539 505286 436638 148123 252495 193665 360148 304508 382737 445912 313291
17120C13291Q036o4093q0884J26475J479J7258J99818j64699d7664C36276J31487
$$ 313291 321327 257234 176350 302825 304304 321562 521380 356681 -47664 336276 467763
17109D67763A25650O752J50192L00864B72519J79593p5188h2980I7855L99231
$$ 467763 125650 132402 282594 583458 272519 452112 376924 -82980 97855 497086
17099D97086k16613K08111J83367j88730j68112M00675B77450J73797j46602K46210
$$ 497086 280473 488584 671951 483221 315109 715784 277450 451247 304645 550855
17089E50855j81213m3383R8393j52104J69600j25348l1879J36734j58605J75206
$$ 550855 369642 326259 424652 272548 442148 316800 284921 421655 263050 438256
17079D38256G6971K34333J18076K16426H4534N42697I7260K93651J04599J33742
$$ 438256 76971 311304 429380 645806 84534 627231 97260 390911 495510 629252
17069F29252B22040L41466k51223j35535L7740R6738J61814L62576B41519j4301
$$ 629252 222040 563506 312283 176748 214488 311226 473040 835616 241519 227218
17059B27218N11814j63023j32123J84004A45704J29893J11413j20353J38663q7722
$$ 227218 739032 576009 443886 627890 145704 275597 387010 266657 405320 317598
17049C17598K05837j49198J83770J3081j26985j15106K06118j35325j95169L58530
$$ 317598 523435 374237 558007 571088 444103 328997 535115 399790 204621 563151
17039E63151a11007H18840C63520O9037N7636K7018O1793j75102Q2048J20589
$$ 563151 -111007 818840 363520 432557 490193 517211 579004 403902 485950 606539
17029F06539k50191J88040k37348L24730p5464n6869j82375M5579J99241q1611
$$ 606539 356348 544388 307040 631770 556306 499437 317062 362641 561882 480271
17019D80271J63419o4675Q3393j05637j97758L88480K6168N0248C94292J53332
$$ 480271 643690 579015 662408 556771 359013 747493 773661 823909 394292 547624
17009E47624J7307K6415J46948j76099A47438L15540Q8533j76714K62188j21468
$$ 547624 564931 591346 738294 562195 147438 462978 551511 374797 636985 515517
16999E15517A79793M79766p8297B76735K26015k9100J43281j96229M73398L18363
$$ 515517 179793 659559 581262 276735 502750 473650 616931 420702 894100 1212463
16989A212463k33123m73968J37443R8279k16177m0607L59464k557n7404l53923
$$ 1212463 979340 505372 642815 741094 524917 484310 843774 841217 783813 429890
16979D29890K93534P1707k25256K3691K47955J72639j58905D20488M17188o0819
$$ 429890 723424 795131 569875 593566 841521 1014160 855255 420488 837676 776857
16969G76857j55432J01368J04042k186k69258M76683j97410o027p4100K90879
$$ 776857 621425 722793 826835 824649 555391 1032074 834664 828637 754537 1045416
16959A045416j76864k09126L42140m22399L38442r0991j50135K18551J36927L117
$$ 1045416 868552 659426 1001566 579167 917609 826618 676483 895034 1031961 1035078
16949A035078m17871O12778k03201J85834l57307p3886J35463J3135J35775l7120
$$ 1035078 617207 1229985 1026784 1212618 855311 781425 916888 930023 1065798 1028678
16939A028678j24459D51756O05938K42286o2591j2839k58512M5857k4179O7252
$$ 1028678 904219 451756 1057694 1299980 1237389 1224550 966038 1011895 987716 1054968
16929A054968J19756j46379k8698j91231K09916k22540N09516j48238j37329m3581
$$ 1054968 1174724 1028345 999647 808416 1018332 795792 1305308 1157070 1019741 976160
16919I76160M65522m24898L02566k92352L44631l71292K42507r0793K88217r7345
$$ 976160 1441682 1016784 1319350 1026998 1371629 1000337 1242844 1152051 1440268 1342923
16909A342923n8169J16375n5648j56113N11422m51409K50015o5423k5772k0282
$$ 1342923 1284754 1401129 1345481 1189368 1700790 1249381 1499396 1433973 1408201 1387919
16899A387919O0539j06191J84451k29576l0013N3516p8590N90253k06849K6532
$$ 1387919 1448458 1342267 1526718 1297142 1267129 1320645 1242055 1832308 1625459 1651991
16889A651991l6867k17999K73925j27830Q8177j07200J71992L60112l67324k92842
$$ 1651991 1615124 1397125 1671050 1543220 1631397 1524197 1696189 2056301 1688977 1396135
16879A396135N63182K0085k1563l8305L20863k9924l18453j61353L49983r4532
$$ 1396135 1959317 1979402 1957839 1919534 2240397 2210473 1892020 1730667 2080650 1986118
16869A986118K2635j49351L93869k31103K12736j37317J35436K2142J13128R6454
$$ 1986118 2008753 1859402 2253271 2022168 2234904 2097587 2233023 2255165 2368293 2464747
16859B464747K51214j18003M5281p2172k97754J82067L29254K58549j2096n01664
$$ 2464747 2715961 2597958 2643239 2571067 2273313 2455380 2784634 3043183 3031087 2529423
16849B529423K48626J91178l29489L04266k87136L77624j63174K02723J51401
$$ 2529423 2778049 2969227 2639738 2944004 2656868 3034492 2871318 3074041 3225442
16840C225442p3090k12662R9451L07631L8999n2692K42469p9289N6553L34565
$$ 3225442 3152352 2939690 3039141 3346772 3385771 3333079 3575548 3496259 3552812 3887377
16830C887377J70291l49189q3605K44181M32166p8118L9807J65674o5382J1888
$$ 3887377 4057668 3708479 3624874 3869055 4301221 4223103 4262910 4428584 4363202 4375090
16820D375090Q5568O3140K51376J47035M9272J96389K34096P4085j67981Q4324
$$ 4375090 4460658 4523798 4775174 4922209 4971481 5167870 5401966 5476051 5308070 5392394
16810E392394J1644K9314L64841J35434K09374k3800K37541J70540J39852J37642
$$ 5392394 5404038 5433352 5798193 5933627 6143001 6119201 6356742 6527282 6667134 6804776
16800F804776m3992N01585K2178K56590r8370L16986M98961J06982o20l2154J52558
$$ 6804776 6760784 7262369 7284547 7541137 7442767 7759753 8258714 8365696 8365076 8332922 8485480
16789H485480Q67718r133K57144L67758N9647J63273N24404K79801L50101M07903
$$ 8485480 9353198 9344065 9601209 9968967 10028614 10191887 10716291 10996092 11346193 11754096
16779A1754096K91672N87261J24964O25477L86616L31655L99695N39484P29288
$$ 11754096 12045768 12633029 12757993 13383470 13770086 14101741 14501436 15040920 15770208
16770A5770208J44185Q27277L66196P57262N74566J059169O59783K61004J310849
$$ 15770208 15914393 16741670 17107866 17865128 18439694 19498863 20158646 20419650 21730499
16761B1730499N42443J002349R48791J153005Q64224J276985J290596J413631
$$ 21730499 22272942 23275291 24224082 25377087 26241311 27518296 28808892 30222523
16753C0222523J607668J251375J531843K208427J308247J887377K528751J689645
$$ 30222523 31830191 33081566 34613409 36821836 38130083 40017460 42546211 44235856
16745D4235856K638172K504342K971430K836770L250051L158610M065382L943644
$$ 44235856 46874028 49378370 52349800 55186570 58436621 61595231 65660613 69604257
16737F9604257M344331M369618M962437N125528N533445O220981N807329O577718
$$ 69604257 73948588 78318206 83280643 88406171 93939616 100160597 105967926 112545644
16729A12545644O712270P308466O958842P453006O709355P394280O712517N987393
$$ 112545644 119257914 126566380 133525222 140978228 147687583 155081863 161794380 167781773
16721A67781773N543295M467977L294031K236501J183112j12370j163421k787216
$$ 167781773 173325068 177793045 181087076 183323577 184506689 184394319 183230898 180443682
16713A80443682l373062m750543n126152n855569o324426p130594o954866p094927
$$ 180443682 177070620 172320077 167193925 161338356 155013930 147883336 140928470 133833543
16705A33833543p086014o956916o570026o424898o178473n909273n877187m936927
$$ 133833543 126747529 119790613 113220587 106795689 100617216 94707943 88830756 83893829
16697H3893829n022461m597324m153166m314892l464338l515487l516727k998089
$$ 83893829 78871368 74274044 70120878 65805986 62341648 58826161 55309434 52311345
16689E2311345k914626k560459k636855j618593k327755j966200k027808j781536
$$ 52311345 49396719 46836260 44199405 42580812 40253057 38286857 36259049 34477513
16681C4477513j507531j831560j194272j174283j202587j356512j192104r62623
$$ 34477513 32969982 31138422 29944150 28769867 27567280 26210768 25018664 24056041
16673B4056041j154756q61305o66209n78140j280647p07311p44421l62709p49096
$$ 24056041 22901285 22039980 21373771 20795631 19514984 18807673 18063252 17700543 16951447
16664A6951447n09890l64809p85636l49594l71244p89706n82929k60180l87154
$$ 16951447 16441557 16076748 15291112 14941518 14570274 13780568 13197639 12937459 12550305
16655A2550305m09926m91490l41476k90308k43391k15639j17352o57558l23768
$$ 12550305 12140379 11648889 11307413 11017105 10773714 10558075 10440723 9783165 9459397
16646I459397k98513K58992m51301j37311n62558P0670m12271l53766k98972L5562
$$ 9459397 9160884 9419876 8968575 8831264 8268706 8339376 7927105 7573339 7274367 7309929
16636G309929J04831m19234Q1705m33687p5578l82839o5579P5252j52804k24456
$$ 7309929 7414760 6995526 7077231 6643544 6567966 6185127 6119548 6194800 6041996 5817540
16626E817540l48434J71534l01045r3650k83620l8464R3124j11125k1705o79555
$$ 5817540 5469106 5640640 5339595 5245945 4962325 4923861 5016985 4905860 4884155 4204600
16616D204600M25424r365j81035p546j8738k24047K12796k98620m70842N80000
$$ 4204600 4630024 4620659 4439624 4432078 4413340 4189293 4402089 4103469 3632627 4212627
16606D212627l20295m06015R1710j758k36584J36771j38553L4858k33338L69534
$$ 4212627 3892332 3486317 3578027 3576269 3339685 3476456 3337903 3372761 3139423 3508957
16596C508957k91044j0069n2639m0543l07652L35122P1591l28029l03109J22102
$$ 3508957 3217913 3207844 3155205 3114662 2807010 3142132 3213723 2885694 2582585 2704687
16586B704687J44639k64260L8366n1614m907R0987J08557R083k79211k15276N286
$$ 2704687 2849326 2585066 2623432 2571818 2566911 2657898 2766455 2775538 2496327 2281051 2286337
16575B286337p1124K61614J40973o69170M601K6017n74o4372K22439n4241j24107
$$ 2286337 2215213 2476827 2617800 1948630 1953231 1979248 1978674 1914302 2136741 2082500 1958393
16564A958393k27967L02010J27674k71171j1931m12000J26829K39518q3390m6412
$$ 1958393 1730426 2032436 2160110 1888939 1877008 1465008 1591837 1831355 1747965 1701553
16554A701553j97887L83600r7146j06321k02345K38411K5702p0801j65646K18918
$$ 1701553 1503666 1887266 1790120 1683799 1481454 1719865 1745567 1674766 1509120 1728038
16544A728038k91307P8394j71799L25485j38051L4891j3325m21267K41740n26859
$$ 1728038 1436731 1515125 1343326 1668811 1530760 1565651 1552326 1131059 1372799 845940
16534H45940L59086J06131J75625J34052o61145J97249K67359k01580L31050n04176
$$ 845940 1205026 1311157 1486782 1620834 959689 1156938 1424297 1222717 1553767 1049591
16524A049591J89175q9803k21018K15239K67917p5835k48654K16238j5957k03127
$$ 1049591 1238766 1148963 927945 1143184 1411101 1335266 1086612 1302850 1286893 1083766
16514A083766o4426J09908K59555j67832J16371l07927J40028j67314j22293J96716
$$ 1083766 1019340 1129248 1388803 1220971 1337342 1029415 1169443 1002129 879836 1076552
16504A076552j74271M32808l40117n5745k20688L61569p2805j74848J17405k72668
$$ 1076552 902281 1335089 994972 939227 718539 1080108 1007303 832455 949860 677192
16494F77192M30706l52114J94501L8607M9800j95422J8100j64104J86541j06754
$$ 677192 1107898 755784 950285 988892 1038692 843270 861370 697266 883807 777053
16484G77053p4242R9651K59403k71995K90827l28342K82279l79517N9698K04907
$$ 777053 702811 802462 1061865 789870 1080697 752355 1034634 655117 714815 919722
16474I19722m29464L44849j37090J07075O4134k71717L77647l38857J33313J26907
$$ 919722 490258 835107 698017 805092 869226 597509 975156 636299 769612 896519
16464H96519k16814O8815j29763M9552L63272m20011J06146J64015m28876L63071
$$ 896519 679705 748520 618757 668309 1031581 611570 717716 881731 452855 815926
16454H15926l16789O20132m46014l6341Q3346L7818l1339k36872J60428k64456
$$ 815926 499137 1119269 673255 636914 720260 758078 726739 489867 650295 385839
16444C85839L38775j00449J25834j90046K05748j7748j20038L0952j74064L07241
$$ 385839 724614 624165 749999 559953 765701 747953 627915 658867 484803 792044
16434G92044j82703K7137J85447l70544K91658J7995k15722L35546K1052l16943
$$ 792044 609341 636478 821925 451381 743039 761034 545312 880858 901910 584967
16424E84967k26180J40738j12409K34597k35466K79909k05623J51906M5161j58841
$$ 584967 358787 499525 387116 621713 386247 666156 460533 612439 657600 498759
16414D98759j07858L1896J48836K88782m28838J99627r6396m7391A16933P1550
$$ 498759 390901 422797 571633 860415 431577 631204 534808 487417 116933 188483
16404A88483J34876J04817K00896j06816N9788l6771k71094K40235B13104J21917
$$ 188483 323359 428176 629072 522256 582044 545273 274179 514414 213104 335021
16394C35021o0234K86106L9344J42506k60513K0449p3580n6468K24970o8898B51528
$$ 335021 274787 560893 600237 742743 482230 502679 429099 372631 597601 528703 251528
16382I4845O23953A00055K84556A82658L11599A05120J48589K54004l7909q0651
$$ 94845 718798 100055 384611 182658 494257 105120 253709 507713 469804 389153
16372C89153J98936K97341C08020k7505P3467O5707A45907K45626j78391M19084
$$ 389153 588089 885430 308020 280515 353982 419689 145907 391533 213142 632226
16362F32226k39802K865A93441J81466K25376B32088K77961N4787Q7676n2794
$$ 632226 392424 395289 193441 374907 600283 232088 510049 564836 652512 599718
16352E99718k01723p3112A48852o0620L81515J92913B23303l5456K66145B25376
$$ 599718 397995 324883 148852 88232 469747 662660 223303 187847 453992 225376
16341B03922K14297k05323J90170j28908L25498k61540O7644N032p8080k8423
$$ 203922 418219 212896 403066 274158 599656 338116 405760 410792 332712 304289
16331C04289P3898o2736J70866k16004p6840P2695L12988k34257Q3006A92906
$$ 304289 378187 315451 486317 270313 193473 266168 579156 344899 427905 192906
16320C24191j39475Q4861J56303j2347j98285j3430J14844a22051B36514k6027
$$ 324191 184716 269577 425880 413533 215248 201818 316662 -122051 236514 210487
16310B10487O5507L2087r8774B5705L44560R3230n1618N858H6699L23100n5467
$$ 210487 275994 308081 209307 25705 370265 463495 411877 417735 86699 409799 354332
16299C54332Q9624j26935R9174q9684K23511J6788k37648j22986L61431B66324
$$ 354332 443956 317021 416195 326511 550022 566810 329162 206176 567607 266324
16288B79311J64668j0N5427B17054K91699B32417L75493j44771a89421B03206
$$ 279311 443979 443969 499396 217054 508753 232417 607910 463139 -189421 203206
16277B87951o7557P8628L2558A33985L36044B24202J00269K14210H4154K49331
$$ 287951 220394 299022 331580 133985 470029 224202 324471 538681 84154 333485
16267C33485J09115j06993D8792L12553p3579A10339h4056C66572J19666A30807
$$ 333485 442600 335607 48792 361345 287766 110339 -84056 366572 486238 130807
16256B78403I2636D5181K38285K24649A1272c35418C79429A74563E0896M28258
$$ 278403 92636 45181 283466 508115 11272 -335418 379429 174563 50896 479154
16246D79154d9078j5207I1804J67120a82502J0263C57156r9189n0074Q2152m2443
$$ 479154 -49078 -64285 91804 258924 -182502 -172239 357156 257967 207893 290045 247602
16235B47602J42936e9284E28055j90910C51K7954M55966B16004R2115j30492D3800
$$ 247602 390538 -59284 528055 337145 351 28305 484271 216004 308119 177627 43800
16223B25360Q92I1542N4240m2879K02385B0754L41476C0028M9588K59358j25083
$$ 225360 226252 91542 145782 102903 305288 20754 362230 30028 79616 338974 213891
16212B13891I7491K99670j75104q8447K9157B1583B863K02984P7329N5520j04798
$$ 213891 97491 397161 222057 133610 162767 21583 2863 205847 283176 338696 233898
16201B33898k4592m5897a35882C72007A60824G3149d4031F1489J60461p0843o9493
$$ 233898 209306 163409 -135882 372007 160824 73149 -44031 61489 221950 151107 81614
16190H1614e1147A96185M11775k36021K2312d8949A33885O9010r0403K78880D8166
$$ 81614 -51147 196185 607960 371939 394251 -48949 133885 202895 112492 391372 48166
16178A75613K18051b71165A87186J22684a93448F5486J96844j18907K22833B6752
$$ 175613 393664 -271165 187186 309870 -193448 65486 262330 143423 366256 26752
16167i286p7443A9206h5230D0908J19558n1687K80373I5632f6362B12483q0124
$$ -9286 -86729 19206 -85230 40908 160466 108779 389152 95632 -66362 212483 132359
16156A32359K02222d028k69287A5935a50651I7153a01793L2142A93102q6358J29203
$$ 132359 334581 -4028 -273315 15935 -150651 97153 -101793 -69651 193102 106744 235947
16145B35947J4866p6481O7160p3757D5495A8365M503P2936a1448J898l2617k03007
$$ 235947 250813 174332 241492 167735 45495 18365 22868 95804 -11448 -9550 -42167 -245174
16133b45174N1259C75771A30723l2871i606j1602D01625A95513J72815j76114
$$ -245174 -193915 375771 130723 97852 -9606 -21208 401625 195513 368328 192214
16123A92214I2160e9752C65706b1444p4730B59863G4844i4164b9714A33901a79070
$$ 192214 92160 -59752 365706 -21444 -96174 259863 74844 -94164 -29714 133901 -179070
16111G7488g4311C80617I254M00994c4729C5226J38563m7734G25J85206f2927
$$ 77488 -74311 380617 9254 410248 -34729 35226 173789 126055 725 185931 -62927
16099B10001H2789a65035A72619I294J70875m5614n0608J56340j02667a63674
$$ 210001 82789 -165035 172619 9294 180169 134555 83947 240287 137620 -163674
16088A89614C585J50169N9155d4250D2727J33826p8889h5040n6536F9144J8285
$$ 189614 3585 153754 212909 -44250 42727 176553 97664 -85040 -141576 69144 87429
16077H7429J45287p5354o688m0083J03287c13394a06030C6683b26186N6223E4571
$$ 87429 232716 157362 150674 110591 213878 -313394 -106030 36683 -226186 -169963 54571
16065f2790b7202B98060D3370N3340J10074p8689J1626a83538g8590j19438e4514
$$ -62790 -27202 298060 43370 96710 206784 128095 139721 -183538 -78590 -198028 -54514
16053I4514a28586G9188K18355i3728B82523q947C8393L6300c3183H3962b73820
$$ 94514 -128586 79188 297543 -93728 282523 273576 38393 74693 -33183 83962 -273820
16041A8815R3768J4402a72932g9331G0099m560J50419C2558e392l3745B42555
$$ 18815 112583 126985 -172932 -79331 70099 65539 215958 32558 -5392 -39137 242555
16029A87647b14234m2413c2660C1453J44020h5G3469c18324A43328o1407h9206
$$ 187647 -214234 -256647 -32660 31453 175473 -85 73469 -318324 143328 81921 -89206
16017B18160a91701H3936a12673G1726f5334B84209F7092e7793q9283F920L8094
$$ 218160 -191701 83936 -112673 71726 -65334 284209 67092 -57793 -147076 6920 45014
16006D5014g1367m37769G7434a55374B15112d65235A51229C20J35021L340e6138
$$ 45014 -71367 -509136 77434 -155374 215112 -465235 151229 320 135341 138681 -56138
15994B95403q0423e0414I7248B0531H032a7184B39768m8432a60116j8505d3100
$$ 295403 214980 -50414 97248 20531 8032 -17184 239768 191336 -160116 -178621 -43100
15982A59031n2698K48960r4499A1375i0588L8785l3605B08504F8417b25412B1308
$$ 159031 106333 355293 260794 11375 -90588 -51803 -85408 208504 68417 -225412 21308
15970i4078G6361a58732o3223A86807F9848d538A83366K7394l8470b76544B8662
$$ -94078 76361 -158732 -221955 186807 69848 -4538 183366 210760 172290 -276544 28662
15958H5234a3364F4392a09678k33821F9702e8157A27543b50200Q438N7496G9768
$$ 85234 -13364 64392 -109678 -343499 69702 -58157 127543 -250200 -241762 -184266 79768
15946a87740g0451H4489c62549E4772j2712a12464I8992c04936A62934a31213
$$ -187740 -70451 84489 -362549 54772 42060 -112464 98992 -304936 162934 -131213
15935b28263a05970B04439a40737c9385p8881r7114A52013a34032q2901A55141
$$ -228263 -105970 204439 -140737 -39385 -118266 -215380 152013 -134032 -216933 155141
15924A42017a01135B69916a07087K8280k6260j285C34600e1825C7858L94337a31354
$$ 142017 -101135 269916 -107087 -78807 -105067 -106352 334600 -51825 37858 432195 -131354
15912a36892N8711l92159a97552d9356b4526j78650r9109O1439J11115M1463A86850
$$ -136892 -78181 -470340 -197552 -49356 -24526 -203176 -302285 -240846 -129731 -88268 186850
15900B65655I6934H964e4899B17124J7332a72523l3791p4208C84791D2229h6155
$$ 265655 96934 8964 -54899 217124 234456 -172523 -206314 -280522 384791 42229 -86155
15888c79820d0834o1374M4344j75330A38780k3225Q2383a37773B66344a31545
$$ -379820 -40834 -102208 -57864 -233194 138780 115555 197938 -137773 266344 -131545
15877B06919H5349b45793A35871a17545k43194d3897j51980q3761B20314e7015
$$ 206919 85349 -245793 135871 -117545 -360739 -43897 -195877 -279638 220314 -57015
15866D07067a04334A41806a95070D1264Q67Q674b72583j77717C4416K1984I084
$$ 407067 -104334 141806 -195070 41264 42131 50805 -272583 -450300 34416 56400 9084
15854A60255n0328C5382b05747C7372b54465A09182a10227A64320f7411n1968
$$ 160255 109927 35382 -205747 37372 -254465 109182 -110227 164320 -67411 -119379
15844a19379A57946d09901a26329I4583b15829E7555a19755A95233b72363F3717
$$ -119379 157946 -409901 -126329 94583 -215829 57555 -119755 195233 -272363 63717
15833b04859C74313c16053J30267M5660f2976H5315a9775B24706j00673g2322
$$ -204859 374313 -316053 -185786 -140126 -62976 85315 -19775 224706 124033 -72322
15822a13048p4783C75242A76523g9695q2559b4405I4377i2029q5496J4695N2096
$$ -113048 -187831 375242 176523 -79695 -162254 -24405 94377 -92029 -177525 -162830 -110734
15811a10734j63839B80736C5405a40265O9023A43429a99921C27734a24924K4415
$$ -110734 -274573 280736 35405 -140265 -71242 143429 -199921 327734 -124924 -100509
15801a00509m6188k47025a06831c2966A74517a43833C93543b16707B6160i7875
$$ -100509 -146697 -393722 -106831 -32966 174517 -143833 393543 -216707 26160 -97875
15790f4895j55406f8831H8573b47445B75577g2876o9050j13494C45321D5388b73288
$$ -64895 -220301 -68831 88573 -247445 275577 -72876 -141926 -255420 345321 45388 -273288
15778c82854a37285f5266A20637b1522I1863c39413J67775A50583R479b7612j39766
$$ -382854 -137285 -65266 120637 -21522 91863 -339413 -171638 150583 160062 -27612 -167378
15767a67378L2020k53458i5046B942b21740b6018k46436j75436i3595C9101a18763
$$ -167378 -135358 -388816 -95046 2942 -221740 -26018 -272454 -447890 -93595 39101 -118763
15755E6929J34004n8519J23247h9424A75639b2110F0335a55520N2831J9047l4095
$$ 56929 190933 132414 255661 -89424 175639 -22110 60335 -155520 -102689 -83642 -117737
15744a17737C6796a40487G9040a09200b8861B21004J07395F3031M3733f171o5685
$$ -117737 36796 -140487 79040 -109200 -28861 221004 328399 63031 106764 -6171 -71856
15733g1856b306m25968G3310f9782k7448j95388A11843J10059a77004A3862J74449
$$ -71856 -2306 -428274 73310 -69782 -97230 -292618 111843 221902 -177004 13862 188311
15722A88311A2856b21436j91162A51061a84757A53802a38625f2801B45436e1443
$$ 188311 12856 -221436 -412598 151061 -184757 153802 -138625 -62801 245436 -51443
15711A66801G0403B7000Q4682J79441d12240H9680c5927a1952B54650E6466B1308
$$ 166801 70403 27000 111682 291123 -412240 89680 -35927 -11952 254650 56466 21308
15699b62265E8917Q49c1815k42040J18704f3084F8657A3160M0813K42981a68315
$$ -262265 58917 59766 -31815 -273855 -155151 -63084 68657 13160 53973 296954 -168315
15687a63846D16105A03691a71330D7492j7197g3881B5924a21966A84393J991a56756
$$ -163846 416105 103691 -171330 47492 30295 -73881 25924 -121966 184393 186384 -156756
15675h008C7440f4925r8971b9008B98653A31737J0216b73845G5466b5296m54148
$$ -8008 37440 -64925 -163896 -29008 298653 131737 141953 -273845 75466 -25296 -479444
15664d79444a70712a5197F239J09479a2862a946j15821d9196l57804A34743a37060
$$ -479444 -170712 -15197 6239 115718 -12862 -1946 -117767 -49196 -407000 134743 -137060
15652A82165a2830A14576a23291l571r5438A33650b62937A10289J31170H3520
$$ 182165 -12830 114576 -123291 -126862 -222300 133650 -262937 110289 241459 83520
15641g6463g750j10335F358e4109H4958b59661I1923a91835c4870A40746d7464
$$ -76463 -7750 -118085 6358 -54109 84958 -259661 91923 -191835 -34870 140746 -47464
15629a72575F2145h2142l1855p4370g055A85974a70719P1380B75752a20167C45837
$$ -172575 62145 -82142 -113997 -188367 -7055 185974 -170719 -99339 275752 -120167 345837
15617a19493B86160a09165G4400o227N9459n7608J47612g9284A4600d26111L8286
$$ -119493 286160 -109165 74400 68173 127632 70024 217636 -79284 14600 -426111 -387825
15606c87825a35510j94296a05590e1061H3496d053D3255b27801G872J12406J44136
$$ -387825 -135510 -329806 -105590 -51061 83496 -4053 43255 -227801 7872 120278 264414
15595B64414b45548a091j04143B31890c3101D2910b03396A5273J71902a23728
$$ 264414 -245548 -1091 -105234 231890 -33101 42910 -203396 15273 187175 -123728
15584a3916A13783m6525r910L0431f4762A87976d652k9078A40832J60600a86348
$$ -13916 113783 67258 57348 87779 -64762 187976 -4652 -33730 140832 301432 -186348
15572B17493n5069d2851p0700c5507q1907e0730j0435K9848B11061F5493P3345
$$ 217493 162424 -42851 -113551 -35507 -117414 -50730 -61165 -31317 211061 65493 138838
15561A38838F338c83521J33707a6853j23045k00182a56661e8512R552A15111D0381
$$ 138838 6338 -383521 -249814 -16853 -139898 -340080 -156661 -58512 -48960 115111 40381
15549i4445j32619Q5216c417B03011a41003f3744j20750f9700k76125b655l73057
$$ -94445 -227064 -141848 -3417 203011 -141003 -63744 -184494 -69700 -345825 -2655 -375712
15538c75712J34754A32618b68377D11261b65982d7916B68414h9337A47295e8412
$$ -375712 -240958 132618 -268377 411261 -265982 -47916 268414 -89337 147295 -58412
15527B08486d4212B16479J12348G591c86025A6758M3401A5587b30666R7204B09494
$$ 208486 -44212 216479 328827 7591 -386025 16758 60159 15587 -230666 -133462 209494
15515H7212a37449A98663b7603C14723E0610h4543I6703A6745b57655g1621f923
$$ 87212 -137449 198663 -27603 314723 50610 -84543 96703 16745 -257655 -71621 -6923
15503b64649M1g1273p400L0476j36739Q5946E901b79780R5286Q406K5759q8075
$$ -264649 -264608 -71273 -78673 -48197 -184936 -98990 5901 -279780 -184494 -176088 -150329 -238404
15491b38404A03727J61442j12244C1485e5230A26165b73307D1076b51309A9763
$$ -238404 103727 265169 152925 31485 -55230 126165 -273307 41076 -251309 19763
15480A05986a94931A10765a29131j7737l6018A88082e3061j61660B20604g2473
$$ 105986 -194931 110765 -129131 -146868 -182886 188082 -53061 -214721 220604 -72473
15469F1981M81037A16386b81329B38806a85289E6J93762G989M017j123i5042G2144
$$ 61981 543018 116386 -281329 238806 -185289 56 193818 7989 12006 10883 -95042 72144
15456e8522k13870N5014P5361A65237a8645o6436B55270f3434A28108o3674j5653
$$ -58522 -272392 -217378 -142017 165237 -18645 -85081 255270 -63434 128108 64434 48781
15445D8781a0138a451n2309j67465A69191b9621I5065p260e9503E4002M8904m2066
$$ 48781 -10138 -1451 -53760 -221225 169191 -29621 95065 87805 -59503 54002 102906 60840
15433F0840a46401g1576A26581a38818B03400d23671d1334A30930N5738b8596
$$ 60840 -146401 -71576 126581 -138818 203400 -423671 -41334 130930 186668 -28596
15422d633q1443A10456f5912A48042O6167r6142b98683D6420a49861o5202c594
$$ -4633 -86076 110456 -65912 148042 214209 118067 -298683 46420 -149861 -215063 -3594
15410c3598q2128a0465H9182b99036I7343d0579A1550i0015A77770D4560K10977
$$ -33598 -115726 -10465 89182 -299036 97343 -40579 11550 -90015 177770 44560 255537
15399B55537K2358a62796A40655a11108j20687j0077G2504l5715G130J71138c9520
$$ 255537 277895 -162796 140655 -111108 -231795 -241872 72504 36789 7130 178268 -39520
15387a78253B13208b46228b6925A428e6442a9644g855j01349a1676E5539N1750
$$ -178253 213208 -246228 -26925 1428 -56442 -19644 -7855 -109204 -11676 55539 107289
15376A07289b7744k56707N6033A54191F6666c244j34705A60397D3065c2441j23246
$$ 107289 -27744 -284451 -228418 154191 66666 -3244 -137949 160397 43065 -32441 -155687
15365a55687c6927C04318h948j81384J7498B8647e661m9117C9838f4680j02960
$$ -155687 -36927 304318 -8948 -190332 -172834 28647 -5661 -54778 39838 -64680 -167640
15354a67640A79931J09732A06969d2534C6018c0688E30650i0555n0357A60623
$$ -167640 179931 289663 106969 -42534 36018 -30688 530650 -90555 -140912 160623
15343h6281C8110K10725g700A57853m1841c4406P745m44021c153A70479b3271
$$ -86281 38110 248835 -7700 157853 116012 -34406 -26661 -470682 -3153 170479 -23271
15331B32700j09111J79416b57080F307K25703g2409J8734o3086o5163O1039A84068
$$ 232700 123589 303005 -257080 6307 232010 -72409 -53675 -116761 -181924 -120885 184068
15319b31248b6370n0735o6670f956C155J71492b34365e9257B4124a81389r3683
$$ -231248 -26370 -77105 -143775 -6956 3155 174647 -234365 -59257 24124 -181389 -275072
15308b75072A08993b00949F8672a46498B03992R9852B9462a7927k09751G5338
$$ -275072 108993 -200949 68672 -146498 203992 303844 29462 -17927 -227678 75338
15297C608b5869B46318a20846a1749j4853B24614B1992K2614L97354C3848J20689
$$ 3608 -25869 246318 -120846 -11749 -26602 224614 21992 44606 441960 33848 154537
15286A54537M6263A8806J80122G8793O0550m6970R2556f9322D1622O6253d8580
$$ 154537 200800 18806 198928 78793 139343 92373 184929 -69322 41622 107875 -48580
15274b28167A21331L28792k18495H7589J67130b0945B72387j31749N153J33004
$$ -228167 121331 450123 231628 87589 254719 -20945 272387 140638 145791 278795
15264B78795I6974O0619J8537M4239b87406A94276a12707b0064C08507o9325J60352
$$ 278795 96974 157593 176130 220369 -287406 194276 -112707 -20064 308507 239182 399534
15253C99534A70722J23756n3325K92382J72071L75582J36800k98568K56594D20164
$$ 399534 170722 294478 241153 533535 705606 1081188 1217988 919420 1176014 420164
15242D27962B11926L12167a08333B2927a75706I7998i6370E1433J77185a4219
$$ 427962 211926 524093 -108333 22927 -175706 97998 -96370 51433 228618 -14219
15231B9718i6151B37751a8054m9989K3012k16476d1095j76389A2992O2629C0375
$$ 29718 -96151 237751 -18054 -68043 -45031 -261507 -41095 -217484 12992 75621 30375
15219A64016b6455N294G965b04653R2839j25908F1258J96979j2707G7663B3773
$$ 164016 -26455 -21161 7965 -204653 -111814 -237722 61258 258237 245530 77663 23773
15207A10081N6560F5542J93784E7136J36194c28932a56117j83690B41571k4338
$$ 110081 166641 65542 259326 57136 193330 -328932 -156117 -339807 241571 217233
15197B17233l1862A8909N2183R1470B4550i1241k89284H2244a8866o1058m786
$$ 217233 185371 18909 71092 162562 24550 -91241 -380525 82244 -18866 -79924 -84710
15186h4710j7244D1340a3486j48891C09955e0614j99938Q1434M2053B96210E5787
$$ -84710 -101954 41340 -13486 -162377 309955 -50614 -250552 -169118 -127065 296210 55787
15174D8314a18116C78215A4686J52831b9041A6249R335K6788K49773F7489f1758
$$ 48314 -118116 378215 14686 167517 -29041 16249 25584 52372 302145 67489 -61758
15162g135C1743J47051J40083a8303j12940A60757i2928A0331a78608k0883A61237
$$ -7135 31743 178794 318877 -18303 -131243 160757 -92928 10331 -178608 -199491 161237
15150B36864K75376b85167J28435M0514B19633p750h6710B18739a25095k83472
$$ 236864 512240 -285167 -156732 -116218 219633 211883 -86710 218739 -125095 -408567
15140d08567B95208c6850I6391H959L43403B4271K76783a14135A49559J21059
$$ -408567 295208 -36850 96391 8959 352362 24271 301054 -114135 149559 270618
15130B70618G0312j2614J65878j05682J74633j0928q0989c55407d1409M094D2791
$$ 270618 70312 57698 223576 117894 292527 281599 200610 -355407 -41409 -37315 42791
15118a81352h7867B55988A8018J42063b4626C95435A16312l6711i5962d2689k430
$$ -181352 -87867 255988 18018 160081 -24626 395435 116312 79601 -95962 -42689 -45119
15107d5119A73219E2671K81792k3208A48158D6836A220K58664K10237j63961I4922
$$ -45119 173219 52671 334463 311255 148158 46836 1220 259884 470121 306160 94922
15095A4275P30K47690b75745B26402q8490l7508J64631C0107M6385J49830i5281
$$ 14275 15005 262695 -275745 226402 137912 100404 265035 30107 76492 226322 -95281
15083E557L2130a12424D18Q9652K4929k3154J33644J39597J623j50670d2490A22045
$$ 5557 37687 -112424 418 90070 114999 91845 225489 365086 366709 216039 -42490 122045
15070A83402J11952G3204M55916A10283L1757R6859b01352C85533j88379n7947
$$ 183402 295354 73204 529120 110283 142040 238899 -201352 385533 197154 139207
15060A39207K05794D0249N0087J93928A02815A2941a62123G3129N3939N8008J55310
$$ 139207 345001 40249 90336 284264 102815 12941 -162123 73129 127068 185076 340386
15049C40386q1315K6022m356O1260H6286M0174K25428j09097a78305P0826B8522
$$ 340386 259071 285093 280737 341997 86286 126460 351888 242791 -178305 -107479 28522
15037I9376l4202J15866a62740I611L70062H6428j0818M7972a07758H1991k3523
$$ 99376 65174 181040 -162740 9611 379673 86428 75610 123582 -107758 81991 58468
15026E8468J3433M37365B11529R035M3922J8727J8274j21127J01149A35050K379
$$ 58468 71901 509266 211529 220564 264486 283213 301487 180360 281509 135050 137429
15015A37429Q5266J87931I2275c9756j8646A82055J05526J85133A08736L33679
$$ 137429 222695 410626 92275 -39756 -58402 182055 287581 472714 108736 442415
15005D42415k715A40311D8584J55954d0706B58148A0397J7607R1452L10957A45707
$$ 442415 439700 140311 48584 204538 -40706 258148 10397 28004 119456 430413 145707
14993B53432k3605q4024k8891M4371k3687K0517J29872a8197B02226C1127K04093
$$ 253432 229827 145803 116912 161283 137596 158113 287985 -18197 202226 31127 235220
14982B35220c1600B71997I7809J37359I2459l5868K76151j51341J35231J16815
$$ 235220 -31600 271997 97809 235168 92459 56591 332742 181401 316632 433447
14972D33447Q4361C2410J44148J62555Q290H8360l1217M77174B1444K34477A20638
$$ 433447 517808 32410 176558 339113 347403 88360 57143 534317 21444 255921 120638
14960D98408D2896Q4203K50347e3137B64252H9616K88406J800J50334j65334i874
$$ 498408 42896 127099 377446 -53137 264252 89616 378022 379822 530156 364822 -9874
14948D00868n5491P574A18476m1155J95620h1843D52158j08144j5576j27535J05556
$$ 400868 345377 352951 118476 77321 272941 -81843 452158 344014 328438 200903 306459
14937C06459a24430a840A93024J44186A23301B6399M27151k08559a20794B24634
$$ 306459 -124430 -1840 193024 337210 123301 26399 453550 244991 -120794 224634
14926D52832A31173Q0610J00863B6587N37007B32102N8721Q5336p5487O2262j36814
$$ 452832 131173 211783 312646 26587 563594 232102 290823 376159 300672 362934 226120
14915B26120J03687J04965j52387P3783j20152J45487A23676J10322c1262F21615
$$ 226120 329807 434772 282385 356168 236016 381503 123676 233998 -31262 621615
14904D40842C2643M02396C4999P6807K50802j8146j4726P8722j57444N68057m05827
$$ 440842 32643 435039 34999 111806 362608 344462 329736 408458 251014 819071 413244
14893D13244m6587a44599j27071B89305A37222J36534A32244M1057J19842q0214
$$ 413244 366657 -144599 -271670 289305 137222 273756 132244 173301 293143 212929
14883B12929R1901p1603J06904k6162l5727J21439j6051R6699j81443j2291J51322
$$ 212929 304830 233227 340131 313969 278242 399681 383630 480329 298886 286595 437917
14872D37917A20841J78093j30527O36729I8134K19119J65135j89181J57003B18552
$$ 437917 120841 298934 168407 805136 98134 317253 482388 293207 450210 218552
14861E05635A29851K86336N4740E9793L13026p2153M5382P8379M0220m2609A40973
$$ 505635 129851 416187 470927 59793 372819 300666 346048 424427 464647 422038 140973
14849B75226P6121o5335L0091N1970d7464E65673I8805D069L00826H2697N61947
$$ 275226 351347 286012 316103 368073 -47464 565673 98805 4069 304895 82697 644644
14838F44644j53861o5813K39d474F00021k19454k0267L61651l05301J74770M1668
$$ 644644 490783 424970 425209 -4474 600021 380567 360300 721951 416650 591420 633088
14827F33088j20256j03902J54193j86470J58678m7755k1769j66879L45553B21973
$$ 633088 512832 408930 563123 376653 535331 487576 465807 298928 644481 221973
14816D60551J46170k64207P0313J67407k10320M175P31n5705J25301k05148L36406
$$ 460551 606721 342514 412827 580234 369914 374089 374820 319115 444416 239268 575674
14805E75674j9247K72012B85069N53142j97613f2682I14312l85688j26950L65440
$$ 575674 556427 828439 285069 838211 640598 -62682 914312 528624 401674 767114
14795G67114j0609j02625j48282j1105J50641q2860K38253C79200A04466O63206
$$ 767114 756505 653880 505598 494493 645134 562274 800527 379200 104466 767672
14785G67672j69692O9696j50245K22845k56199B32353K03480J31901J24527k49710
$$ 767672 597980 667676 517431 740276 484077 232353 435833 567734 692261 442551
14775D42551j0192L07728l07753J87364A95275J31437p9106M40612o1050n0095
$$ 442551 432359 740087 432334 619698 195275 326712 247606 688218 627168 577073
14765E77073o0744J64494k60498J39922p8226P3505j14931J12999P8712B56903
$$ 577073 516329 680823 420325 560247 482021 555526 440595 553594 632306 256903
14754C97960J57321B49259M68678B54950K65388Q6263n4003J51291k27029O4298
$$ 397960 555281 249259 717937 254950 520338 606601 552598 703889 476860 541158
14744E41158J725M36299j80985J15060k74694o5881N8768l1065B51164N61479
$$ 541158 542883 979182 798197 913257 638563 572682 631450 600385 251164 812643
14734H12643k36512j3279q9928K40530o45l2336O993k35840J24811L64952l43574
$$ 812643 576131 562852 472924 713454 712809 680473 687466 451626 576437 941389 597815
14723E97815J07301q5892j16974A07059O97013j31876Q3490K30829o3522l23772
$$ 597815 705116 619224 502250 107059 804072 672196 755686 986515 922993 599221
14713E99221Q4920r5037J86426j59525K75184k85941j34447L44028o1088j95519
$$ 599221 684141 589104 775530 616005 891189 605248 470801 814829 753741 558222
14703E58222M23351l76908Q8363J28979k3384P1042j80553J5697j80651N53246
$$ 558222 981573 604665 693028 822007 798623 869665 689112 704809 524158 1077404
14693A077404k8409k75415k3256K45988K44881n80662N4808J89490j174j78649
$$ 1077404 1048995 773580 750324 996312 1241193 660531 715339 904829 903655 725006
14683G25006N8917l2703J35854k15282K86700J0818j39499k34331q7841M66628
$$ 725006 783923 751220 887074 671792 958492 969310 829811 595480 507639 974267
14673I74267J71401k8084j85686O6190k63321K82923k83020J00216q1150M07694
$$ 974267 1145668 1117584 931898 998088 734767 1017690 734670 834886 753736 1161430
14663A161430k52973K41879L7652r6360q0296J432K0486J48800j48692L6021R6491
$$ 1161430 908457 1150336 1187988 1091628 1011332 1012764 1033250 1182050 1033358 1069379 1165870
14652A165870J87463l73131j45918N7871l9604Q8365L3718K9936P7580J47370
$$ 1165870 1353333 980202 834284 892155 852551 940916 974634 1004570 1082150 1229520
14642A229520M0002n52251K81614M18446l50989j20006J79589j6751q1025J43780
$$ 1229520 1269522 717271 998885 1417331 1066342 946336 1125925 1109174 1028149 1171929
14632A171929l6189K92902j93975J59317l48380K99011l08211N7603L5816j8175
$$ 1171929 1135740 1428642 1234667 1393984 1045604 1344615 1036404 1094007 1129823 1111648
14622A111648J29319r5426J44956n8977J35917L5351k9899j71031J93540m14555
$$ 1111648 1240967 1145541 1290497 1231520 1367437 1402788 1372889 1201858 1395398 980843
14612I80843N05628l18807O6652J7929K45009k31767R1080k9688P5577m968K80305
$$ 980843 1486471 1167664 1234316 1252245 1497254 1265487 1356567 1326879 1402456 1397488 1677793
14601A677793l77232L91528j46251j0066M6043j72836K070p8220J17643j7433
$$ 1677793 1300561 1692089 1545838 1535772 1581815 1408979 1411049 1332829 1450472 1433039
14591A433039L08919j08032M1244K91290j16888j86123J07506n4944j13190o292
$$ 1433039 1741958 1633926 1675170 1966460 1849572 1663449 1770955 1716011 1602821 1596529
14581A596529K72397j06235M16762m83714J50298J49849L5883k16230J65655J70579
$$ 1596529 1868926 1762691 2179453 1695739 1846037 1995886 2031769 1815539 1981194 2151773
14571B151773P6766M9177m05035k34838N78023k5472j32996L39633j92185l512
$$ 2151773 2228539 2277716 1872681 1637843 2215866 2190394 2057398 2397031 2204846 2201334
14561B201334q5725L05645J15365R1348p5003N67154j86098K73787M50215K78503
$$ 2201334 2115609 2421254 2536619 2627967 2552964 3120118 2934020 3207807 3658022 3936525
14551C936525N08570P59312K552136M248870Q150373J0559897O361853j3528976
$$ 3936525 4445095 5204407 7756543 12005413 20155786 30715683 37077536 23548560
14543B3548560A1496408E731238k168600j028562m21342Q7117k15119m5313J01673
$$ 23548560 11496408 5731238 3562638 2534076 2112734 2199851 1984732 1939419 2041092
14534B041092j05761r172K30860k03957k17676L69919j395k16647J5771L90218
$$ 2041092 1935331 1926159 2157019 1953062 1735386 2105305 2103910 1887263 1903034 2293252
14524B293252K4088j16588M50825l81776K18913j54893k95091M94902k64204L8303
$$ 2293252 2317340 2200752 2651577 2269801 2488714 2333821 2038730 2533632 2269428 2307731
14514B307731p5145N18633m66029J65755K83571k17260Q6559O1548L43310k87161
$$ 2307731 2232586 2751219 2285190 2450945 2734516 2517256 2603815 2665363 3008673 2721512
14504B721512K70468k04351n2618n2866M05227l58086p8311L11232q9699L62020
$$ 2721512 2991980 2787629 2735011 2682145 3087372 2729286 2650975 2962207 2872508 3234528
14494C234528r2164J81360j33504k40127M27570l50221J76041R6996k19765J02507
$$ 3234528 3142364 3323724 3190220 2950093 3377663 3027442 3203483 3300479 3080714 3183221
14484C183221J07389K02455j85116j13467K85775l8622j71618L51374K1450j30652
$$ 3183221 3290610 3493065 3307949 3194482 3480257 3441635 3270017 3621391 3642841 3512189
14474C512189J28785j11526J84324J27015K3344j11815K76828K61147m35468K57799
$$ 3512189 3640974 3529448 3713772 3840787 3864131 3752316 4029144 4290291 3854823 4112622
14464D112622J49940J45083m15279L42552n07635Q86865j70557J45807O4398P2668
$$ 4112622 4262562 4407645 3992366 4334918 3827283 4714148 4543591 4689398 4753796 4826464
14454D826464l2818j99337L48083O0724j45676J41763q3916L13461j29994k67491
$$ 4826464 4793646 4594309 4942392 5003116 4857440 4999203 4915287 5228748 5098754 4831263
14444D831263O08038K58133l62722K30715J10599Q0813k65803N2060K72035j9217
$$ 4831263 5439301 5697434 5334712 5565427 5676026 5756839 5491036 5543096 5815131 5795914
14434E795914J69574K12260l04746O97287l26240l6463L91912k23132L9680K68022
$$ 5795914 5965488 6177748 5873002 6570289 6244049 6207586 6599498 6376366 6416046 6684068
14424F684068k31905M67375k9087J9897K13982K27103Q0036k63152N68865M136
$$ 6684068 6452163 6919538 6890451 6910348 7124330 7351433 7431469 7168317 7737182 7741318
14414G741318L40877l22392M596J20384J85077J40207K33137L65001n08307L89077
$$ 7741318 8082195 7759803 7764399 7884783 8069860 8210067 8443204 8808205 8299898 8688975
14404H688975K60587J16997L61839j92739M64376l65213M39462L38144J62627
$$ 8688975 8949562 9066559 9428398 9235659 9700035 9334822 9774284 10112428 10275055
14395A0275055k70296M33431P6468N01822j30552Q5585M13428K91448k06609K57863
$$ 10275055 10004759 10438190 10514658 11016480 10885928 10971513 11384941 11676389 11469780 11727643
14385A1727643P21864l7113L91805M7835J52089N54076J25780J9660M84844K44398
$$ 11727643 12449507 12412394 12804199 12852034 13004123 13558199 13683979 13703639 14188483 14432881
14375A4432881R4289O30163k4302M77675P35764l39282N81367N06670q7035M37448
$$ 14432881 14527170 15157333 15133031 15610706 16346470 16007188 16588555 17095225 17008190 17445638
14365A7445638M75854P76159m6143J70081O29883L23505M14759O11785M28643
$$ 17445638 17921492 18697651 18651508 18821589 19451472 19774977 20189736 20801521 21230164
14356B1230164O11626O81049k07039J015271N82608N07962P04356N62265Q28316
$$ 21230164 21841790 22522839 22315800 23331071 23913679 24421641 25125997 25688262 26516578
14347B6516578N43662J115216J63219R04662R34466K86123J058626J082027J019548
$$ 26516578 27060240 28175456 28338675 29243337 30177803 30463926 31522552 32604579 33624127
14338C3624127Q26063J092110N77079J267005R84490J350226J228978Q54029J753685
$$ 33624127 34450190 35542300 36119379 37386384 38370874 39721100 40950078 41804107 43557792
14329D3557792J375068J323300J625976J578180J552768J997389J529751J784328
$$ 43557792 44932860 46256160 47882136 49460316 51013084 53010473 54540224 56324552
14321E6324552K146441K318651K122775K484637K132113K961861K616680K796544
$$ 56324552 58470993 60789644 62912419 65397056 67529169 70491030 73107710 75904254
14313G5904254K940535L190524L252696L863604L968095L940392M209215M615954
$$ 75904254 78844789 82035313 85288009 89151613 93119708 97060100 101269315 105885269
14305A05885269N321680M865481N214344O125402O133776O670621O960192P412622
$$ 105885269 111206949 116072430 121286774 127412176 133545952 140216573 147176765 154589387
14297A54589387P987994Q368117R018976R631881J0053721J0652104J1522527
$$ 154589387 162577381 170945498 179964474 189596355 199650076 210302180 221824707
14290B21824707J2032901J2271502J3108822J3946631J4283842J4668513J5560271
$$ 221824707 233857608 246129110 259237932 273184563 287468405 302136918 317697189
14283C17697189J5446540J5898797J5783825J5411740J5005786J4039044J2787758
$$ 317697189 333143729 349042526 364826351 380238091 395243877 409282921 422070679
14276D22070679J1525093R878576P807202M479875n25174l070254k649712q32753
$$ 422070679 433595772 443474348 451281550 455761425 455236251 452165997 449516285 448683532
14268D48683532l918764m290302o353905j0160192j2171440j3033402j4708574
$$ 448683532 444764768 440474466 434120561 423960369 411788929 398755527 384046953
14261C84046953j5821299j6083969j6048190j5879206j6046819j4936962j4455956
$$ 384046953 368225654 352141685 336093495 320214289 304167470 289230508 274774552
14254B74774552j3962376j3334035j2831892j2026766j1736308j0917099j0225973
$$ 274774552 260812176 247478141 234646249 222619483 210883175 199966076 189740103
14247A89740103r501320r248124q289624q178717p397243o965812o484102o596029
$$ 189740103 180238783 170990659 162701035 154522318 147125075 140159263 133675161 127079132
14239A27079132n381245n710752n135938m820251m652640m094202m133074l776418
$$ 127079132 121697887 115987135 110851197 106030946 101378306 97284104 93151030 89374612
14231H9374612l270915l334262l558803l451926l059386k730768j856305l224883
$$ 89374612 86103697 82769435 79210632 75758706 72699320 69968552 68112247 64887364
14223F4887364k254814k301364j932075j775703k188574j747592k010070j221374
$$ 64887364 62632550 60331186 58399111 56623408 54434834 52687242 50677172 49455798
14215D9455798j787950j186694j327619j495025j399214j210439j141205j375531
$$ 49455798 47667848 46481154 45153535 43658510 42259296 41048857 39907652 38532121
14207C8532121p88715j000528r56924j016905r41595j119466p91582o99829p52560
$$ 38532121 37743406 36742878 35785954 34769049 33827454 32707988 31916406 31216577 30464017
14198C0464017q66773p36454j228134n62041o82184p24396o29897l79326p40861
$$ 30464017 29597244 28860790 27632656 27070615 26388431 25664035 25034138 24654812 23913951
14189B3913951n65752m10888m19497n03605n60515o90045m28359n71736l25449
$$ 23913951 23348199 22937311 22517814 22014209 21453694 20763649 20335290 19763554 19438105
14180A9438105j69963p12540k45684q8339n94538l61179q4191n89738l98669k5995
$$ 19438105 19268142 18555602 18309918 18221579 17627041 17265862 17181671 16591933 16193264 16167269
14170A6167269o41975j35302l86711l90465L2359p57174M8479l62251k01319j54152
$$ 16167269 15525294 15389992 15003281 14612816 14645175 13888001 13936480 13574229 13372910 13218758
14160A3218758k36510k96882j85030l36880o2292j78358l05233p4193k77719j35149
$$ 13218758 12982248 12685366 12500336 12163456 12101164 11922806 11617573 11543380 11265661 11130512
14150A1130512n0968j83253l35916l29369K06718m42245j53122N6470k98616j341
$$ 11130512 11079544 10896291 10560375 10231006 10437724 9995479 9842357 9898827 9600211 9598870
14140I598870m59915J14866k61461k29017L82234m23295p1804j60806l26887K4108
$$ 9598870 9138955 9253821 8992360 8763343 9145577 8722282 8650478 8489672 8162785 8186893
14130H186893M1137k41524k79760J66297p14595O80707m82289k64979j18978K4799
$$ 8186893 8228030 7986506 7706746 7873043 7158448 7839155 7356866 7091887 6972909 6997708
14120F997708j09211K07825l57565k71583L32318m10684J30172n27538J86558
$$ 6997708 6888497 7096322 6738757 6467174 6799492 6388808 6518980 5991442 6178000
14111F178000J82166k50155p6411j74953J45279m42003J47374j51344L2138K64404
$$ 6178000 6360166 6110011 6033600 5858647 6003926 5561923 5709297 5557953 5590091 5854495
14101E854495n14791L3729m4459L9975k13958o919Q3427p9402j89602j07462L0189
$$ 5854495 5339704 5373433 5328974 5368949 5154991 5148072 5231499 5152097 4962495 4855033 4885222
14090D885222k67563k83600K34660j66806o4549K86282k75646O329n3853n414
$$ 4885222 4617659 4334059 4568719 4401913 4337364 4623646 4348000 4354329 4300476 4295062
14080D295062n6165l6103k78054p2035N17851j80190l13728k8747L24376k31973
$$ 4295062 4238897 4202794 3924740 3852705 4370556 4190366 3876638 3847891 4172267 3940294
14070C940294O5266K1208j85884j62209R3352J1805k91813r8180J96890J80112
$$ 3940294 4005560 4026768 3840884 3678675 3772027 3783832 3492019 3393839 3590729 3770841
14060C770841l18898J53630k14696M25057Q9455l09519n39004L11028k42908J72459
$$ 3770841 3451943 3605573 3390877 3815934 3905389 3595870 3056866 3367894 3124986 3297445
14050C297445K04225k52535O3265m90530K45938o9503K67527K9645m54397J69898
$$ 3297445 3501670 3249135 3312400 2821870 3067808 2998305 3265832 3295477 2841080 3010978
14040C010978O5127j17249r8529J1145J59618k08006l5297q8673M38675l32600
$$ 3010978 3076105 2958856 2860327 2871472 3031090 2823084 2787787 2699114 3137789 2805189
14030B805189j44782Q6525P8329R8081k80390j20455J20900k48499J13672j69522
$$ 2805189 2660407 2746932 2825261 2923342 2642952 2522497 2643397 2394898 2508570 2339048
14020B339048J53545l3594R6482k59673J13336L0397j26339l60026M87423j61328
$$ 2339048 2492593 2458999 2555481 2295808 2409144 2439541 2313202 1953176 2440599 2279271
14010B279271q0688l02301R4620Q8611j04392J91669m19136j43665L88794j41921
$$ 2279271 2198583 1896282 1990902 2079513 1975121 2166790 1747654 1603989 1992783 1850862
14000A850862M3492K45578k65826O476r7250L93324j97541m09471O52930q6135
$$ 1850862 1894354 2139932 1874106 1880582 1783332 2176656 1979115 1569644 2222574 2136439
13990B136439O26194J258924L330511P187492J0831076J0011481q867324j1114339
$$ 2136439 2762633 4021557 7352068 14539560 25370636 35382117 26514793 15400454
13982A5400454o490978k587604j555941o65702n30991n33524q4210l98240J36174
$$ 15400454 8909476 6321872 4765931 4100229 3569238 3035714 2951504 2553264 2689438
13973B689438n799l05418N3924j28426k45758j69561l3640J33151L41985l54659
$$ 2689438 2683639 2378221 2432145 2303719 2057961 1888400 1854760 1987911 2329896 1975237
13963A975237k65768J54094O7865k0643K70522l12930K4275j03348m4268l0313
$$ 1975237 1709469 1863563 1931428 1910785 2181307 1868377 1892652 1789304 1745036 1714723
13953A714723M80795n80114J16019j06980L832O9131J17971m6049J06814o01699
$$ 1714723 2195518 1615404 1731423 1624443 1628275 1697406 1815377 1769328 1876142 1274443
13943A274443L51094k80424j27020K9042J33870j1620m1138J81641L11863m30233
$$ 1274443 1625537 1345113 1218093 1247135 1381005 1369385 1328247 1509888 1821751 1391518
13933A391518P3536k66978J18045J47798j841k20312j77515J0744L28805j10670
$$ 1391518 1465054 1198076 1316121 1463919 1462078 1241766 1064251 1074995 1403800 1293130
13923A293130J99275j29123K62130l06660j41733L3468K01507j41656K65266m62353
$$ 1293130 1492405 1363282 1625412 1318752 1177019 1210487 1411994 1270338 1535604 1073251
13913A073251P9340j12363N59704n58790J90105J06398k64425L3758N62962l20479
$$ 1073251 1152591 1040228 1599932 1041142 1231247 1337645 1073220 1106978 1669940 1349461
13903A349461p4037p2073L9919R8496j19697J6837k22411J61465l53694M00258
$$ 1349461 1275424 1203351 1243270 1341766 1222069 1238906 1016495 1177960 824266 1224524
13893A224524j20832Q4802J3339k03283J82699p9542J0467J53617R974k89241
$$ 1224524 1103692 1188494 1201833 998550 1181249 1101707 1112174 1265791 1275765 986524
13883I86524L162J4298M06332l38129O3547P1067M440n2442j21445J56224k67231
$$ 986524 989686 1003984 1410316 1072187 1135734 1206801 1211241 1158799 1037354 1193578 926347
13872I26347k3691m5314M10437k43m89256L49216l51165j10273M16148j48947
$$ 926347 902656 857342 1267779 1267536 778280 1127496 776331 666058 1082206 933259
13862I33259M94025n57280J9807k7512l35299K11162J4440J49324p7450M38169
$$ 933259 1427284 870004 889811 862299 527000 738162 752602 901926 824476 1262645
13852A262645l14448j67292k86908K78167K61434J30521k73281L5330k05461K15507
$$ 1262645 948197 780905 493997 772164 1033598 1164119 890838 926168 720707 936214
13842I36214j99082J51671L2774j27317J81447j48993j84378J47367O5943K45828
$$ 936214 737132 888803 921577 794260 975707 826714 642336 789703 855646 1101474
13832A101474J3560n35386M32130m26410l1362K29852J14249o7694k60263J18269
$$ 1101474 1115034 579648 1011778 585368 554006 783858 898107 830413 570150 688419
13822F88419J98628j49626j02880J53132j86183L70519l06303r0048M18720k57901
$$ 688419 887047 737421 634541 787673 601490 972009 665706 575658 994378 736477
13812G36477M1906Q1443m4457Q0267j25153J14924k57760j6610K97288C95979
$$ 736477 778383 859826 815369 895636 770483 885407 627647 611037 908325 395979
13801D69915K9455M1668N4271B44110M15429k29867J77094K2367p8713j5034J97830
$$ 469915 499370 541038 595309 244110 659539 429672 606766 629133 550420 535386 733216
13790G33216P597k15286J93758J92500D19722M78079l46062N9124k74678L71607
$$ 733216 740813 525527 719285 911785 419722 897801 551739 610863 336185 707792
13780G07792K51093l64587r1884M09216q7281p1580r6443q5136R1640l17252L41396
$$ 707792 958885 594298 502414 911630 824349 752769 656326 571190 662830 345578 686974
13769F86974L5952j56682l0531Q9018M825j83817J08701j28095P8106K52258j52320
$$ 686974 722926 566244 535713 624731 629556 445739 554440 426345 504451 756709 604389
13758F04389j09112J54581j32648J04577j02602I2860M25796K55477l26943L16029
$$ 604389 495277 649858 517210 621787 519185 92860 518656 774133 447190 763219
13748G63219j99791K0180L6306B29443L77641P3339C34799J64682J91164p6501
$$ 763219 563428 583608 619914 229443 607084 680423 334799 499481 690645 614144
13738F14144k11804J69193o6805K20771A70659K04671O3296R689K21245K8329
$$ 614144 402340 571533 504728 725499 170659 375330 438626 448315 669560 697889
13728F97889J25817l78825J59616j20272J86115C26127M6984p1411J76115J64583
$$ 697889 823706 444881 604497 484225 670340 326127 373111 301700 477815 642398
13718F42398B63508o3130Q78K86793k5861J43126j94303M3160j55163M09366C25767
$$ 642398 263508 200378 201256 488049 462188 605314 411011 454171 299008 708374 325767
13706F69886J00348k07723j57125A35210K0258K20000M85324A68295K55444J55299
$$ 669886 770234 562511 405386 135210 155468 375468 860792 168295 423739 579038
13696E79038k18733J86445j8298J28936R0727A37280M91333K5927B78137J08484
$$ 579038 360305 546750 528452 657388 748115 137280 628613 654540 278137 386621
13686C86621M4812A50861E9852M12993L0937j40948L00534B26868l4426N99073
$$ 386621 431433 150861 59852 472845 503782 362834 663368 226868 192442 791515
13676G91515C11940K76492j08558L304N7884j08194k9159N1041A26874L52058
$$ 791515 311940 588432 479874 483178 541062 432868 403709 454750 126874 478932
13666D78932l7103k6152K36376j41851A39714J37648L00425j19590A01057K88989
$$ 478932 441829 415677 652053 510202 139714 277362 577787 458197 101057 390046
13656C90046j67672M86464C00168J3868A20886N4524H2825O39556l08955J30567
$$ 390046 222374 708838 300168 314036 120886 175410 82825 722381 413426 543993
13646E43993B44104p1753m7355M62051j66624m7528A80017M09034j70718J32560
$$ 543993 244104 172351 124996 587047 420423 372895 180017 589051 418333 550893
13636E50893K3472k13111M43037C65777j50638J35386K1391N6500n9340F7310
$$ 550893 574365 361254 804291 365777 215139 350525 371916 428416 369076 67310
13625D45905B07717j0493K82311a25416C20676p736k8662J86238J61840l1962
$$ 445905 207717 197224 479535 -125416 320676 312940 284278 470516 632356 600394
13615F00394A72239J58228l060A22360L86201j53689L26193k54510j58381L00587
$$ 600394 172239 330467 327407 122360 508561 354872 681065 426555 268174 568761
13605E68761B08509K32655j20845L05338q4065j51778P7182k11427j14124K76892
$$ 568761 208509 441164 320319 625657 541592 389814 466996 255569 141445 418337
13595D18337p0111p7672Q6098j53874L11194j27971R603p4373j52866J50454j27484
$$ 418337 348226 270554 356652 202778 513972 386001 395604 321231 168365 318819 191335
13584A91335g0620C82149A61168o2271M55940B73578K92783j97144K9582p5451
$$ 191335 -70620 382149 161168 98897 554837 273578 566361 369217 398799 323348
13574C23348J26609k00751J13409l723j51537K58160j30698K00717J12372B30006
$$ 323348 449957 249206 362615 358892 207355 465515 334817 535534 647906 230006
13563G6609j9686J98304j01670J30270I7849J54993J07522h334C08146o8640O7811
$$ 76609 56923 255227 153557 283827 97849 252842 360364 -8334 308146 239506 307317
13552C07317M9285J66512B05102m2304J95363J35510k24047e6444B27643q1700
$$ 307317 356602 523114 205102 162798 358161 493671 269624 -56444 227643 145943
13542A45943j3705L06753j38528j15103J95767A00884j6240J62167a38288B99211
$$ 145943 132238 438991 300463 185360 381127 100884 84644 246811 -138288 299211
13531G106M26117r7336D8168K51431f3232E48976C7644M13203A79925K9030B1371
$$ 7106 433223 335887 48168 299599 -63232 548976 37644 450847 179925 208955 21371
13519C69885A58094F2446J19062B783J99174I4018L499K55718A50921R9874b8601
$$ 369885 158094 62446 181508 2783 201957 94018 97517 353235 150921 250795 -28601
13507B44512K22953a02694A59274k4056M2699b38429B58151J956K5394K52037
$$ 244512 467465 -102694 159274 135218 177917 -238429 258151 260107 285501 537538
13497E37538E9806B3129J98265A10522k3454J35149P5506e1930E40039B7658N16959
$$ 537538 59806 23129 221394 110522 87068 222217 297723 -51930 540039 27658 544617
13486E44617k10529o8668p1556J34731j34702k5690J48709j09986H1218k2222
$$ 544617 334088 265420 193864 328595 193893 168203 316912 206926 81218 58996
13476E8996L04212J73678B61525l2109D6947K25195b02267C51272G3173r00R8222
$$ 58996 363208 536886 261525 229416 46947 272142 -202267 351272 73173 72273 170495
13465A70495J10024q8703J05947p232Q6649i2427B79551Q7446N9298H0158J7203
$$ 170495 280519 191816 297763 290531 377180 -92427 279551 366997 426295 80158 97361
13454I7361l3137Q8992O1376M8333M965c5467C01476e752A25797J0133Q1991f3330
$$ 97361 64224 153216 214592 262925 267890 -35467 301476 -5752 125797 135930 217921 -63330
13441A69174Q4954B0782J06458d4184B89239p3586A7401L54354r5467L28476B54110
$$ 169174 254128 20782 127240 -44184 289239 215653 17401 371755 276288 604764 254110
13429B52794J28460g9409A33601k9891M15792k13153A29250J31276a56451A61630
$$ 252794 381254 -79409 133601 103710 519502 306349 129250 260526 -156451 161630
13418B09406i0761B22194j4354R6438i538B14105O4698g9968A06619D9551K50833
$$ 209406 -90761 222194 207840 304278 -9538 214105 278803 -79968 106619 49551 300384
13407C00384e772m36264A38917f612q6049C14821c7803A75447F5155a0008B31053
$$ 300384 -5772 -442036 138917 -6612 -92661 314821 -37803 175447 65155 -10008 231053
13395d2532C45456q0767J03975d8911E6893N3308l8775b4139C17230a4951q4191
$$ -42532 345456 264689 368664 -48911 56893 110201 71426 -24139 317230 -14951 -99142
13384i9142E2487g8774A07998p366O8446C2415K71094j08962G8524M0482A2854
$$ -99142 52487 -78774 107998 100632 169078 32415 303509 194547 78524 119006 12854
13372I4036d2160D86766b8358B20533E6019J07346K12982a1393A06042O6795L6988
$$ 94036 -42160 486766 -28358 220533 56019 163365 376347 -11393 106042 172837 209825
13361B09825E4028J93067D2722a67506A60105a33939B00957G7718K06577K2398
$$ 209825 54028 247095 42722 -167506 160105 -133939 200957 77718 284295 306693
13351C06693D9635P4366h4178B3055K66173A21362L26236J50274j36069k20953
$$ 306693 49635 124001 -84178 23055 289228 121362 447598 597872 461803 240850
13341B40850H4120L4141M43187A44771J47517j33769J9878F3707L73825j26121
$$ 240850 84120 118261 561448 144771 292288 158519 178397 63707 437532 311411
13331C11411A52895p0023C4747Q3577L61458e6353D12825A58152p5905a42837
$$ 311411 152895 82872 34747 118324 479782 -56353 412825 158152 82247 -142837
13320A92326q1049k9177O1964n5158K70653R083A20447L47214j79895R6089A07532
$$ 192326 111277 82100 144064 88906 359559 368642 120447 467661 287766 383855 107532
13308h6019A47365B8598J78997a05919A01545O9050D4238J22189E7218B6719b54654
$$ -86019 147365 28598 207595 -105919 101545 170595 44238 166427 57218 26719 -254654
13296E9286N64071b6492k46429C7484J86236l6093F55b1599j15913a1222A14447
$$ 59286 623357 -26492 -272921 37484 223720 187627 655 -21599 -137512 -11222 114447
13284E605L4527J05391f0852A34881A684M21213A25234K0963d6239d305A06585
$$ 5605 40132 145523 -60852 134881 1684 422897 125234 146197 -46239 -4305 106585
13272A20491N40719B47885m3353B1717K3M49127d0832B69934e2955C17846o3248
$$ 120491 661210 247885 204532 21717 21740 470867 -40832 269934 -52955 317846 254598
13261B54598j09760J33321G9440f2262F1963J22657h3101O648C28808g6693A67793
$$ 254598 144838 278159 79440 -62262 61963 184620 -83101 -76453 328808 -76693 167793
13249B7995R8858a67754F9878K89131i51j24071H7263K37530D8226D849K68173
$$ 27995 126853 -167754 69878 359009 -951 -125022 87263 324793 48226 4849 273022
13238B73022l2862m6381o7034J18836J38456j04698b7373G9107c3268j59296A81177
$$ 273022 240160 193779 126745 245581 384037 279339 -27373 79107 -33268 -192564 181177
13226B33730j05461i9496C2074b95423B49816f961I2869j9946K35210C5015C060
$$ 233730 128269 -99496 32074 -295423 249816 -6961 92869 72923 308133 35015 3060
13214A77482Q1961L9362O4974a67639h0395B63590n9838f5805l76k00213A58420
$$ 177482 259443 298805 363779 -167639 -80395 263590 203752 -65805 -66181 -266394 158420
13202A39688a91145H5652l972N6723J72865K6846j57238J4647b4279G0893a45762
$$ 139688 -191145 85652 81680 138403 311268 338114 180876 195523 -24279 70893 -145762
13190d5865A65863F8433g8828J0263i685k29275c1463A46233j2141O4133F0665
$$ -45865 165863 68433 -78828 -68565 -9685 -238960 -31463 146233 134092 198225 60665
13178b76607J33627D4767J78162J07912c2986A24833a56857F1440a82740d7959
$$ -276607 -142980 44767 222929 330841 -32986 124833 -156857 61440 -182740 -47959
13167C31185l5391a23334B4549K47205j26371c2280B2782c10060h8262p8373A22151
$$ 331185 295794 -123334 24549 271754 145383 -32280 22782 -310060 -88262 -166635 122151
13155D4487M9583c3140G6766A1732J38723a48632A12103R2217a51600C16052a56398
$$ 44487 94070 -33140 76766 11732 150455 -148632 112103 204320 -151600 316052 -156398
13143I7998a17870A08227b69827h8182A30603M3688O1643J13083I598c47218B70690
$$ 97998 -117870 108227 -269827 -88182 130603 174291 235934 349017 9598 -347218 270690
13131a2630A44086E0104c23210A05784k8604C27a91275D02746F3833l1877a73458
$$ -12630 144086 50104 -323210 105784 77180 327 -191275 402746 63833 31956 -173458
13119e1935l1885j8666n4641d6885C75955i5209k27160D7641i4775B0904c5830
$$ -51935 -83820 -102486 -157127 -46885 375955 -95209 -322369 47641 -94775 20904 -35830
13107A18304c16662C21098q479A04944B090d6013k1735E06388a26481b7137A08535
$$ 118304 -316662 321098 312619 104944 2090 -46013 -67748 506388 -126481 -27137 108535
13095b93147A7782J59881J05823P18a50622j46300A276P9213K62038A34802L3062
$$ -293147 17782 177663 283486 284204 -150622 -296922 1276 80489 342527 134802 167864
13084A67864b3330n8216p0841j6435c4938B76392A7614D295L32639A53112J05731
$$ 167864 -23330 -81546 -152387 -168822 -34938 276392 17614 4295 336934 153112 258843
13073B58843g4621l4162A98472n3689e7438F2027J38579A383e80429C01858A39284
$$ 258843 -74621 -108783 198472 144783 -57438 62027 200606 1383 -580429 301858 139284
13061B84725A27148B4179c10884N609e7429o819B51739B7178M2632K53101M73
$$ 284725 127148 24179 -310884 -305275 -57429 -64248 251739 27178 69810 322911 323384
13050C23384H2292e8511A51157o4374a11882C03122A05828D7965J77529g1735
$$ 323384 82292 -58511 151157 86783 -111882 303122 105828 47965 225494 -71735
13039A54018b28481d2659A03938K80625b55400C05006B6197K27052B2517B260
$$ 154018 -228481 -42659 103938 384563 -255400 305006 26197 253249 22517 2260
13028a10019D4787J33442e128A84204g4667k4859c0192B0835K40332q1913m7039
$$ -110019 44787 178229 -5128 184204 -74667 -99526 -30192 20835 261167 179254 132215
13017A32215J1165P2427r3285m0426J41887k9182j2438J85663m7170K2785G1006
$$ 132215 143380 215807 122522 82096 223983 194801 182363 368026 320856 343641 71006
13005A25950E9273a77532A17432c2463j0997A68851J2260M5525a81960B74224
$$ 125950 59273 -177532 117432 -32463 -43460 168851 181111 226636 -181960 274224
12994b20208C75867b86618A54169N0478j5312b9377B6268a65152C81596a17104
$$ -220208 375867 -286618 154169 204647 189335 -29377 26268 -165152 381596 -117104
12983a8904C02720j38564J16123H7724b0127n9612A71511a94564B2555e4408A84263
$$ -18904 302720 164156 280279 87724 -20127 -79739 171511 -194564 22555 -54408 184263
12971E3626J38749g3600j99614d7471B45469A06531a5399B12574b41604J06963
$$ 53626 192375 -73600 -273214 -47471 245469 106531 -15399 212574 -241604 -134641
12961a34641q5518H0843g5273b5288o1845C6810d23407B44288C9417b00635C1942
$$ -134641 -220159 80843 -75273 -25288 -87133 36810 -423407 244288 39417 -200635 31942
12949b24867D9921Q2907c2344J1129A48933B1595L01368F3128f2575B89707a48129
$$ -224867 49921 132828 -32344 -21215 148933 21595 322963 63128 -62575 289707 -148129
12937A46606g7464q9047B07087H2558M0515b04943I3049N9250b62044c0026B19450
$$ 146606 -77464 -166511 207087 82558 123073 -204943 93049 152299 -262044 -30026 219450
12925B51583I6799K47595a50561P0080C77681c2188B73796O6887a74839C4199
$$ 251583 96799 344394 -150561 -80481 377681 -32188 273796 340683 -174839 34199
12914c7200B87174b49404A695P0315N7251L7908D667P1241e64p8673l9830o2844
$$ -37200 287174 -249404 1695 72010 129261 167169 4667 75908 -564 -79237 -119067 -181911
12902a81911C82308P9266A19775n2331O3677d1491A92968g0914I9490R4415G0113
$$ -181911 382308 461574 119775 67444 131121 -41491 192968 -70914 99490 193905 70113
12890h7680H6003J36845a46842C0513K5175J41563f8464A8857b97220C82495F4478
$$ -87680 86003 222848 -146842 30513 55688 197251 -68464 18857 -297220 382495 64478
12878E5483K00028D818b28559A09376J1613h4318D3765J32029a2791e834A7011
$$ 55483 255511 4818 -228559 109376 120989 -84318 43765 175794 -12791 -5834 17011
12866a21772j02162E9353a15212k8715B5496R8330b59341J13055D85299a28399
$$ -121772 -223934 59353 -115212 -143927 25496 123826 -259341 -146286 485299 -128399
12855a71531E2741c0005j73576C616f5308m8944L4472B3308J21592e5812G51J06260
$$ -171531 52741 -30005 -203581 3616 -65308 -114252 -79780 23308 144900 -55812 751 107011
12843A07011c32004a25087D0086c5712C6339b9623o0327k23959M9270A34409P2040
$$ 107011 -332004 -125087 40086 -35712 36339 -29623 -89950 -313909 -264639 134409 206449
12832B06449o2007m9218i3906A15858J46844a07437c6978j5690H8083A9454c15509
$$ 206449 144442 95224 -93906 115858 262702 -107437 -36978 -52668 88083 19454 -315509
12820A15330L4545E3627K03790b84668D4911J57553f7003K3037A00229J53257
$$ 115330 149875 53627 257417 -284668 44911 202464 -67003 -43966 100229 253486
12810B53486F5903J57771K90168A52093b1268k307l8968H7479K0570a02204j14115
$$ 253486 65903 223674 513842 152093 -21268 -23575 -62543 87479 108049 -102204 -216319
12799b16319G4204B5980a11929m3844M6347A15121a45298B0191J4001c5008F3116
$$ -216319 74204 25980 -111929 -155773 -109426 115121 -145298 20191 34192 -35008 63116
12787b20468C8490J46167m0721J40554C2981b94638C0245M9585a13574B95869
$$ -220468 38490 184657 143936 284490 32981 -294638 30245 79830 -113574 295869
12776a97750C83150A07932J97840c3359C6292a51601B2749K49003K2433c91161
$$ -197750 383150 107932 305772 -33359 36292 -151601 22749 271752 294185 -391161
12765F7269O6245m2224J00253c7129j6012B70023P7529e547l60253a62254c7445
$$ 67269 133514 91290 191543 -37129 -53141 270023 347552 -5547 -365800 -162254 -37445
12753a60028B41605b89815I307L636K34146k1236N6778b44438i3021M6335r9593
$$ -160028 241605 -289815 9307 12943 247089 225853 282631 -244438 -93021 -46686 -146279
12742a46279k30955A54667J7476D8495a28250A18097H92K6084g5545A48855a23487
$$ -146279 -377234 154667 172143 48495 -128250 118097 892 26976 -75545 148855 -123487
12730A07307R4424P8433j38347Q7790F0311P0086c1887n0634B18121J73912b22119
$$ 107307 201731 280164 141817 229607 60311 130397 -31887 -82521 218121 392033 -222119
12718a67812k5175j71030B61403a60185D8699a46597G278K51929H1368L7796l9082
$$ -167812 -192987 -364017 261403 -160185 48699 -146597 7278 259207 81368 119164 80082
12707H0082K38061A16638R2690K9038E134M78518A77405J74704j62634b41144
$$ 80082 318143 116638 209328 238366 5134 483652 177405 352109 189475 -241144
12696e3616A46288c7783B89950a90856A41027n1310O1282b6382l84849B34593
$$ -53616 146288 -37783 289950 -190856 141027 89717 150999 -26382 -411231 234593
12685A4319g257F0990c8043l5671B27650c42655A90537B6909d4152m6454k5223
$$ 14319 -7257 60990 -38043 -73714 227650 -342655 190537 26909 -44152 -90606 -115829
12674a15829C65291C8935M77952b17367A69343h7248A18316J94462d592C34738
$$ -115829 365291 38935 516887 -217367 169343 -87248 118316 312778 -4592 334738
12663B307a04896A18408N0992P6669n2781o7368a12132A26801q363q068c8706
$$ 2307 -104896 118408 169400 246069 193288 125920 -112132 126801 118438 110370 -38706
12651A19518K20719i3322B42099D5854J13272c2625G855a17120j05750A73090
$$ 119518 340237 -93322 242099 45854 159126 -32625 7855 -117120 -222870 173090
12640b52059B60608h3071q3171e9043B2029J58827H5777b97450B92572J44222
$$ -252059 260608 -83071 -166242 -59043 22029 180856 85777 -297450 292572 436794
12630D36794G0423j3150R4179J02476a09841C41411A9372J37143J21741b5387
$$ 436794 70423 57273 151452 253928 -109841 341411 19372 156515 278256 -25387
12619b5358k9868F0616a32844K7839b6416E1710b605k21482d7741q7948J8872
$$ -25358 -55226 60616 -132844 -105005 -26416 51710 -2605 -224087 -47741 -135689 -116817
12608a16817F0915b1660C1678b61041A36044b96794A15223K06401E8454A2725
$$ -116817 60915 -21660 31678 -261041 136044 -296794 115223 321624 58454 12725
12597I160J88649a88305A83033J81705m1970q6162Q5159f7920H9371J40854d64440
$$ 9160 197809 -188305 183033 364738 322768 236606 321765 -67920 89371 230225 -464440
12585a1502j18605A27391l3222J34499b4772q5517B10373b4750q511j68885B11036
$$ -11502 -130107 127391 94169 228668 -24772 -110289 210373 -24750 -33261 -202146 211036
12573b85963I2187c95006g5168G9548a30882G0508B6655b23269B24696p3952b1408
$$ -285963 92187 -395006 -75168 79548 -130882 70508 26655 -223269 224696 150744 -21408
12561A34861k0551J35099b78523C964b36709A14444q481D0121h940n0283j56610
$$ 134861 114310 249409 -278523 3964 -236709 114444 105963 40121 -8940 -59223 -215833
12550b15833J04339C8901J1890L5160L57663I6711m6077J9792J18925a38261A64865
$$ -215833 -111494 38901 50791 85951 443614 96711 50634 70426 189351 -138261 164865
12538A91247e0185q5119p0061E9539K05856p3252c18813A84595G7380c7669H6988
$$ 191247 -50185 -135304 -205365 59539 265395 192143 -318813 184595 77380 -37669 86988
12526B12829a20179j05903L0096q6548I6501C0656Q6757C9360Q5493b01812I7149
$$ 212829 -120179 -226082 -195986 -282534 96501 30656 117413 39360 124853 -201812 97149
12514F7572d6179E711J95588H9067a41076A79818G8470P2231b51868f3380B80607
$$ 67572 -46179 5711 201299 89067 -141076 179818 78470 150701 -251868 -63380 280607
12502a0291A4556b2922k03728d6088g962m8830A15027H972L394R8816l6208h4728
$$ -10291 14556 -22922 -226650 -46088 -7962 -56792 115027 8972 12366 111182 74974 -84728
12489a75375n967B09507k6764C6041F58L28066f4095A73045a17879A92744l8211
$$ -175375 -181342 209507 182743 36041 658 328724 -64095 173045 -117879 192744 154533
12478A54533a76325M9419A85407j3106j9262K6710a51674A62967c70859G8431
$$ 154533 -176325 -126906 185407 172301 153039 179749 -151674 162967 -370859 78431
12467a8179D5863J31605G1149J1244b76895H2321c93125e7384j22996c5656a6032
$$ -18179 45863 177468 71149 82393 -276895 82321 -393125 -57384 -180380 -35656 -16032
12455A32900M3667b216A43056J9358b33155B92856b95589a36120k7647A08645
$$ 132900 176567 -2216 143056 162414 -233155 292856 -295589 -136120 -163767 108645
12444a46184I7922a12547j55714J32309e3613F5738b30698D8383g3524A15515
$$ -146184 97922 -112547 -268261 -135952 -53613 65738 -230698 48383 -73524 115515
12433A49693i4548C8173P6707a67438A16652a42156O9351a8950E8546J1265a08011
$$ 149693 -94548 38173 114880 -167438 116652 -142156 -72805 -18950 58546 69811 -108011
12421c4676k59457R7660f1241k77081e680j55119B54474H2472B1750a38337A53922
$$ -34676 -294133 -196473 -61241 -338322 -5680 -160799 254474 82472 21750 -138337 153922
12409a34931j94514B44805b0431j33627P5436d664k47580R4403m4079A09143R8420
$$ -134931 -329445 244805 -20431 -154058 -78622 -4664 -252244 -157841 -201920 109143 207563
12398B07563H0297o560c24848I4686c09515J53382H7541J68468A11440C5318K82307
$$ 207563 80297 73737 -324848 94686 -309515 -156133 87541 256009 111440 35318 317625
12387C17625C8001b07867D04179b21898a2665k51383J20774j38358h0418J4351
$$ 317625 38001 -207867 404179 -221898 -12665 -264048 -143274 -281632 -80418 -66067
12377f6067F4106B0813a001j5672A9400a73503j38474f6249k19441B25422N3006
$$ -66067 64106 20813 -1001 -16673 19400 -173503 -311977 -66249 -285690 225422 278428
12366B78428r2221b03855B40037d0708k14078B93627e7643p8143c2467A49566
$$ 278428 186207 -203855 240037 -40708 -254786 293627 -57643 -135786 -32467 149566
12355c38861h3023m1892b5519l5965C58346A8765a44257E3042P3594a10318E090
$$ -338861 -83023 -124915 -25519 -61484 358346 18765 -144257 53042 126636 -110318 5090
12343C7769O0272A338b861B85640A16873j8001J37471h8650j3763A927g8283I4747
$$ 37769 98041 1338 -2861 285640 116873 98872 236343 -88650 -102413 1927 -78283 94747
12330A31387a8553q5805m0792c8642l5960I0958b3883B99229c46104e2581F932
$$ 131387 -18553 -104358 -145150 -38642 -74602 90958 -23883 299229 -346104 -52581 6932
12318c2284G6042c5035A0978a28766B60754A19473a63678e3964j59555C66540
$$ -32284 76042 -35035 10978 -128766 260754 119473 -163678 -53964 -213519 366540
12307e9707K6720G7941J04009e1482k80537G9499K37200E2673J4270a26204j39556
$$ -59707 -32987 77941 181950 -51482 -332019 79499 316699 52673 66943 -126204 -265760
12296b65760B4566J56058e1385B4237M9457b9098n581J6759j93254J7253A998
$$ -265760 24566 180624 -51385 24237 73694 -29098 -34679 -17920 -211174 -193921 1998
12284B7182K63389c14700a42039A34403K06736h4515l0576A08668a87977B30750
$$ 27182 290571 -314700 -142039 134403 341139 -84515 -115091 108668 -187977 230750
12273C31837q6769e6161j15946C27222F534b28479C2722P8321l9476h4751G6994
$$ 331837 245068 -56161 -172107 327222 6534 -228479 32722 111043 71567 -84751 76994
12261a64888B14059a3439A42334h6404A40046l3900J26638H0769i3466B00189
$$ -164888 214059 -13439 142334 -86404 140046 106146 232784 80769 -93466 200189
12250a14548H5444b42132C91179A49168c5931B0093r165J24963a17047F4749K26882
$$ -114548 85444 -242132 391179 149168 -35931 20093 10928 135891 -117047 64749 291631
12239B91631C8057K31658a38897B51040a25464C06825n3464l0861D2504a30644
$$ 291631 38057 269715 -138897 251040 -125464 306825 253361 222500 42504 -130644
12228A41314a9236A19919J46691J60836j60596J44164A63158b23177a0717B46829
$$ 141314 -19236 119919 266610 427446 266850 411014 163158 -223177 -10717 246829
12217B91114p4442N5678N5650c8431B24689P7195j00620O2522e0705B51893n8835
$$ 291114 216672 272350 328000 -38431 224689 301884 201264 263786 -50705 251893 193058
12206A93058A2027f109E8991L95507j87268N3454A39922a11583H7439h634E7523
$$ 193058 12027 -6109 58991 454498 267230 320684 139922 -111583 87439 -8634 57523
12194a708A64049K0201P2H221i736E788J83508b10615A94567n8128J1135J95455
$$ -1708 164049 184250 184322 8221 -9736 5788 189296 -210615 194567 136439 147574 343029
12182C43029B816K69428a25134B62446A07726h2070a8237r5932B5221b3506A96013
$$ 343029 2816 272244 -125134 262446 107726 -82070 -18237 -114169 25221 -23506 196013
12170B46487j1090C7938g3777j78079J08558B84595b1944C41819a23818e6433
$$ 246487 235397 37938 -73777 -251856 -143298 284595 -21944 341819 -123818 -56433
12159A41813a60301B53941G440J83129a20721k84856B82232f7201k4733l1602
$$ 141813 -160301 253941 7440 190569 -120721 -405577 282232 -67201 -91934 -123536
12149a23536D3981K7805r285b6066B41021a99648g9369l709J5701C6005P1531
$$ -123536 43981 71786 62501 -26066 241021 -199648 -79369 -83078 -67377 36005 107536
12138A07536a41083M8821A3199a03481b2624n4426A31420L4248a61777A29481
$$ 107536 -141083 -92262 13199 -103481 -22624 -77050 131420 165668 -161777 129481
12127c68877A53617C3592Q0162a85534g5296D253b49742E3184N2617J30205E0690
$$ -368877 153617 33592 113754 -185534 -75296 4253 -249742 53184 105801 236006 50690
12115d4079A99793A5120J54222a11757k07037i5316A45373c2563A61280D0431
$$ -44079 199793 15120 169342 -111757 -318794 -95316 145373 -32563 161280 40431
12104B00781J5261b03171d1229A43980J01614b3508o0260A5080J85237b67489
$$ 200781 216042 -203171 -41229 143980 245594 -23508 -83768 15080 200317 -267489
12093g4063j71630p7847b164B5234J09733C8629b00787l3702A65827J12783H00
$$ -74063 -245693 -323540 -2164 25234 134967 38629 -200787 -234489 165827 278610 800
12081A1840J39555A494b31033R2223E431c33865J34994A44756J82006C4980b34827
$$ 11840 151395 1494 -231033 -138810 5431 -333865 -198871 144756 326762 34980 -234827
12069a95885A52757B0878P254j3176K21671e4516A97156G0879a89909J909k5627
$$ -195885 152757 20878 28132 14956 236627 -54516 197156 70879 -189909 -188000 -213627
12058b13627l5936A64853g0166A81906I352J94807O42610K19652k69470a6930
$$ -213627 -249563 164853 -70166 181906 9352 204159 846769 1066421 796951 -16930
12047g663k57390C1657O8790b78747A18377b95580A3775K92036j43730H0692C4551
$$ -7663 -265053 31657 100447 -278747 118377 -295580 13775 305811 162081 80692 34551
12035B75659c1982E406J37565H344b09819C64379a86992B3051a15297A00295e6071
$$ 275659 -31982 5406 142971 8344 -209819 364379 -186992 23051 -115297 100295 -56071
12023A73668l1910f5805J3372A141a84343a2069o4873c5186F2830O1426b6525
$$ 173668 141758 -65805 -52433 1141 -184343 -12069 -76942 -35186 62830 124256 -26525
12011B84864K2409D3473g2745l1228k3997J4836A23070C4750b98353N4867P5903
$$ 284864 307273 43473 -72745 -103973 -127970 -113134 123070 34750 -298353 -243486 -167583
12000a67583C8936i0282M3808A45855l67b01440d9393B04594c37117a54572G167
$$ -167583 38936 -90282 -46474 145855 145488 -201440 -49393 204594 -337117 -154572 7167
11988d4775F9970a91356j18299P8287F3610b26772A76971o8151l8025J76426a48561
$$ -44775 69970 -191356 -309655 -231368 63610 -226772 176971 108820 70795 247221 -148561
11976d86919J40354E2494g5340L3548j74233J03553C07417b06498k3029h0019
$$ -486919 -346565 52494 -75340 -41792 -216025 -112472 307417 -206498 -229527 -80019
11965a89537A31008L8932l1663a87858C5625J45123a07093A79591B5324a61277
$$ -189537 131008 169940 138277 -187858 35625 180748 -107093 179591 25324 -161277
11954d36195d3470o6972E0167a67493D506J75453d7537o674H1060b44780A54306
$$ -436195 -43470 -110442 50167 -167493 4506 179959 -47537 -54211 81060 -244780 154306
11942F6531L94254b87696i6873k19520B77943b91626N4501n1096J8888a19840
$$ 66531 460785 -287696 -96873 -316393 277943 -291626 -237125 -288221 -269333 -119840
11931C7489J55208a74052g3003p4671B08125p9199K57487a61417A11075a90242
$$ 37489 192697 -174052 -73003 -147674 208125 128926 386413 -161417 111075 -190242
11920e4494R899A77370a68614b6710j35711A67426M491J01294A636L5468J48971
$$ -54494 -44595 177370 -168614 -26710 -162421 167426 171917 273211 1636 37104 186075
11909A86075a58766B18448d61173b02717N9631A05195L42236a77986k9498F141
$$ 186075 -158766 218448 -461173 -202717 -143086 105195 447431 -177986 -207484 6141
11898b66356A86259d48619f191C27552H5123N7754a14005I5996j0251J34067b20227
$$ -266356 186259 -448619 -6191 327552 85123 142877 -114005 95996 85745 219812 -220227
11886g9295j82362i9185L2392j19278C97517A8563J34305B0011a75119F8488d67527
$$ -79295 -261657 -99185 -66793 -186071 397517 18563 152868 20011 -175119 68488 -467527
11874A64027B761d05676g1448j6537E1272J33672a78209b8620m42105a68666F693
$$ 164027 2761 -405676 -71448 -87985 51272 184944 -178209 -28620 -470725 -168666 6693
11862E3979L03929b26589B99310I2768a87429l0443A30227N5296J5221c13225
$$ 53979 357908 -226589 299310 92768 -187429 -217872 130227 185523 200744 -313225
11851C0391b2813j30322R047A35760k3113b12990Q6559d4916d105A33318k2878
$$ 30391 -22813 -153135 -144088 135760 112647 -212990 -126431 -44916 -4105 133318 110440
11840A10440a77147J7334P5142B14628c93254J82236f8125k08286Q2686j9687
$$ 110440 -177147 -159813 -84671 214628 -393254 -211018 -68125 -276411 -193725 -213412
11830b13412B4930O606h4946A27437h7188j40090B339N0861f1905m5429j86494
$$ -213412 24930 31536 -84946 127437 -87188 -227278 2339 53200 -61905 -107334 -293828
11819b93828c1774k26030k35319B43763n9464b41302A34702h4037A588a42267
$$ -293828 -31774 -257804 -493123 243763 184299 -241302 134702 -84037 1588 -142267
11808C62994F0286M620a06558B01873a81730o8037N9723e0192j37604N6167d0046
$$ 362994 60286 64906 -106558 201873 -181730 -249767 -190044 -50192 -187796 -131629 -40046
11796D6782L6063d20904A41881F2089P5977a01638B85314e7101c59l42191a7569
$$ 46782 82845 -420904 141881 62089 138066 -101638 285314 -57101 -359 -342550 -17569
11784d1821A14379J66154q8630L4816J43997j49783I1423b19104F6278d9833H2750
$$ -41821 114379 280533 191903 226719 370716 220933 91423 -219104 66278 -49833 82750
11772B34467g9647H4306d14171a03058m7346j04392A41905b41192A15748L1946
$$ 234467 -79647 84306 -414171 -103058 -150404 -254796 141905 -241192 115748 147694
11762A47694a80142C79655F105J30575E4006j0758K42814H253b27924d4845j43893
$$ 147694 -180142 379655 6105 136680 54006 43248 286062 8253 -227924 -44845 -188738
11751a88738A83333b02492O1919K9584A41484b16801B29724i3173A25450K9023
$$ -188738 183333 -202492 -140573 -110989 141484 -216801 229724 -93173 125450 154473
11741A54473J04268G4880a48190E9621b03907A38472k6918P0651k7367f5516j53293
$$ 154473 258741 74880 -148190 59621 -203907 138472 111554 182205 154838 -65516 -218809
11730b18809I703N02158a1941B6683J03760a83717A7098J39912e2479J5429l07822
$$ -218809 9703 511861 -11941 26683 130443 -183717 17098 157010 -52479 -37050 -344872
11719c44872E9652K8130a61001A18119a43583E07117e8122G5430c06640C529a9799
$$ -344872 59652 87782 -161001 118119 -143583 507117 -58122 75430 -306640 3529 -19799
11707A21896b16008C14988m1596p3684i2346L4832k0061C66601H1743a17577B31587
$$ 121896 -216008 314988 273392 199708 -92346 -57514 -77575 366601 81743 -117577 231587
11695A6636J62712a34657A57977m2818d9192a7412j7418A7744K73311j08533H5123
$$ 16636 179348 -134657 157977 115159 -49192 -17412 -34830 17744 291055 182522 85123
11683B49066C3997K40063a1515C9642b11692A49680J79707C9812K13374n5445
$$ 249066 33997 274060 -11515 39642 -211692 149680 329387 39812 253186 197741
11673A97741N0678A12789c8124G8208a3004B07560d0031E8485J33114J86240A81440
$$ 197741 248419 112789 -38124 78208 -13004 207560 -40031 58485 191599 377839 181440
11661B17141D1626j1928c18814a14128A1732J74011n3474Q8238a53571k7574B14319
$$ 217141 41626 29698 -318814 -114128 11732 185743 132269 220507 -153571 -181145 214319
11649D1555b41464a9257A4012a19078M6254B61471C2821g0188I892M2323b44899
$$ 41555 -241464 -19257 14012 -119078 -72824 261471 32821 -70188 9892 52215 -244899
11637A34271b67780J16343g306A73904b43555f6074B23682F2309a60843P0126
$$ 134271 -267780 -151437 -7306 173904 -243555 -66074 223682 62309 -160843 -90717
11627i0717A53755a47970A85665g9295g800j78437B59584F5496K2836L4159K0059
$$ -90717 153755 -147970 185665 -79295 -7800 -186237 259584 65496 88332 122491 142550
11616A42550l7345O3229K59c72048J43949B09975P2917j35312G0488M0359K8308
$$ 142550 105205 168434 168693 -372048 -228099 209975 282892 147580 70488 110847 139155
11605A39155c6010q6003A90309D2938J13218h4527j71801h3416b2893G5100J46255
$$ 139155 -36010 -122013 190309 42938 156156 -84527 -256328 -83416 -22893 75100 221355
11594B21355H458L19561E2195b62097D1531P6352b62312B12486a37217C54886
$$ 221355 8458 328019 52195 -262097 41531 117883 -262312 212486 -137217 354886
11583C5500J22329o3391P7822b84766C79651a81473E7328K99724b0441A88279
$$ 35500 157829 94438 172260 -284766 379651 -181473 57328 357052 -20441 188279
11572a47129f8089A51091a06479A80881C0860g2322H5583h1528D7874b05045D49060
$$ -147129 -68089 151091 -106479 180881 30860 -72322 85583 -81528 47874 -205045 449060
11560g565D3997J66836a95757e041j50055A24402k9191A5671b183G2673k7896
$$ -7565 43997 210833 -195757 -5041 -155096 124402 95211 15671 -2183 72673 44777
11549D4777K51020J428A43849k2122M9184K39269D2501J70670c16049B15852r8375
$$ 44777 295797 297225 143849 121727 170911 410180 42501 213171 -316049 215852 117477
11538A17477a6805I866K62549B9137J85234K08299H8648A2040M9134O2701f2384
$$ 117477 -16805 9866 272415 29137 214371 422670 88648 12040 61174 123875 -62384
11526A32118i5250n4342A8300K21467d8714A67729p6457h6322D55443e7413A80122
$$ 132118 -95250 -149592 18300 239767 -48714 167729 91272 -86322 455443 -57413 180122
11514G6128N1960L91119k48797a19607c9501D2462a31487D13021a17400B9241
$$ 76128 128088 519207 270410 -119607 -39501 42462 -131487 413021 -117400 29241
11503A94321g5839j25217F9477J27011d38734D15655A64353p9669M10243A45827
$$ 194321 -75839 -201056 69477 196488 -438734 415655 164353 84684 494927 145827
11492d6210k30244H9177R6245F369a91076A53450K27703H0085i7006j0937B91852
$$ -46210 -276454 89177 185422 6369 -191076 153450 381153 80085 -97006 -107943 291852
11480a99010A91494f7236B65570h3547j31925D03171j3559H0375K76421H1240
$$ -199010 191494 -67236 265570 -83547 -215472 403171 389612 80375 356796 81240
11469C53209A06893J29124C909J00622L00576I1387J59450a93071E02103E9779
$$ 353209 106893 236017 3909 104531 405107 91387 250837 -193071 502103 59779
11458h172I7527q296P8339F4943b21385A34893D3843b90645A10473J2412L5750
$$ -8172 97527 89231 167570 64943 -221385 134893 43843 -290645 110473 122885 158635
11447A58635K11435J7263c7910G6642K15852A42051J07204A7037b32972a0329
$$ 158635 370070 387333 -37910 76642 292494 142051 249255 17037 -232972 -10329
11436d4146A77631f837H425h6264C05451D8007c30732C85759j89470a07236A11053
$$ -44146 177631 -6837 8425 -86264 305451 48007 -330732 385759 196289 -107236 111053
11424g3555o5946B2137c4530j43715D1379O8123M9337a83021N8443A06262C5257
$$ -73555 -139501 22137 -34530 -178245 41379 109502 158839 -183021 -124578 106262 35257
11412a14533r0638m6899m7315C9633a1868A44314F608a87292m3191A27251J78968
$$ -114533 -205171 -252070 -299385 39633 -11868 144314 6608 -187292 -230483 127251 306219
11401C06219G1689K99752E4155i5196n2857k47713F7514M251L5337n2377a63482
$$ 306219 71689 371441 54155 -95196 -148053 -395766 67514 71765 107102 54725 -163482
11389c6682I111Q1709L2940A6684J43603D1435J91898F6611e018I6334i7038G036
$$ -36682 9111 90820 123760 16684 160287 41435 233333 66611 -5018 96334 -97038 7036
11376f5320A82794f8913B08045g4844C54612A04455J93696b03691R6522j56547
$$ -65320 182794 -68913 208045 -74844 354612 104455 298151 -203691 -107169 -263716
11366b63716G2058b93911B04299b97275A22401i0449L3009A7291a90793K966B08961
$$ -263716 72058 -293911 204299 -297275 122401 -90449 -57440 17291 -190793 -187827 208961
11354E4254b91218A0238N151J39346c5537A3703J92830a4999k26768J1971M502
$$ 54254 -291218 10238 15389 154735 -35537 13703 206533 -14999 -241767 -229796 -225294
11343b25294B58890j18623b54502A59014c145k8242J228F8302c90868a79004G0793
$$ -225294 258890 140267 -254502 159014 -3145 -31387 -30159 68302 -390868 -179004 70793
11331D267a86890h986A52378b62608a24305I8646R4916G0669A6860d3773j29223
$$ 4267 -186890 -8986 152378 -262608 -124305 98646 193562 70669 16860 -43773 -172996
11320a72996F0373j4824k2195J38646a7638m88186D434c29903J14848B23921E7257
$$ -172996 60373 45549 23354 162000 -17638 -505824 4434 -329903 -215055 223921 57257
11308B88085A2795L6787f4523j73164L9825L7075C324e57564e885j03670E6888
$$ 288085 12795 49582 -64523 -237687 -197862 -160787 3324 -557564 -5885 -109555 56888
11296a44632d5842A84786K6426h7020k6282I801c44592J11983A40293b6817D1421
$$ -144632 -45842 184786 211212 -87020 -113302 9801 -344592 -232609 140293 -26817 41421
11284B04670C7052f355A27430a2812r5120J5782N540j41829a08124C73030j54648
$$ 204670 37052 -6355 127430 -12812 -107932 -92150 -86610 -228439 -108124 373030 218382
11273B18382a5840B5492c05060B94485l4156n4581B1851Q5683a48708b5988k7577
$$ 218382 -15840 25492 -305060 294485 260329 205748 21851 107534 -148708 -25988 -53565
11262e3565j50979c9041o7410j54412J26835h865F3204J66654c65234A2805K0579
$$ -53565 -204544 -39041 -106451 -260863 -134028 -8865 63204 229858 -365234 12805 33384
11251C3384c13796a07684r5063b3856A50635h5669A48287l7721a45253G1139R5836
$$ 33384 -313796 -107684 -202747 -23856 150635 -85669 148287 110566 -145253 71139 166975
11240A66975n0478m2102K38007b66741a8569q8986A92151C0167e6961k5490B01357
$$ 166975 116497 74395 312402 -266741 -18569 -107555 192151 30167 -56961 -82451 201357
11228b4970I4825d46714e5493B54025a44349p8043D9674L3868g6379j23439h7657
$$ -24970 94825 -446714 -55493 254025 -144349 -222392 49674 83542 -76379 -199818 -87657
11216a15554j67L8179c3418g148A88438a23920A77144d7673C6847J18050h7795
$$ -115554 -115721 -77542 -33418 -7148 188438 -123920 177144 -47673 36847 154897 -87795
11204c56997J29627C2388a292j00809C09433c7006A78446K14307G311b383k24371
$$ -356997 -227370 32388 -1292 -102101 309433 -37006 178446 392753 7311 -2383 -226754
11193b26754a4694q8852G6314k7951a6254k33544f6053j84974D80870B0874M6172
$$ -226754 -14694 -103546 76314 48363 -16254 -249798 -66053 -251027 480870 20874 67046
11182F7046b1514B9397J16327a00947h166A29434I013K58940r3080j2783o7028
$$ 67046 -21514 29397 145724 -100947 -8166 129434 9013 267953 174873 162090 95062
11171I5062c02497C8730a9362l40j3417q6043j69031a26410J0787K7471a1787
$$ 95062 -302497 38730 -19362 -19702 -33119 -119162 -288193 -126410 -115623 -88152 -11787
11159A84829p3490c17705j23693C9998b49782C13046A31967i5145d6040j17530
$$ 184829 111339 -317705 -441398 39998 -249782 313046 131967 -95145 -46040 -163570
11149a63570j98573a39461o1062i7287H8341j0198i0137d3101F5324B2837f4496
$$ -163570 -362143 -139461 -200523 -97287 88341 78143 -90137 -43101 65324 22837 -64496
11137a2097j16484j37010g6676J7183m3982C01271F8959e41614a11678j57053
$$ -12097 -128581 -265591 -76676 -59493 -103475 301271 68959 -541614 -111678 -268731
11127b68731D2427c02570A51783c43390B40136c09142J48459A68274K4936c1994
$$ -268731 42427 -302570 151783 -343390 240136 -309142 -160683 168274 193210 -31994
11116D4485R6457a13256I144R0519P8274f8466D0969d1578A0068J37142J22053
$$ 44485 140942 -113256 9144 99663 177937 -68466 40969 -41578 10068 147210 269263
11105B69263h6513A27842O4246D3283L994i9466B58120k1586j13036K31861D0813
$$ 269263 -86513 127842 192088 43283 47277 -99466 258120 236534 123498 355359 40813
11093C43972A12760b7168B00595F2444d134q1910A82232J13628O9206d9608H6481
$$ 343972 112760 -27168 200595 62444 -4134 -86044 182232 295860 365066 -49608 86481
11081C42751e155B11547a49333B0866L67630j8421I0719C87O7022K45635E7841
$$ 342751 -5155 211547 -149333 20866 388496 370075 90719 387 67409 313044 57841
11069C83888L4392j36277J84904j20653L74162B68277R9752L09771K9011k23778
$$ 383888 418280 282003 466907 346254 720416 268277 368029 677800 706811 483033
11059D83033j05740K98539O9795j07697j86128K51903j71543j84221K99013p8963
$$ 483033 377293 675832 745627 637930 451802 703705 532162 347941 646954 567991
11049E67991j13582l795J21490R1126j24398o1095K15287r9463P2563j55968J08590
$$ 567991 454409 450614 572104 663230 538832 477737 693024 593561 666124 510156 618746
11038F18746J55145J42323r1172j27320k935K5098B81248M78848n3026j72614
$$ 618746 773891 916214 825042 697722 694787 719885 281248 760096 707070 534456
11028E34456J7900j37072K27702k07382K56005P4197j22665A76819L25119K79533
$$ 534456 552356 415284 642986 435604 691609 765806 643141 176819 501938 781471
11018G81471O3144j33604q4176L7776o4062j40034J65936M3234j20917R2144K07437
$$ 781471 844615 711011 626835 664611 600549 460515 626451 669685 548768 640912 848349
11007H48349J06337j29156k52488O4492L4195k0010k62816N21468j95592n1168
$$ 848349 954686 825530 573042 637534 671729 651719 388903 910371 714779 663611
10997F63611J85677k76243k1311j09927J73807j78259J76506J09248j92237L63202
$$ 663611 849288 573045 551734 441807 615614 437355 613861 723109 530872 894074
10987H94074j83053K17030L38028k20824n0230L9607m4042q3099L85278P8474
$$ 894074 711021 928051 1266079 1045255 995025 1034632 990590 907491 1292769 1371243
10977A371243K35071o6669O64981J94902l14552M07371J89994j53511J02290j68865
$$ 1371243 1606314 1539645 2204626 2399528 2084976 2492347 2682341 2528830 2631120 2462255
10967B462255J05124k10019m14552j80580J00729j18517j18894K22648j17827
$$ 2462255 2567379 2357360 1942808 1762228 1862957 1744440 1625546 1848194 1730367
10958A730367j28634K86963N4553j28017j69557l23298q3668n5908n05445J1637
$$ 1730367 1601733 1888696 1943249 1815232 1645675 1322377 1238709 1182801 677356 688993
10948F88993R1160C47283K08385A11452M11385k15687A00358O8505h6582A39692
$$ 688993 780153 347283 555668 111452 522837 307150 100358 168863 -86582 139692
10937B07554m9586O7461p896h3791C10851a97644A27118a78605B29603b4171d250
$$ 207554 157968 225429 217533 -83791 310851 -197644 127118 -178605 229603 -24171 -4250
10925a05987A26138b83478I5181M3834b0703C7495L140e1295o4757l815M7904
$$ -105987 126138 -283478 95181 139015 -20703 37495 40635 -51295 -116052 -119867 -71963
10914g1963A20388D981K40773J11287a61612A88883a84430C22549b548j43778
$$ -71963 120388 4981 245754 357041 -161612 188883 -184430 322549 -2548 -146326
10904a46326A30234n2486P2710L57537f7304G7341M9865b43384k39602d5203A13786
$$ -146326 130234 77748 150458 507995 -67304 77341 127206 -243384 -482986 -45203 113786
10892g6244E7661f4221j17540A8753R2280N8063C0527J91508o7802E1809a4336
$$ -76244 57661 -64221 -181761 18753 111033 169096 30527 222035 154233 51809 -14336
10880C58020A26187b43649B56437m1690g3843H087K06406f4544q2078A1287L44981
$$ 358020 126187 -243649 256437 214747 -73843 8087 214493 -64544 -146622 11287 356268
10869C56268j22016k4059F6388a30650A81239J1116I5646J99163r1237o5927c7030
$$ 356268 234252 210193 66388 -130650 181239 192355 95646 294809 203572 137645 -37030
10857b37688F1393P2315C6082K4918A8167i5056A97253e76130a0588B66795A01310
$$ -237688 61393 133708 36082 61000 18167 -95056 197253 -576130 -10588 266795 101310
10845B33854E3994J85148a58924A71326c791n27060h4605J8541A51139b06019
$$ 233854 53994 239142 -158924 171326 -3791 -530851 -84605 -66064 151139 -206019
10834b86131J14995K9371c520j79092J2181C5229c6901l12295C6463L5138N6486
$$ -286131 -171136 -141765 -3520 -182612 -170431 35229 -36901 -349196 36463 71601 128087
10823A28087j9346O0170L7977C4847a33880b3050k00848I6462a87537O1755m1931
$$ 128087 108741 168911 206888 34847 -133880 -23050 -223898 96462 -187537 -125782 -167713
10812a67713G5313L4276J18884b69611P2240q4640A44125J11906F2280h8705d439
$$ -167713 75313 109589 228473 -269611 -197371 -282011 144125 256031 62280 -88705 -4439
10800f5884K9832j40572O5440l2591r0345G4136K01643b34760D09464g2862q2631
$$ -65884 -36052 -176624 -111184 -143775 -234120 74136 275779 -234760 409464 -72862 -155493
10789a55493k00820A8878R3874D6485K2087k6778h4495k03017a10397a5737k06388
$$ -155493 -356313 18878 112752 46485 68572 41794 -84495 -287512 -110397 -15737 -222125
10778b22125A99919D7811a57900j35664d9089O699k52517A03364B270J34233J1610
$$ -222125 199919 47811 -157900 -293564 -49089 -42390 -294907 103364 2270 136503 148113
10767A48113E1247J4997b11376H0228a78053L8112A88952c240j9477l89855J36952
$$ 148113 51247 66244 -211376 80228 -178053 -139941 188952 -3240 -22717 -412572 -275620
10756b75620d5419B3442d144j66397M3459D4610L5952o433f5308N896o2745c8322
$$ -275620 -45419 23442 -4144 -170541 -127082 44610 80562 74129 -65308 -59412 -122157 -38322
10743I4688b09680A5886c5205A521b28752D6487A6848c39079H1800a86567G6769
$$ 94688 -209680 15886 -35205 1521 -228752 46487 16848 -339079 81800 -186567 76769
10731a85320k48696a24996k30331A28737R9862a13999K9683C6566J39736D517
$$ -185320 -434016 -124996 -355327 128737 228599 -113999 -84316 36566 176302 4517
10720e7245j79957L1355r756j986J4888r4449a8560j9337n4506A09104f3782i770
$$ -57245 -237202 -205847 -215603 -217589 -202701 -297150 -18560 -37897 -92403 109104 -63782 -9770
10707a73137A3870a40334A54493b03904b3867B10111b9343a4095j54665A81226
$$ -173137 13870 -140334 154493 -203904 -23867 210111 -29343 -14095 -168760 181226
10696b50146g3365e435C3596e15551i878C8295b47463F2462p741J59581b30771
$$ -250146 -73365 -5435 33596 -515551 -9878 38295 -247463 62462 54721 214302 -230771
10684f6381A17278D901c22802B673a39089j15484f3022l54046A42137a18331q041
$$ -66381 117278 4901 -322802 2673 -139089 -254573 -63022 -417068 142137 -118331 -126372
10673a26372a1453A27375J2444A3560a83475A0341a57964A96053B7617a01182
$$ -126372 -11453 127375 139819 13560 -183475 10341 -157964 196053 27617 -101182
10662b0012j52128Q5091k5442k38531C24891b35452A86503b40559R1262A57923
$$ -20012 -172140 -87049 -112491 -351022 324891 -235452 186503 -240559 -149297 157923
10651A62611C6442b75035M6737b3897A55710a8442c330m1621I6208m0946a45655
$$ 162611 36442 -275035 -228298 -23897 155710 -18442 -3330 -44951 96208 55262 -145655
10639A05028b05887b1725j72615j9687b8033k71708K3479C8263b53447B95424
$$ 105028 -205887 -21725 -194340 -214027 -28033 -299741 -276262 38263 -253447 295424
10628d507F7669J93573i9920l85795H2659c33409a49906N9764j99000C19069a68502
$$ -4507 67669 261242 -99920 -485715 82659 -333409 -149906 -90142 -289142 319069 -168502
10616a80785g8072j304k23681h9940B57106a78588n7176g0599M093j048k06623
$$ -180785 -78072 -79376 -303057 -89940 257106 -178588 -235764 -70599 -66506 -67554 -274177
10605b74177A98186A6375a137m3651j04819f9584i288j39755q5436A61177b38588
$$ -274177 198186 16375 -1137 -44788 -149607 -69584 -9288 -149043 -234479 161177 -238588
10593C5926b16379F8379c44124R7503A52853a99094F0961a23665q9102g5752a9050
$$ 35926 -216379 68379 -344124 -246621 152853 -199094 60961 -123665 -212767 -75752 -19050
10581d74938C0039b41610A79318C3835c8716n38684A92297o7922J09408b90898
$$ -474938 30039 -241610 179318 33835 -38716 -577400 192297 124375 233783 -290898
10570d88536f4662A34628A2286a1495l00868E1791B4134a41134f3522Q46J3882
$$ -488536 -64662 134628 12286 -11495 -312363 51791 24134 -141134 -63522 -62676 -48794
10559d8794C0331a58172M7965A39496L8268a04823l2526j43413R3679C04823a05009
$$ -48794 30331 -158172 -110207 139496 177764 -104823 -137349 -280762 -187083 304823 -105009
10547A88142p52l1103K53489f9876l01654N0456c1865H8289a35113j55882I2958
$$ 188142 187390 156287 409776 -69876 -371530 -321074 -31865 88289 -135113 -290995 92958
10535i4004j97121A06169h5024n5404C6276e442n6955C28637d0548A27643h7372
$$ -94004 -291125 106169 -85024 -140428 36276 -5442 -62397 328637 -40548 127643 -87372
10523a40846B02884a09034N0022j6159r9178h0689D5730L6084q908J67202a93974
$$ -140846 202884 -109034 -59012 -75171 -174349 -80689 45730 81814 72906 240108 -193974
10511A7049K24686G730c8081E0174Q4322M9621a48763j14748g1122A00139e5742
$$ 17049 241735 7730 -38081 50174 134496 184117 -148763 -263511 -71122 100139 -55742
10499D132a44188A28415b20309A9050a97582B8624J75716F4331L57791e27559
$$ 4132 -144188 128415 -220309 19050 -197582 28624 204340 64331 422122 -527559
10488A23615k9803a93759A45674J12428P3333l711K67075m670j12065B35950J16827
$$ 123615 93812 -193759 145674 258102 331435 327724 594799 590129 478064 235950 352777
10477C52777H840b46225C21464q2557c17992B6491c2479A63553n1005i4238C0958
$$ 352777 8840 -246225 321464 238907 -317992 26491 -32479 163553 112548 -94238 30958
10465A47385b83941e7793A97907o9571f0107G517a09925c1637l04271K9841e4777
$$ 147385 -283941 -57793 197907 128336 -60107 7517 -109925 -31637 -335908 -306067 -54777
10453I3882K6643b1788j87162l282L1108b1898F5781a16575B2313J04603b91522
$$ 93882 120525 -21788 -208950 -212232 -181124 -21898 65781 -116575 22313 126916 -291522
10441A03263Q0077A7228b1834k76183a15510j15499e4853l18702A6923a72935
$$ 103263 183340 17228 -21834 -298017 -115510 -231009 -54853 -373555 16923 -172935
10430a49726d3056q5591I822a1523F5806b63670i2045r6608C4639a03439k54673
$$ -149726 -43056 -128647 9822 -11523 65806 -263670 -92045 -188653 34639 -103439 -358112
10419c58112A29946J2107d8034B02974b03856Q5260Q484A29282c75169a4852j30992
$$ -358112 129946 142053 -48034 202974 -203856 -118596 -110112 129282 -375169 -14852 -145844
10408a45844c6061l18319b1392N401l24597a25236A91275C7322K43917B2773l773
$$ -145844 -36061 -354380 -21392 -15991 -340588 -125236 191275 37322 281239 22773 19000
10397A9000J12780f0220K5875j71992A31321c7587E6520b2298A23143I429a6831
$$ 19000 131780 -60220 -34345 -206337 131321 -37587 56520 -22298 123143 9429 -16831
10385c20608C08309i0785j43898B78050O7484H6590j4972J04017K10741a97140
$$ -320608 308309 -90785 -234683 278050 345534 86590 71618 175635 386376 -197140
10374B97353C6583h795q1684C48418p4386J31203P4844E0250K78854J09913N5972
$$ 297353 36583 -8795 -90479 348418 274032 405235 480079 50250 329104 439017 494989
10363D94989j02608k4974k5200A69947j7515L1780b17007a3276C42706q1423r7501
$$ 494989 392381 367407 342207 169947 152432 184212 -217007 -13276 342706 261283 163782
10352A63782L41222J4466j26782j68366L1522H7534N32409k47723Q8800l8008
$$ 163782 505004 519470 392688 224322 255844 87534 619943 372220 461020 423012
10342D23012J47563A02702G100K11168a89912C29126j3L5103i1045I1265K06485
$$ 423012 570575 102702 7100 218268 -189912 329126 329113 364216 -91045 91265 297750
10331B97750c44380C6116N0571a00286A40520R1907m4762r221N3765P3233F6707
$$ 297750 -344380 36116 86687 -100286 140520 232427 187665 178444 232209 305442 66707
10319F57J9230L12638D280b45509A22622K17679A57692a56330p422m2375d8322
$$ 657 19887 332525 4280 -245509 122622 340301 157692 -156330 -163752 -206127 -48322
10307F9664E595L00063A49717K59237A66272c9626A74555d3114J0557C24317f0026
$$ 69664 5595 305658 149717 408954 166272 -39626 174555 -43114 -32557 324317 -60026
10295G7832q851a32694A70850A2976a86826A8017P0272b74306C473a94837L5323
$$ 77832 68981 -132694 170850 12976 -186826 18017 88289 -274306 3473 -194837 -159514
10284a59514B70462j27971b34617B27652c5877j03843k38499g8124B1509b10256
$$ -159514 270462 142491 -234617 227652 -35877 -139720 -378219 -78124 21509 -210256
10273a12932a7036l82146a44475C87834b4906A24778F1836J03388F3609k0336
$$ -112932 -17036 -399182 -144475 387834 -24906 124778 61836 165224 63609 43273
10263D3273K78761a1115A75400l1854J49024j29870k0905L01234E9195P2637C982
$$ 43273 322034 -11115 175400 143546 292570 162700 141795 443029 59195 131832 3982
10251B27768a35011B28746l1427a46897F5271K486b54273i2837j03487P7377l04337
$$ 227768 -135011 228746 197319 -146897 65271 67757 -254273 -92837 -196324 -118947 -423284
10240d23284e4177D6904Q1317q622a17008j4166e5590A36681O038O7385D120a86046
$$ -423284 -54177 46904 128221 119599 -117008 -131174 -55590 136681 142719 210104 4120 -186046
10227a5998B4236K34158a10916d8558C17444d7614A98103a21294B04514C7575
$$ -15998 24236 258394 -110916 -48558 317444 -47614 198103 -121294 204514 37575
10216E3308a74456B98576b56786A41534K65418A01991c87860B8682a25258d2138
$$ 53308 -174456 298576 -256786 141534 406952 101991 -387860 28682 -125258 -42138
10205H0188a44901q5645j01101J57336D8169R5500f6892F984J66473k9210b93112
$$ 80188 -144901 -230546 -331647 -174311 48169 143669 -66892 6984 173457 144247 -293112
10193A22534i1110a4928p3040k69272F4183d3042B22844a58487j7714C9109f2343
$$ 122534 -91110 -14928 -87968 -357240 64183 -43042 222844 -158487 -176201 39109 -62343
10181C6285e2881A9661a49030D7044J72270f6653B35240a38284A9655a34314A66217
$$ 36285 -52881 19661 -149030 47044 219314 -66653 235240 -138284 19655 -134314 166217
10169c99785R6952b6990j19430c2949k87012g6891b4173F6328c29017a9923l42756
$$ -399785 -302833 -26990 -146420 -32949 -319961 -76891 -24173 66328 -329017 -19923 -362679
10158c62679A2133J19865i0740A2948f8969C7144J9555b85253f7395k2843K9545
$$ -362679 12133 131998 -90740 12948 -68969 37144 56699 -285253 -67395 -90238 -60693
10147f0693j59496j57554J8070F9098B9430a51731B7948K01559H9767a12433j91148
$$ -60693 -220189 -377743 -359673 69098 29430 -151731 27948 229507 89767 -112433 -303581
10136c03581C61545a68590P0961B0406M4240g8455l37304g7850A06959J5477b94277
$$ -303581 361545 -168590 -97629 20406 64646 -78455 -415759 -77850 106959 122436 -294277
10124D5055b59629b690j96437B7191J17866e8636a7932H7944a38716b797k1675
$$ 45055 -259629 -2690 -199127 27191 145057 -58636 -17932 87944 -138716 -2797 -24472
10113b4472k5137l51806g1801K235j27024a2865F8177P0482d47894A06314i1423
$$ -24472 -49609 -401415 -71801 -69566 -196590 -12865 68177 138659 -447894 106314 -91423
10101a6875o870F9802d3927p2130R206l0926c3223B74320b65193j36477a64545
$$ -16875 -23745 69802 -43927 -116057 -106851 -137777 -33223 274320 -265193 -401670 -164545
10089a41230j85330A3007a27591I099J652a09458A87905N5082b91152B4259a29787
$$ -141230 -326560 13007 -127591 9099 10751 -109458 187905 242987 -291152 24259 -129787
10077c8329o6731G8326K61157I1093a45812b716m11186A10517l6288a45675P0351
$$ -38329 -105060 78326 339483 91093 -145812 -2716 -413902 110517 74229 -145675 -75324
10066g5324p3976c5387C20190b47155A20319N2199E5072P5728K08026c4897F0396
$$ -75324 -149300 -35387 320190 -247155 120319 172518 55072 130800 338826 -34897 60396
10054e2077F7967b43327F686a87473a6724k55182j50315a16260c9190o3962j6021
$$ -52077 67967 -243327 6686 -187473 -16724 -271906 -422221 -116260 -39190 -103152 -119173
10043a19173A06617i3974A38976k3064R3675q7514a4818n6766n1901H5845c05276
$$ -119173 106617 -93974 138976 115912 209587 122073 -14818 -71584 -123485 85845 -305276
10031c25717J14876d3371R964D4126a40605A83967e9761C8534h7683j60916q4088
$$ -325717 -210841 -43371 -33407 44126 -140605 183967 -59761 38534 -87683 -248599 -332687
10020c32687a21186b7300A40219A6430a48746G3139g6542K1865B031e4719A10127
$$ -332687 -121186 -27300 140219 16430 -148746 73139 -76542 -54677 2031 -54719 110127
10008F2195b97051B22589a44061A55342f0680j26490j32115J48806A06548c9888
$$ 62195 -297051 222589 -144061 155342 -60680 -187170 -319285 -170479 106548 -39888
9997B28065a7387A29423a64504C65549D9258a48435F6998g7316A2485a01938j22234
$$ 228065 -17387 129423 -164504 365549 49258 -148435 66998 -77316 12485 -101938 -224172
9986b24172j15511e0031p2329B40895b49850G9553c1005j25121P1943A99f0524
$$ -224172 -339683 -50031 -122360 240895 -249850 79553 -31005 -156126 -84183 199 -60524
9974a35543a7487A4618N0580d9957H765J41605f4242k76552A61808b19326C9545
$$ -135543 -17487 14618 65198 -49957 8765 150370 -64242 -340794 161808 -219326 39545
9962d05829a40751E9374A2270a49091B1690J26256M9559q2881a91777B5164a59716
$$ -405829 -140751 59374 12270 -149091 21690 147946 197505 114624 -191777 25164 -159716
9950E4124b05253l94410a84776A16647M1540a74725K9616e7726k19992R3153q2581
$$ 54124 -205253 -599663 -184776 116647 158187 -174725 -145109 -57726 -277718 -184565 -267146
9939b67146f2218a5486l9944j27891A51212d5469j39947d5683J8935q7607B75200
$$ -267146 -62218 -15486 -55430 -183321 151212 -45469 -185416 -45683 -26748 -114355 275200
9927F8405i8663C8025b638j80884g0247j25837O0022k7021A66J22742b00414h6581
$$ 68405 -98663 38025 -2638 -183522 -70247 -196084 -136062 -163083 166 122908 -200414 -86581
9914a78222K5765G2197G258Q8035i3462j45465G2437f4772I4838c57644J26362
$$ -178222 -152457 72197 7258 95293 -93462 -238927 72437 -64772 94838 -357644 -231282
9903b31282R3536Q350N8918m19997a23382A06234g090l41979B13794b3075k20455
$$ -231282 -137746 -129396 -70478 -490475 -123382 106234 -7090 -349069 213794 -23075 -243530
9892b43530a9661C13786a82890B07369n1317b48597B88327c5608j8474A51753
$$ -243530 -19661 313786 -182890 207369 156052 -248597 288327 -35608 -54082 151753
9881g8799j52917h1973j373A69835e05377K46596i6341j14095c9989B5804L2135
$$ -78799 -231716 -81973 -83346 169835 -505377 -258781 -96341 -210436 -39989 25804 57939
9870E7939a23799L6742G6769l2910J27553a22668N7281A74080b72766B85765a08219
$$ 57939 -123799 -87057 76769 43859 171412 -122668 -65387 174080 -272766 285765 -108219
9858c2076k63888A42589M2189c46801J38562G1640a82945P9437q899K9521H0795
$$ -32076 -295964 142589 184778 -346801 -208239 71640 -182945 -103508 -112407 -82886 80795
9846a2931o4635G4193a28313k55318J21028k30525a31820o4711M0432M6606E5641
$$ -12931 -77566 74193 -128313 -383631 -262603 -493128 -131820 -196531 -156099 -109493 55641
9834B21496b92774R9515j20294J45374G343c35424Q5112h2532c2861B0175K6034
$$ 221496 -292774 -193259 -313553 -168179 7343 -335424 -250312 -82532 -32861 20175 46209
9823D6209d6063I7930K17410d4963l43585i905B25712K3151h2789c8918B34549
$$ 46209 -46063 97930 315340 -44963 -388548 -9905 225712 248863 -82789 -38918 234549
9811b80178K3716c6080j25270j09284l9303h3737B23573d9433G9170N2389a14304
$$ -280178 -256462 -36080 -161350 -270634 -309937 -83737 223573 -49433 79170 131559 -114304
9799f4290k8434b9303m50976A60651K1298B5799L7805g1578k51043A06076c20787
$$ -64290 -92724 -29303 -480279 160651 181949 25799 63604 -71578 -322621 106076 -320787
9787A4374c0392K41m10896e1881r974k1426c0104E8399L3028a87105k90975A37328
$$ 14374 -30392 -30151 -441047 -51881 -61855 -83281 -30104 58399 91427 -187105 -478080 137328
9774A04973m8232a364j91060f3231A37106l4667b79781B08962b48847p8254a29201
$$ 104973 56741 -1364 -192424 -63231 137106 102439 -279781 208962 -248847 -327101 -129201
9762I1786i5871l204A42184d31034a17024K1434l2160k60490J34884d5474j81089
$$ 91786 -95871 -99075 142184 -431034 -117024 -95590 -127750 -388240 -253356 -45474 -226563
9751b26563l6061q574C7929c7092j82962Q558A17598L2419J63348a81606B4600
$$ -226563 -262624 -271198 37929 -37092 -220054 -211496 117598 150017 313365 -181606 24600
9739G8200d76243a89534a3124n5544j12171A30434b78470c0827p4664F423O1676
$$ 78200 -476243 -189534 -13124 -68668 -180839 130434 -278470 -30827 -105491 6423 68099
9728F8099a8254p9182j9828M7742k37052J00834A22077n0387K18287b45035K1536
$$ 68099 -18254 -97436 -117264 -69522 -306574 -205740 122077 71690 289977 -245035 -223499
9717b23499N246M8486l34555a27144D5241b81412a4485l7319j29849O6893p922
$$ -223499 -218253 -169767 -504322 -127144 45241 -281412 -14485 -51804 -181653 -114760 -122682
9706a22682c0617k28061R3311A2154b13535E3086K1825b54304d1853A47269o1421
$$ -122682 -30617 -258678 -165367 12154 -213535 53086 74911 -254304 -41853 147269 85848
9695H5848R6189a33350A37468c5952k09479l7654H263a15143B37644e4648q2987
$$ 85848 182037 -133350 137468 -35952 -245431 -283085 8263 -115143 237644 -54648 -137635
9684a37635H9551a48205M8529A79539a17524B47a22024a1832m83466K17944c087
$$ -137635 89551 -148205 -99676 179539 -117524 247 -122024 -11832 -495298 -277354 -3087
9672h7927k30262J26111Q4655b8474A08277a77741g6662a0006A3311b42452E9677
$$ -87927 -318189 -192078 -107423 -28474 108277 -177741 -76662 -10006 13311 -242452 59677
9660a56542A25910a13284j24073a1649E4588a21886d6429m1340k9382B47597r3923
$$ -156542 125910 -113284 -237357 -11649 54588 -121886 -46429 -87769 -117151 247597 153674
9649A53674F2072c38572f9797A96954F3801J69952g793A89257a14558j23354B95093
$$ 153674 62072 -338572 -69797 196954 63801 233753 -7793 189257 -114558 -237912 295093
9637f9036k26627A1836f7615k23159e1097l23852A09363i363j39402a6311l9810
$$ -69036 -295663 11836 -67615 -290774 -51097 -374949 109363 -9363 -148765 -16311 -56121
9626e6121r5405f5550G4105b05462B50484a07390l9431g1666l3133A94508D7744
$$ -56121 -151526 -65550 74105 -205462 250484 -107390 -146821 -71666 -104799 194508 47744
9614C2467b88071M5457C3062c93067d0734k6462j4832A11142a2336k56924N3114
$$ 32467 -288071 -242614 33062 -393067 -40734 -67196 -82028 111142 -12336 -269260 -216146
9603b16146a00181k8329f3384K6505j51195A51493b1607j99915a00926A0391d35159
$$ -216146 -100181 -128510 -63384 -36879 -188074 151493 -21607 -221522 -100926 10391 -435159
9591a4261e036j02906M7671k34438d3457A51235n6690d8386B9089K9060R872c46222
$$ -14261 -5036 -107942 -60271 -294709 -43457 151235 94545 -48386 29089 58149 68021 -346222
9578A06154a78874g4469j57025Q94j12479Q2583R1463O4888k72591D4265a86955
$$ 106154 -178874 -74469 -231494 -230600 -343079 -260496 -169033 -104145 -376736 44265 -186955
9566A4874J40757a01301i495F3848a54706I9773a04346o5219P2866F6264P5786
$$ 14874 155631 -101301 -9495 63848 -154706 99773 -104346 -169565 -96699 66264 142050
9555A42050b0458l7917F0085b87418I9136a03362p5619m7376f3470j80818I1177
$$ 142050 -20458 -58375 60085 -287418 99136 -103362 -178981 -226357 -63470 -244288 91177
9543b09290p7297g4255K7655a9063D6313j288J5867c9914j14990j6012P1374b4311
$$ -209290 -286587 -74255 -46600 -19063 46313 45025 60892 -39914 -154904 -170916 -99542 -24311
9530a40537d4715J7192l42358a44025D10427g0361n7769e7689j89397D0219a4352
$$ -140537 -44715 -27523 -369881 -144025 410427 -70361 -128130 -57689 -247086 40219 -14352
9518g5255b1898l20693E0021a09949j14669a03394D4109g3345j25186O6708A11345
$$ -75255 -21898 -342591 50021 -109949 -224618 -103394 44109 -73345 -198531 -131823 111345
9506B41100h1043B6776d5657j60090f9716A68782G7575P736l7688b39456j4099
$$ 241100 -81043 26776 -45657 -205747 -69716 168782 77575 85311 47623 -239456 -253555
9495b53555b8683B7384a84915b2109G1594J2350i4492o9392b1213m3588J0474
$$ -253555 -28683 27384 -184915 -22109 71594 83944 -94492 -163884 -21213 -64801 -54327
9484e4327A76598c3664k0050j71622k53149a93445C85827a80578Q1747B99233
$$ -54327 176598 -33664 -53714 -225336 -478485 -193445 385827 -180578 -98831 299233
9473b04299K862O6052H7271c4015k17510h4020J4381L1129j99312F4989a98691
$$ -204299 -201437 -135385 87271 -34015 -251525 -84020 -69639 -38510 -237822 64989 -198691
9461A69499g2411K385k27585J15402A38254b39267B01628b39499C15509a09217
$$ 169499 -72411 -70026 -297611 -182209 138254 -239267 201628 -239499 315509 -109217
9450A32864g8570C21236D2867a72465e72j26333q5321k4894A86804i1206A98952
$$ 132864 -78570 321236 42867 -172465 -572 -126905 -212226 -237120 186804 -91206 198952
9438d35814D65806k13246i4510k72994E84a22937C904a03349j23314q4454a8630
$$ -435814 465806 252560 -94510 -367504 584 -122937 3904 -103349 -226663 -311117 -18630
9426A37515a94590B77833b0715A96611F0764c45309g0398A05705b11793b768j96859
$$ 137515 -194590 277833 -20715 196611 60764 -345309 -70398 105705 -211793 -2768 -199627
9415a99627M2837e0789l13009A95995E4721f0548r0153d100o4329r418l24989
$$ -199627 -156790 -50789 -363798 195995 54721 -60548 -150701 -4100 -68429 -77847 -402836
9404d02836f2067k82980i6729A66799q1351c59621Q5085A54618b68257N4835k88067
$$ -402836 -62067 -345047 -96729 166799 85448 -359621 -274536 154618 -268257 -213422 -501489
9393e01489E5717a84680Q6266j48187d8036m8467j3122k52220J9062A73163B9341
$$ -501489 55717 -184680 -98414 -246601 -48036 -96503 -109625 -361845 -342783 173163 29341
9381c2836D952Q5334K01218a57323k1962d775D5499o961b00667b2557A90420d05551
$$ -32836 4952 90286 291504 -157323 -179285 -4775 45499 38538 -200667 -22557 190420 -405551
9368i8064J9952j33119P1950l7044B08487a04020A41362E8741A021a80219j134
$$ -98064 -78112 -211231 -139281 -176325 208487 -104020 141362 58741 1021 -180219 -181353
9357a81353c269l1896k63618n9315i6849I0343b08281C3552P1930L910f1850k48624
$$ -181353 -3269 -35165 -298783 -358098 -96849 90343 -208281 33552 105482 109392 -61850 -310474
9345c10474G4638c89986A66063f882B1940f644B67766c74986i0052I5409b05032
$$ -310474 74638 -389986 166063 -6882 21940 -6644 267766 -374986 -90052 95409 -205032
9333b66922A75804f7115I4978k3077a65071A87285a49984J2514k49797J33321
$$ -266922 175804 -67115 94978 71901 -165071 187285 -149984 -137470 -387267 -253946
9323b53946B06429m5874O4308a07700b1005j8124F4654b8534C4185e02084B14135
$$ -253946 206429 160555 224863 -107700 -21005 -39129 64654 -28534 34185 -502084 214135
9311g7818O193D0614M8541J68485f5069D1562h7039l730D5495a64542b3007A08993
$$ -77818 -71625 40614 89155 257640 -65069 41562 -87039 -90769 45495 -164542 -23007 108993
9298c83298a48972b0967A39646D8964P2435E6398d3757C07119j40667I563a67213
$$ -383298 -148972 -20967 139646 48964 121399 56398 -43757 307119 166452 9563 -167213
9286B8624a27365B8194O340K00200f4568j75242h235I8239B3712a61464O2352
$$ 28624 -127365 28194 34534 234734 -64568 -239810 -8235 98239 23712 -161464 -99112
9275i9112A81477h9304m3644p2396A14152b81406A05270j2665a40947E3391b65112
$$ -99112 181477 -89304 -132948 -205344 114152 -281406 105270 92605 -140947 53391 -265112
9263a18771l464A06575a71130B04246G1812e655n49978I6064A34g8334n4786D2826
$$ -118771 -122235 106575 -171130 204246 71812 -5655 -555633 96064 134 -78334 -133120 42826
9250i5001D1454J39722a13400j87872j26342e6790j01501C4821M642b3501H7464
$$ -95001 41454 181176 -113400 -301272 -427614 -56790 -158291 34821 39463 -23501 87464
9238c3095n0060j57080M5041A00523b06845d7162E4236d1515k87764i7219C07803
$$ -33095 -83155 -240235 -195194 100523 -206845 -47162 54236 -41515 -329279 -97219 307803
9226b03810N5335M5451c737H1694a13260m2318H360b13696m4285O9156n1938g678
$$ -203810 -148475 -103024 -3737 81694 -113260 -155578 8360 -213696 -257981 -188825 -240763 -7678
9213G7018a94401G9579a3500j41149E0726J09412A5885a78979a3948F2066b30184
$$ 77018 -194401 79579 -13500 -154649 50726 160138 15885 -178979 -13948 62066 -230184
9201D40713A25825J25326c10595A38241R7221j14235n6221a31718D6056b64872
$$ 440713 125825 251151 -310595 138241 235462 121227 65006 -131718 46056 -264872
9190a94079j23521P2524J15728B38795J86012a0864A35175k9919a50283K797q3429
$$ -194079 -317600 -245076 -129348 238795 424807 -10864 135175 105256 -150283 -147486 -230915
9179b30915N3884j25301b337A36596A6254a34158n915j24601p7019J48261J7514
$$ -230915 -177031 -302332 -2337 136596 16254 -134158 -140073 -264674 -341693 -193432 -175918
9168a75918e2859o1322B60919a0498j46550P128J8497l9517B81422n1259N4651
$$ -175918 -52859 -114181 260919 -10498 -157048 -149920 -131423 -170940 281422 230163 284814
9157B84814h2150G3595o416j1963b7761A78214b5139D3595b35222p3110f5392
$$ 284814 -82150 73595 67179 55216 -27761 178214 -25139 43595 -235222 -308332 -65392
9145a25143l63983e3160j71966e4381j40565C1971a87852A83688d224A12830c02801
$$ -125143 -489126 -53160 -225126 -54381 -194946 31971 -187852 183688 -4224 112830 -302801
9133h7362j91370J30140B68591b20480J6024C4903M9555c92419a13606A72564
$$ -87362 -278732 -148592 268591 -220480 -204456 34903 84458 -392419 -113606 172564
9122b86004i6427C36606F116C041d13669a79499E5263a10143I0109i5934c322
$$ -286004 -96427 336606 6116 3041 -413669 -179499 55263 -110143 90109 -95934 -3322
9110A13573J00543P4703a34595I3485a40943I2972J27741n2216J97898B9989c2615
$$ 113573 214116 288819 -134595 93485 -140943 92972 220713 168497 366395 29989 -32615
9098b90916A879h7701k02895Q8266Q3768e9168b9501j12045r6172a12797L3802
$$ -290916 1879 -87701 -290596 -202330 -118562 -59168 -29501 -141546 -237718 -112797 -78995
9087g8995l15758D3424b30198A04548g9786c2697j07055o7022C1759h4554e1k03410
$$ -78995 -394753 43424 -230198 104548 -79786 -32697 -139752 -206774 31759 -84554 -51 -203461
9075b03461F339h0139A17054i6839r5054j13403E8101P4110D033L30995A22375
$$ -203461 6339 -80139 117054 -96839 -191893 -305296 58101 132211 4033 335028 122375
9063A49815d75593E9867L01274c97835a18533c4033j18966J3133p5709f8761k6337
$$ 149815 -475593 59867 361141 -397835 -118533 -34033 -152999 -139866 -215575 -68761 -95098
9052i5098k86035C1527a84066B77239i4110j29813f5282L119A73595c81887J48105
$$ -95098 -381133 31527 -184066 277239 -94110 -223923 -65282 -62163 173595 -381887 -233782
9041b33782e8732l08857a35081K0735j91795A38098K36753g5263l18598k7910
$$ -233782 -58732 -367589 -135081 -114346 -306141 138098 374851 -75263 -393861 -421771
9031d21771e3551r2503j62202a26892C53310A9025c0390m6247j86132e7837j95167
$$ -421771 -53551 -146054 -308256 -126892 353310 19025 -30390 -76637 -262769 -57837 -253004
9020b53004J18075A71599F1159c6360k81356i6903A44613A7129R5977B4181O6032
$$ -253004 -134929 171599 61159 -36360 -317716 -96903 144613 17129 113106 24181 90213
9009I0213b25237C0228d52601a08119E9198a53244e1264K2086r7325a631F870
$$ 90213 -225237 30228 -452601 -108119 59198 -153244 -51264 -29178 -126503 -1631 6870
8997e49551b26173A5658a03164i472n4758D1541a98991l22491A6303J91266A7263
$$ -549551 -226173 15658 -103164 -9472 -64230 41541 -198991 -521482 16303 207569 17263
8985c61212J76618Q4356k3431j69128H5014B1059b35j38525l98054b8848A1806
$$ -361212 -184594 -100238 -123669 -292797 85014 21059 -235 -138760 -536814 -28848 11806
8973D2443O943c7035j50417B66183a77288Q2904R725o0007E5720b5924p7946L5174
$$ 42443 49386 -37035 -187452 266183 -177288 -94384 -84659 -144666 55720 -25924 -103870 -68696
8961f8696A17996K6506h9254k00995Q7399h6030A24202a19714j33000g4973A51182
$$ -68696 117996 144502 -89254 -290249 -202850 -86030 124202 -119714 -252714 -74973 151182
8949a11989A49814b14558C51754A6712J62370a14394k49009i2260L3379l92671
$$ -111989 149814 -214558 351754 16712 179082 -114394 -363403 -92260 -58881 -451552
8939d51552D051J39877i8886B43128K4745K2901G7138e3712g591A53043i4027
$$ -451552 4051 143928 -98886 243128 267873 290774 77138 -53712 -7591 153043 -94027
8927B35150O2856J05741M08699R82649J060240K736712M855591D529964A558920
$$ 235150 298006 403747 812446 1795095 2855335 5592047 10447638 4529964 1558920
8917D13845j89888A05266c0797j8951J2908p7664m2605A82415G1448L4348b55588
$$ 413845 223957 105266 -30797 -49748 -36840 -114504 -157109 182415 71448 105796 -255588
8905f9434G0894a31399L8175A25190A3399c9614k89146A0710b1143p560B36180
$$ -69434 70894 -131399 -93224 125190 13399 -39614 -328760 10710 -21143 -28703 236180
8893A44917g2698j48572L8212E892K02280e4958j55372b4481R54k39473L2584
$$ 144917 -72698 -221270 -183058 5892 208172 -54958 -210330 -24481 -23527 -263000 -230416
8882b30416a13285r1382B04068d4658A34041C9390J26693m0603b02278j05398
$$ -230416 -113285 -204667 204068 -44658 134041 39390 166083 125480 -202278 -307676
8872c07676f559j00900m7111g0853L3703A18602c05014a17640B0102O4164b96464
$$ -307676 -6559 -107459 -154570 -70853 -37150 118602 -305014 -117640 20102 84266 -296464
8860b03110j28513c392r1871A58298b00416p9521f5958K8667k45970g5279a0163
$$ -203110 -331623 -3392 -95263 158298 -200416 -279937 -65958 -37291 -283261 -75279 -10163
8848d8842C16161D2636E296N8929B5306J81400A8216a90016j95576K1230A8615
$$ -48842 316161 42636 5296 64225 25306 206706 18216 -190016 -385592 -364362 18615
8836b06567J9414B74433a49122O7061A365d9418B9150c67739A18342M6477m3333
$$ -206567 -187153 274433 -149122 -82061 1365 -49418 29150 -367739 118342 164819 121486
$$ [...]
##END NTUPLES=NMR SPECTRUM
##END=
