##TITLE=AC1598_PERAH13328_8314459_ReeslgHcy3
##JCAMPDX= 6.0         $$ Bruker NMR JCAMP-DX V2.0
##DATA TYPE= NMR SPECTRUM
##DATA CLASS= NTUPLES
##ORIGIN= BRUKER
##OWNER= Administrator
$$ 1.72 TOPSPIN		Version 2.1
$$ 2013-11-09 17:32:26.271 -0800  Administrator@X
$$ Compression mode = diff/dup
##.OBSERVE FREQUENCY= 400.02188249412
##.OBSERVE NUCLEUS= ^1H
##.ACQUISITION MODE= SIMULTANEOUS (DQD)
##.ACQUISITION SCHEME= undefined
##.AVERAGES= 64
##.DIGITISER RES= 22
##SPECTROMETER/DATA SYSTEM= spect
##.PULSE SEQUENCE= noesygpps1d.comp
##.SOLVENT NAME= COFFEE_meoh
##.SHIFT REFERENCE= INTERNAL, COFFEE_meoh, 1, 14.96119
##AUDIT TRAIL= $$ (NUMBER, WHEN, WHO, WHERE, PROCESS, VERSION, WHAT)
$$ ##TITLE= Audit trail, TOPSPIN		Version 2.1
$$ ##JCAMPDX= 5.01
$$ ##ORIGIN= Bruker BioSpin GmbH
$$ ##OWNER= Administrator
$$ $$ E:\/data/COFFEE/nmr/AC1598_PERAH13328_8314459_ReeslgHcy3/12/pdata/1/auditp.txt
$$ ##AUDIT TRAIL=  $$ (NUMBER, WHEN, WHO, WHERE, PROCESS, VERSION, WHAT)
(   1,<2013-11-09 17:32:20.911 -0800>,<Administrator>,<X>,<go>,<TOPSPIN 2.1>,
      <created by zg
	started at 2013-11-09 17:20:51.436 -0800,
	POWCHK enabled, PULCHK disabled,
       configuration hash MD5:
       C8 4E 4E 5D D3 5C D8 9E 9F 52 82 E0 59 8A DE 15
       data hash MD5: 64K
       22 AA 21 8E BA FC 48 C7 FA AD E5 87 A8 8D 9C 28>)
(   2,<2013-11-09 17:32:24.005 -0800>,<Administrator>,<X>,<proc1d>,<TOPSPIN 2.1>,
      <Start of raw data processing
       efp LB = 0.3 FT_mod = 6 PKNL = 1 PHC0 = 0 PHC1 = 0 SI = 128K 
       data hash MD5: 128K
       F8 BF 74 45 5B CB 83 D5 30 12 42 A3 1B D4 F0 6C>)
(   3,<2013-11-09 17:32:25.239 -0800>,<Administrator>,<X>,<proc1d>,<TOPSPIN 2.1>,
      <pk PHC0 = -85.74829 PHC1 = 0 
       data hash MD5: 128K
       FC FF EA ED 7F D4 E5 52 81 02 C6 77 51 1A 77 74>)
(   4,<2013-11-09 17:32:25.724 -0800>,<Administrator>,<X>,<proc1d>,<TOPSPIN 2.1>,
      <abs ABSG = 1 
       data hash MD5: 128K
       C7 F6 A6 52 3F 8C 70 7C 20 EB 8E 2E F9 AB 33 1A>)
(   5,<2013-11-09 17:32:25.833 -0800>,<Administrator>,<X>,<proc1d>,<TOPSPIN 2.1>,
      <abs ABSG = 2 
       data hash MD5: 128K
       8E 96 5A FF 24 FA 40 3F 9D 97 B3 E8 B2 BA F1 B4>)
(   6,<2013-11-09 17:32:25.911 -0800>,<Administrator>,<X>,<proc1d>,<TOPSPIN 2.1>,
      <abs ABSG = 3 
       data hash MD5: 128K
       B7 9D D8 4B 3E 5B 48 6F 7A 3F E2 4E B0 26 1D EB>)
(   7,<2013-11-09 17:32:25.989 -0800>,<Administrator>,<X>,<proc1d>,<TOPSPIN 2.1>,
      <abs ABSG = 4 
       data hash MD5: 128K
       02 45 59 1D 7F 88 E5 D3 24 70 20 05 A7 56 E6 0D>)
(   8,<2013-11-09 17:32:26.068 -0800>,<Administrator>,<X>,<proc1d>,<TOPSPIN 2.1>,
      <abs ABSG = 5 
       data hash MD5: 128K
       B5 FA E0 58 0C 10 87 72 33 21 15 6B BD 2F 1B 69>)
$$ ##END=
$$ 
$$ $$ hash MD5
$$ $$ 7C 7F 93 FB 6F 9C 7B 8E D0 EA 9F 7C 4A 04 43 FA
##$RELAX= 
##$RELAX= 
##$RELAX= 
##$RELAX= 
##$RELAX= 
##$RELAX= 
##$RELAX= 
##$RELAX= 
$$ Bruker specific parameters
$$ --------------------------
##$DU= <E:\>
##$EXPNO= 12
$$ [...]
##$TP07= 0
##$TPNAME0= <>
##$TPNAME1= <>
##$TPNAME2= <>
##$TPNAME3= <>
##$TPNAME4= <>
##$TPNAME5= <>
##$TPNAME6= <>
##$TPNAME7= <>
##$TPOAL= (0..7)
0.5 0.5 0.5 0.5 0.5 0.5 0.5 0.5
##$TPOFFS= (0..7)
0 0 0 0 0 0 0 0
##$TUNHIN= 0
##$TUNHOUT= 0
##$TUNXOUT= 0
##$USERA1= <user>
##$USERA2= <user>
##$USERA3= <user>
##$USERA4= <user>
##$USERA5= <user>
##$V9= 5
##$VALIST= <valist>
##$VCLIST= <CCCCCCCCCCCCCCC>
##$VD= 0
##$VDLIST= <DDDDDDDDDDDDDDD>
##$VPLIST= <PPPPPPPPPPPPPPP>
##$VTLIST= <TTTTTTTTTTTTTTT>
##$WBST= 1024
##$WBSW= 4
##$XGAIN= (0..3)
0 0 0 0
##$XL= 0
##$YL= 0
##$YMAX_a= 6166589
##$YMIN_a= -11299077
##$ZGOPTNS= <>
##$ZL1= 120
##$ZL2= 120
##$ZL3= 120
##$ZL4= 120
##$ABSF1= 14.96119
##$ABSF2= -5.596992
##$ABSG= 5
##$ABSL= 3
##$ALPHA= 0
##$AQORDER= 0
##$ASSFAC= 0
##$ASSFACI= 0
##$ASSFACX= 0
##$ASSWID= 0
##$AUNMP= <proc_prof1d_extract.lims>
##$AXLEFT= 0
##$AXNAME= <>
##$AXNUC= <1H>
##$AXRIGHT= 0
##$AXTYPE= 0
##$AXUNIT= <>
##$AZFE= 0.1
##$AZFW= 0.1
##$BCFW= 0
##$BC_mod= 0
##$BYTORDP= 0
##$COROFFS= 0
##$CY= 15
##$DATMOD= 1
##$DC= 0
##$DFILT= <>
##$DTYPP= 0
##$F1P= 0
##$F2P= 0
##$FCOR= 0.5
##$FTSIZE= 131072
##$FT_mod= 6
##$GAMMA= 0
##$GB= 0
##$INTBC= 1
##$INTSCL= 1
##$ISEN= 128
##$LB= 0.3
##$LEV0= 0
##$LPBIN= 0
##$MAXI= 10000
##$MC2= 0
##$MEAN= 0
##$ME_mod= 0
##$MI= 0
##$NCOEF= 0
##$NC_proc= -2
##$NLEV= 6
##$NOISF1= 0
##$NOISF2= 0
##$NSP= 0
##$NTH_PI= 0
##$NZP= 0
##$OFFSET= 14.96119
##$PC= 1
##$PHC0= -85.74829
##$PHC1= 0
##$PH_mod= 1
##$PKNL= yes
##$PPARMOD= 0
##$PPDIAG= 0
##$PPIPTYP= 0
##$PPMPNUM= 2147483647
##$PPRESOL= 1
##$PSCAL= 4
##$PSIGN= 0
##$PYNMP= <proc.py>
##$REVERSE= no
##$SF= 400.020009559287
##$SI= 131072
##$SIGF1= 0
##$SIGF2= 0
##$SINO= 400
##$SIOLD= 131072
##$SPECTYP= <>
##$SREGLST= <1H.CDCl3>
##$SSB= 0
##$STSI= 131072
##$STSR= 0
##$SW_p= 8223.68421052631
##$SYMM= 0
##$S_DEV= 0
##$TDeff= 65536
##$TDoff= 0
##$TI= <>
##$TILT= no
##$TM1= 0
##$TM2= 0
##$TOPLEV= 0
##$USERP1= <user>
##$USERP2= <user>
##$USERP3= <user>
##$USERP4= <user>
##$USERP5= <user>
##$WDW= 1
##$XDIM= 131072
##$YMAX_p= 365597888
##$YMIN_p= -10563
##$CURPLOT= <Network HP LaserJet P1505>
##$CURPRIN= <$Network HP LaserJet P1505>
##$DFORMAT= <normdp>
##$LAYOUT= <+/1D_H.xwp>
##$LFORMAT= <normlp>
##$PFORMAT= <normpl>
##$SURQMSG= 1
$$ End of Bruker specific parameters
$$ ---------------------------------
##NTUPLES= NMR SPECTRUM
##VAR_NAME=  FREQUENCY,     SPECTRUM/REAL,   SPECTRUM/IMAG
##SYMBOL=    X,             R,               I
##VAR_TYPE=  INDEPENDENT,   DEPENDENT,       DEPENDENT
##VAR_FORM=  AFFN,          ASDF,            ASDF
##VAR_DIM=   131072,        131072,          131072
##UNITS=     HZ,            ARBITRARY UNITS, ARBITRARY UNITS
##FACTOR=    0.0627417313425164, 1,          1
##FIRST=     8223.62146879497, 1762,         -58172
##LAST=      0,             3185,            -58246
##MIN=       0,             -10563,          0
##MAX=       8223.62146879497, 365597888,    0
$$ Real data points
##PAGE= N=1
##DATA TABLE= (X++(R..R)), XYDATA
$$ [...]
63975B91871O226O779O822O793P430Q632R513R432Q534P433O826P230Q616J0341
63961D02478J1802J3085J4672J6694J8900K1177K3631K6284K9228L2977L8054
63950F48982M4212N0688N7236O4292P2022P9983Q8084R7086J07543J18675J28925
63939A557728J37362J44091J49538J53892J57030J58433J57270J52987J45710
63930B914041J35629J22258J05020Q4543O2562M0332J7850n121k8030n0182p1727
63919C327175r3064j13410j30845j43989j53032j58968j62338j63014j60828j55952
63909A891735j48945j40557j31273j20998j09516r7408q5920p5622o5904n6251
63899H59341m7414m0428l5004k9903k4695k0042j6283j2978j0032q042p041o019
$$ plain form
63975 291871 298097 304876 311698 318491 325921 334553 344066 353498 362032 369465 376291 383521 392137 402478
63961 402478 414280 427365 442037 458731 477631 498808 522439 548723 577951 610928 648982
63950 648982 693194 743882 801118 865410 937432 1017415 1105499 1202585 1310128 1428803 1557728
63939 1557728 1695090 1839181 1988719 2142611 2299641 2458074 2615344 2768331 2914041
63930 2914041 3049670 3171928 3276948 3361491 3424053 3464385 3482235 3477114 3449084 3398902 3327175
63919 3327175 3234111 3120701 2989856 2845867 2692835 2533867 2371529 2208515 2047687 1891735
63909 1891735 1742790 1602233 1470960 1349962 1240446 1143038 1057118 981496 915592 859341
63899 859341 811927 771499 736495 706592 681897 661855 645572 632594 622562 614520 607479 601460
63887F01460m365k779j903j067N79K529L838M908O883R601J1718J2919J4554J7580
63873F76455K1177K4030K6037K8013L0465L3254L6006L8255L9602M0149M0412
63862A033855M0547M0147L9003L7462L5677L3221K9834K5982K2057J7710J2525
63851A368020O934J689l151q101j3391j8847k4257k9261l3191l5835l8059m0839
63839A131711m3762m5413m5341m4746m4894m5539m5433m3911m1429l8779l6295
63828F56169l3891l1482k9229k7400k6045k4847k3320k1235j8851j6783j5484
63817C87602j4776j3857j2086r701p570o222n424m828m456m352m162l539k712
63804B93917k163j988j953k048k462l116l691m171m879n864o602o536n743m884
$$ plain form
63887 601460 597095 594316 592413 591346 591925 594454 598292 603200 610083 619684 631402 644321 658875 676455
63873 676455 697632 721662 747699 775712 806177 839431 875437 913692 953294 993443 1033855
63862 1033855 1074402 1114549 1153552 1191014 1226691 1259912 1289746 1315728 1337785 1355495 1368020
63851 1368020 1374954 1376643 1373492 1365391 1352000 1333153 1308896 1279635 1246444 1210609 1172550 1131711
63839 1131711 1087949 1042536 997195 952449 907555 862016 816583 772672 731243 692464 656169
63828 656169 622278 590796 561567 534167 508122 483275 459955 438720 419869 403086 387602
63817 387602 372826 358969 346883 337182 329612 323390 317966 313138 308682 304330 300168 296629 293917
63804 293917 291754 289766 287813 285765 283303 280187 276496 272325 267446 261582 254980 248444 242701 237817
63790B37817m515m477m078k965j795j642k650l673l588k607j851j858k106j928
63776A98084j348q81q72j179j395j239q97q19j108j338j158q16p54r39j020q85
63760A81436p04n72n01n80o56j89J022K128K031Q06l76p77p92r65j115q52l39
63743A79005j9M5J20L77P93J291J741K031K221K404K369J858J233J283K108K792
63727B01652K584J936J836K506L389M053M522M776M651M219L793L448K974K396
63713B48735K108K257K406K050J218K74o14j461k096k284k230k477l021l023j874
63698B39968l04K71n18j542j662r75k22M23J252K158K687K790K808K788K537K264
63682B54723K357K544K077J016M12Q70J669J858J551J447J562J283M36l59l90
$$ plain form
63790 237817 233302 228825 224747 221782 219987 218345 215695 212022 208434 205827 203976 202118 200012 198084
63776 198084 196736 195855 194983 193804 192409 191170 190273 189454 188346 187008 185850 185034 184280 183341 182321 181436
63760 181436 180732 180160 179659 179079 178423 178234 179256 181384 183415 184221 183845 183068 182276 181311 180196 179344 179005
63743 179005 178986 179031 179151 179528 180321 181612 183353 185384 187605 190009 192378 194236 195469 196752 198860 201652
63727 201652 204236 206172 208008 210514 213903 217956 222478 227254 231905 236124 239917 243365 246339 248735
63713 248735 250843 253100 255506 257556 258774 259048 258434 256973 254877 252593 250363 247886 244865 241842 239968
63698 239968 239664 239935 239417 237875 236213 235238 235016 235439 236691 238849 241536 244326 247134 249922 252459 254723
63682 254723 257080 259624 261701 262717 263129 263999 265668 267526 269077 270524 272086 273369 273805 273446 273056
63667B73056M29J542K175J979J439J335J659J536N90l01k42K28j84j701l263m098
63651B76179m531n076n559n549n027m173l007j695p92o71q75n80L72J264J484
63636B41764J342J665K704L676L664K785K095K280K902L263L513M349N785O978
63622B88765P346P225P213P481Q043R129J0757J2245J2827J2629J2574J3320J4649
63609D24203J5948J6927J7725J8560J9446K0178K0523K0529K0545K0759K0690
63598F36033J9487J6807J3217R518N934K219j551m765o944q209q916r075q583
63585F55172p894p975r399j1791j4346j6576j8263j9069j8735j7669j6755j6353
63573D80347j5867j4597j2694j0914r563q131o060l535j221N27K027L734N543
$$ plain form
63667 273056 273485 275027 277202 279181 280620 281955 283614 285150 285740 285439 285197 285425 285241 283540 280277 276179
63651 276179 271648 266572 261013 255464 250437 246264 243257 241562 240770 240099 239224 238644 239016 240280 241764
63636 241764 243106 244771 247475 251151 254815 257600 259695 261975 264877 268140 271653 276002 281787 288765
63622 288765 296111 303336 310549 318030 326073 335202 345959 358204 371031 383660 396234 409554 424203
63609 424203 440151 457078 474803 493363 512809 532987 553510 574039 594584 615343 636033
63598 636033 655520 672327 685544 695062 700996 703215 701664 696899 689955 681746 672830 663755 655172
63585 655172 647278 639303 629904 618113 603767 587191 568928 549859 531124 513455 496700 480347
63573 480347 464480 449883 437189 426275 416712 408581 402521 398986 397765 398292 400319 404053 409596
63560D09596O803P111O987P525R214J1315J2642J2866J2751J3139J4089J5140
63548E39178J6060J7035J8309K0008K2179K4770K7554L0245L2465L3277L1113
63537H12193K4996J5981O799l33n181q625j0994j1932j1493j0533r868r549r225
63524G72236q844q842r822j2116j5475j9074k2070k4204k5713k6762k7257k7172
63512E44885k6695k5893k4565k2557k0095j7589j5289j3238j1404r753q315p225
63500C42267o673o694p039p199o568m873k618q90l94p69j197j405j610j700j177
63485B91461m2R71J325J305J396J547J443J098P76O60R06J723K922L702L411K353
63469C16957J468J305J640J927J725Q35o18k188l467m328m717m509l845l211k816
$$ plain form
63560 409596 416399 423510 430497 438022 447236 458551 471193 484059 496810 509949 524038 539178
63548 539178 555238 572273 590582 610590 632769 657539 685093 715338 747803 781080 812193
63537 812193 837189 853170 859969 859636 854455 845830 834836 822904 811411 800878 791010 781461 772236
63524 772236 763392 754550 744728 732612 717137 698063 675993 651789 626076 599314 572057 544885
63512 544885 518190 492297 467732 445175 425080 407491 392202 378964 367560 357807 349492 342267
63500 342267 335594 328900 321861 314662 308094 303221 300603 299713 299319 298550 297353 295948 294338 292638 291461
63485 291461 291419 292390 293715 295020 296416 297963 299406 300504 301280 301940 302846 304569 307491 311193 314604 316957
63469 316957 318425 319730 321370 323297 325022 325857 325239 323051 319584 315256 310539 306030 302185 298974 296158
63454B96158k210j018K30P23N72O84J453K383L117M082N674P431Q551Q941R284
63439C46055J0200J1692J3309J4638J5661J6764J8317K0285K2426K4721K7141
63428E41209K8864K8362K4811J9090J2909P228K121j996m007l310p16K429N664
63415F62658R287J3171J6530J9004K1176K3498K5340K5671K4309K1795J8264J3320
63403H94023P124Q60m193p558r394j0024j0016j0174j0946j2142j3550j5442j8047
63390G80521k0931k3485k5638k7557k8911k9162k8387k7170k5726k3798k1336
63379D98420j8712j6202j3860j1856j0346q927o913m299j780K69K176M159N886
63366D18015P230Q704J0580J2272J3230J3997J5528J7800J9861K1124K1907K2681
$$ plain form
63454 296158 293948 292930 293160 293883 294455 295139 296592 298975 302092 306174 311848 319279 327830 336771 346055
63439 346055 356255 367947 381256 395894 411555 428319 446636 466921 489347 514068 541209
63428 541209 570073 598435 623246 642336 655245 662473 664594 662598 658591 655281 654565 656994 662658
63415 662658 671945 685116 701646 720650 741826 765324 790664 816335 840644 862439 880703 894023
63403 894023 901147 902007 897814 890256 880862 870838 860822 850648 839702 827560 814010 798568 780521
63390 780521 759590 736105 710467 682910 653999 624837 596450 569280 543554 519756 498420
63379 498420 479708 463506 449646 437790 427444 418517 411604 407305 405525 405794 407970 412129 418015
63366 418015 425245 433949 444529 456801 470031 484028 499556 517356 537217 558341 580248 602929
63354F02929K3534K4462K5558K6646K7219K7046K6441K5619K4041K0846J5815
63343H70156R698L648j443n169p543q893r701j0339j0870j1161j1239j1441j2201
63330G83502j3733j5994j8827k1926k4615k6027k5733k4117k1950j9641j7072
63319E53867j4073j0756p319l960j234k62k066o467j1905j6515j9309k0339k0038
63306D19624j8831j7198j5574j4049j2402j0573q823p325n944m634l697l389l473
63293B93712l507l303k922k417j968j976k574l197l125k360j521j019q17q95j242
63278B60869j470j101m10k12o01o54R8P75L75o34q91pJ098J651J912K341K706
63261B65845K530J923J437J322J378J414J506J809K416L354M443N226N372N186
$$ plain form
63354 602929 626463 650925 676483 703129 730348 757394 783835 809454 833495 854341 870156
63343 870156 879854 883502 882059 876890 869347 860454 850753 840414 829544 818383 807144 795703 783502
63330 783502 769769 753775 734948 713022 688407 662380 636647 612530 590580 570939 553867
63319 553867 539794 529038 521719 517759 516525 516263 514197 507730 495825 479310 460001 439662 419624
63306 419624 400793 383595 368021 353972 341570 330997 322174 314849 308905 304271 300574 297185 293712
63293 293712 290205 286902 283980 281563 279595 277619 275045 271848 268723 266363 264842 263823 263006 262111 260869
63278 260869 259399 258298 257888 257676 257075 256421 256519 257294 257669 257035 256144 256137 257235 258886 260798 263139 265845
63261 265845 268375 270298 271735 273057 274435 275849 277355 279164 281580 284934 289377 294603 299975 305161
63247C05161N382O197P039P298P208P513Q434R463J0227J1015J2238J3761J5130
63234D26066J6241J7349J8576J9775K0879K1999K3094K3807K3806K3222K2635
63223F57449K2589K3039K3404K3270K2917K2799K2663K1813K0371J9514J9856
63212H99684K0290J9196J6343J2764R055M822k20n700j1235j6666k1423k4633
63200I02277k6280k7444k8853k9919k9649k7875k5058k1592j7845j4279j0884
63189F42599p040k603J478M327O423Q877J1974J5174J8151K0852K2899K4000K4740
63176G91851K5889K6999K6827K5273K3766K3359K3469K2994K1729K0078J8021
63165A050255J5121J1258O810K309j816n600r815j5361k1981k8157l2710l5981
$$ plain form
63247 305161 310543 316740 323779 331077 338285 345798 354232 363695 373922 384937 397175 410936 426066
63234 426066 442307 459656 478232 498007 518886 540885 563979 587786 611592 634814 657449
63223 657449 680038 703077 726481 749751 772668 795467 818130 839943 860314 879828 899684
63212 899684 919974 939170 955513 968277 977332 982154 981934 976234 964999 948333 926910 902277
63200 902277 875997 848553 819700 789781 760132 732257 707199 685607 667762 653483 642599
63189 642599 635559 632956 634434 638761 645184 654061 666035 681209 699360 720212 743111 767111 791851
63176 791851 817740 844739 871566 896839 920605 943964 967433 990427 1012156 1032234 1050255
63165 1050255 1065376 1076634 1083444 1085753 1083937 1078337 1068522 1053161 1031180 1003023 970313 934332
63153I34332l8855m1154m1817m0462l7995l5624l3753l1957k9643k6627k3346
63142E53099k0485j8255j6253j4181j2325j0955r638p820n849m657m450m444m039
63129D19748l526l396l559l602l375k941k351j775j406r48K04J839K678J928N23
63114D00041j7M24Q20Q81J379K477L192L027K868L410L742K756J120M66J055J642
63098D29283J570J482J765J732R64K61M50J094J313J200J418J881J937J606J639
63083D49595K220K578K162J486J394J959K581K902L154L645M323M980N719O846
63069D95544Q294R470R990J0370J1454J3225J4837J5915J7108J8906K0685K1666
63057F67464K2268K3643K6057K8725L1181L3828L6913L9924M2383M4547M6836
$$ plain form
63153 934332 895477 854323 812506 772044 734049 698425 664672 632715 603072 576445 553099
63142 553099 532614 514359 498106 483925 471600 460645 451007 443187 437338 432681 428231 423787 419748
63129 419748 416222 412826 409267 405665 402290 399349 396998 395223 393817 392869 393073 394912 397590 399518 400041
63114 400041 400024 400448 401268 402149 403528 406005 409197 412224 415092 418502 422244 425000 426120 426586 427641 429283
63098 429283 430853 432335 434100 435832 436796 437057 437507 438601 439914 441114 442532 444413 446350 447956 449595
63083 449595 451815 454393 456555 458041 459435 461394 463975 466877 470031 473676 477999 482979 488698 495544
63069 495544 503838 513308 523298 533668 545122 558347 573184 589099 606207 625113 645798 667464
63057 667464 689732 713375 739432 768157 799338 833166 870079 910003 952386 996933 1043769
63046A043769M9125N1130N2998N4962N6741N7893N8499N8935N9097N8488N7154
63035A658791N5894N5379N5338N4932N3669N1650M8985M5260L9726L1922K2087
63024B173633J0911r07j2873k4552l5506m5392n3957o0928o5985o8900o9609o8193
63012A677742o4933o0367n5005m8879m1628l3263k4584j6583r447k542M657J1847
63000A337015J8300K3723K8457L2899L7029M0519M3100M4645M5133M4840M4399
62989A740059M4279M4105M2910M0242L6718L3176K9639K5435K0200J4141P358
62978B078262n68j0025k0770l2040m3042n3103o1679o8508p3754p7658q0095q0690
62966A476330p9352p6457p2494o7774o2543n7211n2203m7648m3403l9352l5529
$$ plain form
63046 1043769 1092894 1144024 1197022 1251984 1308725 1366618 1425117 1484052 1543149 1601637 1658791
63035 1658791 1714685 1770064 1825402 1880334 1934003 1985653 2034638 2079898 2119624 2151546 2173633
63024 2173633 2184544 2183637 2170764 2146212 2110706 2065314 2011357 1950429 1884444 1815544 1745935 1677742
63012 1677742 1612809 1552442 1497437 1448558 1406930 1373667 1349083 1332500 1323053 1320511 1325168 1337015
63000 1337015 1355315 1379038 1407495 1440394 1477423 1517942 1561042 1605687 1650820 1695660 1740059
62989 1740059 1784338 1828443 1871353 1911595 1948313 1981489 2011128 2036563 2056763 2070904 2078262
62978 2078262 2077694 2067669 2046899 2014859 1971817 1918714 1857035 1788527 1714773 1637115 1557020 1476330
62966 1476330 1396978 1320521 1248027 1180253 1117710 1060499 1008296 960648 917245 877893 842364
62955H42364l2010k8885k6365k4563k3111k1347j9155j7291j6491j6479j6372
62944F00295j5832j5222j4680j3850j2665j1654j1103j0566r636q574p688o710
62932D62115n455m465m168l960l018j801j545k382l032k559j464p54p79j341k151
62917D23241k732k594j953j681k110k576k600k737l535m354m191l255k681k825
62903C83417k890k379j934k289l006k938j741l70K6n95j182q74OM53R2m32m23
62886C62941l6Q4k78p08p42l51M7l8o27j068p38J5J12p04j282n84Q07J450R84
62867C59284K81j30o73j573k157j862j120o55m89k96k28n53q36m22M06O60J65
62850C49802o7N95J295R34p3k99O61J618J526Q19M99O03M11k89r35j166j175j100
$$ plain form
62955 842364 810354 781469 755104 730541 707430 686083 666928 649637 633146 616667 600295
62944 600295 584463 569241 554561 540711 528046 516392 505289 494723 485087 476513 468825 462115
62932 462115 456660 452195 448027 444067 441049 439248 437703 435321 432289 429730 428266 427512 426733 425392 423241
62917 423241 420509 417915 415962 414281 412171 409595 406995 404258 400723 396369 392178 388923 386242 383417
62903 383417 380527 378148 376214 373925 370919 367981 366240 365870 365896 365301 364119 363245 363251 363704 363796 363364 362941
62886 362941 362905 362989 362711 362003 361261 360910 360957 360919 360292 359224 358486 358501 358613 357909 356627 356043 356850 358300 359284
62867 359284 359565 359435 358762 357189 355032 353170 352050 351395 350906 350610 350382 349829 348993 348571 348977 349637 349802
62850 349802 349735 350330 351625 352559 352486 352187 352848 354466 355992 356811 357310 357913 358324 358035 357100 355934 354759 353659
62832C53659p54j89J78K44L95O89N21l55j112q49J11P21P79J138K335L777M519
62815C65807M322L666L197L369M262N414O104O018N533N237N442O165P240Q286
62801D40062Q905R131R466J0254J1255J2070J2712J3534J4738J6272J8070K0090
62789E96559K2176K4168K6206K8700L1896L5605L9437M3208M7062N1225N5717
62778A001959O0316O4774O8997P2992P6711P9979Q2506Q3801Q3214Q0287P5135
62767A830671O8267N9937M9879L7837K4180R766m730j9105l3207m6465n7999o7261
62755A851770p4390p9890q3903q5997q5761q3503q0116p6223p1803o6775o1630
62744A001779n7059n3120m9186m4812m0300l6200l2596k9153k5693k2352j9264
$$ plain form
62832 353659 352905 352716 352894 353138 353533 354222 354743 354388 353276 352427 352538 353259 354038 355176 357511 361288 365807
62815 365807 370129 373795 376992 380361 384623 390037 396141 402159 407692 412929 418371 424536 431776 440062
62801 440062 448967 458098 467564 477818 489073 501143 513855 527389 542127 558399 576469 596559
62789 596559 618735 642903 669109 697809 729705 765310 804747 847955 895017 946242 1001959
62778 1001959 1062275 1127049 1196046 1269038 1345749 1425728 1508234 1592035 1675249 1755536 1830671
62767 1830671 1898938 1958875 2008754 2046591 2070771 2080537 2075807 2056702 2023495 1977030 1919031 1851770
62755 1851770 1777380 1697490 1613587 1527590 1441829 1358326 1278210 1201987 1130184 1063409 1001779
62744 1001779 944720 891600 842414 797602 757302 721102 688506 659353 633660 611308 592044
62733E92044j6486j4185j2540j1303r863p996o188m943m049k951j620m80M03J486
62719E01329K950M423N705P185R042J0634J1427J2147J4170J7644K1137K3421
62707F41214K4958K7147L0610L4829L9133M3300M7263N0985N4856N9514O4956
62696A118765P0176P4151P6889P9028Q0748Q1612Q1346Q0052P7500P2918O5815
62685A959000N6563M5738L3372J9324M064j1483k6727m1452n5210o7249p7030
62674A838910q4399q9276r1719r2221r1338q8982q4789p9211p3488o8202o2754
62663I32531n6697n0808m6039m2072l7908l3470k9678k6985k4842k2688k0628
62652E40716j8855j7123j5202j3338j1873j0732r673q744q159p963q024q142p935
$$ plain form
62733 592044 575558 561373 548833 537530 527667 519671 513483 508540 504491 501540 499920 499440 499843 501329
62719 501329 504279 508702 514407 521592 530634 541268 552695 564842 579012 596656 617793 641214
62707 641214 666172 693319 723929 758758 797891 841191 888454 939439 994295 1053809 1118765
62696 1118765 1188941 1263092 1339981 1419009 1499757 1581369 1662715 1742767 1820267 1893185 1959000
62685 1959000 2015563 2061301 2094673 2113997 2118061 2106578 2079851 2038399 1983189 1915940 1838910
62674 1838910 1754511 1665235 1573516 1481295 1389957 1300975 1216186 1136975 1063487 995285 932531
62663 932531 875834 825026 778987 736915 699007 665537 635859 608874 584032 561344 540716
62652 540716 521861 504738 489536 476198 464325 453593 443920 435176 427017 419054 411030 402888 394953
62639C94953o943n145l265k137j804j511o62L96P56L2j107j625j304r46j319k159
62623C66210k558k134j367p40r4R09K055K759K854K786L025L469L646L369L017
62608C87206L214M293O097Q203J0213J1920J3361J4776J6384J8151J9854K1380
62596E35052K2854K4490K6426K8696L1152L3451L5375L7124L8902M0227M0136
62585H93885L8277L5185L1329K6484K0500J3958P360K93p686j5693k2165k6746
62573I94981l0516l4252l7512l9705m1008m1698m1377l9614l6779l3661l0645
62562E88214k7764k5123k2709k0149j7310j4777j3171j2164j0858q987p188o052
62550D01962n437m868m222l782l766l900l558k401r02P4K67K58N81J050J278J376
$$ plain form
62639 394953 388010 382865 379600 377463 375659 374148 373486 373882 374638 374670 373563 371938 370634 369688 368369 366210
62623 366210 363652 361518 360151 359411 359317 360226 362281 365040 367894 370680 373705 377174 380820 384189 387206
62608 387206 390420 394713 400810 409013 419226 431146 444507 459283 475667 493818 513672 535052
62596 535052 557906 582396 608822 637518 668670 702121 737496 774620 813522 853749 893885
62585 893885 932162 967347 998676 1025160 1045660 1059618 1066978 1067271 1059585 1043892 1021727 994981
62573 994981 964465 930213 892701 852996 811988 770290 728913 689299 652520 618859 588214
62562 588214 560450 535327 512618 492469 475159 460382 447211 435047 424189 415202 408014 401962
62550 401962 396525 391657 387435 383653 379887 375987 372429 370028 369126 369200 369467 369725 370306 371356 372634 374010
62534C74010J718K281K805L319M042M877N539O057O714P624Q853J0684J3198J5726
62520D67447J7482J8716K0476K3117K5896K8243L0644L3674L6900L9529M1642
62509G83766M3897M6160M7354M6828M5109M2922M0041L5717K9857K3148J6057
62498A200856Q357o4q598j6459k3572l0233l6122m0290m2234m2348m1151l8719
62486H89423l5278l1695k8627k5506k1247j5872j0692o810m066j724M57K235L513
62473G14111M485N274N729N463M056J431j808m751p094r369j2082j4965j7402
62460F73078j9269k0846k2115k2662k2338k1610k1074k0833k0465j9436j7608
62449D44822j5383j3363j1692r927p757n626m262l661l030j851n26K59M69O41
$$ plain form
62534 374010 375728 378009 380814 384133 388175 393052 398591 404648 411362 418986 427839 438523 451721 467447
62520 467447 484929 503645 524121 547238 573134 601377 632021 665695 702595 742124 783766
62509 783766 827663 873823 921177 968005 1013114 1056036 1096077 1131794 1161651 1184799 1200856
62498 1200856 1209213 1209149 1200551 1184092 1160520 1130287 1094165 1053875 1011641 969293 928142 889423
62486 889423 854145 822450 793823 768317 747070 731198 720506 713696 709630 707906 708363 710598 714111
62473 714111 718596 723870 729599 735062 739118 740549 738741 733990 726896 717527 705445 690480 673078
62460 673078 653809 632963 610848 588186 565848 544238 523164 502331 481866 462430 444822
62449 444822 429439 416076 404384 394457 386700 381074 376812 373151 370121 368270 367744 368003 368472 369113
62435C69113J077J541J664J400R87O74N01K77k25r60j688k416l541n151o461o442
62419C50350n138l799l474l877m052l746l545l778l991l685l043k602k491k411
62405C00718k116j601q56J25J085J495J108L49J8N11J401J874J536Q38N73J035
62389C08093J741K052J834J494J477J911K667L493M079M189L859L406L213L520
62375C47028M325N399O358O928P235P665Q458R475J0484J1450J2458J3456J4300
62362D65019J5058J6066J7604J9597K1719K3697K5526K7491K9953L2984L6114
62351G30828L8595M0119M1071M1885M2185M0893L7290L1710K5121J8238J1285
62340A099220M388k136p889j2659j6548j9951k3343k6894l0316l3130l5062l6022
$$ plain form
62435 369113 370190 371731 373395 374795 375782 376456 376957 377234 377009 376049 374361 371945 368404 363253 356792 350350
62419 350350 345212 341413 337939 334062 330010 326264 322719 318941 314950 311265 308222 305620 303129 300718
62405 300718 298602 297001 296145 296270 297355 298850 299958 300307 300325 300836 302237 304111 305647 306485 307058 308093
62389 308093 309834 311886 313720 315214 316691 318602 321269 324762 328841 333030 336889 340295 343508 347028
62375 347028 351353 356752 363110 370038 377273 384938 393396 402871 413355 424805 437263 450719 465019
62362 465019 480077 496143 513747 533344 555063 578760 604286 631777 661730 694714 730828
62351 730828 769423 809542 850613 892498 934683 975576 1012866 1044576 1069697 1087935 1099220
62340 1099220 1103608 1101472 1093583 1080924 1064376 1044425 1021082 994188 963872 930742 895680 859658
62328H59658l5870l4477l2042k9127k6331k4005k2167k0512j8629j6496j4719
62317E85283j3943j4041j4230j4047j3749j3700j3744j3504j2940j2312j1731
62306D37342j1063j0136q918p608o603o138n910n410m659m139l825k984j362P1
62292C58658K83l46n45J23R71J448J741J978J847J407J377K043K593K223J399
62277C77200J254K036K933L341L499L845M334M738N121N721O548P424Q353R643
62263D45990J1560J3872J5906J7200J8125J9608K2138K5309K8533L1780L5224
62252F85245L8514M0963M2467M3612M4681M5049M3808M0671L5950L0024K3156
62241A114140J5641P774k12p915j4726k0369k5344l0375l5398l9498m1948m2955
$$ plain form
62328 859658 823788 789311 757269 728142 701811 677806 655639 635127 616498 600002 585283
62317 585283 571340 557299 543069 529022 515273 501573 487829 474325 461385 449073 437342
62306 437342 426279 416143 407225 399617 393014 386876 380966 375556 370897 366758 362933 359949 358587 358658
62292 358658 358941 358595 358050 358173 359144 360592 362333 364311 366158 367565 368942 370985 373578 375801 377200
62277 377200 378454 380490 383423 386764 390263 394108 398442 403180 408301 414022 420570 427994 436347 445990
62263 445990 457550 471422 487328 504528 522653 542261 564399 589708 618241 650021 685245
62252 685245 723759 764722 807189 850801 895482 940531 984339 1025010 1060960 1090984 1114140
62241 1114140 1129781 1137555 1137343 1129428 1114702 1094333 1068989 1038614 1003216 963718 921770 878815
62229H78815m3264m3362m3168m2261m0212l6999l3314l0123k7657k5135k1862
62218D91458j8306j5532j3771j2250j0501r066q515q421p891o775n681m927m185
62205C65637l220k327j774j287n60J15J96j94k56N49J913L179M109M871N548O015
62189C82514O249O434O681O935P228P763Q557R273R642R833J0086J0186R734Q861
62175D99976Q146P764P179O030M864M601N494P023Q686J0506J2697J5254J7980
62162F16200K0708K3338K5794K7985K9783L0952L1158L0092K7591K3788J9130
62151I06519J4108Q890L443j939o566j0084j3004j6064j9301k2178k4484k6490
62139G92850k8171k8871k8079k6130k3753k1232j8361j5038j1527q166n130k455
$$ plain form
62229 878815 835551 792189 749021 706760 666548 629549 596235 566112 538455 513320 491458
62218 491458 473152 457620 443849 431599 421098 412032 403517 395096 387205 380430 374749 369822 365637
62205 365637 362417 360090 358316 357029 356469 356584 356780 356586 356330 356879 358792 361971 366080 370951 376499 382514
62189 382514 388763 395197 401878 408813 416041 423804 432361 441634 451276 461109 471195 481381 491115 499976
62175 499976 508122 515886 523065 529095 533959 538560 544054 551077 559763 570269 582966 598220 616200
62162 616200 636908 660246 686040 714025 743808 774760 805918 836010 863601 887389 906519
62151 906519 920627 929517 932960 931021 924455 914371 901367 885303 866002 843824 819340 792850
62139 792850 764679 735808 707729 681599 657846 636614 618253 603215 591688 583522 578392 575937
62127E75937q0K164M390O467Q130R296J0152J0903J1563J2057J2364J2429J1992
62114F87764J0725Q680O472M823L906L333K846K664K966L291K852J408m48j834
62100G39448k170j350K97K190L951N753P882J0020J1376J1566J0935R906Q540
62087H18344P042O085O103O563O442N419M185L678M257N598P044Q095Q804R651
62073I07310J0906J2306J3502J4565J5678J6593J6815J6228J5159J3989J3095
62062A066146J2949J3652J4495J4622J4174J4125J4859J5577J5403J4375J2876
62051A223253J0731P519L480o07m353q026j1936j6047k0210k4337k8224l1573
62039A099670l4264l6460l8345l9919m0964m1051l9765l7281l4519l2250l0191
$$ plain form
62127 575937 575857 578021 582411 588878 597008 606304 616456 627359 638922 650979 663343 675772 687764
62114 687764 698489 707169 713641 718464 722370 725703 728549 731213 734179 737470 740322 741730 741282 739448
62100 739448 737278 735928 736225 738415 742366 748119 756001 766021 777397 788963 799898 809804 818344
62087 818344 825386 831471 837574 844137 850579 855998 860183 863861 868118 873716 880760 888855 897659 907310
62073 907310 918216 930522 944024 958589 974267 990860 1007675 1023903 1039062 1053051 1066146
62062 1066146 1079095 1092747 1107242 1121864 1136038 1150163 1165022 1180599 1196002 1210377 1223253
62051 1223253 1233984 1241503 1244983 1244376 1240023 1231997 1220061 1204014 1183804 1159467 1131243 1099670
62039 1099670 1065406 1028946 990601 950682 909718 868667 828902 791621 757102 724852 694661
62028F94661k7510k4264k1506j9721j7893j4882j1224q766q480r364r649q607
62016E12795o921n678n383n771o209o213n748n066m374l662k860j945r19J81J218
62001D53445K053K706L280L794M236M724N290N548M975L567J883L25j172k592
61987D92062l474l609l645m368n669o800p513q204q942r134q457p473o895o704
61973D01175o356n528m283k902j871j743k430k957k441j237n45q96j606j740j166
61958C63474l89J34L09K81L00O73J572K952M535N835O295N804N076N166O437Q280
61942D16734R920J1211J2433J3721J4959J6071J7109J8115J9162K0304K1321K1729
61930F12789K1328K0560J9955J9371J8201J6259J4067J2160J0560Q979P157M821
$$ plain form
62028 694661 667151 642887 621381 601660 583767 568885 557661 548895 540415 531051 521402 512795
62016 512795 505874 500196 494813 489042 482833 476620 470872 465806 461432 457770 454910 452965 452046 452227 453445
62001 453445 455498 458204 461484 465278 469514 474238 479528 485076 490051 493618 495501 495826 494654 492062
61987 492062 488588 484979 481334 476966 471297 464497 456984 448780 439838 430704 422247 414774 407879 401175
61973 401175 394819 389291 385008 382106 380235 378492 376062 373105 370664 369427 368882 367986 366380 364640 363474
61958 363474 363085 363219 363528 363809 364109 364782 366354 369306 373841 379676 385971 391775 396851 402017 408454 416734
61942 416734 426654 437865 450298 464019 478978 495049 512158 530273 549435 569739 591060 612789
61930 612789 634117 654677 674632 694003 712204 728463 742530 754690 765250 774229 781386 786207
61918G86207J743j832m981o744o986o466o035n867n439m161j914R02L815O565
61904G48807R028J1077J2668J3885J4618J4397J2882J0403P513M142k02n282r923
61891H44013j3323j5895j8306k0271k1134k1213k1592k2520k2971k2037k0031
61880F24720j7923j6259j5094j4448j4255j4158j3829j3338j2817j1991j0463
61869D70145q362o330m869l985l455k984k088k43K562N584P885R180R997J1020
61855D84057J2388J3750J4983J6546J8987K2256K5699K8634L0681L1756L2112
61844G31849L2407L3143L3932L3750L2092K9442K6445K3136J9238J4677R453L553
61832A023117k446p265j0065j1376j2136j2258j0991q417n489k618P03M630Q352
$$ plain form
61918 786207 787950 786118 781137 774393 767407 760941 754906 749039 743600 739439 737525 738427 742242 748807
61904 748807 757835 768912 781580 795465 810083 824480 837362 847765 855278 859420 859218 853936 844013
61891 844013 830690 814795 796489 776218 755084 733871 712279 689759 666788 644751 624720
61880 624720 606797 590538 575444 560996 546741 532583 518754 505416 492599 480608 470145
61869 470145 461783 455453 450584 446599 443144 440160 438072 437829 440391 445975 453860 463040 473037 484057
61855 484057 496445 510195 525178 541724 560711 582967 608666 637300 667981 699737 731849
61844 731849 764256 797399 831331 865081 897173 926615 953060 976196 995434 1010111 1019564 1023117
61832 1023117 1020671 1013406 1003341 991965 979829 967571 956580 948163 942674 940056 940759 945389 953741
61819I53741J1130J2980J3808J2771R395M550n56n931j2301j9380k5735l0427
61807I24045l3859l6684l8717l9399l8795l7463l5705l3390l0486k7319k4301
61796E47927k1599j9137j6782j4477j2370j0784r947r644r218q104o365m663l556
61783D01281k967k426j774j309j241j312j155q24o29o51p23q19j096j465j507
61768C81383j000k86O0j57o54j042j080p02l9N76Q28P17M69K16m6j75J08P66J322
61749C81264J395J165R78O99r0j306k198k150j342m47oj95q17j394j511j244r39
61732C71862n07N26K058L052K750J750J308J831K700L306L511L265K574J963K160
61717D04109L110L968M197M137M157M020L400K535J812J171L98l66q54j202j757
$$ plain form
61819 953741 964871 977851 991659 1004430 1013825 1018375 1017819 1011888 999587 980207 954472 924045
61807 924045 890186 853502 814785 775386 736591 699128 663423 630033 599547 572228 547927
61796 547927 526328 507191 490409 475932 463562 452778 442831 433187 423969 415865 409500 404837 401281
61783 401281 398314 395888 394114 392805 391564 390252 389097 388273 387644 386993 386270 385451 384355 382890 381383
61768 381383 380383 380097 380157 380000 379346 378304 377224 376522 376483 377059 377887 378604 379073 379289 379243 379068 379176 379942 381264
61749 381264 382659 383824 384802 385501 385411 384105 381907 379757 378415 377968 377962 377767 376950 375556 374045 372801 371862
61732 371862 371355 371881 373939 376991 379741 381491 382799 384630 387330 390636 394147 397412 399986 401949 404109
61717 404109 407219 411187 415384 419521 423678 427698 431098 433633 435445 436616 437014 436648 435794 434592 432835
61702D32835k565l348l897m147m027l533k796j926r49l7M73M98L92N46R74J436
61686D09929J667J347K84j120j960j649m43R73K042K397J989J387J339J655J174
61671D21011o23k599l182k190q11j77n46j456k082j796q88l57n15n29P9M37j42
61654D03634o02L47J879K003O21k97K67J128J151R22J217J472R73L20M52J164
61638D16651J744K305L165L662K957J525N91L50%p18j301j693k486l706m534m520
61622D13992m106l706l116k250j603j500j435p48M12J204R66k55j777k766k904
61607C90408k663k721l121l434l587l906m325m290l674l105l043l201l225l336
61593C42777l717l876l360k646k505k737k381j242k92l70j122j607j485j127r14
$$ plain form
61702 432835 430270 426922 423025 418878 414851 411318 408522 406596 405647 405610 406083 406581 406973 407519 408493 409929
61686 409929 411596 412943 413227 412107 410147 408498 408055 409028 411070 413467 415456 416843 418182 419837 421011
61671 421011 420388 417789 414607 412417 411606 411429 410883 409427 407345 405549 404661 404304 403789 403260 403339 403776 403634
61654 403634 403032 403379 405258 407261 407882 407585 407852 408980 410131 411053 412270 413742 414715 415035 415487 416651
61638 416651 418395 420700 423865 427527 430484 432009 432600 432950 432950 432232 430931 429238 426752 423046 418512 413992
61622 413992 409886 406180 403064 400814 399211 397711 396276 395528 395940 397144 398110 397855 396078 393312 390408
61607 390408 387745 385024 381903 378469 374882 370976 366651 362361 358687 355582 352539 349338 346113 342777
61593 342777 339060 335184 331824 329178 326673 323936 321555 320313 320021 319651 318529 316922 315437 314310 313396
61578C13396q76r23j050j277j614k025k299k079j248k32L32K43j14l13l68n41
61562B99012q81j159j212j151j130j087q23l33P9J02k05m28k30K84O77N83k4q51
61544B91223j405j243l22P75J192O32k88o11J2J025J552J197K93m40n44k14j9
61527B92815k84p81j145j313j486j807k320k974l506l500k916k309k189k298k030
61512B61957j403j056j224j449j361j156j017p49l59l74r97j513j165k85J68j2
61496B48005j48K19P78J044R04M30k91j032j530j787j865j502m98N76Q13K33j18
61479B44231L58J026J149R78J060J146P23R6ML13J77m91p15N7J073J364R69N66
61461B54084M40M68O82J112J354R85L26J14M78Q32Q30P68Q69Q50N69M36P15Q78
$$ plain form
61578 313396 312520 311597 310547 309270 307656 305631 303332 301253 300005 299773 300105 300348 300234 299921 299553 299012
61562 299012 298131 296972 295760 294609 293479 292392 291569 291236 291315 291417 291212 290784 290554 290838 291515 292098 292074 291223
61544 291223 289818 288575 288253 289028 290220 290852 290564 289953 289965 290990 292542 293739 294032 293592 293048 292834 292815
61527 292815 292531 291750 290605 289292 287806 285999 283679 280705 277199 273699 270783 268474 266285 263987 261957
61512 261957 260554 259498 258274 256825 255464 254308 253291 252542 252183 251809 250812 249299 248134 247849 248017 248005
61496 248005 247857 248076 248854 249898 250802 251232 250941 249909 248379 246592 244727 243225 242727 243303 244116 244349 244231
61479 244231 244589 245615 246764 247742 248802 249948 250671 250767 250771 251084 251261 250770 250055 250112 251185 252549 253518 254084
61461 254084 254524 254992 255674 256786 258140 259125 259451 259565 260043 260875 261705 262473 263342 264192 264761 265197 265912 266790
61443B66790K99o80j124p82l11j19K36J209K351K828K493J958J730J768J869K008
61427B82523K115J926J407J032J288J873J885R54q3o0J065K084J989J102M42L71
61411C01913L98K17J90O59J285J476J043J22j246k867m065m166l421k809k844
61396B85885l020k640j796j131r63j071j222j441j639j394m23Q09J323O29o33
61381B71273j280q23J11O14M65N4l22o08n81J13J289K117K057J621J752K553L167
61364B83572K866J872R20L84J31M5K95J046K098K996L509L896M534N318N679N393
61348C24554N108N685P030Q029P814O766N964N858N864N195L811K497K154K980
61334C99309M232M850M481L756L394L242K570J213j56r18j238j612k165k727l266
$$ plain form
61443 266790 267089 266409 265285 264503 264192 264073 264309 265518 267869 270697 273190 275148 276878 278646 280515 282523
61427 282523 284638 286564 287971 289003 290291 292164 294049 295003 294920 294860 295925 298009 299998 301100 301542 301913
61411 301913 302311 302528 302718 303377 304662 306138 307181 307303 306057 303190 299125 294959 291538 288729 285885
61396 285885 282865 280225 278429 277298 276335 275264 274042 272601 270962 269568 269145 269954 271277 271906 271273
61381 271273 269993 269170 269281 269895 270360 270414 270092 269484 268903 269016 270305 272422 274479 276100 277852 280405 283572
61364 283572 286438 288310 289230 289614 289745 289790 290085 291131 293229 296225 299734 303630 308164 313482 319161 324554
61348 324554 329662 335347 342377 350406 358220 364986 370950 376808 382672 387867 391678 394175 396329 399309
61334 399309 403541 408391 412872 416628 420022 423264 425834 427047 426891 425973 424735 423123 420958 418231 414965
61319D14965l752l788k949j517l76pJ3L07Q98J415J867K674L974N286O079O324
61303D31413O303O131N886N905O450P017O592M887K834J430N24o33k049l010l412
61288D76268m034n211o100n870m965m459m649n028n328n672n833n183l622j846
61274D08468n07M12J163J750K150K573L174L746M014M003L918L946M313N190O305
61259D54618O942O711O158O236P208Q329Q645P980P060O681O846O820O059M853
61245E51146L807K978J946N91o90j559k112k570l049l654m361m756m454l819l761
61230E25683m553n426n557m895l736k179m81P11J127J392K150L064L365L055K805
61215E16525K963L349L860M496M944M876M604M639M699L998K577J485J369J730
$$ plain form
61319 414965 411213 407425 404476 402959 402583 402576 402589 402896 403794 405209 407076 409750 413724 419010 425089 431413
61303 431413 437716 443847 449733 455638 462088 469105 475697 480584 483418 484848 485372 484739 482690 479680 476268
61288 476268 472234 467023 460923 455053 450088 445629 440980 435952 430624 424952 419119 413936 410314 408468
61274 408468 407961 408373 409536 411286 413436 416009 419183 422929 426943 430946 434864 438810 443123 448313 454618
61259 454618 461560 468271 474429 480665 487873 496202 504847 512827 519887 526568 533414 540234 546293 551146
61245 551146 554953 557931 559877 560468 559778 558219 556107 553537 550488 546834 542473 537717 533263 529444 525683
61230 525683 521130 515704 510147 505252 501516 499337 498856 499567 500694 502086 504236 507300 510665 513720 516525
61215 516525 519488 522837 526697 531193 536137 541013 545617 550256 554955 558953 561530 563015 564384 566114
61201E66114J902J992K377K957L473M117N234O750Q336R891J1400J2640J3423
61188F50606J3889J4111J3660J2096R736P474N892M926M291L777L148K214J119
61175G46939K49k58p00j385k275l095l663m032m374m840n475o262p258q466r556
61160F85549r980r649r256r508j0211j0494r962r098q408p750o802n757n082m765
61146E68827m300l416k392j730j732k433l625m860n733o224o567o819o774o326
61132E05896n546m408k816j034M09J402K446L817N042N642N967O646P674Q711
61118E39848J0058J2374J5430J8094J9782K1017K2201K2776K2279K1488K1608
61107G46955K2688K3665K3709K2838K1354J9468J7482J5632J3693J1233Q331N444
$$ plain form
61201 566114 568016 570008 572385 575342 578815 582932 588166 594916 603252 613143 624543 637183 650606
61188 650606 664495 678606 692266 704362 714098 721572 727464 732390 736681 740458 743606 745820 746939
61175 746939 747188 746930 746230 744845 742570 739475 735812 731780 727406 722566 717091 710829 703571 695105 685549
61160 685549 675569 665920 656664 647156 636945 626451 616489 607391 598983 591233 584431 578674 573592 568827
61146 568827 564527 561111 558719 556989 555257 552824 549199 544339 538606 532382 525815 518996 512222 505896
61132 505896 500350 495942 493126 492092 492501 493903 496349 500166 505208 510850 516817 523463 531137 539848
61118 539848 549906 562280 577710 595804 615586 636603 658804 681580 703859 725347 746955
61107 746955 769643 793308 817017 839855 861209 880677 898159 913791 927484 938717 947048 952492
61095I52492K596o52m306p647j0166j2154j4055j5758j7049j8238j9773k1380
61083H13910k2266k2091k1251k0193j8986j7682j6679j6258j6041j5303j3811
61072F13349j2053j0550r305q146p216o698o187m970l068j427p68p13m61J11O58
61057E42556J314K561M198N356N810O482Q160J0324J1844J2378J2483J2718J3362
61044F49546J4795J7217J9991K2047K3153K4095K5387K6583K7368K8479L0811
61033I09472L4018L6981L9308M1479M3661M5490M7111M9268N2053N4599N6721
61022A410161N9841O5509P3818Q4314R7700J15465J38202J65463J96740K31265
61012B638478K67195L02569L37139L71848M06835M42172M81058N30272N96514
$$ plain form
61095 952492 955088 954436 950130 942483 932317 920163 906108 890350 873301 855063 835290 813910
61083 813910 791644 769553 748302 728109 709123 691441 674762 658504 642463 627160 613349
61072 613349 601296 590746 581441 573295 566079 559381 553194 548224 545156 543729 542961 542248 541787 541898 542556
61057 542556 543870 546431 550629 555985 561795 568277 576437 586761 598605 610983 623466 636184 649546
61044 649546 664341 681558 701549 723596 746749 770844 796231 822814 850182 878661 909472
61033 909472 943490 980471 1019779 1061258 1104919 1150409 1197520 1246788 1298841 1353440 1410161
61022 1410161 1470002 1535511 1609329 1693643 1791343 1906808 2045010 2210473 2407213 2638478
61012 2638478 2905673 3208242 3545381 3917229 4324064 4766236 5247294 5777566 6374080
61003F374080O83710P93550R24665J069173J213411J344753J451769J509116J465819
60994A6830046J267110R05902M54904L7271k44601l58045l31360k16925p5266
60985A8269036J6850k5206k49303o22509j038964j380308j576677j622805j553688
60976A0216426j414182j243197j068802r06555p61522o34150n24696m32945l56940
60967B873437k94130k42940k02207j70155j45007j25703j11132r9399q8810p8974
60957A314980p0193o2358n5087m8321m2052l6079l0685k6963k5607k5777k5899
60946H65959k5249k4137k2911k1504j9863j8193j6804j5972j5761j5790j5507
60935F54268j4902j4558j4785j5238j5538j5660j5450j4538j3153j2274j2339
$$ plain form
61003 6374080 7057790 7851340 8776005 9845178 11058589 12403342 13855111 15364227 16830046
60994 16830046 18097156 19003058 19457962 19495233 19250632 18892587 18561227 18344302 18269036
60985 18269036 18285886 18260680 18011377 17388868 16349904 14969596 13392919 11770114 10216426
60976 10216426 8802244 7559047 6490245 5583690 4822168 4188018 3663322 3230377 2873437
60967 2873437 2579307 2336367 2134160 1964005 1818998 1693295 1582163 1482764 1393954 1314980
60957 1314980 1244787 1182429 1127342 1079021 1036969 1000890 970205 943242 917635 891858 865959
60946 865959 840710 816573 793662 772158 752295 734102 717298 701326 685565 669775 654268
60935 654268 639366 624808 610023 594785 579247 563587 548137 533599 520446 508172 495833
60924D95833j2501j1812j0476r248q257p309o718o811o975o288m973m230m619
60911C95616n407n627n037l958k748j662q18j58L20M24J43p4J66O25Q15O76M71
60894C73767J97k83p51q14m91j36J26L97N69L63k05p85j125j245j310j516j894
60877C64864k081j618p34l24p66j310j108l30K38K46k08j005j746j621m26P51
60861C52822P47j15o22m49k69l49k28J96M09K28O9Q5k1k05L8P05J070P54K96L47
60841C55508Q91J555K071K198J688O10o43j715k256j818m11R68J229N08j35k70
60825C59978l26l77J35J191J867J574Q32L20J12J45M89P80L35o52j008l15K34
60808C65314n31k126l250l515l411l174k793k649l147l876m023l522l011k788
$$ plain form
60924 495833 483332 471520 461044 451796 443539 436230 429512 422701 415726 409438 404465 400235 395616
60911 395616 390209 384582 379545 375587 372839 371177 370359 370201 370521 370945 371088 371014 371180 371805 372620 373296 373767
60894 373767 373964 373681 372930 372116 371625 371489 371615 372012 372581 372944 372739 371954 370829 369584 368274 366758 364864
60877 364864 362783 361165 360431 360107 359341 358031 356923 356593 356831 357077 356869 355864 354118 352497 352071 352822
60861 352822 353569 353454 352832 352383 352114 351765 351537 351733 352142 352370 352439 352524 352503 352298 352336 353041 354111 354865 355161 355508
60841 355508 356399 357954 360025 362223 363911 364521 363878 362163 359907 358089 357678 358646 359875 360383 360248 359978
60825 359978 359652 359275 359410 360601 362468 364042 364874 365194 365306 365451 365940 366720 367055 366403 365395 365080 365314
60808 365314 364783 362657 359407 355892 352481 349307 346514 343865 340718 336842 332819 329297 326286 323498
60794C23498k567k252k267k837l492l519k761j806j406j646j753j043Q8N65O8
60779B96870o21p70n05j13N99J639K256J865J070R74J722K455K626K621L018L819
60763C19525M542M775M490L996L576L216K841K725L176L924M298M169L967L736
60749C72956L043K089J905K834L726L467K479J824J596J225P61N73K18j086k988
60734C94622m255m490m471m685m711m309m053m376m840m851m487m181m058m039
60720C32816m084m032l557k641j763j389j472j633j568j270r94j031j217r16J22
60705C05371J109J046J48l45K54J369K173K532K711K824L045L734M871N752N706
60690C42300M826L706K809K369K549L191L672L454K620J727J215J198J516J767
$$ plain form
60794 323498 320931 318679 316412 313575 310083 306564 303803 301997 300591 298945 297192 296149 296237 296802 296870
60779 296870 296249 295479 294974 294861 295460 297099 299355 301220 302290 303264 304986 307441 310067 312688 315706 319525
60763 319525 324067 328842 333332 337328 340904 344120 346961 349686 352862 356786 361084 365253 369220 372956
60749 372956 375999 378088 379993 382827 386553 390020 392499 394323 395919 397144 397905 398478 398696 397610 394622
60734 394622 390367 385877 381406 376721 372010 367701 363648 359272 354432 349581 345094 340913 336855 332816
60720 332816 328732 324700 321143 318502 316739 315350 313878 312245 310677 309407 308413 307382 306165 305249 305371
60705 305371 306480 307526 307674 307329 307583 308952 311125 313657 316368 319192 322237 325971 330842 336594 342300
60690 342300 347126 350832 353641 356010 358559 361750 365422 368876 371496 373223 374438 375636 377152 378919
60676C78919J596J172J087J494J733J223M48M95J695L195L959L838L558L863M797
60661D13072N732O011N624N178N191N627O235P028Q103R125R499R243R244J0314
60647E15226J2187J3792J4484J4602J4770J4970J4660J3580J2071J0588R235P871
60635F68036O347M537K404K30j470k509l335m480n895p073p784q308q960r655
60621F22085j0038r873r249q512q047q034q356q712q781q365p621p107p268p787
60607E04335p846p172o425o230o355o257o067o380p241p980q015p357o303n180
60593D09527m393m157m108l660k825k280k463l051l485l568l378k978k522k266
60579C64393k219k028j448p22k54o6J58O65J397K105K558K777L091L866N004N942
$$ plain form
60676 378919 380515 381687 382774 384268 386001 387224 387672 388167 389862 393057 397016 400854 404412 408275 413072
60661 413072 418804 424815 430439 435617 440808 446435 452670 459698 467801 476926 486425 495668 504912 515226
60647 515226 527413 541205 555689 570291 585061 600031 614691 628271 640342 650930 660165 668036
60635 668036 674383 678920 681324 681554 680084 677575 674240 669760 663865 656792 649008 640700 631740 622085
60621 622085 612047 602174 592925 584413 576366 568332 559976 551264 542483 534118 526497 519390 512122 504335
60607 504335 496489 489317 482892 476662 470307 464050 457983 451603 444362 436382 428367 421010 414707 409527
60593 409527 405134 400977 396869 393209 390384 388104 385641 382590 379105 375537 372159 369181 366659 364393
60579 364393 362174 360146 358698 357976 357722 357656 357814 358479 359876 361981 364539 367316 370407 374273 379277 385219
60563C85219O251O176O344O980P503P042N374L235J535L82q10k243l247l203k468
60548D24070j882j628j178k06J016K180L350M685O114P408Q317Q642Q417P925
60534D77230P290O226M530K549O71j280l526n474o235n879n276m720l695k145
60520D60266q81k92K76J286K041J715P04J28M72J449K762M222N420O004O236O689
60504D98497P573Q732J0063J1513J2970J4565J6729J9450K1972K3751K5248K7100
60492F98163K8988L0173L0694L0925L0169K6947K0832J3016M767l727j2579k1214
60480H77154k8822l5124m0034m2973m3276m1134l7649l3909l0328k6803k3221
60469D93881j9789j6914j4746j2915j0974r110q022p992q377q273p422o245n236
$$ plain form
60563 385219 391470 397646 403990 410970 418473 425515 430889 434124 435659 436041 435231 432988 429741 426538 424070
60548 424070 422188 420560 419382 419176 420192 422372 425722 430407 436521 443929 452246 460888 469305 477230
60534 477230 484520 490746 495276 497825 498496 497216 493690 488216 481981 476102 470826 466106 462411 460266
60520 460266 459385 459093 459369 460655 462696 464411 465115 465243 465715 467164 469926 474148 479568 485572 491808 498497
60504 498497 506070 514802 524865 536378 549348 563913 580642 600092 622064 645815 671063 698163
60492 698163 727151 757324 788018 818943 849112 876059 896891 909907 914674 910947 898368 877154
60480 877154 848332 813208 773174 730201 686925 645791 608142 574233 543905 517102 493881
60469 493881 474092 457178 442432 429517 418543 409433 401411 393419 385042 376769 369347 363102 357866
60456C57866m554m101l692l217k712k260j887j621j579j741j750j311p29o04j004
60441C25104j452j795k381l121l098j793q6O97M45J38K80L82O0k93k66j29k44
60424C12448l89k37n9l07p53p70l30p6l37o97o73l36P4O02J310J849J735R40m4
60405C13950o30m59N05J830K766K841K277J602J019M88J87L62P67P68K15l01k23
60388C27964L23R00J376J841K190K260K177K229K432K507K280J880J518J270J063
60373C54210P86M39K14L51Q25J355J798K255K665K596J762N51l19o10o46o78n13
60356C67041J29J158K096K417J934J013L41K66N29P79J180K090L293M103M251
60341C92620M184M312M443M191L564K799J948R71M4o85j424k494l762m735n196
$$ plain form
60456 357866 353312 349211 345519 342302 339590 337330 335443 333822 332243 330502 328752 327441 326712 326108 325104
60441 325104 323652 321857 319476 316355 313257 311464 311378 312075 312520 312658 312938 313320 313380 313087 312821 312692 312448
60424 312448 312059 311822 311763 311456 310703 309933 309603 309527 309190 308493 307820 307484 307558 308160 309470 311319 313054 313994 313950
60405 313950 313320 312861 313366 315196 317962 320803 323080 324682 325701 326189 326376 326738 327505 328273 328488 328187 327964
60388 327964 328287 329187 330563 332404 334594 336854 339031 341260 343692 346199 348479 350359 351877 353147 354210
60373 354210 354996 355435 355649 356000 356825 358180 359978 362233 364898 367494 369256 369807 369488 368878 368232 367554 367041
60356 367041 367170 368328 370424 372841 374775 375788 376129 376395 376924 377703 378883 380973 384266 388369 392620
60341 392620 396804 401116 405559 409750 413314 416113 418061 419032 419076 418391 416967 414473 410711 405976 400780
60326D00780n400n554n482n006m297l610k811j610k05O63N85J11K12J095J910
60311C71381J817J049O41J189K245L036L428L954N007O320P341P855Q084Q253
60297D31600Q264P869P018N890M566K826M58k349m981o815p540p182o001m416
60283D29207k853j511l67O34J400J776J630Q41n87k362m016n354o573p684q143
60268C96038p442o021n035n056n487n439m823m134l569k955k422k442k986l200
60254C35027k374r14Q3J53j02Q5P04J162J120P96M87K12l7jM98J039R86M55L70
60235C39749J206K137K029J014L39O86J485J969K135K236K109J702J642K446L541
60220C66425L859L271K580K283K178K221K772L689M147L832L572M141N049N248
$$ plain form
60326 400780 395380 389826 384344 379338 375041 371431 368620 367010 366805 367468 368053 368164 368376 369471 371381
60311 371381 373198 374247 374888 376077 378322 381358 384786 388740 393747 400067 407408 415263 423347 431600
60297 431600 439864 447733 454751 460641 465207 468033 468491 466142 461161 454346 446806 439624 433623 429207
60283 429207 426354 424843 424476 425110 426510 428286 429916 430757 430170 427808 423792 418438 411865 404181 396038
60268 396038 388596 382575 377540 372484 366997 361558 356735 352601 349032 346077 343655 341213 338227 335027
60254 335027 332653 331739 331822 331975 331873 331958 332662 333824 334944 335740 336227 336439 336402 336401 336899 337938 338924 339379 339749
60235 339749 340955 343092 345121 346135 346474 347160 348645 350614 352749 354985 357094 358796 360438 362884 366425
60220 366425 370284 373555 376135 378418 380596 382817 385589 389278 393425 397257 400829 404970 410019 415267
60206D15267M613L920L634L531L493L835M583N096M816M051L574L645L756L332
60192D71146K339J174J71n45q86p45k60J17J1m95j045j499j954k401k680k783
60176D59665k802k634k180j855k280l248l602k697j444j234k096k715k244j250
60162D27384p18p95r88j074j181j196p67M0N56K76l72m59L02J189J365Q44L03
60145D24709J63L21O35J208K021K749L163L411L672L880M027M348M896N286N229
60130D69718M964M682L915K217K43o48n4R16J016K24o39j124j413j588j276j81
60114D80972J271K188K085J361P74N67L94R0L7M86Q83M54p10j731k034j851j641
60097D83595j581j772k313k959l184k926k771k979k831j518O08K279K760K504
$$ plain form
60206 415267 419880 423800 427434 430965 434458 438293 442876 447972 452788 456839 460413 464058 467814 471146
60192 471146 473485 474659 474830 474285 473399 472654 472394 472511 472522 472027 470982 469483 467529 465128 462448 459665
60176 459665 456863 454229 452049 450194 447914 444666 441064 438367 436923 435689 433593 430878 428634 427384
60162 427384 426666 425871 424883 423809 422628 421432 420665 420705 421261 421537 421165 420706 421008 422197 423562 424406 424709
60145 424709 424872 425193 425828 427036 429057 431806 434969 438380 442052 445932 449959 454307 459203 464489 469718
60130 469718 474682 479364 483279 485496 485739 485091 485037 485953 486969 487193 486554 485430 484017 482429 481153 480972
60114 480972 482243 484431 486516 487877 488651 489218 489612 489702 489739 490225 491108 491562 490852 489121 487087 485236 483595
60097 483595 482014 480242 477929 474970 471786 468860 466089 463110 460279 458761 459369 461648 464408 466912
60083D66912K388K782L469M081M337M152L728L438L454L499L104K063O50o46j551
60068E05860k202k926l854m836n693o333o616o379n795n406n522n714n340m461
60054D34783l812l793l914l484k500j557j126j137j212r56j93Q66J735K184K552
60039D18436L253M107M530M365M039L835L496K757J858J144N02l25j167j689k043
60024D47098k682l558m045l900l701m120n074n931o261o102n627m970m264l686
60010C83177l342l152k868k224j246l44R6J98L73O75P32M38J92K47K61r1m34j02
59992C72586R13J880K220K098K092K507L084L256K729J888J468J759K324K607
59978D03411K511K169J519N13m82r76r75r37j176j605j997k147j892j212l81L19
$$ plain form
60083 466912 469300 472082 475551 479632 483969 488121 491849 495287 498741 502240 505344 507407 508057 507411 505860
60068 505860 503658 500732 496878 492042 486349 480016 473400 467021 461226 455820 450298 444584 439244 434783
60054 434783 430971 427178 423264 419780 417280 415723 414597 413460 412248 411292 411099 411965 413700 415884 418436
60039 418436 421689 425796 430326 434691 438730 442565 446061 448818 450676 451820 452322 451997 450830 449141 447098
60024 447098 444416 440858 436813 432913 429212 425092 420018 414087 407826 401724 396097 391127 386863 383177
60010 383177 379835 376683 373815 371591 370345 370001 370097 370295 370668 371343 372075 372513 372705 372952 373213 373122 372688 372586
59992 372586 373499 375379 377599 379697 381789 384296 387380 390636 393365 395253 396721 398480 400804 403411
59978 403411 405922 408091 409610 410123 409641 408665 407690 406753 405577 403972 401975 399828 397936 396724 396343 396662
59962C96662Q82J383J677J632J480J493J492J105M76J51L05N20L90j21r38j952
59946D06637k746k768k019j149o30k78K19O39N31j47r94j672k162k555k798k676
59930C85432k114j452j254j578j681r11K60O92J77j45O89K078K609J853Q01N33
59914C85989J043J553J610J517J776K354K754K685K386K176J947J464R51R04J302
59899D12411J494J056L94J79M68O87M04j31k64L28J279J931K118K319K947L753
59883D31373M211M213M020L772L571L772M584N421N360M333L215K593K159J523
59869D84120Q80M61Qp05j313j464j525k055k887l262k827j956j192p53m97j12
59853D64921O35J615K491L227M063M840M896M029K997K492K079Q60j078k707l392
$$ plain form
59962 396662 397544 398927 400604 402236 403716 405209 406701 407806 408282 408433 408738 409258 409648 409527 408589 406637
59946 406637 403891 401123 399104 397955 397325 397047 397266 397905 398436 398289 397295 395623 393461 390906 388108 385432
59930 385432 383318 381866 380612 379034 377353 376442 376702 377394 377571 377426 378115 380193 382802 384655 385456 385989
59914 385989 387032 388585 390195 391712 393488 395842 398596 401281 403667 405843 407790 409254 410205 411109 412411
59899 412411 413905 414961 415355 415534 416002 416689 417093 416962 416698 417026 418305 420236 422354 424673 427620 431373
59883 431373 435584 439797 443817 447589 451160 454932 459516 464937 470297 474630 477845 480438 482597 484120
59869 484120 485000 485461 485469 484764 483451 481987 480462 478407 475520 472258 469431 467475 466283 465530 465033 464921
59853 464921 465556 467171 469662 472889 476952 481792 486688 490717 493714 496206 498285 499145 498067 495360 491968
59838D91968l396l078k415j560j223k006l750n772p424q259q042o929n472m207
59824D28435l338k875k834l136l559l944m306m584m517l976l285k919k925k911
59810C79326k605k168j858j617j228p53n26o86r61j003o79n7O20Q34J14j218k057
59793C63478j731q93o31r63j003m90k20p65j554j664r43R8R87J497J590J535J727
59776C60055K073K038J569J395J907K424K186J594J595K174K374J759R85Q16J215
59761C86159J690K010K263K447K384K033J748K014K784L313K988K286K320L391
59747D19830M661N364N607N615N150M186L404L237L151K624K128K189K176J221
59733D70543k01q84p15n78o76m60j40o76j971k567j685l45K02j3l79p72j133r20
$$ plain form
59838 491968 488572 485494 483079 481519 480296 478290 474540 468768 461344 453085 445043 438114 432642 428435
59824 428435 425097 422222 419388 416252 412693 408749 404443 399859 395342 391366 388081 385162 382237 379326
59810 379326 376721 374553 372695 371078 369850 369097 368571 367885 366924 365921 365242 365185 365805 366639 366753 365535 363478
59793 363478 361747 360854 360223 359260 358257 357767 357547 356782 355228 353564 352621 352719 353706 355203 356793 358328 360055
59776 360055 362128 364166 365735 367130 369037 371461 373647 375241 376836 379010 381384 383143 384128 384944 386159
59761 386159 387849 389859 392122 394569 396953 398986 400734 402748 405532 408845 411833 414119 416439 419830
59747 419830 424491 429855 435462 441077 446227 450413 453817 457054 460205 462829 464957 467146 469322 470543
59733 470543 470342 469458 468743 468165 467489 467029 466889 466213 464242 461675 459990 459645 459847 459834 459455 458683 457550 456630
59715D56630L8Q95Q53K66p7j66l56l84K82J400K174K302K094J819J605J797K595
59698D73767L483L737L396L064K922K609K032J570J385J230J040J111J462J570
59684E04378J010m0j087j776j903j420o53j87k92p01j150j814k910m081m623m285
59668D78466l588l243l501m068m481m411l765k794k025j812j882j595p72M1L49
59653D40919M48R54J843K445K425K239K437K912L054K442J171k58j298j763j941
59638D58029k201k550k755k829l019l365l653l733l575l100k409k020k255k510
59624D18055j917p04qj43j23O33J207N49r21k077k683l220l619l392k836k833
59608C95968l427l634k912j906j343j066n28K35P04N54o1o65p76l48N0j08m99
$$ plain form
59715 456630 456668 457563 458416 458682 458605 458439 458083 457699 457981 459381 461555 463857 465951 467770 469375 471172 473767
59698 473767 477250 480987 484383 487447 490369 492978 495010 496580 497965 499195 500235 501346 502808 504378
59684 504378 505388 505348 504261 502485 500582 499162 498509 498322 498030 497329 496179 494365 491455 487374 482751 478466
59668 478466 474878 471635 468134 464066 459585 455174 451409 448615 446590 444778 442896 441301 440529 440570 440919
59653 440919 441367 442321 444164 446609 449034 451273 453710 456622 459676 462118 463289 463031 461733 459970 458029
59638 458029 455828 453278 450523 447694 444675 441310 437657 433924 430349 427249 424840 422820 420565 418055
59624 418055 416138 415434 415426 415283 415160 415793 417000 417549 416628 414551 411868 408648 405029 401637 398801 395968
59608 395968 392541 388907 385995 384089 382746 381680 381152 381387 382091 382645 382584 381919 381143 380795 380845 380737 380238
59591C80238l64K92N78M0o05m91J82O03N29L37J45m23j461k413k674k271j757
59574C70485j644k048k722l243l252k729k054j708j844k079j795p38O61J636J796
59559C48722J494J360J549J622J167M07j4K15P61J134J296J572K194L080M002
59544C70561M689M856M487M070M292N382P032Q829J0515J1872J2909J4101J5779
59531D79374J6999J5786J1148M527j363m812n836n169l435j321L46J120J219J140
59517E09723J223J532J794J434J4k248m638o546p697q018p749p515p757q090p795
59502D47667o922o210n910n383m244l157k980l554l976l726l065k468k154k100
59488C91818k095j788r59K15J328K125K531K498K066J523J297J680K668L898M734
$$ plain form
59591 380238 379874 380166 380744 380784 380179 379688 379870 380473 381002 381339 381484 381061 379600 377187 374513 372242 370485
59574 370485 368841 366793 364071 360828 357576 354847 352793 351085 349241 347162 345367 344629 345290 346926 348722
59559 348722 350216 351576 353125 354747 355914 356321 356307 356522 357283 358417 359713 361285 363479 366559 370561
59544 370561 375250 380106 384593 388663 392955 398337 405369 414198 424713 436585 449494 463595 479374
59531 479374 496373 512159 523307 527834 526471 521659 515823 510654 507219 505898 506244 507364 508583 509723
59517 509723 510946 512478 514272 515706 515720 513472 508834 502288 494591 486573 478824 471309 463552 455462 447667
59502 447667 440745 434535 428625 423242 418998 415841 412861 409307 405331 401605 398540 396072 393918 391818
59488 391818 389723 387935 386976 387191 388519 390644 393175 395673 397739 399262 400559 402239 404907 408805 413539
59473D13539M648L794K967K794L112L332L167K688J941Q84k55r70q73J2J364K748
59457D44892L791M415M927N686O713P735Q522R001R120Q891Q515Q212P920P454
59443E45794O909O518O030M634J850j751n045p374q787r456r379q771q153p712
59429E05307o964n509l899l107l165k992j779M9J692L196N135P419R290J0433
59415E15106J1338J2380J3316J3941J4546J5317J5893J6004J5861J5238J2721
59404F71661O939j494j0007j6045j8506j7560j4190r962o197k891P08L994M452
59391E90902J65p620j5340k0233k1940k1402j9466j6768j3960j1465r318p552
59379D26003o273n224l822j990m60J08p9l97o33q46p99j94P04J278J401J536J957
$$ plain form
59473 413539 418187 421981 424948 427742 430854 434186 437353 440041 441982 442866 442611 441641 440768 440780 442144 444892
59457 444892 448683 453098 458025 463711 470424 478159 486681 495682 504802 513693 522208 530420 538340 545794
59443 545794 552703 559221 565251 569885 571735 569984 564939 557565 548778 539322 529943 521172 513019 505307
59429 505307 498343 492834 488935 485828 482663 479671 477892 477941 479633 482829 487964 495383 504673 515106
59415 515106 526444 538824 552140 566081 580627 595944 611837 627841 643702 658940 671661
59404 671661 678600 677106 667099 651054 632548 614988 600798 590836 584639 581748 582456 586450 590902
59391 590902 591067 583447 568107 547874 525934 504532 485066 468298 454338 442873 433555 426003
59379 426003 419730 414506 410684 408694 408234 408342 408263 407866 407233 406387 405588 405394 406098 407376 408777 410313 412270
59362D12270K311K159J587J138J333K294L599M585N077N706P071Q726R655R793
59348D77304J0251J1692J3245J3656J2990J2361J2333J2483J2445J2428J2496
59337F13684J2110J0871R152P460N577K927l92l501n704p156q402r678j0778j1472
59323F04698j1710j1519j0889r825q444o939n528m419l750l431l116k544j859
59310E20725j457j408j220l73J080K649M097N625P380R117J0484J1423J1907J1447
59296E91476R230M977m91n585q963j0256j0066r368q811q422p769o494m644k686
59282E22128j179m09j71J06Q74K022L032L686M373N560P069Q304R100R869J0804
59267E85168J1403J1155J0279R413Q721P848O595N097L411J434o69k482l916n353
$$ plain form
59362 412270 414581 416740 418327 419465 420798 423092 426691 431276 436353 442059 449130 457856 467511 477304
59348 477304 487555 499247 512492 526148 539138 551499 563832 576315 588760 601188 613684
59337 613684 625794 636665 645817 653277 658854 661781 661389 657888 652184 645028 636626 626948 616170 604698
59323 604698 592988 581469 570580 560755 552311 545372 539844 535425 531675 528244 525128 522584 520725
59310 520725 519268 517860 516640 516267 517347 519996 524093 529718 537098 546215 556699 568122 580029 591476
59296 591476 600706 605683 605192 599607 590644 580388 570322 560954 552143 543721 535952 529458 524814 522128
59282 522128 520949 520540 520369 520475 521349 523371 526403 530089 534462 540022 547091 555395 564495 574364 585168
59267 585168 596571 607726 618005 627418 636139 643987 650582 655679 659090 660524 659855 657373 653457 648104
59253F48104o917q074q253p575o655n952n620n650n796n578m801l896l366l014
59239E66957k223q97L33R14R78R91J194J475J549J085l1j417k388k701k934l860
59223E59025n510p074p757p592p307p505q097q574q619q322p936p578p220o705
59209D53229n761m329k894k183k269k393j934j249j094j460j553r19NN21M84K52
59193D26453K15N42J117J564J561J295J379K143L156L712L649L453L630M162M690
59178D62721N001N203N420N549N415N103M900M963N238N687O259O644O490O024
59164E40617N963O516O875O292N162M391M019L335K254J587J642J506K53j726
59150E88686l247l801l862m024m380m746m971m993m865m801m949n138n069m641
$$ plain form
59253 648104 641187 633113 624860 617285 610630 604678 599058 593408 587612 582034 577233 573337 569971 566957
59239 566957 564734 563837 564170 565084 566062 567053 568247 569722 571271 572356 572325 570908 568520 565819 562885 559025
59223 559025 553515 546441 538684 531092 523785 516280 508183 499609 490990 482668 474732 467154 459934 453229
59209 453229 447468 443139 440245 438062 435793 433400 431466 430217 429123 427663 426110 425191 425196 425717 426201 426453
59193 426453 426668 427210 428327 429891 431452 432747 434126 436269 439425 443137 446786 450239 453869 458031 462721
59178 462721 467722 472925 478345 483894 489309 494412 499312 504275 509513 515200 521459 528103 534593 540617
59164 540617 546580 553096 559971 566263 571425 575816 579835 583170 585424 587011 588653 590159 590412 588686
59150 588686 585439 581638 577776 573752 569372 564626 559655 554662 549797 544996 540047 534909 529840 525199
59136E25199l953l090k154j410j136j280j464j288n49O80K012K900L118L053L294
59121E23932L987M774N331N684O003O366O884P741Q958J0139J0745J0592J0021
59108F21157R550R409R395R105Q313P192O173N512N013M285L276K408K014J825
59094G04627J238R2j144j920k120k027k051k560l603m622m915m523m263m619n096
59079F62494n202n433o519q045q864q808q883r598j0060r404q188p584p649p351
59065E50906o167m877m599n458o500o709o014n282n287n745n663m650l474l051
59051D77430l271l312k817k284k305k833l304l233k628j920j462j074k75R33J849
59036D49494J874J288R09J112J561J871K090K568L518M819O049O782O986P114
$$ plain form
59136 525199 521246 518156 516002 514592 513456 512176 510712 509424 508875 509555 511567 514467 517585 520638 523932
59121 523932 527919 532693 538024 543708 549711 556077 562961 570702 579660 589799 600544 611136 621157
59108 621157 630707 640116 649511 658616 666929 674121 680294 685806 690819 695104 698380 700788 702802 704627
59094 704627 705865 705957 704813 702893 700773 698746 696695 694135 690532 685910 680995 676472 672209 667590 662494
59079 662494 657292 651859 645340 637295 628431 619623 610740 601142 591082 581678 573490 565906 558257 550906
59065 550906 544739 539862 535263 529805 523305 516596 510582 505300 500013 494268 488605 483955 480481 477430
59051 477430 474159 470847 468030 465746 463441 460608 457304 454071 451443 449523 448061 446987 446712 447645 449494
59036 449494 451368 452656 453565 454677 456238 458109 460199 462767 466285 471104 477153 483935 490921 498035
59022D98035P619Q460R222R599R624R549R682J0133J0490R995Q340O115M157K614
59008F13634J094m38j502j841j768j591j172l67M75Q82R42J181J784K262K107
58993F15682J509J135J260J405R42j69j499k776l971m898n291n382n810o588o736
58978E78813n474l416j927j454j189l36J014K382L635M857N991O987Q011R123
58964F07017R939J0013R444Q810Q506Q348P835O682N072L499K253J136k55j921
58950F86378l393m439n478p020q780r860r896r607r825j0273r798p885n379l509
58936E81236k564k010j607j725k564l669m508n053n425n376m622l456k591k385
58922E33681k611k893l018k887k491j956j375o68J14N18J56n67p33R0J448K693
$$ plain form
59022 498035 505654 514114 523336 532935 542559 552108 561790 571923 582413 592408 600748 606863 611020 613634
59008 613634 614728 614290 612788 610947 609179 607588 606416 606049 606524 607406 608348 609529 611313 613575 615682
58993 615682 617191 618326 619586 620991 621933 621764 620265 617489 613518 608620 603329 597947 592137 585549 578813
58978 578813 573339 569923 567996 566542 565353 565017 566031 568413 572048 576905 582896 589883 597894 607017
58964 607017 616956 626969 636413 645223 653729 662077 669912 676594 681666 685165 687418 688554 688299 686378
58950 686378 682985 678546 673068 666048 657268 647408 637512 627905 618080 607807 598009 590124 584745 581236
58936 581236 578672 576662 575055 573330 570766 567097 562589 557536 552111 546735 542113 538657 536066 533681
58922 533681 531070 528177 525159 522272 519781 517825 516450 515782 515896 516414 516570 516003 515270 515360 516808 519501
58906E19501L538L861L587L134L456N037P123Q523R034R474J0369J1206J1243
58893F09086J0552R817R404R072Q569Q072P970Q466R504J0824J1986J2531J2269
58880G38122J1381J0074Q341O255M178K417P50j264l605n761p449q922j0376j1440
58866G32701j1591j0822r615q466p634p166o857o336n504m784m687n218n963o618
58852F31440p171p603p769p583p124o558o059n702n337m725m004l728m190m887
58838E49000n079m713m412m590m992n130m797m081l232k589k338k317k217j974
58824D96539j685j301p60l25k73l08J53J012J455J155Q35J213J958K281K113K051
58808E06113K302K449K230J910J726J499J035M73m7o80j500k156k283k069j994
$$ plain form
58906 519501 523039 526900 530487 533621 537077 542114 549237 557760 566794 576268 586637 597843 609086
58893 609086 619638 629455 638859 647931 656500 664572 672542 681008 690512 701336 713322 725853 738122
58880 738122 749503 759577 767918 774173 778351 780768 781518 780254 776649 770888 763439 754517 744141 732701
58866 732701 721110 710288 700673 692207 684573 677407 670550 664214 658710 653926 649239 644021 638058 631440
58852 631440 624269 616666 608897 601314 594190 587632 581573 575871 570534 565809 561805 558077 553887 549000
58838 549000 543921 539208 534796 530206 525214 520084 515287 511206 507974 505385 503047 500730 498513 496539
58824 496539 494854 493553 492793 492468 492195 491887 492040 493052 494507 495662 496497 497710 499668 501949 504062 506113
58808 506113 508415 510864 513094 515004 516730 518229 519264 519737 519690 519010 517510 515354 513071 511002 509008
58793E09008k106k051j804j831k337k817k681k009j276o10K23J184J872K063J933
58778D96761J713J531J644K252K963K928J876N40k52n67j005j804k719l608m474
58763D97779n060m933m063l022k494k670l013k542p83J316J932L92j737k289r72
58748D67841O34J350J620K257L063L337L079K950L332M029M768N379N665N541
58734E14845N379N685O386O740O176M973L899L360L213L296L697M310M502L724
58720E80185K320J211Q26P63O63P62J331K140K884L665M556N076M759L889L082
58705F18112K349J246k98j905l379m786o037p055q156r611j0991j1697j1941j2274
58691E33577j2358j1299r312p808p422p158o013m522l869m241m820m879m207k975
$$ plain form
58793 509008 506902 504851 503047 501216 498879 496062 493381 491372 490096 489486 489709 490893 492765 494828 496761
58778 496761 498474 500005 501649 503901 506864 509792 511668 512208 511956 511389 510384 508580 505861 502253 497779
58763 497779 492719 487786 483723 480701 478207 475537 472524 469982 469199 470515 472447 472839 471102 468813 467841
58748 467841 468475 469825 471445 473702 476765 480102 483181 486131 489463 493492 498260 503639 509304 514845
58734 514845 520224 525909 532295 539035 545211 550184 554083 557443 560656 563952 567649 571959 576461 580185
58720 580185 582505 583716 584542 585305 585968 586730 588061 590201 593085 596750 601306 606382 611141 615030 618112
58705 618112 620461 621707 621409 619504 616125 611339 605302 598247 590091 580480 569489 557792 545851 533577
58691 533577 521219 509920 500608 492800 485378 478220 472207 467685 463816 459575 454755 449876 445669 442694
58677D42694j813j548k259l010l050k718k527k090p81J010K278K918L825N520
58663D38449P475Q824R093Q205O421M472L113K373J592L06j267k649l573l940
58649D78894l716l024k173j511j308j650k285k683k543k069j631j320j094r80
58635D50907q96n38J24O03N62M10O89J167J182P15L80N15Q59J142J285J085M69
58618D60660K1N66J940L016L191L133L676M703N586O066O043N123L259J470R97
58603E09450J759K420K126J390J108J402J813K017J811Q89o46j849j722m61P39
58588E22246J155J195J532K278L359M933O842Q224Q404P889P720Q085Q294P997
58574F00153P560P287P053O875P016P321P247O897P200Q620J0395J1626J2497
$$ plain form
58677 442694 440881 439333 437074 434064 431014 428296 425769 423679 422898 423908 426186 429104 432929 438449
58663 438449 445924 454748 463841 472046 478467 482939 486052 488425 490017 490323 489056 486407 482834 478894
58649 478894 475178 472154 469981 468470 467162 465512 463227 460544 458001 455932 454301 452981 451887 450907
58635 450907 450011 449473 449597 450200 450762 451172 451861 453028 454210 454925 455305 455820 456679 457821 459106 460191 460660
58618 460660 460681 461247 463187 466203 469394 472527 476203 480906 486492 492558 498601 503724 506983 508453 509450
58603 509450 511209 513629 515755 517145 518253 519655 521468 523485 525296 526185 525539 523690 521968 521507 522246
58588 522246 523401 524596 526128 528406 531765 536698 543540 551764 560168 568057 575777 583862 592156 600153
58574 600153 607713 615000 622053 628928 635944 643265 650512 657409 664609 673229 683624 695250 707747
58561G07747J3659J5083J6257J7228J8474J9879K0522J9619J7238J4054J0800
58550H90560P875N164K321n14k610l589m128n217o866q222q869r406j0635j2618
58536H33246j4654j5970j6374j6364j6559j6891j6663j5516j3984j2744j1759
58525F65768j0617r319q114o824n034k911j205l84k55l95n70o50n31j88M19J318
58509F20508K200K446J900J259J239J678K055K439L119L646L269K241J695K041
58495F51735K422K110J449J038O97q1j154j831j626n20J171K854L868M174M560
58480F70866N759P482Q778R242R433R993J0786J1150J0808J0091R187P557M584
58467G85716O87k694m417m600m183l926m047m350m367l668k404j196k36R65K655
$$ plain form
58561 707747 721406 736489 752746 769974 788448 808327 828849 848468 865706 879760 890560
58550 890560 898435 903599 905920 905406 902796 899207 895079 889862 882996 874774 865905 856499 845864 833246
58536 833246 818592 802622 786248 769884 753325 736434 719771 704255 690271 677527 665768
58525 665768 655151 645832 637718 630894 625860 622949 621744 621360 621105 620710 620140 619490 618959 618771 619190 620508
58509 620508 622708 625154 627054 628313 629552 631230 633285 635724 638843 642489 645758 647999 649694 651735
58495 651735 654157 656267 657716 658754 659451 659370 658216 656385 654759 654239 655410 658264 662132 666306 670866
58480 670866 676625 684107 692885 702127 711560 721553 732339 743489 754297 764388 773575 781132 785716
58467 785716 786403 783709 779292 774692 770509 766583 762536 758186 753819 750151 747747 746551 746315 747280 749935
58452G49935M217N016N276N481N512N023M154L052J241j494m127n430n670o051
58438G66135o679o432m858k833j145K96J527K092K078K405L510M706N426O125
58424G72353P304Q573R389R867J0129R656Q147O274M735L224J236o98j685j949
58410H46555k564l833m933n184m797m215l486k574j744j245q59q5J223K568L223
58395H18050K978K376K123K342K688K991L307L455L074K289J737J719J825J593
58381H52547J113P08M76M13N89R22J172J298J493J818K173K757L981N777P506
58366H84743Q697R428R859R991J0013J0238J0570J0679J0792J1535J2804J3611
58354A012960J3309J2192J0670Q817P016N973N549M650K976J864K534M371N916
$$ plain form
58452 749935 754152 759168 764444 769925 775437 780460 784614 787666 788907 787413 783286 777856 772186 766135
58438 766135 759456 753024 748166 745333 744188 744484 746011 748103 750181 752586 756096 760802 766228 772353
58424 772353 779657 788230 797619 807486 817615 827271 835418 841692 846427 849651 850887 850189 848504 846555
58410 846555 843991 840158 835225 830041 825244 821029 817543 814969 813225 811980 811121 811036 812259 814827 818050
58395 818050 821028 823404 825527 827869 830557 833548 836855 840310 843384 845673 847410 849129 850954 852547
58381 852547 853660 854368 854844 855257 855846 856768 857940 859238 860731 862549 864722 867479 871460 877237 884743
58366 884743 893440 902868 912727 922718 932731 942969 953539 964218 975010 986545 999349 1012960
58354 1012960 1026269 1038461 1049131 1057948 1064964 1070937 1076486 1081136 1084112 1085976 1088510 1092881 1098797
58341A098797O733P373Q134Q942R973J1363J2610J3156J3277J3636J4298J4925
58329A233217J5478J5996J6107J5550J4805J4366J3826J2557J0938R909R555R086
58317A391390Q136P212O827O978P494Q295R297J0481J1990J3751J5248J6097J6490
58304A529686J6768J7041J7554J8800K0581K1714K1455K0624K0445K0887K1144
58293A746699K1166K1500K1985K1876K1282K1348K2794K5054K6960K7745K7484
58282B005893K7099K7720K9505L1414L2639L3675L5267L7044L8237L9259M1190
58271B378942M4018M6691M8834N1190N4222N7453O0446O3469O6776P0004P2562
58260C014607P4234P5238P6150P7638P9799Q1957Q3477Q4591Q5891Q7481Q9139
$$ plain form
58341 1098797 1105530 1112903 1121037 1129979 1139952 1151315 1163925 1177081 1190358 1203994 1218292 1233217
58329 1233217 1248695 1264691 1280798 1296348 1311153 1325519 1339345 1351902 1362840 1372749 1382304 1391390
58317 1391390 1399526 1406738 1413565 1420543 1428037 1436332 1445629 1456110 1468100 1481851 1497099 1513196 1529686
58304 1529686 1546454 1563495 1581049 1599849 1620430 1642144 1663599 1684223 1704668 1725555 1746699
58293 1746699 1767865 1789365 1811350 1833226 1854508 1875856 1898650 1923704 1950664 1978409 2005893
58282 2005893 2032992 2060712 2090217 2121631 2154270 2187945 2223212 2260256 2298493 2337752 2378942
58271 2378942 2422960 2469651 2518485 2569675 2623897 2681350 2741796 2805265 2872041 2942045 3014607
58260 3014607 3088841 3164079 3240229 3317867 3397666 3479623 3563100 3647691 3733582 3821063 3910202
58249C910202R0952R3202R6065R9918J05301J12004J18881J25313J32025J39759
58239E023622J48029J56225J64879J74692J85155J95493K06213K18358K31998
58230F704664K46783K63187K81753L01906L23086L46299L72902M02580M34205
58221I677365M68038N05392N46897N92858O44529P03183P68614Q40579R20943
58212A5668398J012723J117980J238636J378275J541105J730549J951313K211651
58204B7850630K521606K891502L335784L876754M540771N351969O332046P501485
58196F4202547Q873259J0445511J2206570J4147624J6263153J8530730K0880329
58189A65549723K3170004K5187504K6687848K7431056K7148672K5443749K1782452
$$ plain form
58249 3910202 4001154 4094356 4190421 4290339 4395640 4507644 4626525 4751838 4883863 5023622
58239 5023622 5171651 5327876 5492755 5667447 5852602 6048095 6254308 6472666 6704664
58230 6704664 6951447 7214634 7496387 7798293 8121379 8467678 8840580 9243160 9677365
58221 9677365 10145403 10650795 11197692 11790550 12435079 13138262 13906876 14747455 15668398
58212 15668398 16681121 17799101 19037737 20416012 21957117 23687666 25638979 27850630
58204 27850630 30372236 33263738 36599522 40476276 45017047 50369016 56701062 64202547
58196 64202547 73075806 83521317 95727887 109875511 126138664 144669394 165549723
58189 165549723 188719727 213907231 240595079 268026135 295174807 320618556 342401008
58182C42401008J5745206P451674k198736j1756417j9804558k5477499k8607008
58175B77753670k9534626k8824949k7050021k4677341k2038129j9350093j6759086
58168A09519425j4364658j2225557j0364239q777649p445902o337120n415035
58161D4589265m647583m008726l475294l026922k648503k328887k057435j824565
58153B0571350j624238j452357j303395j171626j054516r51588q60690p78551
58145A1374389p04300o39076n82403n31915m86470m46720m12653l83119l57665
58136F830068l36252l17332k98719k80253k63238k47431k31234k14838k00329
58127D440442j88259j76737j64623j53188j43697j35541j27778j20663j14550
$$ plain form
58182 342401008 358146214 365597888 363399152 351642735 331838177 306360678 277753670
58175 277753670 248219044 219394095 192344074 167666733 145628604 126278511 109519425
58168 109519425 95154767 82929210 72564971 63787322 56341420 50004300 44589265
58161 44589265 39941682 35932956 32457662 29430740 26782237 24453350 22395915 20571350
58153 20571350 18947112 17494755 16191360 15019734 13965218 13013630 12152940 11374389
58145 11374389 10670089 10031013 9448610 8916695 8430225 7983505 7570852 7187733 6830068
58136 6830068 6493816 6176484 5877765 5597512 5334274 5086843 4855609 4640771 4440442
58127 4440442 4252183 4075446 3910823 3757635 3613938 3478397 3350619 3229956 3115406
58118C115406j08839j03105r7880r3393q8786q3552p8594p4908p2061o8905o5074
58107B180309o1035n7319n4267n1996n0122m8015m5597m3349m1428l9492l7577
58096A650112l6285l5871l5858l5854l5902l5815l4935l3049l0856k9109k7833
58085A278745k6635k5283k3749k2165k0961k0532k0655k0732k0635k0668k0791
58074A035939k0575k0061j9827k0059k0226j9972j9570j9251j8781j7982j7037
58063H22598j5986j4598j2980j1716j1067j0663j0250j0102j0365j0657j0697
58052F93517j0779j1157j1533j1510j1137j0556r706q720q102p996p760o799n463
58039E72299m600m497m750m926m952m986n300o071o998p413p056o541o612p240
$$ plain form
58118 3115406 3006567 2903462 2805582 2712189 2623403 2539851 2461257 2386349 2314288 2245383 2180309
58107 2180309 2119274 2061955 2007688 1955692 1905570 1857555 1811958 1768609 1727181 1687689 1650112
58096 1650112 1613827 1577956 1542098 1506244 1470342 1434527 1399592 1366543 1335687 1306578 1278745
58085 1278745 1252110 1226827 1203078 1180913 1159952 1139420 1118765 1098033 1077398 1056730 1035939
58074 1035939 1015364 995303 975476 955417 935191 915219 895649 876398 857617 839635 822598
58063 822598 806612 792014 779034 767318 756251 745588 735338 725236 714871 704214 693517
58052 693517 682738 671581 660048 648538 637401 626845 617139 608419 600317 592321 584561 577762 572299
58039 572299 567699 563202 558452 553526 548574 543588 538288 532217 525219 517806 510750 504209 497597 490357
58025D90357p834q074q065p856p306o469n612m878m215l763l808m293m642m346
58011D09196l556k827k455k295k172k103j980j405k61Q10R50J84n59o60m78n52
57995C89837p60p48p78j338k214k675k562k441k650k803k462j715r08k43J63K29
57979C65932M8k94r81k090k952k709j625j058j724k761l082k906l143l761l808
57964C33086k888j716j085j069j345j702j900j617r15l81m54q53j048r98j038
57949C14077j268j427j362j112n90L60J418J817J254M34L55J279K804M584O381
57934C29004P593P552O432N272M795M711M473M109L849L405K224K34k084m120
57920C77449n391n724n636o085p388q691r083q824q820r200r252q591p588o675
$$ plain form
58025 490357 482523 474449 466384 458528 451222 444753 439141 434263 430048 426285 422477 418184 413542 409196
58011 409196 405640 402813 400358 398063 395891 393788 391808 390403 390142 390952 391902 392086 391527 390867 390389 389837
57995 389837 389077 388329 387551 386213 383999 381324 378762 376321 373671 370868 368406 366691 365783 365540 365703 365932
57979 365932 365980 365686 364705 362615 359663 356954 355329 354271 352547 349786 346704 343798 340655 336894 333086
57964 333086 330198 328482 327397 326328 324983 323281 321381 319764 318849 318468 318014 317161 316113 315115 314077
57949 314077 312809 311382 310020 308908 308318 308678 310096 311913 313167 313601 313956 315235 318039 322623 329004
57934 329004 336597 344149 350581 355853 360648 365359 369832 373941 377790 381195 383419 383653 381569 377449
57920 377449 372058 366334 360698 354613 347225 338534 329451 320627 311807 302607 293355 284764 277176 270501
57906B70501n952n463n142m492l124j655j241k088l163l566l397l012k336j404
57892B24466p70p63r38p48k80J91P89J591K157K101J780J733J819J586J135Q87
57876B36736P58L31k46l68o8j87j153k234k429j717q83l82J09R14J693J872J546
57859B34292J446J935K468K428K101K266K926L187K562J764J765K484K965K685
57845B67274K151K123K533K487J330m22j558j652j599k295l258l301k369j661
57831B59783j801k001j467p08o33j068j067l35N78J227J693K134K575L083L610
57816B65603L744L192K390K049K112J748L73j775m121o170p496p852p533p173
57802B39091o992o655o007n447n346n448n160m291l177k252j669j306j054j080
$$ plain form
57906 270501 264549 259086 253944 249452 246328 244673 243432 241344 238181 234615 231218 228206 225870 224466
57892 224466 223696 222933 221995 221247 220967 221158 221947 223538 225695 227796 229576 231309 233128 234714 235849 236736
57876 236736 237494 237825 237579 237211 237143 236956 235803 233569 231140 229423 228540 228158 228267 229181 230874 232746 234292
57859 234292 235738 237673 240141 242569 244670 246936 249862 253049 255611 257375 259140 261624 264589 267274
57845 267274 269425 271548 274081 276568 277898 277476 275918 274266 272667 270372 267114 263813 261444 259783
57831 259783 257982 255981 254514 253806 253173 252105 251038 250703 251281 252508 254201 256335 258910 261993 265603
57816 265603 269347 272539 274929 276978 279090 280838 281211 279436 275315 269145 261649 253797 246264 239091
57802 239091 232099 225444 219437 213990 208644 203196 198036 193745 190568 188316 186647 185341 184287 183207
57788A83207j676k667l149k247k66J321J384L78k34L03J302J775J772K153L216
57773A86572M275M661M531M219L483K144R65Q82J466J281o6j371j717j787k612
57758B06926l949m883n240n403n204m193k755j893j903k132k002j514p61J87R05
57743A66186R10M39K37M92O73M82J98ol95j074j695j968j899j442n33M75J040
57726A62120J170J273J318R42L83L27P15P24K50K03Q59J096P4j387k034j938j916
57709A64179j936j333l02J32m39j365j877j740j028j82j58j510l291l758k442
57694A42950o49K67L02R4j85n76o08K05J457K174K077J907K428L527M573N285
57678A65228O047P422R540J1973J4077J5525J6583J7892J9966K2842K6249K9966
$$ plain form
57788 183207 181531 178864 175715 173468 173202 174523 175907 176285 176051 176354 177656 179431 181203 183356 186572
57773 186572 190847 195508 200039 204258 207741 209885 210850 211732 213198 214479 214413 213042 211325 209538 206926
57758 206926 202977 198094 192854 187451 182247 178054 175299 173406 171503 169371 167369 165855 165094 165281 166186
57743 166186 167096 167535 167772 168264 168937 169419 169617 169611 169216 168142 166447 164479 162580 161138 160605 161080 162120
57726 162120 163290 164563 165881 166823 167206 167533 168248 168972 169222 169425 170284 171380 171454 170067 168033 166095 164179
57709 164179 162243 160910 160608 160740 160301 158936 157059 155319 154291 154109 153951 152441 149150 145392 142950
57694 142950 142301 142568 142870 142964 142779 142203 141595 141800 143257 145431 147508 149415 151843 155370 159943 165228
57678 165228 171275 178697 188237 200210 214287 229812 246395 264287 284253 307095 333344 363310
57666C63310L3933L7927M1273M2928M1656L6127K5264R208r755k7657m0779m7530
57654E05905m8725m6345m2126l7008l1482k6134k1611j8047j4918j1741q788o717
57642A92263n614m882m051l208k538j970j463j145r41n46m0L3m56q17m55K42M89
57625A64901J99j62m56r41j651k306k732k845k413j423n21l72o80o09j57k52j308
57608A46272k474k744k153j417r35o23m28l96m50m22k79o1K18M00J63n50j280
57591A32841j556j447j374j508j762k147k712l139k868j858q94q44j705k603k716
57576A03708j999j041m12k86m68o55o71o30p98j177j361j060o64q30j526j954
57560H8176j651j043o77m52j27rl53n82J3R89J269Q44Q03J454J691Q22o7L47J585
$$ plain form
57666 363310 397243 435170 476443 519371 561027 597154 622418 631626 621871 594214 553435 505905
57654 505905 457180 410835 368709 331701 300219 274085 252474 234427 219509 207768 198980 192263
57642 192263 186649 181767 177716 174508 171970 170000 168537 167392 166451 165905 165865 165898 165442 164625 164170 164412 164901
57625 164901 165100 164938 164482 163541 161890 159584 156852 154007 151594 150171 149650 149278 148598 147989 147832 147580 146272
57608 146272 143798 141054 138901 137484 136549 135926 135498 135102 134652 134230 133951 133890 134108 134508 134671 134121 132841
57591 132841 131285 129838 128464 126956 125194 123047 120335 117196 114328 112470 111576 110732 109027 106424 103708
57576 103708 101709 100668 100256 99970 99502 98847 98176 97546 96748 95571 94210 93150 92486 91656 90130 88176
57560 88176 86525 85482 84805 84353 84226 84217 83864 83282 83295 84284 85553 86397 87200 88654 90345 91167 91100 91447 93032
57541I3032J993J097N7j79p5m36j025q75L94K042K958K666J625O26l8o71j411
57524A01780j783j343m91j8o4n4K76N04L28J01K70P34J160J491J756J777J469
57507A07893J143J013P41Jq11j018o97o21j149j792j999j766j311p47l80p20j696
57490I6084k373k000j061o63j041j388j106n59l72n47o65n73m81n15n66o06p83
57473H0785j117j263p60L53J290J122k28j730k238j606n89J69O73J076J217Q78
57457G8032K14l66n35j41P04J408J178p5j331j415k96R09J178M66n52j203j157
57440G7018m56N25J291J556J421J180R86O69o8j137j852j541n02J23k76r23o70
57423G7344M50J329J302Q38N82M81J13n06r18p68q0P64J180Q29M7m32l58j83k88
$$ plain form
57541 93032 95025 96122 96179 96000 95925 95489 94464 93589 93983 96025 98983 101649 103274 103900 103862 103191 101780
57524 101780 99997 98654 98163 98145 98081 98027 98303 98807 99135 99236 99506 100240 101400 102891 104647 106424 107893
57507 107893 109036 110049 110790 110791 109980 108962 108265 107644 106495 104703 102704 100938 99627 98880 98500 97780 96084
57490 96084 93711 91711 90650 89987 88946 87558 86452 85893 85521 84974 84309 83736 83255 82740 82174 81568 80785
57473 80785 79668 78405 77645 77998 79288 80410 80182 78452 76214 74608 74019 74188 74861 75937 77154 78032
57457 78032 78246 77880 77345 77204 77908 79316 80494 80419 79088 77673 77377 78286 79464 79930 79378 78175 77018
57440 77018 76562 77087 78378 79934 81355 82535 83521 84190 84122 82985 81133 79592 79090 79213 78937 78014 77344
57423 77344 77794 79123 80425 81263 81845 82326 82439 81933 81015 80247 80167 80931 82111 82940 82987 82555 82197 82014 81726
57404H1726m38l32j91l50o23n93l13j78k52k63j38k4J89P26J322J323O49Kp3J45
57384H2314J73J18M18J088J802K443L071L342K648J009o30j281r29l63k07l51
57368I4665l62j56l2j62l15k98m37j161k159k461j637m71P8J45N14J146J127K38
57350H8262m59j35N67N91J03Q3O66J053R85J152J813K151J558O86M64P35O72J15
57332A01062m27p76j179j456r97J51J003Q50K43K58J127K045K189J494N00k67
57316A05820n89m99j50J81J75k47p17p52l36K3l7k70k40J1J10m1j35N3L68N76
57296A03304O91R07J310J666J551Q27L9k6N98R04J54j035j430o94M57J320J707
57279A12250J489N83m60o90R4J043J410J339J197Q84L55J83Q30J785K130J743
$$ plain form
57404 81726 81288 80956 80765 80415 79792 79199 78886 78708 78456 78193 78055 78031 78220 78946 80268 81591 82240 82242 82169 82314
57384 82314 82487 82605 83023 84111 85913 88356 91427 94769 97417 98426 97796 96515 95586 95223 95016 94665
57368 94665 94303 94147 94115 93953 93638 93340 92903 91742 89583 87122 85485 85014 85092 85237 85751 86897 88024 88262
57350 88262 87803 87668 88235 88826 88929 89012 89678 90731 91716 92868 94681 96832 98390 99076 99540 100275 100947 101062
57332 101062 100635 99859 98680 97224 96227 96378 97381 98231 98474 98732 99859 101904 104093 105587 106087 105820
57316 105820 105231 104732 104582 104763 104938 104691 103974 103222 102886 102909 102872 102602 102362 102373 102483 102442 102307 102360 102728 103304
57296 103304 103995 104902 106212 107878 109429 110256 110295 110269 110867 111771 111925 110890 109460 108766 109223 110543 112250
57279 112250 113739 114322 113862 113172 113266 114309 115719 117058 118255 119139 119494 119677 120507 122292 124422 126165
57263A26165J287J162J129R35P10O67Q30J157J581J888J795J231M22k82n44k52
57247A39881K75N16L98M40R37J394J182N26K18O11J365K077K576K655K153J364
57231A58568Q36O33L35j29k20M07J340J931K023J843J647J734K363L234L482K634
57215A82661J364O80O69O35L98N95J473K152J666L54n05l51km83j755k930l362
57198A83259l060k297j381q48j244k400l281k930j397M88K043L101L721M011M248
57183A82033M769N637O585P365P852P886P364O674O631P699R408J0804J1410J1537
57169B93654J1769J2374J3280J4376J5631J6903J7841J8145J7961J7836J8183
57158D67953J8908J9707K0580K1670K2623K2556K1091J9113J8075J8523J9664
$$ plain form
57263 126165 127452 128614 129743 130678 131388 132055 132885 134042 135623 137511 139306 140537 140959 140677 140133 139881
57247 139881 140156 140672 141070 141510 142447 143841 145023 145549 145767 146378 147743 149820 152396 155051 157204 158568
57231 158568 159404 160037 160372 160243 160023 160430 161770 163701 165724 167567 169214 170948 173311 176545 180027 182661
57215 182661 184025 184705 185374 186009 186407 187002 188475 190627 192293 192647 192142 191791 191789 191306 189551 186621 183259
57198 183259 180199 177902 176521 175673 174429 172029 168748 165818 164421 164909 166952 170053 173774 177785 182033
57183 182033 186802 192439 199024 206389 214241 222127 229491 236165 242796 250495 259903 270707 282117 293654
57169 293654 305423 317797 331077 345453 361084 377987 395828 413973 431934 449770 467953
57158 467953 486861 506568 527148 548818 571441 593997 615088 634201 652276 670799 690463
57147F90463K0415K0458K0067J9382J8375J7409J7206J8080J9488K0552K0834
57136I02729K0491J9922J9473J9194J8656J7149J4236R968M615j270o258q171
57124A030734n571J243J1337K4785M2052O1941Q1569R8876J14100J28137J40493
57113A729696J49919J56348J61047J65187J69351J74394J81732J92508K07222
57104C287404K26383K50928K81714L19189L63866M16902M79974N54798O42775
57095F823933P44757Q60859R90352J131296J280048J431566J580761J723377J855209
57086A8422158J971352K067363K141001K191589K217603K215566K179631K098046
57078C5504309J947956J697962J323912Q28584K48273l60010r39823j449742j866038
$$ plain form
57147 690463 710878 731336 751403 770785 789160 806569 823775 841855 861343 881895 902729
57136 902729 923220 943142 962615 981809 1000465 1017614 1031850 1041818 1046433 1045163 1038905 1030734
57124 1030734 1025163 1026406 1037743 1062528 1104580 1166521 1248090 1346966 1461066 1589203 1729696
57113 1729696 1879615 2035963 2197010 2362197 2531548 2705942 2887674 3080182 3287404
57104 3287404 3513787 3764715 4046429 4365618 4729484 5146386 5626360 6181158 6823933
57095 6823933 7568690 8429549 9419901 10551197 11831245 13262811 14843572 16566949 18422158
57086 18422158 20393510 22460873 24601874 26793463 29011066 31226632 33406263 35504309
57078 35504309 37452265 39150227 40474139 41302723 41550996 41190986 40251163 38801421 36935383
57069C6935383k179007k389088k504039k536117k499355k407807k274838k112832
57061A8032300j933042j745531j558976j380130j213432j061344r25156q05440
57053G409249p01855o13048n37151m72372m17063l69510l28150k92040k60754
57044C417306k33680k09734j88005j68341j50999j35766j21863j08744r6607q5879
57034A917688p6395o7311n7724m7208l5997k4945j5239p603k008J200k05r414
57022A574839k6998m8583o7286p8759q3220q2951p9356p3068o5416n8163n1993
57011H59046m6390m0965l6073l2054k8715k5733k3014k0516j8213j6361j5326
57000E55686j4967j4621j3809j2629j1362j0170r198q567q116p465o547n655m912
$$ plain form
57069 36935383 34756376 32367288 29863249 27327132 24827777 22419970 20145132 18032300
57061 18032300 16099258 14353727 12794751 11414621 10201189 9139845 8214689 7409249
57053 7409249 6707394 6094346 5557195 5084823 4667760 4298250 3970100 3678060 3417306
57044 3417306 3183626 2973892 2785887 2617546 2466547 2330781 2208918 2100174 2003567 1917688
57034 1917688 1841293 1773982 1716258 1669050 1633053 1608108 1592869 1585266 1583258 1584458 1584253 1574839
57022 1574839 1547841 1499258 1431972 1353213 1269993 1187042 1107686 1034618 969202 911039 859046
57011 859046 812656 771691 735618 703564 674849 649116 626102 605586 587373 571012 555686
57000 555686 540719 526098 512289 499660 488298 478128 468930 460363 452247 444782 438235 432580 427668
56987D27668l978k472m05J807L510M062L348K002Q10j54j428l257n309p215q816
56972D10173r825r900r213q340p408n997m077k378j331l47J319L441N175O215
56958C67507P004P952Q944R553R272P651M549L64m121q084j0865j2196j2392j2103
56944C63035j1638j0749r149o941m429j878M29K295L903N632P458R052J0491J2209
56930C69720J3967J4669J3569J0970P265K223l999r966j4175j6701j8598k0047
56918C48897k0230j8968j7223j5820j4540j2874j0839q784o978n661m973m563
56906B07444l782k506j355q86r08q40k96P25J873K608K723K813L654N129O271
56891B22667O572O563O897P475P914Q269Q703Q868Q233O839N172L396J238j320
$$ plain form
56987 427668 423690 421218 420813 422620 426130 430192 433540 435542 436352 436198 434770 431513 426204 418989 410173
56972 410173 400348 390448 381235 372895 365487 359490 355413 353035 351704 351357 352676 356117 361292 367507
56958 367507 374511 382463 391407 400960 410232 417883 422432 422796 418675 410591 399726 387530 375138 363035
56944 363035 351397 340648 331499 324558 320129 318251 318680 320975 324878 330510 337968 347020 357511 369720
56930 369720 383687 398356 411925 422895 430160 432383 428384 418418 404243 387542 368944 348897
56918 348897 328667 309699 292476 276656 262116 249242 238403 229619 222641 216980 212007 207444
56906 207444 203662 201156 199801 198915 198007 197167 196871 197596 199469 202077 204800 207613 211267 216396 222667
56891 222667 229239 235802 242699 250174 258088 266357 275060 283928 292161 299000 304172 307568 308806 307486
56877C07486l726n350o007n898n281m339l155j622N59L605P265J0845J3762J6076
56863C24220J8315K0723K2907K4318K4855K4710K3807K1723J8106J2883O150j631
56851E41086r287j5202j8374j8992j7959j5907j2890q771l685J874P366J2471
56839D41730J7177K1621K5930L0178L4268L7810M0252M1186M0287L6847K9845
56828G97131J8968N414q656k1317l1310l7765m0352l9730l7174l3578k9083k3750
56816E18798j7981j2170o404o84M857J0104J4940J9007K1948K3951K5451K6095
56804F27912K4524J9618J1569J516r305j9599k7865l3004l5041l4794l3012l0172
56792D62347k6803k3298j9522j5143j0427o149k707K99L417O663R577J1689J2710
$$ plain form
56877 307486 303760 298410 292403 286505 281224 276885 273730 272108 272667 276272 283537 294382 308144 324220
56863 324220 342535 363258 386165 410483 435338 460048 483855 505578 523684 536567 542717 541086
56851 541086 531799 516597 498223 479231 461272 445365 432475 423704 420019 421893 429259 441730
56839 441730 458907 480528 506458 536636 570904 608714 648966 690152 730439 767286 797131
56828 797131 816099 821513 812857 791540 760230 722465 682113 642383 605209 571631 542548 518798
56816 518798 500817 488647 482243 481559 486416 496520 511460 530467 552415 576366 601817 627912
56804 627912 652436 672054 683623 685139 675834 656235 628370 595366 560325 525531 492519 462347
56792 462347 435544 412246 392724 377581 367154 361005 358298 358597 362014 368677 378254 389943 402653
56779D02653J2550J1253Q802N051Q2n430j0594j5044j8897k1911k3277k2662k0956
56766C01620j9458j8467j7247j5330j3177j1393r921q416o944n814m919l895k887
56753A63752k485k826l267l306l224l465l763l467k491j404o30j16K57M52N91
56738A34608R24J276R98j83j602k341k216j748j314q42k56J99K81J02m6q1j37
56721A27622k55k93j80l3O7K79P56J302J537J393J152R38N40p5m41j77M35Q27
56703A35394Q86Q66Q32O92O63J015J360R28k37j117j047n77n08o75m29J11J31
56686A38288n73j167q43K37J296J803J675R61j97j405k093j951j129p0Q53J420
56670A37105J488R50k9q79j004m18J97K43j13k33P4K85j04q69j309j026k68M34
$$ plain form
56779 402653 415203 426456 435258 440309 440391 434961 424367 409323 390426 368515 345238 322576 301620
56766 301620 282162 263695 246448 231118 217941 206548 196627 188211 181267 175453 170534 166639 163752
56753 163752 161267 158441 155174 151868 148644 145179 141416 137949 135458 134054 133424 133308 133565 134017 134608
56738 134608 135532 136808 137806 137623 136021 133680 131464 129716 128402 127560 127304 127503 127784 127886 127840 127759 127622
56721 127622 127367 127074 126894 126861 126928 127207 127963 129265 130802 132195 133347 134285 134825 134750 134309 134132 134567 135394
56703 135394 136280 137146 137978 138670 139333 140348 141708 142636 142399 141282 140235 139658 139150 138475 138046 138157 138288
56686 138288 137715 136548 135705 135942 137238 139041 140716 141677 141480 140075 137982 136031 134902 134832 135685 137105
56670 137105 138593 139543 139514 138635 137631 137213 137410 137653 137540 137307 137381 137666 137562 136693 135384 134358 134090 134524
56652A34524P56P03N07M67P38J158J377J257R83P36M27ok65J4O67J104J004O27
56634A46778L49K14J47K32N38Q88J054J039R82R68J070J317J445J026Q8o98q36
56617A56601o25n40l43M53J474J640O26n55p43JN69J27j068k013j907p72O74J670
56599A55269J880J315K63o41p11k1M58jr26j348j090o68k62L00O80K20q28j274
56581A52615n54N13R63Q59P65P98P91Q52J130J437J647J990K491K632K098J440
56565A72467J385J915K590L365M403N463O152O567P006P326P217O891O708O415
56551B45870N534M369L760L818L755L110K366K086K149K132J871J322L74q47j882
56536B79787k458k784l134l508l917m503n098n074m148l012k677l292m062m290
$$ plain form
56652 134524 135280 135983 136490 136957 137695 138853 140230 141487 142470 143206 143633 143627 143362 143376 144043 145147 146151 146778
56634 146778 147127 147341 147488 147720 148258 149146 150200 151239 152221 153189 154259 155576 157021 158047 158135 157437 156601
56617 156601 155976 155436 155093 155546 157020 158660 159286 158731 157988 157989 158558 158685 157617 155604 153697 152925 153599 155269
56599 155269 157149 158464 158727 158086 157375 157354 157812 157811 156885 155537 154447 153779 153517 153817 154497 154717 153889 152615
56581 152615 152061 152574 153537 154396 155161 155959 156750 157602 158732 160169 161816 163806 166297 168929 171027 172467
56565 172467 173852 175767 178357 181722 186125 191588 197740 204307 211313 218639 225856 232747 239455 245870
56551 245870 251404 255773 259533 263351 267106 270216 272582 274668 276817 278949 280820 282142 282516 281669 279787
56536 279787 277329 274545 271411 267903 263986 259483 254385 249311 245163 242151 239474 236182 232120 227830
56522B27830m123m129m459m633m129l064k144j869j944j687j006n51q28j480j810
56507A89974j666j450j344j050m52m8l86j256j890j839j344p76j70M45O87K59
56491A77694m31o13j65K12l8n59n66J38R61J231Q78M17L81P54J037Q95N53L32
56473A83111M1o52j358j233k56N30M42J40N21J276J365O27k3N2N00P69Q29Q65
56455A87546Q43P15N64L34j66p56q44k32N07P73O62N45L17k55q06o39K19R10Q89
56436A91126N98P03J129J319J127R04Q33P57O68Q20J160J132M77k40l21L8l0q11
56418B01389j524j214J34J587K158J632O61J08K66P20J010J108J126Q94L17j91
56402B10181j95j0k87r31j174q04m08k22L50J557K485K197J103L85M50P50Q86
$$ plain form
56522 227830 223707 219578 215119 210486 206357 203293 201149 199280 197336 195649 194643 194092 193264 191784 189974
56507 189974 188308 186858 185514 184464 184012 183964 183578 182322 180432 178593 177249 176473 176303 176748 177435 177694
56491 177694 177263 176650 176485 176697 176659 176100 175534 175672 176633 177864 178742 179159 179540 180294 181331 182226 182779 183111
56473 183111 183152 182500 181142 179909 179653 180183 180625 180765 181286 182562 183927 184554 184531 184583 185083 185852 186681 187546
56455 187546 188389 189104 189668 190002 189836 189080 188236 188004 188511 189284 189946 190491 190808 190553 189747 189108 189327 190237 191126
56436 191126 191724 192427 193556 194875 196002 196906 197739 198496 199164 199984 201144 202276 202753 202513 202192 202230 202200 201389
56418 201389 199865 198651 198785 200372 202530 204162 204823 204931 205197 205917 206927 208035 209161 210055 210372 210181
56402 210181 209986 209976 209689 208758 207584 206780 206372 206150 206500 208057 210542 212739 213842 214227 214677 215427 216313
56385B16313J042J352J534J329Q13K20j79j31L29P49P62O46R18J503J831J693
56369B30724J446J287R13J20o80q83m23J78M21L04K38N69J186J617J519R88M19
56352B39943R7N1J36K37M39R46J664K036J601O91R3K8J4k03k29K06P60J102J485
56333B51097K176K822K906K451J840J342J191J635K375K554J882J260J558K319
56319B79408K454J800J090P37N69N17O35O46L24J72P64J612J706J097P91J096
56303B95418J222Q04O03J239K236K902L354M002M635M690M062L132K314J876J932
56288C34421K334K879L665M787N709N597M492L463L344L909M600N332O132O619
56274C97283O542O367O768P739Q681R184R292R218R226R661J0733J2308J4039
$$ plain form
56385 216313 217355 218707 220241 221570 222383 222603 222424 222293 222622 223371 224133 224779 225697 227200 229031 230724
56369 230724 232170 233457 234370 234490 233810 232927 232504 232682 233103 233407 233645 234214 235400 237017 238536 239524 239943
56352 239943 240040 240091 240227 240464 240903 241849 243513 245549 247150 247841 247934 247962 247976 247773 247544 247750 248510 249612 251097
56333 251097 253273 256095 259001 261452 263292 264634 265825 267460 269835 272389 274271 275531 277089 279408
56319 279408 281862 283662 284752 285489 286058 286575 287210 287856 288180 288352 289116 290728 292434 293531 294322 295418
56303 295418 296640 297444 298047 299286 301522 304424 307778 311780 316415 321105 325167 328299 330613 332489 334421
56288 334421 336755 339634 343299 348086 353795 359392 363884 367347 370691 374600 379200 384532 390664 397283
56274 397283 403825 410192 416960 424699 433380 442564 451856 461074 470300 479961 490694 503002 517041
56261E17041J5692J7276J9026K1266K4050K6914K9326L1382L3728L6811M0587
56250H13099M4989N0108N5747O1257O6152P0489P4497P8157Q1401Q4282Q6656
56239A566834Q7939Q7466Q4941Q0421P4090O6135N6661M5621L3040J9314N095
56228B207557r039k2621l5179m6413n6365o5052p2072p6999p9942q1262q0971
56217A581642p9115p6435p3861p1371o8171o4032n9639n5483n1318m6883m2471
56206H92863l8456l4921l1920k9442k6954k3830k0440j7938j6686j5660j3968
56195F22648j1969j0405r203p914o686n943n496m739l572k492j854j545j310j106
56181E48414j120j527k086k079j028N75J710K036K115K420K812L066L248L385
$$ plain form
56261 517041 532733 550009 569035 590301 614351 641265 670591 701973 735701 772512 813099
56250 813099 858088 908196 963943 1025200 1091352 1161841 1236338 1314495 1395896 1480178 1566834
56239 1566834 1654773 1742239 1827180 1907601 1981691 2047826 2104487 2150108 2183148 2202462 2207557
56228 2207557 2198518 2175897 2140718 2094305 2037940 1972888 1900816 1823817 1743875 1662613 1581642
56217 1581642 1502527 1426092 1352231 1280860 1212689 1148657 1089018 1033535 982217 935334 892863
56206 892863 854407 819486 787566 758124 731170 707340 686900 668962 652276 636616 622648
56195 622648 610679 600274 591071 583157 576471 570528 565032 560293 556721 554229 552375 550830 549520 548414
56181 548414 547294 545767 543681 541602 540574 541149 542859 544895 547010 549430 552242 555308 558556 561941
56167E61941L376L384L724M191M295M252M867O184P245P556P803Q562R319R581
56153F46280J0052J1649J4011J5977J7263J8692K0943K3871K6989K9989L2713
56142H68429L5197L7887M1430M6095N1471N6802O1700O6534P1851P7240Q1030
56131A495666Q1581P8490P2215O3218N2407M1925L4097K9433K6541K3827K0184
56120B019584J4454N972l970j2779j9165k3875k7699l0493l2843l6811m3720n2410
56108A756245o0775o7811p3114p5617p4331o9663o2860n4829m6388l8731l2478
56097A099648k6951k1388j6229j2278r343o724m331k364n92J157K473L177L861
56084A010116M859N559N657O081P605R516J0687J1092J1209J0971J0507J0815
$$ plain form
56167 561941 565317 568701 572425 576616 580911 585163 590030 596214 603459 611015 618818 627380 636699 646280
56153 646280 656332 667981 681992 697969 715232 733924 754867 778738 805727 835716 868429
56142 868429 903626 941513 982943 1029038 1080509 1137311 1199011 1265545 1337396 1414636 1495666
56131 1495666 1577247 1655737 1727952 1791170 1843577 1885502 1919599 1949032 1975573 1999400 2019584
56120 2019584 2034038 2040010 2036040 2023261 2004096 1980221 1952522 1922029 1889186 1852375 1808655 1756245
56108 1756245 1695470 1627659 1554545 1478928 1404597 1334934 1272074 1217245 1170857 1132126 1099648
56097 1099648 1072697 1051309 1035080 1022802 1013459 1006735 1002404 1000040 999448 1000605 1003078 1006255 1010116
56084 1010116 1014975 1020534 1026191 1032272 1039877 1049393 1060080 1071172 1082381 1093352 1103859 1114674
56072A114674J2387J4062J4620J4571J4960J5443J5180J4729J5212J6284J6746
56061A278868J6692J7233J8440J9196J9053J8681J8630J8935J9688K0775K1302
56050A487493K0598J9392J8827J8826J8701J8747J9751K1364K2550K3246K4099
56039A713594K4974K5312K5639K7050K9347L1227L2212L3037L4247L5728L7560
56028B049927M0085M3225M6615N0141N3451N5701N6787N7951N9986O1835O2369
56017B638073O2502O3898O6542O9365P2346P6058P9927Q2942Q5494Q8670R2395
56006C478212R6104J00359J05843J11615J16454J21098J27089J34262J41515J49096
55996D681647J57802J66967J75691J84998J96252K08476K20075K32153K47154
$$ plain form
56072 1114674 1127061 1141123 1155743 1170314 1185274 1200717 1215897 1230626 1245838 1262122 1278868
56061 1278868 1295560 1312793 1331233 1350429 1369482 1388163 1406793 1425728 1445416 1466191 1487493
56050 1487493 1508091 1527483 1546310 1565136 1583837 1602584 1622335 1643699 1666249 1689495 1713594
56039 1713594 1738568 1763880 1789519 1816569 1845916 1877143 1909355 1942392 1976639 2012367 2049927
56028 2049927 2090012 2133237 2179852 2229993 2283444 2339145 2395932 2453883 2513869 2575704 2638073
56017 2638073 2700575 2764473 2831015 2900380 2972726 3048784 3128711 3211653 3297147 3385817 3478212
56006 3478212 3574316 3674675 3780518 3892133 4008587 4129685 4256774 4391036 4532551 4681647
55996 4681647 4839449 5006416 5182107 5367105 5563357 5771833 5991908 6224061 6471215
55987F471215K65113K84292L04614L27386L52443L78870M07694M40609M77023
55978I709259N15785N58718O08679O65328P26906P95221Q74482R66129J069465
55969A6489972J186826J323531J483487J669630J888222K148326K458611K830238
55961C1478843L281989L837488M519097N349361O353523P550217Q940230J0512659
55953H1823407J2260374J4178366J6242338J8386561K0487549K2356277K3760711
55946B09495583K4472972K4264318K2806237J9618903J4284127O882344j735600
55939C20088884j0186575j7174105k1997220k4620680k5415610k4875253k3459603
55932A72359838k1536090j9364130j7116076j4915691j2856607j0997480r362653
$$ plain form
55987 6471215 6736328 7020620 7325234 7652620 8005063 8383933 8791627 9232236 9709259
55978 9709259 10225044 10783762 11392441 12057769 12784675 13579896 14454378 15420507 16489972
55969 16489972 17676798 19000329 20483816 22153446 24041668 26189994 28648605 31478843
55961 31478843 34760832 38598320 43117417 48466778 54820301 62370518 71310748 81823407
55953 81823407 94083781 108262147 124504485 142891046 163378595 185734872 209495583
55946 209495583 233968555 258232873 281039110 300658013 314942140 321824484 320088884
55939 320088884 309902309 292728204 270730984 246110304 220694694 195819441 172359838
55932 172359838 150823748 131459618 114343542 99427851 86571244 75573764 66211111
55925F6211111p955775o767755n775644m947902m256476l680202l198777k791814
55917B6836766k444569k148450j895352j676609j486894j323580j182127j056848
55909A3622337r45843q50243p68617o96600o31934n75445n26885m83892m45292
55900G697586m11610l82028l54288l27960l04540k84192k65298k47294k31011
55891D889365k16163k01354j86668j73538j62080j51017j40193j30624j22329
55882C405399j14674j08613j05810j05539j05039j03013j00237r6905r2042q5857
55872B387670q0054p5373p1056o6981o3981o1754n8837n5114n2108n0245m8028
55861A704139m4568m0875l7939l5455l3243l2043l1967l1764l0600k9292k8948
$$ plain form
55925 66211111 58255336 51487581 45711937 40764035 36507559 32827357 29628580 26836766
55917 26836766 24392197 22243747 20348395 18671786 17184892 15861312 14679185 13622337
55909 13622337 12676494 11826251 11057634 10361034 9729100 9153655 8626770 8142878 7697586
55900 7697586 7285976 6903948 6549660 6221700 5917160 5632968 5367670 5120376 4889365
55891 4889365 4673202 4471848 4285180 4111642 3949562 3798545 3658352 3527728 3405399
55882 3405399 3290725 3182112 3076302 2970763 2865724 2762711 2662474 2565569 2473527 2387670
55872 2387670 2307616 2232243 2161187 2094206 2030225 1968471 1909634 1854520 1802412 1752167 1704139
55861 1704139 1659571 1618696 1580757 1545302 1512059 1480016 1448049 1416285 1385685 1356393 1327445
55850A327445k9521l0308l0877l0939l0306k9316k8464k7569k6279k5190k5101
55839A013575k5279k4182k1937k0405k0304k0137j8609j6556j5419j5194j4921
55828H00632j4249j3457j2624j1686j0882j0486j0449j0690j1251j1916j2245
55817F70697j2206j2259j2596j2785j2331j1123r354p570o608o830p417p198o061
55804E46359m850m017l313k656k248j829q22N78J420J316Q83O84O05M70L76K03
55788E33159m40j469k282k655k952l259l178k783k999m535o978r363j1109j2177
55774D66980j2724j2878j2605j1696j0129q314o623m951l240k091k053k604k714
55761C74358k327k313k972l584l639l543l821m364m819n142n488o065p138q654
$$ plain form
55850 1327445 1297924 1267616 1236739 1205800 1175494 1146178 1117714 1090145 1063866 1038676 1013575
55839 1013575 988296 964114 942177 921772 901468 881331 862722 846166 830747 815553 800632
55828 800632 786383 772926 760302 748616 737734 727248 716799 706109 694858 682942 670697
55817 670697 658491 646232 633636 620851 608520 597397 588043 580473 573865 567035 559618 552420 546359
55804 546359 541509 537492 534179 531523 529275 527446 526624 527202 528622 529938 530821 531505 532110 532580 532956 533159
55788 533159 532719 531250 528968 526313 523361 520102 516924 514141 511142 506607 499629 490266 479157 466980
55774 466980 454256 441378 428773 417077 406948 398634 392011 387060 383820 381729 379676 377072 374358
55761 374358 372031 369718 366746 363162 359523 355980 352159 347795 342976 337834 332346 326281 319143 310489
55747C10489r832r804q687p398o402n417m367l720l615l409k596j514r15j092
55733B41721j731k227k072j356q14j045j710j993j710j449j690k361l110l525
55719B14928l261k556k257k703k967k089o48l7l60k94Q90K373L067K802K007J117
55703B10012N96O56O97j26j673k932l452l778m318m770m879m713m113k850j566
55688A72791j371k114k251r90N62J052O73N00Q85J394J718J874J926K057K460
55673A81166K776K234P59o78j235j055o62k31O3k10r54j293p40J5J11k91n30m52
55655A78793k23K95J164J830J784J388J286J309P35m94j603j946j637j200j010
55640A80471j072j148j157j428k272l325l851l774l743m046m206l939l695l714
$$ plain form
55747 310489 300657 290853 282166 274768 268366 262949 258582 254862 251247 247838 245242 243728 242813 241721
55733 241721 239990 237763 235691 234335 233521 232476 230766 228773 227063 225614 223924 221563 218453 214928
55719 214928 211667 209111 206854 204151 201184 199095 198447 198410 198050 197756 198646 201019 204086 206888 208895 210012
55703 210012 210608 211264 211961 211835 210162 207230 203778 200000 195682 190912 186033 181320 177207 174357 172791
55688 172791 171420 169306 167055 166065 166627 167679 168352 168852 169737 171131 172849 174723 176649 178706 181166
55673 181166 183942 186176 186935 186257 185022 183967 183305 183074 183137 182927 181973 180680 179940 179955 180066 179775 179245 178793
55655 178793 178570 178865 180029 181859 183643 185031 186317 187626 188361 187867 186264 184318 182681 181481 180471
55640 180471 179399 178251 177094 175666 173394 170069 166218 162444 158701 154655 150449 146510 142815 139101
55626A39101l368k185q63m24q26j197j115q93p82p27q06j298k183k992l229k793
55610A13420k056j635j823k173j982j239n98m27m73n91r68j403j226l70K78J55
55594I6889j58k1J55k92j100j540j519j378j082m66J66M59O61J030J138N81j6
55577I3507K12R63J191O61O9k50o07r91q80j78N31Q53R53R47P41N74Q66J365J237
55558A01764K71p71j247j360j471j432j118r83j493k306k611k132j348q59p85
55543H2119q00n29P2O11O19R3m20l54L12J064J423J421J432J593J548J051M66
55526I1721L14M64L63Mm6K81K81l70j027j163j290k018k856k886k196j665j596
55509G6315j497j106o93l16K65Q64Q16o3j114j669j715j527j142n52j2J42j34
$$ plain form
55626 139101 135733 133548 132685 132261 131435 130238 129123 128230 127448 126721 125915 124617 122434 119442 116213 113420
55610 113420 111364 109729 107906 105733 103751 102512 101914 101487 101014 100423 99455 98052 96826 96456 96734 96889
55594 96889 96731 96710 96865 96573 95473 93933 92414 91036 89954 89488 89654 90113 90774 91804 92942 93523 93507
55577 93507 93719 94682 95873 96534 96603 96353 95746 94755 93875 93697 94228 95081 96034 96981 97722 98296 99162 100527 101764
55558 101764 102035 101264 100017 98657 97186 95754 94636 93653 92160 89854 87243 85111 83763 82904 82119
55543 82119 81319 80790 80862 81473 82092 82185 81765 81411 81723 82787 84210 85631 87063 88656 90204 91255 91721
55526 91721 92035 92499 92862 92866 92820 93101 93382 93012 91985 90822 89532 87514 84658 81772 79576 77911 76315
55509 76315 74818 73712 73019 72703 72968 73832 74648 74585 73471 71802 70087 68560 67418 66866 66854 66996 66862
55492F6862m80l61M44J456J860J470R42P31L92n22j406j308l77L27L08M0n7j50
55474G0171l13k43M2l7p46j490j498p32J93O71N37J12j38j21k36o58r04n56l4
55455F4020L2j34P3M46K48l68m35K25O46K94j33PK82J12k07k13j80m88p44m36
55435F3047j2l23j215j651j146l20O1j5m7K69P63J068J035Q28O10K20n17j267
55417F1388j373o72L31J180J826K172J912J101L13j64p57j761k638k725k214j767
55401E6152j462q30J93R75R92M76J35L92R47J088N11k16l30Q5K34k06o74o89m72
55382E7301l00P0P02R33K65o72q74k88L12N44O85Q62P91L22l08p85q58l36N65
55363E8931J080O76j40m11O3O18O88K29o02j490j782j047J72Q65P38K94j58p01
$$ plain form
55492 66862 66382 66021 66465 67921 69781 71251 72193 72924 73316 72794 71388 70080 69703 70030 70338 70378 70321 70171
55474 70171 69858 69615 69657 69620 68874 67384 65886 65154 65347 66018 66555 66667 66529 66408 66172 65514 64610 64054 64020
55455 64020 64052 63918 63991 64437 64685 64317 63882 64107 64753 65047 64914 64921 65203 65315 65108 64895 64715 64227 63483 63047
55435 63047 63035 62712 61497 59846 58700 58380 58441 58426 58379 58648 59411 60479 61514 62342 62952 63172 62655 61388
55417 61388 60015 59343 59674 60854 62680 64852 66764 67865 68178 68014 67257 65496 62858 60133 57919 56152
55401 56152 54690 53860 54053 55028 56020 56496 56631 57023 57970 59058 59569 59353 59023 59108 59342 59136 58462 57773 57301
55382 57301 57001 57071 57773 58706 58971 58299 57425 57137 57449 57993 58678 59540 60331 60653 60345 59560 58702 58366 58931
55363 58931 60011 60687 60547 60136 60199 60817 61505 61734 61132 59642 57860 56813 56985 57850 58588 58882 58724 58023
55345E8023j075p52N7M44J03l03l84o39j343j734j094R5Q70J058J041P82L9q00
55327E4388r43k45O84J261J320R05L38K91J060J873J673M99o26j132j375j591
55311E8380j372n76J25J85O2M28J000R31P2q22j068o30K12J157J787J687R50J56
55293F2664k70m23n38o03n29m55n73q35j018r71o28L4Q74J463J405O98k20q23
55275E9252q55m54m0R2J37N37J235J522Q89j83p51n58j79m5O3L90O13L54j35j70
55255F1714M98J377J762J358M88j72j38L77O44K37n07r87j104j141j111p35k1
55238F2539O09Q52Q32P13M49R2j2L10O50M23l78j148j381j144q60p56o22j03P76
55219F1841J454J368O34l9k35k78n61q23m63N21J429J695J406R54N43K55J40N6
$$ plain form
55345 58023 56948 56196 56253 56697 56800 56497 56113 55474 54131 52397 51303 51398 52268 53326 54367 55149 55188 54388
55327 54388 53445 53200 53884 55145 56465 57370 57708 57999 59059 60932 62605 63104 62478 61346 59971 58380
55311 58380 57008 56432 56557 56742 56804 57232 58232 59163 59235 58413 57345 56715 56927 58084 59871 61558 62508 62664
55293 62664 62394 61971 61433 60830 60301 59846 59273 58438 57420 56449 55821 55855 56729 58192 59597 60295 60075 59252
55275 59252 58397 57943 57903 57995 58132 58669 59904 61426 62315 62132 61381 60823 60644 60599 60662 61052 61665 62019 61884 61714
55255 61714 62212 63589 65351 66709 67197 67025 66887 67264 67908 68145 67638 66651 65547 64406 63295 62560 62539
55238 62539 63148 64000 64832 65545 65994 66086 66074 66384 67034 67457 67079 65931 64550 63406 62546 61790 61168 61065 61841
55219 61841 63295 64663 65297 65258 65023 64745 64184 63361 62898 63419 64848 66543 67949 68903 69446 69701 69841 69897
55201F9897l26j032j581j488p91J51J082J738J623N52p26j102m78J07n3l44R4
55184F7323Q43O41p94k206k423j761j327j345j009J39J371J612P28m27j010q96
55168E9459m60j2L76P37J096J494J954K297K133J229m9q57p05o8J18m24j022r28
55150F6368k08M95P34N45R4m12o50m22nJ19q7k60l44o75j225j336o29L31P94Q43
55130F4070J068J473J412O34k40m61j5N03N27o4q76j256q40M4P09Q14N65K58o
55111F8319k08l16l66l77k20R9J92k47q14q22k95J16K70P38J566J835J030J22
55093G0622L07J265J615Q96M2j45Oj22l93k58L45R55J191J016N24j45p14q56n35
55074G5616j25p2l80n64k31L73O62M86L09M98Q09P90L57l02j026j556j452o26
$$ plain form
55201 69897 69571 68539 66958 65470 64679 64830 65912 67650 69273 69825 69099 67997 67519 67626 67573 67229 67323
55184 67323 68166 68807 68013 65807 63384 61623 60296 58951 57942 58081 59452 61064 61792 61365 60355 59459
55168 59459 58999 58987 59363 60100 61196 62690 64644 66941 69074 70303 70254 69397 68692 68624 68742 68318 67296 66368
55150 66368 66160 66655 67389 67934 68028 67616 66966 66544 66539 66658 66571 66311 65967 65292 64067 62731 62102 62433 63227 64070
55130 64070 65138 66611 68023 68657 68417 67956 67941 68444 68971 68907 68031 66775 65935 65979 66688 67502 68067 68325 68319
55111 68319 68111 67795 67429 67052 66832 66931 67123 66876 66062 65240 64945 65061 65331 66069 67635 69470 70500 70622
55093 70622 70929 72194 73809 74705 74747 74602 74608 74486 74093 73835 74180 75135 76326 77342 77866 77721 77007 76151 75616
55074 75616 75491 75419 75039 74475 74244 74617 75279 75765 76074 76572 77381 78171 78528 78226 77200 75644 74192 73566
55056G3566K57M60P9j88o2J09P6J7K0j09l51k82K58P35N26k10o29j25J058K100
55036G7305K368J888J080J85q06j583j456k59J001J057j43j403j733j266o29r3
55020G5513M06Q33J042R91P41M04J59N4k11q86j606j696j138p03q63j166r95m65
55002G0414m7K31O81J247J490J203O49J77p0k4L24P85R80P09K20K5K87N54K66
54983H0101l49l38O97J806J758P25N3L95R13O51j65o89o28k30L51J024J411J253
54965H8739Q83P67P74M44k70r92j452j461o76Q65K170K136J008J65K84M49m23
54948I3410j965k733j957l19R19J122O19J29P4L47N37L24l34j154j633j312k34
54931H5840R36J459J223P37N20O27Q47J045J273J584J919K160K332K646L292M128
$$ plain form
55056 73566 73823 74283 74362 74174 74112 74221 74297 74314 74334 74225 73874 73592 73850 74585 75111 74901 74272 74147 75205 77305
55036 77305 79673 81561 82641 82826 82020 80437 78981 78722 79723 80780 80637 79234 77501 76235 75606 75513
55020 75513 75919 76752 77794 78785 79526 79930 80089 80143 79932 79046 77440 75744 74606 73903 73040 71874 70879 70414
55002 70414 70367 70598 71279 72526 74016 75219 75868 76045 75975 75951 76275 77060 78040 78749 78969 78994 79281 79835 80101
54983 80101 79752 79414 80111 81917 83675 84400 84453 84848 85761 86412 86247 85558 84930 84700 85051 86075 87486 88739
54965 88739 89622 90389 91163 91607 91337 90345 88893 87432 86756 87621 89791 91927 92935 93100 93384 93833 93410
54948 93410 91445 88712 86755 86436 87355 88477 89096 89225 89299 89646 90183 90507 90173 89019 87386 86074 85840
54931 85840 86776 88235 89458 90195 90715 91342 92189 93234 94507 96091 98010 100170 102502 105148 108440 112568
54915A12568M695M641M068L394K985K904K966K867K358J358n1j659l054l783l841
54900A32416l856m359m968m800l704k495j823j491j134r32j112j295r70k71K32
54885I9438L36K12l5k82j43N85J417J735J705J969K628L140L245L241L348L464
54869A26003L658M136M612M362L193J779O99k41j378k435k938k987l096l424l700
54854A28243l747l721l764l838l830l647l157k288j221l66o2l46j027j888k720
54839I2621l206k994k048q75j09J18J35O8l18r57j213p37j46k47p99p49L60J758
54821H0662K362J860Q06N1J29P81J075L37r67j670j227k13N20O84N11L36L79O21
54803H7037P91O90M47J77l70j276j818j168K56J044N69k97n15j10L45O20O63K62
$$ plain form
54915 112568 117263 121904 125972 129366 132351 135255 138221 141088 143446 144804 144753 143094 140040 136257 132416
54900 132416 128560 124201 119233 114433 110729 108234 106411 104920 103786 102854 101742 100447 99477 99206 99438
54885 99438 99774 99986 99951 99669 99526 100111 101528 103263 104968 106937 109565 112705 115950 119191 122539 126003
54869 126003 129661 133797 138409 142771 145964 147743 148442 148201 146823 144388 141450 138463 135367 131943 128243
54854 128243 124496 120775 117011 113173 109343 105696 102539 100251 99030 98664 98602 98256 97229 95341 92621
54839 92621 89415 86421 84373 83498 83389 83507 83642 83710 83392 82435 81222 80485 80339 80092 79293 78544 78904 80662
54821 80662 83024 84884 85690 85741 85870 86651 87726 88063 87096 85426 84199 83986 84506 85190 85701 86037 86416 87037
54803 87037 87828 88518 88965 89142 88772 87496 85678 84510 84766 85810 86379 86082 85567 85457 85802 86422 87085 87347
54785H7347l73l74O29J601J250j58j066o62K69O58N59P71J557K258K167J435R62
54768I8830J378K317K904K890K889L438M263M754M755M516M199L867L715L836
54754A48551L790K941J208q00k370l236l618l967m518m938m618l559k656k766
54740A19444l646m211l757k525j223l77j57m13p50q20o23l87k25k4L72J104K166
54723A03948L188L514K854J852J567K406L727M550M504M050L912M258M391L497
54709A52218J635k67j522k368l321m354n077n361n273m761l838k884k207j662
54695A10958j117r72j489j976j578p39p75j926k796k204o81M20O19M24J93k55
54679I6106j008j657j694j054j60M82P30Q28R47Q44L01k90k88K40N02Q8m49m59
$$ plain form
54785 87347 86974 86600 87229 88830 90080 89922 88856 88194 88463 89121 89680 90451 92008 94266 96433 97868 98830
54768 98830 100208 102525 105429 108319 111208 114646 118909 123663 128418 132934 137133 141000 144715 148551
54754 148551 152341 155282 156490 155690 153320 150084 146466 142499 137981 133043 128425 124866 122210 119444
54740 119444 115798 111587 107830 105305 104082 103705 103548 103135 102385 101565 100942 100555 100330 100306 100678 101782 103948
54723 103948 107136 110650 113504 115356 116923 119329 123056 127606 132110 136160 140072 144330 148721 152218
54709 152218 153853 153586 152064 149696 146375 142021 136944 131583 126310 121549 117711 114827 112620 110958
54695 110958 109841 108869 107380 105404 103826 103087 102312 100386 97590 95386 94705 95125 95744 96168 96361 96106
54679 96106 95098 93441 91747 90693 90533 91015 91745 92573 93520 94364 94665 94375 94087 94327 94829 94917 94468 94009
54661I4009p7J68J62J27R4j2OL48O80M89j40n84n51l82l92m28k40N2J45o5m55
54640I2954r06j307j476j269p06RO30J015J180J201R95L59o20j298j030M2J048
54623I0821J355J154R25P28L87N0Q2M86Q68J000R59O81j5q45j028l45L57K26l65
54604I7481l71L81J009R41N46K20l17j257j955j670o03L98R40J210J306J106O97
54587A00062K72l17j248k018j821o79M53Q95Q68P79O14L27J76K10K3m75o83k49
54569I7189J66j68q01p72k37l32j340k073j497j21P86Q39O47P23R77J178J251
54552I6415J070N17j19k64J53M75J63m34n79j89J13J3l3M87J352J887J777J253
54534A04057O58J84j3J75N78Q63R35J038J311J480J141K35q58j595j592q38L20
$$ plain form
54661 94009 93932 94100 94262 94389 94483 94471 94477 94825 95505 95994 95854 95270 94719 94337 93945 93517 93277 93329 93474 93409 92954
54640 92954 92048 90741 89265 87996 87290 87299 87929 88944 90124 91325 92320 92679 92059 90761 89731 89773 90821
54623 90821 92176 93330 94255 94983 95370 95420 95502 95988 96856 97856 98815 99496 99481 98636 97608 97263 97620 97846 97481
54604 97481 97110 97491 98500 99441 99987 100207 99890 98633 96678 95008 94405 94803 95743 96953 98259 99365 100062
54587 100062 100334 100017 98769 96751 94930 94251 94704 95599 96467 97246 97860 98187 98363 98573 98596 98121 97438 97189
54569 97189 97355 97187 96386 95614 95377 95045 93705 91632 90135 90014 90800 91639 92286 93009 93986 95164 96415
54552 96415 97485 98002 97883 97619 97772 98247 98410 97976 97397 97208 97321 97334 97301 97788 99140 101027 102804 104057
54534 104057 104715 104899 104886 105061 105639 106502 107437 108475 109786 111266 112407 112642 111784 110189 108597 107759 108079
54517A08079J346J846J731J175M71j92q71j731k623l010k544j530n36L44J295
54502A03250K003J799P30j70j72J52j87j050j304l93Q62J289O80j70m59o9N56
54485A07347Q99O79m5r07j341r50j1N80J94o96r62k15P25R82O92N10N21L83J51
54466A08536K16M04Q1p21j086m66N45J130J283J343J107K38p91j042l73M17P36
54449A11557P71P66N49R0j16K32O78O82M27L42K08m43j288j441q13k96l70l98
54431A11137K28R33Q20R0k49J15M68K95m6q7Rj15l01j37L94R03J094R64O70M26
54411A17611L64K67l43j556k651k656j362M75J785J979J183R7m78k60L47P69R27
54394A16498J109J423J625J524J178P14J73l57p24q58p75m46J08N63M89j17p46
$$ plain form
54517 108079 109425 111271 113002 114177 114648 114456 113585 111854 109231 106221 103677 102147 101611 101955 103250
54502 103250 105253 107052 107782 107612 107440 107592 107405 106355 105051 104658 105520 106809 107489 107319 106860 106791 107347
54485 107347 108246 108925 108880 107973 106632 105682 105671 106251 106445 105749 104787 104572 105297 106279 106971 107481 108002 108385 108536
54466 108536 108752 109156 109237 108516 107430 106964 107509 108639 109922 111265 112372 112610 111819 110777 110404 110821 111557
54449 111557 112328 113094 113643 113733 113617 113849 114527 115209 115636 115978 116186 115743 114455 113014 112201 111905 111535 111137
54431 111137 111365 112298 113118 113208 112959 113074 113542 113837 113791 113704 113713 113598 113297 113160 113554 114457 115551 116515 117185 117611
54411 117611 117975 118242 117899 116343 113692 111036 109674 110149 111934 113913 115096 115193 114715 114455 114802 115571 116498
54394 116498 117607 119030 120655 122179 123357 124071 124244 123887 123163 122305 121530 121084 121192 121755 122244 122127 121381
54377A21381r44p02k04M62J145J506J388J058P71L25n50j491j774j267o52m55
54361A19997l68J56R78J367R13p5j034j595j610j082k80L44N42M14J49j81m93
54344A18142o06n33n50p55p64j93P04J205R45K77j88k07j9l0l24m38J48J128J374
54325A19316K57j324j923j354p37p61q66m41Q9L6m24o46n54m90l31L17J204J574
54307A12942J215P08N55O72Q60J117J294J049M22K1K91R92J605J922J981J763
54291A29409J292Q14O00P27J132J647J971J864J509J351J453J362P86ro53j133
54275A44122j583j952k207k486k767k685k058j282q29o00j83M42Q60P91L14l53
54259A27544r80j320j261q68j40R91K157K498J570O8r07j086j009r78p60k77Q2
$$ plain form
54377 121381 120437 119735 119531 119993 121138 122644 124032 125090 125861 126186 125636 124145 122371 121104 120452 119997
54361 119997 119629 119785 120763 122130 123043 122968 121934 120339 118729 117647 117367 117711 118253 118667 118816 118635 118142
54344 118142 117536 117003 116453 115698 114934 114741 115445 116650 117595 117872 117684 117477 117458 117428 117104 116666 116814 117942 119316
54325 119316 119573 118249 116326 114972 114235 113474 112608 112167 112256 112292 111868 111222 110668 110178 109847 110164 111368 112942
54307 112942 114157 114865 115420 116092 116952 118069 119363 120412 120834 120855 121146 122138 123743 125665 127646 129409
54291 129409 130701 131515 132115 132842 133974 135621 137592 139456 140965 142316 143769 145131 145917 145908 145255 144122
54275 144122 142539 140587 138380 135894 133127 130442 128384 127102 126273 125673 125490 125932 126792 127583 127897 127544
54259 127544 126564 125244 123983 123115 122975 123966 126123 128621 130191 130259 129352 128266 127257 126279 125519 125242 125324
54242A25324N6j84m35o79p58l78L12O43K36n14j010j138j090r33o35k77K5J87
54224A18752Po44j362j454r15n41p56q64j51Q66J102N11J19N55J374J874J826
54207A20299J282M22k24j81J10l97j721k357j129J040K114J411J97j69J60J06
54191A20963p99j906k220j357J45J330J644J349J045R13O42k0r27j709j981j478
54175A15634l93M45K84n66r81m73K11K71j8rJ08l04r87r01J85J223J294P50M21
54156A16194L51M9m56o38l94j95k67j88M59J450K145K131J496O95K94N31J084
54139A24741J309R14J95l82o86q33q51o11j33K70K87Lj27J97O65O27j25j019j298
54120A23143p92N4P49J110J161R50N60R5l59o39n35q9K21p0p88j252r94j60P38
$$ plain form
54242 125324 125380 125196 124761 124082 123324 122946 123258 123901 124137 123623 122613 121475 120385 119452 118817 118540 118565 118752
54224 118752 118759 118115 116753 115299 114384 113843 113087 112223 112072 112938 114040 114551 114670 115225 116599 118473 120299
54207 120299 121581 122003 121779 121598 121708 121311 119590 117233 116104 117144 119258 120669 120866 120697 120857 120963
54191 120963 120164 118258 116038 114681 114826 116156 117800 119149 120194 121107 121749 121729 120802 119093 117112 115634
54175 115634 115241 115686 115970 115404 114423 113950 114161 114432 114414 114405 114513 114209 113222 112321 112506 113729 115023 115773 116194
54156 116194 116545 116594 116138 115500 115106 114911 114644 114456 114915 116365 118510 120641 122137 122832 123126 123657 124741
54139 124741 126050 126964 127159 126777 126091 125258 124407 123796 123663 123933 124220 124223 124096 124293 124958 125585 125460 124441 123143
54120 123143 122351 122405 123154 124264 125425 126375 126935 127030 126671 126032 125497 125408 125629 125559 124771 123519 122525 122365 123103
54101A23103J163P59k47r23m33Q61J613J041k28j106j284j140q93m92m6K75N76
54084A22599J008J315J166P78O90R47J055Q05N22M68N30O62J068J625J691R03
54068A37832j78o35k22N28J024J003M35n42j509j937j659r80k95L22J033J872
54052A36092K517K499J721P19K75O41J335J737J786J895K309K781K923K751K757
54037A64738L376M400N043M762L954L569L962M480M297L370K329J688J571J977
54023B13516K745L240K682J146j73k17N90P87l29j803k232j484q19j347k865m301
54007B09136m916m808m456m142l917l758l647l537l345l021k578k124j852j898
53993A61137k160k295j984j248n25l06o42j068j146r11n85q6O79J177N70j038
$$ plain form
54101 123103 124266 125025 124778 123855 123422 124283 125896 126937 126709 125603 124319 123179 122286 121794 121748 122023 122599
54084 122599 123607 124922 126088 126866 127556 128503 129558 130363 130885 131353 131883 132545 133613 135238 136929 137832
54068 137832 137654 137019 136797 137325 138349 139352 139787 139245 137736 135799 134140 133160 132865 133187 134220 136092
54052 136092 138609 141108 142829 143548 143823 144464 145799 147536 149322 151217 153526 156307 159230 161981 164738
54037 164738 168114 172514 177557 182319 186273 189842 193804 198284 202581 205951 208280 209968 211539 213516
54023 213516 216261 219501 222183 223329 223156 222939 223529 224316 223987 222184 219952 218468 217649 216302 213437 209136
54007 209136 204220 199412 194956 190814 186897 183139 179492 175955 172610 169589 167011 164887 163035 161137
53993 161137 158977 156682 154698 153450 152925 152619 151977 150909 149763 148852 148267 148181 148860 150037 150607 149569
53977A49569k318k200j157l83j86%L91O01N34N39N47R1n70l44J068K375K270J072
53959A51899K3m24o57p18k31O26J143J203J483K303L044L035K457J948J824J993
53943A70951K275K467K407K240K395L069L927M501M694M743M905N292N832O285
53929B25983O522O801P530Q722R898J0592J0713J0450J0144J0220J0812J1337
53917C39724J0897R260P115N157L347J254j206l594n252n600m607l117k320k593
53903C48465l278l801m398n325o048n945n405n358n886o172n788n255n137n298
53889B75371n402n512n821o194o368o308o049n449m518l715l530l827l996l764
53875B04918l481l490l519l020k047j441j869k867l270k646j880j965k597k578
$$ plain form
53977 149569 147251 145051 143894 143511 143325 143325 143716 144317 144851 145390 145937 146028 145458 145114 146182 148557 150827 151899
53959 151899 151922 151498 150841 150123 149892 150518 151661 152864 154347 156650 159694 162729 165186 167134 168958 170951
53943 170951 173226 175693 178100 180340 182735 185804 189731 194232 198926 203669 208574 213866 219698 225983
53929 225983 232505 239306 246836 255558 265456 276048 286761 297211 307355 317575 328387 339724
53917 339724 350621 359881 366996 372153 375500 376754 375548 371954 366702 361102 356495 353378 351058 348465
53903 348465 345187 341386 336988 331663 325615 319670 314265 308907 303021 296849 291061 285806 280669 275371
53889 275371 269969 264457 258636 252442 246074 239766 233717 228268 223750 220035 216505 212678 208682 204918
53875 204918 201437 197947 194428 191408 189361 187920 186051 183184 179914 177268 175388 173423 170826 168248
53861A68248j484k88q9q16j557j759j569j237p28j6O60R99R03M39k33q13r95p47
53843A58918l70j66j29p3R0K60K99J74l4j74j53p4j46l63m20j06L45N24M18M09
53823A59229O80R49R60R22J138J447J381Q07P3m05l96K63J522K789L279K905K445
53806A79988K498K708K503K170K494L399L874L417K848L161M121M611M095L053
53792B24940K045J140M51M81J349K108J651K04p98n24K25J99o48j325j338j265
53776B28895j776k731l582m057m144l807l210k846k998l237k946k234j765j794
53762A87768j869j600j186r58q92q15p24o08k35N78J648K689L639M504N114N390
53746B02443N683O427P552Q614R466J0376J1445J2340J2587J1708R076M364j551
$$ plain form
53861 168248 166764 166476 166387 165571 164014 162255 160686 159449 158721 158705 159365 160364 161267 161706 161473 160660 159665 158918
53843 158918 158548 158382 158253 158180 158270 158530 158829 159003 158969 158795 158642 158568 158422 158059 157639 157533 157878 158402 158820 159229
53823 159229 159909 160858 161818 162740 163878 165325 166706 167513 167586 167181 166785 167048 168570 171359 174638 177543 179988
53806 179988 182486 185194 187697 189867 192361 195760 199634 203051 205899 209060 213181 217792 221887 224940
53792 224940 226985 228125 228576 229057 230406 232514 234165 234369 233571 233047 233272 233471 232823 231498 230160 228895
53776 228895 227119 224388 220806 216749 212605 208798 205588 202742 199744 196507 193561 191327 189562 187768
53762 187768 185899 184299 183113 182155 181263 180448 179724 179116 178881 179459 181107 183796 187435 191939 197053 202443
53746 202443 208126 214553 222105 230719 240185 250561 262006 274346 286933 298641 307717 312081 310530
53733C10530o707r710j0928j1533j1776j1034r354p848p202o701n396l607k471
53720B06263k326k415k139j780j753j782j298k28R54J766J996J676J099P39Q62
53705B01634J265J550J580J512J517J658J983K472K918L009K602J887J346J462
53691B28395K260L098L198K586K104K295K606K154R57k04r47j572k120j971q74
53676B41965L07N38n9n26n58q29j701k402k031q51Q9L50M00N63M78p7n27l28N0
53657B34851k56j089j370o95J2j44q27j191j202j412j744j458l45Q52J379J271
53641B26632R32N66L36N47J191J671J474R22P58J155J609J708J601J625J876K343
53625B46946L061L935M582M667M329M082M219M521M586M406M402M870N499N626
$$ plain form
53733 310530 303823 294113 283185 271652 259876 248842 239488 231640 224438 217737 212341 208734 206263
53720 206263 203937 201522 199383 197603 195850 194068 192770 192542 193496 195262 197258 198934 200033 200772 201634
53705 201634 202899 204449 206029 207541 209058 210716 212699 215171 218089 221098 223700 225587 226933 228395
53691 228395 230655 233753 236951 239537 241641 243936 246542 248696 249653 249449 248502 246930 244810 242839 241965
53676 241965 242272 242810 242751 242225 241667 240838 239137 236735 234704 233853 233942 234292 234692 235255 235733 235656 235129 234801 234851
53657 234851 234595 233506 232136 231441 231453 231309 230482 229291 228089 226677 224933 223475 223130 223982 225361 226632
53641 226632 227564 228130 228466 229013 230204 231875 233349 234271 235029 236184 237793 239501 241102 242727 244603 246946
53625 246946 250007 253942 258524 263191 267520 271602 275821 280342 284928 289334 293736 298606 304105 309731
53611C09731M953L833K811K053J361O71K40L27P81J122J051P72P03R09J005P08
53595C33031K64Q7J74J56q3k24n5K07K83J89Km08j041j470j392j272j857l040
53577C23551l800l490k634k118k081k047j838j690j599j214n16m6j89n90o62l44
53561B98693jJ85L32M58M53L99N36P96P76L10k28m15k68o2J12L66P06J011J204
53542C05363J250J111R13J108K078L606M925N513N605N871O556P109O843N953
53528C63804N583O589Q391R551R533R285R843J0997J1889J2359J2985J4046J5255
53515E00110J6400J7492J8248J8260J7873J8103J9359K0886K1842K2342K2933
53504G13848K3605K3900K3691K3259K2818K2421K2165K2069K1943K1741K1767
$$ plain form
53611 309731 314684 318517 321328 323381 324742 325413 325653 325980 326761 327883 328934 329706 330409 331318 332323 333031
53595 333031 333295 333382 333556 333712 333629 333405 333350 333557 333840 334029 334031 333623 332582 331112 329720 328448 326591 323551
53577 323551 319751 316261 313627 311509 309428 307381 305543 303853 302254 301040 300524 300478 300289 299699 299037 298693
53561 298693 298692 298877 299209 299667 300120 300519 301055 301851 302627 302937 302709 302294 302026 301964 302076 302442 303148 304159 305363
53542 305363 306613 307724 308637 309745 311823 315429 320354 325867 331472 337343 343899 351008 357851 363804
53528 363804 369387 375976 384367 393918 403451 412736 422579 433576 445465 457824 470809 484855 500110
53515 500110 516510 534002 552250 570510 588383 606486 625845 646731 668573 690915 713848
53504 713848 737453 761353 785044 808303 831121 853542 875707 897776 919719 941460 963227
53493I63227K2154K2454K2255K1854K1643K1154J9574J7144J5146J4261J3778
53482A174644J2837J1687J1155J1415J1991J2535J2945J2843J1806J0184Q958
53471A303000Q444P704N735K843K61j454l032n327q123j0446j1727j2206j2337
53458A263335j2384j2544j2971j3495j3748j3783j4158j5111j6114j6674j7205
53447A105148j8393j9853k0219j8820j6636j5147j4652j4264j3307j2052j0993
53436I30812r943q333o232m493l755l614l064j662J31J678K885M010N144O163
53422I09727P030P845Q696R657J0841J2210J3561J4797J6122J7669J9131K0185
53410A067471K1104K2465K4307K6080K7526K9019L0823L2563L3802L4787L6136
$$ plain form
53493 963227 985381 1007835 1030090 1051944 1073587 1094741 1114315 1131459 1146605 1160866 1174644
53482 1174644 1187481 1199168 1210323 1221738 1233729 1246264 1259209 1272052 1283858 1294042 1303000
53471 1303000 1311444 1319148 1324883 1327726 1327987 1326533 1323501 1318174 1310051 1299605 1287878 1275672 1263335
53458 1263335 1250951 1238407 1225436 1211941 1198193 1184410 1170252 1155141 1139027 1122353 1105148
53447 1105148 1086755 1066902 1046683 1027863 1011227 996080 981428 967164 953857 941805 930812
53436 930812 920869 912536 906304 901811 898056 894442 891378 889716 889847 891525 894410 898420 903564 909727
53422 909727 916757 924602 933298 942955 953796 966006 979567 994364 1010486 1028155 1047286 1067471
53410 1067471 1088575 1111040 1135347 1161427 1188953 1217972 1248795 1281358 1315160 1349947 1386083
53399A386083L8012M0006M1818M3530M5225M6703M7785M8618M9465N0305N0858
53388A888408N1027N1083N1281N1365N0656M8785M6168M3589M1398L9267L6733
53377B399760L3710L0408K6991K3454J9730J5796J1767P933M570J603j437n057
53365B569228r498j4719k0475k6322l1738l6414m0367m3682m6317m8204m9380
53354B202112m9885m9709m9004m8058m6963m5469m3439m1233l9434l8305l7812
53343A712801l7918l8503l9045l8897l7935l6595l5160l3443l1371k9435k8142
53332A326357k7204k5764k3460k0873j8824j7446j6261j4968j3934j3769j4542
53321A119312j5565j5913j5143j3538j1797j0510r820r401q761p691o408n223
$$ plain form
53399 1386083 1424095 1464101 1505919 1549449 1594674 1641377 1689162 1737780 1787245 1837550 1888408
53388 1888408 1939435 1990518 2041799 2093164 2143820 2192605 2238773 2282362 2323760 2363027 2399760
53377 2399760 2433470 2463878 2490869 2514323 2534053 2549849 2561616 2569549 2574119 2575722 2574285 2569228
53365 2569228 2559730 2545011 2524536 2498214 2466476 2430062 2389695 2346013 2299696 2251492 2202112
53354 2202112 2152227 2102518 2053514 2005456 1958493 1913024 1869585 1828352 1788918 1750613 1712801
53343 1712801 1674883 1636380 1597335 1558438 1520503 1483908 1448748 1415305 1383934 1354499 1326357
53332 1326357 1299153 1273389 1249929 1229056 1210232 1192786 1176525 1161557 1147623 1133854 1119312
53321 1119312 1103747 1087834 1072691 1059153 1047356 1036846 1027026 1017625 1008864 1001173 994765 989542
53309I89542m031k391k23J795K824K861K856L741N543P634R594J1501J3420J5008
53295A059674J5873J6113J6324J7107J8639K0618K2419K3432K3518K3154K2987
53284A279858K3133K3023K2009K0009J7540J5163J3069J1143R252P381N487L412
53272A450479J095j252l354n311p573j0341j3158j5344j6701j7607j8538j9745
53260A322650k1268k2911k4195k4725k4723k4888k5522k6166k6245k5804k5252
53249A050951k4620k3562k2151k1099k0988k1506k1803k1513k1136k1306k1954
53238H09313k2376k2011k0942j9641j8510j7747j7348j7056j6475j5502j4415
53227F07290j3353j1985j0104q359p709q199q898r199r530j0489j1793j2621j2613
$$ plain form
53309 989542 985511 983120 982897 984692 987516 990377 993233 996974 1002517 1010151 1019745 1031246 1044666 1059674
53295 1059674 1075547 1091660 1107984 1125091 1143730 1164348 1186767 1210199 1233717 1256871 1279858
53284 1279858 1302991 1326014 1348023 1368032 1385572 1400735 1413804 1424947 1434199 1441580 1447067 1450479
53272 1450479 1451574 1450322 1446968 1441657 1434084 1423743 1410585 1395241 1378540 1360933 1342395 1322650
53260 1322650 1301382 1278471 1254276 1229551 1204828 1179940 1154418 1128252 1102007 1076203 1050951
53249 1050951 1026331 1002769 980618 959519 938531 917025 895222 873709 852573 831267 809313
53238 809313 786937 764926 743984 724343 705833 688086 670738 653682 637207 621705 607290
53227 607290 593937 581952 571848 563489 555780 547581 538683 529484 519954 509465 497672 485051 472438
53214D72438j2090j1523j1263j1496j1957j1898j0877r442q452p951p297o369
53202C51823n860o179o731o713o113n552n405n538n689n739n627n293m746m106
53188B72532l594l424l540l518k964k027j256r46q90q63r07j015r37n76k38k27
53172B45610m08m83l89k43q0Q7J37M3o7k07n89j086j150n69Q8K40J19J98K63k18
53152B41296j044j450j252r21o08KP05O64k82j142j107o31n29o87m72P1L03l0
53134B32886n93j073j280q01N76K129K626J681J62q88j222j187j076j008j019
53119B29913j082j100j015p33j10O58Q21k06j945l240l534l164k467j381k06J84
53103B11393n81j668k065j805j543j423j103n57j00K55O54P78J41r53j545j328
$$ plain form
53214 472438 460348 448825 437562 426066 414109 402211 391334 381892 373440 365489 358192 351823
53202 351823 345963 339784 333053 326340 320227 314675 309270 303732 298043 292304 286677 281384 276638 272532
53188 272532 268938 265514 261974 258456 255492 253465 252209 251263 250373 249510 248603 247588 246651 246075 245837 245610
53172 245610 245202 244719 244330 244087 244007 244094 244231 244274 244207 244000 243411 242325 241175 240606 240694 240934 241053 241251 241514 241296
53152 241296 240252 238802 237550 236629 236021 236023 236728 237392 237110 235968 234861 234230 233701 233014 232542 232613 232916 232886
53134 232886 232293 231220 229940 229139 229715 231844 234470 236151 236313 235425 234203 233016 231940 230932 229913
53119 229913 228831 227731 226716 225983 225873 226531 227352 227146 225201 221961 218427 215263 212796 211415 211209 211393
53103 211393 210812 209144 207079 205274 203731 202308 201205 200648 200548 200803 201457 202235 202376 201423 199878 198550
53087A98550j061j378j853j745j152p79q11o32L09J705K633K423J222j87j072
53072A96172j226q47j47O84J217R50j39j388j992j654p06K12N84L54n5k38k50
53055A91531l46l71J00R25J343J007N59O80J031Q09J4n47m27l9J43K03L98O70
53037A97683Q23Q43P53M88J38J9K34M48L30p2n37r55j133p57N5N33J05q05j315
53018A96878j236j022q09k43N73Q61K24o43p87r2Q65J624K060K090J731J265Q91
53001B04230L30p27j900k355j779o96J57M71L57J44J77M72N97K63j35J1N77R03
52983B01097Q83J130J865K414K160J327M17m99j370j647r63J03O49O37P46J210
52967B10159J543J395J041Q55Q93R91J001Q41O56P83J259J567J359J093J305J551
$$ plain form
53087 198550 197489 196111 194258 192513 191361 190582 189771 189139 189448 191153 193786 196209 197431 197244 196172
53072 196172 194946 194099 193952 194636 195853 196803 196664 195276 193284 191630 190924 191136 191720 192074 192019 191781 191531
53055 191531 191185 190814 190914 191839 193182 194189 194748 195428 196459 197268 197282 196735 196308 196269 196412 196615 197013 197683
53037 197683 198506 199349 200102 200590 200728 200747 200981 201429 201759 201687 201150 200195 199062 198305 198360 198893 198998 198193 196878
53018 196878 195642 194620 193811 193568 194141 195002 195226 194583 193796 193704 194569 196193 198253 200343 202074 203339 204230
53001 204230 204560 203833 201933 199578 197799 197103 197260 197731 198088 198232 198409 198881 199478 199741 199606 199617 200194 201097
52983 201097 201980 203110 204975 207389 209549 210876 211293 210794 209424 207777 206814 206917 207566 208203 208949 210159
52967 210159 211702 213097 214138 214993 215886 216877 217878 218719 219375 220158 221417 222984 224343 225436 226741 228292
52951B28292R07n17j594j771j656j777j769j269p51p61j067j225j307j405j058
52936B11272p2P36N12k61m31N4K06l14p18m87j12p1r3O2r0q48j484j136j61K97
52916B06861j09o08n80l51m98r68j249j079n95m5L14K08m26j187j437r18mP16
52898A98045R77R42Q92R58J034R11M74j06m84m88k93j30k2Q6K8l06n33j10P76
52879B02651J184N92k99m98r2qn11p48j08O94M97o68j531j192j33N40L78j96o36
52860A99916o93k26Q13K104K949K881K068R55k05j242j814j752j503j730k472
52845B00049l121l255l022k581j735m47P34J193R09L15k97q37j189j347j579k046
52829A81744k390k135j414q11n70l69N5N21P09N07j2o22q90n04K66O86L67k82
$$ plain form
52951 228292 229199 228682 227088 225317 223661 221884 220115 218846 218095 217334 216267 215042 213735 212330 211272
52936 211272 211200 211936 212448 212187 211756 211810 212016 211702 210984 210497 210385 210314 210221 210283 210193 209345 207861 206725 206564 206861
52916 206861 206752 206144 205564 205213 204715 203747 202498 201419 200824 200779 201093 201301 200875 199688 198251 197333 197329 198045
52898 198045 199022 199964 200856 201814 202848 203759 204233 204127 203643 203155 202862 202732 202710 202796 202824 202518 201985 201875 202651
52879 202651 203835 204427 204128 203630 203538 203530 203019 202271 202163 202857 203354 202686 201155 199963 199830 200370 200748 200552 199916
52860 199916 199223 198997 199810 201914 204863 207744 209812 210767 210562 209320 207506 205754 204251 202521 200049
52845 200049 196928 193673 190651 188070 186335 185888 186622 187815 188724 189039 188742 187905 186716 185369 183790 181744
52829 181744 179354 177219 175805 174994 174424 174055 174110 174631 175340 175847 175835 175213 174323 173819 174085 174771 175138 174856
52811A74856n57k11M17Q33Q51P08P74J114J435J522J462J253N45p30j797j812
52795A80663j110q65j439j947j696j172j051j015m19M59P16J43o03r97j038p12
52779A67917P3R09J086O55N55J296K140K135J388P29N13M83N65R64J398J097j06
52762A83797j241j292m94m1n85j501j745j012O1O48M50j73n92m96j04K05M51R79
52744A77315J802K324J980R54Ml88l67l31n51j088j769k120j696o72J89L91K70
52727A76247N24J321K247K934L342L422K927J771L50q21j653k379k895k605j191
52712A83541O58J666J286K55k92l6M35N54K89j02m25m38J24J130J898J831J078
52695A93452K77k21n65q70r34o57l67l72l74K50J466K285J793L58o59m54L30N45
$$ plain form
52811 174856 174299 174088 174505 175338 176189 176897 177671 178785 180220 181742 183204 184457 185002 184272 182475 180663
52795 180663 179553 178688 177249 175302 173606 172434 171383 170368 169949 170408 171124 171267 170664 169667 168629 167917
52779 167917 167990 168899 169985 170640 171195 172491 174631 176766 178154 178883 179396 179879 180444 181408 182806 183903 183797
52762 183797 182556 181264 180770 180729 180144 178643 176898 175886 175947 176595 177045 176872 176280 175784 175680 175885 176336 177315
52744 177315 179117 181441 183421 184375 184379 183991 183624 183293 182742 181654 179885 177765 176069 175397 175586 175977 176247
52727 176247 176771 178092 180339 183273 186615 190037 192964 194735 195085 194264 192611 190232 187337 184732 183541
52712 183541 184199 185865 187151 187406 187114 187078 187513 188067 188356 188254 187829 187391 187515 188645 190543 192374 193452
52695 193452 193729 193508 192943 192073 191139 190482 190115 189743 189369 189619 191085 193370 195163 195521 194862 194408 194738 195283
52677A95283lm62j60N98J104J117R39Q44P97O87N58N94Q47J062Q87L75J19O00
52659B05786J427J669R92M5m27m14k99j80OJ9l58p35m09O00J390J174Q5j147j967
52640B07257k249k126j847j656j583j415r86l29M54J308K100K668L077L594M187
52625B12454M379L926L362L401L893L818K483L44j526k547k994l453m098m478
52611B18964m000k679j410j079j438j299p9J293J533O03m69j067j442j705j405
52596B04321m62L59N01M17P10J081J043J054J836K881K883J724P43P66J007N41
52580B21405k25l57J03M25M46N39O70M36k8j05K96N51K97o0o3J66J87j91q62j514
52560B22116j717j269n99m45r61j454j249m43L20N96M23J17pJ21K33M2l46m78
$$ plain form
52677 195283 195280 194818 194658 195256 196360 197477 198416 199260 200057 200744 201302 201896 202743 203805 204692 205067 205186 205786
52659 205786 207213 208882 209874 209919 209492 209078 208779 208599 208605 208624 208266 207531 207122 207722 209112 210286 210371 209224 207257
52640 207257 205008 202882 201035 199379 197796 196381 195395 195066 195520 196828 198928 201596 204673 208267 212454
52625 212454 216833 220759 224121 227522 231415 235233 237716 238060 236534 233987 230993 227540 223442 218964
52611 218964 214964 212285 210875 209796 208358 207059 206980 208273 209806 210409 209940 208873 207431 205726 204321
52596 204321 203859 204218 204719 205136 205846 206927 207970 209024 210860 213741 216624 218348 219091 219857 220864 221405
52580 221405 221180 220823 220926 221351 221797 222336 223006 223442 223414 223309 223605 224156 224453 224393 224330 224496 224683 224492 223630 222116
52560 222116 220399 219130 218531 218086 217125 215671 214422 213979 214299 214895 215318 215435 215428 215549 215782 215824 215478 215000
52542B15000j46L70O61O26M13J78j1j70l60m94l03K43O61M56j34m05k08j27m95
52523B15755q67q14o17p32j008j009p89p35q32o51j4Q21J549K011K034J579J056
52506B16737J042J605K255K620K783K837K534J614L04q01j311j371j438j746k024
52491B25640j884j406j131j326j646j690j518j264o66L70J089O20o55j321o98
52476B12514M00R51R57R26Q60N13J20J29M44O37P36J060J468J450J038R25J486
52459B26614K282K738K869K986L096K852J954M36j263k437k690k414k358k630
52445B32035k591j883j107j075j792k535k714k244j269r1P95R89O21K00Kj13k99
52428B16929m73m88l60j60J06M11O41O88O17O66J039J625J996J877J553J574K007
$$ plain form
52542 215000 214854 215224 215885 216511 216924 217102 217091 216921 216561 216067 215764 216007 216668 217124 216990 216585 216377 216250 215755
52523 215755 214888 214074 213457 212725 211717 210708 209919 209184 208352 207701 207687 208508 210057 212068 214102 215681 216737
52506 216737 217779 219384 221639 224259 227042 229879 232413 234027 234331 233530 232219 230848 229410 227664 225640
52491 225640 223756 222350 221219 219893 218247 216557 215039 213775 213109 213479 214568 215188 214533 213212 212514
52476 212514 212914 213865 214822 215748 216608 217121 217241 217370 217814 218451 219187 220247 221715 223165 224203 225128 226614
52459 226614 228896 231634 234503 237489 240585 243437 245391 245827 244564 242127 239437 237023 234665 232035
52445 232035 229444 227561 226454 225379 223587 221052 218338 216094 214825 214734 215529 216518 217139 217339 217341 217228 216929
52428 216929 216456 215968 215608 215448 215554 215965 216606 217294 217911 218577 219616 221241 223237 225114 226667 228241 230248
52411B30248K425K682L195M121M754M338L146K254K364L394M898O257O606N410
52397B86092L203J095n62k229l937m913m810m428m557m777m214k930j764j115
52383B50154o32lO59J193J585J758J659J570J857K423K767K689K545K747L315
52368B76286L933M257M133L757L490L359K953K104J345J195J230N48q69j993k048
52353C03680j353o02J39J221K529L343L169K395K026K695L986M906N039M919N149
52338C43241N609O005O625P853R195R756R699J0212J1808J3570J4576J5198J6246
52325D79593J7553J8301J8442J8824J9918K1207K2012K2306K2461K2606K2533
52314G05756K2109K1474K0794K0010J8922J7606J6513J5998J5819J5414J4543
$$ plain form
52411 230248 232673 235355 238550 242671 247425 251763 254909 257163 259527 262921 267819 274076 280682 286092
52397 286092 289295 290390 289828 287599 283662 278749 273939 269511 264954 260177 255963 253033 251269 250154
52383 250154 249522 249519 250178 251371 252956 254714 256373 257943 259800 262223 264990 267679 270224 272971 276286
52368 276286 280219 284476 288609 292366 295856 299215 302168 304272 305617 306812 308042 308590 307721 305728 303680
52353 303680 302327 301725 301864 303085 305614 308957 312126 314521 316547 319242 323228 328134 333173 338092 343241
52338 343241 348850 354855 361480 369333 378528 388284 397983 408195 420003 433573 448149 463347 479593
52325 479593 497146 515447 533889 552713 572631 593838 615850 638156 660617 683223 705756
52314 705756 727865 749339 770133 790143 809065 826671 843184 859182 875001 890415 904958
52303I04958J3302J1641R463P254N866N395M931L808K433J405M78q16k083k682
52289I65353l063m392o747q743r281q743q080p427o324m716l065j598m4J803L768
52274H98701N536P057Q545J0194J1881J3196J3834J3966J4022J4195J4339J4381
52262A039847J4491J4722J4731J4116J2875J1415J0202R462R094Q687P783O253
52250A173678M406K693J385N10j60j076k618m658o602p989q872r475r821r922
52236A121479j0046j0420j0741j0470r525q375p340o286n093m065l470k994k053
52223A030601o41O48J365J695K030K488L006L591M164M463M444M567N234O168
52209A073823O763O978P241P535P320O560O071O339O666O162N095M486M613M791
$$ plain form
52303 904958 918260 929901 939364 946618 952484 957879 962810 966618 969051 970456 970934 970118 968035 965353
52289 965353 962290 957898 951151 942408 933127 924384 916304 908877 902553 897837 894772 893174 893130 894933 898701
52274 898701 904237 911294 919839 930033 941914 955110 968944 982910 996932 1011127 1025466 1039847
52262 1039847 1054338 1069060 1083791 1097907 1110782 1122197 1132399 1141861 1150955 1159642 1167425 1173678
52250 1173678 1178084 1180777 1182162 1182672 1182512 1181436 1178818 1174160 1167558 1159569 1150697 1141222 1131401 1121479
52236 1121479 1111433 1101013 1090272 1079802 1070277 1061902 1054562 1048276 1043183 1039118 1035648 1032654 1030601
52223 1030601 1029960 1030608 1031973 1033668 1035698 1038186 1041192 1044783 1048947 1053410 1057854 1062421 1067655 1073823
52209 1073823 1080586 1087564 1094805 1102340 1109660 1116220 1122291 1128630 1135296 1141458 1146553 1151039 1155652 1160443
52195A160443M546M216M168M200L956L429K770K075J592J692K247K442J619J5
52181A199410j601k832l878n117o687q355r497r584q854q204q091p876o768n028
52167A107038l640l060k897k780k707k433j375M42J997K444K252K490L287L736
52153A104794L238K182J106J6j049j493r33j76n60k198l613l372j601L96J588
52138A098325J924J954K260L034L849M021L554L482M829P364R967J2098J4189
52125A170850J6575J8808K0374K1549K2971K4709K6226K7051K7158K6768K6193
52114A429232K5732K5438K4963K3847K1974J9651J7326J5308J3593J1823R564
52103A638451O777L876J302p74k286l195l759m502n663o940q007q943r820j0298
$$ plain form
52195 1160443 1164989 1169205 1173373 1177573 1181529 1184958 1187728 1189803 1191395 1193087 1195334 1197776 1199395 1199410
52181 1199410 1197809 1194977 1191099 1185982 1179295 1170940 1161443 1151859 1143005 1134801 1126710 1118834 1112066 1107038
52167 1107038 1103398 1100338 1097441 1094661 1091954 1089521 1088146 1088588 1090585 1093029 1095281 1097771 1101058 1104794
52153 1104794 1108032 1110214 1111320 1111336 1110287 1108794 1107861 1107685 1107125 1104927 1101314 1097942 1096341 1096737 1098325
52138 1098325 1100249 1102203 1104463 1107497 1111346 1115367 1118921 1122403 1127232 1134596 1144563 1156661 1170850
52125 1170850 1187425 1206233 1226607 1248156 1271127 1295836 1322062 1349113 1376271 1403039 1429232
52114 1429232 1454964 1480402 1505365 1529212 1551186 1570837 1588163 1603471 1617064 1628887 1638451
52103 1638451 1645228 1649104 1650406 1649632 1647346 1644151 1640392 1635890 1630227 1623287 1615280 1606337 1596517 1586219
52089A586219j0065r467r142r256r539r824j0011r698q454o495m488k657o00J943
52075A488466M707P323R656J1552J2824J3648J4509J5540J6348J6708J6892J7087
52063A645260J6941J6127J4888J3630J2296J0583Q540O498M580K678P71j083k980
52050A748729n060p292r584j2005j4611j7136j9196k0681k1789k2716k3545k4326
52038A550788k5004k5401k5379k4975k4173k2771k0724j8386j6218j4431j3081
52027A320245j2224j1677j0976r945r056q808q985q982q693q527q764r338j0122
52014A194148j0860j1100j0792j0707j1556j2884j3705j4088j5001j6598j7880
52003A048977j8420j9091k0429k1458k1206k0410k0406k1020k0956j9920j8927
$$ plain form
52089 1586219 1576154 1566687 1557545 1548289 1538750 1528926 1518915 1509217 1500763 1494268 1489780 1487123 1486523 1488466
52075 1488466 1493173 1500496 1510152 1521704 1534528 1548176 1562685 1578225 1594573 1611281 1628173 1645260
52063 1645260 1662201 1678328 1693216 1706846 1719142 1729725 1738265 1744763 1749343 1752021 1752792 1751709 1748729
52050 1748729 1743669 1736377 1726793 1714788 1700177 1683041 1663845 1643164 1621375 1598659 1575114 1550788
52038 1550788 1525784 1500383 1475004 1450029 1425856 1403085 1382361 1363975 1347757 1333326 1320245
52027 1320245 1308021 1296344 1285368 1275423 1266367 1257559 1248574 1239592 1230899 1222372 1213608 1204270 1194148
52014 1194148 1183288 1172188 1161396 1150689 1139133 1126249 1112544 1098456 1083455 1066857 1048977
52003 1048977 1030557 1011466 991037 969579 948373 927963 907557 886537 865581 845661 826734
51992H26734j8501j7927j6635j5123j4001j3022j1741j0449r852j0186j1127j2121
51980F66049j2548j1987j0779r912r940j0387j0536j0370j0268j0235r969r376
$$ plain form
51992 826734 808233 790306 773671 758548 744547 731525 719784 709335 699483 689297 678170 666049
51980 666049 653501 641514 630735 620823 610883 600496 589960 579590 569322 559087 549118 539742
$$ [...]
##END NTUPLES=NMR SPECTRUM
##END=
