##TITLE=AC1599_JAMAH13329_8315744_5nwIf7IkFF
##JCAMPDX= 6.0         $$ Bruker NMR JCAMP-DX V2.0
##DATA TYPE= NMR SPECTRUM
##DATA CLASS= NTUPLES
##ORIGIN= BRUKER
##OWNER= Administrator
$$ 1.72 TOPSPIN		Version 2.1
$$ 2013-11-09 17:56:16.764 -0800  Administrator@X
$$ Compression mode = diff/dup
##.OBSERVE FREQUENCY= 400.02188249412
##.OBSERVE NUCLEUS= ^1H
##.ACQUISITION MODE= SIMULTANEOUS (DQD)
##.ACQUISITION SCHEME= undefined
##.AVERAGES= 8
##.DIGITISER RES= 22
##SPECTROMETER/DATA SYSTEM= spect
##.PULSE SEQUENCE= zg30
##.SOLVENT NAME= COFFEE_meoh
##.SHIFT REFERENCE= INTERNAL, COFFEE_meoh, 1, 14.98509
##AUDIT TRAIL= $$ (NUMBER, WHEN, WHO, WHERE, PROCESS, VERSION, WHAT)
$$ ##TITLE= Audit trail, TOPSPIN		Version 2.1
$$ ##JCAMPDX= 5.01
$$ ##ORIGIN= Bruker BioSpin GmbH
$$ ##OWNER= Administrator
$$ $$ E:\/data/COFFEE/nmr/AC1599_JAMAH13329_8315744_5nwIf7IkFF/10/pdata/1/auditp.txt
$$ ##AUDIT TRAIL=  $$ (NUMBER, WHEN, WHO, WHERE, PROCESS, VERSION, WHAT)
(   1,<2013-11-09 17:56:09.483 -0800>,<Administrator>,<X>,<go>,<TOPSPIN 2.1>,
      <created by zg
	started at 2013-11-09 17:55:04.212 -0800,
	POWCHK enabled, PULCHK disabled,
       configuration hash MD5:
       C8 4E 4E 5D D3 5C D8 9E 9F 52 82 E0 59 8A DE 15
       data hash MD5: 64K
       8A 18 06 2F 7D C6 79 C6 D6 07 4D 20 EE 39 95 AB>)
(   2,<2013-11-09 17:56:12.483 -0800>,<Administrator>,<X>,<proc1d>,<TOPSPIN 2.1>,
      <Start of raw data processing
       efp LB = 0 FT_mod = 6 PKNL = 1 PHC0 = 0 PHC1 = 0 SI = 32K 
       data hash MD5: 32K
       F5 D7 C0 35 9F F8 E2 88 A2 0E 69 45 D7 7C C3 50>)
(   3,<2013-11-09 17:56:12.842 -0800>,<Administrator>,<X>,<proc1d>,<TOPSPIN 2.1>,
      <pk PHC0 = 91.42273 PHC1 = 0 
       data hash MD5: 32K
       06 81 20 0A 60 6B 64 14 8C CB 41 49 AA D1 5F 46>)
(   4,<2013-11-09 17:56:12.951 -0800>,<Administrator>,<X>,<proc1d>,<TOPSPIN 2.1>,
      <abs ABSG = 1 
       data hash MD5: 32K
       A6 D1 FA C8 58 75 91 5B FF 4B A6 13 DD 46 C1 E4>)
(   5,<2013-11-09 17:56:13.029 -0800>,<Administrator>,<X>,<proc1d>,<TOPSPIN 2.1>,
      <abs ABSG = 2 
       data hash MD5: 32K
       43 A6 C2 35 17 85 6C F6 6D 88 A2 A2 BF C0 D1 EC>)
(   6,<2013-11-09 17:56:13.092 -0800>,<Administrator>,<X>,<proc1d>,<TOPSPIN 2.1>,
      <abs ABSG = 3 
       data hash MD5: 32K
       1C 8B B0 F8 37 6A 20 6C C8 EA 0D 63 E1 C9 1C A6>)
(   7,<2013-11-09 17:56:13.170 -0800>,<Administrator>,<X>,<proc1d>,<TOPSPIN 2.1>,
      <abs ABSG = 4 
       data hash MD5: 32K
       96 F1 2E 59 12 7A 50 58 E8 59 2F 49 16 AD 41 AC>)
(   8,<2013-11-09 17:56:13.248 -0800>,<Administrator>,<X>,<proc1d>,<TOPSPIN 2.1>,
      <abs ABSG = 5 
       data hash MD5: 32K
       C7 B2 EA FD 77 5A 89 D1 3B 22 90 4F 3C 9B 20 A9>)
$$ ##END=
$$ 
$$ $$ hash MD5
$$ $$ 6B 32 6F BA 9F 14 1E 50 B5 18 1A 89 BF FF 8B D7
##$RELAX= 
##$RELAX= 
##$RELAX= 
##$RELAX= 
##$RELAX= 
##$RELAX= 
##$RELAX= 
$$ Bruker specific parameters
$$ --------------------------
##$DU= <E:\>
##$EXPNO= 10
##$NAME= <AC1599_JAMAH13329_8315744_5nwIf7IkFF>
$$ [...]
##$TP= (0..7)
150 150 150 150 150 150 150 150
##$TP07= 0
##$TPNAME0= <>
##$TPNAME1= <>
##$TPNAME2= <>
##$TPNAME3= <>
##$TPNAME4= <>
##$TPNAME5= <>
##$TPNAME6= <>
##$TPNAME7= <>
##$TPOAL= (0..7)
0.5 0.5 0.5 0.5 0.5 0.5 0.5 0.5
##$TPOFFS= (0..7)
0 0 0 0 0 0 0 0
##$TUNHIN= 0
##$TUNHOUT= 0
##$TUNXOUT= 0
##$USERA1= <user>
##$USERA2= <user>
##$USERA3= <user>
##$USERA4= <user>
##$USERA5= <user>
##$V9= 5
##$VALIST= <valist>
##$VCLIST= <CCCCCCCCCCCCCCC>
##$VD= 0
##$VDLIST= <DDDDDDDDDDDDDDD>
##$VPLIST= <PPPPPPPPPPPPPPP>
##$VTLIST= <TTTTTTTTTTTTTTT>
##$WBST= 1024
##$WBSW= 4
##$XGAIN= (0..3)
0 0 0 0
##$XL= 0
##$YL= 0
##$YMAX_a= 652061
##$YMIN_a= -557034
##$ZGOPTNS= <>
##$ZL1= 120
##$ZL2= 120
##$ZL3= 120
##$ZL4= 120
##$ABSF1= 14.98509
##$ABSF2= -5.573092
##$ABSG= 5
##$ABSL= 3
##$ALPHA= 0
##$AQORDER= 0
##$ASSFAC= 0
##$ASSFACI= 0
##$ASSFACX= 0
##$ASSWID= 0
##$AUNMP= <proc_prof1d_extract_pilot.lims>
##$AXLEFT= 0
##$AXNAME= <>
##$AXNUC= <1H>
##$AXRIGHT= 0
##$AXTYPE= 0
##$AXUNIT= <>
##$AZFE= 0.1
##$AZFW= 0.1
##$BCFW= 0
##$BC_mod= 0
##$BYTORDP= 0
##$COROFFS= 0
##$CY= 15
##$DATMOD= 1
##$DC= 0
##$DFILT= <>
##$DTYPP= 0
##$F1P= 0
##$F2P= 0
##$FCOR= 0.5
##$FTSIZE= 32768
##$FT_mod= 6
##$GAMMA= 0
##$GB= 0
##$INTBC= 1
##$INTSCL= 1
##$ISEN= 128
##$LB= 0
##$LEV0= 0
##$LPBIN= 0
##$MAXI= 10000
##$MC2= 0
##$MEAN= 0
##$ME_mod= 0
##$MI= 0
##$NCOEF= 0
##$NC_proc= -8
##$NLEV= 6
##$NOISF1= 0
##$NOISF2= 0
##$NSP= 0
##$NTH_PI= 0
##$NZP= 0
##$OFFSET= 14.98509
##$PC= 1
##$PHC0= 91.42273
##$PHC1= 0
##$PH_mod= 1
##$PKNL= yes
##$PPARMOD= 0
##$PPDIAG= 0
##$PPIPTYP= 0
##$PPMPNUM= 2147483647
##$PPRESOL= 1
##$PSCAL= 4
##$PSIGN= 0
##$PYNMP= <proc.py>
##$REVERSE= no
##$SF= 400.02
##$SI= 32768
##$SIGF1= 0
##$SIGF2= 0
##$SINO= 400
##$SIOLD= 32768
##$SPECTYP= <>
##$SREGLST= <1H.CDCl3>
##$SSB= 0
##$STSI= 32768
##$STSR= 0
##$SW_p= 8223.68421052631
##$SYMM= 0
##$S_DEV= 0
##$TDeff= 65536
##$TDoff= 0
##$TI= <>
##$TILT= no
##$TM1= 0
##$TM2= 0
##$TOPLEV= 0
##$USERP1= <user>
##$USERP2= <user>
##$USERP3= <user>
##$USERP4= <user>
##$USERP5= <user>
##$WDW= 1
##$XDIM= 32768
##$YMAX_p= 463947420
##$YMIN_p= -696358
##$CURPLOT= <Network HP LaserJet P1505>
##$CURPRIN= <$Network HP LaserJet P1505>
##$DFORMAT= <normdp>
##$LAYOUT= <+/1D_H.xwp>
##$LFORMAT= <normlp>
##$PFORMAT= <normpl>
##$SURQMSG= 1
$$ End of Bruker specific parameters
$$ ---------------------------------
##NTUPLES= NMR SPECTRUM
##VAR_NAME=  FREQUENCY,     SPECTRUM/REAL,   SPECTRUM/IMAG
##SYMBOL=    X,             R,               I
##VAR_TYPE=  INDEPENDENT,   DEPENDENT,       DEPENDENT
##VAR_FORM=  AFFN,          ASDF,            ASDF
##VAR_DIM=   32768,         32768,           32768
##UNITS=     HZ,            ARBITRARY UNITS, ARBITRARY UNITS
##FACTOR=    0.250966925370066, 1,           1
##FIRST=     8223.43324360094, 19909,        242674
##LAST=      0,             -74373,          26719
##MIN=       0,             -696358,         0
##MAX=       8223.43324360094, 463947420,    0
$$ Real data points
##PAGE= N=1
##DATA TABLE= (X++(R..R)), XYDATA
$$ [...]
19525a9595G3786b52305b4341E38333c18732J0513k8876k29558d1736j48499e7422
$$ -19595 73786 -252305 -24341 538333 -318732 -308219 -337095 -566653 -41736 -190235 -57422
19513B9428a93170P0294c8458A28714N181a07248P642C636a11312C7063b90352
$$ 29428 -193170 -122876 -38458 128714 133895 -107248 -99606 3636 -111312 37063 -290352
19501D55744d45782E2485c33354i8308M5346p8658k55062a41519A04813c2413
$$ 455744 -445782 52485 -333354 -98308 -52962 -131620 -386682 -141519 104813 -32413
19490a09699n2233A05773b22470F4953J18941i6963A19069d7425j58261a4930
$$ -109699 -161932 105773 -222470 64953 183894 -96963 119069 -47425 -205686 -14930
19479a37872j08536R0768f7466L1933A14577J83705G6171M6328K01438C2746c35775
$$ -137872 -246408 -155640 -67466 -35533 114577 298282 76171 122499 323937 32746 -335775
19467A25771b65722D3615c5103l7897j9226l08836a06063k12766c2115o2902G7017
$$ 125771 -265722 43615 -35103 -73000 -92226 -401062 -106063 -318829 -32115 -95017 77017
19455f2332E9661i1903L5290A50667f0187j15369m0357a07362M9030k72603J46544
$$ -62332 59661 -91903 -56613 150667 -60187 -175556 -215913 -107362 -58332 -330935 -184391
19444a84391a3905O17k16561D2688b9802H79J6967c07352a46930e2900r4934c0144
$$ -184391 -13905 -13288 -229849 42688 -29802 879 17846 -307352 -146930 -52900 -147834 -30144
19431C01314j3481b1088l0964A69465b57176c6224A16280J06937c37594A15836
$$ 301314 287833 -21088 -52052 169465 -257176 -36224 116280 223217 -337594 115836
19420B6424P8283f06185C6006c38934J67627J7038d1515A852b91965a3579n24900
$$ 26424 104707 -606185 36006 -338934 -171307 -154269 -41515 1852 -291965 -13579 -538479
19409e38479a00808A97992b82269I7365B9088J22035j7566J75036a71018p452
$$ -538479 -100808 197992 -282269 97365 29088 151123 133557 308593 -171018 -178470
19399a78470G9182a04316K1814L3891F5127J29349B1952O3444b65683B3458M5205
$$ -178470 79182 -104316 -82502 -48611 65127 194476 21952 85396 -265683 23458 68663
19388F8663a06186l3859j86309b653A96254j7345c71074J58121o5854j88581J97706
$$ 68663 -106186 -140045 -326354 -2653 196254 178909 -371074 -212953 -278807 -467388 -269682
19377b69682J18749k3670d2108j61272A77394F2964R4978D651a42975a8435N417
$$ -269682 -150933 -174603 -42108 -203380 177394 62964 157942 4651 -142975 -18435 -13018
19366a3018j07615a0245l63219J62122B77647a80528P753A56031a77865I7192
$$ -13018 -120633 -10245 -373464 -211342 277647 -180528 -172775 156031 -177865 97192
19355B30449a23132j3302j4638D177c83082L7130b7513E2213i5026E3493a02045
$$ 230449 -123132 -136434 -151072 4177 -383082 -345952 -27513 52213 -95026 53493 -102045
19343a04765B2763b26361I8334b25210N2133j56355N0035A21640a88852g1280
$$ -104765 22763 -226361 98334 -225210 -173077 -329432 -279397 121640 -188852 -71280
19332F2765J28832a81186j24408F00000h8001C1722D694a55942C07529c64406
$$ 62765 191597 -181186 -305594 600000 -88001 31722 4694 -155942 307529 -364406
19321d11140C06131i8485B379a6249G9007J71178A16721a72367l5794L9684A62736
$$ -411140 306131 -98485 2379 -16249 79007 250185 116721 -172367 -208161 -168477 162736
19309A68535b60172b9047l6104B09389B7199c60218a61400E1238L9542a79762
$$ 168535 -260172 -29047 -65151 209389 27199 -360218 -161400 51238 90780 -179762
19298E8778a89839A49154b5863a0394A77556B7725h1835A2392O4174b70837G0783
$$ 58778 -189839 149154 -25863 -10394 177556 27725 -81835 12392 76566 -270837 70783
19286b68475a33301k39691L715G8521Q2106c2801k99103A44887L4221i9363A72800
$$ -268475 -133301 -372992 -369277 78521 160627 -32801 -331904 144887 179108 -99363 172800
19274c1207l60253f0553j16947A9210R4678J11422G1759Q9425a9495k32614j95742
$$ -31207 -391460 -60553 -177500 19210 113888 225310 71759 161184 -19495 -252109 -447851
19263d47851C5760c02944B42955b56773a13826a0099I0890d6575m25620D8983
$$ -447851 35760 -302944 242955 -256773 -113826 -10099 90890 -46575 -472195 48983
19252A59075k0628c25692J45460G8640b53835a00389p5071A13446E3872b21289
$$ 159075 138447 -325692 -180232 78640 -253835 -100389 -175460 113446 53872 -221289
19241b77051l019B68819a42675J1703f5305I7245a54913B6480Q5465c31333e0520
$$ -277051 -280070 268819 -142675 -130972 -65305 97245 -154913 26480 111945 -331333 -50520
19229a49373o7497F7187b17911A79369F1251J02197a75296A76834F8241a9950
$$ -149373 -216870 67187 -217911 179369 61251 163448 -175296 176834 68241 -19950
19218b36751C3278B668c26863J56170f7633k36585g3402j6919O295l26518A21533
$$ -236751 33278 2668 -326863 -170693 -67633 -304218 -73402 -90321 -84026 -410544 121533
19206a2763j14703q9737a07230C5168d9303q0891n9321j45068P0866h4404n2968
$$ -12763 -127466 -217203 -107230 35168 -49303 -130194 -189515 -334583 -263717 -84404 -137372
19195a37372r9078g6862A59218e7040j21948H0571b84925a02541A17134J24706
$$ -137372 -236450 -76862 159218 -57040 -178988 80571 -284925 -102541 117134 241840
19185B41840a20599L415j6399O0645k37727N1624c0169j64999e5414B91148e6140
$$ 241840 -120599 -117184 -133583 -72938 -310665 -259041 -30169 -195168 -55414 291148 -56140
19173a18333a1169B8195e6871G1910c18390a43060f0052n9027a9887A46562b00019
$$ -118333 -11169 28195 -56871 71910 -318390 -143060 -60052 -119079 -19887 146562 -200019
19161I2545k6021a25327A883a22140F0727c66251A85936F0463b17524M9098n9342
$$ 92545 66524 -125327 1883 -122140 60727 -366251 185936 60463 -217524 -168426 -227768
19150b27768j43664J20614B1407f5721j63296A13007E5605h8293k26575a22327
$$ -227768 -371432 -250818 21407 -65721 -229017 113007 55605 -88293 -314868 -122327
19139a34570k74291I750O6214N121i1955C43517d42639K03983p9679J18063D736
$$ -134570 -408861 9750 75964 81085 -91955 343517 -442639 -238656 -318335 -200272 4736
19127c854j61169j9240e8047H3130a33801G729h3250A07016b7661k39687c9727
$$ -3854 -165023 -184263 -58047 83130 -133801 7729 -83250 107016 -27661 -267348 -39727
19115F8649a7346k08062O6551F9254a05817j26328L4149D9412A4468d7802j06188
$$ 68649 -17346 -225408 -158857 69254 -105817 -232145 -197996 49412 14468 -47802 -153990
19104a53990A49227b86289b8912C1155K09994k1790G2131b16815H5668c20021
$$ -153990 149227 -286289 -28912 31155 241149 219359 72131 -216815 85668 -320021
19093A46938e9709l69181G1728C5485c7851l78826C9211n511i1052A2315a88399
$$ 146938 -59709 -428890 71728 35485 -37851 -416677 39211 33700 -91052 12315 -188399
19081a62885O4678j04264L5226A6262a42869D59551j64441c43989a1960j45585
$$ -162885 -98207 -202471 -167245 16262 -142869 459551 295110 -343989 -11960 -157545
19071a57545O9930C90905F1015b28943e7272j65946N072A08561a98925g721m4455
$$ -157545 -87615 390905 61015 -228943 -57272 -223218 -218146 108561 -198925 -7721 -52176
19060e2176F311h107D4049K5660K65161A26254k6058b60683P7898g9009I244b53654
$$ -52176 6311 -8107 44049 69709 334870 126254 100196 -260683 -182785 -79009 9244 -253654
19047e6540o0231j45137J5495e9775C7190q319a64800a6887D3981A2560J6223
$$ -56540 -116771 -261908 -246413 -59775 37190 28871 -164800 -16887 43981 12560 28783
19036B8783d52237B21288D3319J90502o2179N8012o4440a07371C4718J8071K6970
$$ 28783 -452237 221288 43319 233821 171642 229654 165214 -107371 34718 52789 79759
19025G9759H903J01252K644l0017B0991c8363A11080q545f0512A25875d6896B11086
$$ 79759 8903 110155 112799 82782 20991 -38363 111080 102535 -60512 125875 -46896 211086
19012H0093a95124e0095j30627I453e8497j37501K0049Q5075k2251b3710k42959
$$ 80093 -195124 -50095 -180722 9453 -58497 -195998 -175949 -90874 -113125 -23710 -266669
19001b66669p5036a36713A69825J23882d4333B8672a87623Q0616l7083A58571
$$ -266669 -341705 -136713 169825 293707 -44333 28672 -187623 -107007 -144090 158571
18990C02984C7579a41538C09657A6381E294P792L7075b08862a3461n511B89832
$$ 302984 37579 -141538 309657 16381 5294 13086 50161 -208862 -13461 -18972 289832
18978a58688C4348f7298D1316a26779p7963N181A11476a18403E8324J36671i2602
$$ -158688 34348 -67298 41316 -126779 -204742 -199561 111476 -118403 58324 194995 -92602
18966f4773B01944j1047D1089J76455l4860c23411B4613a60251r4482A4474a17423
$$ -64773 201944 190897 41089 217544 182684 -323411 24613 -160251 -254733 14474 -117423
18954h7724q9845h3705G1641J33327a60898c3648A53562a08613K2039C08175B2256
$$ -87724 -177569 -83705 71641 204968 -160898 -33648 153562 -108613 -86574 308175 22256
18942F4670b21898L784K6868B67537a50414D82666A78523a02518B587M3213J08134
$$ 64670 -221898 -218114 -191246 267537 -150414 482666 178523 -102518 2587 45800 153934
18931A53934a29510j09648a2534A02276C5578b78947N739B51492A15306J41809
$$ 153934 -129510 -239158 -12534 102276 35578 -278947 -273208 251492 115306 257115
18921B57115A00599Q6511A0000b29419b2563p1671m3991m2678e6944E2310a24817
$$ 257115 100599 187110 10000 -229419 -22563 -94234 -138225 -180903 -56944 52310 -124817
18909b12614a05679A62015C4027b74085j14324f8063J574k4795k88135A99682
$$ -212614 -105679 162015 34027 -274085 -388409 -68063 -66489 -91284 -379419 199682
18898H3903f2473K3938n8144A94029e812j00396J1694H6332J8444Q9088e35596
$$ 83903 -62473 -38535 -96679 194029 -5812 -106208 -94514 86332 104776 193864 -535596
18886A28340J3837a13915k2518C4886a89011A5383b91358D6373K17284i7374A63984
$$ 128340 142177 -113915 -136433 34886 -189011 15383 -291358 46373 263657 -97374 163984
18874B24311H739a77915O3192c1641A95336C3435M3616a7748A8766b69993C870
$$ 224311 8739 -177915 -114723 -31641 195336 33435 77051 -17748 18766 -269993 3870
18862b56526G4632J53530E1362d8788A69194b05109j8365Q6804C0902Q8562E7553
$$ -256526 74632 228162 51362 -48788 169194 -205109 -223474 -136670 30902 119464 57553
18850F6011J1155b72419N1070R2058A48939a23376m2232Q0001j6759E0178J40255
$$ 66011 77166 -272419 -221349 -129291 148939 -123376 -165608 -85607 -102366 50178 190433
18839A90433E5907b57947O7255p2844D2852A3030a51573D3740h4551A25026h8328
$$ 190433 55907 -257947 -190692 -263536 42852 13030 -151573 43740 -84551 125026 -88328
18827a67096F8687g1534q3233A85845E4656a01371n057D9775g2554j1709A45676
$$ -167096 68687 -71534 -154767 185845 54656 -101371 -106428 49775 -72554 -84263 145676
18815A36555a0933G9898e0808j89894H871L83336A59237d0781C37859a91109g7519
$$ 136555 -10933 79898 -50808 -240702 8871 392207 159237 -40781 337859 -191109 -77519
18803C7224k158a62019k16541M255h9188I8046a43508A23157j0131g9571k74484
$$ 37224 35066 -162019 -378560 -374305 -89188 98046 -143508 123157 113026 -79571 -354055
18792c54055J21691J01932J382k80553a85753G7794a39716j51709A1577f5114
$$ -354055 -232364 -130432 -129050 -409603 -185753 77794 -139716 -291425 11577 -65114
18781b41462B93506d4652J9798l76287J79925H9571e5039k42226L4738A54014
$$ -241462 293506 -44652 -24854 -401141 -221216 89571 -55039 -297265 -262527 154014
18770A63912b52868a3642k88858P0139O0735j48652a11298o5963E5871J28556
$$ 163912 -252868 -13642 -302500 -232361 -171626 -320278 -111298 -177261 55871 184427
18760A84427a47013J6345e268l21129a46460q4028a12461q3631B1252f0904j74573
$$ 184427 -147013 -130668 -5268 -326397 -146460 -230488 -112461 -196092 21252 -60904 -235477
18749b35477K1434h2960j17310Q1289E3377a72352c0104M262j19558B6566K32451
$$ -235477 -214043 -82960 -200270 -118981 53377 -172352 -30104 -25842 -145400 26566 259017
18738B59017B7869P418f5134K8631l1973B20171o2591C9745d7910j28324K437
$$ 259017 27869 35287 -65134 -36503 -68476 220171 157580 39745 -47910 -176234 -173797
18727a73797M0365c5813J1132l48025J15447o1207f6802j86089k9155E6896a65828
$$ -173797 -133432 -35813 -24681 -372706 -257259 -318466 -66802 -252891 -282046 56896 -165828
18715b13848O930i0652h293E660c1160a4321j12421j74501J5845f8257q127B66841
$$ -213848 -206918 -90652 -8293 5660 -31160 -14321 -126742 -301243 -285398 -68257 -76384 266841
18702b73607B47796D6735b46630f9184J3409j77568b2458A33238m5199M8167c2047
$$ -273607 247796 46735 -246630 -69184 -55775 -233343 -22458 133238 88039 136206 -32047
18690A42472F9915c00470h4026A34116a37612J848g85k01259N1708A03402a22238
$$ 142472 69915 -300470 -84026 134116 -137612 -135764 -785 -202044 -150336 103402 -122238
18678b8341I5590g5795f402k28515A22826J68568a44507B4880b39584A4253K53834
$$ -28341 95590 -75795 -6402 -234917 122826 291394 -144507 24880 -239584 14253 268087
18667B68087c54564C61507i2642G3730a92067g5543A06090h4859G9220a10387
$$ 268087 -354564 361507 -92642 73730 -192067 -75543 106090 -84859 79220 -110387
18656C04661J88574g8598E0271d26823A39469G712a33611D40756d1889B35956
$$ 304661 493235 -78598 50271 -426823 139469 7712 -133611 440756 -41889 235956
18645b84828e7826r3466l41779A55684a888q2221l02288D6941j1303c53022J74233
$$ -284828 -57826 -151292 -493071 155684 -1888 -84109 -386397 46941 35638 -353022 -178789
18634a78789F0800c40579E4519e9324k1359F8557C1571K5440b0084j97321A14604
$$ -178789 60800 -340579 54519 -59324 -80683 68557 31571 57011 -20084 -217405 114604
18622c31881P2745F3272J854b2870k25234o3599h2404D4786K50362L0731g6245
$$ -331881 -259136 63272 65126 -22870 -248104 -311703 -82404 44786 295148 325879 -76245
18610g0257C5723b82748j07215B788J14719h9250r7669A80053g7648q8792A92351
$$ -70257 35723 -282748 -389963 2788 117507 -89250 -186919 180053 -77648 -166440 192351
18598C3913a40114j8159a1724B09647c61655i4112A81627J9217G5025b85508D2509
$$ 33913 -140114 -158273 -11724 209647 -361655 -94112 181627 200844 75025 -285508 42509
18586a06045A63315G985K7539b39921B06410h6681j51313K1718c592j17694d1390
$$ -106045 163315 7985 35524 -239921 206410 -86681 -237994 -216276 -3592 -121286 -41390
18574f4619j56612N1398A56436c9416k02309Q1739j06278D09700b23903a11664
$$ -64619 -221231 -169833 156436 -39416 -241725 -159986 -266264 409700 -223903 -111664
18563c54331e9378l24190a60535l85723A01619c44358J00599f4225l43836i3869
$$ -354331 -59378 -383568 -160535 -546258 101619 -344358 -243759 -64225 -408061 -93869
18552b29178O7114G2646a94539A12791e08018B6742c2981A06480P5867q2900J6304
$$ -229178 -162064 72646 -194539 112791 -508018 26742 -32981 106480 182347 99447 115751
18541A15751i6165G0875k2446e2640r4591k86442C1358J34957b0211k77148B15878
$$ 115751 -96165 70875 48429 -52640 -147231 -433673 31358 166315 -20211 -297359 215878
18529a49645j4058e7989J940A61222b5461j52530O7047l319A10798m1638b58963
$$ -149645 -163703 -57989 -56049 161222 -25461 -177991 -110944 -114263 110798 69160 -258963
18517h8434b7241j13091c2536C31560f5397H1738K9208b6789B41498a42284A26584
$$ -88434 -27241 -140332 -32536 331560 -65397 81738 110946 -26789 241498 -142284 126584
18505A81973a36011H3379c76657g0096A38931C8292a27875A2208K45614A16589
$$ 181973 -136011 83379 -376657 -70096 138931 38292 -127875 12208 257822 116589
18494G9056J17532a0632A5345d66735F5678a22693L7935D3932b51949g5688l9634
$$ 79056 196588 -10632 15345 -466735 65678 -122693 -84758 43932 -251949 -75688 -115322
18483a15322H7157M9772D6654a29462M4180o5368a7046k52922B97595b67328R6636
$$ -115322 87157 136929 46654 -129462 -85282 -150650 -17046 -269968 297595 -267328 -170692
18472a70692b42k87768E6295k3301a28106f1741b1786j26745I8274b64708r0715
$$ -170692 -242 -288010 56295 32994 -128106 -61741 -21786 -148531 98274 -264708 -355423
18461c55423i5071c1243k1935p9171j57652c1484A0146b01417i9553r704A1284
$$ -355423 -95071 -31243 -53178 -132349 -290001 -31484 10146 -201417 -99553 -109257 11284
18449I92J72710B3003c8278A43813c87204C02955D6918e5668l9788j05820g0969
$$ 992 173702 23003 -38278 143813 -387204 302955 46918 -55668 -95456 -201276 -70969
18437a8320j11240L1085A29213i8490j26515j92757N0976g8724A54234e6475F1990
$$ -18320 -129560 -98475 129213 -98490 -225005 -417762 -366786 -78724 154234 -56475 61990
18425b09267j03134G7585J3873g0854k02735A90321a64253D6760B1909f4217D5343
$$ -209267 -312401 77585 91458 -70854 -273589 190321 -164253 46760 21909 -64217 45343
18413a7391I29c85465A17289C7049I939K33185c6479F2962L60667A14926a92980
$$ -17391 929 -385465 117289 37049 9939 243124 -36479 62962 423629 114926 -192980
18401H6640d5262j99277j23124c2192j83941C27083E9552K39391C1459b21974
$$ 86640 -45262 -244539 -367663 -32192 -216133 327083 59552 298943 31459 -221974
18390B62734b0625j66602I1314J82390b5699A29121a7489l7205J7253K131j37787
$$ 262734 -20625 -187227 91314 273704 -25699 129121 -17489 -54694 -37441 -35310 -173097
18379a73097A23077b95691Q2455Q9516k8810f8318J5265l95064D4425e1767j91396
$$ -173097 123077 -295691 -213236 -123720 -152530 -68318 -53053 -448117 44425 -51767 -243163
18368b43163B16676O2837e4352k79508J58199M6478j45394A73223H4472e74812
$$ -243163 216676 279513 -54352 -333860 -175661 -129183 -274577 173223 84472 -574812
18357a5485k53386J09418g760B54255a87706A3569L55871c29184b0185j01005
$$ -15485 -268871 -159453 -7760 254255 -187706 13569 369440 -329184 -20185 -121190
18347a21190C85096c25759C76128c83126J69916d5032k54846N8069J14323A10602
$$ -121190 385096 -325759 376128 -383126 -213210 -45032 -299878 -241809 -127486 110602
18336D0778j8493a48723e5103A36685q211a43823A73998a88134B4746a62713A73348
$$ 40778 22285 -148723 -55103 136685 128474 -143823 173998 -188134 24746 -162713 173348
18324b30584F6625b49421R3914a2796k00330N9830r7811J08125B21597A04887
$$ -230584 66625 -249421 -155507 -12796 -213126 -153296 -251107 -142982 221597 104887
18313A30749r76E5547C337h6434A13840D7036a22241k8742A18802a15746p2078
$$ 130749 129773 55547 3337 -86434 113840 47036 -122241 -150983 118802 -115746 -187824
18302a87824O9517n4989d8275j20712k8040E8638b38366b8867e841k24148j2633
$$ -187824 -118307 -173296 -48275 -168987 -197027 58638 -238366 -28867 -5841 -229989 -242622
18291b42622A6546a0796j57048A77569N258a55644j46327h1458D3235a02152l8921
$$ -242622 16546 -10796 -167844 177569 182827 -155644 -301971 -81458 43235 -102152 -141073
18280a41073k13390f831A21390a9318m0036j51702A5147K22754c15076d7636A29348
$$ -141073 -354463 -6831 121390 -19318 -59354 -211056 15147 237901 -315076 -47636 129348
18268i9939j05357p7796B7179n311J17841A8594g1880A8496J84943d05145D0933
$$ -99939 -205296 -283092 27179 21868 139709 18594 -71880 18496 203439 -405145 40933
18256I8287c02916b5650j38008B02787H3293a98419D41106E8038h37m02451A76766
$$ 98287 -302916 -25650 -163658 202787 83293 -198419 441106 58038 -837 -403288 176766
18244A41597A3102J20529a43466O288A37137c37906i0130j59504e5958l21961
$$ 141597 13102 133631 -143466 -137178 137137 -337906 -90130 -249634 -55958 -377919
18234c77919A41923b7255H8661B1949N7843d43868e1810o8798n0661A2289b21479
$$ -377919 141923 -27255 88661 21949 79792 -443868 -51810 -120608 -171269 12289 -221479
18222g7978A11255a71942e2245m577A96592a3229k84269a01618L5511A68074c4528
$$ -77978 111255 -171942 -52245 -56822 196592 -13229 -297498 -101618 -66107 168074 -34528
18210b45387D5225e0417B77270A21641a63485A29086K46840b01825F7419K11322
$$ -245387 45225 -50417 277270 121641 -163485 129086 375926 -201825 67419 278741
18200B78741i4657k0849C4499b09206i9267k51827A0602P8278d26175a26287j87064
$$ 278741 -94657 -115506 34499 -209206 -99267 -351094 10602 88880 -426175 -126287 -313351
18189c13351C0157a44114D6632L85110D0245a52413L6555b9342k0290j2838j90526
$$ -313351 30157 -144114 46632 431742 40245 -152413 -115858 -29342 -49632 -62470 -252996
18178b52996J11728e3114E0311a98087O8745C3521K1282c45016b06A01020C4252
$$ -252996 -141268 -53114 50311 -198087 -129342 33521 54803 -345016 -206 101020 34252
18166g5826j1807B76485a08438m7844A55267C7608L38843q7365b01525B05503
$$ -75826 -87633 276485 -108438 -156282 155267 37608 376451 289086 -201525 205503
18155b29537k08365a17746A61194h6066j6671d2038B80994a28201L6620A30124
$$ -229537 -437902 -117746 161194 -86066 -102737 -42038 280994 -128201 -91581 130124
18144b35658M0446e6841A42989b11615H2725b90000C95644a18793H8608O4414
$$ -235658 -195212 -56841 142989 -211615 82725 -290000 395644 -118793 88608 153022
18134A53022a35170O1711k25106A56949D4420K2595a40854A55697a36188A49710
$$ 153022 -135170 -73459 -298565 156949 44420 67015 -140854 155697 -136188 149710
18123c17842J21350l9324Q2768A139R2261J93069h2706E1956a96649G2995b27160
$$ -317842 -196492 -235816 -153048 1139 93400 286469 -82706 51956 -196649 72995 -227160
18111f1914j138o4524C4247M9119c82945J17216A06490f1781l57830F1240a7763
$$ -61914 -63052 -127576 34247 83366 -382945 -265729 106490 -61781 -419611 61240 -17763
18099a56953B97983a82387E5249a55894j80037A23155A8179L90181E2870c1514
$$ -156953 297983 -182387 55249 -155894 -335931 123155 18179 408360 52870 -31514
18088a01513B5485R1381K0437b33035O5108A0400a11888k09191F5509M0867a20887
$$ -101513 25485 116866 137303 -233035 -167927 10400 -111888 -321079 65509 106376 -120887
18076a19931j30971F6676f2715A03638b06826p4634J14828I6004J63689a0066
$$ -119931 -250902 66676 -62715 103638 -206826 -281460 -166632 96004 259693 -10066
18065A45798b44422a01815A09980a65979g1072j78777A6434c14641B17659b97878
$$ 145798 -244422 -101815 109980 -165979 -71072 -249849 16434 -314641 217659 -297878
18054b5274B2396a89537L1791D6302M50974a76000N8355A42607G080b82920A72139
$$ -25274 22396 -189537 -157746 46302 497276 -176000 -117645 142607 7080 -282920 172139
18042d47748A51685J1671f3087j26025D1887a33855c3004C7192J47436c52368
$$ -447748 151685 163356 -63087 -189112 41887 -133855 -33004 37192 184628 -352368
18031a6706B86366a49188B77007a70736f9539E4845K20412J4944F3625L52156
$$ -16706 286366 -149188 277007 -170736 -69539 54845 275257 290201 63625 415781
18021D15781B2481K4809b75749D09061b8487j56856D34413I4062k6679b2616I5896
$$ 415781 22481 47290 -275749 409061 -28487 -185343 434413 94062 67383 -22616 95896
18009e1040A58202k1753E0786J75154B8978b32735B3542h6774j81544g3737j39556
$$ -51040 158202 136449 50786 225940 28978 -232735 23542 -86774 -268318 -73737 -213293
17998b13293b0034C5615g8247B4143J61661e6710b4683l01214B9875J73471d918
$$ -213293 -20034 35615 -78247 24143 185804 -56710 -24683 -325897 29875 203346 -4918
17986B36038C0949a74570Q3884I1787P0157L6143A201e0328D7141M5926J52893
$$ 236038 30949 -174570 -90686 91787 161944 198087 1201 -50328 47141 93067 245960
17975B45960C9618K14878e0238H369Q0206K23217c01796A81411b54236d1806j31838
$$ 245960 39618 254496 -50238 8369 88575 311792 -301796 181411 -254236 -41806 -173644
17964a73644a452k8339A6464J0431b26030n3856j88576b32696b2433A5215a68706
$$ -173644 -1452 -29791 16464 26895 -226030 -279886 -468462 -232696 -22433 15215 -168706
17952A58561a38685K8965G5670a98k48550J17920C8454R0083J2121a15821A8179
$$ 158561 -138685 -109720 75670 -198 -248748 -130828 38454 128537 140658 -115821 18179
17940a81489P3931M3341m0611j08041b9401A09091k7460i5746l2066K0586c7069
$$ -181489 -107558 -64217 -104828 -212869 -29401 109091 81631 -95746 -127812 -107226 -37069
17928b65672a25071B01729c8880n1213F0044b3482j86966k2742E7514b3784j0858
$$ -265672 -125071 201729 -38880 -90093 60044 -23482 -210448 -233190 57514 -23784 -34642
17917c4642C7067J4021a92978A53060b10761A6008a34577j09843C44690h9436
$$ -34642 37067 51088 -192978 153060 -210761 16008 -134577 -244420 344690 -89436
17906A91073j4319J40933d6354m88484A50472C1655h9809A93804i9530k9167A15959
$$ 191073 176754 317687 -46354 -534838 150472 31655 -89809 193804 -99530 -128697 115959
17894a50270A11292a2240a159j44797I2152b53215A0713M36479b34239J4725B97603
$$ -150270 111292 -12240 -1159 -145956 92152 -253215 10713 447192 -234239 -219514 297603
17882d03391i0778b4435n5811A83652e9045m9855M4030f651l36708B75829g8248
$$ -403391 -90778 -24435 -80246 183652 -59045 -108900 -64870 -6651 -343359 275829 -78248
17870A89174i9517D3324J96936C0416K37868j03407b89036a9896D39446j96112
$$ 189174 -99517 43324 240260 30416 268284 164877 -289036 -19896 439446 243334
17860B43334a96668B09212b6566A46556R3635b516C9640b5904l23727A80300f8966
$$ 243334 -196668 209212 -26566 146556 240191 -2516 39640 -25904 -349631 180300 -68966
17848c1075B7545a03291k3578A56006a44111Q172a2864G4088c818E0856a86924
$$ -31075 27545 -103291 -126869 156006 -144111 -135939 -12864 74088 -3818 50856 -186924
17836b95350a39722B67173B936a15956A1054P1388l9232b32628A55936i4367q5436
$$ -295350 -139722 267173 2936 -115956 11054 82442 43210 -232628 155936 -94367 -179803
17825a79803L1164A67886d37516a01052I8465A259K76623l2140j20072J26168
$$ -179803 -148639 167886 -437516 -101052 98465 1259 277882 245742 125670 251838
17815B51838A14434a61146A36583a77483B2261a51022F2116J53186b87859a03647
$$ 251838 114434 -161146 136583 -177483 22261 -151022 62116 215302 -287859 -103647
17804a85337E2048h8169p5393B00401D2029K87829e0693I2318L8591a46780a3955
$$ -185337 52048 -88169 -163562 200401 42029 329858 -50693 92318 130909 -146780 -13955
17792b47945B13823a69127A33632c40247a01557k91947G2332a97377A14929j4781
$$ -247945 213823 -169127 133632 -340247 -101557 -393504 72332 -197377 114929 100148
17782A00148L1780a06133p6659Q1411A33513J33506A0228b0073j68922M1159m5180
$$ 100148 131928 -106133 -182792 -101381 133513 267019 10228 -20073 -188995 -147836 -193016
17771a93016g6147J2791C2128J99977b46790L1265g6356B96251g4280p5428C40301
$$ -193016 -76147 -63356 32128 232105 -246790 -215525 -76356 296251 -74280 -149708 340301
17759c11081c1755H3978K53207j31424d3066F3396J31876i7725B09730D1158J82231
$$ -311081 -31755 83978 337185 205761 -43066 63396 195272 -97725 209730 41158 223389
17748B23389d5936a0421B87961p4634a7363m6351K5732j11465A3582J58617a60641
$$ 223389 -45936 -10421 287961 213327 -17363 -63714 -37982 -149447 13582 172199 -160641
17736F5610a35702A98987a25598j53190A01690J05700J58800D9739h9091A58200
$$ 65610 -135702 198987 -125598 -278788 101690 207390 366190 49739 -89091 158200
17725a00312j20515R6957n578A1477E336i5949A31380q468b06811P6856B07258
$$ -100312 -220827 -123870 -129448 11477 5336 -95949 131380 122912 -206811 -129955 207258
17713a10359m6046C8981K84121a9650k7727o1249B76267a22641a6103C5201b30545
$$ -110359 -156405 38981 323102 -19650 -47377 -108626 276267 -122641 -16103 35201 -230545
17701A76244a09117I547M34851b28065K1262f8534C94375I1922a05829A91174
$$ 176244 -109117 9547 444398 -228065 -206803 -68534 394375 91922 -105829 191174
17690a88243P9404F542K12529K07078D3462b62097J14095k78261K11936G0856
$$ -188243 -108839 6542 219071 426149 43462 -262097 -148002 -426263 -214327 70856
17679b45836C2343A3044N9242F191b39567G1175M2577M5033b45580d0652C0971
$$ -245836 32343 13044 72286 6191 -239567 71175 113752 158785 -245580 -40652 30971
17667B61178A5704b02927I9766b87434G6991c3123l390C50998G4970K54628j14271
$$ 261178 15704 -202927 99766 -287434 76991 -33123 -36513 350998 74970 329598 215327
17656B15327i127A34352I365J7734a10890A81136i7646G0769R3363a44334l30726
$$ 215327 -9127 134352 9365 27099 -110890 181136 -97646 70769 164132 -144334 -475060
17645d75060b0997j06102e0702B90675L0889h5770L3252B08349b46934B16049
$$ -475060 -20997 -127099 -50702 290675 321564 -85770 -52518 208349 -246934 216049
17634f6571b9737k48243C1458a65128e910C0445K7810K77145C3434N8640c83139
$$ -66571 -29737 -277980 31458 -165128 -5910 30445 58255 335400 33434 92074 -383139
17622B38944a93517m0136c502D336M6095K73321A54178a6624B15005c43577a16226
$$ 238944 -193517 -233653 -3502 4336 50431 323752 154178 -16624 215005 -343577 -116226
17610G7751K82179a87101R2525j33757M1786I2446a8749D01183b34195E3432K18575
$$ 77751 359930 -187101 -94576 -228333 -186547 92446 -18749 401183 -234195 53432 272007
17599B72007b76684D12629a4342A09079f4797D51110g4433B7144a59530B62964
$$ 272007 -276684 412629 -14342 109079 -64797 451110 -74433 27144 -159530 262964
17588A44444N6636C0074J84805b67516A70516e4056D60486c70439C63115D3168
$$ 144444 201080 30074 214879 -267516 170516 -54056 460486 -370439 363115 43168
17577F0540b69662A4237O1382c46155a11074p4679j125D06611A03059f8055C4460
$$ 60540 -269662 14237 75619 -346155 -111074 -185753 -186878 406611 103059 -68055 34460
17565B29550r6023L513a12841B4121L591i9447D2088J24128O0058c48826G5974
$$ 229550 133527 137040 -112841 24121 27712 -99447 42088 166216 226274 -348826 75974
17553B85167j35792b70969B35402B0492h2272a2154A93579i8965c0115j58183
$$ 285167 149375 -270969 235402 20492 -82272 -12154 193579 -98965 -30115 -188298
17543a88298A79539J3746F4632f8872j83514D1315g2105D3634K31260h5565A81282
$$ -188298 179539 193285 64632 -68872 -252386 41315 -72105 43634 274894 -85565 181282
17531E6585a09235c9502M812B40593B9491Q2446M4007P6213m9546J8731a3795
$$ 56585 -109235 -39502 -34690 240593 29491 111937 155944 232157 182611 201342 -13795
17519b46523H8550a17224F2002M0272K03250b16935D82144b2430G2638b22071
$$ -246523 88550 -117224 62002 102274 305524 -216935 482144 -22430 72638 -222071
17508A92101N7147H6788M026L6019R9729Q9252B7251K60297q0744l5414J05980
$$ 192101 249248 86788 90814 126833 226562 315814 27251 287548 206804 171390 277370
17497B77370A14216L0557L12120a39996b5558A37269J18332a534j60019C4075
$$ 277370 114216 144773 456893 -139996 -25558 137269 255601 -1534 -161553 34075
17486C2902J08459L084F8315f8418D20251k04947F7613n473c8540J7013E6604
$$ 32902 141361 144445 68315 -68418 420251 215304 67613 62140 -38540 -21527 56604
17474h0590K9573D8719A7516J6633O8168P5863J05376l074d740B16516J17792
$$ -80590 -51017 48719 17516 34149 102317 178180 283556 280482 -4740 216516 334308
17463C34308q2849h2985A8472a43296A31463P0905a7718m794j3857D8540K48362
$$ 334308 251459 -82985 18472 -143296 131463 202368 -17718 -22512 -36369 48540 296902
17452B96902e8938A40819M5562J55079M8929p2422A54874J9490R7707A17330L4353
$$ 296902 -58938 140819 186381 341460 390389 317967 154874 174364 272071 117330 151683
17441A51683L84917A5477a0739H3999P2072J85929n3898J05350A73684K2506K0472
$$ 151683 536600 15477 -10739 83999 156071 342000 288102 393452 173684 196190 216662
17430B16662o603O242p0150J39676a16896C08145Q6201A65934L07402G2978a43754
$$ 216662 210059 216301 146151 285827 -116896 308145 394346 165934 473336 72978 -143754
17418a34746B73855C8718J77166J36485H5651K93083k5058d5170B62870N1479
$$ -134746 273855 38718 215884 352369 85651 378734 353676 -45170 262870 314349
17408C14349g1169H6547L10795A32942O1694b3456I6492g8098B14905K06960q0135
$$ 314349 -71169 86547 397342 132942 194636 -23456 96492 -78098 214905 421865 341730
17397C41730G6223K52784A19149J08588n3161R1050j24746m7667K08387K95768
$$ 341730 76223 329007 119149 227737 174576 265626 140880 93213 301600 597368
17387E97368A7120M66366D4514R2918B2646a25158M2697D7215J70868K29653g008
$$ 597368 17120 483486 44514 137432 22646 -125158 -82461 47215 218083 447736 -7008
17375C07450j46343J4011d3539F2324P1230A7141b73706B73597I5346j6505e4680
$$ 307450 161107 175118 -43539 62324 133554 17141 -273706 273597 95346 78841 -54680
17363B36478o9763e9395B31414F5846L42347N614C2151r274L21487I2788a54526
$$ 236478 166715 -59395 231414 65846 408193 413807 32151 22877 344364 92788 -154526
17351A87447M7927P1898j12799Q6626B0345K76770m1604A15633K35817J97708
$$ 187447 235374 307272 194473 281099 20345 297115 255511 115633 351450 549158
17341E49158A46498J46272j2326G2503K92315D0618J14664K1084M7326j03506
$$ 549158 146498 292770 280444 72503 364818 40618 155282 176366 223692 120186
17331A20186K65823j05795H316K49059r435C426L0068N540J18997K03203p2533
$$ 120186 386009 280214 8316 257375 247940 3426 33494 39034 158031 361234 288701
17320B88701j03310E0182b80653C79635a2206j20354F30117i6061j69204B07127
$$ 288701 185391 50182 -280653 379635 -12206 -132560 630117 -96061 -265265 207127
17309C8006J91381N5394b3595A162J71446a01847C92589A04207c4164D6030O5333
$$ 38006 229387 284781 -23595 1162 172608 -101847 392589 104207 -34164 46030 111363
17298A11363E5488h9153A51466Q0160o2566m0761b05137A64722g3674B57228K52871
$$ 111363 55488 -89153 151466 231626 169060 128299 -205137 164722 -73674 257228 510099
17287E10099G6015A6563N5596a05065C599M02361A33782k4820J22465i1027j17837
$$ 510099 76015 16563 72159 -105065 3599 405960 133782 108962 231427 -91027 -208864
17276b08864C34806I1538j8939J90618a71119E6807a60741C48669F404K74557
$$ -208864 334806 91538 72599 263217 -171119 56807 -160741 348669 6404 280961
17266B80961j17481J37661l8673P9495M9953j66528Q6687J84096F1773J38824
$$ 280961 163480 301141 262468 341963 391916 225388 312075 496171 61773 200597
17256B00597p6414L34994A52358n6459J36641J41911A86239J07397e5546E9550
$$ 200597 124183 459177 152358 95899 232540 374451 186239 293636 -55546 59550
17245A43930P4401a95278C43352A50571g9421C91390B5084K17064o9278J39919
$$ 143930 218331 -195278 343352 150571 -79421 391390 25084 242148 172870 312789
17235C12789J16002c07229A23188g8105b1275A86994q7745L31156j36458O1992
$$ 312789 428791 -307229 123188 -78105 -21275 186994 99249 430405 293947 355939
17225C55939j38708p1f1846A38967K17504e4613C66667j26291G348n2C12J28392
$$ 355939 217231 217160 -61846 138967 356471 -54613 366667 240376 7348 7296 312 128704
17213A28704j5130J41621J55008j05902j4407O0788A61766C419M2920R2270O7123
$$ 128704 113574 255195 410203 304301 289894 350682 161766 3419 46339 138609 205732
17202B05732O1399O4563J14290B13797p8857J31145N0317j22305Q5523O6886A10342
$$ 205732 267131 331694 445984 213797 134940 266085 316402 194097 279620 346506 110342
17190B70824f897B48507q8134D0158R2293Q656J31492J83482J75299k63267A76832
$$ 270824 -6897 248507 160373 40158 132451 141107 272599 456081 631380 368113 176832
17178A79551K91709A69078L9634j1883m5839K64333m8962J2062M2323Q6231j92232
$$ 179551 471260 169078 208712 196829 150990 415323 366361 378423 420746 506977 314745
17167C14745K64648B05111R5570r0864K35735A2633L86457K95874B43498j1195
$$ 314745 579393 205111 300681 209817 445552 12633 399090 694964 243498 232303
17157B32303K19298A20030N7366j7944M33101A21156J44327K78138A49062J81776
$$ 232303 451601 120030 177396 159452 592553 121156 265483 543621 149062 330838
17147C30838O3621I7740R8187n3704K02842K80057A20938J56346J33493K14970
$$ 330838 394459 97740 195927 142223 345065 625122 120938 277284 410777 625747
17137F25747l08396q1476k9265K54365L3499A60334m343J10098I1779C1450K62355
$$ 625747 317351 235875 206610 460975 494474 160334 155991 266089 91779 31450 293805
17126B93805j5621J58702A98357L49682j33010j04848J8879l426L960o784j23250
$$ 293805 278184 436886 198357 548039 415029 310181 329060 325634 329594 322810 199560
17115A99560M71561B55309L60758B87848D5005L72021o2413J92665k41859K0930
$$ 199560 671121 255309 616067 287848 45005 417026 354613 547278 305419 326349
17105C26349o7201j06781J15934K3432O3740L7742L67512j93742B29014P10742
$$ 326349 259148 152367 268301 291733 355473 393215 760727 566985 229014 939756
17095I39756B96363Q2019J02695k37598M03302B97650K49805k65658K60441m5421
$$ 939756 296363 378382 481077 243479 646781 297650 547455 281797 542238 496817
17085D96817B40062k1254M51934A01515L0042N25258k88893J14425J81754p2904
$$ 496817 240062 218808 670742 101515 131557 656815 367922 482347 664101 591197
17075E91197k05700J01054R2985L0252j59326K52258k33018P067L29610C47531
$$ 591197 385497 486551 579536 609788 450462 702720 469702 476769 806379 347531
17064H11092l00512B12065J99672j8430L7886K21402j41397R7127k05182Q7314
$$ 811092 510580 212065 411737 393307 431193 652595 511198 608325 403143 490457
17054D90457k39336n7081M93059l7554j82671j50870J67429J11416j63623M13209
$$ 490457 251121 194040 687099 649545 466874 316004 483433 594849 431226 844435
17044H44435D19146K10172k06893j45564L22966J93256k55480l5638j25049O64265
$$ 844435 419146 629318 422425 276861 599827 793083 537603 501965 376916 1041181
17034A041181C24068N2117J34535o8667K13579r1590L69633l48801k2145j81140
$$ 1041181 324068 376185 510720 442053 655632 564042 933675 584874 562729 381589
17024C81589L27049k9598Q7442J8630j24941j87536Q1538j44784J84968j24214
$$ 381589 708638 679040 766482 785112 660171 472635 554173 409389 594357 470143
17014D70143j94686N30797J67062l0640k26186L4259j18579k7884J42452k62494
$$ 470143 275457 806254 973316 942676 716490 750749 632170 604286 746738 484244
17004D84244J82961j37462J44651p0112K58144l66828K44080j46814K34855k93525
$$ 484244 667205 529743 674394 604282 862426 495598 739678 592864 827719 534194
16994E34194j40835K76130j33994K85355Q5106j63091L45563E19836J98212l02074
$$ 534194 393359 669489 535495 820850 905956 742865 1088428 519836 718048 415974
16984D15974L26710M27891m93284J40212K77699j67296p4308O7556q6568J52068
$$ 415974 742684 1170575 677291 817503 1095202 927906 853598 921154 834586 986654
16974I86654l6822j44399k5447m3809J69352L14672k51772j2071j83114q8466
$$ 986654 949832 805433 779986 736177 905529 1220201 968429 956358 773244 684778
16964F84778K17109K20107k7419J00337m60588J10956k3114K17706Q7028m23193
$$ 684778 901887 1121994 1094575 1194912 734324 845280 822166 1039872 1126900 703707
16954G03707J87147j00286J89511j27264L91839j3925l97564L02061J83523j51095
$$ 703707 890854 790568 980079 852815 1244654 1230729 833165 1135226 1318749 1167654
16944A167654j25823j00309M8164k2258M51198l38088r4794K09362j88420N02090
$$ 1167654 1041831 941522 989686 967428 1418626 1080538 985744 1195106 1006686 1508776
16934A508776j77079k63383Q2235J69950k76308J70775L50030l81329k71131O00792
$$ 1508776 1331697 1068314 1150549 1320499 1044191 1214966 1564996 1183667 912536 1513328
16924A513328j4787k71885Q0876j76927K61328J0378k580m710K53360l54655j23949
$$ 1513328 1498541 1226656 1307532 1130605 1391933 1402311 1399731 1395021 1648381 1293726 1169777
16913A169777M33393J3063l34N7359n8852j42409M1079Q0918j1393K52645k89563
$$ 1169777 1603170 1616233 1615899 1673258 1614406 1471997 1513076 1593994 1582601 1835246 1545683
16902A545683N4229L16189l74965K50736K11221k22695l4814Q9655L43005j15045
$$ 1545683 1599912 1916101 1541136 1791872 2003093 1780398 1745584 1835239 2178244 2063199
16892B063199M698j39446J24540j72487r1139L81668k98512J67150o4268J97028
$$ 2063199 2067897 1928451 2052991 1880504 1789365 2171033 1872521 2039671 1975403 2172431
16882B172431o1353p24L10272m97510L33015j87948M46397J7853k10188L07107
$$ 2172431 2111078 2110354 2420626 1923116 2256131 2068183 2514580 2532433 2322245 2629352
16872B629352j34895L06683J53061o90334K47188M78062l72608O8546J23905L9601
$$ 2629352 2494457 2801140 2954201 2263867 2511055 2989117 2616509 2685055 2808960 2848561
16862B848561K41379j38800j43005l03116M00070L8609K39024r7836J1647K00032
$$ 2848561 3089940 2951140 2808135 2505019 2905089 2943698 3182722 3084886 3096533 3296565
16852C296565N9266M9183K0474k8674J39850j1266j45579M8164O7161K64903R5507
$$ 3296565 3355831 3405014 3425488 3396814 3536664 3525398 3379819 3427983 3495144 3760047 3855554
16841C855554J24724J13302N678l5934j00136J64051M45761l39117P9820K31904
$$ 3855554 3980278 4093580 4099258 4063324 3963188 4127239 4573000 4233883 4313703 4545607
16831D545607k5406P501O10290n02147K52115N8632J52964K36334P0814O5206
$$ 4545607 4520201 4527702 5137992 4635845 4887960 4946592 5099556 5335890 5406704 5471910
16821E471910k10871J18243K72434j26585L78501J74741K42932K47722o1239j06762
$$ 5471910 5261039 5379282 5651716 5525131 5903632 6078373 6321305 6569027 6507788 6401026
16811F401026K18363q6640M65986K62108K0109O7730J93765K314J45034L27557
$$ 6401026 6619389 6532749 6998735 7260843 7280952 7348682 7542447 7544761 7689795 8017352
16801H017352K61303N8381J82200Q976M98874M40765L8041L70391L82763J79590
$$ 8017352 8278655 8337036 8519236 8528212 9027086 9467851 9505892 9876283 10259046 10438636
16791A0438636J87082K77484k48081N43527N85512J11008L29218M04638N92085
$$ 10438636 10625718 10903202 10655121 11198648 11784160 11895168 12224386 12629024 13221109
16782A3221109K90644K64341M34291J87855P94865N24391P74485J01058P45720
$$ 13221109 13511753 13776094 14210385 14398240 15193105 15717496 16491981 16593039 17338759
16773A7338759J92668P28201K84850J158803N41524Q74064N80688M60108P77550
$$ 17338759 17531427 18259628 18544478 19703281 20244805 21118869 21699557 22159665 22937215
16764B2937215J079179R14468J190132J070639N52327J686176J226406J141165
$$ 22937215 24016394 24930862 26120994 27191633 27743960 29430136 30656542 31797707
16756C1797707J106845J257383K107237J347744K108769J821547J771189K187120
$$ 31797707 32904552 34161935 36269172 37616916 39725685 41547232 43318421 45505541
16748D5505541J957555K489956K599043K792504K658038L302691L405837K943002
$$ 45505541 47463096 49953052 52552095 55344599 58002637 61305328 64711165 67654167
16740F7654167M116120M266737M169483M864542M757476N161478N308035N984764
$$ 67654167 71770287 76037024 80206507 85071049 89828525 94990003 100298038 106282802
16732A06282802N938885O430925O369573O639547O838830O831297O581803O861140
$$ 106282802 112221687 118652612 125022185 131661732 138500562 145331859 151913662 158774802
16724A58774802O266711N718434N109471M249559L725406K515700J956974K79913
$$ 158774802 165041513 170759947 175869418 180118977 183844383 186360083 188317057 188596970
16716A88596970p86759j610043k648523l851573m228732n559531n368749o322311
$$ 188596970 187810211 186200168 183551645 179700072 175471340 169911809 164543060 158220749
16708A58220749o740806o954267o532949p030876o806227o368041o298664o377288
$$ 158220749 151479943 144525676 137992727 130961851 124155624 117787583 111488919 105111631
16700A05111631n814517n464443n065592n109203m638511m097012m458629l551303
$$ 105111631 99297114 93832671 88767079 83657876 79019365 74922353 70463724 66912421
16692F6912421l661707l224124l290115k604055k949598k634929k446116k198152
$$ 66912421 63250714 60026590 56736475 54132420 51182822 48547893 46101777 43903625
16684D3903625j967967k076345j946362j732131j663081j516088j216949j078668
$$ 43903625 41935658 39859313 37912951 36180820 34517739 33001651 31784702 30706034
16676C0706034j327931j404486j051547o06662j544642r97266p30426j379611
$$ 30706034 29378103 27973617 26922070 26315408 24770766 23773500 23043074 21663463
16668B1663463p09320j66335j126283q99611m98041n28036m48496r10873l09973
$$ 21663463 20954143 20787808 19661525 18761914 18263873 17735837 17287341 16376468 16066495
16659A6066495q17198n5711p41002j64651p65235j56768n99009r4067n51439n22901
$$ 16066495 15249297 15193586 14452584 14287933 13522698 13365930 12766921 12672854 12121415 11598514
16649A1598514l07384k99483j55290n9369m11342l03323k01382k19086k93839
$$ 11598514 11291130 10991647 10836357 10776988 10365646 10062323 9860941 9641855 9348016
16640I348016j89919k96810m1255o20998j39442m42383K31350k95849k47556J02161
$$ 9348016 9158097 8861287 8820032 8199034 8059592 7617209 7848559 7552710 7305154 7407315
16630G407315l63345l15132J99463J32407l90228m13455m2682j78932L7282k16482
$$ 7407315 7043970 6728838 6928301 7060708 6670480 6257025 6214343 6035411 6072693 5856211
16620E856211M4519m91314k51105M761O3295P2700q36921O46599m78076J83625
$$ 5856211 5900730 5409416 5158311 5163072 5226367 5299067 4462146 5108745 4630669 4814294
16610D814294j28301j27337j81463J32173j10774j3650j2907j20778k88805K26498
$$ 4814294 4685993 4558656 4377193 4509366 4398592 4384942 4372035 4251257 3962452 4188950
16600D188950k89439r1685k23568P6356j99294K32503Q1362j37932m94079L75719
$$ 4188950 3899511 3807826 3584258 3660614 3461320 3693823 3775185 3637253 3143174 3518893
16590C518893k60933k74034J1538K7051k31558q3152K63141J7887J76163n07479
$$ 3518893 3257960 2983926 2995464 3022515 2790957 2707805 2970946 2988833 3164996 2657517
16580B657517J37494q0320j12246m1431o9594L39515m30027J15102l56982M64029
$$ 2657517 2795011 2714691 2602445 2561014 2491420 2830935 2400908 2516010 2159028 2623057
16570B623057m11860L23713k29443n2786K58264l37639L72740k53615Q4630m01449
$$ 2623057 2211197 2534910 2305467 2252681 2510945 2173306 2546046 2292431 2377061 1975612
16560A975612M6906K4273O55408q75282L86448m7923N9941K2829j79002j63113
$$ 1975612 2022518 2046791 2702199 1826917 2213365 2165442 2225383 2248212 2069210 1906097
16550A906097l86778K71945k09091L08652M7190l08219K35892O6193m8707l76829
$$ 1906097 1519319 1791264 1582173 1890825 1938015 1629796 1865688 1931881 1883174 1506345
16540A506345K75107N66k08055k01496L79139j3703l49459L57665m10813J8074
$$ 1506345 1781452 1782018 1573963 1372467 1751606 1737903 1388444 1746109 1335296 1353370
16530A353370M28182j82908Q9415k47379J07460j92459l3519k18051O62144o55068
$$ 1353370 1781552 1598644 1688059 1440680 1548140 1355681 1322162 1104111 1766255 1111187
16520A111187M53571m96902J70841l41805J5329J15954M46834l21868M23310j92019
$$ 1111187 1564758 1067856 1238697 896892 912221 1028175 1475009 1153141 1576451 1384432
16510A384432m70004K01591n3399l6323J89711l54082L66534j04588j65547j15697
$$ 1384432 914428 1116019 1062620 1026297 1216008 861926 1228460 1123872 958325 842628
16500H42628K27842O949j46276Q0454K5170M4338K06758k55933R9106K1029m92052
$$ 842628 1070470 1077419 931143 1011597 1036767 1081105 1287863 1031930 1131036 1152065 660013
16489F60013K62985k39806K42677o8530M6314K1513P8719j36394l8155L33856
$$ 660013 922998 683192 925869 857339 903653 925166 1003885 867491 829336 1163192
16479A163192r806j24289l26085M9929J39224k63129K49490l990K965J00663j14633
$$ 1163192 1153386 1029097 703012 752941 892165 629036 878526 874536 877501 978164 863531
16468H63531N8053o3265o228j51558R1769J24973k5019m4762J8115J99162k63633
$$ 863531 921584 858319 852091 700533 792302 917275 892256 847494 865609 1064771 801138
16457H01138j08256K14738j16592C83722L50165l30639K38211J08003k78990M04296
$$ 801138 692882 907620 791028 383722 733887 403248 641459 749462 470472 874768
16447H74768l26762J18744j6648j97107J52002k97989N68018k88095M00775l73677
$$ 874768 548006 666750 650102 452995 604997 307008 875026 586931 987706 614029
16437F14029o1386l8096J22986o9923J19323N6790o1010q0267K74774k12089j49699
$$ 614029 552643 514547 637533 567610 686933 743723 682713 602446 877220 665131 515432
16426E15432P4508J4953j69487J29237j70378M8166K87773j76990J21705l24814
$$ 515432 589940 604893 435406 564643 394265 442431 730204 553214 674919 350105
16416C50105n8712K21649J74411l01167n6534l6394M9292M8468L9107L21197o3890
$$ 350105 291393 513042 687453 386286 329752 293358 342650 391118 430225 751422 687532
16405F87532Q183j91728J64811k38815J99626m0739j73175N6472B09122J72696
$$ 687532 695715 503987 668798 429983 629609 588870 415695 472167 209122 381818
16395C81818j04339J30704P2110j51312P8839H9753K86215j46443J24542j8401
$$ 381818 277479 408183 480293 328981 407820 89753 375968 229525 354067 335666
16385C35666J30884j07586A53544l8976M26857B55087N98776C33827N8149O9461
$$ 335666 466550 358964 153544 114568 541425 255087 853863 333827 391976 461437
16375D61437o9085J08247A02068j1212B1279L86252K00126B94813q1008l5941
$$ 461437 392352 500599 102068 90856 21279 407531 607657 294813 213805 177864
16365A77864K87460K85424L1316l05128B13499J70360K21080B15238J94502L618
$$ 177864 465324 750748 782064 476936 213499 383859 604939 215238 409740 413358
16355D13358J1591j38757E423M35773j814Q7342A98318a11840A63932J77759N9067
$$ 413358 424949 286192 5423 441196 439382 526724 198318 -111840 163932 341691 400758
16344D00758K20895K43733C98538D6221L73280O7017j13165j34949P5249l2404
$$ 400758 621653 865386 398538 46221 419501 486518 373353 238404 313653 281249
16334B81249J05499j2178n925j70689P0045a6213D66433A47289K45991R0215A28989
$$ 281249 386748 374570 368645 197956 268001 -16213 466433 147289 393280 483495 128989
16322i7131D51928k22298K71411A86003K6317n2072M4169K57909A32500J32885
$$ -97131 451928 229630 501041 186003 212320 160248 204417 462326 132500 265385
16312B65385O8220R5867A69657K33479p2243j9709L8281R1342I7556j2072f4266
$$ 265385 333605 429472 169657 403136 330893 311184 349465 440807 97556 85484 -64266
16300D42830j84993j08739K48884a87481b6702B8369K09655h0734B40023K3293
$$ 442830 257837 149098 397982 -187481 -26702 28369 238024 -80734 240023 263316
16290B63316K11747A70003i8872A08867i7010G4235L38448p8546M1844n4726m0405
$$ 263316 475063 170003 -98872 108867 -97010 74235 412683 334137 375981 321255 280850
16279B80850r386J64555I4863M248K58353A4308J92961m5658J86924H6970J59595
$$ 280850 271464 436019 94863 99111 357464 14308 207269 161611 348535 86970 246565
16268B46565J10236j55272J6639J4400q4911F0747K4059J51793n3431K32066G5963
$$ 246565 356801 201529 218168 232568 147657 60747 84806 236599 183168 415234 75963
16256B76276c4752B27625J45567g0876n4222B83107K7205b76143B65827k7290
$$ 276276 -34752 227625 373192 -70876 -125098 283107 310312 -276143 265827 238537
16246B38537A7914K29027e6466B98512a5665C62007A46988F3971K65710A51005
$$ 238537 17914 246941 -56466 298512 -15665 362007 146988 63971 329681 151005
16235G1631L06825b85579F3770P0670n9972J05443k3863n5536J38850K20830E579
$$ 71631 378456 -285579 63770 134440 74468 179911 156048 100512 239362 460192 5579
16223B61296B7769g2186C5155J15662o368r934h4148M1082B82337H5005N3172
$$ 261296 27769 -72186 35155 150817 144449 134515 -84148 -43066 282337 85005 138177
16212A38177M688q537O2457q9350b03929c8442B70072o2402K18632E5055L9118
$$ 138177 142865 134328 196785 107435 -203929 -38442 270072 207670 426302 55055 94173
16201I4173K92206a81877h418A30942L3711G1932q198B3249a61829B36233a81434
$$ 94173 386379 -181877 -8418 130942 164653 71932 63734 23249 -161829 236233 -181434
16189f6369E2302a23461A8916a09616C1878K2543a69036P7816B9465J2496N0328
$$ -66369 52302 -123461 18916 -109616 31878 54421 -169036 -91220 29465 41961 92289
16178I2289g7437j6620L7913k8994C03156D5603j2314h7900m5781B60717J7291
$$ 92289 -77437 -94057 -56144 -85138 303156 45603 33289 -87900 -133681 260717 278008
16167B78008L5670A35308B3496J22264c3032A21350O5356K8832j3704H3101a71436
$$ 278008 313678 135308 23496 145760 -33032 121350 186706 215538 201834 83101 -171436
16155F3919c00832D3944M56957A86530B2792e4194B71671A21941a61496A59510
$$ 63919 -300832 43944 500901 186530 22792 -54194 271671 121941 -161496 159510
16144G0070a50099H8573j6234O7466Q9969K4027j23367K71257F3070M7041O0742
$$ 70070 -150099 88573 72339 139805 229774 253801 130434 401691 63070 110111 170853
16133A70853n1958K1826c59545A19529d5476A99544H9722a3290B37116b17074
$$ 170853 118895 140721 -359545 119529 -45476 199544 89722 -13290 237116 -217074
16122C3341c2971H679c9132A59043p2475m0734b5304A40497h2261K7869I3430
$$ 33341 -32971 8679 -39132 159043 86568 45834 -25304 140497 -82261 -54392 93430
16110B06729e7231A41725E1441P0644a8809E4736e266B05990o0862D3242a3178
$$ 206729 -57231 141725 51441 122085 -18809 54736 -5266 205990 145128 43242 -13178
16098b3192A33102i1181m6355K8391A3263a1779j28102J8684B6867J30068a45188
$$ -23192 133102 -91181 -137536 -109145 13263 -11779 -139881 -121197 26867 156935 -145188
16086A13823a34355A83833q2402C9473a35234A00031a37425A40159B0286J90706
$$ 113823 -134355 183833 101431 39473 -135234 100031 -137425 140159 20286 210992
16076B10992c0952r0133B08323q2645J02068J7177F8396I914Q0015a67225A8812
$$ 210992 -30952 -121085 208323 125678 227746 244923 68396 9914 89929 -167225 18812
16064h3488J0251B56192G5381N8453o312a3196B41960c75110I0711f7648j24385
$$ -83488 -73237 256192 75381 133834 127522 -13196 241960 -375110 90711 -67648 -192033
16053a92033K6687B8602b919j18618G9704b25076A18968i3124J1192C2173a14844
$$ -192033 -165346 28602 -2919 -121537 79704 -225076 118968 -93124 -81932 32173 -114844
16041C48925A10508J10226b01122b4770o4382C885b36031F2037J04912F14a72948
$$ 348925 110508 220734 -201122 -24770 -89152 3885 -236031 62037 166949 614 -172948
16029b5362B2738a34945E6355b36215A04081a04870A98247d17061i0098B53842
$$ -25362 22738 -134945 56355 -236215 104081 -104870 198247 -417061 -90098 253842
16018C33928b66928j17652J04458e1853q272B12601b56952j86129q1268C02a90531
$$ 333928 -266928 -384580 -280122 -51853 -60125 212601 -256952 -443081 -524349 302 -190531
16006A57519J85998c881j2640B14073c37978B52077F5239f1679F837b36092A34253
$$ 157519 343517 -3881 -16521 214073 -337978 252077 65239 -61679 6837 -236092 134253
15994B48007h316l3142m5203B55228F4964d02605C85237A0863J38655Q6088O6907
$$ 248007 -8316 -41458 -86661 255228 64964 -402605 385237 10863 149518 235606 302513
15983C02513J24844j34999p0310j7054F8197J68880p0192G890L61276h7456j22625
$$ 302513 427357 292358 222048 204994 68197 237077 166885 7890 369166 -87456 -210081
15972b10081g6115k67828C78661E4991L50253g563c535A75361L6553b59131H8024
$$ -210081 -76115 -343943 378661 54991 405244 -7563 -3535 175361 211914 -259131 88024
15960B18713e864A991J95924m406d1493j18342B02913f0842A30440c73780J42567
$$ 218713 -5864 1991 197915 193509 -41493 -159835 202913 -60842 130440 -373780 -231213
15949b31213Q3524D8734h5612p4334L4016j51751B6508b14550B69998b11472P5016
$$ -231213 -147689 48734 -85612 -159946 -125930 -277681 26508 -214550 269998 -211472 -136456
15938a36456C01896b84670a35299J2120F0556L5910N7099a44387o3114E282K75166
$$ -136456 301896 -284670 -135299 -123179 60556 96466 153565 -144387 -207501 5282 280448
15927B80448e2172l20610J71422B14024A8869a04749f513j39446O0149n7030c8180
$$ 280448 -52172 -372782 -201360 214024 18869 -104749 -6513 -145959 -85810 -142840 -38180
15915d88194C49641g9396j45947d6972F9453d50940A58019R7953C2663c5134A75221
$$ -488194 349641 -79396 -225343 -46972 69453 -450940 158019 255972 32663 -35134 175221
15903a11742B44987B6613P2405d11590J57052e2424j14275e8535k4529G5150f1502
$$ -111742 244987 26613 99018 -411590 -254538 -52424 -166699 -58535 -83064 75150 -61502
15891b14280A40150b2177k24013a02511K4489A76692i3314C77035c4954B1258
$$ -214280 140150 -22177 -246190 -102511 -78022 176692 -93314 377035 -34954 21258
15880A25213m4149O1791P0388D3182d38814A5870J45439b55468i8000B59828K5849
$$ 125213 81064 142855 213243 43182 -438814 15870 161309 -255468 -98000 259828 285677
15869B85677a01298m2834q577A90537d46974e6797k02475A73199d1575N091a7216
$$ 285677 -101298 -144132 -152709 190537 -446974 -56797 -259272 173199 -41575 -36484 -17216
15857a1900j41535L0708l0402j39860B05719a83950e4863b2042G4956a64754A4630
$$ -11900 -153435 -122727 -153129 -292989 205719 -183950 -54863 -22042 74956 -164754 14630
15845b6624A31525c00224b0110C5731b6035a718G7063J53238p6094a64326B59631
$$ -26624 131525 -300224 -20110 35731 -26035 -1718 77063 230301 154207 -164326 259631
15833a16227A34314C4607Q2218E7619k7511d1244o5276q3076A2871h4501k82116
$$ -116227 134314 34607 116825 57619 30108 -41244 -106520 -189596 12871 -84501 -366617
15822c66617h6026E1351a77170K3856o6930B2366f0217C4998a54406A59084F6933
$$ -366617 -86026 51351 -177170 -153314 -220244 22366 -60217 34998 -154406 159084 66933
15810a79876j49378J12055g0682A35338n6640b3679A62168a50274P3496C32275
$$ -179876 -329254 -217199 -70682 135338 78698 -23679 162168 -150274 -76778 332275
15799A11954K08m919D9389R9652l3812b95893J30808j369g1922B09122m3924h2963
$$ 111954 112162 107243 49389 149041 115229 -295893 -165085 -166454 -71922 209122 165198 -82963
15786a7786p260a1275D0366a46645j72998I1495L6019a39039k27290B3495q771
$$ -17786 -25046 -11275 40366 -146645 -319643 91495 127514 -139039 -366329 23495 14724
15775A4724b01858A78489l002h8534B0175K4175j975J4341K44858d31699A37079
$$ 14724 -201858 178489 175487 -88534 20175 44350 42375 56716 301574 -431699 137079
15763c03183B65204b44563A18704f3802H0427N6807A6787h0008A5400J54955a66742
$$ -303183 265204 -244563 118704 -63802 80427 137234 16787 -80008 15400 170355 -166742
15751h3774I1599c84549H8694O536Q4319b61109A45793a76300A55257a23668e0627
$$ -83774 91599 -384549 88694 95230 179549 -261109 145793 -176300 155257 -123668 -50627
15739b7159B94812q1279c38216a56930k78850A87956a99503m9207A195f6986j29131
$$ -27159 294812 213533 -338216 -156930 -435780 187956 -199503 -248710 1195 -66986 -196117
15728a96117D5956h2554B74949I2798h8507j85607j89334A331a99399B93693a40048
$$ -196117 45956 -82554 274949 92798 -88507 -274114 -463448 1331 -199399 293693 -140048
15716a35351A54146a00399l5180j92095b4434k97218j90640I7640c42162L9607
$$ -135351 154146 -100399 -135579 -327674 -24434 -321652 -512292 97640 -342162 -302555
15706c02555J40182F2128c2446j11612J5923D2558J58017a52930F3380j1850a91100
$$ -302555 -162373 62128 -32446 -144058 -128135 42558 200575 -152930 63380 51530 -191100
15694f7546B6537a1157b661k5470a00A45800j2531J28406a9546A5586M60382A02691
$$ -67546 26537 -11157 -2661 -28131 -100 145800 133269 261675 -19546 15586 475968 102691
15681e8178J1533m4472m8271e1231C0603b43888k54651b24839F4281K72808b2654
$$ -58178 -46645 -91117 -139388 -51231 30603 -243888 -498539 -224839 64281 337089 -22654
15669b32655a05887A35405P5064a24486j56785M1468a00272E2511a90102q620
$$ -232655 -105887 135405 210469 -124486 -281271 -239803 -100272 52511 -190102 -198722
15659a98722N8431p7932F3058c9957n7605F8982i2153A8216L3373b69396A0761
$$ -198722 -140291 -218223 63058 -39957 -97562 68982 -92153 18216 51589 -269396 10761
15647b07925A81379k061L4386a89600k6878e2643E7546f0232A58775d8665j06333
$$ -207925 181379 179318 213704 -189600 -216478 -52643 57546 -60232 158775 -48665 -154998
15636a54998g0510H4715B3705K607J48461E1496J00090G3933a42076k1606A65966
$$ -154998 -70510 84715 23705 26312 174773 51496 151586 73933 -142076 -163682 165966
15624C20533b30491K8520j5048A65962j0278p2564J10027b00777h0593l61999
$$ 320533 -230491 -201971 -217019 165962 155684 83120 193147 -200777 -80593 -442592
15614d42592e7303C62649b61608E5616h4689J1876j5910G0975n593a16257k13247
$$ -442592 -57303 362649 -261608 55616 -84689 -72813 -88723 70975 65382 -116257 -329504
15603c29504J56771r1925k7039A81309b90304A62495n744c06005D26325a18148
$$ -329504 -172733 -264658 -291697 181309 -290304 162495 156751 -306005 426325 -118148
15592B6265b21158b6005j18760j14927P4909E8305Q8409H798J49801l9090j0895
$$ 26265 -221158 -26005 -144765 -259692 -184783 58305 146714 8798 158599 119509 108614
15581A08614c19210J12772A03184a8894l57748E793f7507J7861c749I1342b30728
$$ 108614 -319210 -206438 103184 -18894 -376642 5793 -67507 -49646 -3749 91342 -230728
15569a45078q0683K1162j0980D5255J36912f4955A62781b01868g7792j7114A6164
$$ -145078 -225761 -204599 -215579 45255 182167 -64955 162781 -201868 -77792 -94906 16164
15557F8718J24525a67405j79330a54332A8059a24982r6120B47259r3899D2465
$$ 68718 193243 -167405 -346735 -154332 18059 -124982 -221102 247259 153360 42465
15546e9243A56139J52715a86878a3940B56433m682F2046q354n527i9933j114r5496
$$ -59243 156139 308854 -186878 -13940 256433 251751 62046 53692 48165 -99933 -101047 -196543
15534a96543M2696H0903a81631I403J96359g2643C8345d8968E4676J95224I6a17758
$$ -196543 -153847 80903 -181631 9403 205762 -72643 38345 -48968 54676 249900 96 -117758
15521B15750G687J46267a47730g1819A43097j2629m3974N5905L0216n9475b02393
$$ 215750 7687 153954 -147730 -71819 143097 130468 86494 142399 172615 113140 -202393
15509i5628p7312M0951M2281j42233i9821B07689p324a63706l8999p9674a8505
$$ -95628 -172940 -131989 -89708 -231941 -99821 207689 200365 -163706 -202705 -282379 -18505
15497a52962B7574M23088I9610e5085C8389K4565P4518d14593F7136a29247A25749
$$ -152962 27574 450662 99610 -55085 38389 62954 137472 -414593 67136 -129247 125749
15485A23127J8265m8001A6839K9543f4166j53693N3955K205A57019G1986J18022
$$ 123127 141392 93391 16839 46382 -64166 -217859 -163904 -161699 157019 71986 190008
15474A90008a91568r7554e657A01601d6833A54434a60760C84038A41583c04782
$$ 190008 -191568 -289122 -5657 101601 -46833 154434 -160760 384038 141583 -304782
15463a22366j74503A26834P6613L0516c14529b8695j27490A69686B3432J28960
$$ -122366 -296869 126834 203447 233963 -314529 -28695 -156185 169686 23432 152392
15453A52392a45480A18511a35604B06732k0600g5648j11373K4202g1348A75482
$$ 152392 -145480 118511 -135604 206732 186132 -75648 -187021 -162819 -71348 175482
15442a40046N6641j50716A48609b117B74441B7463a26426A7352K3788m361A425
$$ -140046 -83405 -234121 148609 -2117 274441 27463 -126426 17352 41140 36779 1425
15430B62531g5865b8704A11402a78507A12528I898J73637d9379j24229A6688J70036
$$ 262531 -75865 -28704 111402 -178507 112528 9898 183535 -49379 -173608 16688 186724
15419A86724a90269G0284P1609m405g6077n8900B67972F4178K64372B8688B737
$$ 186724 -190269 70284 141893 137488 -76077 -134977 267972 64178 328550 28688 2737
15407a88j15494E0750a95036f0492j2551j09163E1594a00973A81969G8320B1550
$$ -188 -115682 50750 -195036 -60492 -73043 -182206 51594 -100973 181969 78320 21550
15395I0257a32400I6242c58777A71473b26221a0536r4995j59929o1937o6183J59843
$$ 90257 -132400 96242 -358777 171473 -226221 -10536 -105531 -265460 -327397 -393580 -233737
15384b33737B47652e7888k6780b216H830c43418G5065j8103b42057B30124b92357
$$ -233737 247652 -57888 -84668 -2216 8830 -343418 75065 56962 -242057 230124 -292357
15372F8944c65682H5574a76807C0246d159k04210B15121i4244b3354j40227O4972
$$ 68944 -365682 85574 -176807 30246 -4159 -208369 215121 -94244 -23354 -163581 -98609
15361i8609F5414a75143m3000A05228J73174A32071m5920K14813J96667c52796
$$ -98609 65414 -175143 -218143 105228 278402 132071 86151 300964 497631 -352796
15350B91196k7782p4942a24449C19047e5800j22284k2252I228L8321j5371J09035
$$ 291196 263414 188472 -124449 319047 -55800 -178084 -200336 9228 47549 32178 141213
15339A41213a05733A7350c5861n8009j5451B2178Q740A13K0811e4304A40536H657
$$ 141213 -105733 17350 -35861 -93870 -109321 22178 30918 113 20924 -54304 140536 8657
15326b23253C21085a95231i1872I2573C6502a77474d3003e126G8742l5372B887
$$ -223253 321085 -195231 -91872 92573 36502 -177474 -43003 -5126 78742 43370 2887
15314h4620C8101J06758K6429L06472d7654B96406G1011a81280H2545R2790e9798
$$ -84620 38101 144859 171288 477760 -47654 296406 71011 -181280 82545 175335 -59798
15302D9133b3161m660k43549a3121k9995J1322F6740b55422A28371a1924C63056
$$ 49133 -23161 -27821 -271370 -13121 -43116 -31794 66740 -255422 128371 -11924 363056
15290b05205B88169a4980l10976a6493j70562Q8061k3565A03609a05276o3703
$$ -205205 288169 -14980 -325956 -16493 -187055 -98994 -122559 103609 -105276 -168979
15280a68979j61583C03242r0991a98319A07812l4801R7444g913F8579b06592A77205
$$ -168979 -330562 303242 212251 -198319 107812 73011 170455 -7913 68579 -206592 177205
15268C96882F0223a51622A26411a69835A92796F6721K00813a54263p8314A39124
$$ 396882 60223 -151622 126411 -169835 192796 66721 267534 -154263 -232577 139124
15257B7483K92108A2852K07156d708A34609J63347j8307k9366J60285R29193j62696
$$ 27483 319591 12852 220008 -4708 134609 297956 279649 250283 410568 1339761 1177065
15246A177065J64899L31359C08360L56034A39378B276J89809a5173k59320O7808
$$ 1177065 1341964 1673323 308360 664394 139378 2276 192085 -15173 -274493 -206685
15236b06685A95247a561D5540A1013f5608j3703A404J56711b645B27316j13296
$$ -206685 195247 -1561 45540 11013 -65608 -79311 1404 158115 -2645 227316 114020
15225A14020A1836J27898Q1802j0460f2500j27051C07374j17814p3280k5655K8352
$$ 114020 11836 139734 221536 211076 -62500 -189551 307374 189560 116280 90625 118977
15214A18977i8578B76930c8903o5931A2955J59470G5376L17252c14893B98377
$$ 118977 -98578 276930 -38903 -104834 12955 172425 75376 392628 -314893 298377
15203A23401E8742M6354A3896M2310a16178A72984D5999P6027K38355c6088B7098
$$ 123401 58742 105096 13896 56206 -116178 172984 45999 122026 360381 -36088 27098
15191F5107K71566a8759A27450J16860h5611a9767C25469A20134q412J12854Q5421
$$ 65107 336673 -18759 127450 244310 -85611 -19767 325469 120134 111722 224576 309997
15180C09997f0160D68601C9168K61660j22904K58296a99054M7657A08121L29246
$$ 309997 -60160 468601 39168 300828 177924 436220 -199054 -151397 108121 437367
15170D37367h0761A08517M4994N5362J2984K8954j15681J10400F3456K4401J34797
$$ 437367 -80761 108517 153511 208873 221857 250811 135130 245530 63456 87857 222654
15159B22654E7800Q5057J78340A23555n2813K64859A29579E6917L1691a29401
$$ 222654 57800 142857 321197 123555 70742 335601 129579 56917 88608 -129401
15148C23950h2044o0235B689h5476F9971a89717F6081M01718k31211j8244a57660
$$ 323950 -82044 -142279 2689 -85476 69971 -189717 66081 467799 236588 218344 -157660
15136A60551c8404A84891O9477L3008G2715J57183E9189K54629o5421A9788h1287
$$ 160551 -38404 184891 254368 287376 72715 229898 59189 313818 248397 19788 -81287
15124B96878r1877b4468H3475J400M1567B5892J97344d4087D91280B5978Q1226
$$ 296878 205001 -24468 83475 84875 126442 25892 223236 -44087 491280 25978 107204
15113A07204J13778J56364c7617q5706B91440G5666L00398h007A39505J8746Q2272
$$ 107204 220982 377346 -37617 -123323 291440 75666 376064 -8007 139505 158251 240523
15102B40523K9039q5659J35617j50319H1118k8227B5074P6926R0180a58655B6451
$$ 240523 269562 183903 319520 169201 81118 52891 25074 102000 192180 -158655 26451
15090B400e9515k5766C37677G2163Q6166M22663A52426B196M63578Q9858B68139
$$ 2400 -59515 -85281 337677 72163 158329 580992 152426 2196 465774 555632 268139
15078A16634N283A4182a39495A30590n7101j3480L41208A33852B342R9791M1903
$$ 116634 121917 14182 -139495 130590 73489 60009 401217 133852 2342 102133 144036
15067A44036e7283a4569A79623a7198E7030K929a0725B27866m9419O3266J29376
$$ 144036 -57283 -14569 179623 -17198 57030 59959 -10725 227866 178447 241713 371089
15056C71089A17203A077a67318a3955D99773c0591j79462C34910j58876K6015
$$ 371089 117203 1077 -167318 -13955 499773 -30591 -210053 334910 176034 202049
15046B02049K0330N4822j22965h7124A00770b94G1030L952J20099J47937r8959
$$ 202049 222379 277201 154236 -87124 100770 -294 71030 74982 195081 343018 244059
15035B44059q816j16842L36417o1474j21065j30109o8985a10603e574A87778M5826
$$ 244059 235243 118401 454818 393344 272279 142170 73185 -110603 -5574 187778 233604
15024B33604j2914c3451A41811K7652N2885J40488A73170j1372J48415A34712
$$ 233604 220690 -33451 141811 169463 222348 362836 173170 161798 310213 134712
15013A10809i0087D00642A01211i2655A04072B2458J40112L53743b2714C55258
$$ 110809 -90087 400642 101211 -92655 104072 22458 162570 516313 -22714 355258
15002D52833j19542G916L78659a53787J8332D70744i643B49685I7244f8015A54859
$$ 452833 333291 7916 386575 -153787 -135455 470744 -9643 249685 97244 -68015 154859
14990D72067n9721Q8176B09595L56545j60229A70594m8175h4722D06379j72160
$$ 472067 412346 500522 209595 566140 405911 170594 122419 -84722 406379 234219
14980B34219K4623A10362K19769j62949E5187K37164A13298J36809q2771K89876
$$ 234219 258842 110362 330131 167182 55187 292351 113298 250107 167336 457212
14970D57212H4829K25577q3166J06283j43577L52366N501B10987E7417J87809
$$ 457212 84829 310406 227240 333523 189946 542312 547813 210987 57417 245226
14960B45226p163F3260K1574J56090I6187K80756j70966C7377K21258a7394D32407
$$ 245226 238063 63260 84834 240924 96187 376943 205977 37377 258635 -17394 432407
14948E02261k21730k0712J51671B3623K62136M4942M7287Q4239A2233h3716B69397
$$ 502261 280531 259819 411490 23623 285759 330701 377988 462227 12233 -83716 269397
14936B93561R6490m6160A09791K658Q7909J78573l4046l3795J1332J7644A67698
$$ 293561 390051 343891 109791 112449 200358 378931 344885 311090 322422 340066 167698
14924a507D14163C2028M06992b05581C35569M3716j39424C1358L69656K15686
$$ -1507 414163 32028 439020 -205581 335569 379285 239861 31358 401014 616700
14914F16700O5548B90282K39719k17582j34976R3085E6486J33176J77245A70019
$$ 616700 682248 290282 530001 312419 177443 270528 56486 189662 366907 170019
14903E28818o2803A00380N53788j87003B24414J23226J17561A79265L5611K12112
$$ 528818 466015 100380 654168 467165 224414 347640 465201 179265 214876 426988
14893D26988J7884A44814M12811k4760k07470K21141h0983C36218K09710A86332
$$ 426988 444872 144814 557625 532865 325395 546536 -80983 336218 545928 186332
14882C31106Q9297J18832k55748j5594J44763j06558J1929j52106d0942D60278
$$ 331106 420403 539235 283487 267893 412656 306098 318027 165921 -40942 460278
14871C10119R3443K67985k42200Q6420B36044K84920j90727K45437k08187j35326
$$ 310119 403562 671547 429347 515767 236044 520964 330237 575674 367487 232161
14861B32161L26276H4206K13334D0844O01310o5679B19634J82186L6923J19361
$$ 232161 558437 84206 297540 40844 642154 576475 219634 401820 438743 558104
14851E58104k70086K68512B39922j9815L99401j18893J5673j56051K51249k23601
$$ 558104 288018 556530 239922 220107 619508 500615 516288 360237 611486 387885
14841C87885J17895j30749j72893H8955L20460J20738P3407p1023k22664L02267
$$ 387885 505780 375031 202138 88955 409415 530153 603560 532537 309873 612140
14831F12140A86332J1574J62459Q3836J89043j70498o0757m8566J49409Q1490
$$ 612140 186332 197906 360365 444201 633244 462746 401989 353423 502832 584322
14821E84322B68809J89388l9920l1377P8450q1421j31403J36304J64382B70984
$$ 584322 268809 458197 418277 386900 465350 383929 252526 388830 553212 270984
14810D78453J30540P1836j59796B07626O02055C34896K70307l6925K703j24336
$$ 478453 608993 680829 521033 207626 809681 334896 605203 568278 570981 446645
14800D46645K72671j54641o1442P7753Q8599p5782j16766l7320M8537j20115O1063
$$ 446645 719316 564675 503233 580986 669585 593803 477037 439717 488254 368139 429202
14789D29202L76654l67725l3606K78548k0819N5618r3959m6226K1723q253j63886
$$ 429202 805856 438131 404525 683073 662254 717872 623913 577687 599410 591157 427271
14778D27271K12711q5573P2442j20631M02781l36825J888J46512j64195L43427
$$ 427271 639982 554409 626851 506220 909001 572176 574064 720576 556381 899808
14768H99808l75589K31698J72332l23906J15591j91407K33627j00381j67775J89861
$$ 899808 524219 755917 928249 604343 719934 528527 762154 661773 493998 683859
14758F83859M8744B66852J15893j54619L23852M2303p2449L30787l10593J23591
$$ 683859 732603 266852 382745 228126 551978 594281 521832 852619 542026 665617
14748F65617j12459k49385L24412L07239k20362j23264L51083k07395N9918j23528
$$ 665617 553158 303773 628185 935424 715062 591798 942881 735486 795404 671876
14738F71876K68480l81582J46956L03396m62k82416j18412O3890R2685L2970j3371
$$ 671876 940356 558774 705730 1009126 1008664 726248 607836 671726 764411 797381 784010
14727G84010J2228l9873J20309l9536l54702R8961J14835j33626M10181n3557
$$ 784010 796238 756365 876674 837138 482436 581397 696232 562606 972787 919230
14717I19230n5982M5154Q0711k39207K05955k8946j7506r3310K9045k1241K27193
$$ 919230 863248 908402 989113 749906 955861 926915 909409 816099 845144 823903 1051096
14706A051096p9292n1251L1050j32943J40514J28357J51948F02423K44829R4813
$$ 1051096 971804 920553 951603 818660 959174 1087531 1239479 602423 847252 942065
14696I42065k77585J21531J5696K51104P3075N5486k50941J21206k69918K28395
$$ 942065 664480 786011 801707 1052811 1125886 1181372 930431 1051637 781719 1010114
14686A010114k02231q359L32269O2775j68308Q1153k01000j20263M55082l45202
$$ 1010114 807883 799524 1131793 1194568 1026260 1107413 906413 786150 1241232 896030
14676H96030L09632l55628O0164L3698K67911l29146J57468P6600r876j08637
$$ 896030 1205662 850034 910198 943896 1211807 882661 1040129 1116729 1106853 998216
14666I98216J60251q872m5769j60222J63191J51925q2949l36634j76454K80012
$$ 998216 1158467 1149595 1103826 943604 1106795 1258720 1175771 839137 662683 942695
14656I42695K27021l45732N39688j40831R9753p6550Q2195k04933N1797J29775
$$ 942695 1169716 823984 1363672 1222841 1322594 1246044 1328239 1123306 1175103 1304878
14646A304878J07829k66244L30617j79213l3466j35794j5788M014j21179K27570
$$ 1304878 1412707 1146463 1477080 1297867 1264401 1128607 1112819 1116833 995654 1223224
14636A223224J68524N0300q726l29336M43364m09222J30986J6720J55948L7009
$$ 1223224 1391748 1442048 1433322 1103986 1547350 1138128 1269114 1285834 1441782 1478791
14626A478791p2930J00169k51077K13162r6431n425l0584J65148J30421l22102
$$ 1478791 1405861 1506030 1254953 1468115 1371684 1366259 1335675 1500823 1631244 1309142
14616A309142j3374K03189R1398j18544j31545K06841n0869j25416J04664J42635
$$ 1309142 1295768 1498957 1590355 1471811 1340266 1547107 1496238 1370822 1475486 1618121
14606A618121L962Q8364K85429k10719l52337K91829j09058L34244J216k67599
$$ 1618121 1622083 1710447 1995876 1785157 1432820 1724649 1615591 1949835 1951051 1683452
14596A683452R366J02993J87908j5950l98649J61995K44643L1060k23949L12422
$$ 1683452 1692818 1795811 1983719 1967769 1569120 1731115 1975758 2006818 1782869 2095291
14586B095291m12449J09024L08722k78545M4957Q2849L75159l46258J8028J84418
$$ 2095291 1682842 1791866 2100588 1822043 1867000 1949849 2325008 1978750 1996778 2181196
14576B181196k02049J21162J03845p2757J53066L65276l30243K51990k51682K81972
$$ 2181196 1979147 2100309 2204154 2131397 2284463 2649739 2319496 2571486 2319804 2601776
14566B601776k14587P4889j66656K53779L27688l78450M4817M87811J16921j80868
$$ 2601776 2387189 2462078 2295422 2549201 2876889 2498439 2543256 3031067 3147988 2967120
14556B967120L23744M44861j75992L56377N97229L26223J129385J419599L946829
$$ 2967120 3290864 3735725 3559733 3916110 4513339 4839562 5968947 7388546 11335375
14547A1335375J0474916J8602363N21577j7967797j0974402n202649k383889j497307
$$ 11335375 21810291 40412654 40934231 22966434 11992032 6789383 4405494 2908187
14539B908187m14771r4266j59930l20054J68291P827K22952j29830j08853k47718
$$ 2908187 2493416 2399150 2239220 1919166 2087457 2095284 2318236 2188406 2079553 1831835
14529A831835L41736K81130j68960K50381M3673p304j70837K17872L1497J26377
$$ 1831835 2173571 2454701 2285741 2536122 2579795 2572491 2401654 2619526 2651023 2777400
14519B777400o0568m3295J37189K4710K01684k85509J25283j52195J16989N1686
$$ 2777400 2716832 2673537 2810726 2835436 3037120 2751611 2876894 2724699 2841688 2893374
14509B893374J0655R6517j85602L2893Q2138K21P1319j641K19904J79590j48155
$$ 2893374 2904029 3000546 2814944 2847837 2929975 2930196 3001515 2999874 3219778 3399368 3251213
14498C251213L25446k97935J86424q1291j129Q0044k32974N73399j00583O835
$$ 3251213 3576659 3278724 3465148 3383857 3382728 3462772 3229798 3803197 3702614 3709449
14488C709449J61351l17861L38550k86643K94113j61901l7003M28527M4750j83885
$$ 3709449 3870800 3552939 3891489 3604846 3898959 3737058 3700055 4128582 4173332 3989447
14478C989447J01360o5600J89115L26285m66465N12880m5970N4997k00754J75717
$$ 3989447 4090807 4025207 4214322 4540607 4074142 4587022 4541052 4596049 4395295 4571012
14468D571012J56372k42845J51582K65780o1060K013Q8176J90531p9800K9890
$$ 4571012 4727384 4484539 4636121 4901901 4840841 4842854 4931030 5121561 5041761 5071651
14458E071651J29307J8352m5054L17913l08171L22254N0754M28508l35595J54950
$$ 5071651 5200958 5219310 5174256 5492169 5183998 5506252 5557006 5985514 5649919 5804869
14448E804869K95382j34965K62028m17047K14918J39858k20303L7895N00181L78448
$$ 5804869 6100251 5965286 6227314 5810267 6025185 6165043 5944740 5982635 6482816 6861264
14438F861264l92905K78585k4508L78998M6337N2746Q1288J69316k58001L06011
$$ 6861264 6468359 6746944 6722436 7101434 7147771 7200517 7281805 7451121 7193120 7499131
14428G499131K04072k82604K09072K79523r9066L01825M26508j23370k15803m5722
$$ 7499131 7703203 7420599 7629671 7909194 7810128 8111953 8538461 8415091 8199288 8153566
14418H153566O63346J16390j43988K09548K58011K48819k27573K28914M64855
$$ 8153566 8816912 8933302 8789314 8998862 9256873 9505692 9278119 9507033 9971888
14409I971888k15713O97285l19563K91258J21980o7907P76023n22165M04147K32286
$$ 9971888 9756175 10453460 10133897 10425155 10547135 10479228 11255251 10733086 11137233 11369519
14399A1369519k6242M95607L99164l82456J92521J55015N92403K85851L7443J70996
$$ 11369519 11343277 11838884 12238048 11855592 12048113 12203128 12795531 13081382 13118825 13289821
14389A3289821K02495O29993m51391M98860K23673J97233M23875j91911O42368
$$ 13289821 13492316 14122309 13670918 14169778 14393451 14590684 15014559 14822648 15465016
14380A5465016K51913M08598K52720M45242N4595O85152k29602R63719J75299
$$ 15465016 15716929 16125527 16378247 16823489 16878084 17563236 17333634 18297353 18472652
14371A8472652M21930J81652J67002N61495L40665P80116K9182M86162N76579
$$ 18472652 18894582 19076234 19243236 19804731 20145396 20925512 20954694 21440856 22017435
14362B2017435M86156N70043j85556R98776P74063L31224M55838P66607P68522
$$ 22017435 22503591 23073634 22888078 23886854 24660917 24992141 25447979 26214586 26983108
14353B6983108M77412Q09520P32976N56146Q21469M45148R60220Q61630O73372
$$ 26983108 27460520 28270040 29003016 29559162 30380631 30825779 31785999 32647629 33321001
14344C3321001Q67315R88373J137132R02542J080596J010299J224074J005201
$$ 33321001 34188316 35176689 36313821 37216363 38296959 39307258 40531332 41536533
14336D1536533J268428J185046J245195J181753J390176J672565J559180J790667
$$ 41536533 42804961 43990007 45235202 46416955 47807131 49479696 51038876 52829543
14328E2829543J557915J595334J815039J992604J778228K308878K147523K432617
$$ 52829543 54387458 55982792 57797831 59790435 61568663 63877541 66025064 68457681
14320F8457681K564951K601539K286338K816246L277465K846753L633549K944793
$$ 68457681 71022632 73624171 75910509 78726755 82004220 84850973 88484522 91429315
14312I1429315L856270L666074M346261M195908M888229M556767N140857N668713
$$ 91429315 95285585 98951659 103297920 107493828 112382057 116938824 122079681 127748394
14304A27748394N714212N862312O415661O838919P117123P641171P741147Q862178
$$ 127748394 133462606 139324918 145740579 152579498 159696621 167337792 175078939 183941117
14296A83941117Q503957R368996J0377994J0223548J0942109J1759012J1725986
$$ 183941117 192445074 201814070 212192064 222415612 233357721 245116733 256842719
14289B56842719J2616233J3327401J3145748J3902092J4443123J4040256J4632763
$$ 256842719 269458952 282786353 295932101 309834193 324277316 338317572 352950335
14282C52950335J4088013J4346300J3854622J3181817J2501090J1392691R929933
$$ 352950335 367038348 381384648 395239270 408421087 420922177 432314868 442244801
14275D42244801R027048O963558M484851J227162k979112l930006m393717m940084
$$ 442244801 451271849 458235407 462720258 463947420 460968308 457038302 452644585 447704501
14267D47704501p789896o790566p750367q434308j1074779j3054178j3865273
$$ 447704501 439914605 433124039 425373672 416939364 405864585 392810407 378945134
14260C78945134j3992474j5005320j5199570j5025198j4719454j4544247j3174259
$$ 378945134 364952660 349947340 334747770 319722572 305003118 290458871 277284612
14253B77284612j3220437j2846904j2227102j1351608j1085348j0503131r663053
$$ 277284612 264064175 251217271 238990169 227638561 216553213 206050082 196387029
14246A96387029r547492q771909p914040p410332p979073p171681o475605o064728
$$ 196387029 186839537 178067628 170153588 162743256 154764183 147592502 141116897 135052169
14238A35052169n426970o004501m931091n010018m986374m288902l946332l927820
$$ 135052169 129625199 123620698 118689607 113679589 108693215 104404313 100457981 96530161
14230I6530161l470791m068703l354383l011515k938176l267772k642003k656371
$$ 96530161 93059370 88990667 85636284 82624769 79686593 76418821 73776818 71120447
14222G1120447k678952k018535k154406k075720k219103j952167k253407j215652
$$ 71120447 68441495 66422960 64268554 62192834 59973731 58021564 55768157 54552505
14214E4552505j694351j272681j721015j583787j469997r58593j708249p08044
$$ 54552505 52858154 51585473 49864458 48280671 46810674 45852081 44143832 43435788
14206D3435788j314526j339441j152732j237609q15363j030053l41952j377029
$$ 43435788 42121262 40781821 39629089 38391480 37576117 36546064 36204112 34827083
14198C4827083q35307q69364j081943n14310r28916j71276j065513q42279p62168
$$ 34827083 33991776 33122412 32040469 31526159 30597243 30425967 29360454 28518175 27756007
14189B7756007q36656j87500q26350k88768q25889q00516j27704l21629q97503
$$ 27756007 26919351 26731851 25905501 25616733 24790844 23990328 23862624 23540995 22643492
14180B2643492l53813n83231m82971k59785m98356k16912n01765n06555l92486
$$ 22643492 22289679 21706448 21223477 20963692 20465336 20248424 19746659 19240104 18847618
14171A8847618n04081P8045m95758j90903m42349k05250n14330l29384j87724
$$ 18847618 18343537 18421582 17925824 17734921 17292572 17087322 16572992 16243608 16055884
14162A6055884l91626j18909l99130m90283j05763j45630j76143k99398m0496
$$ 16055884 15664258 15545349 15146219 14655936 14550173 14404543 14228400 13929002 13888506
14153A3888506p79299J23007l27706M0929q0150p07277j3442m36416p0215J65085
$$ 13888506 13109207 13232214 12904508 12945437 12865287 12158010 12144568 11708152 11637937 11803022
14143A1803022l34728j84355J7580l08967m11737N7654l84764R9546k16028j30326
$$ 11803022 11468294 11283939 11301519 10992552 10580815 10638469 10253705 10353251 10137223 10006897
14133A0006897l96582Q6325r1766J70791k48349j73656j07973m88451J81570k02449
$$ 10006897 9610315 9696640 9604874 9775665 9527316 9353660 9245687 8757236 8938806 8736357
14123H736357j01924m06570L9011k44290K51408j95180m93861K43041J55905j73743
$$ 8736357 8634433 8227863 8266874 8022584 8273992 8078812 7584951 7827992 7983897 7810154
14113G810154q8044m05337j9485j25622j51228k16044K5337N5127J6548l18006
$$ 7810154 7722110 7316773 7297288 7171666 7020438 6804394 6829731 6884858 6901406 6583400
14103F583400M7023l4957k79919J96303k01270k16289L14294l37267J25528r9208
$$ 6583400 6630423 6595466 6315547 6511850 6310580 6094291 6408585 6071318 6196846 6097638
14093F097638J24933p104n10272R4391J39250k81785n4615k50429K69508J1827
$$ 6097638 6222571 6215467 5705195 5799586 5938836 5657051 5602436 5352007 5621515 5633342
14083E633342k52382Q2958m25959K27732L0477o3732n75846L94530n9830L2123
$$ 5633342 5380960 5463918 5037959 5265691 5296168 5232436 4656590 5051120 4991290 5023413
14073E023413k38177L10751J47502m78088p0808K7089l83881K44935j95384j0195
$$ 5023413 4785236 5095987 5243489 4765401 4694593 4721682 4337801 4582736 4387352 4377157
14063D377157J14882k05217Q9690O4787k37885J37883J22905l32145N4366l39981
$$ 4377157 4492039 4286822 4376512 4441299 4203414 4341297 4464202 4132057 4186423 3846442
14053C846442K38313j05673K20686J12081m36326L35012k35539l87288n2550J99961
$$ 3846442 4084755 3979082 4199768 4311849 3875523 4210535 3974996 3587708 3535158 3735119
14043C735119k43632J87329J36080n71078J69577k06919M90046n56735N1579O7960
$$ 3735119 3491487 3678816 3814896 3243818 3413395 3206476 3696522 3139787 3191366 3259326
14033C259326J65262m631j16482K53516j2413K6032k63896k50448o3317J17360
$$ 3259326 3424588 3419957 3303475 3556991 3544578 3570610 3306714 3056266 2992949 3110309
14023C110309K37366l76811J58803k91853L62097m05855K74444J01503j02405
$$ 3110309 3347675 2970864 3129667 2837814 3199911 2794056 3068500 3170003 3067598
14014C067598k70643m326J06670n98990K21772k48539M09001l25333J28465j23423
$$ 3067598 2796955 2792629 2899299 2300309 2522081 2273542 2682543 2357210 2485675 2362252
14004B362252J51285j21087R2091r4886J48055j39841k78650L1657j70710K15308
$$ 2362252 2513537 2392450 2484541 2389655 2537710 2397869 2119219 2150876 1980166 2195474
13994B195474J54618R1521l03799J09272L01847R15307K278267Q518759J8846806
$$ 2195474 2350092 2441613 2137814 2247086 2548933 3464240 5742507 14261266 33108072
13985C3108072R004978j5823150j0297623n801859k959560j656584j029239l01973
$$ 33108072 42113050 26289900 15992277 10190418 7230858 5574274 4545035 4243062
13977D243062m30519j92134k92389l53333m5510k28090L04209r40927N54278R1865
$$ 4243062 3812543 3620409 3328020 2974687 2929177 2701087 3005296 2064369 2618647 2710512
13967B710512k00878K28491k50049j17167J4281o5261p375l3972R2434O1995q2540
$$ 2710512 2509634 2738125 2488076 2370909 2385190 2319929 2312554 2278582 2371016 2433011 2350471
13956B350471K85003o70850K55267j85600m23306P3749J67360P4935J94472l18318
$$ 2350471 2635474 1964624 2219891 2034291 1610985 1684734 1852094 1927029 2121501 1803183
13946A803183M286K00226k50484K34909J56291j11220j53825Q2753N1679r6659
$$ 1803183 1807469 2007695 1757211 1992120 2148411 2037191 1883366 1966119 2017798 1921139
13936A921139j88408q809L76314j53118m16445R6077K34766J32903l08353J98892
$$ 1921139 1732731 1723922 2100236 1947118 1530673 1626750 1861516 1994419 1686066 1884958
13926A884958J38718n40115L96028J75695k37912q3479Q4371m3738p1967l6411
$$ 1884958 2023676 1483561 1879589 2055284 1817372 1733893 1818264 1774526 1702559 1666148
13916A666148j92476o775K37972j75624P0928k00866o7754K79068j76080K0214
$$ 1666148 1473672 1466897 1704869 1529245 1600173 1399307 1331553 1610621 1434541 1454755
13906A454755L46029o73181N52778p25050O32456L07722l02820Q5627k86057j88082
$$ 1454755 1800784 1127603 1680381 955331 1587787 1895509 1592689 1678316 1392259 1204177
13896A204177J87812m24952P80066l10735P1587M2966m01328J28710P0173q2820
$$ 1204177 1391989 967037 1747103 1436368 1507955 1550921 1149593 1278303 1348476 1265656
13886A265656L13496k15493p036j15143R4207K91384l82301L38460l17048m25696
$$ 1265656 1579152 1363659 1356623 1241480 1335687 1627071 1244770 1583230 1266182 840486
13876H40486L06357n6655J6946R607J58962r9650k2262J41980j18666K27930r1904
$$ 840486 1146843 1090188 1107134 1116741 1275703 1176053 1153791 1295771 1177105 1405035 1313131
13865A313131q6026n6993k6760k75861M79204l19902K6891J48819M1809k40032
$$ 1313131 1227105 1170112 1143352 867491 1346695 1026793 1053684 1202503 1244312 1004280
13855A004280K39632k7909k01504K52645j78250J12241J36266k22028J3593L04906
$$ 1004280 1243912 1216003 1014499 1267144 1088894 1201135 1337401 1115373 1128966 1433872
13845A433872k77338L7575n58648L83091k0610K75543m72178R6172K17255J35990
$$ 1433872 1156534 1194109 635461 1018552 997942 1273485 801307 897479 1114734 1250724
13835A250724n18864P5371J14288M4894K43807p6620J83382m97895J59685j76906
$$ 1250724 731860 807231 921519 966413 1210220 1133600 1316982 819087 978772 801866
13825H01866L6437P5270j70863K22711r3854K24809M2863n3546k12037J08753
$$ 801866 838303 913573 742710 965421 871567 1096376 1139239 1085693 873656 982409
13815I82409k98501m3488L72031J35623k73069o176R708j38792R758J21361P6382
$$ 982409 683908 640420 1012451 1148074 875005 868829 878537 739745 749503 870864 947246
13804I47246k19606m5542J19807K00090m7633k08806K63651k26754M4230j7667
$$ 947246 727640 682098 801905 1001995 954362 745556 1009207 782453 826683 809016
13794H09016J28658k2339j93729K06049j26611o569l68259O69273m84259K75606
$$ 809016 937674 915335 721606 927655 801044 794475 426216 1095489 611230 886836
13784H86836k1647j27375k15033L9483K66619K40909j37787C73981J70648L88693
$$ 886836 865189 737814 522781 562264 828883 1069792 932005 373981 544629 933322
13774I33322j83577J42823l3577l3208n5620m9071L26741E21415M01182l12985
$$ 933322 749745 892568 858991 825783 770163 721092 1047833 521415 922597 609612
13764F09612Q4684R5715j38071M6078j57308J11044k50458M45965l34632L50220
$$ 609612 694296 790011 651940 698018 540710 651754 401296 847261 512629 862849
13754H62849l82896K34031L10692k87144m025J30194C69729K18413l9453J31436
$$ 862849 479953 713984 1024676 737532 733507 863701 369729 588142 548689 680125
13744F80125n4026L01883j24609k38733R2024l7715P1968l45411O06709J59981
$$ 680125 626099 927982 803373 564640 656664 618949 690917 345506 952215 1112196
13734A112196E02471J92479C45955M98262k65884L02915k88967K07816k56625
$$ 1112196 502471 694950 345955 844217 578333 881248 592281 800097 543472
13725E43472m920M9907k03616J77809M33329C31876J43232L18890k75443N7446
$$ 543472 538552 588459 384843 562652 995981 331876 475108 793998 518555 576001
13715E76001K91567k57895J83504k2740k00215B41540M78126j27555L86510C72837
$$ 576001 867568 609673 793177 770437 570222 241540 719666 592111 978621 372837
13704F94241j9250k88494J05038j27380J86397j01187M34833k63276O0338J36081
$$ 694241 674991 386497 491535 364155 550552 449365 884198 620922 681260 817341
13694H17341k13169K73407D17599J38511j61353K14495k76247K56137B62744L64056
$$ 817341 604172 877579 417599 556110 394757 609252 333005 589142 262744 626800
13684F26800k43193L46064k47432j07359K44408M2424p4533p3303K90204A164
$$ 626800 383607 729671 482239 374880 619288 661712 587179 513876 804080 1164
13673G11268B83271L54216J55884k8218k13370j97890R3015Q2093P264j17584
$$ 711268 283271 637487 793371 765153 551783 353893 446908 529001 536265 418681
13663D18681J76222k16622M7636A19923K18381K80640n5389J93978l52124j57960
$$ 418681 594903 378281 425917 119923 338304 618944 563555 757533 405409 247449
13653B47449L2074N4654R3892K3236Q3017j89256J62177o556B27490L61997B90188
$$ 247449 279523 334177 428069 451305 534322 345066 507243 500687 227490 589487 290188
13641D10747m8768j45698J68261j66068K20947o7285r8821K48829J52660M6983
$$ 410747 361979 216281 384542 218474 439421 372136 273315 522144 674804 721787
13631G21787k38836k31366K26238j92151R7916J19647n1516p8004Q2721j43955
$$ 721787 482951 251585 477823 285672 383588 503235 451719 373715 456436 312481
13621C12481l595J42993J84628B67424M3841j50615K77889n0511J45148k18045
$$ 312481 308886 451879 636507 267424 311265 160650 438539 388028 533176 315131
13611C15131m0416J23501n9514J37728A94672L29798B16730K29578j16690m3968
$$ 315131 274715 398216 338702 476430 194672 524470 216730 446308 329618 285650
13601B85650f3818G56068B98073K28912k48207J70957n0851R8580k27774N72590
$$ 285650 -63818 756068 298073 526985 278778 449735 398884 497464 269690 842280
13591H42280C47150j6937K1194J19867j37746A19328J62557N9027G3686L66265
$$ 842280 347150 330213 351407 471274 333528 119328 281885 340912 73686 439951
13581D39951A57220J87847Q7308k5227J44117k48989J22320R340k5089k7892J9922
$$ 439951 157220 345067 432375 407148 551265 302276 424596 433936 408847 380955 400877
13570D00877A40369M07567o4482B18177J69857J29167A19079J62299K16747r4966
$$ 400877 140369 547936 483454 218177 388034 517201 119079 281378 498125 403159
13560D03159N2207J03587k18140K35768k2901I0206J55682H5086L56440A16972
$$ 403159 455366 558953 340813 576581 553680 90206 245888 85086 441526 116972
13549D26879r4363m0228A23028N0273n898N6232K14896K28578C09821N3626H4867
$$ 426879 332516 292288 123028 173301 167403 223635 438531 667109 309821 363447 84867
13537C03998K32410j47149M9682R467k2739a90750A81886J27393r9114M37055
$$ 303998 536408 389259 438941 448408 425669 -190750 181886 309279 210165 647220
13527F47220a79162C01190A35306n7372J48406q8723L75307A23114L61045B13199
$$ 647220 -179162 301190 135306 77934 226340 137617 512924 123114 484159 213199
13516F4073O31098I3264j0243K51973o2338q604o7930M58565k10128A00214K04139
$$ 64073 695171 93264 83021 334994 272656 264052 196122 654687 444559 100214 304353
13505C04353R0653A75575K9668J13312o7592q2341j7348M9694K73886E0376K95179
$$ 304353 395006 175575 205243 318555 250963 168622 151274 200968 474854 50376 345555
13494C45555A65912J75182j8685D2523J60830J1713M40514A64765N4323O9429
$$ 345555 165912 341094 322409 42523 203353 215066 655580 164765 219088 288517
13484B88517p987J9462K4934J9076J35358A60316N5737M1764p6314m5267J08086
$$ 288517 280530 299992 324926 344002 479360 160316 216053 257817 181503 136236 244322
13473B44322M336K20528B13164J93786o1980A60093J60978h3765J0470D09966
$$ 244322 248658 469186 213164 406950 344970 160093 321071 -83765 -73295 409966
13462B64975O4390A04875K15994N8537j39145G2994k7045L5623J36405R8248C8717
$$ 264975 329365 104875 320869 379406 240261 72994 45949 81572 217977 316225 38717
13450B56113J58482A80234K10931j38223K07469j3650n1362A52377K58829p4008
$$ 256113 414595 180234 391165 252942 460411 446761 395399 152377 411206 337198
13440C37198r4710l1604O2020j11598a3144A42952J4003j1681l0493N19922C12024
$$ 337198 242488 210884 272904 161306 -13144 142952 156955 145274 114781 634703 312024
13428C63216A56011O520L4138K7877i1924C22958b07088I9671K11186A13232F615
$$ 363216 156011 162531 196669 224546 -91924 322958 -207088 99671 310857 113232 6615
13416A34862g179A64120L41316F8411L82114b50712B47993o5261K93397l8543
$$ 134862 -7179 164120 505436 68411 450525 -250712 247993 182732 476129 437586
13406D37586l6797j97717J27866H5431M64749h105A83290K70486j15559j55040
$$ 437586 400789 203072 330938 85431 550180 -8105 183290 453776 338217 183177
13396A83177J97974j27877K61656A99346P4717J11416a33177B28513a09429A26030
$$ 183177 381151 253274 514930 199346 274063 385479 -133177 228513 -109429 126030
13385D03400j90462M1202l6889n1259J06677N7238A03670N4730J03597l4900l9359
$$ 403400 212938 254140 217251 165992 272669 329907 103670 158400 261997 227097 187738
13374A87738J50573J76480r5389o7877d6391B24375C4668L36129N2650j38835
$$ 187738 338311 514791 419402 351525 -46391 224375 34668 370797 423447 284612
13364B84612K00761J7808A53519F2781J01989J21122j18862K45876A09734J43136
$$ 284612 485373 503181 153519 62781 164770 285892 167030 412906 109734 252870
13354B52870b2456I8480b43794C48425g7550C50528J11846k24854I9420M8119
$$ 252870 -22456 98480 -243794 348425 -77550 350528 462374 237520 99420 147539
13344A47539K64186a04174D10001j03259M7947D0902K41589J84795k05735K88030
$$ 147539 411725 -104174 410001 306742 354689 40902 282491 467286 261551 549581
13334E49581j83023j69412L3135F5687K21385P5352J06011J83419A38010A3168
$$ 549581 366558 197146 230281 65687 287072 362424 468435 651854 138010 13168
13323B8563p49J34858K77093A8171O55574l8190B21096M74953F8002K30573a21905
$$ 28563 27814 162672 439765 18171 673745 635555 221096 696049 68002 298575 -121905
13311B3010P0713m5092P0021l5613M5269P6181K73968B0572K47258g1508A18768
$$ 23010 93723 48631 118652 83039 128308 204489 478457 20572 267830 -71508 118768
13299H1671J74997G6972Q5565M622j0788J19605a91502A85520J04416K9520A10729
$$ 81671 256668 76972 162537 167159 156371 275976 -191502 185520 289936 319456 110729
13287F8123L87136B25212m4643E1654L45622A72813a01100F49822B75166a6832
$$ 68123 455259 225212 180569 51654 397276 172813 -101100 649822 275166 -16832
13276c62722A31097a18924B74343L722i4223c9801l7728D72622A49226b49456
$$ -362722 131097 -118924 274343 278065 -94223 -39801 -77529 472622 149226 -249456
13265B24666F3669N2948M1901O422G7324J27422M005I3512L86630A81019G0243
$$ 224666 63669 116617 158518 164940 77324 204746 208751 93512 480142 181019 70243
13253B78100I609a6518A1497J83166l7220o4581J83448j26191f861B77849G8760
$$ 278100 9609 -16518 11497 194663 157443 92862 276310 150119 -6861 277849 78760
13241a1457C0054J99313a18836L4699C1742Q300P1769a79021A04037h4557A75529
$$ -11457 30054 229367 -118836 -84137 31742 40042 111811 -179021 104037 -84557 175529
13229g3338K6504D11002j25155N1825A09862b4743C3433f8809K8481p2193B37319
$$ -73338 -46834 411002 285847 337672 109862 -24743 33433 -68809 -40328 -112521 237319
13217C52989d883A44130J29498k9831o4256o5893J6138a3391M641B6170K26551
$$ 352989 -4883 144130 273628 243797 179541 113648 129786 -13391 -8750 26170 252721
13206B52721a19261C00768K32375j87378j32608c4601B89023G8575c72518D70370
$$ 252721 -119261 300768 533143 345765 213157 -34601 289023 78575 -372518 470370
13195A73742C2633J73316h8830B44943e9365b9116j08316j4787E6185B0505N8360
$$ 173742 32633 205949 -88830 244943 -59365 -29116 -137432 -152219 56185 20505 78865
13184G8865a07550H6595J37466N5138J12062j67923d9106H0335R110b55947D18285
$$ 78865 -107550 86595 224061 279199 391261 223338 -49106 80335 89445 -255947 418285
13172B45039B5318L21723H4408J61683J37313E5831b26082J1086a07365A39793
$$ 245039 25318 347041 84408 246091 383404 55831 -226082 -214996 -107365 139793
13161A07426l8767Q5597N730K8760J67353A38661C585Q4975a20763H1470a01010
$$ 107426 68659 154256 159986 188746 356099 138661 3585 88560 -120763 81470 -101010
13149A31571n1135B0984R8141J83331d7859A4131N6144J98537C0585K20124p058
$$ 131571 80436 20984 119125 302456 -47859 14131 70275 268812 30585 250709 243651
13138B43651o7595P8082a35410a2981j94092h0975A17478N4502N5541A852N9759
$$ 243651 176056 254138 -135410 -12981 -207073 -80975 117478 171980 227521 1852 61611
13127F1611b68873G4781N1325a76054G3707L8606K37916b63895B10957E7196J81337
$$ 61611 -268873 74781 126106 -176054 73707 112313 350229 -263895 210957 57196 238533
13116B38533A04929B8635J34263j9437K9394d4421C19441A39043b9149B15041
$$ 238533 104929 28635 162898 143461 172855 -44421 319441 139043 -29149 215041
13105d5429I0939j1369Q5302D7441f8913j21276B57273i1830C10993A22699L07881
$$ -45429 90939 79570 164872 47441 -68913 -190189 257273 -91830 310993 122699 430580
13094D30580c16813d6935C64978A82036q6327K08099m8431h0423m866H4716A5221
$$ 430580 -316813 -46935 364978 182036 95709 303808 255377 -80423 -85289 84716 15221
13082b80345a16123B07472H819h3419A129L03302q900b73836Q9881F1059a13970
$$ -280345 -116123 207472 8819 -83419 1129 304431 295531 -273836 -183955 61059 -113970
13070C86955G4257K00630j5171n4539a52483C51769q3945P3384k3182c41112J44451
$$ 386955 74257 274887 259716 205177 -152483 351769 267824 341208 318026 -341112 -196661
13059a96661e5341C59611j22933H5250D748K24290B84K48943E3469J43880O0455
$$ -196661 -55341 359611 236678 85250 4748 229038 284 249227 53469 197349 257804
13048B57804p7045a85948A19401g9681A44079G423O32131A36476K2960K50248
$$ 257804 180759 -185948 119401 -79681 144079 7423 639554 136476 159436 409684
13038D09684f0549A04285K20875A01277J77425o4403a94673A67953b83993a425
$$ 409684 -60549 104285 325160 101277 278702 214299 -194673 167953 -283993 -1425
13027A50131g2120i008A68016K60184I2404L1524m3351j1474f3835C1380L64408
$$ 150131 -72120 -9008 168016 428200 92404 123928 80577 69103 -63835 31380 395788
13016C95788G3560L12820H1018J46954J99452A13571Q2678r0657K7451M6762J65955
$$ 395788 73560 386380 81018 227972 427424 113571 196249 105592 133043 179805 345760
13005C45760j30793K627n7018a13502F1793J35534R4313G4184O276a96742B65394
$$ 345760 214967 217594 160576 -113502 61793 197327 291640 74184 80460 -196742 265394
12993D4727a22532A20634c76105O3216d9679A74075A3162J72337B5528a02979
$$ 44727 -122532 120634 -376105 -312889 -49679 174075 13162 185499 25528 -102979
12982B709M6845a85580G1281a07823c6146B57232J04353a2716A66442h7556d694
$$ 2709 49554 -185580 71281 -107823 -36146 257232 361585 -12716 166442 -87556 -4694
12970A78901K0766B0071K03482D0129K89481j25983b57164R9882A94963a3313
$$ 178901 199667 20071 223553 40129 329610 203627 -257164 -157282 194963 -13313
12959a4313A53126A162g47D1270a52922G0803f238j41241j18764B8665a82476
$$ -14313 153126 1162 -747 41270 -152922 70803 -6238 -147479 -266243 28665 -182476
12947b09607e9078A35019a62390A20729D9084b06323D5992c8523k53094A4711
$$ -209607 -59078 135019 -162390 120729 49084 -206323 45992 -38523 -291617 14711
12936A29509Q0903a464r8844J6520o6743k6695N4554B06705m1742n3101K48880
$$ 129509 210412 -1464 -100308 -83788 -150531 -177226 -122672 206705 164963 111862 360742
12925C60742B0069J52140B9003M50085A07994b54174C7133J18274g047q969B64549
$$ 360742 20069 172209 29003 479088 107994 -254174 37133 155407 -7047 -16016 264549
12913A82650a16408b9060C06821j7831A2900b10534c5508A12096e5596A2289K03825
$$ 182650 -116408 -29060 306821 288990 12900 -210534 -35508 112096 -55596 12289 216114
12902B16114c14452H1889c2326A81257L9219b58990A79306A4680K43254q9468
$$ 216114 -314452 81889 -32326 181257 220476 -258990 179306 14680 257934 168466
12892A68466l0229b39501P4691g67G6743b9970j16834M2569A34158K99538b2138
$$ 168466 138237 -239501 -164810 -767 76743 -29970 -146804 -104235 134158 433696 -22138
12880D5375d5749B15332A075a09469B07503Q2258J05434g2353A13456n0165A1178
$$ 45375 -45749 215332 1075 -109469 207503 289761 395195 -72353 113456 63291 11178
12868h2444D9549J76343l4752b81361a13522C96783H6122J2732b59412C60875
$$ -82444 49549 225892 191140 -281361 -113522 396783 86122 98854 -259412 360875
12857I0839d4244j20789b0527h079B09441j03095N4812c12342e4170A19240J48333
$$ 90839 -44244 -165033 -20527 -8079 209441 106346 161158 -312342 -54170 119240 267573
12846B67573a58551B31737a1876j4229d912m3802B89914e3432B21299I276J39561
$$ 267573 -158551 231737 -11876 -26105 -4912 -48714 289914 -53432 221299 9276 148837
12835A48837b87518I425K353K1249b368k19932E6305L20801b25834e5909G7435
$$ 148837 -287518 9425 11778 33027 -2368 -222300 56305 377106 -225834 -55909 77435
12823A30519h1248j25494l6720J6713C00086H4982c59187D3183a07320j37315
$$ 130519 -81248 -206742 -243462 -226749 300086 84982 -359187 43183 -107320 -244635
12813b44635h6758m865F0955J10134k7799f4851q1731A17101q322c3721m2909
$$ -244635 -86758 -91623 60955 171089 143290 -64851 -146582 117101 108779 -33721 -76630
12802g6630A71470a59055A2151K84397a5742o115B3024d542A13228J51617A08110
$$ -76630 171470 -159055 12151 296548 -15742 -21857 23024 -4542 113228 264845 108110
12790e2168a9704C69602a74340B9199b10493A03344D5864d9196J0144j56940A757
$$ -52168 -19704 369602 -174340 29199 -210493 103344 45864 -49196 -39052 -195992 1757
12778b35407M6634B56041a07838B80258k269N2126m6226J02165j34583C9962b14686
$$ -235407 -188773 256041 -107838 280258 277989 330115 283889 386054 251471 39962 -214686
12766A61579K1853a3113A87720m6852C3827J22156J00935a86107P2890C1084J31652
$$ 161579 183432 -13113 187720 140868 33827 155983 256918 -186107 -113217 31084 162736
12755A62736a97986A79916l7539J15712R8798b00534d739H1642B7499a81313A91205
$$ 162736 -197986 179916 142377 258089 356887 -200534 -4739 81642 27499 -181313 191205
12743a11702A16063c6799A30153H987b13530F1767L08964P3722a36048A39153
$$ -111702 116063 -36799 130153 8987 -213530 61767 370731 444453 -136048 139153
12732A22793D8745A4618J19088J27066d9775A07044a59390p8404D24103I3288
$$ 122793 48745 14618 133706 260772 -49775 107044 -159390 -237794 424103 93288
12721F5529L81260c07560b9082A34257R8197j09905a60800A28261f7869G1360
$$ 65529 446789 -307560 -29082 134257 232454 122549 -160800 128261 -67869 71360
12710A33688J75141P3819j85832K09252A41784L14356B25185a31692B33553M38924
$$ 133688 308829 382648 196816 406068 141784 456140 225185 -131692 233553 672477
12700F72477k64319A31094l8513a02681b4001P27m4560b9312H9317J01813p4074
$$ 672477 408158 131094 92581 -102681 -24001 -23274 -67834 -29312 89317 191130 117056
12689A17056O8553a60991E0257a53844H9596b96980a5699r268A67891d0606A09744
$$ 117056 185609 -160991 50257 -153844 89596 -296980 -15699 -24967 167891 -40606 109744
12677b06032A15219l0487b56305C5193J91458j3618a14182L221j3327B06256b62962
$$ -206032 115219 84732 -256305 35193 226651 213033 -114182 -110961 -124288 206256 -262962
12665B2722J25819j1037K72017j59304e3930E7293B812P6160J34909a71382A55425
$$ 22722 148541 137504 409521 250217 -53930 57293 2812 78972 213881 -171382 155425
12653A74088O0871j09675N8619F4491d4601G7434J79928K35786B32474I8718b1068
$$ 174088 234959 125284 183903 64491 -44601 77434 257362 493148 232474 98718 -21068
12641B52509i4796j57538C57366P0321A55470J169L51331A37617g8358F1525k9627
$$ 252509 -94796 -252334 357366 427687 155470 156639 507970 137617 -78358 61525 31898
12630C1898h8473A65460D7911L46845A66013K8714E9974O3074b49277a2841E5310
$$ 31898 -88473 165460 47911 394756 166013 194727 59974 123048 -249277 -12841 55310
12618A70352p1359d9861A05766B6080J22152a5324B89093j41646a110I6807J9794
$$ 170352 98993 -49861 105766 26080 148232 -15324 289093 147447 -1110 96807 116601
12607A16601P9419B6293J56095E4653c09081B3000J1319J38753D9497L10943J38235
$$ 116601 196020 26293 182388 54653 -309081 23000 34319 173072 49497 360440 498675
12596D98675F2505K69582j0179b38767B18238O4455a1112j79591A04006D0825
$$ 498675 62505 332087 321908 -238767 218238 282693 -11112 -190703 104006 40825
12585B34708r0228a3977A25501J0813c7000k765A3346J54010b71005A52459a78957
$$ 234708 144480 -13977 125501 136314 -37000 -39765 13346 167356 -271005 152459 -178957
12573A3258a86382C0405b27701D29848j69791b28979F1256K1810L760O5176b54259
$$ 13258 -186382 30405 -227701 429848 260057 -228979 61256 83066 86826 152002 -254259
12561a07400A76441k1670i4441B13619L318J11103q7652O0829C4879b0533j2070
$$ -107400 176441 154771 -94441 213619 216937 328040 240388 301217 34879 -20533 -32603
12550c2603k4424m2917P424a4607G8747b79980b3833a0449A75731f648j82727
$$ -32603 -57027 -99944 -92520 -14607 78747 -279980 -23833 -10449 175731 -6648 -189375
12539a89375p1086E3656h5384m5264O2565A60414a52840C48118i8122A27594n5207
$$ -189375 -260461 53656 -85384 -130648 -68083 160414 -152840 348118 -98122 127594 72387
12528G2387N439l5400J28636a69742B17999E8028B6974h5129A04237N3881E3565
$$ 72387 77826 42426 171062 -169742 217999 58028 26974 -85129 104237 158118 53565
12516C49225H5736a34102e4598o1012B48616H6419a9166o7979m1422o6631B65145
$$ 349225 85736 -134102 -54598 -115610 248616 86419 -19166 -87145 -128567 -195198 265145
12504B71306j00770m0411f526I9476l9842a11863G8923a50792G4225i9582C09418
$$ 271306 170536 130125 -6526 99476 59634 -111863 78923 -150792 74225 -99582 309418
12492a83053A66980G9187K65345F8565J27919a73678A06475b07264B13267E8909
$$ -183053 166980 79187 344532 68565 196484 -173678 106475 -207264 213267 58909
12481h3539j2402k35263J50741C8407O4045a37920F715b15054B02991L2536Q923
$$ -83539 -95941 -331204 -180463 38407 102452 -137920 6715 -215054 202991 235527 244450
12470B44450A16255J3996b3136B03486n2518a3690I3758h9115h15E8625K23386
$$ 244450 116255 130251 -23136 203486 150968 -13690 93758 -89115 -815 58625 282011
12459B82011A2550K27789G248b77439J07488C44929a62451L894O9414C1441i5948
$$ 282011 12550 240339 7248 -277439 -169951 344929 -162451 -158557 -89143 31441 -95948
12447d0904o9580A29096b37477j76483a02738C0907J41925m1842a9751r9292e1954
$$ -40904 -110484 129096 -237477 -413960 -102738 30907 172832 130990 -19751 -119043 -51954
12435G171K74841E6598D906Q4746a70806n537C2702a43885D3943e9217K0762A42325
$$ 7171 282012 56598 4906 89652 -170806 -176343 32702 -143885 43943 -59217 -38455 142325
12422e8190A18464a41391q3124A94853C0845a3638n00424a41591G624a75747H2460
$$ -58190 118464 -141391 -224515 194853 30845 -13638 -514062 -141591 7624 -175747 82460
12410a58764O2164C8019j1221a16125B16565H0581J77871g0660l04089A18555
$$ -158764 -96600 38019 26798 -116125 216565 80581 258452 -70660 -374749 118555
12399c24400I7970l8521J752f5412k6571A35965L51310a73003A06916a62362A18401
$$ -324400 97970 59449 61201 -65412 -91983 135965 487275 -173003 106916 -162362 118401
12387c587j8887D6421a52062q9455Q0124d4797G4164P4172g3806F2098J69393
$$ -3587 -22474 46421 -152062 -241517 -161393 -44797 74164 148336 -73806 62098 231491
12376B31491j08688l1595J7836g0973B67614a57548K3380M4663h369o4893B30417
$$ 231491 122803 91208 109044 -70973 267614 -157548 -134168 -89505 -8369 -73262 230417
12364h8819A21570d2756A11664N6776G6422E860d1532A68726b51989J0266D74918
$$ -88819 121570 -42756 111664 168440 76422 5860 -41532 168726 -251989 -241723 474918
12352C3067M1080b717n4751A2486h8386C109g9864j08967P0419A678a91519B46504
$$ 33067 74147 -2717 -57468 12486 -88386 3109 -79864 -188831 -118412 1678 -191519 246504
12339B32838c01851M3669b9575A51059p3864f3685H2553B4021f9109A19376a48890
$$ 232838 -301851 -258182 -29575 151059 77195 -63685 82553 24021 -69109 119376 -148890
12327c723j27406G8668l5645K37028D6997J82795B3713a14009B61422h1439j60756
$$ -3723 -131129 78668 43023 280051 46997 229792 23713 -114009 261422 -81439 -242195
12316b42195I7432b79337F0892G148N3172f5054A16862a39644M9015i407D0780
$$ -242195 97432 -279337 60892 7148 60320 -65054 116862 -139644 -90629 -9407 40780
12304d07440C8780c3478C27290G0651i5968K1481J5113A85597a67767I0200a36328
$$ -407440 38780 -33478 327290 70651 -95968 -74487 -59374 185597 -167767 90200 -136328
12292a67765B2311R2239A5572b38662A43997i5494A74890C9921k727a29812c1079
$$ -167765 22311 114550 15572 -238662 143997 -95494 174890 39921 37194 -129812 -31079
12280C65307h9911B23206J70690a08720f781A12586j181J07629i7880C22048A52846
$$ 365307 -89911 223206 393896 -108720 -6781 112586 111405 219034 -97880 322048 152846
12268D4929K70691j29986J02127O4149j38240a903k47395A79J55712P6685G442
$$ 44929 315620 185634 287761 351910 213670 -1903 -249298 179 155891 232576 7442
12256h9285c5411m2206k7660F7517R8096a55423C68500b04753A24328M6229o9539
$$ -89285 -35411 -77617 -105277 67517 165613 -155423 368500 -204753 124328 170557 101018
12245A01018l4925a10369A19357R2233E7361h3497K6314B45308a46457I2447K03143
$$ 101018 66093 -110369 119357 211590 57361 -83497 -57183 245308 -146457 92447 295590
12234B95590a55950A38580K23711A49372G3759O8122J44209j40863J19902a50945
$$ 295590 -155950 138580 362291 149372 73759 141881 286090 145227 265129 -150945
12223a64527K2035B48896p4817J71247a34207A98208l1064O8195G3735c3397D66020
$$ -164527 -142492 248896 174079 345326 -134207 198208 167144 235339 73735 -33397 466020
12211A01703b05165F6956R2142a30556e8868B80796a19878D83432B4584J12686
$$ 101703 -205165 66956 159098 -130556 -58868 280796 -119878 483432 24584 137270
12201A37270O6021g57C79843A32906J27895M7415L792J4250a88528C1324J10284
$$ 137270 203291 -757 379843 132906 260801 308216 312008 326258 -188528 31324 141608
12190A41608D0303K79754D9781L9731j0683a73059c3664C6646J26388L241E8914
$$ 141608 40303 320057 49781 89512 78829 -173059 -33664 36646 163034 166275 58914
12178B13459j3796c8168H6720K886i8440C07057A32997L2652f6057A81034a67190
$$ 213459 199663 -38168 86720 89606 -98440 307057 132997 165649 -66057 181034 -167190
12166D25838j03446N5052A61238H0137R8387k6366E3297b11602D28249r1215A09019
$$ 425838 322392 377444 161238 80137 178524 152158 53297 -211602 428249 337034 109019
12154A80152R1117a60833A2393K4694K62995A6908J23008J42939L9892b22785
$$ 180152 271269 -160833 12393 37087 300082 16908 139916 282855 322747 -222785
12143A12703a78086k18453G5137a2365b19k33841B68222a25220j56291A73137
$$ 112703 -178086 -396539 75137 -12365 -219 -234060 268222 -125220 -281511 173137
12132h16o7696j84301B4904a57884A67332D083K53588a23934p925e3328B8324
$$ -816 -68512 -252813 24904 -157884 167332 4083 257671 -123934 -131859 -53328 28324
12120D22831A86398p4237a49233A62374a21099C3572c6667p7038B31427i5188
$$ 422831 186398 112161 -149233 162374 -121099 33572 -36667 -113705 231427 -95188
12109a4689j34781D7304J60579a00883c062A1293J0780J67344d28490K07236A43750
$$ -14689 -149470 47304 207883 -100883 -3062 11293 22073 189417 -428490 -221254 143750
12097h4590k5430B15410J8873a93751M2258m3553N0130h337A49884d4914o4713
$$ -84590 -110020 215410 234283 -193751 -151493 -195046 -144916 -8337 149884 -44914 -109627
12086a09627L8150j33389f7100A10686J72065d602k4120J822k9386A82701c32270
$$ -109627 -71477 -204866 -67100 110686 282751 -4602 -28722 -26900 -56286 182701 -332270
12074C51943f5331B3453K3643P8485N65080L54287C09459p3070a17463A69713
$$ 351943 -65331 23453 47096 125581 690661 1044948 309459 236389 -117463 169713
12063D61327b95356c4146B77302a22900O634d4207G3151a27779B60536n2653H975
$$ 461327 -295356 -34146 277302 -122900 -116266 -44207 73151 -127779 260536 207883 8975
12051D5752i3774k85953i5042L9140l92442J71644J16446H2538j1736c02879J24665
$$ 45752 -93774 -379727 -95042 -55902 -448344 -276700 -160254 82538 70802 -302879 -178214
12040a78214f8026c3528l2222m8328c3883C62438c278o627l4943D9866f2800b7541
$$ -178214 -68026 -33528 -65750 -114078 -33883 362438 -3278 -9905 -44848 49866 -62800 -27541
12027h7998A30140a55546k2565A38913a70349A095e4122H5023K16516a55273A52631
$$ -87998 130140 -155546 -178111 138913 -170349 1095 -54122 85023 301539 -155273 152631
12015f2165A21195m8024J18844J9061l9969N619H3398a30028A31483b24113B50665
$$ -62165 121195 73171 192015 211076 171107 176726 83398 -130028 131483 -224113 250665
12003b2183A3281J51463O961m9924f0122A9382L8445R4849a22463p3429A60421
$$ -22183 13281 164744 171705 121781 -60122 19382 57827 152676 -122463 -195892 160421
11991A67570i860D4752b46646A10322c05062C9746M3723J39170a42681l081a2363
$$ 167570 -9860 44752 -246646 110322 -305062 39746 83469 222639 -142681 -145762 -12363
11979B01904D8177a29267f0687D6982a46941k06361J52700O1700o7895A86525
$$ 201904 48177 -129267 -60687 46982 -146941 -353302 -200602 -138902 -206797 186525
11968F4309J4159d426n8022H9358a6396H0642d7702l42657f8625J5223j17580
$$ 64309 78468 -4426 -62448 89358 -16396 80642 -47702 -390359 -68625 -53402 -170982
11957a70982O076A79749a19020A99819c10353g4166H1710R8824a25291C98565
$$ -170982 -164906 179749 -119020 199819 -310353 -74166 81710 180534 -125291 398565
11946E9800M3686e112A36496L778Q8643A07039c90026e2190A47054n5128b21843
$$ 59800 103486 -5112 136496 140274 228917 107039 -390026 -52190 147054 91926 -221843
11934f4261j71938j80650I9285a44712A32280d29411a5508l51109A7463P5761
$$ -64261 -236199 -416849 99285 -144712 132280 -429411 -15508 -366617 17463 93224
11924I3224R9300a92245Q7555G5796e7156B47558a62466B22408f8867N720C61627
$$ 93224 192524 -192245 -104690 75796 -57156 247558 -162466 222408 -68867 -63147 361627
11912c2024A01185E0050Q6747h5893A1886a06052G149a15937j32969D5875A7222
$$ -32024 101185 50050 136797 -85893 11886 -106052 7149 -115937 -248906 45875 17222
11900A5477b9099j78167c0790L334k67265O3811b734I053c1814j24861E1123j7995
$$ 15477 -29099 -207266 -30790 -27456 -294721 -230910 -2734 9053 -31814 -156675 51123 33128
11888C3128Q1729J73429a55170M2607F1810k3683b39688f2409B12036D4566O5173
$$ 33128 114857 288286 -155170 -112563 61810 38127 -239688 -62409 212036 44566 109739
11877A09739b07178J9684b7632j1234o0210C02707a38987J4469B4990a2181H3009
$$ 109739 -207178 -187494 -27632 -38866 -99076 302707 -138987 -124518 24990 -12181 83009
11865D7779O5325F185i8928B7291K7345K5314P7332b57092C9528J50680F4733
$$ 47779 113104 6185 -98928 27291 54636 79950 157282 -257092 39528 190208 64733
11853b95426F0080a30520A95992g2488A51207a26390I637a6966r7729e2443a3250
$$ -295426 60080 -130520 195992 -72488 151207 -126390 9637 -16966 -114695 -52443 -13250
11841h0640j99128g9574A3170f7620B87568a85142f9932A5763b9215A01585b29463
$$ -80640 -279768 -79574 13170 -67620 287568 -185142 -69932 15763 -29215 101585 -229463
11829A09114g5874B76217a38800d2863j07440N3986j15328j20625O5588E5455
$$ 109114 -75874 276217 -138800 -42863 -150303 -96317 -211645 -332270 -266682 55455
11818A60964n4279j495D602a63738A16788l9190a23658B97641A7372i4741D7209
$$ 160964 106685 105190 4602 -163738 116788 77598 -123658 297641 17372 -94741 47209
11806f5711k0150K2414j00250G4647j5308c4240n6904A9611c34911A38232a38571
$$ -65711 -85861 -63447 -163697 74647 59339 -34240 -91144 19611 -334911 138232 -138571
11794H1719a74638A15143K7270G0526b78299i9349B68316B5830b11054b9306m5692
$$ 81719 -174638 115143 142413 70526 -278299 -99349 268316 25830 -211054 -29306 -74998
11783g4998a2411a940j33059G8559A7923a60740M8904B41670b57734A07848N0532
$$ -74998 -12411 -1940 -134999 78559 17923 -160740 -111836 241670 -257734 107848 158380
11772A58380J3425i4062B74345b70860l7758j00015a33595A7851c6693j83384
$$ 158380 171805 -94062 274345 -270860 -308618 -408633 -133595 17851 -36693 -220077
11762b20077A55626a47538A67459e1618B12362c0271E9280J40795k783I6474M5440
$$ -220077 155626 -147538 167459 -51618 212362 -30271 59280 200075 197292 96474 141914
11751A41914a57404H5843J14854C4104J10879Q0555f7796j22305A58876c0517
$$ 141914 -157404 85843 200697 34104 144983 225538 -67796 -190101 158876 -30517
11740B20054a6118H2671b38804H1766c56250a25815K9908A30995h6816j11927
$$ 220054 -16118 82671 -238804 81766 -356250 -125815 -95907 130995 -86816 -198743
11730a98743L3643o0595A2679a03608b5773f787A68070b07061a7146C83793A66663
$$ -198743 -165100 -225695 12679 -103608 -25773 -6787 168070 -207061 -17146 383793 166663
11718B62672k8783c1914A96593f2658E3052K01738q1674b19116E1197a67198A77685
$$ 262672 233889 -31914 196593 -62658 53052 254790 173116 -219116 51197 -167198 177685
11706B99799M0978e3598a8188g760k51732C56811a86196E7422J62755l8547B1492
$$ 299799 340777 -53598 -18188 -7760 -259492 356811 -186196 57422 220177 181630 21492
11694D00660b03055Q7492a0587k4400A96997b20891P7281B8490J02929a44256
$$ 400660 -203055 -115563 -10587 -34987 196997 -220891 -143610 28490 131419 -144256
11683A04464m3850J49272g1120b8262D1847c2128j37108b6728p6658E8869M5090
$$ 104464 60614 209886 -71120 -28262 41847 -32128 -169236 -26728 -103386 58869 103959
11672A03959d6901I1012a5407A1390d0060H5092d4089B62195a46410D86838A31319
$$ 103959 -46901 91012 -15407 11390 -40060 85092 -44089 262195 -146410 486838 131319
11660A23752J03673a9829A50788Q5762A5421P0435J52834p4626i144B25445g9412
$$ 123752 227425 -19829 150788 236550 15421 85856 238690 164064 -9144 225445 -79412
11648d418A47232F4521J19023K18914a45694F9180B0055d8392B48617i3936d3793
$$ -4418 147232 64521 183544 402458 -145694 69180 20055 -48392 248617 -93936 -43793
11636E2915J57003c59442J40822a931C55113b20345P7550F2397J63990B9497a23029
$$ 52915 209918 -359442 -218620 -1931 355113 -220345 -142795 62397 226387 29497 -123029
11624F8313k8519b82276E7246k1766K57138j35877f1471A49003d0538j33242J7139
$$ 68313 39794 -282276 57246 35480 292618 156741 -61471 149003 -40538 -173780 -156641
11613a56641C06980j08248e4985n3018G5045B8171a44455H2984b5954k87632A61014
$$ -156641 306980 198732 -54985 -108003 75045 28171 -144455 82984 -25954 -313586 161014
11601B51424R6718a09779B23506C2484a25250A31677b792I4986a46405B50407
$$ 251424 348142 -109779 223506 32484 -125250 131677 -2792 94986 -146405 250407
11590E20834k58233j10088K88962a09806G2825b4454A77153N5822E5904P8743
$$ 520834 262601 152513 441475 -109806 72825 -24454 177153 232975 55904 134647
11580A34647f8856A09624e7098D7444e116A95021B0714h572B05762r4235M6358
$$ 134647 -68856 109624 -57098 47444 -5116 195021 20714 -8572 205762 111527 157885
11569A57885J7117R4529i9253l4145B00869a74268A83491J82188p7012F539J07118
$$ 157885 175002 269531 -99253 -133398 200869 -174268 183491 365679 288667 6539 113657
11558A13657a03831B641L0588K0111j6443g3615h205E21272a61860N9194j83221
$$ 113657 -103831 2641 33229 53340 36897 -73615 -8205 521272 -161860 -102666 -285887
11547b85887B06491g5839E45681h8243k01515A6019K7995Q7727a5725j57743C86174
$$ -285887 206491 -75839 545681 -88243 -289758 16019 44014 131741 -15725 -173468 386174
11535D32093a14492d6474A72903J64181j56239c43643d6393m9667D22329A02401
$$ 432093 -114492 -46474 172903 337084 180845 -343643 -46393 -96060 422329 102401
11524h4423B2598a34427B82660a27354N8623A38439J82516m0866D6117K01004
$$ -84423 22598 -134427 282660 -127354 -68731 138439 320955 280089 46117 247121
11514B47121A17375J2537L7077a24765A03495H259N06950a09059A01411r534b370
$$ 247121 117375 129912 166989 -124765 103495 8259 515209 -109059 101411 91877 -2370
11502a0407B18412Q6859n307r5180r9556B4622K16015M6860a77938Q405B23632
$$ -10407 218412 305271 299964 204784 105228 24622 240637 287497 -177938 -169533 223632
11490C28367G6820K91704o2675D5417K06643N7175A53649K36639c5853G904L14565
$$ 328367 76820 368524 305849 45417 252060 309235 153649 390288 -35853 7904 322469
11479C22469k3410f9295A72411L5916l1436B828J0914h433m1649I9297j8840M74566
$$ 322469 299059 -69295 172411 208327 176891 2828 13742 -8433 -50082 99297 80457 555023
11467E55023j73537b72401D67665C1005M9729e269B33344d5174n7760L7459k9661
$$ 555023 381486 -272401 467665 31005 80734 -5269 233344 -45174 -102934 -65475 -95136
11456i5136A40661k0709b7089B75145a35535A67480B3031J49819N2537r1571P8
$$ -95136 140661 119952 -27089 275145 -135535 167480 23031 172850 225387 133816 133894
11445A33894O4422K62991k21877J45253j30440K2272J3838I9715B7546b6857I2475
$$ 133894 198316 461307 239430 384683 254243 276515 290353 99715 27546 -26857 92475
11433e0894f445B08105J40405e7217C837K23394n0273C9824a55901A23732M7389
$$ -50894 -6445 208105 348510 -57217 3837 227231 176958 39824 -155901 123732 171121
11422A71121b44673m8563A83429b84563a0452G5079e7504A78991h2183M712b7469
$$ 171121 -244673 -293236 183429 -284563 -10452 75079 -57504 178991 -82183 -77471 -27469
11410A70932j9013f1186A00598A690a77379j47849D713c62997a38506A84150a47099
$$ 170932 151919 -61186 100598 1690 -177379 -325228 4713 -362997 -138506 184150 -147099
11398a33430B18726c00003H6785b62459H2490Q6240a96702g0855a3009B62842
$$ -133430 218726 -300003 86785 -262459 82490 168730 -196702 -70855 -13009 262842
11387A73240i7688B82502b535B05181C6583g4307C2456a30459p10j0288C42614
$$ 173240 -97688 282502 -2535 205181 36583 -74307 32456 -130459 -131169 -141457 342614
11375C65106c02135I9751a42067M3057G4521c20995B29525B2439b92560B4841
$$ 365106 -302135 99751 -142067 -99010 74521 -320995 229525 22439 -292560 24841
11364A53729i0799H5397a22658a7916l41184b9895B70245A3333a40106k76027
$$ 153729 -90799 85397 -122658 -17916 -359100 -29895 270245 13333 -140106 -416133
11354d16133d6883E498K25581c90500B2353K100b84644A95554K11335A59557i3830
$$ -416133 -46883 5498 231079 -390500 22353 24453 -284644 195554 406889 159557 -93830
11342C82780B7046b21136i7662A36370Q8421n1367q3587d5651j66867A33995c39467
$$ 382780 27046 -221136 -97662 136370 224791 173424 89837 -45651 -212518 133995 -339467
11330A3188e3154m610n4080l4065C4345c25446J61077l7948m558N5302M8084K7671
$$ 13188 -53154 -57764 -111844 -145909 34345 -325446 -164369 -202317 -206875 -151573 -103489 -75818
11318g5818k77891C3751g8931L041A51393f5502A85066a44201K0707e7601K1311
$$ -75818 -353709 33751 -78931 -75890 151393 -65502 185066 -144201 -123494 -57601 -36290
11307c6290A0394N4019K9827A3694M0141J11783G9851K06812B2947J35398D2119
$$ -36290 10394 64413 94240 13694 53835 165618 79851 286663 22947 158345 42119
11295I7872c01542B6583b73988d7389B7419N2519l6508N5882a89339D5118h3851
$$ 97872 -301542 26583 -273988 -47389 27419 79938 43430 99312 -189339 45118 -83851
11283C07839c9056j599K013l73785A92533p6693k9874g2697B0327A0158h9760
$$ 307839 -39056 -40655 -38642 -412427 192533 115840 85966 -72697 20327 10158 -89760
11271c75943i1353A73525J22881A6191M3365d21249J33112e8577m7965m2627p142
$$ -375943 -91353 173525 296406 16191 59556 -421249 -288137 -58577 -106542 -149169 -156311
11260a56311r5127A28724f0962D2425Q8281b36949i6567B8784j0337b6970A12553
$$ -156311 -251438 128724 -60962 42425 130706 -236949 -96567 28784 18447 -26970 112553
11248A95896o9824c50703C16011c31870J4443f467G8182c44611A10187L4078h0748
$$ 195896 126072 -350703 316011 -331870 -317427 -6467 78182 -344611 110187 144265 -80748
11236a9345j69408G2778J88137h855E1127a0356D1729L07872h6273G903P0685
$$ -19345 -188753 72778 260915 -8855 51127 -10356 41729 349601 -86273 7903 78588
11225G8588o064a30536P984o9046f8130C9830K48870d5819j22357C3796K4680
$$ 78588 72524 -130536 -122552 -191598 -68130 39830 288700 -45819 -168176 33796 58476
11214E8476J46712d3241n2071B35831g7854j45235A50419b71296C30959A58926
$$ 58476 205188 -43241 -95312 235831 -77854 -223089 150419 -271296 330959 158926
11203E5595a05707Q377j5417C13660L142f5050k765E6960c20145E5468g7483k16407
$$ 55595 -105707 -97330 -112747 313660 316802 -65050 -67815 56960 -320145 55468 -77483 -293890
11191b93890C4092b81758C09044b20779H2189b8154k72603f4006j07997E1059
$$ -293890 34092 -281758 309044 -220779 82189 -28154 -300757 -64006 -172003 51059
11180c9064G2197J12006n8761N617a54386l3915F0579d211j78212f278j35582
$$ -39064 72197 184203 125442 131059 -154386 -188301 60579 -4211 -182423 -6278 -141860
11169a41860D5420K7692O009j2107K7254a11672N0118j72599J9523B2302a85829
$$ -141860 45420 73112 79121 67014 94268 -111672 -61554 -234153 -214630 22302 -185829
11157a15404M9908r1663H2271b3313A04066h6283L7366j8629j52690L1884m7860
$$ -115404 -65496 -157159 82271 -23313 104066 -86283 -48917 -67546 -220236 -188352 -236212
11146b36212m3266a19906k16566L5185J34706l0472A33284A2360d87180a19586
$$ -236212 -279478 -119906 -336472 -301287 -166581 -197053 133284 12360 -487180 -119586
11135b07089C97886j04546i1918j11964g8494A00732l3983O6455c6308B85841
$$ -207089 397886 293340 -91918 -203882 -78494 100732 66749 133204 -36308 285841
11124A77084J7693J82875E5210N5006K07392a74971A80587O9839a50625J9631
$$ 177084 194777 377652 55210 110216 317608 -174971 180587 250426 -150625 -130994
11114a30994A21483b66756G6161f040m5730B32720N5461A4111K28102j01619a1940
$$ -130994 121483 -266756 76161 -6040 -51770 232720 288181 14111 242213 140594 -11940
11102I534c3494j84152A84299J85317C3099J18491n0887B9265A1719K63871j33528
$$ 9534 -33494 -217646 184299 369616 33099 151590 100703 29265 11719 275590 142062
11091A42062C7739J62710G119K8328K14652n6151l9922F7791J3347d8876E266
$$ 142062 37739 200449 7119 35447 250099 193948 154026 67791 81138 -48876 5266
11079C38482A39019a01547B48560j12197K6216Q0526H7782M5299K10271m8390
$$ 338482 139019 -101547 248560 136363 162579 243105 87782 133081 343352 294962
11069B94962r066D3008L8183L34288J3200O5330Q7338k48217J82709m1200p9483
$$ 294962 285896 43008 81191 415479 428679 494009 581347 333130 515839 474639 395156
11058C95156K93683j9466k41349j01170M95342j70435R4024p544C59053O17503
$$ 395156 688839 669373 428024 326854 822196 651761 745785 738241 359053 976556
11048I76556p7348k65474L51735D32159L47120K7728r8229j10715M6505n3348
$$ 976556 899208 633734 985469 432159 779279 807007 708778 598063 644568 591220
11038E91220n4018n438Q9361N3160K64440l97113K09550k458j66480L62012k41582
$$ 591220 537202 531764 621125 674285 938725 541612 751162 748704 582224 944236 702654
11027G02654J04324p113J01465l25217j27633L48210j04071k73258L87727j06566
$$ 702654 806978 799865 901330 576113 448480 796690 692619 419361 807088 700522
11017G00522p5561r4108O333J31038J65050N1761C80788M03778j13911j58296
$$ 700522 624961 530853 537186 668224 833274 885035 380788 784566 670655 512359
11007E12359K25852k73248K23481P4715j69406J56019k46962M43416j97592l41912
$$ 512359 738211 464963 688444 763159 593753 749772 502810 946226 748634 406722
10997D06722N29740D52362J6540M67786j39772C01486N48484P9783J51611l64229
$$ 406722 936462 452362 468902 936688 796916 301486 849970 929753 1081364 717135
10987G17135M27563m42532M90184k06403q7055Q5392K43358j45468K91381j45751
$$ 717135 1144698 702166 1192350 985947 898892 984284 1227642 1082174 1373555 1227804
10977A227804J57655J14149L85566M14560L1468P1967m6996L34871j78095J59375
$$ 1227804 1385459 1499608 1885174 2299734 2331202 2403169 2356173 2691044 2512949 2672324
10967B672324k17140j66578j64424k84643M10382n73765J58996j80057K46913
$$ 2672324 2455184 2288606 2124182 1839539 2249921 1676156 1835152 1655095 1902008
10958A902008J11073m695l10131L1659k47850j32066J12556m78749k45253J04916
$$ 1902008 2013081 2008386 1698255 1729914 1482064 1349998 1462554 983805 738552 843468
10948H43468M858l53276k38050Q7010j69894o6705C8727N0972M13628m6162n9701
$$ 843468 848326 495050 257000 344010 174116 107411 38727 89699 503327 457165 397464
10937C97464j73923Q2455j19450J04386j38721F7371M843f429H2643C0414P1655
$$ 397464 223541 305996 186546 290932 152211 67371 72214 -6429 82643 30414 102069
10926A02069J83029p829c8932E59274F7339L0087d1618j03651a5537j74539h5273
$$ 102069 285098 277269 -38932 559274 67339 97426 -41618 -145269 -15537 -190076 -85273
10914a32350a3434p8718n8868d6306C30194H3566K19793b60981E9850L12674b7866
$$ -132350 -13434 -92152 -151020 -46306 330194 83566 303359 -260981 59850 372524 -27866
10902c1080A24849a95997C36007a64877a3787k54130C65998a230E7321k1562b78514
$$ -31080 124849 -195997 336007 -164877 -13787 -267917 365998 -1230 57321 35759 -278514
10890A8713a59353A38168d22914H4893a71462A5571a51025A11459b40366D2278
$$ 18713 -159353 138168 -422914 84893 -171462 15571 -151025 111459 -240366 42278
10879b18003K6522a7370k6630C84326a3591A28500c0637F6442j2219K7572k0902
$$ -218003 -191481 -17370 -44000 384326 -13591 128500 -30637 66442 54223 81795 60893
10868F0893g7423j09958J0290g4528A67618b39956B01957J64461A63659k4388
$$ 60893 -77423 -187381 -177091 -74528 167618 -239956 201957 366418 163659 139271
10858A39271a22316B7286h0980A71440o3539O4879K06159A53595A6678K58289
$$ 139271 -122316 27286 -80980 171440 107901 172780 378939 153595 16678 274967
10848B74967a4473q8148A49509J59553a8352A15159O0573h1429j17137I3379R3966
$$ 274967 -14473 -102621 149509 309062 -18352 115159 175732 -81429 -198566 93379 187345
10837A87345d3919e234k11577J7955L8831B50852B4122b38058I1027C9483h7598
$$ 187345 -43919 -5234 -216811 -198856 -160025 250852 24122 -238058 91027 39483 -87598
10825F3145b42585g3864C89899a12334n1053J1607B82509H6254j5852c96651J79800
$$ 63145 -242585 -73864 389899 -112334 -163387 -151780 282509 86254 70402 -396651 -216851
10814b16851k74876f9040l8448j2506A60005m2416c61768A08844f7012k2942r7991
$$ -216851 -491727 -69040 -107488 -119994 160005 117589 -361768 108844 -67012 -89954 -187945
10803a87945f6994a9814g099G1678b29567g3335a7723B917R7937J1329a79885
$$ -187945 -66994 -19814 -7099 71678 -229567 -73335 -17723 2917 100854 112183 -179885
10791A59017c26678A36323j9624b5105j51240n8266h2260b5476j9271A8457b99321
$$ 159017 -326678 136323 116699 -25105 -176345 -234611 -82260 -25476 -44747 18457 -299321
10779B00439g7269k41997L1902A22310a80197O3360C96356i1020n3392f0230D6569
$$ 200439 -77269 -319266 -287364 122310 -180197 -116837 396356 -91020 -144412 -60230 46569
10767A53925b8257I910J07651a78633B33886G624a08247B0767a70473A00786E0103
$$ 153925 -28257 9910 117561 -178633 233886 7624 -108247 20767 -170473 100786 50103
10755b82908C8127J87936l0980r5667d29331A7024J31253j7030g0020K5696B53228
$$ -282908 38127 226063 195083 99416 -429331 17024 148277 131247 -70020 -44324 253228
10743a20459M1018K8523m0659L1052j78470J19326j51049G6302B8412e9614q3564
$$ -120459 -79441 -50918 -91577 -60525 -238995 -119669 -270718 76302 28412 -59614 -143178
10732a43178r687j7068j41866a6963j87721O6274M3283A54357a32277H5111a00375
$$ -143178 -152865 -169933 -311799 -16963 -204684 -138410 -95127 154357 -132277 85111 -100375
10720a07860j48133f734j22987B96160a82838j28461A16221c14689l025C4907
$$ -107860 -255993 -6734 -129721 296160 -182838 -311299 116221 -314689 -317714 34907
10709b30554f301n0808F1264J35911E3047b53480A59414p3685J42291l6604b54204
$$ -230554 -6301 -57109 61264 197175 53047 -253480 159414 85729 228020 191416 -254204
10697b616A04038K3378O1025b73294a0376k63805A77884A4753J42576h4130L3500
$$ -2616 104038 127416 188441 -273294 -10376 -274181 177884 14753 157329 -84130 -50630
10686e0630A5190a39146O9410B1080b31181J03197A7424c17901A85163b66874
$$ -50630 15190 -139146 -69736 21080 -231181 -127984 17424 -317901 185163 -266874
10675b13899b6247j40338M7569J9065j93470d7612A02763b32144P8062l5494R3729
$$ -213899 -26247 -166585 -119016 -99951 -293421 -47612 102763 -232144 -154082 -189576 -95847
10664i5847k6324F4391J18462J1373L2022i7524d3259p728A90874b47094o2463
$$ -95847 -122171 64391 182853 194226 226248 -97524 -43259 -50987 190874 -247094 -309557
10653c09557b3247D1142J50893a0779o0667C5631b81309A48811c93516E1240J66241
$$ -309557 -23247 41142 192035 -10779 -71446 35631 -281309 148811 -393516 51240 217481
10642B17481a15461R794B3517K13825H8313k5005c0677j33978D3146k979b37853
$$ 217481 -115461 -105667 23517 237342 88313 63308 -30677 -164655 43146 40167 -237853
10630b29814c8825q8314N531J7827B51685g4030m4848F4325B9943b23897E3248
$$ -229814 -38825 -127139 -121608 -103781 251685 -74030 -118878 64325 29943 -223897 53248
10618h8231o642j69057B64834A1558K90633F0865j5442O8360i1996B9267b40347
$$ -88231 -94873 -263930 264834 11558 302191 60865 45423 113783 -91996 29267 -240347
10606a8952H5208L1757b00013n1984B45515C5918i1766M2543p2871j2661B36232
$$ -18952 85208 116965 -200013 -251997 245515 35918 -91766 -49223 -122094 -134755 236232
10594h4793K9610B870g2849l9662e3181A73742f711A84078g4337j4115A6238C222
$$ -84793 -55183 2870 -72849 -112511 -53181 173742 -6711 184078 -74337 -88452 16238 3222
10581e9097l5573j56415o2899f9499f933j62648A44337a68119a5155j82682k39297
$$ -59097 -94670 -251085 -313984 -69499 -6933 -169581 144337 -168119 -15155 -197837 -437134
10570d37134e8444A34825M8958B2706J88275I4594m472i267j2695m810l5413B4199
$$ -437134 -58444 134825 183783 22706 210981 94594 90122 -9267 -21962 -26772 -62185 24199
10557C60132j66778n7695J97551a39491M249j51667P7905d9327A45894E0289j5573
$$ 360132 193354 135659 333210 -139491 -135242 -286909 -209004 -49327 145894 50289 34716
10546C4716J7380A3978Q5566a59961d1049o8806d3616l6017r0337K812b6291N807
$$ 34716 52096 13978 99544 -159961 -41049 -109855 -43616 -79633 -169970 -167158 -26291 -20484
10534b0484B87653b7104C5424Q7342K675B8529P4447L4663k4033l1729d32471
$$ -20484 287653 -27104 35424 122766 125441 28529 102976 137639 113606 81877 -432471
10522a18368e0321o7909k493A54740o8493i3433a6450k36309j63490a4944I7843
$$ -118368 -50321 -118230 -120723 154740 86247 -93433 -16450 -252759 -416249 -14944 97843
10510a99412R8328k48737p8940c5974f488j701A420b89008J43306B69671J08140
$$ -199412 -101084 -349821 -428761 -35974 -6488 -8189 1420 -289008 -145702 269671 377811
10499C77811b15689A6894J8755g9764k19188C3294c5926j6792j55704f5060C686
$$ 377811 -215689 16894 35649 -79764 -298952 33294 -35926 -52718 -208422 -65060 3686
10487E4503a05025I3992b105r5844D91K18361r2784M33955B73519N6712C3433
$$ 54503 -105025 93992 -2105 -97949 491 218852 126068 560023 273519 330231 33433
10475B54466j04367b65789e8469J0660E4283b17799j16429I7977m62A2394a1292
$$ 254466 150099 -265789 -58469 -47809 54283 -217799 -334228 97977 97515 12394 -11292
10463c07713C8079p993b1065j315n4254C52141A00647a27820P10D03048a27841
$$ -307713 38079 30086 -21065 -22380 -76634 352141 100647 -127820 -127110 403048 -127841
10451I1378c20758A14539e1457j85504N251C40386d3758D43347A5734a13178A25744
$$ 91378 -320758 114539 -51457 -236961 -231710 340386 -43758 443347 15734 -113178 125744
10439d4133F9793b87914C2011J74821G881d21072A02842R9274G6999l5924A2054
$$ -44133 69793 -287914 32011 206832 7881 -421072 102842 202116 76999 41075 12054
10427C6062c82810F8426i7723A48962a12480C7377f7658m4851J996n2437C50023
$$ 36062 -382810 68426 -97723 148962 -112480 37377 -67658 -112509 -110513 -162950 350023
10415h4424l41526A30374Q8555o9830a38997C2278O3986a64001G0345J07283a40101
$$ -84424 -425950 130374 218929 149099 -138997 32278 96264 -164001 70345 177628 -140101
10403a71605A33786n6932j7475P4581M8882l8162J0470j2743I325K01437f2972
$$ -171605 133786 76854 59379 133960 182842 144680 155150 142407 9325 210762 -62972
10391a0979A59100J83633j40217j5514J5791J19115b9747F6036Q4728b6577j00038
$$ -10979 159100 342733 202516 187002 202793 321908 -29747 66036 150764 -26577 -126615
10380a26615j6567L9867M9622E03219q1506j85486r379m5192P8909K83467j90930
$$ -126615 -143182 -103315 -53693 503219 421713 236227 226848 181656 260565 544032 353102
10369C53102j32787K30465j00883K154R8546l0430N9211A97549J53213M2906G6839
$$ 353102 220315 450780 349897 352051 450597 420167 479378 197549 350762 393668 76839
10357B76939j31880J12476L99748b28799A00804K66082R3563j14787l5280l0822
$$ 276939 145059 257535 657283 -228799 100804 366886 460449 345662 310382 279560
10347B79560J46321F584L0271L62380J69253j33250Q1050A28628M70194B44810
$$ 279560 425881 6584 36855 399235 568488 435238 516288 128628 598822 244810
10336A93003J35728K1581B3635K51119J62728c6500B73102A03021D0333K33490
$$ 193003 328731 350312 23635 274754 437482 -36500 273102 103021 40333 273823
10326B73823J26182A22123D1723a61048B58516d6123f753A98226D7257r596b6657
$$ 273823 400005 122123 41723 -161048 258516 -46123 -6753 198226 47257 37661 -26657
10314C85393q5178r6400K83058b1379n8896a439I871c64617E929a87346O0950
$$ 385393 300215 203815 486873 -21379 -80275 -1439 9871 -364617 5929 -187346 -126396
10303a26396l02180A09502B6889d70352F3853J99593r5297G9766b4569l04938
$$ -126396 -428576 109502 26889 -470352 63853 263446 168149 79766 -24569 -329507
10293c29507a1626l75284C3566b53997c6564j74794O3607m0938A13417d8092k39618
$$ -329507 -11626 -386910 33566 -253997 -36564 -211358 -147751 -188689 113417 -48092 -287710
10282b87710A7787J56839M354K79959j60614R9889b44104A54456A2100c58143
$$ -287710 17787 174626 178980 458939 298325 398214 -244104 154456 12100 -358143
10271a48213F2758J33430E9959g8320B16040c3713B20639K508m1010K57478I2903
$$ -148213 62758 196188 59959 -78320 216040 -33713 220639 223147 182137 439615 92903
10259A75262J04218m9979d500j44097O4118B20644b74086A50717e7558k30433
$$ 175262 279480 229501 -4500 -148597 -84479 220644 -274086 150717 -57558 -287991
10249b87991j54586e0587E737J5161b51185H1940J19849I8475l7416d3616k34729
$$ -287991 -442577 -50587 5737 20898 -251185 81940 201789 98475 61059 -43616 -278345
10238b78345a11479C5515b27670R7511A52265K11169A6588K80436f4552B9903
$$ -278345 -111479 35515 -227670 -130159 152265 363434 16588 297024 -64552 29903
10227A25487k1445c3795j58109G6608e3716b3524j6460H6767a14606b2721j34765
$$ 125487 104042 -33795 -191904 76608 -53716 -23524 -39984 86767 -114606 -22721 -157486
10216a57486L5885o31j1908B65598e7340j71254Q9822n4607p5396i7409j89923
$$ -157486 -121601 -122232 -134140 265598 -57340 -228594 -138772 -193379 -268775 -97409 -287332
10205b87332A44062b00286c9664j10352E5043N694a97962a4908A26936Q19K08408
$$ -287332 144062 -200286 -39664 -150016 55043 60737 -197962 -14908 126936 127755 336163
10194C36163d81201b3590K22A70673l0800a14021j59500a04961e307B7602c7874
$$ 336163 -481201 -23590 -23368 170673 139873 -114021 -273521 -104961 -5307 27602 -37874
10182A40473J48544A19968f6130j46823A04140a22545F7345P9295K1136H291M28142
$$ 140473 289017 119968 -66130 -212953 104140 -122545 67345 146640 167776 8291 436433
10171D36433c82232h4094n7537B30037a98774g9165B80221c87559C24930b19596
$$ 436433 -382232 -84094 -141631 230037 -198774 -79165 280221 -387559 324930 -219596
10160A2843J03005b41063P7659j50939d9973A4852d73856B77560H9297b9381l1879
$$ 12843 115848 -241063 -163404 -314343 -49973 14852 -473856 277560 89297 -29381 -61260
10149f1260l90754A72000i5775o1139M7418A25787E0472J24260h0682j4003j33817
$$ -61260 -452014 172000 -95775 -156914 -109496 125787 50472 174732 -80682 -94685 -228502
10138b28502A67890b55885J16876A27966J68636b62766l6154P8759d8878r4086
$$ -228502 167890 -255885 -139009 127966 296602 -262766 -298920 -220161 -48878 -142964
10128a42964j39933P8041J2772A96672f779A15276e4291j00557e8486m2084c9803
$$ -142964 -282897 -204856 -192084 196672 -6779 115276 -54291 -154848 -58486 -100570 -39803
10116b54343A58268e5915q9043O6968o5028j18966a005o1921K1301D3205d12845
$$ -254343 158268 -55915 -144958 -77990 -143018 -261984 -1005 -62926 -41625 43205 -412845
10104c4973j29918j04374C25462c1646j76709d3526J5047j66698P7731D46492
$$ -34973 -164891 -269265 325462 -31646 -208355 -43526 -28479 -195177 -117446 446492
10093a48614I4224b48437m7424C3156J72951c28336a59639J5402d5243j87246
$$ -148614 94224 -248437 -295861 33156 206107 -328336 -159639 -144237 -45243 -232489
10083b32489K1214B1478a35099I6552b77016A39119b66708F8777d0851l4541n2960
$$ -232489 -211275 21478 -135099 96552 -277016 139119 -266708 68777 -40851 -75392 -128352
10072a28352A16269A534c7634k32270Q1556D1185J0154g7215k48974A806a75531
$$ -128352 116269 1534 -37634 -269904 -188348 41185 51339 -77215 -326189 1806 -175531
10060F6861b04800h0754C2733J08579b54819A02151O1457n876b0894j81038A28168
$$ 66861 -204800 -80754 32733 141312 -254819 102151 163608 157732 -20894 -201932 128168
10048e9511B67615a30097N2077n1058c4399h11j59353j28845O1085d3440H4191
$$ -59511 267615 -130097 -78020 -129078 -34399 -811 -160164 -289009 -227924 -43440 84191
10036b62722a00424A92490I4273i3096B52165C4436c80050R9957f3424k0352A4259
$$ -262722 -100424 192490 94273 -93096 252165 34436 -380050 -280093 -63424 -83776 14259
10024a42961A43177l8653M6510D8975J2260a90340Q2163a2793j28753j17875J04960
$$ -142961 143177 104524 151034 48975 61235 -190340 -108177 -12793 -141546 -259421 -154461
10013a54461k19608B36245C833L2853M0241a59038N2932C3653G492O1483K2527
$$ -154461 -374069 236245 3833 36686 76927 -159038 -106106 33653 7492 68975 91502
10002I1502f1867E3380K46849I2515F635b0841n2770A3226a92948I9294c03985
$$ 91502 -61867 53380 300229 92515 6635 -20841 -73611 13226 -192948 99294 -303985
9990A42351c0153B27778b91952J35775B81458a79021r5166e4561q6404d4378J3342
$$ 142351 -30153 227778 -291952 -156177 281458 -179021 -274187 -54561 -140965 -44378 -31036
9979c1036E5726J75952a42730L3589e919C7575b12717h2879b6797l8333c0258
$$ -31036 55726 231678 -142730 -109141 -5919 37575 -212717 -82879 -26797 -65130 -30258
9967a10058O126A15560h8540m53810i0117J4291c5072E9784b76198N2075l838
$$ -110058 -103932 115560 -88540 -542350 -90117 -75826 -35072 59784 -276198 -224123 -227961
9956b27961P5084l9483a165j88674j90341D447a62563k85624C78415j28007a83552
$$ -227961 -152877 -192360 -1165 -189839 -380180 4447 -162563 -448187 378415 250408 -183552
9944b9597j8035j61759P8107D678J5887K20290A14301K05708A9792a28942j55473
$$ -29597 -47632 -209391 -131284 4678 20565 240855 114301 320009 19792 -128942 -284415
9933b84415A9641M1291h7142A6610J38696a83934C26759C5158h5708A59735a31649
$$ -284415 19641 60932 -87142 16610 155306 -183934 326759 35158 -85708 159735 -131649
9921D603b2075k56984a01621j47741i9157i890k24599e1977C0352d22789G3509
$$ 4603 -22075 -279059 -101621 -249362 -99157 -9890 -234489 -51977 30352 -422789 73509
9909i9838j3926d5974l5392E6505Q6192e1308k05391F9402a32971K3797n799j526
$$ -99838 -113764 -45974 -81366 56505 142697 -51308 -256699 69402 -132971 -109174 -114973 -116499
9897a16499j47028A63872c4704Q322C8104J24968B1017K96872B0347M0425a49686
$$ -116499 -263527 163872 -34704 -26382 38104 163072 21017 317889 20347 60772 -149686
9885b2391F6586d7262m7564j43049A62685a54981r2967J3781m4969o4965J60155
$$ -22391 66586 -47262 -94826 -237875 162685 -154981 -247948 -234167 -279136 -344101 -183946
9874a83946F7471a13508j09694d7851I1706R1240c83025J81844c6789C46070a77116
$$ -183946 67471 -113508 -223202 -47851 91706 182946 -383025 -201181 -36789 346070 -177116
9862e45616e9327d117l87181a24254B96246b1720j77039E3799M4737a22608p7853
$$ -545616 -59327 -4117 -391298 -124254 296246 -21720 -198759 53799 98536 -122608 -200461
9851b00461d7247F4454k0879O2039b33371F4193f6588j10025P6012n6477o1708
$$ -200461 -47247 64454 43575 105614 -233371 64193 -66588 -176613 -100601 -157078 -218786
9840b18786c5914G784a83426P4033A10139K1445b65420K4354j12472a16156e7526
$$ -218786 -35914 7784 -183426 -109393 110139 131584 -265420 -241066 -353538 -116156 -57526
9828b83665C6566a42440G8215b71778G4301d09073a27197F1272k0025M43375a24991
$$ -283665 36566 -142440 78215 -271778 74301 -409073 -127197 61272 41247 484622 -124991
9816D73797b30931J12024L6887A41484b16948g6141a7225B00462L1929c6403j26281
$$ 473797 -230931 -118907 -82020 141484 -216948 -76141 -17225 200462 232391 -36403 -162684
9805a62684j05979i7775I0737a87157k7582A78697F4218b26368k7055N3274Q6592
$$ -162684 -268663 -97775 90737 -187157 -214739 178697 64218 -226368 -253423 -200149 -113557
9794a13557K0223k14091A41020J13323a10337B24800a6651k52187P7127D42920
$$ -113557 -93334 -307425 141020 254343 -110337 224800 -16651 -268838 -191711 442920
9783b04235A58120c9894A2941c55344g6317a3374l76353J49405i7611B8063A1757
$$ -204235 158120 -39894 12941 -355344 -76317 -13374 -389727 -240322 -97611 28063 11757
9771A0313d16846a99197E1518c19632J49101A66899A159K76187D7217L2942g4760
$$ 10313 -416846 -199197 51518 -319632 -170531 166899 1159 277346 47217 80159 -74760
9759A3750b44801K5430C8022N2694P0926D9651b89807i2480k18054A07550c34291
$$ 13750 -244801 -219371 38022 90716 161642 49651 -289807 -92480 -310534 107550 -334291
9747c26283A09949i1954K4369J8965B74703E1165b72164J21680j31847B01889
$$ -326283 109949 -91954 -67585 -48620 274703 51165 -272164 -150484 -282331 201889
9736e5454C68247A47119d851k14964a00562N586j7442L1782j10453e6229b734
$$ -55454 368247 147119 -4851 -219815 -100562 -94976 -112418 -80636 -191089 -56229 -2734
9724b92269B11506a13347j10976j54449R284I1399B1064J34230d9324B56060c17221
$$ -292269 211506 -113347 -224323 -378772 -369488 91399 21064 155294 -49324 256060 -317221
9712d27306c5597j70203Q2986a5840k76630a05441A6177D685c6044B3020c13305
$$ -427306 -35597 -205800 -122814 -15840 -292470 -105441 16177 4685 -36044 23020 -313305
9700A04467a29067A6149b11052b7618k53056C27173f36656g5031p8911e8006A13929
$$ 104467 -129067 16149 -211052 -27618 -280674 327173 -636656 -75031 -153942 -58006 113929
9688c2291o7186q7085e8005k80370J29485Q8848n6801G9589c31247C5532K63248
$$ -32291 -99477 -186562 -58005 -338375 -208890 -120042 -176843 79589 -331247 35532 298780
9677B98780G8369b42813B82486a36523j27677f362B31223m765A05557K74928d4214
$$ 298780 78369 -242813 282486 -136523 -264200 -6362 231223 226458 105557 380485 -44214
9665A00120K72204a23571j6542l6451k88471L4272a32170p3448m0007F1133K08870
$$ 100120 372324 -123571 -140113 -176564 -465035 -430763 -132170 -205618 -245625 61133 270003
9654B70003c89250F7966c54015L7917f1774k30350A83799o8729a10419N1543l77426
$$ 270003 -389250 67966 -354015 -316098 -61774 -292124 183799 115070 -110419 -58876 -436302
9643d36302D75903b36266n992p8972B76861q8849K9709A200a32019H4221l4118
$$ -436302 475903 -236266 -242258 -321230 276861 188012 217721 1200 -132019 84221 50103
9632E0103b49986R9805a249q9931c278p5837j82672A80676A9393a02160B19681
$$ 50103 -249986 -150181 -1249 -91180 -3278 -79115 -261787 180676 19393 -102160 219681
9620B35818g0846G58h6839b0039n0704c989r5076j49816M0622i1272A58846C9871
$$ 235818 -70846 758 -86839 -20039 -70743 -3989 -99065 -248881 -208259 -91272 158846 39871
9607F1045a1946k2972j54675h0531b3788A38663b2733I3697B8890c6517k90988
$$ 61045 -11946 -34918 -189593 -80531 -23788 138663 -22733 93697 28890 -36517 -327505
9596c27505h8505a6799j37633j94429E9108b11655D27983f6135E157J53492b36613
$$ -327505 -88505 -16799 -154432 -348861 59108 -211655 427983 -66135 5157 158649 -236613
9584a31449B08030J23780h6498C1189a78281G3474b61971F7157c23329d7028A31287
$$ -131449 208030 331810 -86498 31189 -178281 73474 -261971 67157 -323329 -47028 131287
9572b63619J05203b4646B38474c9086A92403l2944b10838b3786j97142J0569R4667
$$ -263619 -158416 -24646 238474 -39086 192403 159459 -210838 -23786 -220928 -210359 -115692
9561a15692L9637G8451C1079a81927B17484d10785a82005B33406C1524E85h4435
$$ -115692 -76055 78451 31079 -181927 217484 -410785 -182005 233406 31524 585 -84435
9549c11081e6918j88147A48381J47469e5446C78036j62250e4233k9257p0135a6925
$$ -311081 -56918 -245065 148381 295850 -55446 378036 215786 -54233 -83490 -153625 -16925
9537b75301A54955n3833b6628E6344d3786M421n640m5530A88247a70257M1184
$$ -275301 154955 101122 -26628 56344 -43786 -39365 -45005 -90535 188247 -170257 -129073
9526a29073h637k98103D04048j47188g096A04646f4339b2822j22057p5294a5776
$$ -129073 -8637 -306740 404048 256860 -7096 104646 -64339 -22822 -144879 -220173 -15776
9514h0386j92618J0079m40A22162b93044b3580H4790c9694k1175B7499a13668
$$ -80386 -273004 -262925 -263365 122162 -293044 -23580 84790 -39694 -60869 27499 -113668
9502H2930l7959L713A1442J04215c77201A12927h2551k23370A15682a22955j07120
$$ 82930 44971 48684 11442 115657 -377201 112927 -82551 -305921 115682 -122955 -230075
9491b30075A05062a38595N6920c66B53163d3352o7506j27928D318d05289A89517
$$ -230075 105062 -138595 -81675 -366 253163 -43352 -110858 -238786 4318 -405289 189517
9479H6245b28265j05185J56747D5123c17069a2697A45698a16680C5007R4718a05123
$$ 86245 -228265 -333450 -176703 45123 -317069 -12697 145698 -116680 35007 129725 -105123
9467d04696F3550c07548a09052j67370Q3406A20385d16553a9293J7G304h0512
$$ -404696 63550 -307548 -109052 -276422 -193016 120385 -416553 -19293 -19276 7304 -80512
9455a25767d893p8716c4866A16910b13218D3352A4367a78353I6027b22777a00231
$$ -125767 -4893 -83609 -34866 116910 -213218 43352 14367 -178353 96027 -222777 -100231
9443H8376c50550P0658J11565c7240n2823c3591A53382e1849B43953J9541b86124
$$ 88376 -350550 -279892 -168327 -37240 -90063 -33591 153382 -51849 243953 263494 -286124
9431a21760I3865J04042a6926A0417i6523A33698a50866o9775j28446b1952p9189
$$ -121760 93865 197907 -16926 10417 -96523 133698 -150866 -220641 -349087 -21952 -101141
9420a01141I1360J20921H6094b36466C08918H6340j6881a13021B55505a35446
$$ -101141 91360 212281 86094 -236466 308918 86340 69459 -113021 255505 -135446
9409d225j96785O5349A31340i6083b6299j92883F1749J23875p2039c92072b7250
$$ -4225 -201010 -135661 131340 -96083 -26299 -219182 61749 185624 113585 -392072 -27250
9397I7373b35427A1064R5004A4649J2247a09983l9292K8257B4974g1561H5501
$$ 97373 -235427 11064 106068 14649 26896 -109983 -149275 -121018 24974 -71561 85501
9385A66416E9277a71079A5817c8741k57051a07609b1418l06348a12918n0392j38617
$$ 166416 59277 -171079 15817 -38741 -295792 -107609 -21418 -327766 -112918 -163310 -301927
9374c01927a36906G7554M3277J2497i9835l82250E0602J25678o4431d7282j34108
$$ -301927 -136906 77554 120831 133328 -99835 -482085 50602 176280 111849 -47282 -181390
9363a81390D3655i4815B55552a27912N7250m4559a7755j02911p7741B20559g0410
$$ -181390 43655 -94815 255552 -127912 -70662 -115221 -17755 -120666 -198407 220559 -70410
9351a67340O8337k5475D8692c05748A97312a68585j29510G0779c23952C70047
$$ -167340 -99003 -124478 48692 -305748 197312 -168585 -298095 70779 -323952 370047
9340B4705d00282a66087j72998e1063H496d33137a90069j62858P2281j50787K03794
$$ 24705 -400282 -166087 -339085 -51063 8496 -433137 -190069 -352927 -280646 -431433 -227639
9329b27639R4855b1656C4674a3676C7266a19706A16327g7698G4743c73573a71121
$$ -227639 -132784 -21656 34674 -13676 37266 -119706 116327 -77698 74743 -373573 -171121
9317A54592a27712C83633a68211B49706E7168d2999A385b4473C2717a969A17127
$$ 154592 -127712 383633 -168211 249706 57168 -42999 1385 -24473 32717 -1969 117127
9305C1443K43024B77O6492J73710A1318J54330a92716l7279r7135a30339b8262
$$ 31443 274467 277 66769 240479 11318 165648 -192716 -229995 -327130 -130339 -28262
9293A04705a26610j39580I2402a36853d8154B70497c60540a04843B01765l3748
$$ 104705 -126610 -266190 92402 -136853 -48154 270497 -360540 -104843 201765 168017
9283A68017E3899i0605F6977J04031c27365a38762E8891A8856c88953d1974p8828
$$ 168017 53899 -90605 66977 171008 -327365 -138762 58891 18856 -388953 -41974 -120802
9272a20802E1308a08780l4896A2135a04049k8679C29170G9788a14087m3962M5318
$$ -120802 51308 -108780 -143676 12135 -104049 -132728 329170 79788 -114087 -158049 -112731
9261a12731p8279C2174b21295O5326c9722h177j88518f3085j48709p878f664j70835
$$ -112731 -191010 32174 -221295 -155969 -39722 -8177 -196695 -63085 -211794 -219672 -6664 -177499
9249a77499n6595e9297K0588A32036b63125M2700J4013c2859q4924d9364p2875
$$ -177499 -234094 -59297 -38709 132036 -263125 -220425 -206412 -32859 -117783 -49364 -122239
9238a22239l7690k6634H7516H1a40865Q078I647b8204A4830b74830M3423E2610
$$ -122239 -159929 -186563 87516 81 -140865 -132787 9647 -28204 14830 -274830 -231407 52610
9225a15497o0448Q127j94016e0132b491A88709c7413J0928B21235a52629O7592
$$ -115497 -175945 -167818 -361834 -50132 -2491 188709 -37413 -26485 221235 -152629 -85037
9214h5037C6041H474K2213a533D00300F4885B2983b38570a12365k3812b5449j61881
$$ -85037 36041 8474 30687 -1533 400300 64885 22983 -238570 -112365 -136177 -25449 -187330
9202a87330C25756b59898A81885a33582e990A84368a0091j66937Q5798I6790f6522
$$ -187330 325756 -259898 181885 -133582 -5990 184368 -10091 -177028 -91230 96790 -66522
9190f6339F613a8880j39757a8741m9269p9430K9693G371a32443m0102M1002k52335
$$ -66339 6613 -18880 -158637 -18741 -68010 -147440 -117747 7371 -132443 -172545 -131543 -383878
9178c83878J55415J02142F5443a28450c6554k05912a14050b3802j76636R1305
$$ -383878 -228463 -126321 65443 -128450 -36554 -242466 -114050 -23802 -200438 -109133
9168a09133j41723A1712J4819a23602k59902J70346F034J27238b65552o1967A94156
$$ -109133 -250856 11712 26531 -123602 -383504 -213158 6034 133272 -265552 -327519 194156
9156C7637K1689f0127j05064B81301j39438A4531J61292c89694A69736a80713
$$ 37637 59326 -60127 -165191 281301 141863 14531 175823 -389694 169736 -180713
9145H8160k6951Q3364h1763E7305e9755E9786J75267b5536C6904L1929a10808
$$ 88160 61209 144573 -81763 57305 -59755 59786 235053 -25536 36904 68833 -110808
9133A50682a51855g0412A18241k0735R8577d09171a54496f364k69136H0197d5542
$$ 150682 -151855 -70412 118241 97506 196083 -409171 -154496 -6364 -275500 80197 -45542
9121e5756B2247L58779b4110j04520I0068a84978H7213f8282j51674h8236A65002
$$ -55756 22247 381026 -24110 -128630 90068 -184978 87213 -68282 -219956 -88236 165002
9109d9105C8617c95096c6674E2192O9620j5706b96921A11470i0540E8889b28724
$$ -49105 38617 -395096 -36674 52192 121812 106106 -296921 111470 -90540 58889 -228724
9097a13621n9480A04732a50840j67037N3890A61527j2729L7085i0900L8444n7396
$$ -113621 -173101 104732 -150840 -317877 -263987 161527 148798 185883 -90900 -52456 -109852
9086a09852l02518Q7159c4536B17824r5994J7083B617c95803J65790j45087k800
$$ -109852 -412370 -325211 -34536 217824 121830 138913 2617 -395803 -230013 -375100 -377900
9075c77900H6052d3701C11689J12209G5108b97844A31915c3453l47491J46897
$$ -377900 86052 -43701 311689 423898 75108 -297844 131915 -33453 -380944 -234047
9065b34047C227c14098a09508r9411A64366j859c7624a5048p6323A38651a6705
$$ -234047 3227 -314098 -109508 -208919 164366 162507 -37624 -15048 -91371 138651 -16705
9053A6032b10950d9563j08601D5612a30954m6798j85135B56624r9430a00043j7156
$$ 16032 -210950 -49563 -158164 45612 -130954 -177752 -362887 256624 157194 -100043 -117199
9042a17199C27966b14757L2715A37262c22431B04674a09511K3905E6068b94518
$$ -117199 327966 -214757 -182042 137262 -322431 204674 -109511 -85606 56068 -294518
9031a50816b5791r0630c1456k80360A2868b48867j59953G9786b79897F1527f2785
$$ -150816 -25791 -116421 -31456 -311816 12868 -248867 -408820 79786 -279897 61527 -62785
9019h5104G639g5830B07031B8300a7138A87969p0260a55766J5322A1310i6862
$$ -85104 7639 -75830 207031 28300 -17138 187969 117709 -155766 -140444 11310 -96862
9007a04751L7704j92161O368J13076a189l78994i9862G0872d40777h2109B15957
$$ -104751 -67047 -259208 -252840 -139764 -1189 -380183 -99862 70872 -440777 -82109 215957
8995a86874a7499k65194f359j13713G5827h2929H8767d5397E7600L37312e0826
$$ -186874 -17499 -282693 -6359 -120072 75827 -82929 88767 -45397 57600 394912 -50826
8983h4339C8518d4867A23114J8252c21617e1573r4398j71763J03388j9092A9808
$$ -84339 38518 -44867 123114 141366 -321617 -51573 -145971 -317734 -214346 -233438 19808
8971a52322g095j17353B44543e43974i3502I968d8225k43157B20481l9696a85082
$$ -152322 -7095 -124448 244543 -543974 -93502 9968 -48225 -291382 220481 180785 -185082
8959B21162H5481i4002A49411j6857m832L2746a892o8944o6094f1033A16001b67948
$$ 221162 85481 -94002 149411 132554 127722 160468 -1892 -70836 -136930 -61033 116001 -267948
8946i0003p4312g8922D50K6022a39697j3016k7111k79804B15812a12672B91862
$$ -90003 -164315 -78922 450 26472 -139697 -152713 -179824 -459628 215812 -112672 291862
8934A25326J14885b6225F1674N1726i7759j22280f7821r6663A12548R3940J88651
$$ 125326 240211 -26225 61674 113400 -97759 -220039 -67821 -164484 112548 206488 395139
8923C95139J688542K742714N556082D605171A727526p76321D39502j62467E5051
$$ 395139 2083681 4826395 10382477 4605171 1727526 951205 439502 277035 55051
8913c61890A18331a16276k27917A24987b27061E24624A82251G1522J5797b6342
$$ -361890 118331 -116276 -344193 124987 -227061 524624 182251 71522 87319 -26342
8902F4501l1218d64616D7071a7805A08311c04344i8523E6042J29417c72130a83816
$$ 64501 33283 -464616 47071 -17805 108311 -304344 -98523 56042 185459 -372130 -183816
8890a56800K6923A68764b07316j88687R7019J7306M8830A53471G5946a35567J9693
$$ -156800 -129877 168764 -207316 -396003 -298984 -281678 -232848 153471 75946 -135567 -115874
8879a15874j09761B12931d906C29321A30681b92890J02510G2291a43915F6413
$$ -115874 -225635 212931 -4906 329321 130681 -292890 -190380 72291 -143915 66413
8868F0405a48500C1035J84968p1758d82864c7279D5296d1j41118o5033J7111i0474
$$ 60405 -148500 31035 216003 144245 -482864 -37279 45296 -41 -141159 -206192 -189081 -90474
8855B20399a8900B93620r8752b29406m062f4076j56974b4828C25258a11290B9639
$$ 220399 -18900 293620 194868 -229406 -233468 -64076 -221050 -24828 325258 -111290 29639
$$ [...]
##END NTUPLES=NMR SPECTRUM
##END=
