##TITLE=AC1599_JAMAH13329_8315744_5nwIf7IkFF
##JCAMPDX= 6.0         $$ Bruker NMR JCAMP-DX V2.0
##DATA TYPE= NMR SPECTRUM
##DATA CLASS= NTUPLES
##ORIGIN= BRUKER
##OWNER= Administrator
$$ 1.72 TOPSPIN		Version 2.1
$$ 2013-11-09 18:09:16.236 -0800  Administrator@X
$$ Compression mode = diff/dup
##.OBSERVE FREQUENCY= 400.02188249412
##.OBSERVE NUCLEUS= ^1H
##.ACQUISITION MODE= SIMULTANEOUS (DQD)
##.ACQUISITION SCHEME= undefined
##.AVERAGES= 64
##.DIGITISER RES= 22
##SPECTROMETER/DATA SYSTEM= spect
##.PULSE SEQUENCE= noesygpps1d.comp
##.SOLVENT NAME= COFFEE_meoh
##.SHIFT REFERENCE= INTERNAL, COFFEE_meoh, 1, 14.96119
##AUDIT TRAIL= $$ (NUMBER, WHEN, WHO, WHERE, PROCESS, VERSION, WHAT)
$$ ##TITLE= Audit trail, TOPSPIN		Version 2.1
$$ ##JCAMPDX= 5.01
$$ ##ORIGIN= Bruker BioSpin GmbH
$$ ##OWNER= Administrator
$$ $$ E:\/data/COFFEE/nmr/AC1599_JAMAH13329_8315744_5nwIf7IkFF/12/pdata/1/auditp.txt
$$ ##AUDIT TRAIL=  $$ (NUMBER, WHEN, WHO, WHERE, PROCESS, VERSION, WHAT)
(   1,<2013-11-09 18:09:11.205 -0800>,<Administrator>,<X>,<go>,<TOPSPIN 2.1>,
      <created by zg
	started at 2013-11-09 17:57:41.384 -0800,
	POWCHK enabled, PULCHK disabled,
       configuration hash MD5:
       C8 4E 4E 5D D3 5C D8 9E 9F 52 82 E0 59 8A DE 15
       data hash MD5: 64K
       8B 00 D4 81 62 15 FD 57 1B DC 6A E6 B3 9A 97 B4>)
(   2,<2013-11-09 18:09:14.189 -0800>,<Administrator>,<X>,<proc1d>,<TOPSPIN 2.1>,
      <Start of raw data processing
       efp LB = 0.3 FT_mod = 6 PKNL = 1 PHC0 = 0 PHC1 = 0 SI = 128K 
       data hash MD5: 128K
       F1 60 24 92 5D 40 D9 4F 5C B3 10 C5 44 BA CE FC>)
(   3,<2013-11-09 18:09:15.205 -0800>,<Administrator>,<X>,<proc1d>,<TOPSPIN 2.1>,
      <pk PHC0 = -86.43494 PHC1 = 0 
       data hash MD5: 128K
       B7 12 33 82 E6 6C 09 C3 18 29 A5 FF 54 1A 69 3F>)
(   4,<2013-11-09 18:09:15.627 -0800>,<Administrator>,<X>,<proc1d>,<TOPSPIN 2.1>,
      <abs ABSG = 1 
       data hash MD5: 128K
       30 05 53 B9 DC 31 AA E8 B5 C8 6D 87 06 EB 35 C3>)
(   5,<2013-11-09 18:09:15.752 -0800>,<Administrator>,<X>,<proc1d>,<TOPSPIN 2.1>,
      <abs ABSG = 2 
       data hash MD5: 128K
       A2 2C A2 E6 0A ED F5 E2 35 9E FB 52 BD 45 7A F4>)
(   6,<2013-11-09 18:09:15.830 -0800>,<Administrator>,<X>,<proc1d>,<TOPSPIN 2.1>,
      <abs ABSG = 3 
       data hash MD5: 128K
       0A 64 3E 2C 4D 95 E1 83 48 5B 58 A4 01 E2 C7 B1>)
(   7,<2013-11-09 18:09:15.955 -0800>,<Administrator>,<X>,<proc1d>,<TOPSPIN 2.1>,
      <abs ABSG = 4 
       data hash MD5: 128K
       96 D4 6C B8 34 96 C7 EA 0D 32 90 EB F4 7E 59 1B>)
(   8,<2013-11-09 18:09:16.064 -0800>,<Administrator>,<X>,<proc1d>,<TOPSPIN 2.1>,
      <abs ABSG = 5 
       data hash MD5: 128K
       03 B4 52 42 77 DC 10 67 7D 16 B5 0D 5A 27 27 C4>)
$$ ##END=
$$ 
$$ $$ hash MD5
$$ $$ 21 CC 8A 85 F2 12 B8 03 33 6D 40 98 98 E7 17 62
##$RELAX= 
##$RELAX= 
##$RELAX= 
##$RELAX= 
##$RELAX= 
##$RELAX= 
##$RELAX= 
##$RELAX= 
$$ Bruker specific parameters
$$ --------------------------
##$DU= <E:\>
##$EXPNO= 12
$$ [...]
##$TP07= 0
##$TPNAME0= <>
##$TPNAME1= <>
##$TPNAME2= <>
##$TPNAME3= <>
##$TPNAME4= <>
##$TPNAME5= <>
##$TPNAME6= <>
##$TPNAME7= <>
##$TPOAL= (0..7)
0.5 0.5 0.5 0.5 0.5 0.5 0.5 0.5
##$TPOFFS= (0..7)
0 0 0 0 0 0 0 0
##$TUNHIN= 0
##$TUNHOUT= 0
##$TUNXOUT= 0
##$USERA1= <user>
##$USERA2= <user>
##$USERA3= <user>
##$USERA4= <user>
##$USERA5= <user>
##$V9= 5
##$VALIST= <valist>
##$VCLIST= <CCCCCCCCCCCCCCC>
##$VD= 0
##$VDLIST= <DDDDDDDDDDDDDDD>
##$VPLIST= <PPPPPPPPPPPPPPP>
##$VTLIST= <TTTTTTTTTTTTTTT>
##$WBST= 1024
##$WBSW= 4
##$XGAIN= (0..3)
0 0 0 0
##$XL= 0
##$YL= 0
##$YMAX_a= 6324017
##$YMIN_a= -12224957
##$ZGOPTNS= <>
##$ZL1= 120
##$ZL2= 120
##$ZL3= 120
##$ZL4= 120
##$ABSF1= 14.96119
##$ABSF2= -5.596992
##$ABSG= 5
##$ABSL= 3
##$ALPHA= 0
##$AQORDER= 0
##$ASSFAC= 0
##$ASSFACI= 0
##$ASSFACX= 0
##$ASSWID= 0
##$AUNMP= <proc_prof1d_extract.lims>
##$AXLEFT= 0
##$AXNAME= <>
##$AXNUC= <1H>
##$AXRIGHT= 0
##$AXTYPE= 0
##$AXUNIT= <>
##$AZFE= 0.1
##$AZFW= 0.1
##$BCFW= 0
##$BC_mod= 0
##$BYTORDP= 0
##$COROFFS= 0
##$CY= 15
##$DATMOD= 1
##$DC= 0
##$DFILT= <>
##$DTYPP= 0
##$F1P= 0
##$F2P= 0
##$FCOR= 0.5
##$FTSIZE= 131072
##$FT_mod= 6
##$GAMMA= 0
##$GB= 0
##$INTBC= 1
##$INTSCL= 1
##$ISEN= 128
##$LB= 0.3
##$LEV0= 0
##$LPBIN= 0
##$MAXI= 10000
##$MC2= 0
##$MEAN= 0
##$ME_mod= 0
##$MI= 0
##$NCOEF= 0
##$NC_proc= -2
##$NLEV= 6
##$NOISF1= 0
##$NOISF2= 0
##$NSP= 0
##$NTH_PI= 0
##$NZP= 0
##$OFFSET= 14.96119
##$PC= 1
##$PHC0= -86.43494
##$PHC1= 0
##$PH_mod= 1
##$PKNL= yes
##$PPARMOD= 0
##$PPDIAG= 0
##$PPIPTYP= 0
##$PPMPNUM= 2147483647
##$PPRESOL= 1
##$PSCAL= 4
##$PSIGN= 0
##$PYNMP= <proc.py>
##$REVERSE= no
##$SF= 400.020009561738
##$SI= 131072
##$SIGF1= 0
##$SIGF2= 0
##$SINO= 400
##$SIOLD= 131072
##$SPECTYP= <>
##$SREGLST= <1H.CDCl3>
##$SSB= 0
##$STSI= 131072
##$STSR= 0
##$SW_p= 8223.68421052631
##$SYMM= 0
##$S_DEV= 0
##$TDeff= 65536
##$TDoff= 0
##$TI= <>
##$TILT= no
##$TM1= 0
##$TM2= 0
##$TOPLEV= 0
##$USERP1= <user>
##$USERP2= <user>
##$USERP3= <user>
##$USERP4= <user>
##$USERP5= <user>
##$WDW= 1
##$XDIM= 131072
##$YMAX_p= 437814943
##$YMIN_p= -11389
##$CURPLOT= <Network HP LaserJet P1505>
##$CURPRIN= <$Network HP LaserJet P1505>
##$DFORMAT= <normdp>
##$LAYOUT= <+/1D_H.xwp>
##$LFORMAT= <normlp>
##$PFORMAT= <normpl>
##$SURQMSG= 1
$$ End of Bruker specific parameters
$$ ---------------------------------
##NTUPLES= NMR SPECTRUM
##VAR_NAME=  FREQUENCY,     SPECTRUM/REAL,   SPECTRUM/IMAG
##SYMBOL=    X,             R,               I
##VAR_TYPE=  INDEPENDENT,   DEPENDENT,       DEPENDENT
##VAR_FORM=  AFFN,          ASDF,            ASDF
##VAR_DIM=   131072,        131072,          131072
##UNITS=     HZ,            ARBITRARY UNITS, ARBITRARY UNITS
##FACTOR=    0.0627417313425164, 1,          1
##FIRST=     8223.62146879497, -3508,        -59117
##LAST=      0,             -1781,           -60021
##MIN=       0,             -11389,          0
##MAX=       8223.62146879497, 437814943,    0
$$ Real data points
##PAGE= N=1
##DATA TABLE= (X++(R..R)), XYDATA
$$ [...]
63935B531734K09119K11509K09371K02950J92618J77919J58143J33813J06815
63926D133991P8801N0034K0171j0501m1196p1387j00532j27306j50012j67838
63916C614225j81118j90301j95386j96419j93964j88864j81882j73647j64393
63907A948251j53703j41179j27552j14511j03102r2754q2305p1527o1286n2530
63897I47802m5547l9950l4998l0073k5173k0861j7577j5285j3880j3581j4459
63886F76418j5824j6534j6019j4691j3324j2123j0633q446n872l618j846N8K567
63873E60113N276P547R541J1947J4804J7337J9071K0391K1789K3188K4269K4938
63861G60211K5122K4650K3629K2450K1164J9346J6906J4420J2246R911O904L498
$$ y = [2531734, 2740853, 2952362, 3161733, 3364683, 3557301, 3735220, 3893363, 4027176, 4133991, 4212792, 4262826, 4282997, 4272496, 4231300, 4159913, 4059381, 3932075, 3782063, 3614225, 3433107, 3242806, 3047420, 2851001, 2657037, 2468173, 2286291, 2112644, 1948251, 1794548, 1653369, 1525817, 1411306, 1308204, 1215450, 1133145, 1061618, 1000332, 947802, 902255, 862305, 827307, 797234, 772061, 751200, 733623, 718338, 704458, 690877, 676418, 660594, 644060, 628041, 613350, 600026, 587903, 577270, 568824, 562952, 559334, 557488, 557546, 560113, 565389, 572936, 582477, 594424, 609228, 626565, 645636, 666027, 687816, 711004, 735273, 760211, 785333, 809983, 833612, 856062, 877226, 896572, 913478, 927898, 940144, 950055, 956959, 960457]
63849I60457J97l099o699j0296j3321j5842j8370k0954k3190k4990k6597k7896
63837G69400k8434k8211k7830k7762k7959k8161k8104k7354k5602k3247k1200
63826D75536j9908j8981j7873j6461j4930j3493j2394j1683j0912r522p744o597
63814C15038o715p525p900p309o062m706l603k928k701k802l074l385l539l307
63800B49482k752k327k419k853l063k737k121j591j229r37q57j244j921k245j934
63785B19252j523j569j717j269n06n48j653k617k356j299n63l95l02j88l71o88
63769B01688n94q0K78K30P9K3j2N4L60N46J63m11k89N67J144P76j08q93j532j998
63749A99991j862j008o0M18N96Q18R63R09R23J146J233J076J215J889K423K269
$$ y = [960457, 960654, 957555, 950856, 940560, 927239, 911397, 893027, 872073, 848883, 823893, 797296, 769400, 740966, 712755, 684925, 657163, 629204, 601043, 572939, 545585, 519983, 496736, 475536, 455628, 436647, 418774, 402313, 387383, 373890, 361496, 349813, 338901, 329379, 321635, 315038, 308323, 300798, 292898, 285589, 279527, 274821, 271218, 268290, 265589, 262787, 259713, 256328, 252789, 249482, 246730, 244403, 241984, 239131, 236068, 233331, 231210, 229619, 228390, 227453, 226596, 225352, 223431, 221186, 219252, 217729, 216160, 214443, 213174, 212668, 212120, 210467, 207850, 205494, 204195, 203632, 203237, 202935, 202747, 202376, 201688, 201094, 201014, 201292, 201522, 201601, 201624, 201612, 201666, 202026, 202572, 202735, 202324, 202035, 202602, 203746, 204522, 204414, 203521, 201989, 199991, 198129, 197121, 197061, 197479, 198075, 198893, 199856, 200765, 201688, 202834, 204067, 205143, 206358, 208247, 210670, 212939]
63733B12939K039K505L228L244K695K557K909K822K051J621K316L575M416M650
63719B53567M619M469M304M521N253N798N217L464J425q6r28j332j535j779k278
63704B84699k927l221k827k129j899k334k661k018n06R56J689J737J388Q26M87
63689B71260J012K336L353L148K239J824K116K300J998J770J928J871J125K37
63675B98517n9K6k41r27j461j573j432r62P8J255J571Q42K42Q54K196K859K330
63658C04115J408Q03K17r15k389l515m023m186m204m020l699l524l619l779l723
63643B64947l265k317j071j57p1m38l39M60J182J236J162J867L301M515M823M421
63627B80256L916L755M052M645N235N744O414P351Q224Q734R177J0061J1373J2658
$$ y = [212939, 214978, 217483, 220711, 223955, 226650, 229207, 232116, 234938, 236989, 238610, 240926, 244501, 248917, 253567, 258186, 262655, 266959, 271480, 276733, 282531, 287748, 291212, 292637, 292551, 291623, 290291, 288756, 286977, 284699, 281772, 278551, 275724, 273595, 271696, 269362, 266701, 264683, 264177, 265133, 266822, 268559, 269947, 270773, 271260, 272272, 274608, 277961, 281109, 283348, 285172, 287288, 289588, 291586, 293356, 295284, 297155, 298280, 298517, 298458, 298484, 298243, 297316, 295855, 294282, 292850, 291888, 291966, 293221, 294792, 295634, 295876, 296730, 298926, 301785, 304115, 305523, 306326, 306543, 305628, 303239, 299724, 295701, 291515, 287311, 283291, 279592, 276068, 272449, 268670, 264947, 261682, 259365, 258294, 258137, 258066, 257628, 257289, 257749, 258931, 260167, 261329, 263196, 266497, 271012, 275835, 280256, 284172, 287927, 291979, 296624, 301859, 307603, 314017, 321368, 329592, 338326, 347503, 357564, 368937, 381595]
63613C81595J3742J4782J5851J7009J8724K1371K4279K6090K6423K6437K7249
63602F13552K8347K8211K6172K2952J9472J5758J1234N823N09l262m874n193n724
63589G52977p120q737r755j0239j0927j2305j4268j6446j8497k0148k1254k1710
63577E81571k1339j9988j7952j5910j4266j2806j1255r768q549p245n298k754
63565D34441j82K028L891N329O038N930N386M894M734N067O000P420R009J0582
63551E10567J2194J3945J5905J8257K1129K4173K6748K8768L0918L3604L5836
63540G72044L5671L1956K5351J7686J0554M628m2l582o144p889q838q886q109
63527H54400o969o084n842o519q536j2149j6842k1400k4898k7268k8767k9271
$$ y = [381595, 395337, 410119, 425970, 442979, 461703, 483074, 507353, 533443, 559866, 586303, 613552, 641899, 670110, 696282, 719234, 738706, 754464, 765698, 771521, 772030, 768768, 763894, 758701, 752977, 745857, 737120, 727365, 717126, 706199, 693894, 679626, 663180, 644683, 624535, 603281, 581571, 560232, 540244, 522292, 506382, 492116, 479310, 468055, 458287, 449738, 442493, 437195, 434441, 434259, 436287, 440178, 445507, 451545, 457475, 462861, 467755, 472489, 477556, 483556, 490976, 499985, 510567, 522761, 536706, 552611, 570868, 591997, 616170, 642918, 671686, 702604, 736208, 772044, 807715, 839671, 865022, 882708, 893262, 897890, 897848, 894266, 888122, 880233, 871395, 862509, 854400, 847431, 841347, 835505, 828986, 820450, 808301, 791459, 770059, 745161, 717893, 689126, 659855]
63515F59855k8589k7151k5818k4977k4231k3025k1240j9147j7099j5314j3739
63504D19525j2109j0396r025q377q145p672o834o030n368m461l277k530k765l526
63490C29010l844l316k203q78L69J134J155P86P26J159J582J589J520K057L375
63475C34221M871N786N883N451M733L667K306J194Q60R88O00p84k616m101n064
63460C57995n721o060n889n293m540l760k990k363j903j376o70n6L19Q34J803
63445C20330K866L514L937M683N715O618P516Q907J0627J1931J2735J3850J5795
63432D29024J8172K0511K2639K3886K2969J9500J4919J1099Q618P053O335O806
63420F11531Q345J0414J2851J5919J9634K3649K7577L0936L3082L3831L3782L3267
$$ y = [659855, 631266, 604115, 578297, 553320, 529089, 506064, 484824, 465677, 448578, 433264, 419525, 407416, 397020, 387995, 379618, 371473, 363801, 356967, 350937, 345569, 341108, 337831, 335301, 332536, 329010, 325166, 321850, 319647, 318769, 319138, 320272, 321427, 322213, 322939, 324098, 325680, 327269, 328789, 330846, 334221, 339092, 344878, 350761, 356212, 360945, 364612, 366918, 368112, 368972, 369960, 370560, 369776, 367160, 363059, 357995, 352274, 346214, 340325, 335032, 330492, 326732, 323742, 321379, 319476, 318100, 317430, 317374, 317693, 318527, 320330, 323196, 326710, 330647, 335330, 341045, 347663, 355179, 364086, 374713, 386644, 399379, 413229, 429024, 447196, 467707, 490346, 514232, 537201, 556701, 571620, 582719, 591337, 598390, 604725, 611531, 619876, 630290, 643141, 659060, 678694, 702343, 729920, 760856, 793938, 827769, 861551, 894818]
63408H94818L1420K7200K1073J4653Q814L260k015o126q526r855j0982j2059j3019
63395I38656j4222j5981j8032k0066k2275k4865k7466k9564l1058l1799l1171
63384F72157k8836k5596k2772k0859j9381j7941j6592j5148j2936r650o104l612
63372D72730k653k314j192J165L876N870P112Q356R883J1226J2221J3525J5627
63359E55432J8044K0147K2229K4952K8030L0400L1618L2306L3061L3593L3224
63348H63036L1630K8810K4701J9275J2889O387P78l298o023q229j0408j2091j2559
63335I34898j2146j2211j3683j6169j8749k1200k3920k6881k9226l0022k9117
63324G01574k7108k4611k1842j8917j6163j3771j1274q080m787l309n020r015
$$ y = [894818, 926238, 953438, 974511, 989164, 997978, 1001238, 999223, 993097, 984571, 974716, 963734, 951675, 938656, 924434, 908453, 890421, 870355, 848080, 823215, 795749, 766185, 735127, 703328, 672157, 643321, 617725, 594953, 574094, 554713, 536772, 520180, 505032, 492096, 482446, 476342, 472730, 470077, 467763, 466571, 467736, 471612, 477482, 484594, 492950, 502833, 514059, 526280, 539805, 555432, 573476, 593623, 615852, 640804, 668834, 699234, 730852, 763158, 796219, 829812, 863036, 894666, 923476, 948177, 967452, 980341, 986728, 987506, 984208, 978185, 969956, 959548, 947457, 934898, 922752, 910541, 896858, 880689, 861940, 840740, 816820, 789939, 760713, 730691, 701574, 674466, 649855, 628013, 609096, 592933, 579162, 567888, 559808, 555021, 551712, 546692, 537677]
63312E37677j2846j4898j5416j5357j5089j4495j3557j2363j0878r223p833p004
63300C88718o496n880n048m140l212k366j893j896j916j450p60o94j549k577k839
63285C46002k271j596j404j673k152k758l333l409k724j838j652k101k001o05
63271C16485J194J900J250K64l18o27p33k14Q64J510J137O40J219K573L247K668
63255C33059J867K007L027M042M525M607M610M690M916N361O113P176Q328R175
63241D03503R574R983J1098J3074J5350J7361J9037K0537K1878K3114K4601K6559
63229F15669K8491K9577K9679K9554K9831L0166K9892K9187K8994K9687L0450
63218I41177L0428L0014L0283L1307L1795L0718K8541K6387K4297K1136J6082
$$ y = [537677, 524831, 509933, 494517, 479160, 464071, 449576, 436019, 423656, 412778, 403555, 395722, 388718, 382222, 376342, 371294, 367154, 363942, 361576, 359683, 357787, 355871, 354421, 353661, 352967, 351418, 348841, 346002, 343731, 342135, 340731, 339058, 336906, 334148, 330815, 327406, 324682, 322844, 321192, 319091, 317090, 316485, 317679, 319579, 320829, 321093, 320775, 320148, 319415, 319201, 320065, 321575, 322712, 323352, 324571, 327144, 330391, 333059, 334926, 336933, 339960, 344002, 348527, 353134, 357744, 362434, 367350, 372711, 378824, 386000, 394328, 403503, 413077, 423060, 434158, 447232, 462582, 479943, 498980, 519517, 541395, 564509, 589110, 615669, 644160, 673737, 703416, 732970, 762801, 792967, 822859, 852046, 881040, 910727, 941177, 971605, 1001619, 1031902, 1063209, 1095004, 1125722, 1154263, 1180650, 1204947, 1226083, 1242165]
63207A242165R586K580m627j2216j9874k6635l1791l5596l8687m1089m2211m1745
63195I59860m0156l8073l5596l2494k8836k4977k1096j7192j3436j0055o880l509
63183F87560j8L019N347P353R371J1181J2508J3504J4337J4797J4757J4623J4796
63170H23135J5032J4916J4583J4344J3852J2420R986P114M171J148j864m848q362
63157I15627j2896j7665k1118k2906k4301k6231k7925k8209k7272k6137k5002
63146F55965k3258k0864j8595j6847j5142j3080j1073r807r320r022q324p131
63134D93502n789m715l997l394k734k131j680j233p47n52q28j090o67M12J467
63119D65824K057K326K535K702K801K873K871K738K674K912L276L323K976K534
$$ y = [1242165, 1251751, 1254331, 1249704, 1237488, 1217614, 1190979, 1159188, 1123592, 1084905, 1043816, 1001605, 959860, 919704, 881631, 846035, 813541, 784705, 759728, 738632, 721440, 708004, 697949, 691069, 687560, 687542, 690561, 695908, 703261, 712632, 723813, 736321, 749825, 764162, 778959, 793716, 808339, 823135, 838167, 853083, 867666, 882010, 895862, 908282, 918268, 925382, 929553, 930701, 928837, 923989, 915627, 902731, 885066, 863948, 841042, 816741, 790510, 762585, 734376, 707104, 680967, 655965, 632707, 611843, 593248, 576401, 561259, 548179, 537106, 527299, 517979, 508957, 500633, 493502, 487713, 482998, 479001, 475607, 472873, 470742, 469062, 467829, 467082, 466530, 465702, 464612, 463945, 464357, 465824, 467881, 470207, 472742, 475444, 478245, 481118, 483989, 486727, 489401, 492313, 495589, 498912, 501888, 504422]
63105E04422K050J272L26j75N3N35P97J010J529K132K259J722P92j66q62j079
63089E16617q93o69n49k07N30J220J416J450J970K912L516L468L383M040N517
63074E43721P209Q385Q657Q266Q045Q735J0240J1746J2639J3025J3331J3826J4681
63061F82506J6136J8266K0770K3278K5801K8717L2322L6453M0584M4254M7487
63050A016574N0705N4189N7773O1201O4503O7700P0340P1823P2203P2211P2408
63039A731630P2731P2912P2880P2652P2288P2086P2326P2552P1713O9366O6085
63028B519221O2186N6545M7569L5123K0758N991q953k4595m0923n6956p1176q2237
63016B462553q9619r3927r6313r7414r6900r4118q8955q1960p3961o5719n7813
$$ y = [504422, 506472, 507744, 508070, 507895, 507948, 508483, 509280, 510290, 511819, 513951, 516210, 517932, 518724, 518558, 517696, 516617, 515724, 515055, 514506, 514299, 514829, 516049, 517465, 518915, 520885, 523797, 527313, 530781, 534164, 538204, 543721, 550930, 559315, 567972, 576238, 584283, 593018, 603258, 615004, 627643, 640668, 653999, 667825, 682506, 698642, 716908, 737678, 760956, 786757, 815474, 847796, 884249, 924833, 969087, 1016574, 1067279, 1121468, 1179241, 1240442, 1304945, 1372645, 1442985, 1514808, 1587011, 1659222, 1731630, 1804361, 1877273, 1950153, 2022805, 2095093, 2167179, 2239505, 2312057, 2383770, 2453136, 2519221, 2581407, 2637952, 2685521, 2720644, 2741402, 2747393, 2738440, 2713845, 2672922, 2615966, 2544790, 2462553, 2372934, 2279007, 2182694, 2085280, 1988380, 1894262, 1805307, 1723347, 1649386, 1583667, 1525854]
63005A525854n0415m3144l5387k6993j8665j1474n813r10M330J0017J5095J8595
62993A381090K0728K2372K3850K4736K4832K4703K5037K5825K6442K6226K4791
62982A650632K1970J7843J2783P271J569m359j0681j7486k4683l1984l8926m4966
62970A538983m9623n2679n4344n5103n5279n4697n2905m9715m5564m1371l8027
62959I89676l5787l4013l1742k8673k5468k2962k1311k0237j9662j9567j9405
62948G10849j8447j6823j5561j5327j5654j5753j5518j5173j4447j2861j0726
62937E44559r049q324q013p452o725o280o061n604m772l900l164k342j378p34
62923D70761p78j140j210j077j409k334l104l099k616k286k213k190k347k852
$$ y = [1525854, 1475439, 1432295, 1396908, 1369915, 1351250, 1339776, 1333963, 1333053, 1337383, 1347400, 1362495, 1381090, 1401818, 1424190, 1448040, 1472776, 1497608, 1522311, 1547348, 1573173, 1599615, 1625841, 1650632, 1672602, 1690445, 1703228, 1710499, 1712068, 1707709, 1697028, 1679542, 1654859, 1622875, 1583949, 1538983, 1489360, 1436681, 1382337, 1327234, 1271955, 1217258, 1164353, 1114638, 1069074, 1027703, 989676, 953889, 919876, 888134, 859461, 833993, 811031, 789720, 769483, 749821, 730254, 710849, 692402, 675579, 660018, 644691, 629037, 613284, 597766, 582593, 568146, 555285, 544559, 535510, 527186, 519173, 511721, 504996, 498716, 492655, 487051, 482279, 478379, 475215, 472873, 471495, 470761, 469983, 468843, 467633, 466556, 465147, 462813, 459709, 456610, 453994, 451708, 449495, 447305, 444958, 442106]
62909D42106l265k987k288k101k660l174l081k807k876k911k277j260p86j088
62895D08545j384r34P1Q52R05M18n4j17J07J55j86o42q21o83m74l22j42J87O93
62876D06174J289J670J434N51l98p22l65O4Ln64j266j706j641j047k37K17r2r22
62858D02442j488j202l65J17j37m80j09Q04J403J351J135J095R40M93J74L04M81
62841D06958K27k10l31k37l09m06j65J44j22q70j262q94k63J12L54P30J124J350
62823D05930J555J979K591L155L431L248K729K456K969M013M770M913M895N105
62809D53739N360N525N919O703P381P476P265P339P823Q518R486J0860J2342J3462
62795E69198J4272J5190J6242J7077J7715J8793K0880K4008K7899L2290L6865
$$ y = [442106, 438841, 435854, 433566, 431465, 428805, 425631, 422550, 419743, 416867, 413956, 411679, 410419, 409633, 408545, 407161, 406227, 406298, 407150, 408055, 408473, 408419, 408302, 408409, 408564, 408378, 407736, 406915, 406232, 405758, 405436, 405294, 405481, 406174, 407463, 409133, 410567, 411118, 410720, 409998, 409633, 409697, 409700, 409136, 407870, 406164, 404523, 403476, 403239, 403456, 403364, 402442, 400954, 399752, 399387, 399504, 399367, 398887, 398778, 399582, 400985, 402336, 403471, 404566, 405506, 405999, 406173, 406477, 406958, 407185, 406975, 406644, 406407, 406098, 405692, 405527, 405671, 405549, 404679, 403417, 402523, 402260, 402372, 402726, 403456, 404580, 405930, 407485, 409464, 412055, 415210, 418641, 421889, 424618, 427074, 430043, 434056, 438826, 443739, 448634, 453739, 459099, 464624, 470543, 477246, 484627, 492103, 499368, 506707, 514530, 523048, 532534, 543394, 555736, 569198, 583470, 598660, 614902, 631979, 649694, 668487, 689367, 713375, 741274, 773564, 810429]
62784H10429M1347M5858N0905N6788O3255O9903P6760Q4146R2080R9951J06946
62773A598368J12660J17145J20301J21369J19330J13842J05474R4874Q2011O6520
62763B651894M8541K8778Q000j3072l3410n1811o7589q0804r1674j00067j05787
62752B192999j09013j10190j09619j07435j03910r9507r4606q9288q3471p7257
62742A208703p1079o5408o0235n5045m9462m3911l9280l6018l3721l1585k8970
62731F93989k5567k1502j7444j4280j2369j1297j0496r734q818p353n286l395
62719E46448k528k479k265j422l53P05K168M238O248P608Q849J0889J3586J5880
62705F07572J7392J9000K1609K5063K8697L2295L5974L9533M2666M5621M9045
$$ y = [810429, 851776, 897634, 948539, 1005327, 1068582, 1138485, 1215245, 1299391, 1391471, 1491422, 1598368, 1711028, 1828173, 1948474, 2069843, 2189173, 2303015, 2408489, 2503363, 2585374, 2651894, 2700435, 2729213, 2737213, 2724141, 2690731, 2638920, 2571331, 2490527, 2398853, 2298786, 2192999, 2083986, 1973796, 1864177, 1756742, 1652832, 1553325, 1458719, 1369431, 1285960, 1208703, 1137624, 1072216, 1011981, 956936, 907474, 863563, 824283, 788265, 754544, 722959, 693989, 668422, 646920, 629476, 615196, 602827, 591530, 581034, 571300, 562482, 555129, 549843, 546448, 543920, 541441, 539176, 537754, 537401, 538106, 540274, 544512, 550760, 558368, 567217, 578106, 591692, 607572, 624964, 643964, 665573, 690636, 719333, 751628, 787602, 827135, 869801, 915422, 964467]
62694I64467N3107N7234O0765O3447O5185O5696O4597O1678N6871N0151M1643
62683A604841L1662K0633R006k689j3921k4357l3925m2520m9837n5526n9545o2158
62671A321664o3630o3925o2744n9998n6254n2551m9530m6881m3850m0238l6556
62660G45507l3297l0454k7900k5746k3994k2241k0137j7903j6033j4512j2904
62649E00386j1161r833r241q881q062o864n969n651n426m865m224l915l661k726
62635D09907r45R35K046K173J604O38m51j281j598j532j310q76j40N71P91N98
62619D11130N72R69J418J512J451J813K941M645O264P019O649N826N669O631Q202
62604D72711R757J1272J2972J4750J6411J8149K0325K2909K5656K8729L2654L7498
$$ y = [964467, 1017574, 1074808, 1135573, 1199020, 1264205, 1329901, 1394498, 1456176, 1513047, 1563198, 1604841, 1636503, 1657136, 1666142, 1663453, 1649532, 1625175, 1591250, 1548730, 1498893, 1443367, 1383822, 1321664, 1258034, 1194109, 1131365, 1071367, 1015113, 962562, 913032, 866151, 822301, 782063, 745507, 712210, 681756, 653856, 628110, 604116, 581875, 561738, 543835, 527802, 513290, 500386, 489225, 479392, 470151, 461270, 453208, 446344, 440375, 434724, 429298, 424433, 420209, 416294, 412633, 409907, 408962, 409897, 411943, 414116, 415720, 416358, 415907, 414626, 413028, 411496, 410186, 409310, 409170, 409741, 410532, 411130, 411702, 412671, 414089, 415601, 417052, 418865, 421806, 426451, 432715, 439734, 446383, 452209, 457878, 464509, 472711, 482468, 493740, 506712, 521462, 537873, 556022, 576347, 599256, 624912, 653641, 686295, 723793]
62592G23793M2529M6909N0482N3681N6761N9259O0265N9128N5878N0959M4678
62581A304322L7063K8165J8234P621l258j3781k3314l1598l8700m4445m8348n0321
62569A141640n1039n1213n0826m9516m7401m5049m2765m0442l7987l5383l2408
62558F57611k8831k4973k1563j8925j6728j4714j3136j2287j1877j1291j0222
62547D73064q808p340o086n268m927m842m721m430l983l363k573j763j159q15
62533D12986n41j38L23O40Q58J340K269L204L531L411L828N466P835R875J1193
62518D66080J2267J3632J5374J7352J9486K1748K4214K7122L0522L3854L6263
62507G17914L7432L7702L7350L6138L3780L0437K6463K1984J6962J1468N660l50
$$ y = [723793, 766322, 813231, 863713, 917394, 974155, 1033414, 1093679, 1152807, 1208685, 1259644, 1304322, 1341385, 1369550, 1387784, 1395405, 1392147, 1378366, 1355052, 1323454, 1284754, 1240309, 1191961, 1141640, 1090601, 1039388, 988562, 939046, 891645, 846596, 803831, 763389, 725402, 690019, 657611, 628780, 603807, 582244, 563319, 546591, 531877, 518741, 506454, 494577, 483286, 473064, 464256, 456916, 450830, 445562, 440635, 435793, 431072, 426642, 422659, 419296, 416723, 414960, 413801, 412986, 412445, 412307, 412630, 413270, 414128, 415468, 417737, 420941, 424472, 427883, 431711, 437177, 445012, 454887, 466080, 478347, 491979, 507353, 524705, 544191, 565939, 590153, 617275, 647797, 681651, 717914, 755346, 793048, 830398, 866536, 900316, 930753, 957216, 979200, 996162, 1007630, 1013290, 1012940]
62495A012940o366j1932j6563k0061k2490k3869k4003k2745k0350j7568j5127
62484H11866j3132j1100q668n911k818R47N268Q990J0880J0954J0168Q947O968
62471H33359M344J889j81k734o335j0285j3768j7114k0936k4596k6739k7183k7118
62458F62603k7370k7409k6390k4389k2142k0033j7919j5672j3516j1690j0000
62447D46073p926n319k851j421j069r10k88M81Q66J051J542K281K802L027L272
62432D41611L570L635L278K418Q67j216k938l549l606m283n664o659o790o837
62418D13837p283p267n891l771k353k200k715l216l459l365k964k599k540k477
62404C61737j920r75k47k9n1n4p7j15M9N51J235J803K060J990J784J683J643J380
$$ y = [1012940, 1006574, 994642, 978079, 958018, 935528, 911659, 887656, 864911, 844561, 826993, 811866, 798734, 787634, 778966, 773055, 770237, 771184, 776452, 785442, 796322, 807276, 817444, 826391, 833359, 837703, 839592, 839411, 836677, 830342, 820057, 806289, 789175, 768239, 743643, 716904, 689721, 662603, 635233, 607824, 581434, 557045, 534903, 514870, 496951, 481279, 467763, 456073, 446073, 438147, 432828, 429977, 428556, 427487, 426577, 426289, 426770, 427636, 428687, 430229, 432510, 435312, 438339, 441611, 445181, 448816, 452094, 454512, 455379, 454163, 451225, 447676, 444070, 439787, 434123, 427464, 420674, 413837, 406554, 399287, 393396, 389625, 387272, 385072, 382357, 379141, 375682, 372317, 369353, 366754, 364214, 361737, 359817, 358842, 358595, 358566, 358515, 358461, 358384, 358269, 358318, 358869, 360104, 361907, 363967, 365957, 367741, 369424, 371067, 372447]
62386C72447R57J000J957L376M420M902N260N655N762N499N321N551N949O186
62372D34242O342O668P196P889Q803R880J0825J1497J2182J3253J4810J6827J9340
62359E79754K2211K5046K7795L1117L5597M0686M5004M7800M9577N1063N2003
62348A007653N1387M8588M3809L7532L0061K1743J3296N529j195p046j2316j7187
62336A221854k1807k6399l0967l5051l7896l9011l8534l7076l5238l3245l1066
62325H55564k8731k6385k4032k1506j8958j7145j6752j7470j8209j8322j8157
62314F29897j8174j8110j7477j6446j5602j5030j4249j2981j1431r805q174o813
62302D65605o037n565m710l443k626k765l151k824j846j000n26L6Q97J691K223
$$ y = [372447, 373404, 374404, 376361, 379737, 384157, 389059, 394319, 399974, 405736, 411235, 416556, 422107, 428056, 434242, 440584, 447252, 454448, 462337, 471140, 481020, 491845, 503342, 515524, 528777, 543587, 560414, 579754, 601965, 627011, 654806, 685923, 721520, 762206, 807210, 855010, 904587, 955650, 1007653, 1059040, 1107628, 1151437, 1188969, 1219030, 1240773, 1254069, 1259598, 1258403, 1251357, 1239041, 1221854, 1200047, 1173648, 1142681, 1107630, 1069734, 1030723, 992189, 955113, 919875, 886630, 855564, 826833, 800448, 776416, 754910, 735952, 718807, 702055, 684585, 666376, 648054, 629897, 611723, 593613, 576136, 559690, 544088, 529058, 514809, 501828, 490397, 480592, 472418, 465605, 459568, 454003, 449293, 445850, 443224, 440459, 437308, 434484, 432638, 431638, 431112, 431148, 432045, 433736, 435959]
62287D35959K788L482L772L236K374K182K956M013M545M465M241M216M318M354
62273D86901M323M296M243M131M146M601N537O664P765R031J0811J3115J5631
62260E81195J8163K0888K4037K7503L0986L4464L8261M2508M6736N0232N2693
62249I67666N4162N4361N2514M8116M1573L3786K5407J6824Q553J005o052j3180
62237A284735k0404k7125l2964l8114m2663m6107m7877m7954m6778m4909m2887
62226H46953m0995l8862l5870l2137k8631k5961k3684k1185j8610j6331j4142
62215E50545j1749r589q248p386o107m284k600j385k90Q54J675K023K330L059
62201E08848M319O096Q179R729R758Q336O799O416P263Q522R265Q870P357N628
$$ y = [435959, 438747, 442229, 446001, 449237, 451611, 453793, 456749, 460762, 465307, 469772, 474013, 478229, 482547, 486901, 491224, 495520, 499763, 503894, 508040, 512641, 518178, 524842, 532607, 541638, 552449, 565564, 581195, 599358, 620246, 644283, 671786, 702772, 737236, 775497, 818005, 864741, 914973, 967666, 1021828, 1076189, 1128703, 1176819, 1218392, 1252178, 1277585, 1294409, 1302962, 1303967, 1297915, 1284735, 1264331, 1237206, 1204242, 1166128, 1123465, 1077358, 1029481, 981527, 934749, 889840, 846953, 805958, 767096, 731226, 699089, 670458, 644497, 620813, 599628, 581018, 564687, 550545, 538796, 529207, 520959, 513573, 507466, 503182, 500582, 499197, 498907, 499761, 501436, 503459, 505789, 508848, 513167, 519263, 527442, 537171, 546929, 555265, 562064, 568480, 575743, 584265, 593530, 602400, 609757, 615385]
62187F15385M803N015N380N280M928M549L931L270L395M468N239M506K778J544
62173F74471J354J541J609J929L082N243Q285J1914J5699J9416K3264K7363L1262
62160H26432L4427L6887L8747L9340L7683L3763K8606K3039J7063J0619M263j293
62148A129576n889r926j3946j8249k2611k6329k8840l0246l0949l0966l0061k8474
62136H53090k6782k5026k2561j9036j5007j1369q554o475m852l316j564L84K213
62123G11145L719N031O404Q006R877J1808J3346J4208J4557J4476J3451J0898
62111H36926P122L135l64l163m870n029m083l385l820n091o542p951r059r227
62097G84599q199o540m748k544K49K764M040M432N094O185O733O211N385N201
$$ y = [615385, 620188, 625203, 630583, 635863, 640791, 645340, 649271, 652541, 655936, 660404, 665643, 670149, 672927, 674471, 675825, 677366, 678975, 680904, 683986, 689229, 697514, 709428, 725127, 744543, 767807, 795170, 826432, 860859, 897746, 936493, 975833, 1013516, 1047279, 1075885, 1098924, 1115987, 1126606, 1130869, 1129576, 1123687, 1113761, 1099815, 1081566, 1058955, 1032626, 1003786, 973540, 942591, 911625, 881564, 853090, 826308, 801282, 778721, 759685, 744678, 733309, 724755, 718280, 713428, 710112, 708548, 708932, 711145, 714864, 719895, 726299, 734305, 744182, 755990, 769336, 783544, 798101, 812577, 826028, 836926, 844048, 847183, 846819, 843656, 838786, 833757, 829674, 826289, 822469, 817378, 810836, 802885, 793826, 784599, 776400, 769860, 765112, 762568, 762817, 765581, 769621, 774053, 779147, 785332, 792065, 798276, 803661, 808862]
62083H08862N648O083O213O312O820Q057R970J2015J3461J4117J4500J5196J6248
62070I43502J7374J8446J9438K0086K0035J9401J8867J9029J9818K0762K1648
62059A158406K2595K3503K3872K3326K1919J9642J6048J0980N440R16k276n310
62047A319061r304j4060j8719k3042k7431l1999l6256l9635m1876m2954m2988
62036I90797m2207m0774l8778l6498l4387l2499l0276k7274k3928k1086j8920
62025F44170j6837j4375j1771r612q328q055q576r265r450r044q577q510q658
62012E13112q492p770o814o151n930n717m908l379j615j73Q25J628K532L707M997
61997D75852N833N704M886M285M227L889K373m3k294l766m524m674m343m127m726
$$ y = [808862, 814510, 820593, 826806, 833118, 839938, 847995, 857965, 869980, 883441, 897558, 912058, 927254, 943502, 960876, 979322, 998760, 1018846, 1038881, 1058282, 1077149, 1096178, 1115996, 1136758, 1158406, 1181001, 1204504, 1228376, 1251702, 1273621, 1293263, 1309311, 1320291, 1325731, 1326647, 1324371, 1319061, 1309757, 1295697, 1276978, 1253936, 1226505, 1194506, 1158250, 1118615, 1076739, 1033785, 990797, 948590, 907816, 869038, 832540, 798153, 765654, 735378, 708104, 684176, 663090, 644170, 627333, 612958, 601187, 591575, 583247, 575192, 566616, 557351, 547901, 538857, 530280, 521770, 513112, 504620, 496850, 490036, 483885, 477955, 472238, 467330, 463951, 462336, 462163, 462988, 464616, 467148, 470855, 475852, 481685, 487389, 492275, 496560, 500787, 504676, 507049, 507006, 504712, 500946, 496422, 491748, 487405, 483278, 478552]
61982D78552n952o818o790o329o007n707n018l962k982k465k447k520k127j282
61968D18146q77j637k829k898j499OM85M56R15J628J656R98N28M92K44m00o02
61951D14812K73J691K765L435M286N548O934Q247R538J0724J1620J2470J3910
61938E06253J6160J8560K0299K1348K2314K3455K4295K4269K3427K2292K1334
61927G44006K0684K0180J9412J7967J5756J2999R761N840J338k986o312q485r796
61914H40364j0324r993r042p818o162l575j05L528O768R638J2215J4244J5454
61901H55192J5778J5051J3068J0129P008L966M38l977q634j2505j5269j7293j8895
61888H44057k0141k1131k1912k2267k1997k1230k0124j8627j6929j5720j5374
$$ y = [478552, 472600, 465782, 458992, 452663, 446656, 440949, 435931, 431969, 428987, 426522, 424075, 421555, 419428, 418146, 417269, 415632, 412803, 409905, 408406, 408412, 408897, 409353, 410268, 411896, 413552, 414550, 415078, 415570, 415814, 415414, 414812, 415085, 416776, 419541, 422976, 427262, 432810, 439744, 447991, 457529, 468253, 479873, 492343, 506253, 522413, 540973, 561272, 582620, 604934, 628389, 652684, 676953, 700380, 722672, 744006, 764690, 784870, 804282, 822249, 838005, 851004, 860765, 866605, 867943, 864957, 858645, 850160, 840364, 830040, 820047, 811005, 803187, 797025, 793450, 793345, 796873, 803641, 813279, 825494, 839738, 855192, 870970, 886021, 899089, 909218, 916226, 920192, 920630, 916653, 908019, 895514, 880245, 862952, 844057, 823916, 802785, 780873, 758606, 736609, 715379, 695255, 676628, 659699, 643979, 628605]
61877F28605j5227j4416j3195j2499j2376j1766j0083q098o830o232n451l994
61865E08438k115l84Q18J515K188L349M980O638Q320J0658J3953J7342J9615K0753
61851F16068K2093K4804K8626L2314L5077L7147L8991M0432M0910M0380L9298
61840I96140L7626L4493K9387K3186J7249J1684N485j484p678j1496j3021j3389
61828A108182j3041j1482q453m480j48M366Q813J2575J5128J6398J6325J4455
61816A158638J0421M650j789q070j4127k0263k6404l1860l5790l7962l8946l9489
61804I19009l9725l9125l7270l4480l1569k9120k7135k5270k3278k1197j9238
61793E91602j7497j5790j3872j1824j0104r043q427p731o782n904n372m941m183
$$ y = [628605, 613378, 598962, 585767, 573268, 560892, 549126, 539043, 530945, 524115, 517883, 512432, 508438, 506323, 505939, 506757, 508272, 510460, 513809, 518789, 525427, 533747, 544405, 558358, 575700, 595315, 616068, 638161, 662965, 691591, 723905, 758982, 796129, 835120, 875552, 916462, 956842, 996140, 1033766, 1068259, 1097646, 1120832, 1138081, 1149765, 1155250, 1153766, 1146088, 1134592, 1121571, 1108182, 1095141, 1083659, 1075206, 1070726, 1070578, 1074944, 1083757, 1096332, 1111460, 1127858, 1144183, 1158638, 1169059, 1173709, 1171920, 1163850, 1149723, 1129460, 1103056, 1071196, 1035406, 997444, 958498, 919009, 879284, 840159, 802889, 768409, 736840, 707720, 680585, 655315, 632037, 610840, 591602, 574105, 558315, 544443, 532619, 522515, 513472, 505045, 497314, 490532, 484628, 479256, 474315, 470132]
61780D70132l203k681l089m036m616m272l216k058j310j178j478j654j129L1J045
61765D37288J200O37J13J00M19P15Q92R81R55Q89J059J674K539L201L384L153
61749D59199K679J987R81l05j565k388k665k675k660k518k122j712j547j278l70
61734D43041Q22J152J77j106j461p87L03J562K963L961M019L627L748M282M235
61719D70538L504L195L816M397M133L725M092M688M325L032J844J074Q0j355k644
61704E08444l441m070m678m973m967n051n128m654l797l540m071m192l006j389
61690D51487q31j537k581l372l938m085l461k411j826j938k044j612r50n62m18
61675D19921k59j23k31n77q82q64n03j90n17j567k583k725k097j541j457j462
$$ y = [470132, 466929, 464248, 461159, 457123, 452507, 448235, 445019, 442961, 441651, 440473, 438995, 437341, 436212, 436243, 437288, 438488, 439125, 439238, 439338, 439757, 440472, 441364, 442345, 443300, 444189, 445248, 446922, 449461, 452662, 456046, 459199, 461878, 463865, 464846, 464541, 462976, 460588, 457923, 455248, 452588, 450070, 447948, 446236, 444689, 443411, 443041, 443863, 445015, 445192, 444086, 442625, 441838, 442141, 443703, 446666, 450627, 454646, 458273, 462021, 466303, 470538, 474042, 477237, 481053, 485450, 489583, 493308, 497400, 502088, 506413, 509445, 511289, 512363, 512443, 511088, 508444, 505003, 500933, 496255, 491282, 486315, 481264, 476136, 471482, 467685, 464145, 460074, 455882, 452876, 451487, 450656, 449119, 446538, 443166, 439228, 435143, 431682, 429271, 427445, 425507, 423463, 421851, 420901, 420339, 419921, 419662, 419539, 419308, 418731, 417849, 416985, 416482, 416292, 415775, 414208, 411625, 408900, 406803, 405262, 403805, 402343]
61659D02343j197q19m47J80J068J569J212N34M97J276K172K501K119J202R5n92
61643D13713k48J115K756L823M002L572L057K818K808K677K176J401N34m03j405
61628D42396k310k989l509l877l869l459l091l050k835j836m18M03L74K52N14
61613D12696O81L19j29j99l93j493l247m598n105n341n915o654o926o359n173
61598C62164m109l947m673n302m945l926l283l405l761l877l785l454k705j903
61584C09089j847k552k968k451j768j878k383k127r63O4J74l84j080j747k251
61569B84928k225j563p71m48o26q62q52p07p03q78r45o72l13l40o37l77R16K492
61551B75417L163K712J938J386P48k65j226j476r27qQ60J376J348R01N84Q96J731
$$ y = [402343, 401146, 400327, 399880, 400060, 401128, 402697, 403909, 404443, 404940, 406216, 408388, 410889, 413008, 414210, 414305, 413713, 413465, 414580, 417336, 421159, 425161, 428733, 431790, 434608, 437416, 440093, 442269, 443670, 444204, 443801, 442396, 440086, 437097, 433588, 429711, 425842, 422383, 419292, 416242, 413407, 411571, 411153, 411556, 411930, 412182, 412696, 413377, 413696, 413567, 413368, 412975, 411482, 408235, 403637, 398532, 393191, 387276, 380622, 373696, 367337, 362164, 358055, 354108, 349435, 344133, 339188, 335262, 331979, 328574, 324813, 320936, 317151, 313697, 310992, 309089, 307242, 304690, 301722, 299271, 297503, 295625, 293242, 291115, 290152, 290216, 290390, 290006, 288926, 287179, 284928, 282703, 281140, 280369, 279921, 279295, 278433, 277581, 276874, 276171, 275293, 274348, 273676, 273363, 273023, 272386, 272009, 272925, 275417, 278580, 281292, 283230, 284616, 285364, 285099, 283873, 282397, 281470, 281462, 282322, 283698, 285046, 285947, 286531, 287427, 289158]
61534B89158K419K324J362J35m83j17O80J017P26N07Q71J387J231K66q36j397
61518B99250j401j338j623k142k448k351k202k386k619k227j097K7M73L87L14
61503B78617L43J29m24r56j119r62p91p83q17o13m8O87J286J626J737J572J044
61486B80528L46r2j7M38R67J321J372J249J308J667J886J566J108J224J691J493
61470B98055M27l42J38J256J790J526J083O59m4q28r58k18P42J237J167P34J60
61453C06584j86RN02P05N47O16J183J617J200J56n66l92L68J062J440J696J986
61436C18527K180K199K362L025L957M489M349L915L483K809J781R34P87J050J173
61421C57020J301J913K737K920K291J674J761K311K672K493J838J096Q67J351
$$ y = [289158, 291577, 293901, 295263, 295398, 294915, 294798, 295478, 296495, 297221, 297728, 298599, 299986, 301217, 301483, 300647, 299250, 297849, 296511, 294888, 292746, 290298, 287947, 285745, 283359, 280740, 278513, 277416, 277443, 277916, 278303, 278617, 278960, 279089, 278665, 277709, 276590, 275628, 274837, 274054, 273237, 272624, 272576, 273263, 274549, 276175, 277912, 279484, 280528, 280874, 280782, 280765, 281203, 282170, 283491, 284863, 286112, 287420, 289087, 290973, 292539, 293647, 294871, 296562, 298055, 298482, 298140, 298278, 299534, 301324, 302850, 303933, 304592, 304548, 303720, 302762, 302544, 303286, 304523, 305690, 306424, 306584, 306398, 306407, 306909, 307614, 308161, 308777, 309960, 311577, 312777, 312933, 312367, 311975, 312343, 313405, 314845, 316541, 318527, 320707, 322906, 325268, 328293, 332250, 336739, 341088, 345003, 348486, 351295, 353076, 354010, 354797, 355847, 357020, 358321, 360234, 362971, 365891, 368182, 369856, 371617, 373928, 376600, 379093, 380931, 382027, 382894, 384245]
61407C84245J770J055p01k237k750k776l017l140k509j467j032j496k109k170
61393C61666j775j403j229j102r64r92j321j726j737j244p63q12j121r43j31O47
61377C45050Q87Q17P77O69M19M56J099J900K161J852J486J337J363J570J873J801
61361C65517J058K08J66J042K153L130M209N359O019O056O196O991P917Q202Q016
61346D32239Q122Q585Q618P784O614N845N538N265M835M527M693N342N998N960
61332E19965M861L122J569N50m15j805l312m206m315m143m043l812l236k545k069
61317D96166j740j307p79l76j66J1M35J399K990M731N823O130O586Q128J0414
61302E38445J2102J2264J1009Q919O537M403K840J488k94k357l693l772l386l674
$$ y = [384245, 386015, 387070, 386369, 384132, 381382, 378606, 375589, 372449, 369940, 368473, 367441, 365945, 363836, 361666, 359891, 358488, 357259, 356157, 355193, 354201, 352880, 351154, 349417, 348173, 347410, 346598, 345477, 344534, 344403, 345050, 345937, 346754, 347531, 348200, 348619, 349075, 350174, 352074, 354235, 356087, 357573, 358910, 360273, 361843, 363716, 365517, 366575, 366783, 366949, 367991, 370144, 373274, 377483, 382842, 388861, 394917, 401113, 408104, 416021, 424223, 432239, 440361, 448946, 457564, 465348, 471962, 477807, 483345, 488610, 493445, 497972, 502665, 508007, 514005, 519965, 524826, 527948, 529517, 530067, 529652, 527847, 524535, 520329, 516014, 511871, 507828, 504016, 500780, 498235, 496166, 494426, 493119, 492340, 491964, 491798, 491809, 492244, 493643, 496633, 501364, 507187, 513317, 519903, 528031, 538445, 550547, 562811, 573820, 582739, 589276, 593679, 596519, 598007, 597713, 595356, 591663, 587891, 584505, 580831]
61288E80831m770n897o493o715o978p408p745p564o683n445m391l570k519j089
61274E03564K22J029J613K262K616K227J431R61R77J204J787L117M852N981O211
61259E40054O467P602R225J0289J0396R912R121P918O401N139M650M741M654L824
61245F40393K439J216O19L60k27j381k638l389l524l431l588m213n163n980o125
61230F05368n395m065k600j239k6Q89J254J062P24O26O99N40L4l61j9J205K801
61213F01497M056M565M419L946L322K410J083l48j141p78N08K010L175L852M078
61198F36654M084M434N728P967J0556J2974J5085J6609J6860J5436J2908J0270
61186G69565P975N915M230L387L346L315K668J668Q94K75p43k257l671m512m964
$$ y = [580831, 576061, 570164, 563671, 556956, 549978, 542570, 534825, 527261, 520578, 515133, 510742, 507172, 504653, 503564, 503786, 504815, 506428, 508690, 511306, 513533, 514964, 515925, 516902, 518106, 519893, 523010, 527862, 533843, 540054, 546521, 554123, 563348, 573637, 584033, 593945, 603066, 610984, 617385, 622524, 627174, 631915, 636569, 640393, 642832, 644048, 644667, 645027, 644800, 643419, 640781, 637392, 633868, 630437, 626849, 622636, 617473, 611493, 605368, 599973, 595908, 593308, 592069, 592043, 592932, 594186, 595248, 595972, 596598, 597297, 597837, 597871, 597510, 597491, 598696, 601497, 605553, 610118, 614537, 618483, 621805, 624215, 625298, 624950, 623809, 623031, 623539, 625549, 628724, 632576, 636654, 640738, 645172, 650900, 658867, 669423, 682397, 697482, 714091, 730951, 746387, 759295, 769565, 777540, 783455, 787685, 791072, 794418, 797733, 800401, 802069, 802963, 803238, 802495, 800238, 796567, 792055, 787091]
61171G87091n420n860o052o114o425p033p553p789q076q780r725j0444j0803j1082
61157F75935j1482j1824j1767j1124r944q485p015n529l756j652J77R22L89r17
61143E93928k519m337o253p764q413q320p992p673p129n984m178k169p06j88j68
61128E20135L09J683L479N014O139P057P791Q303Q997J0499J2812J5126J6677
61115F24021J7543J8367J9501K0723K1700K2410K2896K2952K2376K1450K0775
61104H54714K0459J9850J8319J6003J3423J0612P205L303l18l086n292p634j0404
61091I37154j3341j6025j8087j9282j9621j9475j9297j9301j9461j9694j9864
61080G33706j9662j8708j6953j4968j3624j3312j3485j3197j2054j0395q625o832
$$ y = [787091, 781671, 775811, 769759, 763645, 757220, 750187, 742634, 734845, 726769, 717989, 708264, 697820, 687017, 675935, 664453, 652629, 640862, 629738, 619794, 611309, 604294, 598765, 595009, 593357, 593534, 594456, 594845, 593928, 591409, 587072, 580819, 573055, 564642, 556322, 548330, 540657, 533528, 527544, 523366, 521197, 520491, 520303, 520135, 520444, 522127, 525606, 530620, 536759, 543816, 551607, 559910, 568907, 579406, 592218, 607344, 624021, 641564, 659931, 679432, 700155, 721855, 744265, 767161, 790113, 812489, 833939, 854714, 875173, 895023, 913342, 929345, 942768, 953380, 960585, 963888, 963570, 960484, 955192, 947558, 937154, 923813, 907788, 889701, 870419, 850798, 831323, 812026, 792725, 773264, 753570, 733706, 714044, 695336, 678383, 663415, 649791, 636479, 622994, 609797, 597743, 587348, 578723, 571891]
61068E71891n200m145l707l291k471j532p77J14J365K389K668K817L748N174O131
61053E75174O629P504Q749R507R751J0527J2199J3870J5009J6198J7792J9159
61041G22068K0012K1118K2943K4780K6092K7448K9218L0594L0983L1201L2156
61030A018613L3476L4683L6523L9718M3318M5821M7086M7902M8524M9151N0804
61019A495619N4182N8477O2987O8901P7635Q8361R9250J10390J23404J39291J59174
61008B537671J86431K25149K77212L43867M29073N36622O63384P99507R36238
60999F935154J070563J204654J348837J522688J732339J928291J996406J825044
60991A9563976J405556Q62904L73248M8592r8351r9437J6740J99268L31004K63463
$$ y = [571891, 566691, 562546, 558839, 555548, 553077, 551545, 550768, 550882, 552247, 554636, 557304, 560121, 563869, 569043, 575174, 581803, 589307, 598056, 607563, 617314, 627841, 640040, 653910, 668919, 685117, 702909, 722068, 742080, 763198, 786141, 810921, 837013, 864461, 893679, 924273, 955256, 986457, 1018613, 1052089, 1086772, 1123295, 1163013, 1206331, 1252152, 1299238, 1347140, 1395664, 1444815, 1495619, 1549801, 1608278, 1671265, 1740166, 1817801, 1906162, 2005412, 2115802, 2239206, 2378497, 2537671, 2724102, 2949251, 3226463, 3570330, 3999403, 4536025, 5199409, 5998916, 6935154, 8005717, 9210371, 10559208, 12081896, 13814235, 15742526, 17738932, 19563976, 20969532, 21832436, 22205684, 22254276, 22155925, 22056488, 22073228, 22272496, 22603500, 22866963]
60981B2866963p3320n99957j139469j541020j755868j816157j772638j662079
60973A2506455j511519j345551j181982j028588q88111p62790o53219n57417m73636
60964D103642m02131l43103k94968k55443k22738j95155j71084j50061j32453
60955A936506j17844j04913r2939q2002p1779o1720n2612m6216m2883m0969l9016
60944A183613l7058l5341l3283l0515k7703k5489k3640k1886k0670k0300k0176
60933H87552j9557j8475j7338j6218j5030j3862j2744j1593j0562r834r028p679
60921G25632o253n675n700m981l147j419n29N34K707N024N961N802O112P428Q888
60906G40384J0045J1587J3983J6537J8263J8987J9170J9177J9168J9316J9674
$$ y = [22866963, 22793643, 22193686, 21054217, 19513197, 17757329, 15941172, 14168534, 12506455, 10994936, 9649385, 8467403, 7438815, 6550704, 5787914, 5134695, 4577278, 4103642, 3701511, 3358408, 3063440, 2807997, 2585259, 2390104, 2219020, 2068959, 1936506, 1818662, 1713749, 1620810, 1538808, 1467029, 1405309, 1352697, 1306481, 1263598, 1222629, 1183613, 1146555, 1111214, 1077931, 1047416, 1019713, 994224, 970584, 948698, 928028, 907728, 887552, 867995, 849520, 832182, 815964, 800934, 787072, 774328, 762735, 752173, 742339, 733311, 725632, 719379, 713704, 708004, 703023, 699876, 698457, 697928, 698462, 701169, 706193, 712154, 717956, 724068, 731496, 740384, 750429, 762016, 775999, 792536, 810799, 829786, 848956, 868133, 887301, 906617, 926291]
60895I26291J9979J9809J8970J7544J5621J3119J0025O786M128K202J41l011o971
60882A044633j0389j2498j3975j5916j8387k0521k1579k1527k0772j9856j9291
60871H49922j9187j9023j8156j6557j4879j3761j3307j3197j3089j2830j2370
60860F83566j1669j0733r763r060q738q622q537q496q429q070p443p127p519q021
60846E61339p711o675n957o064o391o368o384p001p889q194p662o788o124n894
60832D66237o103o582o961o952o576n945n032l918k956k345j796r43R2Q82J260
60817D12362J361J308J222J351J792K164J966J264P00P89J420K006J936R87m27
60802D32201j398j245j80Q56J100O56K62M35Q53O61n26k061k925k856k432k144
$$ y = [926291, 946270, 966079, 985049, 1002593, 1018214, 1031333, 1041358, 1048144, 1052272, 1054474, 1054615, 1051604, 1044633, 1034244, 1021746, 1007771, 991855, 973468, 952947, 931368, 909841, 889069, 869213, 849922, 830735, 811712, 793556, 776999, 762120, 748359, 735052, 721855, 708766, 695936, 683566, 671897, 661164, 651401, 642341, 633603, 624981, 616444, 607948, 599519, 591449, 584006, 576879, 569360, 561339, 553628, 546953, 540996, 534932, 528541, 522173, 515789, 508788, 500899, 492705, 485043, 478255, 472131, 466237, 460134, 453552, 446591, 439639, 433063, 427118, 422086, 418168, 415212, 412867, 411071, 410128, 410220, 411102, 412362, 413723, 415031, 416253, 417604, 419396, 421560, 423526, 424790, 425490, 426279, 427699, 429705, 431641, 432628, 432201, 430803, 429558, 429378, 430234, 431334, 431990, 432252, 432687, 433540, 434201, 433675, 431614, 428689, 425833, 423401, 421257]
60786D21257j918j707j925k856m025m654m546m094l630l267l226l747m608n087
60772C71967m565l072j290j47k25j249k198k235j483o86k72J1N41J306J993K318
60756C60714K223J870J509J244J069J115J673K727L719M121M078M143M474M716
60742C99395M560M017L097J714L7j445k416l044l607m110m475m788n091n125m677
60727C74042l991l578l614l782l761l603l524l544l489l288l117l147l264l083
60713C25257k300j101j44q3r80k203k937k832k155j400q22l08L46J082J478J080
60697C11978m6j175j536j085m24L0M40J005J463J491J297J359J708J963K012K184
60681C22664K699L351L837M061M049L904L878M120M319M068L607L687M509N330
$$ y = [421257, 419339, 417632, 415707, 412851, 408826, 404172, 399626, 395532, 391902, 388635, 385409, 381662, 377054, 371967, 367402, 364330, 363040, 362893, 362668, 361419, 359221, 356986, 355503, 354817, 354545, 354556, 355097, 356403, 358396, 360714, 362937, 364807, 366316, 367560, 368629, 369744, 371417, 374144, 377863, 381984, 386062, 390205, 394679, 399395, 403955, 407972, 411069, 412783, 412820, 411375, 408959, 405915, 402308, 398198, 393723, 388935, 383844, 378719, 374042, 370051, 366473, 362859, 359077, 355316, 351713, 348189, 344645, 341156, 337868, 334751, 331604, 328340, 325257, 322957, 321856, 321712, 321629, 320649, 318446, 315509, 312677, 310522, 309122, 308300, 307992, 308338, 309420, 310898, 311978, 311932, 310757, 309221, 308136, 307712, 307742, 308182, 309187, 310650, 312141, 313438, 314797, 316505, 318468, 320480, 322664, 325363, 328714, 332551, 336612, 340661, 344565, 348443, 352563, 356882, 360950, 364557, 368244, 372753, 378083]
60667C78083N394M780L949L012J910R51N24N52O21N21J99n01j499k129j798q88
60651C93681l44l84l40J83O82N99J04l74q87j680k500k854k826l104m037n123
60635C70796n566n150m312l544k962k482k142k010j889j418n93K2m3m88n54L3
60619C37698P70J071Q92M80Ql19j36N76J156R37K12r1L24P61O37K81K70M44K83
60600C46254j79m36m20n41p70m37P28J935K175J413N26K82P43J395J609J126L68
60583C55771K2J25j4p65j505j496j020q29p97l8J681L474M542N069N660O420P089
60566C83389P587Q052Q593R247R977J0485J0341R502Q322P000N320L186R52j004
60552D80949k655m002m710m472l463k131q35J78P57J175K071L787N974Q107J0013
$$ y = [378083, 383477, 388257, 392206, 395218, 397128, 398079, 398603, 399155, 399776, 400297, 400496, 399995, 398496, 396367, 394569, 393681, 393337, 392953, 392613, 392796, 393478, 394077, 394181, 393807, 392920, 391240, 388740, 385886, 383060, 379956, 375919, 370796, 365230, 360080, 355768, 352224, 349262, 346780, 344638, 342628, 340739, 339321, 338728, 338750, 338707, 338219, 337665, 337698, 338468, 339539, 340431, 340911, 340919, 340600, 340464, 341040, 342196, 343133, 343345, 343254, 343578, 344339, 344976, 345257, 345527, 345971, 346254, 346075, 345639, 345219, 344678, 343908, 343471, 344199, 346134, 348309, 349722, 350248, 350530, 351273, 352668, 354277, 355403, 355771, 355793, 355918, 355904, 355139, 353634, 352138, 351118, 350289, 349492, 349454, 351135, 354609, 359151, 364220, 369880, 376300, 383389, 390976, 399028, 407621, 416868, 426845, 437330, 447671, 457173, 465495, 472495, 477815, 481001, 481953, 480949, 478294, 474292, 469582, 465110, 461647, 459516, 458681, 458859, 459616, 460791, 462862, 466649, 472623, 480730, 490743]
60537D90743J1631J2713J3207J3568J4088J4238J3204J0979Q333N779L151K60
60525F11894k536m610n709o146o414o625o371n371m182l826m458m953m214k478
60511E44001q09L08J141J812K017J817J910K868M547O493Q609J1167J4400J8214
60497F18495K2193K5864K9122L2366L5998L9792M2908M4554M4457M2849M0132
60486A018730L6447L1365K4125J4421K885r238k0663l0361l7740m2900m6254m7715
60474H93102m6834m4056m1047l8986l7106l3943k9537k5339k2229j9843j7840
60463E36342j6421j5393j3927j1838j0075r305q877p890o513n488m989m757m792
60450D16077n064m955l955k694k392l240m137m094l241k283j595j189j093j302
$$ y = [490743, 502374, 515087, 528294, 541862, 555950, 570188, 583392, 594371, 602704, 608483, 611634, 611894, 609358, 604748, 599039, 592893, 586479, 579854, 573483, 568112, 563930, 560104, 555646, 550693, 546479, 544001, 543192, 543500, 544641, 546453, 548470, 550287, 552197, 555065, 559612, 566105, 574714, 585881, 600281, 618495, 640688, 666552, 695674, 728040, 764038, 803830, 846738, 891292, 935749, 978598, 1018730, 1055177, 1086542, 1110667, 1125088, 1127973, 1118735, 1098072, 1067711, 1029971, 987071, 940817, 893102, 846268, 802212, 761165, 722179, 685073, 651130, 621593, 596254, 574025, 554182, 536342, 519921, 504528, 490601, 478763, 468688, 459383, 450506, 442616, 436103, 430615, 425626, 420869, 416077, 411013, 406058, 402103, 399409, 397017, 393777, 389640, 385546, 382305, 380022, 378427, 377238, 376145, 374843]
60436C74843j454j012Q9J120J179K19o94n15N10J111N55n64j250j222p93j53O24
60419C72593J150J010M45J88N78J177J383J084O39M83P65J173J138M54l94p44
60403C83122n63l34k60k4N59J108J189R22P78R36J139J166J147J362J827K202
60387C96276K136J691J348J530K114K556K523K280K345K866L449L574L131K432
60373D30251J847J511J395J492J782K048K001J680J494J711K035K007J702J641
60359D54597J939J958J186J49k8J026K553L713M523N422O368O918P059P303P852
60344E12538Q181P687O425M903L419J880J13j847l706n000n484n529n860o640
60330E11080p149o677n489m478m051l854l465k946k598k652l188m017m577m323
$$ y = [374843, 373389, 372377, 372466, 373586, 374765, 374984, 374290, 373775, 374285, 375396, 375951, 375387, 374137, 372915, 372122, 371969, 372593, 373743, 374753, 375198, 375386, 375964, 377141, 378524, 379608, 380247, 380730, 381495, 382668, 383806, 384260, 383866, 383122, 382559, 382225, 381965, 381941, 382500, 383608, 384797, 385719, 386497, 387433, 388572, 389738, 390885, 392247, 394074, 396276, 398412, 400103, 401451, 402981, 405095, 407651, 410174, 412454, 414799, 417665, 421114, 424688, 427819, 430251, 432098, 433609, 435004, 436496, 438278, 440326, 442327, 444007, 445501, 447212, 449247, 451254, 452956, 454597, 456536, 458494, 459680, 459829, 459801, 460827, 463380, 467093, 471616, 477038, 483406, 490324, 497383, 504686, 512538, 520719, 528406, 534831, 539734, 543153, 545033, 545146, 543299, 539593, 534593, 529109, 523580, 517720, 511080, 503931, 497254, 491765, 487287, 483236, 479382, 475917, 472971, 470373, 467721, 464533, 460516, 455939, 451616]
60316D51616l302k069r56K12J553K694L214L237L335L975N272P109R232J1272
60302D96394J2916J4221J5531J7010J8197J8172J6312J2860Q561L830j415p006
60290F25583j2046j5491j7041j7151j6391j5129j3587j1835r827p777o280n636
60278D77392n320m651l816l587m028m283l735k732j926j512j435j783k551l378
60264D32655l879l969l652k863j775q60l83j40M9K3k92m72j19N24Q49N84p3p42
60246D15465j025o42K14R12J076R88R99R04L37m54q06n47j36Q9L74J107K201L128
60228D24184L399K907J945R83M20M55J011J708K055J937J826K208K858L142L015
60213D54053L214M198N437O071N921N451N012M592M148L847L971M691N832O779
$$ y = [451616, 448314, 446245, 445289, 445501, 447054, 449748, 452962, 456199, 459534, 463509, 468781, 475890, 485122, 496394, 509310, 523531, 539062, 556072, 574269, 592441, 608753, 621613, 630174, 634004, 632589, 625583, 613537, 598046, 581005, 563854, 547463, 532334, 518747, 506912, 497085, 489308, 483028, 477392, 472072, 467421, 463605, 460018, 455990, 451707, 447972, 445240, 443314, 441802, 440367, 438584, 436033, 432655, 428776, 424807, 421155, 418292, 416517, 415657, 415274, 415134, 415183, 415206, 414914, 414442, 414323, 414847, 415696, 416280, 416207, 415465, 414440, 413798, 414012, 414924, 416000, 416988, 417987, 418891, 419228, 418774, 417968, 417421, 417285, 417374, 417748, 418855, 421056, 424184, 427583, 430490, 432435, 433418, 433838, 434293, 435304, 437012, 439067, 441004, 442830, 445038, 447896, 451038, 454053, 457267, 461465, 466902, 472973, 478894, 484345, 489357, 493949, 498097, 501944, 505915, 510606, 516438, 523217]
60199E23217O883O040M710L378K335J910K225K688K408J416P30Q41R01l8j687
60184E57957l092l888m250m185l789l641m054m265l441k128j627k137k644k570
60170E12246k344k196j671p02r4l86j099j577j795j838j414n04J42j14q85j291
60154D94478r97k47O85J537J938J756J347J037P62N29P28J463K118K165J928J906
60138E13133J858J378R82J563K935L943M117M176M636M913M320L201K377J977
60124E55509J526R24N57N85O55M34N5j05J73P79J368J621J546J439J440J351J032
60107E70889P40O61M22m52j623k218k107k209l159m296m506l736k937k750k874
60092E39845k780k364j733r23l7O41J035J427K048K739L206L324L062K403J535
$$ y = [523217, 530100, 536140, 540850, 544228, 546563, 548473, 550698, 553386, 555794, 557210, 557940, 558781, 559682, 559644, 557957, 554865, 550977, 546727, 542542, 538753, 535112, 531058, 526793, 523352, 521224, 519597, 517460, 514816, 512246, 509902, 507706, 506035, 505333, 505239, 504853, 503754, 502177, 500382, 498544, 497130, 496626, 496768, 496654, 495769, 494478, 493481, 493234, 493919, 495456, 497394, 499150, 500497, 501534, 502296, 502825, 503553, 505016, 507134, 509299, 511227, 513133, 514991, 516369, 517351, 518914, 521849, 525792, 529909, 534085, 538721, 543634, 547954, 551155, 553532, 555509, 557035, 557959, 558516, 559101, 559756, 560190, 560245, 560140, 560313, 561092, 562460, 564081, 565627, 567066, 568506, 569857, 570889, 571629, 572290, 572712, 572260, 570637, 568419, 566312, 564103, 560944, 556648, 552142, 548406, 545469, 542719, 539845, 537065, 534701, 532968, 532045, 532008, 532649, 533684, 535111, 537159, 539898, 543104, 546428, 549490, 551893, 553428]
60077E53428Q32M15Jn75j037j149j255j928l216m616n661o236o405o278o055n867
60061E04398n627n213m756m526m591m746m690m196l240k148j442j296j310j002
60047D55615l24N03J327J979K155J908J928K808M125M828M521L838L498L530L577
60032D95816L478L264K839J960M99j362l107m260m904n643o752p645p557o609
60018D60017n666n265n142m816m125l188k302j896k086k292j837r46n78j133j957
60003D16788k301k170j907j593j214r78j051j271j446j573j499p91O27K090K860
59988D04571K886K614K416K533L138L918L966K743R51j33j48J49M0l72o55p89
59972D27828j053j525j985k200k155k039k016k001j701r90j23N40R66J354J756
$$ y = [553428, 554260, 554675, 554676, 554101, 553064, 551915, 550660, 548732, 545516, 540900, 535239, 529003, 522598, 516320, 510265, 504398, 498771, 493558, 488802, 484276, 479685, 474939, 470249, 466053, 462813, 460665, 459223, 457927, 456617, 455615, 455291, 455794, 457121, 459100, 461255, 463163, 465091, 467899, 472024, 476852, 481373, 485211, 488709, 492239, 495816, 499294, 502558, 505397, 507357, 507856, 506494, 503387, 499127, 494223, 488580, 481828, 474183, 466626, 460017, 454351, 449086, 443944, 439128, 435003, 431815, 429513, 427617, 425531, 423239, 421402, 420456, 419878, 418745, 416788, 414487, 412317, 410410, 408817, 407603, 406625, 405574, 404303, 402857, 401284, 399785, 398994, 399621, 401711, 404571, 407457, 410071, 412487, 415020, 418158, 422076, 426042, 428785, 429736, 429603, 429455, 429604, 429644, 429272, 428617, 427828, 426775, 425250, 423265, 421065, 418910, 416871, 414855, 412854, 411153, 410163, 410040, 410580, 411546, 412900, 414656]
59957D14656K015K002J727J191M37k37l79J43R42J479J569J452J379J299J004
59942D30679N64L90P58J332J409P08k94r17r79p54m26J33R66J716J921J604J335
59925D40145J553J988K039J640J370J597K006K231K481K993L305K847K024J895
59911D70114K708L649M135M476M827M450K780N24j094j783k104k304k156j746
59897D86476j550j623j480q85j56M72J109J719J994K003K383L516M922N866O167
59882E10933O076N729N246N050N513O306O569N857M548L213J937N05r63j968k242
59867E62309k157k320k906l622m283n105o197o998o667n084l131j815j311j057
59853E09656m81N67J951L350M286M525M597N510P619R975J1164J0524Q357N226
$$ y = [414656, 416671, 418673, 420400, 421591, 422028, 421791, 421412, 421555, 422497, 423976, 425545, 426997, 428376, 429675, 430679, 431243, 431633, 432391, 433723, 435132, 435840, 435546, 434629, 433650, 432896, 432470, 432603, 433569, 435285, 437206, 438810, 440145, 441698, 443686, 445725, 447365, 448735, 450332, 452338, 454569, 457050, 460043, 463348, 466195, 468219, 470114, 472822, 476471, 480606, 485082, 489909, 494359, 497139, 497663, 496569, 494786, 492682, 490378, 488222, 486476, 484926, 483303, 481823, 480938, 480782, 481254, 482363, 484082, 486076, 488079, 490462, 493978, 498900, 504766, 510933, 517009, 522738, 527984, 533034, 538547, 544853, 551422, 557279, 561827, 565040, 566977, 567482, 566519, 564551, 562309, 560152, 557832, 554926, 551304, 547021, 541916, 535719, 528721, 522054, 516970, 513839, 512024, 510713, 509656, 509175, 509742, 511693, 515043, 519329, 523854, 528451, 533961, 541580, 551555, 562719, 573243, 581600, 586826]
59839E86826J737j123k271j490K39J745K529K437J148j270l718m874m672m220
59825E73023m277m543m606m743n345o108o376n960n133m151l193k533k317k259
59811E11479k012j666j524j526j385j229j551k440l257l399l045k864l099l303
59797D79179k955k126j349r71q91q88q92q34n30n3M8n72j282j025L04J569J746
59780D68478J112O34P05R16Q59N03q0q15j384j295m48O33J253J179P30M09M53
59763D73842P19R03Q92Q02P22O06N00O49J229K057K697K856K594K279K305K708
59747D98360L062K981K646K563K839L086L090L040K959K486J575Q89R92J511J657
59732E33736J277R07R14J143J286J136N73k12o25k75L84N04l8n22l63K57Q08R89
$$ y = [586826, 588563, 587440, 585169, 583679, 583918, 585663, 588192, 590629, 591777, 590507, 586789, 581915, 577243, 573023, 568746, 564203, 559597, 554854, 549509, 543401, 537025, 531065, 525932, 521781, 518588, 516055, 513738, 511479, 509467, 507801, 506277, 504751, 503366, 502137, 500586, 498146, 494889, 491490, 488445, 485581, 482482, 479179, 476224, 474098, 472749, 471778, 470887, 469999, 469107, 468273, 467743, 467690, 467738, 467166, 465884, 464859, 465163, 466732, 468478, 469590, 470224, 470929, 471845, 472704, 473207, 473127, 472312, 470928, 469633, 469185, 469818, 471071, 472250, 472980, 473389, 473842, 474561, 475464, 476356, 477158, 477880, 478486, 478986, 479635, 480864, 482921, 485618, 488474, 491068, 493347, 495652, 498360, 501422, 504403, 507049, 509612, 512451, 515537, 518627, 521667, 524626, 527112, 528687, 529576, 530568, 532079, 533736, 535013, 535920, 536834, 537977, 539263, 540399, 540972, 540760, 540135, 539860, 540244, 540748, 540710, 540188, 539825, 540082, 540890, 541879]
59714E41879P10rq26j137o75J21N99O15N93R33J541J923J725J128P32R41J590
59697E52383K203K500K534K439K246J881J290O15K03K29K97j61j005j360p99m5
59681E65450Rm89p56o55p80j389k099k690l477m602n596o016n999n863n547m877
59665E14624m014l337k935k589k075j353n51J22N49Q92J415K083K554K618K468
59650E10471K388K397K257J748Q92L2m32n29q30j697k622k740k072j659k250l264
59634E02090l479k503j213p67j406k302k537k077j630j599j652j490j518k189
59620D75728l010l062k368j915k165k361j732o33l3l62j304k320k807k185m70
59605D49001J394K282J969J203P86R63J477J925J998J719J379J169R57N64R6k02
$$ y = [541879, 542589, 542580, 541754, 540617, 539942, 540063, 540662, 541277, 541870, 542803, 544344, 546267, 547992, 549120, 549852, 550793, 552383, 554586, 557086, 559620, 562059, 564305, 566186, 567476, 568091, 568294, 568523, 568820, 568659, 567654, 566294, 565495, 565450, 565459, 564970, 564214, 563559, 562779, 561390, 559291, 556601, 553124, 548522, 542926, 536910, 530911, 525048, 519501, 514624, 510610, 507273, 504338, 501749, 499674, 498321, 497770, 497892, 498441, 499333, 500748, 502831, 505385, 508003, 510471, 512859, 515256, 517513, 519261, 520153, 520185, 519753, 519224, 518394, 516697, 514075, 511335, 509263, 507604, 505354, 502090, 498611, 496108, 494895, 494128, 492722, 490420, 487883, 485806, 484176, 482577, 480925, 479435, 477917, 475728, 472718, 469656, 467288, 465373, 463208, 460847, 459115, 458482, 458449, 458087, 456783, 454463, 451656, 449471, 449001, 450395, 452677, 454646, 455849, 456635, 457598, 459075, 461000, 462998, 464717, 466096, 467265, 468222, 468786, 468882, 468680]
59589D68680k62k04j49j15J8M79J230J652J029m66j792k240k127j971j647r46
59573D61169m61j030k481l644l654k679j454o11m29p01q56o34n69j208k073k059
59557D36626r27L41Q17N07j40p97j021k67J290K573K832K531K506K844L277M116
59541D57108N829Q014R717J0719J1657J3031J4964J7654K0757K2208J9265J1695
59529F22618K909l167n697o472o769o213m554k803j986j832j477p68k41l44j292
59514E81912l167n523p246p539o945o762p481q369q575q074p416o954o610o073
59500D85178n112l846k843k677l259l778l527k616j732j262r13k68N45R48O75
59485D55513J08k43l62m56l40M05J561K255K107J931K703M176N180N137M650M482
$$ y = [468680, 468418, 468214, 468065, 467950, 467968, 468447, 469677, 471329, 472358, 471892, 470100, 467860, 465733, 463762, 462115, 461169, 460708, 459678, 457197, 453553, 449899, 447220, 445766, 445155, 444726, 444025, 443169, 442535, 441966, 440758, 438685, 436626, 435699, 436040, 436857, 437364, 437224, 436427, 435406, 435139, 436429, 439002, 441834, 444365, 446871, 449715, 452992, 457108, 462937, 470951, 480668, 491387, 503044, 516075, 531039, 548693, 569450, 591658, 610923, 622618, 625527, 622360, 616663, 610191, 603422, 597209, 592655, 589852, 587866, 586034, 584557, 583789, 583548, 583204, 581912, 578745, 573222, 565976, 558437, 551492, 544730, 537249, 528880, 520305, 512231, 504815, 497861, 491251, 485178, 480066, 476220, 473377, 470700, 467441, 463663, 460136, 457520, 455788, 454526, 453613, 453345, 453890, 454838, 455513, 455621, 455378, 455016, 454560, 454220, 454625, 456186, 458441, 460548, 462479, 465182, 469358, 474538, 479675, 484325, 488807]
59469D88807M558M290L441K318J288M99No2L91J261K215K940L389L780M304M871
59453E28295N272N489N773O320P005P444P304O569N433M013K311M50j245k653
59439E87780m025n456o459o553o089n865n899n387m032k648k043j958j622p90
59425E28954K85J473K731L832M712N831P657R970J2108J3672J4652J5162J5441
59412F36480J5804J6364J7154J8453K0025J9878J5238N887m569j1968j5263j5865
59400G17618j4683j1715p678l657N86N548R173P681J69r632j7220k1182k2336
59387F32672k1228j8316j5178j3340j2459j1129r022o935n257l707k282j238l57
59374E12224P38J788K357K745L434M061M007L665L906M521M505L927M142N805
$$ y = [488807, 493365, 497655, 501096, 503414, 504702, 505201, 505206, 505144, 505535, 506796, 509011, 511951, 515340, 519120, 523424, 528295, 533567, 539056, 544829, 551149, 558154, 565598, 572902, 579471, 584904, 588917, 591228, 591678, 590433, 587780, 583755, 578299, 571840, 565287, 559198, 553333, 547434, 542047, 538015, 535367, 533324, 531366, 529744, 528954, 529239, 530712, 533443, 537275, 541987, 547818, 555475, 565445, 577553, 591225, 605877, 621039, 636480, 652284, 668648, 685802, 704255, 724280, 744158, 759396, 765283, 760714, 748746, 733483, 717618, 702935, 691220, 683542, 679885, 680471, 686019, 695192, 702873, 703042, 693410, 676190, 655008, 632672, 611444, 593128, 577950, 564610, 552151, 541022, 532000, 525065, 519808, 516101, 513819, 512581, 512224, 512962, 514750, 517107, 519852, 523286, 527347, 531354, 535019, 538925, 543446, 547951, 551878, 556020, 561825]
59360E61825P798Q648Q215P436P030P078P448Q092R026J0236J1621J2956J4034
59347F81443J4793J5149J4948J4244J3446J2877J2421J1812J0966R732P726M809
59335H24366J425j892m964p538r009r281r408j0546j2467j3865j4023j3350j2484
59322G06964j1577j0589r560q457p283o401o222o554o687o178n198m192l493l081
59308F11492k417q66J332K986L492L886N555Q279J0567J1768J2672J3942J4911
59295F97599J4204J0960N366j288p098j0819j2768j3896j4311j3603j2301j1498
59283F30547j1042r575o876m664m194m369l372j230O04J555K485M097N982P438
59269F07386Q303Q730Q745Q358P713O941O032M924L555J877m4k024l935n712p148
$$ y = [561825, 569623, 578271, 586486, 593922, 600952, 608030, 615478, 623570, 632596, 642832, 654453, 667409, 681443, 696236, 711385, 726333, 740577, 754023, 766900, 779321, 791133, 802099, 811831, 819557, 824366, 825791, 823899, 818935, 811397, 802388, 793107, 783699, 773153, 760686, 746821, 732798, 719448, 706964, 695387, 684798, 675238, 666781, 659498, 653097, 646875, 640321, 633634, 627456, 622258, 618066, 614573, 611492, 609075, 608209, 609541, 612527, 616019, 619905, 625460, 633739, 644306, 656074, 668746, 682688, 697599, 711803, 722763, 728129, 726841, 719743, 708924, 696156, 682260, 667949, 654346, 642045, 630547, 619505, 609930, 603054, 598390, 594196, 589827, 586455, 585225, 585829, 587384, 589869, 593966, 599948, 607386, 615689, 624419, 633164, 641522, 649235, 656176, 662208, 667132, 670687, 672564, 672520, 670496, 666561, 660849, 653701]
59254F53701p953q172q269q549q754q464p701o855o161n499m605l357j909o24
59240E66829L24J217K410L717M519M612M431M365M299M049L705L184J999m6k199
59225F07415l453l733l902m633n688o320o072n159m303m079m289m025k725r77
59211E48057L1j56p97q81j91P11J282J474J537J567J488J350J425J854K358K469
59195E63578K066J536J393J782K337K473J880Q61J16O4M71P85P66N97N43P33J095
59178E83076J345J152N74J27K07O64J168J766K635L590M347N090O156P301P898
59163F27096P878P734P581O898N483L948K894K186J415N77k17j231k706m236n113
59148F60187n197m990m917n006n220n665o233o502o192n608n282n233m952m206
$$ y = [653701, 645748, 637576, 629307, 620758, 612004, 603540, 595839, 588984, 582823, 577324, 572719, 569362, 567453, 566829, 567153, 568370, 570780, 574497, 579016, 583628, 588059, 592424, 596723, 600772, 604477, 607661, 609660, 609614, 607415, 603962, 600229, 596327, 591694, 586006, 579686, 573614, 568455, 564152, 560073, 555784, 551759, 549034, 548057, 548088, 547932, 547135, 546254, 546063, 546774, 548056, 549530, 551067, 552634, 554122, 555472, 556897, 558751, 561109, 563578, 565644, 567180, 568573, 570355, 572692, 575165, 577045, 577906, 578022, 578086, 578557, 579342, 580108, 580705, 581248, 581981, 583076, 584421, 585573, 586147, 586274, 586481, 587145, 588313, 590079, 592714, 596304, 600651, 605741, 611897, 619198, 627096, 634974, 642708, 650289, 657187, 662670, 666618, 669512, 671698, 673113, 673690, 673473, 672242, 669536, 665300, 660187, 654990, 650000, 645083, 640077, 634857, 629192, 622959, 616457, 610265, 604657, 599375, 594142, 589190, 584984]
59134E84984l569l705m362m575l919k973k412k217k094k052k059j654n54P73J780
59119E51392K635L699M672N139N547O629Q079Q933R166R674J0614J1033J0419
59106F47631R430Q643P771O666N938N810N386L957K214J216Q39K10q05j538j660
59091G01708j523j526j773k180k402j984j086o44j279k487l431m055m718n272
59077F67348n396n438o008o910p380p235o906o513n838n162n157n703n781m849
59063E83072l658l236l664m247m493m463m395m316m049l478k817k514k664k763
59049E32315k349j766j754k326k599j931q04k12m54q34n68K64P99M16m98j032
59033E16667q34l15K12J007K249L477M225M802N826P193Q138Q310Q239Q719J0027
$$ y = [584984, 581415, 577710, 573348, 568773, 564854, 561881, 559469, 557252, 555158, 553106, 551047, 549393, 548839, 549612, 551392, 554027, 557726, 562398, 567537, 573084, 579713, 587792, 596725, 605891, 615565, 626179, 637212, 647631, 657061, 665704, 673475, 680141, 686079, 691889, 697275, 701232, 703446, 704662, 705501, 705711, 704906, 703368, 701708, 700185, 698659, 696886, 694706, 692304, 690320, 689234, 688590, 687311, 684824, 681393, 677338, 672620, 667348, 661952, 656514, 650506, 643596, 636216, 628981, 622075, 615562, 609724, 604562, 599405, 593702, 587921, 583072, 579414, 576178, 572514, 568267, 563774, 559311, 554916, 550600, 546551, 543073, 540256, 537742, 535078, 532315, 529966, 528200, 526446, 524120, 521521, 519590, 518786, 518574, 518120, 517286, 516718, 516982, 517781, 518197, 517699, 516667, 515833, 515518, 515730, 516737, 518986, 522463, 526688, 531490, 537316, 544509, 552647, 560957, 569196, 577915, 587942]
59018E87942J1716J2846J2616J1098R236P743O291M249J853j01j464k692l616
59005F57717l324j635K21J075J267J939L313M542N111N431N890O005N030L028
58991F95610Q89o16j423j869k219k615l184l895m464m676m752n116n774o125n468
58976F44303l620j056J401L098M021M691N567O654P824R166J0562J1347J1040
58963G14998J0269J0163J0816J1150J0463R230Q044O643M583K103l27k800n531
58950G89804q167j0223j1810j3186j3981j3711j2829j2274j2106j1452r896q121
58938F52048o877o040n045l799k751k368k769l597m181l969l054k134j901k509
58924F01054l568m449m627m028l079k343k067k035j771r25L04J211J351J228J731
$$ y = [587942, 599658, 612504, 625120, 636218, 645454, 653197, 659488, 663737, 665590, 665489, 664025, 661333, 657717, 654393, 652758, 652979, 654054, 655321, 657260, 660573, 665115, 670226, 675657, 681547, 687552, 692582, 695610, 696499, 695883, 694460, 692591, 690372, 687757, 684573, 680678, 676214, 671538, 666786, 661670, 655896, 649771, 644303, 640683, 639627, 641028, 644126, 648147, 652838, 658405, 665059, 672883, 682049, 692611, 703958, 714998, 725267, 735430, 746246, 757396, 767859, 777089, 785133, 791776, 796359, 798462, 798135, 795335, 789804, 781637, 771414, 759604, 746418, 732437, 718726, 705897, 693623, 681517, 670065, 660169, 652048, 645171, 639131, 634086, 630287, 627536, 625168, 622399, 618802, 614621, 610652, 607598, 605464, 603563, 601054, 597486, 593037, 588410, 584382, 581303, 578960, 576893, 574858, 573087, 572162, 572466, 573677, 575028, 576256, 577987]
58909E77987K816L490L240K789K985L667M298N034O326P959R395J0743J2351J3673
58895F66753J3617J2219J0949J1028J2143J3221J3830J4365J5219J6307J7324
58884H16975J8100J8593J8586J7606J5350J2177Q831N561K004j862n295p761r748
58871I09117j1910j3890j4805j4629j4114j3551j2573j1210j0141r672r268q541
58859G64813p970q127q704q900q536q271q710r640j0288j0153r421q522p546o429
58845F43596n480n185n391n391n054n173o167p150p008n908m953m704m791m755
58831E66486m520m168l850l736l565k707j200k09n73j454j406l71N63J038J748
58816E42076K971M040M504M639M607M123L240K569K393K419K535K931L340L089
$$ y = [577987, 580803, 584293, 587533, 590322, 593307, 596974, 601272, 606306, 612632, 620591, 629986, 640729, 653080, 666753, 680370, 692589, 703538, 714566, 726709, 739930, 753760, 768125, 783344, 799651, 816975, 835075, 853668, 872254, 889860, 905210, 917387, 926218, 931779, 933783, 931921, 926626, 918865, 909117, 897207, 883317, 868512, 853883, 839769, 826218, 813645, 802435, 792294, 782622, 773354, 764813, 756843, 748716, 740012, 731112, 722576, 714305, 705595, 695955, 685667, 675514, 666093, 657571, 650025, 643596, 638116, 632931, 627540, 622149, 617095, 611922, 605755, 598605, 591597, 585689, 580736, 576032, 571241, 566486, 561966, 557798, 553948, 550212, 546647, 543940, 542740, 542531, 541958, 540504, 539098, 538727, 539290, 540328, 542076, 545047, 549087, 553591, 558230, 562837, 566960, 570200, 572769, 575162, 577581, 580116, 583047, 586387, 589476]
58802E89476K161J209M20o45j879k484k401k673l825m942n058m445l822l187k328
58787E55577j688j752k072j747n67R56K343L322L698L556L297L130K879K622K811
58772E76365L311L028J197j493l705m974n745o414p042p652q062p679o144m083
58758E20908k570j963j757j436r66m91j8N24J162J840K307K310J939J659J782
58743E25230K262L015M059N134N697N567N183M936M718M417M380M954N876O575
58729E92003O775O485N791M983M554M635M665M018K790J686J244J485K104K810
58715F46028L522M371N382O210O482O334O200O075N460M045K002l79k801m775
58701F94156o007p078q933j1594j3950j5097j5215j4953j4588j4069j3188j1633
$$ y = [589476, 591637, 592846, 593266, 592621, 590742, 588258, 585857, 583184, 579359, 574417, 569359, 564914, 561092, 557905, 555577, 553889, 552137, 550065, 548318, 547751, 548707, 551050, 554372, 558070, 561626, 564923, 568053, 570932, 573554, 576365, 579676, 582704, 583901, 582408, 578703, 573729, 567984, 561570, 554528, 546876, 538814, 531135, 524991, 520908, 518338, 516375, 514618, 513182, 512216, 511725, 511707, 512231, 513393, 515233, 517540, 519850, 521789, 523448, 525230, 527492, 530507, 534566, 539700, 545397, 550964, 556147, 561083, 565801, 570218, 574598, 579552, 585428, 592003, 598778, 605263, 611054, 616037, 620591, 625226, 629891, 633909, 636699, 638385, 639629, 641114, 643218, 646028, 649550, 653921, 659303, 665513, 671995, 678329, 684529, 690604, 696064, 700109, 702111, 701732, 698931, 694156, 688149, 681071, 672138, 660544, 646594, 631497, 616282, 601329, 586741, 572672, 559484, 547851]
58689E47851r479p704p254p612p249n751m291l728l468k881k454k718l127l037
58675D77098k812k867k527j062Q65K081K673L626N094O333P124P919Q729Q931
58661E21205Q360P542O766N697M105K252M15j320k733l517l761l875m014l962
58647E33160l617l188k936l025l464l891l699k738j682j261j388j409r40n0J085
58632E00957K172K706K404J603R33P47J110J962K906L270K785J913J226Q89J010
58617E28593J842L115L920L845L700M379N463N762M897L594K587J928J262L74
58603E75261n52r67o11j90p26k060k868k525j969k068k268j747r56p58q14j16
58587E54066J398K973M387N927P340Q072Q321Q715R125Q910Q203P704P360O476
$$ y = [547851, 538372, 530668, 523414, 515802, 508553, 502802, 498511, 494783, 491315, 488434, 485980, 483262, 480135, 477098, 474286, 471419, 468892, 467830, 468695, 470776, 473449, 477075, 482169, 488502, 495626, 503545, 512274, 521205, 529565, 537107, 543873, 549570, 553675, 555927, 556342, 555022, 552289, 548772, 545011, 541136, 537122, 533160, 529543, 526355, 523419, 520394, 516930, 513039, 509340, 506602, 504920, 503659, 502271, 500862, 499922, 499872, 500957, 503129, 505835, 508239, 509842, 510775, 511522, 512632, 514594, 517500, 520770, 523555, 525468, 526694, 527583, 528593, 530435, 533550, 537470, 541315, 545015, 549394, 554857, 560619, 565516, 569110, 571697, 573625, 574887, 575261, 574709, 573742, 573131, 572941, 572215, 570155, 567287, 564762, 562793, 560725, 558457, 556710, 555754, 554996, 554182, 554066, 555464, 558437, 562824, 568751, 576091, 584163, 592484, 601199, 610324, 619234, 627437, 635141, 642501, 648977]
58573F48977N215M749N568O735P187P043P204Q337J0545J3445J6351J8720K0561
58560G80637K2075K3055K3111K2292K0944J9072J6361J2776Q694M644J297o83
58548I54275j282j357j721k382l072l934n147o500q040j0394j3607j6471j7978
58535H62390j8734j9761k0606k0003j7920j5496j3238j0777q249o462n555m736
58523G00853l525k125o05J190K810L393K877K031J266L62o46j325j648j964k172
58508G00772j903j476j649k406l026l305l661m020l787l026k513k487k374j935
58494F63204j629j678j736j635j496j000M18K458M001M466M389M556N386P035
58480F86739R258J1290J2665J3930J5581J6747J6168J4070J1651R057N468J085
$$ y = [648977, 654192, 658941, 664509, 671244, 678431, 685474, 692678, 701015, 711560, 725005, 741356, 760076, 780637, 802712, 825767, 848878, 871170, 892114, 911186, 927547, 940323, 949017, 953661, 954958, 954275, 952993, 951636, 949915, 947533, 944461, 940527, 935380, 928880, 920840, 910446, 896839, 880368, 862390, 843656, 823895, 803289, 783286, 765366, 749870, 736632, 725855, 717606, 711144, 705589, 700853, 697328, 695203, 694598, 695788, 698598, 701991, 704868, 706899, 708165, 708527, 707881, 706556, 704908, 702944, 700772, 698869, 697393, 695744, 693338, 690312, 687007, 683346, 679326, 675539, 672513, 670000, 667513, 665139, 663204, 661575, 659897, 658161, 656526, 655030, 654030, 654448, 656906, 660907, 665373, 669762, 674318, 679704, 686739, 695997, 707287, 719952, 733882, 749463, 766210, 782378, 796448, 808099, 817156, 822624, 823709]
58468H23709k720n379p514r211r576q403o714n156l372j356J03R57K300M574O787
58453G79029Q167R155J0032R953Q304N791L282P12k029m186n193n725o714p894
58439H02684q165o964m770k646j552j515j411k76J317K094K112K684M263N952
58425G93807P248Q773J0759J2331J2839J2596J1736R766O828M044J948j61k674
58412H89840m853o127o913p467p324o551o190o651o933o246n076l956k538p26
58398H12289O99J442K388L984N240N357N028N073N066M361L320K473J543L27n64
58383H58026q26j210k140k730k174j002pR96K335L504M075M536N313N995O398
58368H81089P087Q095Q494Q213Q754J0830J2837J3049J2075J1564J1714J1639
$$ y = [823709, 820989, 815610, 808096, 798885, 789309, 780906, 774192, 769036, 765664, 764308, 764411, 765368, 767668, 772242, 779029, 787196, 796351, 806383, 816336, 824640, 830431, 833713, 834425, 832396, 828210, 823017, 817292, 810578, 802684, 794519, 787555, 782785, 780139, 778587, 777072, 775661, 775385, 776702, 778796, 780908, 783592, 787855, 793807, 801055, 809828, 820587, 832918, 845757, 858353, 870089, 879855, 886683, 890727, 892675, 892514, 889840, 884987, 878860, 871947, 864480, 857156, 850605, 844415, 837764, 830831, 824585, 819509, 815553, 813015, 812289, 812988, 814430, 816818, 820802, 826042, 831399, 836427, 841500, 846566, 850927, 854247, 856720, 858263, 858590, 858026, 857200, 855990, 853850, 851120, 848946, 847944, 847937, 848933, 851268, 854772, 858847, 863383, 868696, 874691, 881089, 888176, 896271, 904765, 912978, 921732, 932562, 945399, 958448, 970523, 982087, 993801, 1005440]
58356A005440J1161J0607R672Q025O344N467N121M696M410M605M732M313M088
58343A088681N032O881Q672J0061J1090J1581J1694J2262J3648J5133J6167J7149
58331A228051J8204J8502J7641J6480J5645J4543J2776J1058R765Q149O061M787
58319A381662M978N406N068M851N732P044Q030R309J1258J2697J2913J3231J4798
58306A496977J6525J7158J7602J9118K0854K1378K1212K1575K2027K1508K0519
58295A716453K0110K0016J9716K0027K1548K3012K3266K3409K4876K6898K8192
58284A967523K9465L1827L4200L4952L4693L4957L5437L5033L4136L3446L2015
58273B337684K9159K6688K6548K7839K8982L1052L5749M1751M6521N0347N5120
$$ y = [1005440, 1016601, 1027208, 1036880, 1044905, 1051249, 1056716, 1061837, 1066533, 1070943, 1075548, 1080280, 1084593, 1088681, 1093713, 1100594, 1109266, 1119327, 1130417, 1141998, 1153692, 1165954, 1179602, 1194735, 1210902, 1228051, 1246255, 1264757, 1282398, 1298878, 1314523, 1329066, 1341842, 1352900, 1362665, 1370814, 1376875, 1381662, 1386640, 1392046, 1397114, 1401965, 1407697, 1414741, 1422771, 1432080, 1443338, 1456035, 1468948, 1482179, 1496977, 1513502, 1530660, 1548262, 1567380, 1588234, 1609612, 1630824, 1652399, 1674426, 1695934, 1716453, 1736563, 1756579, 1776295, 1796322, 1817870, 1840882, 1864148, 1887557, 1912433, 1939331, 1967523, 1996988, 2028815, 2063015, 2097967, 2132660, 2167617, 2203054, 2238087, 2272223, 2305669, 2337684, 2366843, 2393531, 2420079, 2447918, 2476900, 2507952, 2543701, 2585452, 2631973, 2682320, 2737440]
58262B737440O0348O4007O6319O9102P2229P4133P5110P6717P8733P9878Q0684
58251C534700Q2567Q5048Q7041Q9676R4591J00738J06191J11654J18708J26235
58241D537149J32453J38768J47560J57714J66598J74878J84927J96097K06263
58232F042407K16562K29747K45231K60643K76828K96182L17662L38810L61158
58223H585230L88066M18768M50355M83959N22912N66600O12614O63101P22121
58214A3413726P88788Q60339R39981J033820J142293J263200J400951J563700
58206B2406798J754114J973373K231700K543623K916261L356144L886176M543001
58198D5611190N362986O390323P697673R379386J1527798J4240422J7640386K1832610
$$ y = [2737440, 2797788, 2861795, 2928114, 2997216, 3069445, 3143578, 3218688, 3295405, 3374138, 3454016, 3534700, 3617267, 3702315, 3789356, 3879032, 3973623, 4074361, 4180552, 4292206, 4410914, 4537149, 4669602, 4808370, 4955930, 5113644, 5280242, 5455120, 5640047, 5836144, 6042407, 6258969, 6488716, 6733947, 6994590, 7271418, 7567600, 7885262, 8224072, 8585230, 8973296, 9392064, 9842419, 10326378, 10849290, 11415890, 12028504, 12691605, 13413726, 14202514, 15062853, 16002834, 17036654, 18178947, 19442147, 20843098, 22406798, 24160912, 26134285, 28365985, 30909608, 33825869, 37182013, 41068189, 45611190, 50974176, 57364499, 65062172, 74441558, 85969356, 100209778, 117850164, 139682774]
58190A39682774K6790216L2256107L7684023M2154104M4321260M2661725L6155456
58183D01705665K5049757J1059521l277929j5677559k4881241l0735015l3742222
58176C29500977l4551222l3703838l1651864k8841286k5701854k2560834j9600304
58169A32889775j6901737j4507104j2433130j0662632r157411p881562o803971
58162E4542228n889702n105865m433022l859805l370452k947787k583801k276066
58154B4075728k016062j790799j593984j426109j284421j161090j050776r52628
58146A2799859q64912p84210p09925o43855n85353n31788m83045m40730m03851
58137G352190l70121l40547l17749l00373k83934k66750k50528k35648k20442
$$ y = [139682774, 166472990, 198729097, 236413120, 278567224, 322888484, 365550209, 401705665, 426755422, 437814943, 434537014, 418859455, 393978214, 363243199, 329500977, 294949755, 261245917, 229594053, 200752767, 175050913, 152490079, 132889775, 115988038, 101480934, 89047804, 78385172, 69227761, 61346199, 54542228, 48652526, 43546661, 39113639, 35253834, 31883382, 28935595, 26351794, 24075728, 22059666, 20268867, 18674883, 17248774, 15964353, 14803263, 13752487, 12799859, 11934947, 11150737, 10440812, 9796957, 9211604, 8679816, 8196771, 7756041, 7352190, 6982069, 6641522, 6323773, 6023400, 5739466, 5472716, 5222188, 4986540, 4766098]
58128D766098k04967j91213j79422j67938j56627j46967j38811j30479j21979
58119C327695j14892j09198j03310r7047r1647q7005q1796p6124p1355o7577o3783
58108B363961o0112n7422n5154n2250m9596m8877m9547m9639m9053m9223n0065
58097A793023n0097m9399m9505n0371n0140m8023m5022m1786l8035l4203l1304
58086A305138k9094k6444k3558k1783k1277k0912k0398k0500k1194k1564k1481
58075A056933k1570k1672k1111k0235j9858j9519j8148j6150j4922j4583j4114
58064H55051j3375j2916j2232j0435q444q175r548j0508j0177r784j0259j0988
58052G28210j1325j1483j1365j0320q489o926o075n486n126n490o275o518o149
$$ y = [4766098, 4561131, 4369918, 4190496, 4022558, 3865931, 3718964, 3580153, 3449674, 3327695, 3212803, 3103605, 3000295, 2903248, 2811601, 2724596, 2642800, 2566676, 2495321, 2427744, 2363961, 2303849, 2246427, 2191273, 2139023, 2089427, 2040550, 1991003, 1941364, 1892311, 1843088, 1793023, 1742926, 1693527, 1644022, 1593651, 1543511, 1495488, 1450466, 1408680, 1370645, 1336442, 1305138, 1276044, 1249600, 1226042, 1204259, 1182982, 1162070, 1141672, 1121172, 1099978, 1078414, 1056933, 1035363, 1013691, 992580, 972345, 952487, 932968, 914820, 898670, 883748, 869165, 855051, 841676, 828760, 816528, 806093, 797649, 789474, 779926, 769418, 759241, 749457, 739198, 728210, 716885, 705402, 694037, 683717, 675228, 668302, 662227, 656741, 651615, 646125, 639850, 633332, 627183]
58039F27183n973o070n754n105n027n611n962n800n790o277p005q078r695j1045
58025E33991j0968r818r025q870q268o898n839n799o202o361o228n726m658l510
58011D35821l051l070k674j864j468j546j317p00m27n50k95M31Q00N67M37P37
57995D21831R82Q68N72k8j137k087j971j160q35j156j332j336j852k611k598k031
57979D04119k233l332l942l521l181l615l993l627l047k730k304j705j665k204
57965C63020k185j120j62l62j231j756j788j597j165o57n85r03q69m12n15j634
57949C46079k788k902k101j097k40K83L20L30J157K813M408N582O803P985Q192
57934C74824P338O770P386Q421Q846Q760Q563P908O534N090M142L117J262j088
$$ y = [627183, 621210, 615140, 609386, 604281, 599254, 593643, 587681, 581881, 576091, 569814, 562809, 554731, 545036, 533991, 523023, 513205, 504180, 495310, 487042, 480144, 474305, 468506, 462304, 455943, 449715, 443989, 439331, 435821, 432770, 429700, 427026, 425162, 423694, 422148, 420831, 420131, 419704, 419154, 418859, 419290, 420090, 420657, 421094, 421831, 422813, 423681, 424253, 424225, 423088, 421001, 419030, 417870, 417035, 415879, 414547, 413211, 411359, 408748, 406150, 404119, 401886, 398554, 394612, 391091, 387910, 384295, 380302, 376675, 373628, 370898, 368594, 366889, 365224, 363020, 360835, 359715, 359553, 359191, 357960, 356204, 354416, 352819, 351654, 350997, 350412, 349509, 348640, 348228, 347713, 346079, 343291, 340389, 338288, 337191, 336951, 337234, 337554, 337884, 339041, 341854, 346262, 351844, 358647, 366632, 374824, 382162, 388932, 396318, 404739, 413585, 422345, 430908, 438816, 445350, 450440, 454582, 457699, 458961, 457873]
57920D57873l030m270n107n782o477p373q209q393p902p359o971o277n275m688
57906C70760m683m435l565k902l163l886m432m921n523n752n341m840m547l808
57892C08962k204n37K98O57J400K540L458L887L868L351K513J925J813J800J777
57877C35508K184K862K689J186n28j239j243j549k233k615k444k036j699j712
57863C27131k326l132l221k426j664j432j014Q0J030J043P04R08J332J180O96
57848C18889O51R29Q28L29r5m83j130j774k054k307k961l593l584l209l164l432
57832B93840l563l540l424k732j290n7L5m58l51L54Q11R95J571K379K495J859
57816B88924J473J871K529K939L171L165K441Q29j166k937m142m570m296l890
$$ y = [457873, 454843, 450573, 445466, 439684, 433207, 425834, 417625, 409232, 401330, 393971, 387000, 380723, 375448, 370760, 366077, 361642, 358077, 355175, 352012, 348126, 343694, 338773, 333250, 327498, 322157, 317317, 312770, 308962, 306758, 306221, 306519, 307176, 308576, 311116, 314574, 318461, 322329, 325680, 328193, 330118, 331931, 333731, 335508, 337692, 340554, 343243, 344429, 343901, 342662, 341419, 339870, 337637, 335022, 332578, 330542, 328843, 327131, 324805, 321673, 318452, 316026, 314362, 312930, 311916, 311996, 313026, 314069, 314773, 315681, 317013, 318193, 318889, 319540, 320469, 321297, 321626, 321531, 321048, 319918, 318144, 316090, 313783, 310822, 307229, 303645, 300436, 297272, 293840, 290277, 286737, 283313, 280581, 279291, 279234, 279269, 278811, 278460, 278814, 279625, 280620, 282191, 284570, 287065, 288924, 290397, 292268, 294797, 297736, 300907, 304072, 306513, 307342, 306176, 303239, 299097, 294527, 290231, 286341]
57802B86341l845l932l615k911k180j436n44K30O00P79R16N65m44j209q39J61
57786B68637O86O81P99Q60J94p94r19j6R66J606K323L000K886K169K035K724K980
57769B90817K100J127J138J548J081l99j974k991l432l472l344l322l403l301
57755B72173l044l036l339l501l317l050k644j538K58J660J804J182Q85J131J298
57740B56922J016N57K56J16l0l12p52j254j676k008k369k798l236l637l847l521
57724B33427k590j605j182j169r19l17J01om95j243k213k977l039k731k886l412
57708B06744l210j932p96j002k062k605k197j469r35n47l09m48r32j397j620j661
57692A83622j563j375j371j772k216j975q51M61J148J150J073J401K030K652L301
$$ y = [286341, 282496, 278564, 274949, 272038, 269858, 268422, 267878, 268108, 268708, 269487, 270403, 270968, 270524, 269315, 268476, 268637, 269323, 270004, 270803, 271663, 271857, 271063, 270144, 270128, 271094, 272700, 275023, 278023, 280909, 283078, 285113, 287837, 290817, 292917, 294044, 295182, 296730, 297811, 297412, 295438, 292447, 289015, 285543, 282199, 278877, 275474, 272173, 269129, 266093, 262754, 259253, 255936, 252886, 250242, 248704, 248962, 250622, 252426, 253608, 254493, 255624, 256922, 257938, 258495, 258751, 258867, 258837, 258525, 257773, 256519, 254843, 252835, 250466, 247668, 244432, 240795, 236948, 233427, 230837, 229232, 228050, 226881, 225962, 225645, 225746, 225740, 225245, 224002, 221789, 218812, 215773, 213042, 210156, 206744, 203534, 201602, 200806, 199804, 197742, 195137, 192940, 191471, 190536, 189989, 189680, 189232, 188300, 186903, 185283, 183622, 182059, 180684, 179313, 177541, 175325, 173350, 172499, 172960, 174108, 175258, 176331, 177732, 179762, 182414, 185715]
57677A85715M309N781P523R521J2149J5592J9425K3204K7133L1719L6951M2408
57665D21430M7769N2354N4019M9614L7380J8821k008k0820l4778m2902m5808m5110
57653D89961m2484l8865l4510k9681k5048k1310j8579j6288j3879j1474r561q168
57641B20114o767n122l719l004k741k510k385k468k293j438m45k21p20j097j092
57626A84092j244j702j861j461j085j150j233r30o46r05j433j561j163o33k67
57611A66818j30l05q20j423j731j545r21j67K07p2n79n43J79Q99R63M40k50q90
57593A60130j458j918k213k212j708r04o55j568k878l191k367j651j683j561n06
57578A33657P03Q88J90m82j032j933k805k605j256mJ05p29j731k448k709k386
$$ y = [185715, 190024, 195805, 203328, 212849, 224998, 240590, 260015, 283219, 310352, 342071, 379022, 421430, 469199, 521553, 575572, 625186, 662566, 681387, 679379, 658559, 623781, 580879, 535071, 489961, 447477, 408612, 374102, 344421, 319373, 298063, 279484, 263196, 249317, 237843, 228282, 220114, 213347, 208225, 204506, 201502, 198761, 196251, 193866, 191398, 189105, 187667, 187222, 187001, 186281, 185184, 184092, 182848, 181146, 179285, 177824, 176739, 175589, 174356, 173426, 172780, 171875, 170442, 168881, 167718, 167085, 166818, 166688, 166383, 165563, 164140, 162409, 160864, 159943, 159776, 159983, 159911, 159332, 158789, 158968, 159867, 160830, 161270, 161020, 160130, 158672, 156754, 154541, 152329, 150621, 149717, 149062, 147494, 144616, 141425, 139058, 137407, 135724, 134163, 133657, 134360, 135248, 135438, 134956, 133924, 131991, 129186, 126581, 125325, 125321, 125426, 124697, 122966, 120518, 117809, 115423]
57562A15423j696j249j347j524j119j48P56J126J054Q48N97L08K33P35J701K458
57546A18156K485K057J811J851J658Q76k74j351k012k001j275k82L51N37O62P96
57530A24045N37k13r28j208j226j162p98q6M79N30L43K64J61o4jO10J249J325
57512A23857J084J101J280J137P84P47R61Q16K20k18j80j09m39r24j075q21m55
57495A27766k33k55n64j116j669j875j545r14n48p71j195j185o94k55r6J10M92
57478A15453O72N75P79J521K016J514M73r1l4M6n9o8m9l87r79j320j367j458j485
57459A15752r83j38K00k94j039j531j885k163j969j141j65N01R34J261J223P08
57443A09271J52o8k01n76r25p12J40J212K019K189J548M78j42J80R35J241Q94
$$ y = [115423, 113727, 112478, 111131, 109607, 108488, 108340, 109096, 110222, 111276, 112124, 112721, 113029, 113262, 113997, 115698, 118156, 120641, 122698, 124509, 126360, 128018, 128894, 128620, 127269, 125257, 123256, 121981, 121699, 122050, 122587, 123249, 124045, 124582, 124369, 123441, 122233, 121007, 119845, 119047, 118961, 119440, 119970, 120313, 120577, 120738, 120674, 120673, 121283, 122532, 123857, 124941, 126042, 127322, 128459, 129243, 129990, 130951, 131767, 131987, 131769, 131589, 131480, 131041, 130117, 129042, 128221, 127766, 127533, 127278, 126714, 125598, 123929, 122054, 120509, 119595, 119047, 118276, 117081, 115896, 115202, 114947, 114851, 114961, 115453, 116125, 116700, 117479, 119000, 121016, 122530, 123003, 122912, 122878, 122924, 122865, 122797, 122748, 122361, 121382, 120062, 118695, 117237, 115752, 114769, 114631, 114831, 114537, 113498, 111967, 110082, 107919, 105950, 104809, 104644, 105145, 106079, 107340, 108563, 109271, 109423, 109355, 109154, 108578, 107653, 106941, 107081, 108293, 110312, 112501, 114049, 114527, 114385, 114565, 115500, 116741, 117635]
57426A17635L97J05j50n66j010j185r68m44J45M36J42o18j291j356q04j38K21
57409A10551L61N97R28J038Q46O14M58R9n87j157j148p51m33k07J95N92M65j61
57391A12300n92l29M56J390K296K978L131K777K360K178K060J825J626J579J440
57376A37475R76M29K20L89N29L02j75m39k14J66K2p57j398j201n40l14o53r00
57358A33917p31m61j66N06J369J544P83Q4L39J069J297R89P66O73K32n32j065
57341A40613j186j196j171q87m65l14l72j28M82R07Q36N81M10J63j67j90J43K29
57323A38288k81p83n52O2J11n67j068o93J99P53O06K7n48p89m95L54J513K600
57305A38737L253L165K285J096M23N96J002R44O97J125K246K927K365J171N12
$$ y = [117635, 118032, 118137, 117987, 117421, 116411, 115226, 114258, 113814, 113959, 114395, 114537, 113919, 112628, 111272, 110468, 110330, 110551, 110912, 111509, 112437, 113475, 114321, 114935, 115393, 115492, 114905, 113748, 112600, 111849, 111416, 111209, 111404, 111996, 112461, 112300, 111708, 111379, 111835, 113225, 115521, 118499, 121630, 124407, 126767, 128945, 131005, 132830, 134456, 136035, 137475, 138451, 138880, 139100, 139489, 140018, 140320, 140145, 139706, 139492, 139658, 139680, 138923, 137525, 136324, 135784, 135470, 134817, 133917, 133186, 132725, 132559, 133065, 134434, 135978, 136761, 136845, 137184, 138253, 139550, 140539, 141305, 141978, 142210, 141678, 140613, 139427, 138231, 137060, 136173, 135708, 135394, 135022, 134894, 135376, 136283, 137119, 137700, 138110, 138273, 138106, 137916, 138059, 138288, 138007, 137224, 136672, 136734, 136845, 136278, 135210, 134517, 134716, 135469, 136075, 136102, 135554, 134765, 134270, 134624, 136137, 138737, 141990, 145155, 147440, 148536, 148959, 149555, 150557, 151501, 152198, 153323, 155569, 158496, 160861, 162032, 162544]
57290A62544O33R39J118J353J634J620J285R46N99m5p42o99K67J346J889K220
57274A76907K780L160K771J973J642J907K090J897J811K202K713K782K337J801
57260B08773J669K204L187L952L892L109K304K092K588L574M667N440N695N715
57246B58861N897O150O002N311M532M205M490N224O075O628O621O278O197O772
57232C39243P887R105R972J0277J0276J0535J1190J1548J0964R922R648J0645
57220D61212J2258J3750J4993J5901J6081J5629J5564J6717J8616K0140K0954
57209F41815K1606K2494K3444K4275K5099K5982K6828K7613K8364K9002K9631
57198I26153L0856L3116L5830L7904L9229M0863M3441M6141M7779M8248M8187
$$ y = [162544, 163177, 164116, 165234, 166587, 168221, 169841, 171126, 172072, 172671, 172626, 171884, 171185, 171452, 172798, 174687, 176907, 179687, 182847, 185618, 187591, 189233, 191140, 193230, 195127, 196938, 199140, 201853, 204635, 206972, 208773, 210442, 212646, 215833, 219785, 223677, 226786, 229090, 231182, 233770, 237344, 242011, 247451, 253146, 258861, 264758, 270908, 276910, 282221, 286753, 290958, 295448, 300672, 306747, 313375, 319996, 326274, 332471, 339243, 347130, 356235, 366207, 376484, 386760, 397295, 408485, 420033, 430997, 440919, 450567, 461212, 473470, 487220, 502213, 518114, 534195, 549824, 565388, 582105, 600721, 620861, 641815, 663421, 685915, 709359, 733634, 758733, 784715, 811543, 839156, 867520, 896522, 926153, 957009, 990125, 1025955, 1063859, 1103088, 1143951, 1187392, 1233533, 1281312, 1329560, 1377747]
57187A377747M7704M6312M3995M1481L9314L7365L5490L4001L3044L2079L0634
57176A799166K9328K9411L1205L3625L5481L6743L8156L9966M1624M2693M3558
57165B200956M4934M7000M9160N0578N0913N0641N0679N1504N2700N3485N3620
57154B756170N3426N3066N2404N1673N1677N2833N4495N5814N6849N8171N9597
57143C356175O0066N8965N6858N4737N2973N1264M9161M6441M3332M0634L9231
57132C909837L9217L9792M0299M1031M2675M5277M8204N0994N3661N6055N7344
57121D424386N6605N3938N0801M9110N0025N3690N9908O8589P9298R0890J02192
57110E139432J12942J23622J34504J45539J57276J71237J89240K12884K44003
$$ y = [1377747, 1425451, 1471763, 1515758, 1557239, 1596553, 1633918, 1669408, 1703409, 1736453, 1768532, 1799166, 1828494, 1857905, 1889110, 1922735, 1958216, 1994959, 2033115, 2073081, 2114705, 2157398, 2200956, 2245890, 2292890, 2342050, 2392628, 2443541, 2494182, 2544861, 2596365, 2649065, 2702550, 2756170, 2809596, 2862662, 2915066, 2966739, 3018416, 3071249, 3125744, 3181558, 3238407, 3296578, 3356175, 3416241, 3475206, 3532064, 3586801, 3639774, 3691038, 3740199, 3786640, 3829972, 3870606, 3909837, 3949054, 3988846, 4029145, 4070176, 4112851, 4158128, 4206332, 4257326, 4310987, 4367042, 4424386, 4480991, 4534929, 4585730, 4634840, 4684865, 4738555, 4798463, 4867052, 4946350, 5037240, 5139432, 5252374, 5375996, 5510500, 5656039, 5813315, 5984552, 6173792, 6386676, 6630679]
57101F630679K85194L39616M10566N01378O15347P55518R24716J125484J359131
57092A2947629J624350J916591K227746K545279K852118L129462L360695L532945
57084C4136815L637212L669815L630698L511121L278450K881471K285536J510116
57076E8541234O30399k60145j089410j816824k420417k886363l210252l399785
57068D4088437l471349l444740l340665l179332k978500k752850k515324k277578
57060B0128099k048553j833646j635698j455984j294197j148851j018515r02180
57052H790475p98617p06440o25010n54254m93398m40856l95558l57305l25402
57043D093635k97979k73258k50630k30034k11034j93119j76108j59690j43063
$$ y = [6630679, 6915873, 7255489, 7666055, 8167433, 8782780, 9538298, 10463014, 11588498, 12947629, 14571979, 16488570, 18716316, 21261595, 24113713, 27243175, 30603870, 34136815, 37774027, 41443842, 45074540, 48585661, 51864111, 54745582, 57031118, 58541234, 59171633, 58911488, 57822078, 56005254, 53584837, 50698474, 47488222, 44088437, 40617088, 37172348, 33831683, 30652351, 27673851, 24921001, 22405677, 20128099, 18079546, 16245900, 14610202, 13154218, 11860021, 10711170, 9692655, 8790475, 7991858, 7285418, 6660408, 6106154, 5612756, 5171900, 4776342, 4419037, 4093635, 3795656, 3522398, 3271768, 3041734, 2830700, 2637581, 2461473, 2301783, 2158720]
57034B158720j25746j08256r1483p5801o1202m7860l5936k4934j3824j965R732
57023A581445J8167J8952R142j0051l3421n4921p0687p9604q2356q0599p6297
57012A139770p0915o5138n9387n4078m9257m4602m0078l6036l2435k8679k4638
57001F34527k1126j8848j7511j6443j5487j4670j3601j1925r990q393p203o069
56989D73261m721k926m10K605N317P298Q879J0021R590O681K121k443o385j0037
56975D98851j3189j5028j5472j5236j4496j2732j0075p644o102m873l359j814
56963C78831m82J331M352Q178J1808J4916J7669J9518J9075J5428R117J625n618
56950D95748j1666j6008j8503j9393j9116j8001j6171j3748j1069q602o552m701
$$ y = [2158720, 2032974, 1924718, 1833235, 1757434, 1696232, 1648372, 1612436, 1587502, 1573678, 1571713, 1581445, 1599612, 1618564, 1627706, 1617655, 1584234, 1529313, 1458626, 1379022, 1296666, 1216067, 1139770, 1068855, 1003717, 944330, 890252, 840995, 796393, 756315, 720279, 687844, 659165, 634527, 613401, 594553, 577042, 560599, 545112, 530442, 516841, 504916, 494926, 486533, 479330, 473261, 468540, 465614, 465204, 467809, 473126, 480424, 489303, 499324, 508914, 515595, 517716, 515273, 508888, 498851, 485662, 470634, 455162, 439926, 425430, 412698, 402623, 394979, 388877, 384004, 380645, 378831, 378349, 379680, 384032, 392210, 404018, 418934, 436603, 456121, 475196, 490624, 499741, 501366, 495748, 484082, 468074, 449571, 430178, 411062, 393061, 376890, 363142, 352073, 343471, 336919, 332218]
56938C32218k629p4L034O701J0885J5451K0130K4361K7074K6922K3079J5861O507
56925E09520l434j2521j9635k4264k6506k6674k5140k2619k0153j8347j6854j5056
56913B78317j2992j1177r793q626p625o928o372n536m334l136k263j801j804k152
56899A93778k253j456P1J412K060K532L641N501P546R302J0873J2734J5079J7336
56885B78156J8443J7788J5656J2617Q810M276m08m409p388r379j0079r125p030
56872C07928m986l515k006J05K483M609O780R873J4405K0208K6657L2884L7992
56859D53417M1276M2010L9027L1260J9144N104p858j7909k4689k8452k9572k8592
56847D94166k6156k2693j8347j3192p415j320M829J1096J7950K5779L4378M3282
$$ y = [332218, 329589, 329515, 332549, 339250, 350135, 365586, 385716, 410077, 437151, 464073, 487152, 503013, 509520, 506086, 493565, 473930, 449666, 423160, 396486, 371346, 348727, 328574, 310227, 293373, 278317, 265325, 254148, 244355, 235729, 228104, 221176, 214804, 209268, 204934, 201798, 199535, 197734, 195930, 193778, 191525, 190069, 190140, 191552, 193612, 196144, 199785, 205286, 212832, 222134, 233007, 245741, 260820, 278156, 296599, 314387, 330043, 342660, 351470, 355746, 355338, 350929, 343541, 334162, 324083, 314958, 307928, 302942, 299427, 297421, 297526, 300009, 304618, 311398, 321271, 335676, 355884, 382541, 415425, 453417, 494693, 536703, 575730, 606990, 626134, 631238, 623380, 605471, 580782, 552330, 522758, 494166, 468010, 445317, 426970, 413778, 406363, 405043, 409872, 420968, 438918, 464697, 499075, 542357]
56835E42357N2362O1386O8795P1611O7098N4427L4878J1268j2548l2619m6504
56824H72511n4130n6771n5545n1280m5250l8955l3027k6981k0289j3211o353K76
56812D70995P296J5143K3496L1613L8931M4911M8262M6890L9265K5772Q596r494
56800G91676k5841l8105m5035m7296m6771m4681m0959l5625k9719k4363j9575
56789C93706j4818j0136n932k004K379P536J3038J8240K2553K5249K5394K2189
56777D97394J5350N583n206j4702k1689k6438k9426l0358k9041k6486k4028k1774
56765B89179j8930j5535j2710j0991r554p583n626m875n513o410o369n273l983
56752A75827l321l250l062k368j674j758k588l254k984j898p41j67l09p84r92
$$ y = [542357, 594719, 656105, 724900, 796511, 863609, 918036, 952914, 964182, 951634, 919015, 872511, 818381, 761610, 706065, 654785, 609535, 570580, 537553, 510572, 490283, 477072, 470719, 470995, 478291, 493434, 516930, 548543, 587474, 632385, 680647, 727537, 766802, 792574, 801170, 791676, 765835, 727730, 682695, 635399, 588628, 543947, 502988, 467363, 437644, 413281, 393706, 378888, 368752, 362820, 360816, 363195, 370731, 383769, 402009, 424562, 449811, 475205, 497394, 512744, 518327, 513121, 498419, 476730, 450292, 420866, 390508, 361467, 334981, 310953, 289179, 270249, 254714, 242004, 231013, 221459, 213876, 208250, 203375, 197862, 191452, 185083, 179810, 175827, 172506, 169256, 166194, 163826, 162152, 160394, 157806, 154552, 151568, 149670, 148929, 148762, 148453, 147669, 146677]
56737A46677o22N5M89M40J37p7r9p1k23o66j216j405q37L86J664K251J793P18
56719A49394M5M93J651K373K036J114L56k9j59O8P92J748K436K571K152J369O83
56702A69093N42P51N81j31n94k76J46k23j022j183n90j45l23o01m73j41O2J66
56684A65639K53K31J97M05P33O93K47M2N02J162J196L35r55j919j959j046J43
56667A65899P84P19M16K19M0j30L6O89J405J625J257P33N90R88J517J573J179
56650A79539J196K185L368L414K142P35J44J47J71J97L81M64K11p2j9J59P9q6
56632A94355J55P96J289J197N29m69j486k160k308k172k131k201k131j927j963
56617A79373k356k649k392j816j536j607j332k98Q32J052L27m24o41o81q99r59
$$ y = [146677, 146055, 146110, 146599, 147039, 147176, 147099, 147000, 146929, 146706, 146040, 144824, 143419, 142582, 142968, 144632, 146883, 148676, 149394, 149439, 149932, 151583, 153956, 155992, 157106, 157462, 157433, 157274, 157342, 158134, 159882, 162318, 164889, 167041, 168410, 169093, 169635, 170386, 170967, 170836, 170242, 169966, 170112, 169889, 168867, 167684, 167094, 166949, 166626, 166025, 165552, 165411, 165473, 165639, 165892, 166123, 166320, 166725, 167458, 168151, 168398, 168440, 168942, 170104, 171300, 171635, 170680, 168761, 166802, 165756, 165899, 166683, 167402, 167818, 168037, 168077, 167947, 167983, 168672, 170077, 171702, 172959, 173692, 174282, 175270, 176787, 178360, 179539, 180735, 182920, 186288, 189702, 191844, 192579, 192723, 192870, 193041, 193238, 193619, 194083, 194294, 194222, 194203, 194362, 194441, 194355, 194510, 195306, 196595, 197792, 198321, 197852, 196366, 194206, 191898, 189726, 187595, 185394, 183263, 181336, 179373, 177017, 174368, 171976, 170160, 168624, 167017, 165685, 165387, 166219, 167271, 167598, 167174, 166533, 165852, 164953, 163994]
56601A63994m57L36R56J412J774J580N11p13j011l56K84L63K54L23L98L39M00
56584A70387O39O35P3p33j136p30M09J683K253J811J035Q04J090J181Q95P93J212
56567A82301J767K036K111K365L073M284N564O051N444M727N098O342P161O992
56553B45316O345N413L688J367k47m48j87o54j636k067j538n69J34J22o67j661
56537B52711k065j769j451j539j754j881k098k315k080j535j432j804j689p56
56523B28543mj63n69n59p48j771k814k738j890j402j404j296j188j574j960j368
56507B07095j8Q38P45L88K11o9m82n50j95J03K22N25R48R78N31O0l64j032j671
56488B08263j559p86l52o84j078r67p04n81o9J159K221J960O05m32l13L04K65
$$ y = [163994, 163537, 163873, 164829, 166241, 168015, 169595, 170106, 169393, 168382, 168026, 168310, 168673, 168927, 169250, 169648, 169987, 170387, 171026, 171661, 171734, 171001, 169865, 169135, 169544, 171227, 173480, 175291, 176326, 177130, 178220, 179401, 180296, 181089, 182301, 184068, 186104, 188215, 190580, 193653, 197937, 203501, 209552, 214996, 219723, 224821, 231163, 238324, 245316, 251661, 257074, 260762, 262129, 261882, 261434, 261247, 260593, 258957, 256890, 255352, 254783, 254917, 255039, 254372, 252711, 250646, 248877, 247426, 245887, 244133, 242252, 240154, 237839, 235759, 234224, 232792, 230988, 229299, 228543, 228539, 228376, 227807, 227248, 226500, 224729, 221915, 219177, 217287, 215885, 214481, 213185, 211997, 210423, 208463, 207095, 207077, 207915, 208660, 209048, 209259, 209190, 208708, 208158, 207963, 208066, 208288, 208813, 209761, 210739, 211270, 211330, 210966, 209934, 208263, 206704, 205918, 205566, 204882, 203804, 202837, 202133, 201552, 201483, 202642, 204863, 206823, 207428, 206996, 206683, 206987, 207252]
56471B07252n76j216p55M67J294J212R11J196J844K049J600J046Q10P62N78J31
56455B18605m72q55o28J8L00j13m55J04J085J216J55j042j232k77J133K156K201
56438B21899J242j00j130j658j735j222j31R06J228R77P51O51M31K25L08L54j12
56421B22884o81n04L23Q40P47P17J019R28rj058j250n27N18J445K053K186J951
56404B31582J735J681J486R38K63k45n37n61j68N26J135J486J788K097K110J637
56388B46953R69N69O52J114J618J717J234N04Jj57j07J41N42P89O36K85nl65q61
56369B56229j016m35M31Q88J015J298J625J607J515J923K561K600J964J291P90
56354B74286J66l98m32k69p17j454j167M27J972K316J817J258P24J40j7O25J673
$$ y = [207252, 206676, 205460, 204705, 205172, 206466, 207678, 208589, 209785, 211629, 213678, 215278, 216324, 217134, 217896, 218474, 218605, 218133, 217278, 216650, 216668, 216968, 216855, 216400, 216504, 217589, 218805, 218960, 217918, 216686, 216409, 217542, 219698, 221899, 223141, 223041, 221911, 220253, 218518, 217296, 217165, 218071, 219299, 220276, 221027, 221678, 222109, 222334, 222642, 222996, 222884, 222203, 221699, 222022, 222862, 223609, 224326, 225345, 226273, 226264, 225206, 223956, 223429, 223947, 225392, 227445, 229631, 231582, 233317, 234998, 236484, 237422, 237685, 237440, 236903, 236342, 236174, 236700, 237835, 239321, 241109, 243206, 245316, 246953, 247922, 248491, 249143, 250257, 251875, 253592, 254826, 255330, 255331, 255174, 255067, 255208, 255750, 256539, 257175, 257460, 257455, 257090, 256229, 255213, 254778, 255209, 256097, 257112, 258410, 260035, 261642, 263157, 265080, 267641, 270241, 272205, 273496, 274286, 274452, 274054, 273622, 273353, 272636, 271182, 270015, 270442, 272414, 274730, 276547, 277805, 278529, 278669, 278652, 279277, 280950]
56337B80950K569L229L651L653L357L244L311L016K346K090K553K928K544J912
56323C21353J904K471K911K842K391J736R92K21o07j384j621r76P1P29R82J338
56307C35353J668J398P69P04J269J570J421J744K901L945M106L773L458L009K477
56292C69565K513L170L478K960K418K463K525K213K342L564N033N610N425N262
56278D18541N294N445O056P056P480O926O582P591R240J0104J0175J0438J1053
56265E21981J1450J1760J2634J3890J4761J5384J6808J9393K2334K4848K7045
56254G12288K9511L2710L6774M1480M6552N2187N8829O6157P3051P9008Q4784
56243A313331R0951R6705J00861J03293J04427J04056J01576R6762Q9449P9183
$$ y = [280950, 283519, 286748, 290399, 294052, 297409, 300653, 303964, 306980, 309326, 311416, 313969, 316897, 319441, 321353, 323257, 325728, 328639, 331481, 333872, 335608, 336600, 336821, 336214, 334830, 333209, 332233, 332304, 333033, 334015, 335353, 337021, 338419, 339188, 339892, 341161, 342731, 344152, 345896, 348797, 352742, 356848, 360621, 364079, 367088, 369565, 372078, 375248, 378726, 381686, 384104, 386567, 389092, 391305, 393647, 397211, 402244, 407854, 413279, 418541, 423835, 429280, 435336, 442392, 449872, 456798, 463380, 470971, 480211, 490315, 500490, 510928, 521981, 533431, 545191, 557825, 571715, 586476, 601860, 618668, 638061, 660395, 685243, 712288, 741799, 774509, 811283, 852763, 899315, 951502, 1010331, 1076488, 1149539, 1228547, 1313331, 1404282, 1500987, 1601848, 1705141, 1809568, 1913624, 2015200, 2111962, 2201411, 2280594]
56233B280594O6113N1518L6505K0939M600j1482k6019l9020n1100o1872p0342
56222B200434p6448q0925q4047q5607q5759q4779q2499p9036p5507p2745o9922
56211A323160o5714o0416n5460n1316m7319m3305l9866l6974l3894l0568k7863
56200H30465k6116k4525k2253j9399j6672j4739j3842j3486j2702j1160r642q779
56188F37150p973o422m604l619l472l169k294j411r91q71o93j97O76J448J292
56173F04850J78p46o06J99J003J945L073L511K817K158K805M203M962M994N205
56158F40551N766O283P046Q522J0075J0776J1031J1873J3142J3959J4687J6622
56146G70333J9989K3731K7280L1116L5778M1467M8402N6374O4365P1695P8916
$$ y = [2280594, 2346707, 2398225, 2434730, 2455669, 2460269, 2448787, 2422768, 2383748, 2332648, 2270776, 2200434, 2123986, 2043061, 1959014, 1873407, 1787648, 1702869, 1620370, 1541334, 1465827, 1393082, 1323160, 1257446, 1197030, 1141570, 1090254, 1042935, 999630, 959764, 922790, 888896, 858328, 830465, 804349, 779824, 757571, 738172, 721500, 706761, 692919, 679433, 666731, 655571, 645929, 637150, 629177, 622755, 618151, 614532, 611060, 607891, 605597, 604186, 603195, 602324, 601631, 601434, 602110, 603558, 604850, 605028, 604282, 603676, 603875, 604878, 606823, 609896, 613407, 616224, 618382, 621187, 625390, 630352, 635346, 640551, 646317, 652600, 659646, 668168, 678243, 689019, 700050, 711923, 725065, 739024, 753711, 770333, 790322, 814053, 841333, 872449, 908227, 949694, 998096, 1054470, 1118835, 1190530, 1269446]
56135A269446Q6298R2175R4275R2095Q6581P8385O8162N7899M9943M4971M2186
56124B062416M0654L8850L4141K5074J3588L062n253j1975j7066k0290k3498k9540
56112B110163l8955m9928o1039p1580p9670q3088q2061p8697p3800o6823n8701
56101A365821n1637m5879l9609l2387k5906k0965j6545j2442r906q901p471m733
56089A089440k062m71Q26K426L659M276M952N579N272M595N318P421Q878R012
56075A149121R384J0671J1493J1282J1483J2757J3626J3233J2974J4028J5519
56064A285571J6459J7398J8851K0026K0327K0342K0482K0323J9962K0110K0447
56053A500298J9923J8965J9107K0209K0579K0020K0090K1065K1654K1941K3455
$$ y = [1269446, 1355744, 1447919, 1542194, 1634289, 1720870, 1799255, 1867417, 1925316, 1975259, 2020230, 2062416, 2103070, 2141920, 2176061, 2201135, 2214723, 2217785, 2212532, 2200557, 2183491, 2163201, 2139703, 2110163, 2071208, 2021280, 1960241, 1888661, 1808991, 1725903, 1643842, 1565145, 1491345, 1424522, 1365821, 1314184, 1268305, 1228696, 1196309, 1170403, 1149438, 1132893, 1120451, 1110545, 1101644, 1094173, 1089440, 1087378, 1086907, 1087733, 1090159, 1093818, 1098094, 1103046, 1108625, 1113897, 1118492, 1123810, 1131231, 1140109, 1149121, 1158505, 1169176, 1180669, 1191951, 1203434, 1216191, 1229817, 1243050, 1256024, 1270052, 1285571, 1302030, 1319428, 1338279, 1358305, 1378632, 1398974, 1419456, 1439779, 1459741, 1479851, 1500298, 1520221, 1539186, 1558293, 1578502, 1599081, 1619101, 1639191, 1660256, 1681910, 1703851, 1727306]
56042A727306K5955K7426K7786K9050L1235L1906L0617K9885L0705L0992K9791
56031B052654K9109L0060L1139L1857L4053L7957M0991M2284M4348M8343N1890
56020B474685N3675N5977O0144O3859O5507O7236P0869P4668P6977P9340Q3120
56009C226057Q6796Q9385R2836R8261J03538J07345J11750J18126J24529J29703
55999D288326J35674J43633J51626J58841J67642J78683J88965J97572K08092
55990E819054K22356K37301K51230K67343K87486L08524L28757L51665L79216
55981H452932M08094M36870M69954N09730N52093N94920O43361P01248P65343
55972A3534545Q34029R13258J007533J114031J232542J371854J539021J732804
$$ y = [1727306, 1753261, 1780687, 1808473, 1837523, 1868758, 1900664, 1931281, 1961166, 1991871, 2022863, 2052654, 2081763, 2111823, 2142962, 2174819, 2208872, 2246829, 2287820, 2330104, 2374452, 2422795, 2474685, 2528360, 2584337, 2644481, 2708340, 2773847, 2841083, 2911952, 2986620, 3063597, 3142937, 3226057, 3312853, 3402238, 3495074, 3593335, 3696873, 3804218, 3915968, 4034094, 4158623, 4288326, 4424000, 4567633, 4719259, 4878100, 5045742, 5224425, 5413390, 5610962, 5819054, 6041410, 6278711, 6529941, 6797284, 7084770, 7393294, 7722051, 8073716, 8452932, 8861026, 9297896, 9767850, 10277580, 10829673, 11424593, 12067954, 12769202, 13534545, 14368574, 15281832, 16289365, 17403396, 18635938, 20007792, 21546813, 23279617]
55964B3279617J955933K222940K547697K936230L402319L977658M697958N597279
55956E0617631O729990Q180692J0039373J2390398J5339005J9000867K3401641
55949A45699597K8364261L3458933L7945620M0672792M0167935L5192445K5556805
55942C87058388J2528767j595642j4447257k4373953l0701044l3589578l3739169
55935B61140512l2052257k9339862k6178506k2935146j9843304j7036221j4561186
55928I9194030j2417884j0593236r061063p775678o689986n773488n003308m351024
55920C7528363l790922l310747k902650k552146k245592j979716j753722j559274
55912A7433594j387038j236002j107777r97643q99134q11794p37102o71718o11431
$$ y = [23279617, 25235550, 27458490, 30006187, 32942417, 36344736, 40322394, 45020352, 50617631, 57347621, 65528313, 75567686, 87958084, 103297089, 122297956, 145699597, 174063858, 207522791, 245468411, 286141203, 326309138, 361501583, 387058388, 399587155, 397991513, 383544256, 359170303, 328469259, 294879681, 261140512, 229088255, 199748393, 173569887, 150634741, 130791437, 113755216, 99194030, 86776146, 76182910, 67121847, 59346169, 52656183, 46882695, 41879387, 37528363, 33737441, 30426694, 27524044, 24971898, 22726306, 20746590, 18992868, 17433594, 16046556, 14810554, 13702777, 12705134, 11806000, 10994206, 10257104, 9585386, 8973955]
55903H973955n57060n10375m68593m28547l91844l60726l33150l06717k82978
55894E333965k63167k44285k24026k05197j90634j78066j64575j51740j41820
55885C570455j33019j23143j13860j06879r9937r1267q4137q2042q2855q2506
55875B570810q1088q0583p9764p6302p1449o7919o5374o2124n8964n7292n5769
55864A814182n2792m9897m8946m8351m5959m3302m2976m4155m4623m4969m6589
55853A301623m7687m5613m1510l8472l6617l4054l1236l0110l0021k8511k5584
55842I12208k3454k2703k1988k0960k0311j9558j7774j5840j5171j5035j3854
55831G05560j2231j1749j1832j0705q706p653p640p331o799p239q442r174r558
$$ y = [8973955, 8416895, 7906520, 7437927, 7009380, 6617536, 6256810, 5923660, 5616943, 5333965, 5070798, 4826513, 4602487, 4397290, 4206656, 4028590, 3864015, 3712275, 3570455, 3437436, 3314293, 3200433, 3093554, 2993617, 2902350, 2818213, 2736171, 2653316, 2570810, 2489722, 2409139, 2329375, 2253073, 2181624, 2113705, 2048331, 1986207, 1927243, 1869951, 1814182, 1761390, 1711493, 1662547, 1614196, 1568237, 1524935, 1481959, 1437804, 1393181, 1348212, 1301623, 1253936, 1208323, 1166813, 1128341, 1091724, 1057670, 1026434, 996324, 966303, 937792, 912208, 888754, 866051, 844063, 823103, 802792, 783234, 765460, 749620, 734449, 719414, 705560, 693329, 681580, 669748, 659043, 650337, 642684, 635044, 627713, 620914, 613675, 605233, 596059, 586501]
55818E86501j0489j1309j0706r313q917r535r704r074q375p435n683l958l417
55805D78586l267j976q4P28O75J412L007M074M440N102N758N071L192J591M30
55790E08739j406l692m832m601m552n366n947n497m672m324m794o467r339j1956
55776D31294j2567j1296r679q290o610m860l868l262j782M19J743J542P18j63
55762C73339j490l163m282m614m811m971m521l680l470m103m766n213o063p365
55748C10827q234q180p620o973o343o027o146o036n136m155m059m344l871k905
55734B30798k602k775k206r90o44j626k650k787k566k635k851l148l857m764n055
55719A89642m508l620k565j231j74j08n14k00Q00J442J721K697M340N199M582
$$ y = [586501, 576012, 564703, 553997, 544684, 535767, 526232, 516528, 507454, 499079, 491644, 485961, 482003, 478586, 475319, 473343, 473259, 473987, 474662, 476074, 479081, 483155, 487595, 492697, 498455, 503526, 506718, 508309, 508739, 507333, 503641, 498809, 494208, 489656, 484290, 478343, 472846, 468174, 463850, 459056, 452589, 443250, 431294, 418727, 407431, 397752, 389462, 382852, 377992, 374124, 370862, 369080, 369499, 371242, 372784, 373502, 373339, 371849, 368686, 364404, 359790, 354979, 350008, 345487, 341807, 338337, 334234, 329468, 324255, 318192, 310827, 302593, 294413, 286793, 279820, 273477, 267450, 261304, 255268, 250132, 245977, 241918, 237574, 233703, 230798, 228196, 225421, 223215, 222225, 221581, 219955, 217305, 214518, 211952, 209317, 206466, 203318, 199461, 194697, 189642, 185134, 181514, 178949, 177718, 177544, 177436, 176922, 176722, 177522, 178964, 180685, 183382, 187722, 192921, 197503]
55704A97503L434K518J379l10j867k774l451m266m958n497o334p213o998n267
55690A55899l036j399l99K77N50M56M79Q43J229J500J909K430K654K553K442K175
55674A70562J358L87J38M91L56o42j617j776j299o44j0K90L4k39K08J029J172
55657A69798O33N13J213J919K085K054J918J191M7m87p7L63J61k92o85j475k771
55640A76108l758l863l579l468l408l331l668m486n070m934m382l719k910k294
55626A23238k507l224l199k080r74o80o49l42k69p59r95l57L27M6p44r28m84l04
55608A05116p32j345j807k081k053j725j490j597j692j415j047j030j203j135
55594H4764q18n61m44l43k45k29l21n83r96j220q98j43O24J276J797J812J120
$$ y = [197503, 200937, 203455, 204834, 204524, 202657, 199883, 196432, 192166, 187208, 181711, 175377, 168164, 161166, 155899, 152863, 151464, 151065, 151342, 151892, 152348, 152827, 153670, 154899, 156399, 158308, 160738, 163392, 165945, 168387, 170562, 171920, 172307, 172445, 172936, 173292, 172650, 171033, 169257, 167958, 167314, 167304, 167594, 167628, 167389, 167597, 168626, 169798, 170431, 170944, 172157, 174076, 176161, 178215, 180133, 181324, 181371, 180884, 180807, 181170, 181331, 181039, 180354, 178879, 176108, 172350, 168487, 164908, 161440, 158032, 154701, 151033, 146547, 141477, 136543, 132161, 128442, 125532, 123238, 120731, 117507, 114308, 112228, 111254, 110574, 109925, 109583, 109314, 108555, 107560, 107203, 107530, 107576, 106832, 105904, 105420, 105116, 104384, 103039, 101232, 99151, 97098, 95373, 93883, 92286, 90594, 89179, 88132, 87102, 85899, 84764, 83946, 83385, 82941, 82598, 82353, 82124, 81803, 81220, 80224, 79004, 78106, 77963, 78587, 79863, 81660, 83472, 84592]
55577H4592M46O28J195J042M03O60J970K756K124J183J080J251P28o9j68K77M31
55560A00529J40k70r43j990k654k136r69l89n78n77J68J066J261N76m44j067r44
55543I0779m32j58j46J07O01O57J50N6J107K578L164K575J516N77j28n68p42q24
55525A00869q83p53n24p53j654k550k616j893j092q19j260k192k907k624j417
55510G6932k67J23k7l57r95j897k351j870r17j62M01R40J129P25K91M21P59N25
55492G3403k73r56j096p21Q6J029J405Q07j50n01j44J94L2l38l79P4O42O92K1
55473G3827p00n63L51J002P03j65r63j526j787j594j195j120j148m50Q40J365
55457F6877N01o47j040j233j971k516j814m21L49M82Q85J453J259M20O7M63O76
$$ y = [84592, 85038, 85666, 86861, 87903, 88306, 88966, 90936, 93692, 95816, 96999, 98079, 99330, 100058, 99989, 99821, 100098, 100529, 100669, 100399, 99456, 97466, 94812, 92676, 91707, 91318, 90740, 90163, 90331, 91397, 92658, 93234, 92790, 91723, 90779, 90347, 90189, 90043, 90150, 90751, 91408, 91558, 91614, 92721, 95299, 98463, 101038, 102554, 103131, 103003, 102435, 101693, 100869, 99986, 99233, 98709, 97956, 96302, 93752, 91136, 89243, 88151, 87332, 86072, 83880, 80973, 78349, 76932, 76665, 76788, 76761, 76404, 75409, 73512, 71161, 69291, 68374, 68212, 68613, 69553, 70682, 71407, 71698, 72119, 72878, 73403, 73130, 72174, 71078, 70357, 70443, 71472, 72877, 73684, 73534, 73033, 72889, 73083, 73115, 72777, 72398, 72472, 73114, 73806, 73827, 73127, 72564, 72915, 73917, 74620, 74455, 73492, 71966, 70179, 68585, 67390, 66270, 65122, 64672, 65512, 66877, 67378, 66731, 65691, 64458, 62487, 59971, 58157, 57736, 58085, 58567, 59452, 60905, 62164, 62584, 62651, 63114, 63790]
55440F3790L31J94O93J144R79N91M65L56n0l88j01P15J405J405O98j51m42j38
55422G1496K2m66j060r46j94N44J130J785K186J753P57J17j4l63j192j813j730
55405G2012j307r65n61l1J44l44j065j468j520j326p16K73R83Q26J43j68K13P48
55387F5871Q30N11L10N17Q43P94L18j25j64k0j09l60k68L72J038J025K37o23p69
55368G0228k01K70P5l22r6O30Q25K9r66j190o40N9N11N94J58o75j292j249q36
55349F5912n17k36K05N37M32J41O6L8l40q52r13m36J14M13M31J60l28p27q41q27
55329F2432p02j04R83J770J597Q17J40l70q79j005m28K70L94L31Q42J598J614
55312F9300Q54K10j0j88k53K61R57Q55P4k04K85M44j23k28Q55J827J118p86j986
$$ y = [63790, 64121, 64315, 65008, 66152, 67131, 67722, 68187, 68543, 68493, 68105, 68004, 68719, 70124, 71529, 72227, 72076, 71634, 71496, 71518, 71052, 69992, 69046, 68852, 69396, 70526, 72311, 74497, 76250, 77007, 77124, 77110, 76747, 75555, 73742, 72012, 70705, 69740, 69179, 69148, 69292, 68948, 67883, 66415, 64895, 63569, 62853, 63126, 64109, 64935, 65078, 64910, 65123, 65871, 66701, 67212, 67522, 68039, 68882, 69676, 69994, 69869, 69705, 69685, 69576, 69216, 68948, 69320, 70358, 71383, 71620, 70997, 70228, 70027, 70297, 70372, 70050, 69954, 70584, 71409, 71438, 70472, 69282, 68642, 68701, 69212, 69806, 69964, 69289, 67997, 66748, 65912, 65395, 65159, 65364, 65901, 66333, 66474, 66540, 66578, 66238, 65386, 64473, 64037, 64151, 64564, 64995, 65155, 64827, 64100, 63259, 62432, 61730, 61626, 62609, 64379, 65976, 66793, 66933, 66563, 65684, 64679, 64251, 64521, 64915, 65246, 66088, 67686, 69300, 70154, 70364, 70354, 70166, 69913, 70174, 71131, 71986, 72060, 71856, 72141, 72585, 72462, 72234, 73089, 74916, 76034, 75248, 73262]
55293G3262j677p48k11r8L1L04N24N16L75M28Q99J492J620J111L59l10r59j539
55275G5379j570p32N25J339J258N11l12p61q46r66j272j298o14L14N43j4m40j96
55257G0848J38q0m40j43O59R94M40l00l30L78J119J348J160R05O72L10j68n79
55239G6931r36j431j937j958j280l79K00M95P72R26O56M7n55r68j064n91L36R27
55221G0191N78j69k45N00J198J239Q90O37O05P11Q07N83j27q96j104p85o06r34
55203G3073j433j547j023JR52J106L90l23k55K80M91L72M96R32J220J262J303
55186G7297J235Q37M77N86O84J7j013j319r05q13j285j425q99m94n73m10L72J051
55168G3420J140J184J500J426O35mJ09J87n43j342j050P2Q67R85R25Q46N35K03
$$ y = [73262, 71585, 70837, 70626, 70528, 70559, 70863, 71387, 71903, 72278, 72706, 73605, 75097, 76717, 77828, 78187, 77877, 76918, 75379, 73809, 73077, 73602, 74941, 76199, 76710, 76398, 75637, 74791, 73825, 72553, 71255, 70641, 70955, 71498, 71484, 71044, 70848, 70986, 70906, 70466, 70323, 70982, 71976, 72416, 72116, 71786, 72164, 73283, 74631, 75791, 76696, 77368, 77678, 77510, 76931, 75995, 74564, 72627, 70669, 69389, 69010, 69210, 69705, 70477, 71403, 72059, 72106, 71551, 70583, 69519, 68928, 69264, 70191, 70769, 70600, 70355, 70855, 72053, 73292, 74182, 74819, 75424, 76135, 76942, 77525, 77398, 76502, 75398, 74613, 74007, 73073, 71640, 70093, 69070, 69071, 70023, 71129, 71519, 71196, 70941, 71221, 71712, 72084, 72580, 73512, 74732, 75994, 77297, 78532, 79369, 79846, 80432, 81116, 81133, 80120, 78801, 77896, 77083, 75798, 74373, 73474, 72980, 72407, 71997, 72369, 73420, 74560, 75744, 77244, 78670, 79305, 79301, 79410, 79597, 79054, 77712, 76662, 76734, 77601, 78586, 79511, 80357, 80892, 81095]
55150H1095K20L10p2p20q78l49L51P98R54Q61N96L68J72k81q86q90O9J155J304
55131H4177N86j13l87m74m68k55j6l7q1K27N73K54o76j346j166m31K40N08K93
55112H1408k98q80r93n12K89J022J395J313R97P99P23N07K75N23J176J345O11
55095H9700j46O2Q00Q55Q0l89J88J194J577J018m0r77j354j069m47k2o9m55q12
55076H9694p80k25N58J026R34N19N8l59n57k96J71J06o53j251r47j87J26m9m0
55057H7848L26N19K09l31p30q22n31L7M79M88L05L02L81L31M27R65J471J225M78
55038I3377K10O07P03j36j202j505j122q65r22o50L58J529J944J394N32mk27m53
55020I3568o12l91Q2J79l33q78p92j50M39N72L38Q1J34N22P85M26l44o94k44M49
$$ y = [81095, 81315, 81625, 81553, 80833, 79955, 79606, 79957, 80755, 81709, 82570, 83166, 83534, 83706, 83425, 82539, 81649, 81718, 82873, 84177, 84763, 84650, 84263, 83789, 83321, 83066, 83050, 83013, 82932, 83159, 83732, 83986, 83310, 81964, 80798, 80367, 80607, 81115, 81408, 81110, 80230, 79237, 78725, 79014, 80036, 81431, 82744, 83741, 84540, 85263, 85770, 86045, 86568, 87744, 89089, 89700, 89554, 89616, 90416, 91271, 91351, 90962, 91150, 92344, 93921, 94939, 94899, 93922, 92568, 91499, 91052, 91030, 90961, 90506, 89694, 88914, 88689, 89247, 90273, 91207, 91726, 91784, 91425, 90868, 90572, 90743, 90849, 90196, 88945, 87998, 87811, 87937, 87888, 87848, 88174, 88693, 88902, 88571, 87841, 87019, 86488, 86525, 87004, 87492, 87797, 88099, 88480, 88811, 89238, 90203, 91674, 92899, 93377, 93587, 94194, 94897, 94761, 93559, 92054, 90932, 90067, 89145, 88495, 88853, 90382, 92326, 93720, 94252, 94248, 94021, 93568, 92956, 92565, 92647, 92826, 92493, 91615, 90823, 90673, 91112, 91684, 92022, 92103, 92237, 92759, 93544, 93970, 93626, 92932, 92688, 93137]
55000I3137P28O25M95M42N25R63J623J794J103J79k18k48n20r87j082o63j08K81
54982I8069L41k07j302k123j869q42l9J68K30N03Q72J203J423J202L43n43n35
54965I6894L77J184J156N85J88K77O88J036R72N96M97J039J665J493M43p17j356
54948A07017j443j175p77n82p14p31k04N13P41N86P46J292J458Q10j71q75j263
54931A05228j508j478r47K5J110J870J954J520J268J701K484L034L463M271N376
54916A29371O146O277N910N082L838K685K079J531J94j699l017l364l520m080
54902A47433m753n251n726n947n139l298j659j174j264q97j63O1m07q21n74P6
54886A10497M08O7n14n18K98J235J557J511J826K454K697K514K638L294L870M119
$$ y = [93137, 93865, 94490, 94985, 95427, 95952, 96915, 98538, 100332, 101435, 101614, 101396, 101148, 100628, 99641, 98559, 97896, 97788, 98069, 98410, 98203, 96901, 94778, 92909, 92067, 92028, 92196, 92426, 92929, 93801, 95004, 96427, 97629, 97972, 97429, 96894, 97271, 98455, 99611, 100196, 100384, 100661, 101349, 102385, 103357, 103953, 104450, 105489, 107154, 108647, 109090, 108373, 107017, 105574, 104399, 103622, 103040, 102326, 101595, 101391, 101904, 102645, 103231, 103977, 105269, 106727, 107537, 107366, 106491, 105228, 103720, 102242, 101295, 101320, 102430, 104300, 106254, 107774, 109042, 110743, 113227, 116261, 119724, 123995, 129371, 135517, 141794, 147704, 152786, 156624, 159309, 161388, 162919, 163113, 161414, 158397, 155033, 151513, 147433, 142680, 137429, 131703, 125756, 120617, 117319, 115660, 114486, 113222, 112325, 112162, 112223, 111816, 110995, 110421, 110497, 110905, 110972, 110458, 109940, 110238, 111473, 113030, 114541, 116367, 118821, 121518, 124032, 126670, 129964, 133834, 137953]
54870A37953M554N250N265L979K017K74j113k257k882k975l198l821m092l542
54856A35412l034l441m051l582k264j521j833k266k118j769j658j510j058o55
54842A04652p13j077j376j502j456j078l05N05Q21M98m3k13J37N14M09N7J92R45
54824A00967J465J010m5o61l86L30P55M77l46j046r68l24r6p50j452j132R2J157
54806I9047J430J169Q05N26M52O22P48M90nk93k62j20P5L32L47j30o30m42K39
54787A04400L82m61j457j569p86J06N16N13M85P41J261J651J546J127R47J215
54771A10617J568J699J759J907J861J369R44J522L318N362O381O090N345N076
54757A54818N261N124M169K668J099m95k271m051n430o272o685o546n592m057
$$ y = [137953, 142507, 147757, 153022, 157001, 159018, 159292, 158179, 155922, 153040, 150065, 146867, 143046, 138954, 135412, 132378, 128937, 124886, 121304, 119040, 117519, 115686, 113420, 111302, 109533, 107875, 106365, 105307, 104652, 103939, 102862, 101486, 99984, 98528, 97450, 97145, 97650, 98471, 98969, 98926, 98713, 98850, 99364, 99773, 99830, 100022, 100967, 102432, 103442, 103397, 102736, 102350, 102680, 103435, 103912, 103566, 102520, 101552, 101228, 101132, 100382, 98930, 97798, 97890, 99047, 100477, 101646, 102451, 102977, 103429, 104051, 104799, 105289, 105284, 104991, 104729, 104609, 104684, 105016, 105363, 105233, 104603, 104161, 104400, 104782, 104321, 102864, 101295, 100509, 100615, 101131, 101644, 102129, 102870, 104131, 105782, 107328, 108455, 109402, 110617, 112185, 113884, 115643, 117550, 119411, 120780, 121724, 123246, 126564, 131926, 138307, 144397, 149742, 154818, 160079, 165203, 169372, 172040, 173139, 172644, 170373, 166322, 160892, 154620, 147935, 141389, 135797, 131740]
54743A31740k742k233k260k166j665r39k26L03M19po64r69o96k01R8K16L85N85
54725A18978O82Q73J565K744L899M638N055N209M803L811K999L146L874L878K428
54710A68582J21j957l311m076m458m484m090l264k288j763k059k697k762k072
54696A29422j398j362j675j764j616j522j430j122p83p96j155j493j577j376q27
54681A09526K6P98J123J132J191J202P04l62j403j846j712j378j079q05n38m02
54665A06177n41q38r01m38K19L84j54p65p34j32L92N11M68O04R19J160J079O09
54647A08019J1k61pL99L74k14q63r46k34Q87J722J864J580J362J203O47l64j261
54629A13918j623j648j432n82Q98J936J566L48l67l21l72p17m92N59J302R19K67
$$ y = [131740, 128998, 126765, 124505, 122339, 120674, 119735, 119509, 119812, 120231, 120224, 119560, 118591, 117895, 117694, 117792, 118008, 118393, 118978, 119660, 120533, 122098, 124842, 128741, 133379, 138434, 143643, 148446, 152257, 155256, 158402, 162276, 166154, 168582, 168703, 166746, 163435, 159359, 154901, 150417, 146327, 143063, 140775, 139012, 136953, 134256, 131494, 129422, 128024, 126662, 124987, 123223, 121607, 120085, 118655, 117533, 116750, 115954, 114799, 113306, 111729, 110353, 109526, 109552, 110350, 111473, 112605, 113796, 114998, 115702, 115340, 113937, 112091, 110379, 109001, 107922, 107117, 106579, 106177, 105636, 104798, 103897, 103459, 103678, 104062, 103908, 103143, 102409, 102277, 102669, 103180, 103648, 104252, 105171, 106331, 107410, 108019, 108030, 107769, 107762, 108161, 108535, 108321, 107458, 106512, 106278, 107165, 108887, 110751, 112331, 113693, 114896, 115543, 115179, 113918, 112295, 110647, 109215, 108633, 109531, 111467, 113033, 113381, 113014, 112693, 112321, 111604, 111112, 111671, 112973, 113892, 114159]
54612A14159M81J079P33n27j284r01l25l80m93J41J034J091K84l79l94k53l48
54595A13718l28J52P45R57Q43O69L85j12n85q68j314k138k632j819O9J573J688
54578A11003R30M69O83R86P93J98k26n5N36R39P86L63J52J99K38K73N10Q07P89
54559A20373N49N89R15Q57N6r06j220q61m60n11r79j428j339n62M17R06Q30O69
54541A17895O63N95N09Q03J406J557R76N18R91J876J959R71j58n36j88K37K00
54524A30274k78o63n09j12k55j114j945k097j825j626j373o97J89P44R03R78R70
54507A21564N98j11p91j217j379j206o56J8M14L38m8k83J63J228J874J053p42
54490A20817j806j404n98m06l38L67J145J074N64O90J337J468Q78L82L85N51P67
$$ y = [114159, 114640, 115719, 116452, 115925, 114641, 113740, 113415, 113035, 112542, 112683, 113717, 114808, 115092, 114713, 114319, 114066, 113718, 113390, 113542, 114287, 115244, 116087, 116756, 117141, 117029, 116444, 115576, 114262, 112124, 109492, 107673, 107742, 109315, 111003, 111933, 112402, 113085, 114071, 114864, 115062, 114836, 114781, 115317, 116256, 117042, 117405, 117557, 117756, 117994, 118267, 118777, 119584, 120373, 120922, 121511, 122426, 123283, 123339, 122433, 121213, 120352, 119892, 119381, 118402, 116974, 115635, 115073, 115490, 116396, 117226, 117895, 118558, 119153, 119662, 120465, 121871, 123428, 124404, 124922, 125913, 127789, 129748, 130719, 130561, 130025, 129837, 130074, 130274, 129996, 129333, 128824, 128712, 128457, 127343, 125398, 123301, 121476, 119850, 118477, 117780, 117969, 118713, 119616, 120594, 121564, 122162, 122051, 121260, 120043, 118664, 117458, 116802, 116820, 117234, 117572, 117524, 117241, 117404, 118632, 120506, 121559, 120817, 119011, 117607, 117009, 116603, 116265, 116632, 117777, 118851, 119415, 120105, 121442, 122910, 123788, 124170, 124555, 125106, 125873]
54473A25873J192J499J243Q55J125J771J880J533J591J885J241m20j631j514q78
54458A37245o61o33l82k08l18k59Q6O5m12l98M20Q27j2r86p13K45M53J8J89R34
54438A35500Q11o83k190k408j647r11m16J82P96R44N15l2k86l63o38j143j378
54421A26653r05N3Q89J410J876K213J897R07J65M09J160J389Q76K35j10k71l75
54404A38471l13o7K21N06P91R59R63J053J329J328O16l88q14n12j72k45l78j72
54386A43176J33J16j02j02J36J85k04p48r44n73J12O13N84J39k25j27K57L73l9
54367A42760n22m03L52J015R69M90L83R46J611J652J034M24M68J106J595J326
54351A55206O08M53J347K515K753J868R03R10J841K638K306Q53p19j424j385j546
$$ y = [125873, 127065, 128564, 129807, 130662, 131787, 133558, 135438, 136971, 138562, 140447, 141688, 141268, 139637, 138123, 137245, 136584, 135951, 135569, 135361, 135043, 134784, 134870, 134935, 134523, 134125, 134545, 135372, 135360, 134374, 133661, 133906, 134359, 134377, 134566, 135500, 136311, 135628, 133438, 131030, 129383, 128472, 128056, 128238, 129034, 129978, 130493, 130461, 130175, 129812, 129174, 128031, 126653, 125748, 125801, 126690, 128100, 129976, 132189, 134086, 134993, 135158, 135567, 136727, 138116, 138992, 139227, 139117, 138846, 138471, 138158, 138091, 138312, 138818, 139609, 140568, 141531, 142584, 143913, 145241, 145857, 145469, 144655, 144143, 143971, 143726, 143348, 143176, 143309, 143425, 143323, 143221, 143357, 143542, 143338, 142590, 141646, 141073, 141185, 141798, 142382, 142521, 142296, 142169, 142426, 142799, 142760, 142238, 141835, 142187, 143202, 144171, 144661, 145044, 145990, 147601, 149253, 150287, 150711, 151179, 152285, 153880, 155206, 155814, 156267, 157614, 160129, 162882, 164750, 165653, 166563, 168404, 171042, 173348, 174201, 173482, 172058, 170673, 169127]
54335A69127k255k757k481k090k417k958k521j098M2J72j44k83m32q20j097r96
54319A46992p77n09K07J274J700Q79l68q08l59J14J05j71m50p45j097j414j526
54302A43047j205m01M18N92J14l51m30m34n62n84n34q83j492j409l16P42Q71O22
54284A37805Q37J144P53L7p3K73J54m22n59p1K48K2k64l04l15k72J10N44L74k11
54264A39810k53M45R86Q69O29O30M15j25p2J157K622L042K427J622Q28l00j478
54247A53254j833j257p11r26j436j255j56J079J451O26q35j937j990j038K64J148
54231A44448J176N00k45m43j6N67P90M96j80j011j753k141j949j117Q8J067J253
54214A41530P03J28J01M14M80J64j27r9J18K55K00n4m09n94l68J55O22Q12P14
$$ y = [169127, 166872, 164115, 161634, 159544, 157127, 154169, 151648, 150550, 150592, 150764, 150620, 150337, 149905, 149085, 147988, 146992, 146215, 145706, 145913, 147187, 148887, 149766, 149398, 148590, 148231, 148345, 148450, 148279, 147829, 147084, 145987, 144573, 143047, 141842, 141441, 141859, 142451, 142565, 142214, 141784, 141350, 140788, 140204, 139670, 138787, 137295, 135886, 135570, 136312, 137183, 137805, 138642, 139786, 140539, 140576, 140503, 140776, 140930, 140508, 139949, 139878, 140126, 140148, 139884, 139580, 139265, 138993, 139103, 139647, 140021, 139810, 139557, 140002, 140988, 141857, 142486, 143116, 143531, 143406, 143334, 144491, 147113, 150155, 152582, 154204, 155032, 154732, 153254, 151421, 150164, 149453, 148527, 147091, 145836, 145680, 146759, 148210, 148836, 148001, 146064, 144074, 143036, 143300, 144448, 145624, 146124, 145879, 145436, 145420, 145987, 146777, 147273, 147093, 146082, 144329, 142188, 140239, 139122, 139210, 140277, 141530, 142233, 142361, 142462, 142876, 143356, 143520, 143393, 143294, 143412, 143667, 143867, 143813, 143404, 142810, 142442, 142597, 143219, 144031, 144745]
54195A44745L04l75j017j222r01k86L21O17L15n01j190j185o35j08K21N62Q63
54178A40528P84K91k71p47j180j329q02J67P81P43O39R39J248R88K97j88k03r
54160A42676R4K4j62l41l73k96l28n62p95p78m87m6L37L91O0k39rN84P64J62o75
54139A40001r84o85k42J08N46J225J880K011J406M80j1K18O69P54N73N58N95J76
54121A49278o33j106q65k93K57Q28J224Q43k99j106p37J53L55j31j83O98J689
54104A49972J797R86j17j025j538j478p94K18J002J212R89P54P08N89L7q17j321
54087A51174r62J20J327K083K071J331L87n7J53L93N3o45r36m92K71Q18J018J014
54069A59121R40Q57Q23Q97J089J377J760K297L080L994M591M505M067M151N128
$$ y = [144745, 145049, 144674, 143657, 142435, 141534, 141248, 141569, 142186, 142501, 142000, 140810, 139625, 138990, 138882, 139103, 139665, 140528, 141312, 141603, 141332, 140585, 139405, 138076, 137274, 137441, 138222, 138965, 139604, 140543, 141791, 142779, 143076, 142888, 142685, 142676, 142770, 142794, 142632, 142291, 141918, 141622, 141294, 140732, 139937, 139159, 138672, 138626, 138963, 139354, 139414, 139175, 139166, 139750, 140514, 140676, 140001, 139017, 138332, 138090, 138198, 138744, 139969, 141849, 143860, 145266, 145746, 145735, 145953, 146622, 147376, 147949, 148507, 149102, 149278, 148645, 147539, 146674, 146381, 146638, 147466, 148690, 149533, 149234, 148128, 147391, 147544, 147899, 147768, 147585, 148283, 149972, 151769, 152755, 152638, 151613, 150075, 148597, 147803, 148021, 149023, 150235, 151224, 151978, 152686, 153275, 153312, 152495, 151174, 150212, 150332, 151659, 153742, 155813, 157144, 157531, 157474, 157627, 158020, 158073, 157428, 156492, 156000, 156271, 157089, 158107, 159121, 160061, 160918, 161741, 162638, 163727, 165104, 166864, 169161, 172241, 176235, 180826, 185331, 189398, 193549, 198677]
54054A98677O260O430N259L261J139p20k144l062l491l465l011k379k054k221
54040A98479k287j466K39J977K976L187K950K631K660L428M706N499M989L428
54026B33396J808P98L82M05Q29J360J409Q07J94K60P52P78J7r31j485j821k357
54009B36601k959l201l130l166l373l387l159l165l586l800l134j819p09k07n
53994A97801J31j29j080k276k819k349j375o60n22q31j272j495j187m18K09J57
53978A81885l62o40m10j14r6p1L62R99J309J115P26N70R42J899L035L597L156
53961A97902K015Q22N1J8P48J519J187l42j647j564q38r13j586j358Q4J272J227
53944A98597P64R36J492J762J991K627L173K890K217K351L617N174O187O495O187
$$ y = [198677, 204937, 211367, 216626, 219887, 221026, 220306, 218162, 215100, 211609, 208144, 205133, 202754, 200700, 198479, 196192, 194726, 194965, 196942, 199918, 203105, 206055, 208686, 211346, 214774, 219480, 224979, 229968, 233396, 235204, 236002, 236384, 236789, 237618, 238978, 240387, 241194, 241388, 241648, 242400, 243178, 243195, 242264, 240779, 238958, 236601, 233642, 230441, 227311, 224145, 220772, 217385, 214226, 211061, 207475, 203675, 200541, 198722, 198013, 197806, 197801, 197932, 197803, 196723, 194447, 191628, 189279, 187904, 187244, 186722, 185891, 184619, 183124, 181937, 181519, 181728, 181885, 181523, 180883, 180473, 180359, 180263, 180192, 180554, 181553, 182862, 183977, 184703, 185273, 186215, 188114, 191149, 194746, 197902, 199917, 200739, 200790, 200808, 201556, 203075, 204262, 203920, 202273, 200709, 199871, 198958, 197372, 196014, 196098, 197370, 198597, 199361, 200297, 201789, 203551, 205542, 208169, 211342, 214232, 216449, 218800, 222417, 227591, 233778, 240273, 246460]
53929B46460N301M022K758J864J583J970K639K955K862L040L861M676M829M776
53915B93596N418O672P692Q194Q700R524J0472J1323J1762J0881P877L431o05
53902C94937l170m838o408p657q040p711p191o583n870n503n873o471o352n424
53888C07846m671m987o147p061o834n550m137l484l646l942l807l324k938k902
53874B44416l120l238k853j917j021j003k044l405m173l969k969j617n89m99j302
53859B10697k256k738k778k538j790n04M53M5j492k691k549j628j128j391j777
53844A85935j769j544j374j046k48P16J083O33K2q0J42J16j00Q4P00R89N24o9
53826A84714o7K79K48j16j38K57L56j17l72L30J517K020J458O49N52J246J990
$$ y = [246460, 251761, 255783, 258541, 260405, 261988, 263958, 266597, 269552, 272414, 275454, 279315, 283991, 288820, 293596, 299014, 305686, 313378, 321572, 330272, 339796, 350268, 361591, 373353, 384234, 392111, 395542, 394937, 391767, 386929, 380521, 372864, 364824, 357113, 349922, 343339, 337469, 331966, 326093, 319622, 313270, 307846, 303175, 298188, 292041, 284980, 278146, 272596, 268459, 264975, 261329, 257387, 253580, 250256, 247318, 244416, 241296, 238058, 235205, 233288, 232267, 231264, 229220, 225815, 221642, 217673, 214704, 213087, 212498, 211999, 210697, 208441, 205703, 202925, 200387, 198597, 198093, 198546, 198591, 197099, 194408, 191859, 190231, 189103, 187712, 185935, 184166, 182622, 181248, 180202, 179954, 180670, 181753, 182386, 182408, 182328, 182470, 182586, 182486, 182570, 183270, 184259, 184783, 184714, 184647, 184926, 185174, 185058, 184920, 185177, 185533, 185416, 185044, 185374, 186891, 188911, 190369, 191018, 191570, 192816, 194806]
53809A94806K072J472Q35Q43J616K709L634M221M474M356L887L277K792K596K787
53794B36377L398M118M283L495K207J320J243J582J739J513J009L76k29o24p72
53779B61035q57j111j612k281k861k971k492j955k106l004l884m149m075m178
53765B23499m256l723k664j889j852k058j884j477j448j928k377k310j806j197
53751A92630n25L06J021J023K03o65p38j98j2n53j074p88L7N64N67N22P16Q63
53733A93899P06M35L66N22P15Q03Q07R00J265J778J957J541R29P04Q30P91M46
53716B09394K39M66Q68J104J216J405J714K009K111J879J474J432K022K675K670
53701B32678K246K311K925L082K389J896K589L849M335L861L338L217L030K429
$$ y = [194806, 196878, 198350, 199185, 200028, 201644, 204353, 207987, 212208, 216682, 221038, 224925, 228202, 230994, 233590, 236377, 239775, 243893, 248176, 251671, 253878, 255198, 256441, 258023, 259762, 261275, 262284, 262660, 262431, 261807, 261035, 260178, 259067, 257455, 255174, 252313, 249342, 246850, 244895, 242789, 239785, 235901, 231752, 227677, 223499, 219243, 215520, 212856, 210967, 209115, 207057, 205173, 203696, 202248, 200320, 197943, 195633, 193827, 192630, 192105, 192411, 193432, 194455, 194658, 193993, 193255, 193057, 193045, 192492, 191418, 190630, 190667, 191231, 191798, 192320, 193036, 193899, 194605, 195040, 195406, 195928, 196643, 197446, 198253, 199153, 200418, 202196, 204153, 205694, 206623, 207327, 208157, 208948, 209394, 209633, 210099, 210967, 212071, 213287, 214692, 216406, 218415, 220526, 222405, 223879, 225311, 227333, 230008, 232678, 234924, 237235, 240160, 243242, 245631, 247527, 250116, 253965, 258300, 262161, 265499, 268716, 271746, 274175]
53687B74175J773J423J232R25M63j79j032j833k105j777j261p98k14M54O77J74
53671B72097n14o77m59n80j251j883j972j706j422r80j57O38O26k10q89n82L46
53654B60425Q10L49m91r36p77l36N8M19J029J936K505J865R3j462j562n15M34
53637B63844Q26J226J918K414K462K497K634K228J066J05K41J002J350J181J174
53622B86168J487J622J435J388J811K572L400M034M114L557K907K765L069L438
53608C23767L914M718N496N690N462N411N473N026M135L686M049M540M530M235
53594C90132M000L589K780J958J480R20l04j893k926l040k750k641k717k654k346
53579C83588k030j972k157k300k151j788j505j479j644j853j995k013j967k007
$$ y = [274175, 275948, 277371, 278603, 279528, 279991, 279812, 278780, 276947, 274842, 273065, 271804, 271006, 270792, 271246, 271923, 272097, 271583, 270906, 270447, 269867, 268616, 266733, 264761, 263055, 261633, 260653, 260496, 261134, 261760, 261550, 260661, 260079, 260425, 261235, 261584, 261093, 260157, 259380, 259044, 259102, 259521, 260550, 262486, 264991, 266856, 266949, 265487, 263925, 263410, 263844, 264670, 265896, 267814, 270228, 272690, 275187, 277821, 280049, 281115, 281220, 281461, 282463, 283813, 284994, 286168, 287655, 289277, 290712, 292100, 293911, 296483, 299883, 303917, 308031, 311588, 314495, 317260, 320329, 323767, 327681, 332399, 337895, 343585, 349047, 354458, 359931, 364957, 369092, 372778, 376827, 381367, 385897, 390132, 394132, 397721, 400501, 402459, 403939, 404859, 404555, 402662, 399736, 396696, 393946, 391305, 388588, 385934, 383588, 381558, 379586, 377429, 375129, 372978, 371190, 369685, 368206, 366562, 364709, 362714, 360701, 358734, 356727]
53565C56727k123k026j512p74j14M73J122J671J786J425Q08R4n16o40j62L69M11
53548C57019L30R05K004K669K565K457K929L459L311K674K261K294K545K965L716
53533C94103M661N408N736N775N796O073O711P451P862P922Q144Q948J0210J1564
53519D96364J2746J3471J3502J3145J3213J4037J4953J5283J5454J6481J8549
53508F57198K0752K2186K2771K2961K3158K3499K3891K4017K3597K2728K1824
53497I08582K1231K1000K1020K1201K1414K1481K1300K0952K0644K0449K0139
53486A139413J9393J8320J7568J7647J8274J8703J8636J8403J8236J7957J7419
53475A339969J6728J5810J4350J2462J0841R816Q756O906M415J967j84k205m028
$$ y = [356727, 354604, 352578, 351066, 350292, 350178, 350651, 351773, 353444, 355230, 356655, 357463, 357557, 357041, 356401, 356239, 356608, 357019, 357349, 358254, 360258, 362927, 365492, 367949, 370878, 374337, 377648, 380322, 382583, 384877, 387422, 390387, 394103, 398764, 404172, 409908, 415683, 421479, 427552, 434263, 441714, 449576, 457498, 465642, 474590, 484800, 496364, 509110, 522581, 536083, 549228, 562441, 576478, 591431, 606714, 622168, 638649, 657198, 677950, 700136, 722907, 745868, 769026, 792525, 816416, 840433, 864030, 886758, 908582, 929813, 950813, 971833, 993034, 1014448, 1035929, 1057229, 1078181, 1098825, 1119274, 1139413, 1158806, 1177126, 1194694, 1212341, 1230615, 1249318, 1267954, 1286357, 1304593, 1322550, 1339969, 1356697, 1372507, 1386857, 1399319, 1410160, 1419976, 1428732, 1435638, 1440053, 1442020, 1441836, 1439631, 1435603]
53462A435603n437o710q394j0444j2125j2938j3149j3350j3934j5095j6812j8616
53450A288599j9837k0224k0082j9706j9110j8478j8333j8907j9602j9465j8171
53439A076684j6206j4276j2704j1311r702p689n636m229l758l742l446k592j305
53426I80088M03K601M918O585P279P547Q119R105J0168J1204J2386J3694J4902
53413A088999J6037J7337J8739J9854K0654K1724K3497K5654K7490K8730K9674
53402A338389L0799L2385L4336L6206L7659L9040M1082M3886M6646M8654N0089
53391A779171N1432N2601N3281N3596N3876N4047N3929N3731N3602N2979N1198
53380B363443M8563M6085M4288M2899M1472L9508L6271L1536K6390K2250J9127
$$ y = [1435603, 1430166, 1423456, 1415062, 1404618, 1392493, 1379555, 1366406, 1353056, 1339122, 1324027, 1307215, 1288599, 1268762, 1248538, 1228456, 1208750, 1189640, 1171162, 1152829, 1133922, 1114320, 1094855, 1076684, 1060478, 1046202, 1033498, 1022187, 1012485, 1004796, 999160, 994931, 991173, 987431, 983985, 981393, 980088, 980491, 983092, 988010, 994595, 1001874, 1009421, 1017540, 1026645, 1036813, 1048017, 1060403, 1074097, 1088999, 1105036, 1122373, 1141112, 1160966, 1181620, 1203344, 1226841, 1252495, 1279985, 1308715, 1338389, 1369188, 1401573, 1435909, 1472115, 1509774, 1548814, 1589896, 1633782, 1680428, 1729082, 1779171, 1830603, 1883204, 1936485, 1990081, 2043957, 2098004, 2151933, 2205664, 2259266, 2312245, 2363443, 2412006, 2458091, 2502379, 2545278, 2586750, 2626258, 2662529, 2694065, 2720455, 2742705, 2761832]
53369B761832J5830J1777P392K693l052r925j6862k3195k9369l5555m0789m4369
53357B596408m6972m9403n1230n1730n1317n0879n0362m9220m7690m6438m5401
53346B055766m4087m2698m1811m1323m0789m0470m0834m1202m0249l7851l5214
53335A609238l3033l0748k7963k5337k3474k1826j9506j6580j4023j2602j2280
53324A371866j2460j2585j2632j3056j4028j4987j5274j5005j4652j4061j2684
53313A220442j0728r175q487q107p431o507n498m262k880j866j330n76Q89K547
53299A157031L724M728O408Q817J1114J2754J4129J5896J8124K0348K2144K3478
53287A318695K4514K5281K5606K5387K4848K4302K3662K2493K0656J8684J7234
$$ y = [2761832, 2777662, 2789439, 2796831, 2799524, 2796472, 2786547, 2769685, 2746490, 2717121, 2681566, 2640777, 2596408, 2549436, 2500033, 2448803, 2397073, 2345756, 2294877, 2244515, 2195295, 2147605, 2101167, 2055766, 2011679, 1968981, 1927170, 1885847, 1845058, 1804588, 1763754, 1722552, 1682303, 1644452, 1609238, 1576205, 1545457, 1517494, 1492157, 1468683, 1446857, 1427351, 1410771, 1396748, 1384146, 1371866, 1359406, 1346821, 1334189, 1321133, 1307105, 1292118, 1276844, 1261839, 1247187, 1233126, 1220442, 1209714, 1200539, 1192052, 1183945, 1176514, 1170007, 1164509, 1160247, 1157367, 1155501, 1154171, 1153595, 1154484, 1157031, 1160755, 1165483, 1171891, 1180708, 1191822, 1204576, 1218705, 1234601, 1252725, 1273073, 1295217, 1318695, 1343209, 1368490, 1394096, 1419483, 1444331, 1468633, 1492295, 1514788, 1535444, 1554128, 1571362]
53276A571362J6283J5039J2681R161N246J824q48l151n457p706r753j1831j4351
53263A578499j7314k0265k2814k4868k6399k7323k7719k7907k8170k8581k9095
53252A298044k9613k9839k9330k7911k6009k4424k3667k3488k3198k2557k2175
53241A015833k2722k3877k4589k4396k3836k3346k2533k1069j9560j8676j7932
53230G73297j6314j3874j1662j0202r068q006p459p652q084q430r058j0197j1248
53217F42043j1586j1560j2001j3121j4385j5201j5189j4195j2574j1301j1098
53206D99832j1541j1495j0443q954p878p550p825q416r033r418r540r555r550
53193C78634r457r319r346r506r266q131o295m522l322k666k518l077m128m697
$$ y = [1571362, 1587645, 1602684, 1615365, 1624526, 1629772, 1631596, 1630748, 1627597, 1622140, 1614434, 1604681, 1592850, 1578499, 1561185, 1540920, 1518106, 1493238, 1466839, 1439516, 1411797, 1383890, 1355720, 1327139, 1298044, 1268431, 1238592, 1209262, 1181351, 1155342, 1130918, 1107251, 1083763, 1060565, 1038008, 1015833, 993111, 969234, 944645, 920249, 896413, 873067, 850534, 829465, 809905, 791229, 773297, 756983, 743109, 731447, 721245, 712177, 704171, 696712, 689060, 680976, 672546, 663488, 653291, 642043, 630457, 618897, 606896, 593775, 579390, 564189, 549000, 534805, 522231, 510930, 499832, 488291, 476796, 466353, 457399, 449521, 441971, 434146, 425730, 416697, 407279, 397739, 388184, 378634, 369177, 359858, 350512, 341006, 331740, 323609, 317314, 312792, 309470, 306804, 304286, 301209, 297081, 292384]
53179B92384m025k749k251k842l368k876j850j355j600j949j913j554j138r22
53165B61992j009j094p06m6J3p94j517j338q70j083j619j348l57K0q33k036k600
53148B44775k416j694n47M40L02r76k109k072j271o55m04j85l7j64k80J03R26
53131B33736J619J722J213M12j72k24JM8L5M86J292J657J316R93J210J483J289
53114B48116J005J155J405J217Q68R03R49J62j350k503k656k332k324k718k947
53099B38950k476j370l42j19o04r71p59m29m28m42j11J17k78p88n48K10M61P3
53081B30146M5Q57J628J391M09k68j00N73J093R99K88n53r57q53o35n10l31j06
53063B33116j79o58j065r08l06K16L49J21l33q21j050q32l31J28M08N79O63N80
$$ y = [292384, 288359, 285610, 283359, 280517, 277149, 274273, 272423, 271068, 269468, 267519, 265606, 264052, 262914, 261992, 260983, 259889, 259183, 259137, 259150, 258356, 256839, 255501, 254631, 253548, 251929, 250581, 250224, 250244, 249411, 247375, 244775, 242359, 240665, 240118, 240558, 240860, 239884, 237775, 235703, 234432, 233777, 233373, 233188, 233151, 232987, 232707, 232810, 233736, 235355, 237077, 238290, 238702, 238530, 238306, 238307, 238355, 238390, 238876, 240168, 241825, 243141, 244134, 245344, 246827, 248116, 249121, 250276, 251681, 252898, 253766, 254669, 255618, 255780, 254430, 251927, 249271, 246939, 244615, 241897, 238950, 236474, 235104, 234762, 234643, 234039, 233068, 232309, 231880, 231452, 231010, 230899, 231016, 230738, 229950, 229402, 229612, 230073, 230146, 230191, 231048, 232676, 234067, 234476, 234208, 234108, 234681, 235774, 236773, 237061, 236508, 235551, 234698, 234063, 233553, 233222, 233116, 232937, 232279, 231214, 230306, 230000, 230216, 230565, 230686, 230353, 229532, 228482, 227650, 227319, 227447, 227855, 228434, 229097, 229677]
53045B29677L16mk76n56r37j326j475j235p34k19J97N16O20L44j78n03l84o6O1
53026B23838l4q4K4J17K9j23p0L36R27J357J454J379J314J090L85p12j627j894
53008B27706j546p76L49J691K747K975K282J119J53j52J49M80L38n8l7N64J087
52991B39071R37L23j08q5J95M12L43k5l27o3P77J576J837J703J478J134N74M6
52973B49798j59l3L75J125J949K181J637J023R85J192J039P19P82J070J000O48
52957B65331M95L03o33k073k801k329j617j583j866j731j386j463j672j074K65
52942B46166R40k5j688k196j099J38J08p88j207q77p16j030r49k0P77M60m29p52
52924B36813n46o79j197j290p46k37q8J05M36L96j62n99m45M1N23R98J299J007
$$ y = [229677, 229993, 229989, 229713, 229157, 228220, 226894, 225419, 224184, 223450, 223231, 223428, 223944, 224564, 224908, 224730, 224227, 223843, 223777, 223838, 223804, 223720, 223744, 223861, 223890, 223767, 223697, 224033, 224960, 226317, 227771, 229150, 230464, 231554, 231939, 231227, 229600, 227706, 226160, 225384, 225733, 227424, 230171, 233146, 235428, 236547, 236700, 236548, 236697, 237177, 237515, 237457, 237420, 237984, 239071, 240008, 240331, 240223, 240138, 240333, 240745, 241088, 241063, 240736, 240673, 241450, 243026, 244863, 246566, 248044, 249178, 249752, 249798, 249639, 249606, 249981, 251106, 253055, 255236, 256873, 257896, 258881, 260073, 261112, 261831, 262613, 263683, 264683, 265331, 265826, 266129, 265496, 263423, 260622, 258293, 256676, 255093, 253227, 251496, 250110, 248647, 246975, 245901, 246166, 247106, 247081, 245393, 243197, 242098, 242236, 242344, 241556, 240349, 239472, 238756, 237726, 236777, 236757, 237534, 237994, 237565, 236813, 236267, 235588, 234391, 233101, 232355, 232118, 232030, 232135, 232571, 232967, 232805, 232206, 231761, 231802, 232325, 233323, 234622, 235629]
52906B35629K44j96M1M24M33J78k29r97j860j883p88L52M62j34m54l03j18R5N97
52887B31493J067R27L55L9M6j98q50j358j282p22M8P59R69M70j73j36N55J129
52869B33138J294J493J829J715R89N37J113K159K521J942J159P51O05M14J17k92
52853B51484q29j330j547j478j337j161q37n81r23j955k979l202k635j978j735
52838B26977j807j862j755j516j215r31o94l85J50P98J190J101O27n4q13j355
52822B18456j260n12K26K86k41p00p78p43q42q92n86J16J034J887K305K077J498
52805B21331J169J201J002J50r17j490j573j702j892j508l91N86N41j97n44j61
52789B15605J73k46j070j435j029k04O11J116J031L45l59l99J53N51M24R5j40
$$ y = [235629, 235873, 235677, 235718, 236142, 236575, 236753, 236524, 235527, 233667, 231784, 230996, 231348, 231810, 231676, 231222, 230919, 230801, 230896, 231493, 232560, 233487, 233842, 233881, 233927, 233729, 232879, 231521, 230239, 229517, 229565, 230324, 231293, 231763, 231590, 231454, 232009, 233138, 234432, 235925, 237754, 239469, 240458, 240995, 242108, 244267, 246788, 248730, 249889, 250640, 251245, 251659, 251776, 251484, 250655, 249325, 247778, 246300, 244963, 243802, 242965, 242384, 241461, 239506, 236527, 233325, 230690, 228712, 226977, 225170, 223308, 221553, 220037, 218822, 217891, 217197, 216812, 216962, 217760, 218950, 220051, 220678, 220624, 219811, 218456, 217196, 216684, 216910, 217196, 216955, 216255, 215477, 214734, 213892, 213000, 212414, 212530, 213564, 215451, 217756, 219833, 221331, 222500, 223701, 224703, 224853, 223936, 222446, 220873, 219171, 217279, 215771, 215380, 215966, 216507, 216310, 215766, 215605, 215778, 215532, 214462, 213027, 211998, 211794, 212405, 213521, 214552, 214897, 214538, 214139, 214292, 214843, 215267, 215362, 215222]
52772B15222m56q76r10l06L77N06K56J26j3n87j303j337n80J23J70o6O9O36J211
52753B12262J424J117L77l72o37m59l50n14n39j43L46N86R32J922L272L969L422
52736B26615K136J133Q88J060J125J044J179J579J713J064j19j069j349j122o06
52721B35271J60Q80Q97n6j314j883j520q72p04j196j890k115j559o56k30n65j000
52704B21648o80L76J331J540J148O28J56k80m31O0J028J654J287K44m82k93M52
52687B29386R80Q95M03pPL62N53K34k01mQ31J389J054L67J92M56M64N1l39n42
52667B36531p90r52n41L15O95O4r95j510j150k14Q29J503J474R58P02J187K138
52650B40244K911L075K515J359P1p98j183j476j829j929j661j374j281j113p61
$$ y = [215222, 214766, 213890, 212980, 212674, 213051, 213557, 213813, 213939, 213926, 213339, 212036, 210699, 210119, 210242, 210412, 210346, 210415, 211051, 212262, 213686, 214803, 215180, 214808, 214171, 213712, 213362, 212848, 212309, 212166, 212512, 213098, 214030, 215952, 219224, 223193, 226615, 228751, 229884, 230772, 231832, 232957, 234001, 235180, 236759, 238472, 239536, 239417, 238348, 236999, 235877, 235271, 235431, 236311, 237208, 237152, 235838, 233955, 232435, 231563, 230859, 229663, 227773, 225658, 224099, 223443, 223213, 222648, 221648, 220968, 221344, 222675, 224215, 225363, 225991, 226147, 225867, 225436, 225496, 226524, 228178, 229465, 229709, 229227, 228934, 229386, 230366, 231261, 231664, 231657, 231664, 232026, 232579, 232813, 232612, 232608, 233439, 234828, 235882, 236249, 236441, 236897, 237361, 237412, 237073, 236531, 235741, 234789, 234248, 234563, 235258, 235322, 234327, 232817, 231667, 231453, 232282, 233785, 235259, 236217, 236919, 238106, 240244, 243155, 246230, 248745, 250104, 250175, 249377, 248194, 246718, 244889, 242960, 241299, 239925, 238644, 237531, 236770]
52635B36770o16q34q69k59N84R88J006J108J270J198J147J696K664L071K417J328
52619B52669O29K81l14j278j949j686o53K57K94m71j345j724j468p89q3K21Lk69
52601B42325o6M18M72o6n41n08l58n37p47m76J27N27O38P53R24J038J298J926
52583B47147K517K330J302K15k22j8M15P48Q07N49J77MQ8J98J16k22p77j325j446
52564B52603r46k20J24L1m3Q7O5m33j097j318q78k29j4m32j015j147p63l38j93
52545B43844j00J86L80K7p40j266j123o07l15m41n63j19P82J208L99j059j691
52528B38802q83L81Q79O19L86M40N04O59J319K253K550J722L37o53p62j86M72
52511B48839O40L99N50J616K941L428K990K534K468K172J169m8q52j367j961k385
$$ y = [236770, 236154, 235320, 234451, 234192, 234776, 235764, 236770, 237878, 239148, 240346, 241493, 243189, 245853, 248924, 251341, 252669, 253298, 253579, 253265, 251987, 250038, 248352, 247699, 247956, 248250, 247779, 246434, 244710, 243242, 242453, 242370, 242591, 242594, 242325, 242259, 242677, 243149, 243083, 242542, 242034, 241676, 241139, 240392, 239916, 240043, 240570, 241208, 241961, 242885, 243923, 245221, 247147, 249664, 251994, 253296, 253511, 253289, 253271, 253686, 254434, 255241, 255790, 255967, 255971, 256059, 256257, 256373, 256151, 255374, 254049, 252603, 251657, 251437, 251561, 251592, 251549, 251636, 251701, 251268, 250171, 248853, 247975, 247746, 247732, 247300, 246285, 245138, 244375, 244037, 243844, 243744, 243930, 244310, 244337, 243597, 242331, 241208, 240601, 240286, 239845, 239282, 239163, 239945, 241153, 241552, 240493, 238802, 237919, 238300, 239179, 239798, 240184, 240624, 241128, 241787, 243106, 245359, 247909, 249631, 249968, 249315, 248553, 248367, 248839, 249479, 249878, 250428, 252044, 254985, 258413, 261403, 263937, 266405, 268577, 269746, 269698, 268846, 267479, 265518, 263133]
52495B63133k165j473r62q92r77r79r45q91o98l88j41J4K33N01N91M13J91J11
52477B54676P6o0j52K5M08P41J056J633K375K564J673J85q16q24k50L86J014J631
52459B66341J907J656J226J036R22M41l78j029j176r92q39r75j491k229k738k584
52443B59098j792q77m29o61j205j380r52n49r20j772k000j221k75J25L90J015
52427B46595J448J011L00M61J337J659R56R5j75l0L46J189K220K400J380L24M93
52410B62009J585K383K528K790L769N158O361P253Q071Q853R195Q551O766M223
52396C39495J424j453m240o257o721n784m646m338m733m978m521l507k442j818
52382B85481j801k056k022j433m15Q31K092K970L203L216L646M314M324L523L011
$$ y = [263133, 260968, 259495, 258533, 257641, 256664, 255685, 254740, 253849, 253151, 252763, 252622, 252636, 252869, 253370, 253961, 254374, 254565, 254676, 254752, 254692, 254540, 254565, 254973, 255714, 256770, 258403, 260778, 263342, 265015, 265200, 264384, 263560, 263310, 263696, 264710, 266341, 268248, 269904, 271130, 272166, 273088, 273529, 273151, 272122, 270946, 269954, 269115, 268140, 266649, 264420, 261682, 259098, 257306, 256429, 256000, 255339, 254134, 252754, 251802, 251253, 250333, 248561, 246561, 245340, 245065, 245190, 245580, 246595, 248043, 249054, 249354, 249815, 251152, 252811, 253767, 253862, 253687, 253657, 254003, 255192, 257412, 259812, 261192, 261516, 262009, 263594, 265977, 268505, 271295, 275064, 280222, 286583, 293836, 301907, 310760, 319955, 328506, 335272, 339495, 340919, 339466, 335226, 328969, 322248, 316464, 311818, 307480, 302747, 297769, 293248, 289741, 287299, 285481, 283680, 281624, 279602, 278169, 277754, 278585, 280677, 283647, 286850, 290066, 293712, 298026, 302350, 305873, 308884]
52367C08884L666M793N016M004K579J432N66k6J3P57J549J553O89k51m11K79J096
52350C36188J389J316J521K144K552K231J513J175J553K342L072L492L612L700
52336C67800M148N137O420P545Q216Q466Q642R226J0451J1977J3191J3868J4373
52323D89460J5137J6227J7507J8861K0164K1282K2200K2887K3038K2379K1301
52312G10443K0716K1012K1642K1905K1766K1529K1248K0845K0484K0331K0221
52301I42142J9864J9215J8285J6930J5122J3223J1606J0208Q761P167N253K598
52289A090374q71m275o445p167p294p645q250q699q772q507q021p488p052o587
52275I93301n653l904j523Q77K782M185N508P134R142J1380J3529J5029J5342
$$ y = [308884, 312550, 317343, 322359, 326363, 328942, 330374, 330940, 330914, 330927, 331684, 333233, 334786, 335475, 335224, 334813, 335092, 336188, 337577, 338893, 340414, 342558, 345110, 347341, 348854, 350029, 351582, 353924, 356996, 360488, 364100, 367800, 371948, 377085, 383505, 391050, 399266, 407732, 416374, 425600, 436051, 448028, 461219, 475087, 489460, 504597, 520824, 538331, 557192, 577356, 598638, 620838, 643725, 666763, 689142, 710443, 731159, 752171, 773813, 795718, 817484, 839013, 860261, 881106, 901590, 921921, 942142, 962006, 981221, 999506, 1016436, 1031558, 1044781, 1056387, 1066595, 1075356, 1082523, 1087776, 1090374, 1089503, 1085228, 1078783, 1071616, 1064322, 1056677, 1048427, 1039728, 1030956, 1022449, 1014428, 1006940, 999888, 993301, 987648, 983744, 982221, 983098, 985880, 990065, 995573, 1002707, 1011849, 1023229, 1036758, 1051787, 1067129]
52262A067129J4616J3835J3835J4400J4777J4845J5086J5518J5584J5158J4810
52251A229593J4672J3954J2077R655P675O240M723K701J32k948o291r220j1236
52238A271727j2596j3863j5127j6121j6767j7070j6850j6124j5518j5652j6303
52227A099736j6726j6560j5924j4910j3620j2417j1532j0599r216p692o564n662
52215I58314m427k976j936j330n69M96J356J814K276K890L272L280L294L383L037
52200I72174K110J350J446K181K924L466L881M157M378M826N425N567M983M227
52186A023095L759L126J755P6j046j697k810m664o467p541q101q522q589q020
52172I74354p195o704o458n880m865l960l489l051k105p62L63Q92R96J093J486
$$ y = [1067129, 1081745, 1095580, 1109415, 1123815, 1138592, 1153437, 1168523, 1184041, 1199625, 1214783, 1229593, 1244265, 1258219, 1270296, 1279951, 1287626, 1293866, 1298589, 1301290, 1301422, 1298474, 1292183, 1282963, 1271727, 1259131, 1245268, 1230141, 1214020, 1197253, 1180183, 1163333, 1147209, 1131691, 1116039, 1099736, 1083010, 1066450, 1050526, 1035616, 1021996, 1009579, 998047, 987448, 978232, 970540, 963976, 958314, 953887, 950911, 948975, 947645, 947076, 947572, 948928, 950742, 953018, 955908, 959180, 962460, 965754, 969137, 972174, 974284, 975634, 977080, 979261, 982185, 985651, 989532, 993689, 998067, 1002893, 1008318, 1013885, 1018868, 1023095, 1026854, 1029980, 1031735, 1031811, 1030765, 1029068, 1026258, 1021594, 1015127, 1007586, 999485, 990963, 982374, 974354, 967159, 960455, 953997, 948117, 943252, 939292, 935803, 932752, 930647, 929885, 930248, 931140, 932136, 933229, 934715]
52157I34715K241L141L739L662L027K377K134K203K189J923J648J707K077K317
52143I69100K088J699J817K506K948K515J692J419J760K033K163K882M372N762
52129A004756O533P588R993J3348J6329J8510K0630K3212K5843K7930K9351L0241
52117A234264L0792L1389L2275L2940L2427L0568K8346K6809K5977K5118K3628
52106A554533K1378J8597J5779J3434J1635R978Q181O503N315M450L257J242j470
52093A672812m269o672q790j1115j3794j6344j8313j9926k1520k2646k2419k0830
52081A486174j8961j7620j6378j4433j1822r257p042m802k234M45K858M929O836
52068A398693Q763J0798J2922J4963J6611J7645J8140J8373J8570J8682J8520
$$ y = [934715, 936956, 940097, 943836, 947498, 950525, 952902, 955036, 957239, 959428, 961351, 962999, 964706, 966783, 969100, 971188, 972887, 974704, 977210, 980158, 982673, 984365, 985784, 987544, 989577, 991740, 994622, 998994, 1004756, 1011289, 1018877, 1028870, 1042218, 1058547, 1077057, 1097687, 1120899, 1146742, 1174672, 1204023, 1234264, 1265056, 1296445, 1328720, 1361660, 1394087, 1424655, 1453001, 1479810, 1505787, 1530905, 1554533, 1575911, 1594508, 1610287, 1623721, 1635356, 1645334, 1653515, 1660018, 1665333, 1669783, 1673040, 1674282, 1672812, 1668543, 1661871, 1653081, 1641966, 1628172, 1611828, 1593515, 1573589, 1552069, 1529423, 1507004, 1486174, 1467213, 1449593, 1433215, 1418782, 1406960, 1397703, 1390661, 1385859, 1383625, 1384070, 1386928, 1391857, 1398693, 1407456, 1418254, 1431176, 1446139, 1462750, 1480395, 1498535, 1516908, 1535478, 1554160, 1572680]
52057A572680J8050J7431J6727J5736J4206J2194J0067Q165O461M565K048j122
52045A697208m535p794j0955j4136j6935j8689j9466k0204k1542k3002k3748k3714
52033A492488k3449k3188k2729k2004k1177k0307j9398j8705j8466j8371j7887
$$ y = [1572680, 1590730, 1608161, 1624888, 1640624, 1654830, 1667024, 1677091, 1685256, 1691717, 1696282, 1698330, 1697208, 1692673, 1684879, 1673924, 1659788, 1642853, 1624164, 1604698, 1584494, 1562952, 1539950, 1516202, 1492488, 1469039, 1445851, 1423122, 1401118, 1379941, 1359634, 1340236, 1321531, 1303065, 1284694, 1266807]
$$ [...]
##END NTUPLES=NMR SPECTRUM
##END=
