##TITLE=AC1600_BMGAH13330_8315788_LLG8LWJYbE
##JCAMPDX= 6.0         $$ Bruker NMR JCAMP-DX V2.0
##DATA TYPE= NMR SPECTRUM
##DATA CLASS= NTUPLES
##ORIGIN= BRUKER
##OWNER= Administrator
$$ 1.72 TOPSPIN		Version 2.1
$$ 2013-11-09 21:00:41.050 -0800  Administrator@X
$$ Compression mode = diff/dup
##.OBSERVE FREQUENCY= 400.02188249412
##.OBSERVE NUCLEUS= ^1H
##.ACQUISITION MODE= SIMULTANEOUS (DQD)
##.ACQUISITION SCHEME= undefined
##.AVERAGES= 8
##.DIGITISER RES= 22
##SPECTROMETER/DATA SYSTEM= spect
##.PULSE SEQUENCE= zg30
##.SOLVENT NAME= COFFEE_meoh
##.SHIFT REFERENCE= INTERNAL, COFFEE_meoh, 1, 14.98509
##AUDIT TRAIL= $$ (NUMBER, WHEN, WHO, WHERE, PROCESS, VERSION, WHAT)
$$ ##TITLE= Audit trail, TOPSPIN		Version 2.1
$$ ##JCAMPDX= 5.01
$$ ##ORIGIN= Bruker BioSpin GmbH
$$ ##OWNER= Administrator
$$ $$ E:\/data/COFFEE/nmr/AC1600_BMGAH13330_8315788_LLG8LWJYbE/10/pdata/1/auditp.txt
$$ ##AUDIT TRAIL=  $$ (NUMBER, WHEN, WHO, WHERE, PROCESS, VERSION, WHAT)
(   1,<2013-11-09 21:00:34.159 -0800>,<Administrator>,<X>,<go>,<TOPSPIN 2.1>,
      <created by zg
	started at 2013-11-09 20:59:27.488 -0800,
	POWCHK enabled, PULCHK disabled,
       configuration hash MD5:
       C8 4E 4E 5D D3 5C D8 9E 9F 52 82 E0 59 8A DE 15
       data hash MD5: 64K
       64 FB C9 7B 5B 98 52 D8 D2 DE 8C 63 0C 86 5E B8>)
(   2,<2013-11-09 21:00:37.144 -0800>,<Administrator>,<X>,<proc1d>,<TOPSPIN 2.1>,
      <Start of raw data processing
       efp LB = 0 FT_mod = 6 PKNL = 1 PHC0 = 0 PHC1 = 0 SI = 32K 
       data hash MD5: 32K
       5E 29 ED 62 CC 88 D0 AE 8F 90 C7 BC A4 09 5A 93>)
(   3,<2013-11-09 21:00:37.441 -0800>,<Administrator>,<X>,<proc1d>,<TOPSPIN 2.1>,
      <pk PHC0 = 91.87866 PHC1 = 0 
       data hash MD5: 32K
       E3 DE 0C 3D 77 9D 29 6F E0 45 A7 56 C9 34 46 BB>)
(   4,<2013-11-09 21:00:37.534 -0800>,<Administrator>,<X>,<proc1d>,<TOPSPIN 2.1>,
      <abs ABSG = 1 
       data hash MD5: 32K
       17 A8 B4 8F 2E 9D D3 BD D3 43 31 56 0B 0B 5D B5>)
(   5,<2013-11-09 21:00:37.628 -0800>,<Administrator>,<X>,<proc1d>,<TOPSPIN 2.1>,
      <abs ABSG = 2 
       data hash MD5: 32K
       A1 22 73 49 4F A2 8B B7 67 EF FB B9 53 B0 7B 49>)
(   6,<2013-11-09 21:00:37.706 -0800>,<Administrator>,<X>,<proc1d>,<TOPSPIN 2.1>,
      <abs ABSG = 3 
       data hash MD5: 32K
       E3 0C 67 98 0B 6F F7 99 D1 B3 0A EB B3 EF B7 A3>)
(   7,<2013-11-09 21:00:37.784 -0800>,<Administrator>,<X>,<proc1d>,<TOPSPIN 2.1>,
      <abs ABSG = 4 
       data hash MD5: 32K
       9C 4B 49 B0 6E DC 99 FC 9E 8F 6A 9C CE B2 54 A2>)
(   8,<2013-11-09 21:00:37.878 -0800>,<Administrator>,<X>,<proc1d>,<TOPSPIN 2.1>,
      <abs ABSG = 5 
       data hash MD5: 32K
       AA 4A 8B C7 AB 82 80 57 2D CF 30 81 9F AF C4 50>)
$$ ##END=
$$ 
$$ $$ hash MD5
$$ $$ 97 3E 54 74 6B 0B CF 67 9D 98 BE D7 1E 32 D8 8A
##$RELAX= 
##$RELAX= 
##$RELAX= 
##$RELAX= 
##$RELAX= 
##$RELAX= 
##$RELAX= 
$$ Bruker specific parameters
$$ --------------------------
##$DU= <E:\>
##$EXPNO= 10
##$NAME= <AC1600_BMGAH13330_8315788_LLG8LWJYbE>
$$ [...]
##$TP= (0..7)
150 150 150 150 150 150 150 150
##$TP07= 0
##$TPNAME0= <>
##$TPNAME1= <>
##$TPNAME2= <>
##$TPNAME3= <>
##$TPNAME4= <>
##$TPNAME5= <>
##$TPNAME6= <>
##$TPNAME7= <>
##$TPOAL= (0..7)
0.5 0.5 0.5 0.5 0.5 0.5 0.5 0.5
##$TPOFFS= (0..7)
0 0 0 0 0 0 0 0
##$TUNHIN= 0
##$TUNHOUT= 0
##$TUNXOUT= 0
##$USERA1= <user>
##$USERA2= <user>
##$USERA3= <user>
##$USERA4= <user>
##$USERA5= <user>
##$V9= 5
##$VALIST= <valist>
##$VCLIST= <CCCCCCCCCCCCCCC>
##$VD= 0
##$VDLIST= <DDDDDDDDDDDDDDD>
##$VPLIST= <PPPPPPPPPPPPPPP>
##$VTLIST= <TTTTTTTTTTTTTTT>
##$WBST= 1024
##$WBSW= 4
##$XGAIN= (0..3)
0 0 0 0
##$XL= 0
##$YL= 0
##$YMAX_a= 641340
##$YMIN_a= -548837
##$ZGOPTNS= <>
##$ZL1= 120
##$ZL2= 120
##$ZL3= 120
##$ZL4= 120
##$ABSF1= 14.98509
##$ABSF2= -5.573092
##$ABSG= 5
##$ABSL= 3
##$ALPHA= 0
##$AQORDER= 0
##$ASSFAC= 0
##$ASSFACI= 0
##$ASSFACX= 0
##$ASSWID= 0
##$AUNMP= <proc_prof1d_extract_pilot.lims>
##$AXLEFT= 0
##$AXNAME= <>
##$AXNUC= <1H>
##$AXRIGHT= 0
##$AXTYPE= 0
##$AXUNIT= <>
##$AZFE= 0.1
##$AZFW= 0.1
##$BCFW= 0
##$BC_mod= 0
##$BYTORDP= 0
##$COROFFS= 0
##$CY= 15
##$DATMOD= 1
##$DC= 0
##$DFILT= <>
##$DTYPP= 0
##$F1P= 0
##$F2P= 0
##$FCOR= 0.5
##$FTSIZE= 32768
##$FT_mod= 6
##$GAMMA= 0
##$GB= 0
##$INTBC= 1
##$INTSCL= 1
##$ISEN= 128
##$LB= 0
##$LEV0= 0
##$LPBIN= 0
##$MAXI= 10000
##$MC2= 0
##$MEAN= 0
##$ME_mod= 0
##$MI= 0
##$NCOEF= 0
##$NC_proc= -8
##$NLEV= 6
##$NOISF1= 0
##$NOISF2= 0
##$NSP= 0
##$NTH_PI= 0
##$NZP= 0
##$OFFSET= 14.98509
##$PC= 1
##$PHC0= 91.87866
##$PHC1= 0
##$PH_mod= 1
##$PKNL= yes
##$PPARMOD= 0
##$PPDIAG= 0
##$PPIPTYP= 0
##$PPMPNUM= 2147483647
##$PPRESOL= 1
##$PSCAL= 4
##$PSIGN= 0
##$PYNMP= <proc.py>
##$REVERSE= no
##$SF= 400.02
##$SI= 32768
##$SIGF1= 0
##$SIGF2= 0
##$SINO= 400
##$SIOLD= 32768
##$SPECTYP= <>
##$SREGLST= <1H.CDCl3>
##$SSB= 0
##$STSI= 32768
##$STSR= 0
##$SW_p= 8223.68421052631
##$SYMM= 0
##$S_DEV= 0
##$TDeff= 65536
##$TDoff= 0
##$TI= <>
##$TILT= no
##$TM1= 0
##$TM2= 0
##$TOPLEV= 0
##$USERP1= <user>
##$USERP2= <user>
##$USERP3= <user>
##$USERP4= <user>
##$USERP5= <user>
##$WDW= 1
##$XDIM= 32768
##$YMAX_p= 459803067
##$YMIN_p= -698832
##$CURPLOT= <Network HP LaserJet P1505>
##$CURPRIN= <$Network HP LaserJet P1505>
##$DFORMAT= <normdp>
##$LAYOUT= <+/1D_H.xwp>
##$LFORMAT= <normlp>
##$PFORMAT= <normpl>
##$SURQMSG= 1
$$ End of Bruker specific parameters
$$ ---------------------------------
##NTUPLES= NMR SPECTRUM
##VAR_NAME=  FREQUENCY,     SPECTRUM/REAL,   SPECTRUM/IMAG
##SYMBOL=    X,             R,               I
##VAR_TYPE=  INDEPENDENT,   DEPENDENT,       DEPENDENT
##VAR_FORM=  AFFN,          ASDF,            ASDF
##VAR_DIM=   32768,         32768,           32768
##UNITS=     HZ,            ARBITRARY UNITS, ARBITRARY UNITS
##FACTOR=    0.250966925370066, 1,           1
##FIRST=     8223.43324360094, -90879,       63776
##LAST=      0,             -219297,         -20710
##MIN=       0,             -698832,         0
##MAX=       8223.43324360094, 459803067,    0
$$ Real data points
##PAGE= N=1
##DATA TABLE= (X++(R..R)), XYDATA
$$ [...]
19549I7941b28225e5350H6851B6707M2316M2343a6517l94160b02919B88774a32571
$$ 97941 -228225 -55350 86851 26707 69023 111366 -16517 -410677 -202919 288774 -132571
19537a58485B20368a49882I8876I464O4199J56405b45903j3422g5645b7835B3974
$$ -158485 220368 -149882 98876 9464 73663 230068 -245903 -259325 -75645 -27835 23974
19525a95951B3498L1962F207d00871A03299d24327i5092k85765J23386J7618O0798
$$ -195951 23498 55460 6207 -400871 103299 -424327 -95092 -380857 -257471 -239853 -179055
19514a79055d3918E4823i1264o5996L2470A03806e9009j68731h3112A98591F0710
$$ -179055 -43918 54823 -91264 -157260 -124790 103806 -59009 -227740 -83112 198591 60710
19502h9300C7035J21939o2154h5423A30675A5795J30135o5071b65008G6832a20905
$$ -89300 37035 158974 96820 -85423 130675 15795 145930 80859 -265008 76832 -120905
19490b40204B22090c14429I550c06346A45821F6938c8767q8948e8013m9887k03940
$$ -240204 222090 -314429 9550 -306346 145821 66938 -38767 -127715 -58013 -107900 -311840
19479c11840A52163c3857R198B41493m6953i3566j05256H343b03363p2554B1657
$$ -311840 152163 -33857 -24659 241493 194540 -93566 -198822 8343 -203363 -275917 21657
19467f7564k32075I9431A5092c12799a19899A7303b20535F042a26092J3734A80988
$$ -67564 -299639 99431 15092 -312799 -119899 17303 -220535 6042 -126092 -112358 180988
19455a0427r6168B74621a14074j21698k9829J27249j589B26335E0146e0380J3269
$$ -10427 -106595 274621 -114074 -235772 -265601 -138352 -139941 226335 50146 -50380 -37111
19444c7111A55115J67879j08517e6515j82256f7477j26881l309k882d2161G2368
$$ -37111 155115 322994 214477 -56515 -238771 -67477 -194358 -197667 -200549 -42161 72368
19432d27985b8389B08378c1262I2309E840f9684m06543E7999B4272N0651A9438
$$ -427985 -28389 208378 -31262 92309 5840 -69684 -476227 57999 24272 74923 19438
19420c29063A08045b10144F8554a42709c7715J7262k720J0610D7601e1179J9691
$$ -329063 108045 -210144 68554 -142709 -37715 -20453 -23173 -12563 47601 -51179 -31488
19409c1488E7875i3168M3098j81275P5893j34658B59417E1969c12419D33459F3210
$$ -31488 57875 -93168 -50070 -231345 -155452 -290110 259417 51969 -312419 433459 63210
19397a90150g0718A00172a48414l6356M5083f6787k14163a2757j63843g3378k55315
$$ -190150 -70718 100172 -148414 -184770 -139687 -66787 -280950 -12757 -176600 -73378 -328693
19386c28693h9369G2758i3304j42166i5799c6472G9692a78818j16392B68811p0650
$$ -328693 -89369 72758 -93304 -235470 -95799 -36472 79692 -178818 -295210 268811 198161
19375A98161b09725O3697B3993b68416F109a17830b0910A4695f394A66070e27854
$$ 198161 -209725 -146028 23993 -268416 6109 -117830 -20910 14695 -6394 166070 -527854
19363F5041c68178F0517a78511e6040B31265c85560O5640D5356h1681A2925d56
$$ 65041 -368178 60517 -178511 -56040 231265 -385560 -319920 45356 -81681 12925 -456
19351A20987j8253c48470J73413j69033g5765j13712e0583o1242A2961b41168
$$ 120987 102734 -348470 -175057 -344090 -75765 -189477 -50583 -111825 12961 -241168
19340c83962a20406k59072e1929b868F8436k1764r035b6100j16816A60278a54534
$$ -383962 -120406 -379478 -51929 -2868 68436 46672 37637 -26100 -142916 160278 -154534
19328A26097a06915j56993A24092a45314D48466j92585A8615a23200j95301d2728
$$ 126097 -106915 -263908 124092 -145314 448466 255881 18615 -123200 -318501 -42728
19317A97841f1994F7257c1760k7873m4142j72754M4490J3314b1874j87688E5256
$$ 197841 -61994 67257 -31760 -59633 -103775 -276529 -232039 -218725 -21874 -209562 55256
19305a6931k06889F8000a64443A62374n4576c03637A90656e9219b4060k25886
$$ -16931 -223820 68000 -164443 162374 107798 -303637 190656 -59219 -24060 -249946
19295b49946B7926L1362A718d7335C35121j61357g0051A53447p1876d8815B3109
$$ -249946 27926 59288 1718 -47335 335121 173764 -70051 153447 81571 -48815 23109
19283H978a4978A45597a92069m9090A75636a45755j26985f9128A21448m5964b33529
$$ 8978 -14978 145597 -192069 -241159 175636 -145755 -272740 -69128 121448 75484 -233529
19271a84300H1653K9786a86026B29363d88246B4463a78282q7539d388k36795c821
$$ -184300 81653 111439 -186026 229363 -488246 24463 -178282 -265821 -4388 -241183 -3821
19259A85348J28850a76360J7399l4135n9483j2277A71540d1714j4897o0315A91883
$$ 185348 314198 -176360 -158961 -193096 -252579 -264856 171540 -41714 -56611 -116926 191883
19247H9649q446C3527a0549o33697d6276q0636m4891j37042D5077b45122H5531
$$ 89649 81203 33527 -10549 -644246 -46276 -126912 -171803 -308845 45077 -245122 85531
19235B04731H661J11254a80597C701J1120b63824d8130A9607a30924j98523c1699
$$ 204731 8661 119915 -180597 3701 14821 -263824 -48130 19607 -130924 -329447 -31699
19223B16757G630b2304m5107q6308B11749f2862B39855R0512A05187c82663F3790
$$ 216757 7630 -22304 -67411 -153719 211749 -62862 239855 330367 105187 -382663 63790
19211f7012j43958b447p0739H0882O1566c0587j4509q4671j43954B38647a60109
$$ -67012 -210970 -2447 -73186 80882 142448 -30587 -45096 -129767 -273721 238647 -160109
19199A33397D8315e7131k80189B12173a11152j67870A36700f0380l5332A49223
$$ 133397 48315 -57131 -337320 212173 -111152 -279022 136700 -60380 -95712 149223
19188b65473H2457f7282i481j75095A31059a38320N9333C58351i38B22204a69030
$$ -265473 82457 -67282 -9481 -184576 131059 -138320 -78987 358351 -938 222204 -169030
19176A4020f0608B5371c9131q8053A22216a96197M0116d7170A6620J59477K66528
$$ 14020 -60608 25371 -39131 -127184 122216 -196197 -156081 -47170 16620 176097 442625
19165D42625a3693k22455d8400p3932l7068K5369j13866h4714f99A1828a45676
$$ 442625 -13693 -236148 -48400 -122332 -159400 -134031 -247897 -84714 -699 11828 -145676
19153A15553c33755K72E3037b9249E6393a22081J9060l75295A1032b61410B25017
$$ 115553 -333755 -333483 53037 -29249 56393 -122081 -103021 -478316 11032 -261410 225017
19141B09797a97852k20012J77286P2566B61122a48541a5770A04586a12465n3298
$$ 209797 -197852 -417864 -240578 -168012 261122 -148541 -15770 104586 -112465 -165763
19131a65763A14351E6262M0709a04676B32465g7078k06758G3051J3477a37907
$$ -165763 114351 56262 96971 -104676 232465 -77078 -283836 73051 86528 -137907
19120e672k12685e466A13907J38207d8993D0851F14O0538a96269C2008e2007a7344
$$ -5672 -218357 -5466 113907 252114 -48993 40851 614 61152 -196269 32008 -52007 -17344
19107I9910J23976b17337G7815L9487C862J58710g4757j03414a6463j28543k53491
$$ 99910 223886 -217337 77815 117302 3862 162572 -74757 -178171 -16463 -145006 -398497
19096c98497r9364I5872h3154p3711J1064l1819M0167j23312p4172a19169j66655
$$ -398497 -497861 95872 -83154 -156865 -145801 -177620 -137453 -260765 -334937 -119169 -285824
19085b85824B93214e36508a63711A36057G64b06278E772c7571m1651k92115a74874
$$ -285824 293214 -536508 -163711 136057 764 -206278 5772 -37571 -79222 -371337 -174874
19073b34991H318b01227A2814M5072H548d18884a44695E5061J11717b60985i9785
$$ -234991 8318 -201227 12814 57886 8548 -418884 -144695 55061 166778 -260985 -99785
19061C97160c0372j88215A42531h9285L303A7515A089J5467J42175b03476j78225
$$ 397160 -30372 -218587 142531 -89285 -85982 17515 1089 16556 158731 -203476 -381701
19050c81701J32166A31215g4740I1951b28134C6060j1215c5650i20k93362F4727
$$ -381701 -249535 131215 -74740 91951 -228134 36060 24845 -35650 -920 -294282 64727
19038A80138g939k2646q4198q4285A11547J2836E2802K86750J062E7239a06608
$$ 180138 -7939 -30585 -114783 -199068 111547 124383 52802 339552 340614 57239 -106608
19026A35211a96180B77498c891j53541B9765J50772J2843b17262k7976l9571m8173
$$ 135211 -196180 277498 -3891 -157432 29765 180537 193380 -217262 -245238 -284809 -332982
19015c32982a62498M6206j89990c9437J2623j40494B32137r7812Q8586h4845B6883
$$ -332982 -162498 -116292 -306282 -39437 -26814 -167308 232137 134325 222911 -84845 26883
19003b19921i0759j28064B4659h0949b2680E5373L2260c934m951j97701b8344
$$ -219921 -90759 -218823 24659 -80949 -22680 55373 87633 -3934 -8885 -206586 -28344
18991b61721a01013j5214A01013b93355e8661j9505D12040G1788c9888A30504
$$ -261721 -101013 -116227 101013 -293355 -58661 -78166 412040 71788 -39888 130504
18980a3320p2235j33342C9016b42706e5393B66355b7981C20074F1257k2104f05240
$$ -13320 -85555 -218897 39016 -242706 -55393 266355 -27981 320074 61257 39153 -605240
18968d2544p9541M1649K0517j4218P999K666A3918Q7727a11852j17226k12925
$$ -42544 -122085 -80436 -59919 -74137 -66138 -63472 13918 101645 -111852 -229078 -442003
18957d42003H783h9941A83270L4097c28402A5714e7305l6596B54815b7526j26861
$$ -442003 8783 -89941 183270 217367 -328402 15714 -57305 -93901 254815 -27526 -154387
18946a54387q2497B38713a84396j80618D4205a96902r4506J40919B0068J33454
$$ -154387 -236884 238713 -184396 -365014 44205 -196902 -291408 -150489 20068 153522
18936A53522a00126H6210A1886K3477J19866p255a10550j56134k34768a58198
$$ 153522 -100126 86210 11886 35363 155229 147974 -110550 -266684 -501452 -158198
18925a65004J1148p4145E6475b51116J24383L7187A57008D3108c35369c6548o000
$$ -165004 -153856 -228001 56475 -251116 -126733 -89546 157008 43108 -335369 -36548 -42548
18914d2548O119B01230c3183p2731A92398a74127D8646a2029A09762O2332a12236
$$ -42548 -36429 201230 -33183 -105914 192398 -174127 48646 -12029 109762 172094 -112236
18902c1246n1861l74515b13882A86605L90426B32652A5387P288a97155h3494p2459
$$ -31246 -83107 -457622 -213882 186605 577031 232652 15387 22675 -197155 -83494 -155953
18891a55953c7434L643A07468d04553J61854Q0028n4487j40714a67940q3875j52746
$$ -155953 -37434 -33791 107468 -404553 -242699 -162671 -217158 -357872 -167940 -251815 -404561
18880d04561c5912F2790l40a60968P3515j06682K167B18309j02923a01580A59918
$$ -404561 -35912 62790 62450 -160968 -87453 -194135 -191968 218309 115386 -101580 159918
18868a24102I9052a9933E5348j7164b10478e6819l6029M4877j9795i295k27567
$$ -124102 99052 -19933 55348 38184 -210478 -56819 -92848 -47971 -67766 -9295 -236862
18857b36862Q9784f7980k6906H6516k687P6798C0977a76872o3752A28782O184
$$ -236862 -147078 -67980 -94886 86516 83829 160627 30977 -176872 -240624 128782 134966
18846A34966Q3477K6427b15424g2718A96958i0071C5661n014c2516q2896A09847
$$ 134966 218443 244870 -215424 -72718 196958 -90071 35661 30647 -32516 -115412 109847
18834C15187j38628a57959G8662a39574A37933M62372A53176a48509A89842c58408
$$ 315187 176559 -157959 78662 -139574 137933 600305 153176 -148509 189842 -358408
18823B37465c02396H9595P6718b58638B73206A20739k3492a7808F7413d85404
$$ 237465 -302396 89595 166313 -258638 273206 120739 97247 -17808 67413 -485404
18812A03977J14198J34937n8492a62480D27538p1373a18819j82054h4589A6145
$$ 103977 218175 353112 294620 -162480 427538 356165 -118819 -300873 -84589 16145
18801b03471B9391a79758n0352f6875o9179F4930b41539E7646c9541m78792a87324
$$ -203471 29391 -179758 -230110 -66875 -136054 64930 -241539 57646 -39541 -518333 -187324
18789a6826E2234a92874d7169k50751a35364k20278J47717l0106d099l01311P7600
$$ -16826 52234 -192874 -47169 -297920 -135364 -355642 -207925 -238031 -4099 -305410 -227810
18778b27810E8284c02714F7509g0969G1725O4265F0961K89572d94523a86069O8047
$$ -227810 58284 -302714 67509 -70969 71725 135990 60961 350533 -494523 -186069 -118022
18767a18022B73839B7334o274K87610F8638K12370d19534A99010a85270B68142
$$ -118022 273839 27334 21060 308670 68638 281008 -419534 199010 -185270 268142
18756b05820g3020B8470b88729J14427k18654C0805i4093G2549J82349A20671
$$ -205820 -73020 28470 -288729 -174302 -392956 30805 -94093 72549 254898 120671
18745A36967F4952L6918J4102a21222c6062A21127e1447k03924f2998p2683p8
$$ 136967 64952 101870 115972 -121222 -36062 121127 -51447 -255371 -62998 -135681 -135759
18734a35759k83599I1702c73449a36583m3096j869h3393C01112a18699j39196
$$ -135759 -419358 91702 -373449 -136583 -179679 -181548 -83393 301112 -118699 -257895
18724b57895a5990j51687A6536J59096f5258p5453H7596a8784D0454A5960a89359
$$ -257895 -15990 -167677 16536 175632 -65258 -140711 87596 -18784 40454 15960 -189359
18712d7471o8674e0217b391j9688B87389a6544k43740i6815m4164N6007j08294
$$ -47471 -116145 -50217 -2391 -22079 287389 -16544 -260284 -96815 -140979 -84972 -193266
18701a93266O3140j21948B38638a6558A5951P0869b17071k0548G3665A0080f7667
$$ -193266 -130126 -252074 238638 -16558 15951 86820 -217071 -237619 73665 10080 -67667
18689c31976m091g2101m3507d7903H6086P2862c83767B755L5925R4880g0900B10357
$$ -331976 -336067 -72101 -115608 -47903 86086 158948 -383767 2755 38680 133560 -70900 210357
18676a69767B14017a46652f9576B95693b50171Q0181C41765A30940i5952F4133
$$ -169767 214017 -146652 -69576 295693 -250171 -169990 341765 130940 -95952 64133
18665C5574i8862I8384c8082j66685A08154d5020n144C5382l60d4779A34586a61715
$$ 35574 -98862 98384 -38082 -204767 108154 -45020 -50164 35382 35022 -44779 134586 -161715
18652B6143f4460k18577B30154a96823m3985l5025a18117c680F43a16880l9625
$$ 26143 -64460 -283037 230154 -196823 -240808 -275833 -118117 -3680 643 -116880 -156505
18641a56505F4688K4559b08206b7451G4053k2757i4267d1903j27669f6054k35695
$$ -156505 64688 89247 -208206 -27451 74053 51296 -94267 -41903 -169572 -66054 -301749
18630c01749b2303B10642a28072A50118a84222B54842C4384a61422A55858a46032
$$ -301749 -22303 210642 -128072 150118 -184222 254842 34384 -161422 155858 -146032
18619b31549A51513n6290b24834K0932g8771B03844g9811m7181k02230M8251g4681
$$ -231549 151513 95223 -224834 -203902 -78771 203844 -79811 -126992 -329222 -280971 -74681
18607D9935h9004C4494a44949q3631R3220C1317K0452a50943F8033a99162B0668
$$ 49935 -89004 34494 -144949 -228580 -135360 31317 51769 -150943 68033 -199162 20668
18595b5425p4573r8103A53027J36798f5637k47505a31197d8774j20677C7977M7695
$$ -25425 -99998 -198101 153027 289825 -65637 -313142 -131197 -48774 -169451 37977 85672
18584H5672A544a34087A3624R5678K02779g9975A91951h4701k8697n0601r5765
$$ 85672 1544 -134087 13624 109302 312081 -79975 191951 -84701 -113398 -163999 -259764
18573b59764O2001B54552a76503B08437b13861m8545A88645h8980p2127g3804
$$ -259764 -197763 254552 -176503 208437 -213861 -262406 188645 -88980 -161107 -73804
18562B0011a58512q3680f1575A41504c6139j17715A90928H2098P0710M69j1970
$$ 20011 -158512 -242192 -61575 141504 -36139 -153854 190928 82098 152808 153277 141307
18551A41307L3014B9250c4184F8303K4920a04733c1795D442a90581k3902A24882
$$ 141307 174321 29250 -34184 68303 93223 -104733 -31795 4442 -190581 -214483 124882
18539b76722a19421m1957K9056A26750a49122A40469a57719g2204G2616C0616
$$ -276722 -119421 -161378 -132322 126750 -149122 140469 -157719 -72204 72616 30616
18528A27625a14957k64230a19946e6792j06404j02330B16605E8675J88745b02521
$$ 127625 -114957 -379187 -119946 -56792 -163196 -265526 216605 58675 247420 -202521
18517G2782b21067C0036K8095L8617O4792a37626I7196m8364b2257B09304i1740
$$ 72782 -221067 30036 58131 96748 161540 -137626 97196 48832 -22257 209304 -91740
18505B5245J13291b19169R4902f0621C1132I735K13305e34132f1949i99r5274
$$ 25245 138536 -219169 -124267 -60621 31132 9735 223040 -534132 -61949 -999 -96273
18494i6273l07167A71197b13122j31322A26318a18622Q479k7121e6147j69064
$$ -96273 -403440 171197 -213122 -344444 126318 -118622 -110143 -137264 -56147 -225211
18484b25211N1342a2616k0972A20275m1318d23443G1340k9298a98714j11258B57375
$$ -225211 -173869 -12616 -33588 120275 78957 -423443 71340 42042 -198714 -309972 257375
18472D1924K50355a0131n8794m767J2428l61224B41055r4423b0718A8427a14009
$$ 41924 292279 -10131 -68925 -73692 -61264 -422488 241055 146632 -20718 18427 -114009
18460b94632A42833a40844l8128j31288E1056j0939K48349d6217a5438j98122
$$ -294632 142833 -140844 -178972 -310260 51056 40117 288466 -46217 -15438 -213560
18450b13560o9695B30136b05083A3445g5788A9572i8322B57388b92691C7830M5601
$$ -213560 -283255 230136 -205083 13445 -75788 19572 -98322 257388 -292691 37830 83431
18439H3431b97081B17395B1149a10436k28539B31383B120O5179N7059o548m0570
$$ 83431 -297081 217395 21149 -110436 -338975 231383 2120 67299 124358 117810 77240
18428G7240c8341k14132J847Q921j7980f9386m18j6677b330j23399k4438G9719
$$ 77240 -38341 -252473 -250626 -241705 -259685 -69386 -69804 -86481 -2330 -125729 -150167 79719
18415b60074D6887b39883b7091j18735C569L7767A8404J71402f8415A59760K7343
$$ -260074 46887 -239883 -27091 -145826 3569 41336 18404 189806 -68415 159760 187103
18404A87103p2406l7618a29074A6562c348o0673k7143b0497E7824a86477Q4854
$$ 187103 114697 77079 -129074 16562 -3348 -64021 -91164 -20497 57824 -186477 -101623
18393a01623q6679h4107K6398A20661f7643j40320B38731a72274B89493e6437
$$ -101623 -188302 -84107 -57709 120661 -67643 -207963 238731 -172274 289493 -56437
18382a31815F3622A2583Q3582b70673G1264J34476j5470a55180C1404A3027K766
$$ -131815 63622 12583 96165 -270673 71264 205740 190270 -155180 31404 13027 15793
18371A5793d3820A68426O1858a29696B49M520b1945A60198a11356n0189H8000
$$ 15793 -43820 168426 230284 -129696 249 4769 -21945 160198 -111356 -161545 88000
18359A03309j4155K31837c59090f8609m7766j85993A17563K04553C612c5009E2951
$$ 103309 89154 320991 -359090 -68609 -116375 -302368 117563 322116 3612 -35009 52951
18347g6276k2846a902j12467C76976a1073m96248c01A72314D0294K88486g9298
$$ -76276 -99122 -1902 -114369 376976 -11073 -507321 -301 172314 40294 328780 -79298
18335a73728A81982b5664m4773M942K3478C543b25977a7195k30479A64740B6803
$$ -173728 181982 -25664 -70437 -65495 -42017 3543 -225977 -17195 -247674 164740 26803
18323A7841J90112c39533j4387A1127b78494C55758a92171E1042a2284A81212
$$ 17841 207953 -339533 -353920 11127 -278494 355758 -192171 51042 -12284 181212
18312a85696e5464l0159j88284Q1376j44262A04236a04799l87017F4776L01946
$$ -185696 -55464 -85623 -273907 -192531 -336793 104236 -104799 -491816 64776 366722
18302C66722j17649K9719P9566g0582j93759J05495A6732M6979h3250D63933A08026
$$ 366722 249073 278792 358358 -70582 -264341 -158846 16732 63711 -83250 463933 108026
18290G9572a1949k8311l42067I582f2462C02466b14562f4993j29552I7327B6903
$$ 79572 -11949 -40260 -382327 9582 -62462 302466 -214562 -64993 -194545 97327 26903
18278d69833B8333h9878H360J3622O0465J0224A5918l028a22102A16424C123f2583
$$ -469833 28333 -89878 8360 21982 82447 92671 15918 12890 -122102 116424 3123 -62583
18265a29320I7044K51524a1826j34707B7706K34589H7866a22002A14424a53242
$$ -129320 97044 348568 -11826 -146533 27706 262295 87866 -122002 114424 -153242
18254D4237b70067H1485g2041A82518c90328c4902o8256F0844N0022a088k60973
$$ 44237 -270067 81485 -72041 182518 -390328 -34902 -103158 60844 110866 -1088 -262061
18243b62061C1614Q006J40518q6385c29936D007P5829a91222N6714b1922B28130
$$ -262061 31614 39620 180138 93753 -329936 4007 79836 -191222 -134508 -21922 228130
18231B00335a51469j55089B75241b90501J17341C79767C5667b34680e7213K6197
$$ 200335 -151469 -306558 275241 -290501 -173160 379767 35667 -234680 -57213 -31016
18221c1016j7461k34986B7297o893b23261d8779C9854b13145P8050B8339O2072
$$ -31016 -48477 -283463 27297 20404 -223261 -48779 39854 -213145 -135095 28339 90411
18210I0411a69517J1012H6599P5713m8462g3167r7250A59930D9537O7387c5294
$$ 90411 -169517 -158505 86599 162312 113850 -73167 -170417 159930 49537 116924 -35294
18198A79512a6194E5951c4027k74844B1839M6704a63454A72808h6336A10219c39117
$$ 179512 -16194 55951 -34027 -308871 21839 68543 -163454 172808 -86336 110219 -339117
18186a83950b0342A74992a11815A4159J40588d53003a53664f3089B20173j04163
$$ -183950 -20342 174992 -111815 14159 154747 -453003 -153664 -63089 220173 116010
18176A16010h3731k46046A49599b07983L2627c5813j25584m3502N4876H1972a46450
$$ 116010 -83731 -329777 149599 -207983 -175356 -35813 -161397 -204899 -150023 81972 -146450
18164h0159j33904b2588k82645J33742A99938J50518F7569a3063k9825J1069m8818
$$ -80159 -214063 -22588 -305233 -171491 199938 350456 67569 -13063 -42888 -31819 -80637
18153h0637A32397a76465g5895B70803l2843b46914B20416a92124M9733k07580
$$ -80637 132397 -176465 -75895 270803 237960 -246914 220416 -192124 -142391 -349971
18143c49971A81180a20077j9315e3273o6877b1418j16510f6197A51010c5100m9993
$$ -349971 181180 -120077 -139392 -53273 -120150 -21418 -137928 -66197 151010 -35100 -85093
18132h5093K2339A71877A3204N2321K21191g1488A96204G812J20737b8818k86886
$$ -85093 -62754 171877 13204 65525 286716 -71488 196204 7812 128549 -28818 -315704
18121c15704a9870D7748b29711a28C3988a19733c3763K634B56916a94081L1659
$$ -315704 -19870 47748 -229711 -128 33988 -119733 -33763 -31129 256916 -194081 -162422
18110a62422q3184l1857J32223l5945C20J37367a01832B1227b10349o6981p7105
$$ -162422 -245606 -277463 -145240 -181185 320 137687 -101832 21227 -210349 -277330 -354435
18099c54435J68969G9910J84271A05036C3107b66227a04121m740F878b06992q7048
$$ -354435 -185466 79910 264181 105036 33107 -266227 -104121 -108861 6878 -206992 -294040
18088b94040C73600a81753j6620e0149D117J08804a76049B38808b64908h5824
$$ -294040 373600 -181753 -198373 -50149 4117 112921 -176049 238808 -264908 -85824
18077B5486F175a02687g059k65142Q9907A67811F4320J6408i9820A221b88301
$$ 25486 6175 -102687 -7059 -272201 -182294 167811 64320 80728 -99820 1221 -288301
18065f3152p262B00274C7525c56232B14036d29613a23742C66160j72465c31503
$$ -63152 -70414 200274 37525 -356232 214036 -429613 -123742 366160 193695 -331503
18054a39114A7551d04115a19534l79214B95086a42532K1704k4182a8628q2572
$$ -139114 17551 -404115 -119534 -498748 295086 -142532 -120828 -145010 -18628 -101200
18044a01200c3175A5897J86879a11942A29985D0857b97111A30054b46020h4475
$$ -101200 -33175 15897 202776 -111942 129985 40857 -297111 130054 -246020 -84475
18033b31610j49419e0681A90359a72278B26613b19808g2300B7409a91267C727
$$ -231610 -381029 -50681 190359 -172278 226613 -219808 -72300 27409 -191267 3727
18022A71299b07345A75575j2806b9213M642l24274C18546b9693A83939I0529a53703
$$ 171299 -207345 175575 162769 -29213 -24571 -348845 318546 -29693 183939 90529 -153703
18010b90986L4845G9748K07196e5964A49812a10365F620a08272j40568g7984A71811
$$ -290986 -256141 79748 286944 -55964 149812 -110365 6620 -108272 -248840 -77984 171811
17998a91981d6028A39924b38543K3559F8934a19237D4188K8160b8406P844j88284
$$ -191981 -46028 139924 -238543 -214984 68934 -119237 44188 72348 -28406 -20562 -208846
17987b08846F4267b21156A0447b72478M1648A13375a27326B4126N5755a23072
$$ -208846 64267 -221156 10447 -272478 -230830 113375 -127326 24126 79881 -123072
17976G2531J0708a05342J1468C51057a88925B710K66796B5074J9312a09660I4027
$$ 72531 83239 -105342 -93874 351057 -188925 2710 269506 25074 44386 -109660 94027
17964A31438g9117A39177B2252d01298E31140B20790a9088A04843E2141d399k29843
$$ 131438 -79117 139177 22252 -401298 531140 220790 -19088 104843 52141 -4399 -234242
17953b34242a03325M6816B67194I1723b19472A2075e1232m4054m4724O6575j32401
$$ -234242 -103325 -56509 267194 91723 -219472 12075 -51232 -95286 -140010 -73435 -205836
17942b05836C229N4308c31090B76001a24991I2661J723R9193B8376J1367K26950
$$ -205836 3229 57537 -331090 276001 -124991 92661 94384 193577 28376 39743 266693
17931B66693b6152m1991o8427A22467b26515A49898N4818r4955k0869h6128A99205
$$ 266693 -26152 -68143 -136570 122467 -226515 149898 204716 109761 88892 -86128 199205
17919b64265c1592q2408j93665N2900B41720b1598A40782i7413A00251B458b53980
$$ -264265 -31592 -114000 -307665 -254765 241720 -21598 140782 -97413 100251 2458 -253980
17907a24631q6976A0938J48729a61763j0844A86717F4595K0089b21054B2976b91886
$$ -124631 -211607 10938 159667 -161763 -172607 186717 64595 84684 -221054 22976 -291886
17895c6451l33335a65004G236J62863o9905R0214a2997G5689L1012a78241B19010
$$ -36451 -369786 -165004 7236 170099 100194 190408 -12997 75689 106701 -178241 219010
17883f6606o9063C786J2919b30286c7114A73462J052a72998L0351A4270J68254
$$ -66606 -135669 3786 16705 -230286 -37114 173462 174514 -172998 -142647 14270 182524
17872A82524M8145M7016A0856J65381a08183c8963A74894C184J22319c15036h0830
$$ 182524 230669 277685 10856 176237 -108183 -38963 174894 3184 125503 -315036 -80830
17860a26413E49074a1131A87953e7513j94879D1751e2645k602A58801a56485A898
$$ -126413 549074 -11131 187953 -57513 -252392 41751 -52645 -55247 158801 -156485 1898
17848D18758j93151d380j11124I9166n539h3314A47150j3254m9936J28947c2752
$$ 418758 225607 -4380 -115504 99166 93627 -83314 147150 133896 83960 212907 -32752
17836A457a05826l0083e7395o5C7689b51592A23519a96670A34909h3258l5605
$$ 1457 -105826 -135909 -57395 -57460 37689 -251592 123519 -196670 134909 -83258 -118863
17825a18863H1015a53646b4273j94423m8993a850C05492f739k46366D00519b84655
$$ -118863 81015 -153646 -24273 -218696 -267689 -1850 305492 -6739 -253105 400519 -284655
17813c08761a39749A37409b69060D7629c11374C9133a68093P4619k8660A37848
$$ -308761 -139749 137409 -269060 47629 -311374 39133 -168093 -93474 -122134 137848
17802d4355j00653A87845H878L81410g7780G2451l837j5475b77563F1490K27742
$$ -44355 -145008 187845 8878 390288 -77780 72451 68614 53139 -277563 61490 289232
17791B89232f4496A84012J32537A14790E7018Q5905o3076A9971K6600b0679r5018
$$ 289232 -64496 184012 316549 114790 57018 142923 79847 19971 46571 -20679 -115697
17780a15697E6201L50831g8944j35801M1680A88846A5219K70180L7758c92223
$$ -115697 56201 407032 -78944 -214745 -173065 188846 15219 285399 323157 -392223
17769D1299P9842a00150A15783d4859k45868B19836H7288i415j21796A54872o6478
$$ 41299 121141 -100150 115783 -44859 -290727 219836 87288 -9415 -131211 154872 88394
17758H8394m0564k2735E11J60203i1309F4545a08630n6482D15333A3502J93194
$$ 88394 47830 25095 511 160714 -91309 64545 -108630 -165112 415333 13502 206696
17747B06696g2045A29898a25380A78337q9120B2288f5543l01625J46376B9002
$$ 206696 -72045 129898 -125380 178337 89217 22288 -65543 -367168 -220792 29002
17736A61848b92939B38889a94784j50346D7349K76752d1357Q683o7749k44141
$$ 161848 -292939 238889 -194784 -345130 47349 324101 -41357 -32674 -100423 -344564
17726c44564J71608h0868m9959B40396a36540B68423g2234k41892A3192J9821
$$ -344564 -172956 -80868 -130827 240396 -136540 268423 -72234 -314126 13192 33013
17716C3013K80966A8752a96337A18409J8831a084q7107G0084c03898J14425A48401
$$ 33013 313979 18752 -196337 118409 137240 -1084 -88191 70084 -303898 -189473 148401
17704b64889a25274F0029c37765d3F2619c0849A79916K8248I7867h9481L9740
$$ -264889 -125274 60029 -337765 -43 62619 -30849 179916 208164 97867 -89481 -49741
17693d9741A35351f5849j24688B15165a81603d4363j19383B9575i7872A32192
$$ -49741 135351 -65849 -190537 215165 -181603 -44363 -163746 29575 -97872 132192
17682a87857D7142d24862J97923A7052p748J8412i1854o3988N2168A20167a1675
$$ -187857 47142 -424862 -226939 17052 9304 27716 -91854 -155842 -103674 120167 -11675
17670g3660g034H1985b89583g3079K5031j1085H0357L5131c23643D2816J70781
$$ -73660 -7034 81985 -289583 -73079 -48048 -59133 80357 115488 -323643 42816 213597
17659B13597p2597K9877C4614K32839b7712J607B52539D9726b48721F13394B33632
$$ 213597 141000 170877 34614 267453 -27712 -26105 252539 49726 -248721 613394 233632
17647b84066a08753j91532b8022A19588M7863p3114a22472I1641d9477B51180
$$ -284066 -108753 -300285 -28022 119588 167451 94337 -122472 91641 -49477 251180
17636b78812H099Q8558J78927J64765a14164m0573b8788n2162B79c9751I4719
$$ -278812 8099 96657 275584 440349 -114164 -154737 -28788 -80950 279 -39751 94719
17624A62887g7770B18716K22402j46092e9412k19301e336B37820m8458p5745K27755
$$ 162887 -77770 218716 441118 295026 -59412 -278713 -5336 237820 189362 113617 341372
17613C41372A48043a5410k42117E6308J67239r6656e0076B41880a45588k3526
$$ 341372 148043 -15410 -257527 56308 223547 126891 -50076 241880 -145588 -169114
17603a69114c1950C58043A17399K34945j74232g8876K6707D00545B4775b2428
$$ -169114 -31950 358043 117399 352344 178112 -78876 -52169 400545 24775 -22428
17592e1887H6998d7945A04025k1318a1849A8493a80985K1586l4058f9803G9675
$$ -51887 86998 -47945 104025 82707 -11849 18493 -180985 -159399 -193457 -69803 79675
17580a27366F1232d04658H951a30087a3431j78262A42522L18847a54511l2602
$$ -127366 61232 -404658 8951 -130087 -13431 -191693 142522 461369 -154511 -187113
17570a87113F4692B0897K78475g1966G7950N1847K72123d2797B79395c24884C06328
$$ -187113 64692 20897 299372 -71966 77950 129797 401920 -42797 279395 -324884 306328
17558c7629G0730J58972j13885K4169K41463A22291a29290n256I490M02379E7881
$$ -37629 70730 229702 115817 139986 381449 122291 -129290 -134546 9490 411869 57881
17546A05659l440J25953D4380J16666j3862I58a14858C06467A46445a79274B15828
$$ 105659 102219 228172 44380 161046 147184 958 -114858 306467 146445 -179274 215828
17534b41245C03115i2047I9033b04938A10211B9485b0109B72099a06673j00835
$$ -241245 303115 -92047 99033 -204938 110211 29485 -20109 272099 -106673 -207508
17524b07508K8722F1240l044J5751a98062A42138k732d3322A38316a75770A7876
$$ -207508 -178786 61240 58196 73947 -198062 142138 139406 -43322 138316 -175770 17876
17512B49763D1515K87730j40486c4826A18929E7936d05641A24097E6792h1258
$$ 249763 41515 329245 188759 -34826 118929 57936 -405641 124097 56792 -81258
17501I3788J72409B4956J13277b79868e2656A53877P6069j03111K71906A91085
$$ 93788 266197 24956 138233 -279868 -52656 153877 229946 126835 398741 191085
17490A1511J8881J48274n0706c0639B1216L47051c1986D4159J56587A1153J39454
$$ 11511 30392 178666 127960 -30639 21216 368267 -31986 44159 200746 11153 150607
17479A50607a00693A14761B9818c315B50740o4720M1506L0414E8232J29345c1806
$$ 150607 -100693 114761 29818 -3315 250740 186020 227526 257940 58232 187577 -31806
17467I225J08255J6095b34024C66813j02412p4908m6132J463J2547e1538G6447
$$ 9225 117480 133575 -234024 366813 264401 189493 143361 144824 157371 -51538 76447
17455b93864f8466o651B79093l4986A785N67605H4155B9733L35122j45090e900
$$ -293864 -68466 -75117 279093 244107 1785 569390 84155 29733 364855 219765 -5900
17443C22816R1038M7842H4964J31405I1750J76819J73771q8098a7279H4376L04196
$$ 322816 413854 461696 84964 216369 91750 268569 442340 354242 -17279 84376 388572
17432C88572a61427B16440A03412D1336a08921A46471b357n2170j07232a0432
$$ 388572 -161427 216440 103412 41336 -108921 146471 -2357 -54527 -161759 -10432
17421A44823K16776a9226A82244Q4801a00126B8100O39527g7117B1895K25822
$$ 144823 361599 -19226 182244 267045 -100126 28100 667627 -77117 21895 247717
17411B47717P8594j3181G7266K79588j70490J16437G4938J01699d1560F2283J21881
$$ 247717 326311 313130 77266 356854 186364 302801 74938 176637 -41560 62283 184164
17400A84164J21077A13638c45695d9239D40556B13559n7115n0652L21395r2684
$$ 184164 305241 113638 -345695 -49239 440556 213559 156444 105792 427187 334503
17390C34503A16791C0461P7959J33458r4259j2756J1230L1500q7763L58332A33444
$$ 334503 116791 30461 108420 241878 147619 134863 146093 177593 89830 448162 133444
17378B92953a67241n1742A69695e8762A80852N474f8943C66524A61861E4478L02471
$$ 292953 -167241 -218983 169695 -58762 180852 186326 -68943 366524 161861 54478 356949
17367C56949E5785b53640A90289g5739B21795C9908K90970n4550E5531K42691
$$ 356949 55785 -253640 190289 -75739 221795 39908 330878 276328 55531 298222
17357B98222j3796J39363A73588F0486b9078B73511o6688q1624L3728r243J74955
$$ 298222 284426 423789 173588 60486 -29078 273511 206823 125199 158927 149684 324639
17346C24639I0069L43652A96843a79172C76741G3450C5316M67517A41044J99183
$$ 324639 90069 433721 196843 -179172 376741 73450 35316 502833 141044 340227
17336C40227e9229A25646N2625a3317n0380C50165I6403c9215A96536O0821a42526
$$ 340227 -59229 125646 178271 -13317 -63697 350165 96403 -39215 196536 257357 -142526
17324B77477a19939j00168D5420d2649B05584a53222A40821F8896b687q8996H6260
$$ 277477 -119939 -220107 45420 -42649 205584 -153222 140821 68896 -2687 -91683 86260
17312g1727A64561J4733m966n8947J98169J8261E4133J17829J89598C2527e5A54180
$$ -71727 164561 179294 174328 115381 313550 331811 54133 171962 361560 32527 -55 154180
17299C46123a16229c6548D25489A9387L60633A06477m6308K73881j49259O3291
$$ 346123 -116229 -36548 425489 19387 380020 106477 60169 334050 184791 248082
17289B48082j22689J12988J37157j18570O9808l1922B7472N1541K12938d9477
$$ 248082 125393 238381 375538 256968 326776 294854 27472 79013 291951 -49477
17278C07440a076I0493J43909n6995b33148A46940l9247B7482h3939A48592K1672
$$ 307440 -1076 90493 234402 177407 -233148 146940 107693 27482 -83939 148592 170264
17267A70264n3603M9737R7694a43713F7619a60424D8540R2768K39216c4081C21880
$$ 170264 116661 166398 264092 -143713 67619 -160424 48540 141308 380524 -34081 321880
17255H4424C5272K62065N5760b47140A9221N0559O7991Q6432m370L189P5155A01663
$$ 84424 35272 297337 353097 -247140 19221 69780 137771 224203 219833 223022 298177 101663
17242E7576L74520n9115A58040K60558a30712b4778B08332M8309J95975L6710
$$ 57576 432096 372981 158040 418598 -130712 -24778 208332 256641 452616 489326
17232D89326E4556J20687A4579a2478j05803A92626b2954k0616H6795K18925o9332
$$ 489326 54556 175243 14579 -12478 -118281 192626 -22954 -43570 86795 305720 236388
17221B36388C6039K94815a72106A79085a98937C75914D7526O22889A32688J60585
$$ 236388 36039 330854 -172106 179085 -198937 375914 47526 670415 132688 293273
17211B93273c4987H005K9249K86054b36525h5921A93089j2612b513C95695N6322
$$ 293273 -34987 8005 37254 323308 -236525 -85921 193089 180477 -2513 395695 452017
17200D52017B15646n8920J16940n0030J11644o5204P7634j60154R9932R9209A10421
$$ 452017 215646 156726 273666 223636 335280 270076 347710 187556 287488 386697 110421
17188D65577j99742j01332C7311P5322c6636B04566O0706f0525B98524A4819N43180
$$ 465577 265835 164503 37311 112633 -36636 204566 265272 -60525 298524 14819 557999
17177E57999b4334D9991L55513A79552H3963L23263j23301o1125n5402a79127
$$ 557999 -24334 49991 405504 179552 83963 407226 283925 222800 167398 -179127
17166C60137A77242N3038N3382J22721A70796c4253C65500k839A63776J92131
$$ 360137 177242 230280 283662 406383 170796 -34253 365500 362661 163776 355907
17156C55907j37448l3876N23567k78148A05379K05166A42163E1149a15132C47771
$$ 355907 218459 184583 708150 430002 105379 310545 142163 51149 -115132 347771
17145D68620K03565B28590O1255K1846J38764C8370L55833K95645k32939l4589
$$ 468620 672185 228590 289845 311691 450455 38370 394203 689848 456909 422320
17135D22320K45701I815M97048b7240D84621k07883K06928k09034R712o7364J10154
$$ 422320 668021 9815 506863 -27240 484621 276738 483666 274632 284344 216980 327134
17124C27134m7145J30377j80788K64127A11296L99970k3622j04170j91428e868
$$ 327134 279989 410366 229578 493705 111296 511266 487644 383474 192046 -5868
17113I5689L3475N39222k08150p4221E8886j1725L63821J30433j91714G4226N07902
$$ 95689 129164 668386 460236 386015 58886 47161 410982 541415 349701 74226 582128
17102E82128k71504q4243B9401d784D16808K31141k12383k0056j6127J0380B6812
$$ 582128 310624 226381 29401 -4784 416808 647949 435566 415510 399383 409763 26812
17090A75283K94397A97613K55968j68882K86156R0728C07328J26261L8067A98962
$$ 175283 469680 197613 453581 284699 570855 661583 307328 433589 471656 198962
17079B81055J51271K65654j64323j28149o8953O0239l8880J56244J26521B27264
$$ 281055 432326 697980 533657 405508 336555 396794 357914 514158 640679 227264
17068D25080j84852M00598m5524j33851p5859j47512J53305j08668P171K89382
$$ 425080 240228 640826 595302 461451 385592 238080 391385 282717 289888 579270
17058E79270j00685m7510p1103n886L53J51538K03604B77784K26944A17233K50083
$$ 579270 478585 431075 359972 354086 354439 505977 709581 277784 504728 117233 367316
17047C67316L26278L714A73114M29486P5097j67193B01553N80189j471k81905
$$ 367316 693594 697308 173114 602600 677697 510504 201553 781742 780271 498366
17037D98366O6472R8461k22237L68064D00240Q3603L61458k99379j78445A78183
$$ 498366 564838 663299 441062 809126 400240 483843 845301 545922 367477 178183
17026F10492j44569J56531B03611M51190n0308J48360j36366M4327p1726r8666
$$ 610492 465923 622454 203611 654801 604493 752853 616487 660814 589088 490422
17016D90422R3282j3990p2429L6681r2375L3757Q4917M45899k90078j04021K07741
$$ 490422 583704 569714 497285 533966 441591 475348 560265 1006164 716086 612065 819806
17005H19806j23560l1964p5622r1280K49566k34046J7470L46890D28441J8302
$$ 819806 696246 664282 588660 497380 746946 512900 530370 877260 428441 446743
16995D46743N8917r0952K52473m1477L26071k30260j41307J54490l14446K72257
$$ 446743 505660 414708 667181 625704 951775 721515 580208 734698 420252 692509
16985F92509P9990K01553D25625N32942l42229L04062j98310J90147m06999J27211
$$ 692509 772499 974052 425625 958567 616338 920400 722090 912237 505238 632449
16975F32449k5461K48869k90700J70274j46731J62419K38269N599k66607J8343
$$ 632449 606988 855857 565157 735431 588700 751119 989388 994987 728380 746723
16965G46723p9662K528N08114m83260J81891k4416l2251m2970K93751J08357n52614
$$ 746723 667061 669589 1177703 694443 876334 851918 819667 776697 1070448 1178805 626191
16954F26191J8753K85378K65781l70583p7046J43063J12221j5619L4628j61930
$$ 626191 644944 930322 1196103 825520 748474 891537 1003758 988139 1022767 860837
16944H60837O9682Q763k42167K03339J0615r6746L04723J20579m386o4448m8774
$$ 860837 930519 939282 697115 900454 911069 814323 1119046 1239625 1235239 1170791 1122017
16933A122017k44209K42871j43214J83156l70495L87155j99428M11876k81273
$$ 1122017 877808 1120679 977465 1160621 790126 1177281 977853 1389729 1108456
16924A108456J17076K7335l24633J98718L0460P6783J74202k19534Q5509J27414
$$ 1108456 1225532 1252867 928234 1126952 1157412 1234195 1408397 1188863 1274372 1401786
16914A401786m18778L2402M6527N61469k56162m05448K65498K84483P0197O417
$$ 1401786 983008 1015410 1061937 1623406 1367244 961796 1227294 1511777 1581974 1588391
16904A588391J41845l36366L41018r2228j74763q9314J60826p5956l9774K22653
$$ 1588391 1730236 1393870 1734888 1642660 1467897 1378583 1539409 1463453 1423679 1646332
16894A646332k56917J91785J73699j54575k43369J80939M69007j46768k10353
$$ 1646332 1389415 1581200 1754899 1600324 1356955 1537894 2006901 1860133 1649780
16885A649780J43645j32975k1248J64555L07835k92052o8865K22505l5475J73148
$$ 1649780 1793425 1660450 1639202 1803757 2111592 1819540 1750675 1973180 1937705 2110853
16875B110853p7120k19637M76831J37369n28782K67547K05870J4797j7562r7375
$$ 2110853 2033733 1814096 2290927 2428296 1899514 2167061 2372931 2387728 2370166 2272791
16865B272791m335K73128l04169J95780k12059L08886P0686O5104j80883k29927
$$ 2272791 2268456 2541584 2237415 2433195 2221136 2530022 2600708 2665812 2484929 2255002
16855B255002P33867j72341Q8730p7340J99836k88764J58805K17386l1407R0400
$$ 2255002 2988869 2816528 2905258 2827918 3027754 2738990 2897795 3115181 3083774 3174174
16845C174174n9149M2859l9893J0626j31696K81137K08156l9343N9436r4406O2830
$$ 3174174 3115025 3157884 3117991 3128617 2996921 3278058 3486214 3446871 3506307 3411901 3474731
16834C474731r6902L10985N4665K51580q0780m8736J00642L29064l6421j97626
$$ 3474731 3377829 3688814 3743479 3995059 3914279 3865543 3966185 4295249 4258828 4061202
16824D061202K26756K67275L96656l52169j13884L06361J02624l7143l828J5056
$$ 4061202 4287958 4555233 4951889 4599720 4485836 4792197 4894821 4857678 4853850 4868906
16814D868906R5088M12281J62007L3094M4487L77234P6454r8159J61973K1492
$$ 4868906 4963994 5376275 5538282 5571376 5615863 5993097 6069551 5971392 6133365 6154857
16804F154857L99281p7355L65936K15402q3346Q8238K07782j9297N28672R6729
$$ 6154857 6554138 6476783 6842719 7058121 6974775 7063013 7270795 7251498 7780170 7876899
16794G876899N35686m25107M44057K51418O45564J58327O3611K78113J03718K49141
$$ 7876899 8412585 7987478 8431535 8682953 9328517 9486844 9550455 9828568 9932286 10181427
16784A0181427L13416Q0175Q23634K24944J20522K31417N94702L45379K74354
$$ 10181427 10494843 10575018 11398652 11623596 11744118 11975535 12570237 12915616 13189970
16775A3189970L06570N16709M41905N23672L96471N20802Q99287K93078L39175
$$ 13189970 13496540 14013249 14455154 14978826 15375297 15896099 16795386 17088464 17427639
16766A7427639P96239R15452N39716Q21530P75756Q70189P10916P21204J194012
$$ 17427639 18223878 19139330 19679046 20500576 21276332 22146521 22857437 23578641 24772653
16757B4772653R47356J230909J448931P25492J258581J550092J327308J969321
$$ 24772653 25720009 26950918 28399849 29125341 30383922 31934014 33261322 35230643
16749C5230643J340526J542065K403414J975908K004925K537656K231951K698950
$$ 35230643 36571169 38113234 40516648 42492556 44497481 47035137 49267088 51966038
16741E1966038K945466L158821L138328L583249M203994L971758M436944M672589
$$ 51966038 54911504 58070325 61208653 64791902 68995896 72967654 77404598 82077187
16733H2077187N196062N193439N829552O638735O365481P089270P245299P370432
$$ 82077187 87273249 92466688 98296240 104934975 111300456 118389726 125635025 133005457
16725A33005457P710968Q211878P780880P946469P498259O771261O317211N341253
$$ 133005457 140716425 148928303 156709183 164655652 172153911 178925172 185242383 190583636
16717A90583636M660094L227615J921049O89900p23089k430069l346778m690596
$$ 190583636 195243730 198471345 200392394 201082294 200359205 197929136 194582358 189891762
16709A89891762n405630o483628p353097p478985p967189q050043p986481p883179
$$ 189891762 184486132 178002504 170649407 163170422 155203233 147153190 139166709 131283530
16701A31283530p546128p282678o915486o938329n906769o037735n663456m796717
$$ 131283530 123737402 116454724 109539238 102600909 96694140 90656405 84992949 80196232
16693H0196232m841791m245888m449275l919478l355467l008258l160670l288590
$$ 80196232 75354441 71108553 66659278 62739800 59384333 56376075 53215405 49926815
16685D9926815k739724k005975k492464j809373k175691k066966j938399j353618
$$ 49926815 47187091 45181116 42688652 40879279 38703588 36636622 34698223 33344605
16677C3344605j692674j510208j311002o95294j346340j386583j011893j289465
$$ 33344605 31651931 30141723 28830721 28135427 26789087 25402504 24390611 23101146
16669B3101146o48316r01911n50181p79213q05408p51591p20536o02443n93188
$$ 23101146 22452830 21550919 21000738 20221525 19416117 18664526 17943990 17341547 16748359
16660A6748359m70549p54141l62714j128546M0565n47633n34828J06728m51059
$$ 16748359 16277810 15523669 15160955 14032409 14072974 13525341 12990513 13097241 12646182
16651A2646182o92329j85532m33663j87860n95649K632o53191J36648m38022o09098
$$ 12646182 11953853 11768321 11334658 11146798 10551149 10553781 9900590 10037238 9599216 8990118
16641H990118R958l84980k74353L10386l84080n15585j62959r0372l07596Q5925
$$ 8990118 9000076 8615096 8340743 8651129 8267049 7751464 7588505 7498133 7190537 7276462
16631G276462l84464j36430n66626Q3245N5728m1601k65026k68752R6567l59685
$$ 7276462 6891998 6755568 6188942 6272187 6327915 6286314 6021288 5752536 5849103 5489418
16621E489418K55319o91922M28921k93286l39982L27833j741k90679j74901J59422
$$ 5489418 5744737 5052815 5481736 5188450 4848468 5176301 5174560 4883881 4708980 4868402
16611D868402l11848k32673J75734k00151J15338m60974N7715j09626q4398o9399
$$ 4868402 4556554 4323881 4499615 4299464 4414802 3953828 4011543 3901917 3817519 3748120
16601C748120J24911K6642m9200j70051k65134J68185m55262K60651k39325j52110
$$ 3748120 3873031 3899673 3850473 3680422 3415288 3583473 3128211 3388862 3149537 2997427
16591B997427N30592l66925o9744j31271l970L2293k64384p1891j25200o5594
$$ 2997427 3528019 3161094 3091350 2960079 2956109 2988402 2724018 2652127 2526927 2461333
16581B461333K00848l34587M23089m14571j5860M14271m93559j22670N93969m74265
$$ 2461333 2662181 2327594 2750683 2336112 2320252 2734523 2240964 2118294 2712263 2237998
16571B237998k17920K70834r4571n6073P6671k42629J6376J54301p3265J26769
$$ 2237998 2020078 2290912 2196341 2140268 2216939 1974310 1990686 2144987 2071722 2198491
16561B198491n7493j95453k9862K3102r9865J5813J81398l85868j22167r307M04100
$$ 2198491 2140998 1945545 1915683 1938785 1838920 1854733 2036131 1650263 1528096 1518789 1922889
16550A922889j15682k08275k11458M52360j45833j41523j35552j2601L25385J7830
$$ 1922889 1807207 1598932 1387474 1839834 1694001 1552478 1416926 1404325 1729710 1747540
16540A747540m33083L79488r0114k22862K09390k01615l4229n717k11255M52526
$$ 1747540 1314457 1693945 1603831 1380969 1590359 1388744 1354515 1348798 1137543 1590069
16530A590069p05749P83436n57662K57410k68651M1357M12448k62784k2989J03933
$$ 1590069 884320 1667756 1110094 1367504 1098853 1140210 1552658 1289874 1266885 1370818
16520A370818l1048j09602K46966o04891M44610k32835K0130P4130J559k09453
$$ 1370818 1339770 1230168 1477134 872243 1316853 1084018 1104148 1178278 1179837 970384
16510I70384o0553K90357j58823J88737j82596J50491M661m65657K30880j14305
$$ 970384 909831 1200188 1041365 1230102 1047506 1197997 1202658 737001 967881 853576
16500H53576J93258j86442L29516o7104k74807j24128J70905p5074M2028j07494
$$ 853576 1046834 860392 1189908 1122804 847997 723869 894774 819700 861728 754234
16490G54234R7611J30803o8304k89053J15853L99705l11590K13630l628k30479
$$ 754234 851845 982648 914344 625291 741144 1140849 829259 1042889 1039261 808782
16480H08782J08285m43922N7402L80204k48797N6477O71287o28318k7397L5772
$$ 808782 917067 473145 530547 910751 661954 718431 1389718 761400 734003 769775
16470G69775k04732K63756l66542N3812L28288K19193m60967J86169j99121k59369
$$ 769775 565043 828799 462257 516069 844357 1063550 602583 788752 589631 330262
16460C30262O1610N42344k1149A73192M05274K25337K01134k97801r6763j32533
$$ 330262 391872 934216 913067 173192 578466 803803 1004937 707136 610373 477840
16450D77840L26224j57664j14363l16J26348L6333j02474n0831K86774B66222
$$ 477840 804064 646400 532037 531721 658069 694402 591928 541097 827871 266222
16439F23749K80605k49138J09092l18302O4340p5236J38642k79621m534M2664
$$ 623749 904354 655216 764308 446006 510346 435110 573752 294131 289597 332261
16429C32261M15587B41447J54793J92881k86140M16238j64794k46393Q3885K22640
$$ 332261 747848 241447 396240 589121 302981 719219 554425 308032 391917 614557
16419F14557j14667J42414o2650K2638J84882k31569J4401j8914Q7282l13896
$$ 614557 499890 642304 579654 602292 787174 555605 570006 551092 638374 324478
16409C24478N926P0256N91976B13929L38352n0485A77919H2396N5340L59807Q3808
$$ 324478 330404 400660 992636 213929 552281 501796 177919 82396 137736 497543 581351
16398E81351j26430n3543M9895j29111q0875L51563B96229j15989C354O04257
$$ 581351 454921 401378 451273 322162 241287 592850 296229 180240 3354 607611
16388F07611j54677L73897A53589K99395j61532l5002I8479L62287o5337m3347
$$ 607611 452934 826831 153589 452984 291452 256450 98479 460766 395429 352082
16378C52082j36973O52312A20054R7151J52045A60207L35424R2423J15940n8129
$$ 352082 215109 867421 120054 217205 369250 160207 495631 588054 703994 645865
16368F45865B89674O21558m15364N6754a8587B57511J24666F8703K77825A01197
$$ 645865 289674 911232 495868 552622 -18587 257511 382177 68703 346528 101197
16357A85451K3848m1743J36133M3125J16296j20606l9524j30526M55094B53539
$$ 185451 209299 167556 303689 346814 463110 342504 302980 172454 627548 253539
16346E37325A46831K76067j40129q035P4481n6446J64603F416N04611j8294j6519
$$ 537325 146831 422898 282769 274734 349215 292769 457372 6416 511027 492733 476214
16335D76214C6477L1109J08380J9431P6176L00843B36167L76652I5803L16747
$$ 476214 36477 67586 175966 195397 271573 572416 236167 612819 95803 412550
16325D12550m9537j20670n8027r0059L58856j74381j10240O4242I2350K81676
$$ 412550 363013 242343 184316 94257 453113 278732 168492 232734 92350 374026
16315C74026j61315J80742j35926F0285A9991L98483f858C71719J0961A25452
$$ 374026 212711 393453 257527 60285 19991 418474 -6858 371719 382680 125452
16304D79249a3753B64651E5900J27639J39577j22184e5921B56004J21272j5220
$$ 479249 -13753 264651 55900 183539 323116 200932 -55921 256004 377276 362056
16294C62056j7502j56589N5786K95124n6286j62708A16064k0394L41529C3709
$$ 362056 344554 187965 243751 538875 482589 319881 116064 95670 437199 33709
16283A35665J74488j16091K79746j87069A32563C9912J24102J01380Q5289j44432
$$ 135665 310153 194062 473808 286739 132563 39912 164014 265394 350683 206251
16273B06251g3773A28366m3853j1046J72107j15772P6212K18552A01178g0317
$$ 206251 -73773 128366 84513 73467 245574 129802 206014 424566 101178 -70317
16262A18409l9019M20266i6071B81824L6165Q2728j53706F4361N0391L3193F4718
$$ 118409 79390 499656 -96071 281824 317989 400717 247011 64361 114752 147945 64718
16250A14325P2600P3632g6651I0188d9177B00766H0701J26620J55821h3036A30397
$$ 114325 186925 260557 -76651 90188 -49177 200766 80701 207321 363142 -83036 130397
16238b959B89702a09047A14207K77890r4483J54510A41835J33465j13131N2096
$$ -2959 289702 -109047 114207 392097 297614 452124 141835 275300 162169 214265
16228B14265K598H371J73764M4203C7372Q8881P7770a02923A28350l6143M354
$$ 214265 216863 8371 182135 226338 37372 126253 204023 -102923 128350 92207 96561
16217I6561K82381j22452N1938Q7691M2988A95587r03Q1346L28420B20468F0831
$$ 96561 378942 256490 308428 396119 439107 195587 194684 276030 604450 220468 60831
16205A30781a95876B77624e4166A46733K5302e3863B40332a23464j68387A4269
$$ 130781 -195876 277624 -54166 146733 172035 -53863 240332 -123464 -291851 14269
16194C8189J54054b9920A25704b97840A40672n3007M52918e3439n6705D0451N8053
$$ 38189 192243 -29920 125704 -297840 140672 87665 540583 -53439 -110144 40451 98504
16183I8504J03518q4360D3673R5687o5126P1881M34072a5608l307l0906B31006
$$ 98504 202022 117662 43673 139360 74234 146115 580187 -15608 -18915 -49821 231006
16171B42173C6865J65847q6585a07180B72318n4440F5498B2330Q0466l7624a06237
$$ 242173 36865 202712 116127 -107180 272318 217878 65498 22330 102796 65172 -106237
16159A97788K12972D321J11629J31695q5528H0846L8298g0110A13682e8057J3101
$$ 197788 410760 4321 115950 247645 162117 80846 119144 -70110 113682 -58057 -44956
16148d4956C07264r6819l4535B6670e5519F2254J3716a2254G5428N030K04743
$$ -44956 307264 210445 175910 26670 -55519 62254 75970 -12254 75428 80458 285201
16137B85201b62056A20688b3074B41599c06701e8636k41212A69420b73955A23986
$$ 285201 -262056 120688 -23074 241599 -306701 -58636 -299848 169420 -273955 123986
16126H7942F436R886J45144n5220a4003I9138a55435G5492O5709K38013C001N7269
$$ 87942 6436 16322 161466 106246 -14003 99138 -155435 75492 141201 379214 3001 60270
16114F0270L57336c85220B2199L43313E1268K14149j17837o5256N1940O186h9418
$$ 60270 417606 -385220 22199 365512 51268 265417 147580 82324 134264 140450 -89418
16102i0162j3362H0538g4334B17585M9812m6951o7400b55133B38012a75095B83822
$$ -90162 -103524 80538 -74334 217585 267397 220446 153046 -255133 238012 -175095 283822
16090A60515i0987I9670a17149B13528C5363f8484k55833I6478C8886e972F0162
$$ 160515 -90987 99670 -117149 213528 35363 -68484 -324317 96478 38886 -5972 60162
16078D5370P1729a31266j4054j33356a10636A72922c59225F5207c64683A52753
$$ 45370 117099 -131266 -145320 -278676 -110636 172922 -359225 65207 -364683 152753
16067I5780d3301a7708A61406p4246c33702A82418b81470A22386b5352j29076
$$ 95780 -43301 -17708 161406 87160 -333702 182418 -281470 122386 -25352 -154428
16057a54428f9087B6766b46735D43732a40619k417d75j46342d4682C75026b69087
$$ -154428 -69087 26766 -246735 443732 -140619 -143036 -475 -146817 -44682 375026 -269087
16045i8634E1274c11840c9019C7982L3553P9089c04281B77751D0403K099O5402
$$ -98634 51274 -311840 -39019 37982 71535 150624 -304281 277751 40403 42502 107904
16034A07904e2391j97846m4431B25549F1729k4951J59302H7400a09214L2363A10863
$$ 107904 -52391 -250237 -294668 225549 61729 36778 196080 87400 -109214 -76851 110863
16022F8689L9284B6278J73773b4562k91299a15810d7540q8324l2575B136a34817
$$ 68689 107973 26278 200051 -24562 -315861 -115810 -47540 -135864 -168439 2136 -134817
16010c6047F2791O6173d48330a30332e391C793J90190O6736o5822a23677O0071
$$ -36047 62791 128964 -448330 -130332 -5391 3793 193983 260719 194897 -123677 -63606
15999f3606G5433b4212B06177H150N0460c0210j43006J2940F3184a57807A3638
$$ -63606 75433 -24212 206177 8150 58610 -30210 -173216 -160276 63184 -157807 13638
15987G2014L1706b6516F0704K98908B9870K55571a71553B94303H0234L55851A77403
$$ 72014 103720 -26516 60704 359612 29870 285441 -171553 294303 80234 436085 177403
15975d3481C27190j05420b96417J37904B13447b58085J26246D5320J93117D3189
$$ -43481 327190 221770 -296417 -158513 213447 -258085 -131839 45320 238437 43189
15964D8078a03165B9076a78102H0487c69762A14429b54598P7815B95416C7632
$$ 48078 -103165 29076 -178102 80487 -369762 114429 -254598 -176783 295416 37632
15953A21646B1039a65490P119L4736o5816h1445A47289a22490M4648k05209C66773
$$ 121646 21039 -165490 -158371 -123635 -189451 -81445 147289 -122490 -77842 -283051 366773
15941A474d97524b10230M2117p5240I0076J7066D3132P9067a17698r9361A60679
$$ 1474 -497524 -210230 -168113 -243353 90076 107142 43132 122199 -117698 -217059 160679
15929a46520D0810a29181e4370j90755G5262d2819A1314i1497k18634O625C2025
$$ -146520 40810 -129181 -54370 -245125 75262 -42819 11314 -91497 -310131 -303506 32025
15917A50294k2461Q7934b38759A70763A5713h8448J7055q5073E17944E1160J8220
$$ 150294 127833 215767 -238759 170763 15713 -88448 -71393 -156466 517944 51160 69380
15906F9380J21876c69399d7129J1184F4369e05654A39774a57244B34983E6050
$$ 69380 191256 -369399 -47129 -35945 64369 -505654 139774 -157244 234983 56050
15895h698j1854J147k77696J04563Q7459l1592A98806H4434k9259a62838j0851
$$ -8698 -20552 -19405 -297101 -192538 -105079 -136671 198806 84434 55175 -162838 -173689
15884a73689j4506H2664J4930k0764a33378D922a8353j76519A34346G028i0720
$$ -173689 -188195 82664 97594 76830 -133378 4922 -18353 -194872 134346 7028 -90720
15872g9491C42882j23269d5126l48622A24158C0511d0238j12253J7320I3803M2737
$$ -79491 342882 219613 -45126 -393748 124158 30511 -40238 -152491 -135171 93803 136540
15861A36540M1769G0606d57931D42698b54731A47492C3540a57288j1919A85992
$$ 136540 178309 70606 -457931 442698 -254731 147492 33540 -157288 -169207 185992
15850c69103J59323B5598a86372B67531b32116C2122H514b11754B85565a70485
$$ -369103 -209780 25598 -186372 267531 -232116 32122 8514 -211754 285565 -170485
15839A00310A3647b37668a07681p2853A92002a07315D3663e8506G1088a08537
$$ 100310 13647 -237668 -107681 -180534 192002 -107315 43663 -58506 71088 -108537
15828c9831k70901J33507a7923A27901b50918j4160J27996n3894A40563a62311
$$ -39831 -310732 -177225 -17923 127901 -250918 -265078 -137082 -190976 140563 -162311
15817a45087j10352L3589M8809q0862A44652c33212A11082b06628r0422j62262
$$ -145087 -255439 -221850 -173041 -253903 144652 -333212 111082 -206628 -297050 -459312
15807d59312E1424a08898C3613K55114C8535a55636A55071p2334k9201g5434C8476
$$ -459312 51424 -108898 33613 288727 38535 -155636 155071 82737 53536 -75434 38476
15795G3269h2007B53410h1756g043A59211a82060C4560L9314a08911E8821a62060
$$ 73269 -82007 253410 -81756 -7043 159211 -182060 34560 73874 -108911 58821 -162060
15783C56566a81619e2010b4440k17914J06716G4409R6890b19115d5385p730j20982
$$ 356566 -181619 -52010 -24440 -242354 -135638 74409 171299 -219115 -45385 -53115 -174097
15772a74097n2857Q4681a4018G9991l7942e8974A11678B4408i5930A9370c14528
$$ -174097 -226954 -142273 -14018 79991 42049 -58974 111678 24408 -95930 19370 -314528
15760a9705j14078A37124L24182h0938A56058b60613c8023a1320A81713H2156
$$ -19705 -133783 137124 461306 -80938 156058 -260613 -38023 -11320 181713 82156
15749A28653J04561e6543A0001J09353D5525f5725J9971r6596g0557A1147b51345
$$ 128653 233214 -56543 10001 119354 45525 -65725 -45754 -142350 -70557 11147 -251345
15737H2053c67976J75070k82773A69734c6307c503B5943J11375o5853a77315Q91
$$ 82053 -367976 -192906 -475679 169734 -36307 -3503 25943 137318 71465 -177315 -176424
15726a76424C43696I4032j3541b35247R3298j22365e1777n007j22507j13527j01144
$$ -176424 343696 94032 80491 -235247 -141949 -264314 -51777 -56784 -179291 -292818 -393962
15715c93962i9358M7753j7453K5149j11368O7428P103A0879a30858A79168a07699
$$ -393962 -99358 -51605 -69058 -43909 -155277 -87849 -80746 10879 -130858 179168 -107699
15703a34932A36654a04774d2081B06285a33444k5855E6105b21962j40339d2849
$$ -134932 136654 -104774 -42081 206285 -133444 -159299 56105 -221962 -362301 -42849
15692h1472C61144e9739j84993A45717c06I7477k7642i2081b9281j13345L8538
$$ -81472 361144 -59739 -244732 145717 -306 97477 69835 -92081 -29281 -142626 -104088
15681a04088j62998a12441r2543h3068B68604o7835H7049Q7273e9193B49537j12310
$$ -104088 -267086 -112441 -204984 -83068 268604 200769 87049 174322 -59193 249537 137227
15670A37227h5621j10734I6339f3571p2140A67695e2127C3583b92702e7862l162
$$ 137227 -85621 -196355 96339 -63571 -135711 167695 -52127 33583 -292702 -57862 -61024
15659f1024m1046j00467B16761e6621k65857m8246A49764a42p3100q9405j79749
$$ -61024 -102070 -202537 216761 -56621 -322478 -370724 149764 -142 -73242 -162647 -342396
15648c42396B80163c11813D03076a23101l7679F3054b43103d4587C10988f4698
$$ -342396 280163 -311813 403076 -123101 -160780 63054 -243103 -44587 310988 -64698
15637g2453A19158L6073K8166f687A40352A0147N7716a75130H9401J6834d4347
$$ -72453 119158 155231 183397 -6687 140352 10147 67863 -175130 89401 106235 -44347
15625b4143C45308I8082a50709B07654a24453B49318c38883a20031D1432a56339
$$ -24143 345308 98082 -150709 207654 -124453 249318 -338883 -120031 41432 -156339
15614e8595k06901K5558G1922O7412g9611a5136k02715A14299d3885k25330B59612
$$ -58595 -265496 -239938 71922 139334 -79611 -15136 -217851 114299 -43885 -269215 259612
15602A3870a61749E3092O714c16042a7070m6043A31262i2101j03749E4496h9245
$$ 13870 -161749 53092 59806 -316042 -17070 -63113 131262 -92101 -195850 54496 -89245
15590a7743j4532B95191p2955e4186C0058L80211c31372D6025c12865C7609d68757
$$ -17743 -32275 295191 222236 -54186 30058 410269 -331372 46025 -312865 37609 -468757
15578b27966a0732B16048J20576c83821a58739k16800b0573p8548j70226c0376
$$ -227966 -10732 216048 336624 -383821 -158739 -375539 -20573 -99121 -269347 -30376
15567B17507a56246C18725B6838a89391b8232j51870F2192b32635L2639h2061
$$ 217507 -156246 318725 26838 -189391 -28232 -180102 62192 -232635 -199996 -82061
15556a20535e9702B30073B0045K9459B309K07838b14486A27547a9051K116n8174
$$ -120535 -59702 230073 20045 49504 2309 210147 -214486 127547 -19051 -16935 -75109
15545g5109A59129n6230a40120A97208c78j28184M5488k495A64460e89914a12008
$$ -75109 159129 102899 -140120 197208 -378 -128562 -83074 -85569 164460 -589914 -112008
15533i8827L113j2383B17750G512c08721P9853a5627j00540d5767b026j79176
$$ -98827 -95714 -108097 217750 7512 -308721 -228868 -15627 -116167 -45767 -2026 -181202
15522a81202Q9032p2953P3314j809o0973f5060D43378a97914G8939a43800C6447
$$ -181202 -92170 -165123 -91809 -93618 -154591 -65060 443378 -197914 78939 -143800 36447
15510A02906a36218M8397a9326r2812m6863j23459j0291D6622L7028B8240M2538
$$ 102906 -136218 -87821 -19326 -112138 -159001 -282460 -292751 46622 83650 28240 70778
15499G0778j7481O1374f8244B48570B7468l059c4554H0592b47785A54740n5261
$$ 70778 53297 114671 -68244 248570 27468 24409 -34554 80592 -247785 154740 99479
15488I9479f2878C4624O5884C8545a2078j87221k81763B88351r4688a58833g4607
$$ 99479 -62878 34624 100508 38545 -12078 -199299 -481062 288351 193663 -158833 -74607
15476a04831M2853h041A13354c43740B0204i6964m22859a28587A4523K10710h3737
$$ -104831 -61978 -8041 113354 -343740 20204 -96964 -519823 -128587 14523 225233 -83737
15464e9243E0324b21180a08321j04126A14622B1919J43790F9611i1932A74775
$$ -59243 50324 -221180 -108321 -212447 114622 21919 165709 69611 -91932 174775
15453e9478B47277a47389C07964A2926a72680J9585D5683N7961R2483D4056a74190
$$ -59478 247277 -147389 307964 12926 -172680 -153095 45683 103644 196127 44056 -174190
15441h229n5123b6617A45862b70545A45938m3378J25083E6070a83813Q8814b8987
$$ -8229 -63352 -26617 145862 -270545 145938 102560 227643 56070 -183813 -94999 -28987
15429A08465a80882A74852N0461a71738l9525i1247F7825c382A87029b688k81166
$$ 108465 -180882 174852 225313 -171738 -211263 -91247 67825 -3382 187029 -2688 -283854
15418b83854B37J0357h3260C43866d1171k0471r8497A15090c03649E4023K40154
$$ -283854 237 10594 -83260 343866 -41171 -61642 -160139 115090 -303649 54023 294177
15407B94177E9000M5968a46467C01291F7765c85472J61088G4289b8028E2464L1871
$$ 294177 59000 104968 -146467 301291 67765 -385472 -224384 74289 -28028 52464 84335
15396H4335j6214g1918m7432B1672n647a82293n5492b5609B43759q7135e9921
$$ 84335 68121 -71918 -119350 21672 16025 -182293 -237785 -25609 243759 156624 -59921
15384a03816j720c5735C29569I4356h3580j07291A82041J15152f4163B90012a88899
$$ -103816 -105536 -35735 329569 94356 -83580 -190871 182041 297193 -64163 290012 -188899
15372b33257A31225i4701I099O657J39577c06470M5366C34897c3901O350F9451
$$ -233257 131225 -94701 9099 15756 155333 -306470 -261104 334897 -33901 -27551 69451
15360b51914j0805a05842C3514K3233b38432H7248J06016c11937a5354C20369
$$ -251914 -262719 -105842 33514 56747 -238432 87248 193264 -311937 -15354 320369
15349G527L74894C4391c9435m3361g492A65601E5664j298M19051b43394k06687
$$ 7527 382421 34391 -39435 -82796 -7492 165601 55664 54366 473417 -243394 -450081
15338d50081C84566j79492c53347H99L01779j07569J88641b27908A71421Q1812
$$ -450081 384566 205074 -353347 899 302678 195109 383750 -227908 171421 253233
15328B53233c599j5852r1695A870L4589b79316C44570a62723A31115b63066B09395
$$ 253233 -3599 -19451 -111146 1870 36459 -279316 344570 -162723 131115 -263066 209395
15316A09458P8955b04287c7685C8562O066N2996A5099b48961A39981J35966p0491
$$ 109458 188413 -204287 -37685 38562 44628 97624 15099 -248961 139981 275947 205456
15305B05456a37022j13356a02233A36452k4596B8852i2136E2146e8494A41425
$$ 205456 -137022 -250378 -102233 136452 111856 28852 -92136 52146 -58494 141425
15294g4770A37735C800O8569P4491K26684c58021C3404C206J12493Q0487L9972
$$ -74770 137735 3800 72369 146860 373544 -358021 33404 3206 115699 196186 236158
15283B36158d4250A83646k3332J24135p47A28743O1512i8015B97065b1325p8111
$$ 236158 -44250 183646 160314 284449 283702 128743 190255 -98015 297065 -21325 -99436
15272i9436L8692K3404d712j98125Q8594A17832c305C59110A60906m0874J25100
$$ -99436 -60744 -37340 -4712 -202837 -114243 117832 -3305 359110 160906 120032 245132
15261B45132n311L7814A23490o0319j2385J07017E7044K57845j49689l740L55568
$$ 245132 239821 277635 123490 63171 50786 157803 57044 314889 165200 161460 517028
15250E17028L06048L521J124861m74332J8530l37213m80156j56893A82138a43869
$$ 517028 823076 826597 1951458 1477126 1495656 1158443 678287 521394 182138 -143869
15239A47184a17541k7391I7542J97297H3977m364B6673J09000a18218a7015f861
$$ 147184 -117541 -144932 97542 294839 83977 79613 26673 135673 -118218 -17015 -6861
15227c28968A13072b1975B88809b91328O0036M1207F3614M1882R6076k0149B5357
$$ -328968 113072 -21975 288809 -291328 -231292 -190085 63614 105496 201572 181423 25357
15215A12430D6703J563e839D2860e5681f234k3937A71899a15004B00130A3012
$$ 112430 46703 48266 -5839 42860 -55681 -6234 -30171 171899 -115004 200130 13012
15203A83648c8415j51577f6076b5221B27400I4141J637O8173K35303A03403D0302
$$ 183648 -38415 -189992 -66076 -25221 227400 94141 95778 163951 399254 103403 40302
15191b00640E9330J66078a89679B94835a26832c1753A08755a93669B36131q9767
$$ -200640 59330 225408 -189679 294835 -126832 -31753 108755 -193669 236131 146364
15181A46364c307A84759a20540E63097C145c0768q3959e4301O843G8988J33262
$$ 146364 -3307 184759 -120540 563097 3145 -30768 -114727 -54301 -47458 78988 212250
15170B12250K25639A54193b96712I4591J13416b1590E6124B5836Q2995P4545F1945
$$ 212250 437889 154193 -296712 94591 208007 -21590 56124 25836 108831 183376 61945
15158B42977R0090c34294B99292b1179j97398D7068K29089F8385J41618L56237
$$ 242977 333067 -334294 299292 -21179 -218577 47068 276157 68385 210003 566240
15148E66240d8994A17009e7526A79806b16571H246J87463r1419J56472a19130
$$ 566240 -48994 117009 -57526 179806 -216571 8246 195709 104290 260762 -119130
15137H8247c522m46294C49230L2578C5304J15827o8853b49745D962J35251O6186
$$ 88247 -3522 -449816 349230 381808 35304 151131 82278 -249745 4962 140213 206399
15126B06399j2232o8769J7667b85778e1590B7638R8301N08651A82724a3637B22439
$$ 206399 194167 125398 143065 -285778 -51590 27638 125939 634590 182724 -13637 222439
15114f5270H5874N2194h8719k25793A01971Q1716M1163D3296a22057A74690L9908
$$ -65270 85874 138068 -88719 -314512 101971 183687 224850 43296 -122057 174690 214598
15103B14598a81264B16615A2978K71976j25243J61762K19991B67241G6946O5017
$$ 214598 -181264 216615 12978 284954 159711 321473 541464 267241 76946 141963
15093A41963K47163m2001A56956J90466j45618A9526q753R8344e9409F41495A09799
$$ 141963 389126 347125 156956 347422 201804 19526 10773 109117 -59409 641495 109799
15081C37333A6250L33034j44752b58387B2675o059M9595i0285E89520b4543B2432
$$ 337333 16250 349284 204532 -258387 22675 16616 66211 -90285 589520 -24543 22432
15069a80450A03327J4323K13760j47010J6336k7839P6229n5115a09876A02582
$$ -180450 103327 117650 331410 184400 200736 172897 249126 194011 -109876 102582
15058c7599C38317C1437J96537l2889K32147a61934I7695d1694a6982B04203G7995
$$ -37599 338317 31437 227974 195085 427232 -161934 97695 -41694 -16982 204203 77995
15046A36768D3020K3948N9178k7034K56374j48352e3843A75532J03254j04598
$$ 136768 43020 66968 126146 99112 355486 207134 -53843 175532 278786 174188
15036A74188K58745B6542K43624g2427A78543c7364C00126k5548j28090K10676
$$ 174188 432933 26542 270166 -72427 178543 -37364 300126 274578 146488 357164
15026C57164q9597r4096A3955h7639C28597j42048J0403Q1951n22O492K49732
$$ 357164 267567 173471 13955 -87639 328597 186549 196952 278903 278381 284873 534605
15015E34605a7235A18393a969A19381L11413k08784E6962R9893J42756j11534
$$ 534605 -17235 118393 -1969 119381 430794 222010 56962 156855 299611 188077
15005A88077J27592A56560L42285q5444j55596K080j27992a16657F1895J94423
$$ 188077 315669 156560 498845 413401 257805 259885 131893 -116657 61895 256318
14995B56318o5914p8880L09658m4743q5373A23953N6073q9021f0980k1328q3627
$$ 256318 190404 111524 421182 376439 291066 123953 180026 91005 -60980 -82308 -165935
14984a65935M4682D33017A52999J18917C1877d0477A05133m6538J69751J36225
$$ -165935 -121253 433017 152999 271916 31877 -40477 105133 58595 228346 364571
14974C64571i9217b2532D19098N1599e2254B38357k8673P9318j31698P9191G652
$$ 364571 -99217 -22532 419098 470697 -52254 238357 209684 289002 157304 236495 7652
14962B07888K934J8156J63706M7640A39782C7618J38089J04766J01486n0377m9692
$$ 207888 210822 228978 392684 440324 139782 37618 175707 280473 381959 331582 281890
14951B81890Q2836H1961L51749J48381E4529K27667l7661K59675o2286I6669K85212
$$ 281890 364726 81961 433710 582091 54529 282196 244535 504210 441924 96669 381881
14940C81881J930m3283j52028J36016N7250M5099j70537R1376D9293N54709A72138
$$ 381881 383811 340528 188500 324516 381766 426865 256328 347704 49293 604002 172138
14928A07108B95O72339l34620L10812a5989C58299q695A16889N28947k93714A7242
$$ 107108 295 672634 338014 648826 -15989 358299 349604 116889 645836 352122 17242
14916H5570C7497j1121Q6468K38531j7339n030l5637M5425k2852o2332K75914
$$ 85570 37497 26376 112844 351375 334036 329006 293369 338794 315942 253610 529524
14905E29524j13194j48387M14112k97049J67913k1653k33656F3791N313L67169
$$ 529524 416330 267943 682055 385006 552919 531266 297610 63791 69104 436273
14895D36273m3603A71001r711J54231J97201J36480B92905A25343J36334P4664
$$ 436273 392670 171001 161290 315521 512722 649202 292905 125343 261677 336341
14885C36341M6308O2422p0228m9172I3831K44129o1117m1023L81895j17461N4329
$$ 336341 382649 445071 374843 325671 93831 337960 276843 235820 617715 500254 554583
14874E54583A76345K3173J54906J59350B50814r1125K32092A48643J19468j2001
$$ 554583 176345 199518 354424 513774 250814 159689 391781 148643 268111 256110
14864B56110k9923J62689M16162k51284n6037B35654r277G4113L75306J56611
$$ 256110 226187 388876 805038 553754 497717 235654 226377 74113 449419 606030
14854F06030J24283A49696M11587q3484k36278M76078k85437Q7833j31031j27072
$$ 606030 730313 149696 561283 477799 241521 717599 432162 519995 388964 261892
14844B61892J67439k10971K44153j13453j38943Q7922J53858k9525J10552p5665
$$ 261892 429331 218360 462513 349060 210117 298039 451897 422372 532924 457259
14834D57259N3626J17611j53859M0513m1865J98039k78213L85397k26795q1427
$$ 457259 510885 628496 474637 515150 473285 671324 393111 778508 551713 470286
14824D70286R8545p5400o926l6699k0958j16299q4550j1111N09237K06123k69845
$$ 470286 568831 493431 486505 449806 428848 312549 227999 216888 726125 932248 662403
14813F62403j83175l3755l3218N9930j05369j54983M13998q4158A29191P03234
$$ 662403 479228 445473 412255 472185 366816 211833 625831 541673 129191 832425
14803H32425l36537Q6249J0617o3713L72771l48912A56362J53574M65515k56514
$$ 832425 495888 582137 592754 529041 901812 552900 156362 309936 775451 518937
14793E18937j05381j13691J06691K27714j88292J0349J72393n2462K63693m9512
$$ 518937 413556 299865 406556 634270 445978 456327 628720 576258 839951 790439
14783G90439k16376l3728n7823r6116K79810j40524K0675K05775l45974J45929
$$ 790439 574063 540335 482512 386396 666206 525682 546357 752132 406158 552087
14773E52087j08209R2044n0119m9315L30649K75586C15003K24847K94396k33945
$$ 552087 443878 535922 485803 436488 767137 1042723 315003 539850 834246 600301
14763F00301B47231L20613o6415J42849J47242l42776K66784C02227L56048j35194
$$ 600301 247231 567844 501429 644278 791520 448744 715528 302227 658275 523081
14753E23081J91302B00585O22935k05133L5309J35070j14539P7142J0734J02299
$$ 523081 714383 200585 823520 618387 653696 788766 674227 751369 762103 864402
14743H64402j23710j21611O3913o2475K15087k44296k50909N54712m10647K23819
$$ 864402 740692 619081 682994 620519 835606 591310 340401 895113 484466 708285
14733G08285J12743m4789K29524l63918R2715j70467k9063M5928J51656l5781
$$ 708285 821028 776239 1005763 641845 734560 564093 535030 580958 732614 696833
14723F96833P0007J32687p2095p1573R2022o7033J71359l5188j26640k49755K74928
$$ 696833 766840 899527 827432 755859 847881 780848 952207 917019 790379 540624 815552
14712H15552j27093L01025r5956r7239k40866M18514l41235L42906j05043J34698
$$ 815552 688459 989484 893528 796289 555423 973937 632702 975608 870565 1005263
14702A005263P3418k52266j3471J48431j37697j64549L50238l57680K84139K8449
$$ 1005263 1078681 826415 812944 961375 823678 659129 1009367 651687 935826 964275
14692I64275q375K5679m0009M7567r6922L2206p4825M53641n55259L62396j30019
$$ 964275 955900 981579 941570 989137 892215 924421 849596 1303237 747978 1110374 980355
14681I80355m04006M26480J70139j57811m1144k94839K93781J48142j83811r233
$$ 980355 576349 1002829 1172968 1015157 974013 679174 972955 1121097 937286 928053
14671I28053K19030p6401j39O5957k53253K22183P7049j76716m6349J67643M5235
$$ 928053 1147083 1070682 1070543 1136500 883247 1105430 1182479 1005763 959414 1127057 1172292
14660A172292k25523J50470j01717M21394n55059J29464L2204j5934J10675k05340
$$ 1172292 946769 1097239 995522 1416916 861857 991321 1023525 1007591 1118266 912926
14650I12926N80791l24237L18160k14728j12795J19825k50107P2026K96915j75286
$$ 912926 1493717 1169480 1487640 1272912 1160117 1279942 1029835 1101861 1398776 1223490
14640A223490M5239k62774R1703R2801K22344k61503K03362k29496J55838L13856
$$ 1223490 1268729 1005955 1097658 1190459 1412803 1151300 1354662 1125166 1281004 1594860
14630A594860J39382k45662j13981j78276L24564k24234L85163k41605k74998
$$ 1594860 1734242 1488580 1374599 1196323 1520887 1296653 1681816 1440211 1165213
14621A165213L56830J23163l27712M8529O8290j43762J36543L59489l90755K29138
$$ 1165213 1522043 1645206 1317494 1366023 1434313 1290551 1427094 1786583 1395828 1624966
14611A624966k9804L1969O4344k81771K73438K09221j72174K3810m13504K78648
$$ 1624966 1595162 1627131 1691475 1409704 1683142 1892363 1720189 1743999 1330495 1609143
14601A609143K9539J82778l54742K11426J7252n2943L46129k60617j77827J02155
$$ 1609143 1638682 1821460 1466718 1678144 1695396 1642453 1988582 1727965 1550138 1652293
14591A652293m5243L42379R2695M0755j85895P8641J56301j95430j923M778j84255
$$ 1652293 1607050 1949429 2042124 2082879 1896984 1975625 2131926 1936496 1934573 1939351 1755096
14580A755096j54319L67059j52275J2944J79459M9423J34887Q7538l72567M01313
$$ 1755096 1600777 1967836 1815561 1828505 2007964 2057387 2192274 2279812 1907245 2308558
14570B308558q921J90082J17964o69392L41515K29804N2336K3593K6249J24222
$$ 2308558 2299637 2489719 2607683 1938291 2279806 2509610 2561946 2585539 2611788 2736010
14560B736010k2970K73591j18455K07261q8025M30074Q7836O13521M20934O25828
$$ 2736010 2713040 2986631 2868176 3075437 2987412 3417486 3505322 4118843 4539777 5165605
14550E165605J876672K661533N876899Q111973J2653917L638540j8206320I492535
$$ 5165605 7042277 9703810 15580709 23692682 36346599 39985139 21778819 9492535
14541D730149j596322n23411l54296P8596k87516J35692k15042N126K66618l4226
$$ 4730149 3133827 2610416 2256120 2334716 2047200 2182892 1967850 1972976 2239594 2205368
14531B205368K48354k45321j16996K87998N1331J90362p00532M15156L04847J86604
$$ 2205368 2453722 2208401 2091405 2379403 2430734 2621096 1920564 2335720 2640567 2827171
14521B827171p0735m53658J59287L59531k50495j2874M5537j3995K2258r8647
$$ 2827171 2756436 2302778 2462065 2821596 2571101 2558227 2603764 2589769 2612027 2513380
14511B513380K11978J03200J27098j44319k92755P62195o08356N26982l68708
$$ 2513380 2725358 2828558 2955656 2811337 2518582 3280777 2672421 3199403 2830695
14502B830695J4019O09369n57795L73292o0488k55211L56048J64708j05750q6558
$$ 2830695 2844714 3454083 2896288 3269580 3209092 2953881 3309929 3474637 3368887 3282329
14492C282329L55612Q2268k93933L46864n37361K08268J20071P1365j27458L88960
$$ 3282329 3637941 3720209 3426276 3773140 3235779 3444047 3564118 3635483 3508025 3896985
14482C896985k19561L36392p7561l3050J41256j07223p6216K35469k96996O34137
$$ 3896985 3677424 4013816 3936255 3903205 4044461 3937238 3861022 4096491 3799495 4433632
14472D433632l00945J50322N03341j51241m37227O47554k62181j46266J05103
$$ 4433632 4132687 4283009 4786350 4635109 4197882 4845436 4583255 4436989 4542092
14463D542092M47389l27063L04732j9715p8201J85922j02600q3748N47705R4227
$$ 4542092 4989481 4662418 4967150 4947435 4869234 5055156 4952556 4868808 5416513 5510740
14453E510740m65211M04428K01121p7135L4579J7043J62287P3827k65530L35326
$$ 5510740 5045529 5449957 5651078 5573943 5608522 5625565 5787852 5861679 5596149 5931475
14443E931475K56365k46461J09187R5760L48752j87357R4563J07921K17985o8265
$$ 5931475 6187840 5941379 6050566 6146326 6495078 6307721 6402284 6510205 6728190 6659925
14433F659925r4487L76330M4641J29071o6850J25681K26631j10597L00494Q0894
$$ 6659925 6565438 6941768 6986409 7115480 7048630 7174311 7400942 7290345 7590839 7671733
14423G671733J98091J75802j2456M9277k7478K24627J40670L61773q951K5929
$$ 7671733 7869824 8045626 8033170 8082447 8054969 8279596 8420266 8782039 8773088 8799017
14413H799017m68838N96228K85553L55859q8276K77846o9087j55923P51344k9224
$$ 8799017 8330179 8926407 9211960 9567819 9479543 9757389 9688302 9532379 10283723 10254499
14403A0254499M0552P1973K45375L61960M9802j9906K56627K87853j16878N73521
$$ 10254499 10295051 10367024 10612399 10974359 11024161 11004255 11260882 11548735 11431857 12005378
14393A2005378N7035J82750M48520K85580N5917M33888j42153M03747J91339N3362
$$ 12005378 12062413 12245163 12693683 12979263 13035180 13469068 13326915 13730662 13922001 13975363
14383A3975363N66177K69269J02451K44991K43630J74682N81202J12018M31614
$$ 13975363 14541540 14810809 14913260 15158251 15401881 15576563 16157765 16269783 16701397
14374A6701397R9502O62965K13100O02001M46672l277P22537O12557N332K89847
$$ 16701397 16800899 17463864 17676964 18278965 18725637 18722360 19444897 20057454 20062786 20352633
14364B0352633M18386M27055P90860R9726M96792N59759P59090M27669P00141
$$ 20352633 20771019 21198074 21988934 22088660 22585452 23145211 23904301 24331970 25032111
14355B5032111M94501M48076J051748M68380N83849N74730P11167O86180O60091
$$ 25032111 25526612 25974688 27026436 27494816 28078665 28653395 29364562 30050742 30710833
14346C0710833J108343R41249Q59412M25723R98874J034010R89147Q83902J528082
$$ 30710833 31819176 32760425 33619837 34045560 35044434 36078444 37067591 37951493 39479575
14337C9479575Q77611J075626J375058J258303J298556J557069J136543J262592
$$ 39479575 40357186 41432812 42807870 44066173 45364729 46921798 48058341 49320933
14329D9320933K007634J405113J540619K152856J738494J747606K215922K198304
$$ 49320933 51328567 52733680 54274299 56427155 58165649 59913255 62129177 64327481
14321F4327481K354628K304371K668352K465561K616378L174131L150777L067652
$$ 64327481 66682109 68986480 71654832 74120393 76736771 79910902 83061679 86129331
14313H6129331L245493L813490L679173M203481M312126M194634M642815N162642
$$ 86129331 89374824 93188314 96867487 101070968 105383094 109577728 114220543 119383185
14305A19383185N542883N547673O650995N843489O736821O943932P718729Q013268
$$ 119383185 124926068 130473741 137124736 142968225 149705046 156648978 164367707 172380975
14297A72380975Q601865Q998757R615899R633162J0916245J1370816J1673576
$$ 172380975 180982840 189981597 199597496 209230658 220146903 231517719 243191295
14290B43191295J2632302J2597905J3581123J3709067J4582616J4588688J4701870
$$ 243191295 255823597 268421502 282002625 295711692 310294308 324882996 339584866
14283C39584866J5053466J5127964J4773925J4038652J3632213J2936354J1145594
$$ 339584866 354638332 369766296 384540221 398578873 412211086 425147440 436293034
14276D36293034J0108338P557396N090602P53697k998518j801615N5948m97370
$$ 436293034 446401372 453958768 459049370 459803067 456804549 455002934 455058882 454561512
14268D54561512l639059n634268q629083j0288712j1094702j2986705j3731289
$$ 454561512 450922453 445288185 436659102 426370390 415275688 402288983 388557694
14261C88557694j4822310j5227912j5083490j5322508j5209159j4876503j3618760
$$ 388557694 373735384 358507472 343423982 328101474 312892315 298015812 284397052
14254B84397052j3278648j3069802j2715050j1905726j1792144j0376519j0466280
$$ 284397052 271118404 258048602 245333552 233427826 221635682 211259163 200792883
14247B00792883r869100q665305q916498p945323p632604p261540p213902o395870
$$ 200792883 190923783 182258478 173341980 165396657 157764053 150502513 143288611 136892741
14239A36892741o043054n391950n328218n044367n165194m694647l717764m226590
$$ 136892741 130849687 125457737 120129519 115085152 109919958 105225311 101507547 97280957
14231I7280957l556781l527197l699432l661375k946944k887279l189446k232619
$$ 97280957 93724176 90196979 86497547 82836172 79889228 77001949 73812503 71579884
14223G1579884k585201k267947k175510k002677k262898j643380k256475k166670
$$ 71579884 68994683 66726736 64551226 62548549 60285651 58642271 56385796 54219126
14215E4219126j258623j447618j200920k114304j459400j256807j523447j174902
$$ 54219126 52960503 51512885 50311965 48197661 46738261 45481454 43958007 42783105
14207D2783105p04435j057186j496899j339275p42332r98590q83764p09786j180978
$$ 42783105 42078670 41021484 39524585 38185310 37442978 36444388 35560624 34850838 33669860
14198C3669860j005386o31634o08458q03990j158076l48848r11840n52802q52186
$$ 33669860 32664474 32032840 31424382 30620392 29462316 29113468 28201628 27648826 26796640
14189B6796640p30541m34577n87459j053680L12493j119524j94837p18354j77852
$$ 26796640 26066099 25631522 25044063 23990383 24302876 23183352 22988515 22270161 22092309
14180B2092309o38985n43623l54041n77045q2061l35477l31670o56206k30678
$$ 22092309 21453324 20909701 20555660 19978615 19896554 19561077 19229407 18573201 18342523
14171A8342523k87284k68865n52032k14054m63199k55112l82965k13140k98382
$$ 18342523 18055239 17786374 17234342 17020288 16557089 16301977 15919012 15705872 15407490
14162A5407490N4382q81419J25876o31406K79813m10159q2822j98493l54496j13903
$$ 15407490 15461872 14580453 14706329 14074923 14354736 13944577 13861755 13663262 13308766 13194863
14152A3194863L634l65313n64753k19929J07056n2932m32557j56791j46565J3351
$$ 13194863 13198497 12833184 12268431 12048502 12155558 12102626 11670069 11513278 11366713 11380064
14142A1380064k23751j81302o64129J10326p7919m9714n46133J3070j19526m96510
$$ 11380064 11156313 10975011 10310882 10421208 10343289 10293575 9747442 9760512 9640986 9144476
14132I144476L81648j51088m01546K94618k44967l88087m9910l4514j44097R7434
$$ 9144476 9526124 9375036 8973490 9268108 9023141 8635054 8585144 8550630 8406533 8503967
14122H503967k72815j48567m5874j31025j94747N4518k12134R0281k65879k04272
$$ 8503967 8231152 8082585 8036711 7905686 7710939 7765457 7553323 7643604 7377725 7173453
14112G173453n6405J43908j13605k30512l26471K78592O7584k79607K203j95515
$$ 7173453 7117048 7260956 7147351 6916839 6590368 6868960 6936544 6656937 6659140 6463625
14102F463625j02994L9612L8833r6319j79323l63712o3585J13204J12566k74349
$$ 6463625 6360631 6400243 6439076 6342757 6163434 5799722 5736137 5849341 5961907 5687558
14092E687558K09418k07887L0193m5675J11614j9301n33217j32459J03175o9213
$$ 5687558 5896976 5689089 5719282 5673607 5785221 5765920 5232703 5100244 5203419 5134206
14082E134206K3490J70177l26170N5271m7756k53295K64605n82074J5381L31499
$$ 5134206 5157696 5327873 5001703 5056974 5009218 4755923 5020528 4438454 4453835 4785334
14072D785334n9012j58795j74092K88657m21591k05551R3856k9185K95525o4587
$$ 4785334 4726322 4567527 4393435 4682092 4260501 4054950 4148806 4119621 4415146 4350559
14062D350559p6585K8193k37811J63845O1791k97447O2545l5738J5820k6189k10626
$$ 4350559 4273974 4302167 4064356 4228201 4289992 3992545 4055090 4019352 4035172 4008983 3798357
14051C798357K7291K69929m84497O8172P4635k99876k53719M18938L5278j18357
$$ 3798357 3825648 4095577 3611080 3679252 3753887 3454011 3200292 3619230 3654508 3536151
14041C536151r1545l20485Q0583J01260q9303J99343o6741J7847j53450m7718
$$ 3536151 3444606 3124121 3204704 3305964 3216661 3416004 3349263 3367110 3213660 3165942
14031C165942j26587J48065k54783j72024k85975M96862l16636J88447J13221
$$ 3165942 3039355 3187420 2932637 2760613 2474638 2971500 2654864 2843311 2956532
14022B956532N7891Q208l54650j49166J16899j6970l4594L06650n22810J99954
$$ 2956532 3014423 3022631 2667981 2518815 2635714 2618744 2584150 2890800 2367990 2567944
14012B567944q4522j69014Q2719J83020j89142j04208j13388K21703j96615j41669
$$ 2567944 2483422 2314408 2397127 2580147 2391005 2286797 2173409 2395112 2198497 2056828
14002B056828N39233l4548k44896k22330L24567l41967j39867J00149J34226Q9974
$$ 2056828 2596061 2561513 2316617 2094287 2418854 2076887 1937020 2037169 2171395 2261369
13992B261369N1176L84054P33611K509700M079021P454492J2913954R601661j5746789
$$ 2261369 2312545 2696599 3430210 5939910 10018931 17473423 30387377 39989038 24242249
13983B4242249j1237004n225309j743061j241262l69131n81818k43910n37497
$$ 24242249 13005245 7779936 6036875 4795613 4426482 3844664 3600754 3063257
13975C063257q9874J3516M3788k39450K7056k75533j81705N01439l85286l5187
$$ 3063257 2973383 2986899 3030687 2791237 2818293 2542760 2361055 2862494 2477208 2442021
13965B442021o4461j46880N600o7572J67123m91614M57472j72985k4631j23313
$$ 2442021 2377560 2230680 2236280 2168708 2335831 1844217 2301689 2128704 2104073 1980760
13955A980760J25827j55410L04315n00103M95397n10377M52980m44905J49853
$$ 1980760 2106587 1951177 2255492 1755389 2250786 1740409 2193389 1748484 1898337
13946A898337m3793K5154k9576K13715l11932k60912L91530K15n17706J65426
$$ 1898337 1854544 1879698 1850122 2063837 1751905 1490993 1882523 1882738 1365032 1530458
13936A530458J87820O6168j00007L26169k27411k64993L04837m9619l64113N83695
$$ 1530458 1718278 1784446 1684439 2010608 1783197 1518204 1823041 1773422 1409309 1993004
13926A993004n8718l57031J89311j81530Q7260k36560j689P4858n830L32507L9631
$$ 1993004 1934286 1577255 1766566 1585036 1672296 1435736 1434047 1508905 1503075 1835582 1875213
13915A875213n67161K83065j69106K16183j92959O311J08308r1927K52915l00538
$$ 1875213 1308052 1591117 1422011 1638194 1445235 1451546 1559854 1467927 1720842 1420304
13905A420304k4992m6077K82687k37381j75441k03503M46824j27017k47316M56117
$$ 1420304 1395312 1349235 1631922 1394541 1219100 1015597 1462421 1335404 1088088 1544205
13895A544205j07829K5008j41403J71420j29094m38784K49580p1479K04948m8884
$$ 1544205 1436376 1461384 1319981 1491401 1362307 923523 1173103 1101624 1306572 1257688
13885A257688M8356P4706O274k1674k6427P3254l77748j75170Q54802j21331k65883
$$ 1257688 1306044 1380750 1387024 1365350 1338923 1412177 1034429 859259 1714061 1592730 1326847
13874A326847m7848m45485Q01578n57943R6340L69115j02097k76522j51945l17939
$$ 1326847 1278999 833514 1635092 1077149 1173489 1542604 1440507 1163985 1012040 694101
13864F94101N24908j28605K39862k49843K04427m5011j25065o1247K04851j25103
$$ 694101 1219009 1090404 1330266 1080423 1284850 1239839 1114774 1053527 1258378 1133275
13854A133275j24807q653l31883K68261o9304R7609K33131l99297K70484j01411
$$ 1133275 1008468 999815 667932 936193 866889 964498 1197629 798332 1068816 967405
13844I67405R0394J17424k00916L11441l31096J6330K74808k19445K19285k16395
$$ 967405 1057799 1175223 974307 1285748 954652 970982 1245790 1026345 1245630 1029235
13834A029235m4530k60298Q5093j44195J63821L18089j44524j38457N2775J65392
$$ 1029235 984705 724407 809500 665305 829126 1147215 1002691 864234 917009 1082401
13824A082401k23425L7598l12045j19180M88117n2049Q1626J75630M3299j28762
$$ 1082401 858976 896574 584529 465349 953466 901417 983043 1158673 1201972 1073210
13814A073210l52489j22041K98773j71815L3138R8175J50223j62838K01698k96528
$$ 1073210 720721 598680 897453 725638 758776 856951 1007174 844336 1046034 749506
13804G49506K48614j53687j5006l2620k8895J45907l68633M65160k14185R708
$$ 749506 998120 844433 829427 796807 767912 913819 545186 1010346 796161 805869
13794H05869K5845r7063J38149m8512k40321N05281l37862L1405n5033P6811k69410
$$ 805869 831714 734651 872800 824288 583967 1089248 751386 782791 727758 804569 535159
13783E35159K46789K11393j36841m7112k76818K98703l1667l4455k0727M847j94816
$$ 535159 781948 993341 856500 809388 532570 831273 799606 765151 744424 749271 554455
13772E54455J29072N2399B68850K20972L8854M57234l04982R7251j15002j01478
$$ 554455 683527 735926 268850 489822 528676 985910 680928 778179 663177 561699
13762E61699L94028l57295J92435k30578m6337K52675l22712L47198p873K24588
$$ 561699 955727 598432 790867 560289 513952 766627 443915 791113 783240 1007828
13752A007828k83301j01899J0420j68531L8171Q4620B46511N62417L0357R5828
$$ 1007828 724527 622628 633048 464517 502688 587308 246511 808928 839285 935113
13742I35113l02446k74113K35265J62331k70944J73688m2743P3727j30805k23892
$$ 935113 632667 358554 593819 756150 485206 658894 616151 689878 559073 335181
13732C35181K64840K44343k32318K4545o9108J23962N470k02675N1237J73490
$$ 335181 600021 844364 612046 636591 567483 691445 696915 494240 545477 718967
13722G18967k53133L23921N5242j42348J70939j91817o8902r3985J99104J46489
$$ 718967 465834 789755 844997 702649 873588 681771 612869 518884 717988 864477
13712H64477j14391j07292j66328N08970j61598k54803j40531K12759p7991j9931
$$ 864477 750086 642794 476466 985436 823838 569035 428504 641263 563272 543341
13702E43341J45875j25789L138o5769n867l9078j07626J27198K39975j40830n6573
$$ 543341 689216 563427 566565 500796 494929 455851 348225 475423 715398 574568 517995
13691E17995J16905k07321L20300j32104l00578K04341j68841L13934k35448R7262
$$ 517995 634900 427579 747879 615775 315197 519538 350697 664631 429183 526445
13681E26445r2355m6129J95841p3149J6253j61612J15959R2794B70743J18062
$$ 526445 434090 387961 583802 510653 526906 365294 481253 574047 270743 388805
13671C88805P7080n101n4305j6426M2129L47519r6338k23831k2968P9521j0704
$$ 388805 465885 460784 406479 390053 432182 779701 683363 459532 436564 516085 505381
13660E05381J1604k11489K10846N9503J40609k74692A25507L02026j57190K20966
$$ 505381 516985 305496 516342 575845 716454 441762 125507 427533 270343 491309
13650D91309j73043q235K44569J04483k52715Q6183o4025m3680J41043p7324J23051
$$ 491309 318266 310031 554600 659083 406368 492551 428526 384846 525889 448565 571616
13639E71616A30196L63283n6954J16673j04258K28581k80030J04717N7108j51849
$$ 571616 130196 493479 436525 553198 448940 677521 397491 502208 559316 407467
13629D07467K82276d9280G88253k93253r0475o1168J33653B22912K19312P4203
$$ 407467 689743 -49280 788253 495000 404525 343357 477010 222912 442224 516427
13619E16427N927n3928B09690l7M88744l16929J16099k07156q015L4795J34887
$$ 516427 522354 468426 209690 209653 698397 381468 497567 290411 282396 317191 452078
13608D52078j3319j45766J31057O7351j90046m7836L75702k53319r1891P07692
$$ 452078 438759 292993 424050 491401 301355 253519 629221 375902 284011 991703
13598I91703A30107J92288L4231L32877k04889p4883j10064k4731J95276j65612
$$ 991703 130107 322395 356626 689503 484614 409731 299667 274936 470212 304600
13588C04600Q8947P2632k5903p3289j74919J36800M44821k26612B57497A2505
$$ 304600 393547 466179 440276 366987 192068 328868 773689 547077 257497 12505
13577E58406A12766L26901A43914L29921L9540F4129A6704R0519j5292a136F93576
$$ 558406 112766 439667 143914 473835 513375 64129 16704 107223 91931 -1136 693576
13565A63881J88113d6931A42027O8682J74157L6652j19855q4662P7218N11337
$$ 163881 351994 -46931 142027 210709 384866 421518 301663 217001 294219 805556
13555H05556B72145N6498J25633p2980A87559L58333k59554C9956N77878k67577
$$ 805556 272145 328643 454276 381296 187559 545892 286338 39956 617834 350257
13545C50257p9097J64803A88469J22491j24599N59578j08474A11845N06207A57988
$$ 350257 271160 435963 188469 310960 186361 745939 637465 111845 618052 157988
13534A30974L82215A16139J94183p6128J67366A77057G7655h1597C16172G2276
$$ 130974 513189 116139 310322 234194 401560 177057 77655 -81597 316172 72276
13523A22527K90457q6705K0622O5015I2918k7228J69095K66946k15907B0964L20122
$$ 122527 412984 326279 346901 411916 92918 65690 234785 501731 285824 20964 341086
13512C41086m2765B9922L96871K50045l05499j75030L33798A90198n3011Q453
$$ 341086 298321 29922 426793 676838 371339 196309 530107 190198 137187 145640
13502A45640K79926J28410j35769h9465B94766N2051J34042A55944K02345j7990
$$ 145640 425566 553976 418207 -89465 294766 346817 480859 155944 358289 340299
13492C40299j00503n1141L9152K92782A29699M41331B08979J69677M1387A09354
$$ 340299 239796 188655 227807 520589 129699 571030 208979 378656 420043 109354
13481D19647L2534J5235q2782j17696A20729J55163j16804p0322L57652k18386
$$ 419647 452181 467416 384634 266938 120729 275892 159088 88766 446418 228032
13471B28032m9642m4536J22915N5859e0985B06989o4594K19881a57055B98358
$$ 228032 178390 133854 256769 312628 -50985 206989 142395 362276 -157055 298358
13460B81601E3807J00553L3589K32867A51683K75780A35963J14765J52110H7765
$$ 281601 53807 154360 187949 420816 151683 427463 135963 250728 402838 87765
13449B13292J82468h581B21181p0288K28230a47997B61209F6393k0724J57605
$$ 213292 395760 -8581 221181 150893 379123 -147997 261209 66393 45669 203274
13439B03274e5055B25292F558L16138J96881d7496A25914N72134A87354J43443
$$ 203274 -55055 225292 6558 322696 519577 -47496 125914 698048 187354 330797
13429C30797j55165F3151B5356M98010G9307O8609f484A99517K15782J92224k06690
$$ 330797 175632 63151 25356 523366 79307 147916 -6484 199517 415299 607523 400833
13418D00833e2185D98438B16567J24634j00083B6416P4449K15968J8391B4731
$$ 400833 -52185 498438 216567 341201 241118 26416 100865 316833 335224 24731
13407A33528b0467A43269l9251a9493C53154R4337m173j20084A6606b16084D16823
$$ 133528 -20467 143269 104018 -19493 353154 447491 443318 323234 16606 -216084 416823
13395A62937c74162A66348E3046k5746K76988A39013a234B40139m7858l2103K72390
$$ 162937 -374162 166348 53046 27300 304288 139013 -1234 240139 192281 160178 432568
13384D32568j91011L9088F7816J67213n3435D2653L21679q0257l0618G3732M8714
$$ 432568 241557 280645 67816 235029 181594 42653 364332 284075 253457 73732 122446
13373A22446J52853J55696N1444B32233j02997Q4859J81104j08302A35295J98505
$$ 122446 275299 430995 482439 232233 129236 214095 395199 286897 135295 333800
13363C33800a4849B26794L40872B66656J26614A62449G2507O6352J64854A26608
$$ 333800 -14849 226794 567666 266656 393270 162449 72507 138859 303713 126608
13352C83906m9105A57371O6027E981K92306Q0700A70473K81184A68453K16244
$$ 383906 334801 157371 223398 5981 298287 378987 170473 451657 168453 384697
13342C84697A16895M87596E8052J96011j03121K2509K15792j21107K55974B50167
$$ 384697 116895 604491 58052 254063 150942 173451 389243 268136 524110 250167
13331F8064K56950A48985o9453l562B3157J51899q4468K10370j27187P451J44905
$$ 68064 325014 148985 79532 75970 23157 175056 90588 300958 173771 181222 326127
13320C26127I9347K11561D3272N99890k22288a33536C26052a8355F27032C03081
$$ 326127 99347 310908 43272 643162 420874 -133536 326052 -18355 627032 303081
13309C87730l3014J5710f554E31477A29743J68230k319H4472Q9571N4762k1002
$$ 387730 354716 370426 -6554 531477 129743 297973 295654 84472 174043 228805 207803
13298B07803N6760o9419r7265b33973A49794K71811o2993a90628h4590E13524
$$ 207803 264563 195144 97879 -233973 149794 421605 358612 -190628 -84590 513524
13287A78124M74611e7281C38677I4549c39432i1103H2401d8942G0530J07203K26982
$$ 178124 652735 -57281 338677 94549 -339432 -91103 82401 -48942 70530 177733 404715
13276D04715C5961J36528A1737J73373K6434c67976C52583j66916o0475J87794
$$ 404715 35961 172489 11737 185110 211544 -367976 352583 185667 125192 312986
13266C12986p5437r4935J14699d508B02556h1067A77735p3603b6142k254C02365
$$ 312986 237549 142614 257313 -4508 202556 -81067 177735 104132 -26142 -28396 302365
13254B39405J26693j10252a52040B87124b9611B66007J73714A85186a15034C92330
$$ 239405 366098 255846 -152040 287124 -29611 266007 439721 185186 -115034 392330
13243A22084J5628Q4837A02273C5458i7731A83803n9486J28445A23912m0438b17987
$$ 122084 137712 222549 102273 35458 -97731 183803 124317 252762 123912 83474 -217987
13231A29819e8751j23695G09i5513A09065P4893D0608M51189B02103q259M0081
$$ 129819 -58751 -182446 709 -95513 109065 183958 40608 491797 202103 193844 233925
13220B33925A2945L52233I0540K32862c3240B94786j39495k6917E9166J96508
$$ 233925 12945 365178 90540 323402 -33240 294786 155291 128374 59166 255674
13210B55674a24128A18382O357L5612D5084h3471a1319C78193j64906o1567C4803
$$ 255674 -124128 118382 124739 160351 45084 -83471 -11319 378193 213287 151720 34803
13198i3538B85897A38247J15081I5501m1580a95462C2678K26342e4562J5635A50470
$$ -93538 285897 138247 253328 95501 53921 -195462 32678 259020 -54562 -38927 150470
13186D04047j71859p9600E3987M4240J55858h1378A03801K64084g1208A76518
$$ 404047 232188 152588 53987 98227 254085 -81378 103801 367885 -71208 176518
13175B64709m9204G8269J89826A1119h7029H9968J04071b28146C00383H8584i5838
$$ 264709 215505 78269 268095 11119 -87029 89968 194039 -228146 300383 88584 -95838
13163d7971j85231I1613M726J1730K14424A40626K3773F51b594C1916L7794J87321
$$ -47971 -233202 91613 96339 108069 322493 140626 164399 651 -2594 31916 69710 257031
13151B57031p5376K3243J1039G6320a76284D75066E931L13703e9447O474A57503
$$ 257031 181655 204898 215937 76320 -176284 475066 5931 319634 -59447 -52973 157503
13139A23787M5235G3133a13121E833c8243j32032A77082K81921c8994j10490b6121
$$ 123787 169022 73133 -113121 5833 -38243 -170275 177082 459003 -38994 -149484 -26121
13127f6310A57630J102c9349C18675j50209c0341A74859J77523h228I5790l9141
$$ -66310 157630 158732 -39349 318675 168466 -30341 174859 352382 -8228 95790 56649
13116E6649N3925n1570b37195c9496P694A7544L35536A35806F2964K647b37781
$$ 56649 110574 59004 -237195 -39496 -31802 17544 353080 135806 62964 65611 -237781
13104A21311j8999I863J80890M6553c495e09A7694L5195M9251C1630H905M0349
$$ 121311 102312 9863 190753 237306 -3495 -509 17694 52889 102140 31630 8905 49254
13092D9254J69770e0026o7636B90187c2293H0189L3152d4869A32583J17365A8355
$$ 49254 219024 -50026 -117662 290187 -32293 80189 113341 -44869 132583 249948 18355
13080A15849M9266P4367P6780G6054d0149C95025D4646P0200c06612a13143C14058
$$ 115849 165115 239482 316262 76054 -40149 395025 44646 114846 -306612 -113143 314058
13068a75667A69628Q3691n5260a22426d8054A37805a66940A17854J05820M4627
$$ -175667 169628 253319 198059 -122426 -48054 137805 -166940 117854 223674 268301
13058B68301i721D9692J4K04299A26032l0581b62232A36499C2913d7694k45993
$$ 268301 -9721 49692 49706 254005 126032 95451 -262232 136499 32913 -47694 -293687
13047b93687a36233M1441p7309E43571a15964B07525E2754d1764r9908A64741
$$ -293687 -136233 -94792 -172101 543571 -115964 207525 52754 -41764 -141672 164741
13036C03918D3417b78625C81L20577a98235C9907h873A66899k3570M96M18050
$$ 303918 43417 -278625 381 320958 -198235 39907 -8873 166899 143329 143825 561875
13025E61875c63273D7531J36092J97104N9319e534B51532Q3864j34599g963B79662
$$ 561875 -363273 47531 183623 380727 440046 -5534 251532 335396 200797 -7963 279662
13013B81275k0625j1357A14517O7946h8161j97277B05583c49771A91680J47303
$$ 281275 260650 249293 114517 182463 -88161 -285438 205583 -349771 191680 338983
13003C38983b36677A47806l4781f2919r5485A73966m6903J49652G3416B1518J92062
$$ 338983 -236677 147806 113025 -62919 -158404 173966 127063 276715 73416 21518 213580
12992B13580a02516B72104a21305C56318j02768H4437c8548A59673J10202A29748
$$ 213580 -102516 272104 -121305 356318 253550 84437 -38548 159673 269875 129748
12981a62C72900b50774A30974b2788k67411A95601J41892c42883K4208a39721
$$ -162 372900 -250774 130974 -22788 -290199 195601 337493 -342883 -318675 -139721
12970a9363A74398e2161A54303f1911C38130C9366K46287B5768J00256i9920K7849
$$ -19363 174398 -52161 154303 -61911 338130 39366 285653 25768 126024 -99920 -72071
12959g2071A38818h9136k4744C9696K00034h312j58582A6209f6135O101B6495
$$ -72071 138818 -89136 -113880 39696 239730 -8312 -166894 16209 -66135 -60034 26495
12947I0282a97271K0259A0898N9481J70603j18082K8442b80948J15753A31934
$$ 90282 -197271 -177012 10898 70379 240982 122900 151342 -280948 -165195 131934
12936A89064a82019f6069d927D75252G7151b7988B64324k0817j147f2095A33458
$$ 189064 -182019 -66069 -4927 475252 77151 -27988 264324 243507 242360 -62095 133458
12924g1231D42030e4407j52819N2543f3982b4722B6094J68569A6765a77040C8819
$$ -71231 442030 -54407 -207226 -154683 -63982 -24722 26094 194663 16765 -177040 38819
12912F5840d6376A66215b27882k7639A77500a29148A40415C2300J8399N1997P0599
$$ 65840 -46376 166215 -227882 -255521 177500 -129148 140415 32300 50699 102696 173295
12901A73295P6513A9230c8581A40998a29957A35488j4804J00059p2605c90613
$$ 173295 249808 19230 -38581 140998 -129957 135488 120684 220743 148138 -390613
12890a91703A16147A7558q45J30067h9005A33732a65791A516j4J94635D1638A0612
$$ -191703 116147 17558 16713 146780 -89005 133732 -165791 1516 1502 196137 41638 10612
12877a63634A92765b14028E6461K69142a87384B49370H2091b74673A1749b63834
$$ -163634 192765 -214028 56461 325603 -187384 249370 82091 -274673 11749 -263834
12866a17583c6667A04881K24549b3905l03425B35822A7185K5280f3814d506p6553
$$ -117583 -36667 104881 329430 -23905 -327330 235822 17185 42465 -63814 -4506 -81059
12855h1059B08551p5718L11879d5695A33899B6453a6204B21531g9949B07428K28
$$ -81059 208551 132833 444712 -45695 133899 26453 -16204 221531 -79949 207428 207656
12844B07656b8360D40674a07507A50027b5363j83052d2410C07467D9224J87838
$$ 207656 -28360 440674 -107507 150027 -25363 -208415 -42410 307467 49224 237062
12834B37062N5022a3257l93808a89245l4337B33541K59991A19857a95319b8109
$$ 237062 292084 -13257 -407065 -189245 -223582 233541 493532 119857 -195319 -28109
12823c6947B37010g1846j55584N5667N8755E1789J62275a29541K6518K6540j0846
$$ -36947 237010 -71846 -227430 -171763 -113008 51789 214064 -129541 -103023 -76483 -87329
12812h7329D12713f5715B6349d8726B73698A13936a43460H0660L15654A28575
$$ -87329 412713 -65715 26349 -48726 273698 113936 -143460 80660 396314 128575
12801a82857H350c43090E3491a46941d3176B57267o7288E1843b88795d2708a9805
$$ -182857 8350 -343090 53491 -146941 -43176 257267 189979 51843 -288795 -42708 -19805
12789I6500l6214L04874H740a09910C73594d9339F7643B0157M7456c06692l5453
$$ 96500 60286 365160 8740 -109910 373594 -49339 67643 20157 67613 -306692 -342145
12778c42145E6226c857j43712K9654A70847K1433a75046f5336k6362o9468A20613
$$ -342145 56226 -3857 -147569 -117915 170847 192280 -175046 -65336 -91698 -161166 120613
12766A75673K2302a56607g3355k8621a7889e590I7638b40722c861k8325j15762
$$ 175673 197975 -156607 -73355 -101976 -17889 -5590 97638 -240722 -3861 -32186 -147948
12755a47948c5511j34227A39739g1167H4670j3568J5332e0204m9701A10440i6201
$$ -147948 -35511 -169738 139739 -71167 84670 71102 86434 -50204 -99905 110440 -96201
12743c4055l8780D16498a03255B62852B9756K05766a99964E93943A10427J48869
$$ -34055 -72835 416498 -103255 262852 29756 235522 -199964 593943 110427 259296
12733B59296r4318m4827M5208a93872L9357B72347E9867g4461k47586d7905A58650
$$ 259296 164978 120151 165359 -193872 -154515 272347 59867 -74461 -322047 -47905 158650
12721F4556R6735J44194j08814c38428C44161j35869a0530E8160J21713b07954
$$ 64556 161291 305485 196671 -338428 344161 208292 -10530 58160 179873 -207954
12710C76303j36562B8550a3947A66207A2890p44J21558M4888J53245A63197j2102
$$ 376303 239741 28550 -13947 166207 12890 12146 133704 178592 331837 163197 151095
12699A51095Q5572b110F0115K49092a24187j24903K8098G8136C7047Q9715a1024
$$ 151095 236667 -2110 60115 309207 -124187 -249090 -220992 78136 37047 126762 -11024
12687A84094b66239A93740a6202H9367a94266B636J35886c5849A93061r3620f5612
$$ 184094 -266239 193740 -16202 89367 -194266 2636 138522 -35849 193061 99441 -65612
12675B45500D0898L3380c3817A56236F1260J05541e1974G0407i2183E3992M5652
$$ 245500 40898 74278 -33817 156236 61260 166801 -51974 70407 -92183 53992 99644
12664I9644E191h3101E776a98383B64507P9926q9760P0948A47939C9248L18616
$$ 99644 5191 -83101 5776 -198383 264507 344433 254673 325621 147939 39248 357864
12653C57864J8829a60365B05142q6812K24345E5680J76071P7930A17631c14126
$$ 357864 376693 -160365 205142 118330 342675 55680 231751 309681 117631 -314126
12642c21131i1674A03324D8312b6556j17254B60094G3720Q9439r007L2770J4640
$$ -321131 -91674 103324 48312 -26556 -143810 260094 73720 163159 154152 186922 201562
12631B01562L9685h2517F6967O0118O0459F7177M39171b5772B93902j06763h8148
$$ 201562 241247 -82517 66967 127085 187544 67177 506348 -25772 293902 187139 -88148
12619H5315c329A079J34354K8719k9526M1029K050f1508J7256H6459j979P0677
$$ 85315 -3329 1079 135433 164152 134626 175655 177705 -61508 -44252 86459 84480 155157
12607A55157D4516n197K76041Q1911A932N56886A48466K2251J1876D7732J1732
$$ 155157 44516 39319 315360 397271 1932 558818 148466 170717 182593 47732 59464
12596E9464L1038R7463K33377j99517o0991a71024g5228G4361i375k3236A7768
$$ 59464 90502 187965 421342 221825 160834 -171024 -75228 74361 -9375 -32611 17768
12584a27523j7680A09247b83106B22755G1558P8960O7524b0619n8672A07599k9275
$$ -127523 -145203 109247 -283106 222755 71558 150518 218042 -20619 -79291 107599 78324
12573G8324a90010I1320e8143G6517L83608a11398l3881N3053A78296H9108b4521
$$ 78324 -190010 91320 -58143 76517 460125 -111398 -145279 -92226 178296 89108 -24521
12561a0531A12501c3673H3081c09126a6113l17761c6427k1553m8588A25713N8190
$$ -10531 112501 -33673 83081 -309126 -16113 -333874 -36427 -57980 -106568 125713 183903
12550A83903E6164g8449A26058Q0780k5463a62389J0319c6699j28778f5796A26518
$$ 183903 56164 -78449 126058 206838 181375 -162389 -152070 -36699 -165477 -65796 126518
12538F8958a07399G9155f5997m3658F2023A2737f5211b886k06344B9331J05039
$$ 68958 -107399 79155 -65997 -109655 62023 12737 -65211 -2886 -209230 29331 134370
12527A34370e468A49555a31193c3215F4065c5099A70577L75379a50810A68721
$$ 134370 -5468 149555 -131193 -33215 64065 -35099 170577 545956 -150810 168721
12516a10638j40737A34056c67670A44327a13857B5006J8500N1460a28910J4184
$$ -110638 -251375 134056 -367670 144327 -113857 25006 43506 94966 -128910 -114726
12506a14726m887q9835C36429a58687e7062j94028f9121A38012G35f1967p8226
$$ -114726 -119613 -209448 336429 -158687 -57062 -251090 -69121 138012 735 -61967 -140193
12495a40193B98168m8353n7516r0878l1866B3861b05411A66768a87882A65907
$$ -140193 298168 249815 192299 101421 69555 23861 -205411 166768 -187882 165907
12484b381j95453H7160A2012b60110E1745O9723a40842E9691g2458o1588m4504
$$ -2381 -197834 87160 12012 -260110 51745 121468 -140842 59691 -72458 -134046 -178550
12473a78550J1280A6854a19076k03976B50465h590r7694b4729j43695P5100l34789
$$ -178550 -167270 16854 -119076 -323052 250465 -8590 -106284 -24729 -168424 -93324 -428113
12462d28113B073K6230J9095O8152d492B90661a00339n0068D9551c48042h461
$$ -428113 2073 28303 47398 115550 -4492 290661 -100339 -150407 49551 -348042 -8461
12450D10669A02401b0173A0292d54183B28406a36920M9128A39297j6295g5757
$$ 410669 102401 -20173 10292 -454183 228406 -136920 -87792 139297 123002 -75757
12439F5023b20462C50483g4188C10743I9570L8649L999b934j84239F2769c5045
$$ 65023 -220462 350483 -74188 310743 99570 138219 142218 -2934 -187173 62769 -35045
12427a53028j32501b8742q5737A74622b60473A3912c08480a4202j20130B927O3125
$$ -153028 -285529 -28742 -114479 174622 -260473 13912 -308480 -14202 -134332 2927 66052
12416F6052h2470A677b39795J10498q8594i6226b8576C4740K04522r0521a42481
$$ 66052 -82470 1677 -239795 -129297 -217891 -96226 -28576 34740 239262 148741 -142481
12404b0399k02181h8291j49975E9068f4461A19416J98977e9267j98451E0978a15212
$$ -20399 -222580 -88291 -238266 59068 -64461 119416 318393 -59267 -257718 50978 -115212
12392I7090J23067f7621c0202B91613I9717c82044A75102i714j50106F5883c05636
$$ 97090 220157 -67621 -30202 291613 99717 -382044 175102 -9714 -159820 65883 -305636
12380E6013K89430c3429a2744j96152j89564D9212L51431b91056E4904g9639j78749
$$ 56013 345443 -33429 -12744 -208896 -398460 49212 400643 -291056 54904 -79639 -258388
12369b58388f3241C9201J26073J06748A32932c7676C19051H4527k2704L5156R4617
$$ -258388 -63241 39201 165274 272022 132932 -37676 319051 84527 61823 96979 191596
12358A91596g5134C11908i2571G5237J20575f1100D6845J94601a74708A9840L0158
$$ 191596 -75134 311908 -92571 75237 195812 -61100 46845 241446 -174708 19840 49998
12347D9998Q5505Q2205a79625B9723b12557d5971j19043j12872A68635d50162
$$ 49998 135503 217708 -179625 29723 -212557 -45971 -165014 -277886 168635 -450162
12336H8052c04872B51519f6149b4515q9977B63289a58612j04169c3507k7514j28551
$$ 88052 -304872 251519 -66149 -24515 -114492 263289 -158612 -262781 -33507 -61021 -189572
12325a89572O2205I0994J06068m868a03213G2629a08592A77516E7814K94255F5815
$$ -189572 -127367 90994 197062 192194 -103213 72629 -108592 177516 57814 352069 65815
12313B575e4137j64843b653G4325L4411J76508A27548g9332A31276f5834K3064
$$ 2575 -54137 -218980 -2653 74325 108736 285244 127548 -79332 131276 -65834 -42770
12302d2770D3538f4428k11656J07383M9602r6637p3902f8752A34491a32549m5049
$$ -42770 43538 -64428 -276084 -168701 -119099 -215736 -289638 -68752 134491 -132549 -177598
12291a77598A96829k4641f1650P960b3366k2531C4172K6590b13062A59352F0982
$$ -177598 196829 172188 -61650 -53690 -23366 -45897 34172 60762 -213062 159352 60982
12279F7326J69705m3953J10566A4297K85907C4870K30085j9392B413K94817A4741
$$ 67326 237031 193078 303644 14297 300204 34870 264955 245563 2413 297230 14741
12267B8965A4171K2866P173J27565b96726D6691c06268h7505A79976l923J6467
$$ 28965 14171 37037 44210 171775 -296726 46691 -306268 -87505 179976 176053 192520
12256A92520g7980E2571M00917c64008H7679K62645b58149e0279B64119b51213
$$ 192520 -77980 52571 453488 -364008 87679 350324 -258149 -50279 264119 -251213
12245B3223a39647A24975K66125A40304a59763E0770k807J63945h0944l2378E2366
$$ 23223 -139647 124975 391100 140304 -159763 50770 47963 211908 -80944 -113322 52366
12233e2329E7655B2450J53267D0390a98603C38071I0035l5214K10336N6064o3673
$$ -52329 57655 22450 175717 40390 -198603 338071 90035 54821 265157 321221 257548
12222B57548q0363R7268B5872c869n3763G381J58315O5623A6114a88425B41365
$$ 257548 177185 274453 25872 -3869 -57632 7381 165696 231319 16114 -188425 241365
12210C60273h4854C44412h5535A40636a4165B64231k6938j6620a47514D11352
$$ 360273 -84854 344412 -85535 140636 -14165 264231 237293 220673 -147514 411352
12199g7255B80500L6494E2972a60802A37205f1607A03159a10409r6694B00814
$$ -77255 280500 316994 52972 -160802 137205 -61607 103159 -110409 -207103 200814
12188f2190K7866j26235D64748j53291A01216J13634L3520a40281B07082J46711
$$ -62190 -34324 -160559 464748 311457 101216 214850 248370 -140281 207082 353793
12178C53793b4644E2085K30663o7426q9323K12417p7229f7234m1207d6877B61898
$$ 353793 -24644 52085 282748 215322 125999 338416 261187 -67234 -108441 -46877 261898
12166A13925g8919C1904M78299j86755m0953j06940E9010a40879A71778L523a4414
$$ 113925 -78919 31904 510203 323448 282495 175555 59010 -140879 171778 175301 -14414
12154a03692C7426L36069A58001c0058A2336P5292a2114F1530b29352j03892a39232
$$ -103692 37426 373495 158001 -30058 12336 87628 -12114 61530 -229352 -333244 -139232
12142h04B76344l3345b10944R7270G3961e0602A77888b28350g9657G3697a68126
$$ -804 276344 242999 -210944 -113674 73961 -50602 177888 -228350 -79657 73697 -168126
12130a25367C77828F4939B069b19862q4557e4438A37315N8664K93740B19549m163
$$ -125367 377828 64939 2069 -219862 -304419 -54438 137315 195979 489719 219549 215386
12119B15386G3685N3322f5021A13185J94711b765j16376a026G4103b44196N1239
$$ 215386 73685 127007 -65021 113185 307896 -2765 -119141 -1026 74103 -244196 -192957
12108a92957B7820a29754j59763a19266E737J27642E6101J43407F2195E4L9322
$$ -192957 27820 -129754 -289517 -119266 5737 133379 56101 199508 62195 54 39376
12097C9376a8043A2826R219e3807B57457c55369h0045J8737k678C1739J07056
$$ 39376 -18043 12826 22045 -53807 257457 -355369 -80045 -61308 -63986 31739 138795
12086A38795K03481c9892j50577k6582j1210C14205h9792G7816K4591K04087f8440
$$ 138795 342276 -39892 -190469 -217051 -228261 314205 -89792 77816 102407 306494 -68440
12074f775k71923E2533J39585o4041e03828A43037k4001c07791B54187D2121P9861
$$ -6775 -278698 52533 192118 128077 -503828 143037 119036 -307791 254187 42121 121982
12063A21982o304B4982J22834K81638N87646M84249B46003K28187a97535D79344
$$ 121982 115678 24982 147816 429454 1017100 1501349 246003 474190 -197535 479344
12052H8609M7387A8125d924F6412c43643B68807a12139E1948L0310a38767B10577
$$ 88609 135996 18125 -4924 66412 -343643 268807 -112139 51948 82258 -138767 210577
12040b12270A52333a26111M9724J0585k3476j69476A7562b79249a05735b7975
$$ -212270 152333 -126111 -76387 -65802 -89278 -258754 17562 -279249 -105735 -27975
12029i8075r5782j11707A45309j8020J95016o0080b58363D5103Q121K80936q3619
$$ -98075 -193857 -305564 145309 127289 322305 262225 -258363 45103 53224 334160 250541
12018B50541B6852e286A68814e1665k361j95653A96253a02837C40357A3991h3607
$$ 250541 26852 -5286 168814 -51665 -54026 -249679 196253 -102837 340357 13991 -83607
12006e9907H3883d83057A58963a62061A0844c00729B45634b2280j22448l9823
$$ -59907 83883 -483057 158963 -162061 10844 -300729 245634 -22280 -144728 -184551
11996a84551C09671b25050b736B77018A964a83893B2792K3054j9257J91027H9934
$$ -184551 309671 -225050 -2736 277018 1964 -183893 22792 45846 26589 217616 89934
11984c9953D6970c68820a80253d0553l7910E2923O3392K82042a17145d9021F0013
$$ -39953 46970 -368820 -180253 -40553 -78463 52923 116315 398357 -117145 -49021 60013
11972a73859A4270K23982G6974a57543A08756e140k43505b0495B44385c88231
$$ -173859 14270 238252 76974 -157543 108756 -5140 -248645 -20495 244385 -388231
11961a34959f3961j4802j4549B46301n174i2685M30n0556d2737j36916g1894j01749
$$ -134959 -63961 -78763 -93312 246301 241127 -92685 -92255 -142811 -42737 -179653 -71894 -173643
11949a73643K3024B2664a1417m7210E9772a13184C41463b31819B04251N3793i604
$$ -173643 -150619 22664 -11417 -58627 59772 -113184 341463 -231819 204251 258044 -9604
11937G1873i7581F05M2062b72639B783a69152j74647C3853d2806q4852d339j97428
$$ 71873 -97581 605 42667 -272639 2783 -169152 -343799 33853 -42806 -127658 -4339 -201767
11925b01767F1088Q5216D3093J41012a19115A59952J76031d82054C3215h2750
$$ -201767 61088 146304 43093 184105 -119115 159952 335983 -482054 33215 -82750
11914A5610a06203A09815a40734E5633b07370D0335K43391j22683e10j12191k1611
$$ 15610 -106203 109815 -140734 55633 -207370 40335 283726 161043 -510 -112701 -134312
11903a34312b0376I4770a29592C63889l6574c30973c3964n052k59132J10746B3849
$$ -134312 -20376 94770 -129592 363889 327315 -330973 -33964 -39016 -298148 -187402 23849
11891G1653d4816n5644p0173B5407G808g5962j89871e1382B17875d7672k7555
$$ 71653 -44816 -100460 -170633 25407 7808 -75962 -265833 -51382 217875 -47672 -75227
11880g5227l6040A22541J46204c53299A304L35345b00262l5517F1462b54714P269
$$ -75227 -111267 122541 268745 -353299 1304 336649 -200262 -235779 61462 -254714 -247445
11869b47445B48198m0643j2180G6085e8176H3253h2619K8115K6556B88519e5419
$$ -247445 248198 207555 195375 76085 -58176 83253 -82619 -54504 -27948 288519 -55419
11857I6075a74443B63787j22616g28q8025L7470j54116g6169q8579A65740k8074
$$ 96075 -174443 263787 141171 -728 -88753 -51283 -205399 -76169 -164748 165740 137666
11846A37666b54200j139a21093A46204b79681D8072a26797k01111C94453D5630
$$ 137666 -254200 -255339 -121093 146204 -279681 48072 -126797 -327908 394453 45630
11835b78786j97880H0179d200j79636B2674a49524a1278j4811D3851A5377d3536
$$ -278786 -476666 80179 -4200 -183836 22674 -149524 -11278 -26089 43851 15377 -43536
11823a39568B13996b51792B4576K70214c7247A43331a08315k30491k2264E1391
$$ -139568 213996 -251792 24576 294790 -37247 143331 -108315 -338806 -361070 51391
11812B24678a79978h309k86786B67711n0191A03615f6914j03190H4784h9841C4154
$$ 224678 -179978 -8309 -295095 267711 217520 103615 -66914 -170104 84784 -89841 34154
11800A49586b04936I5871C2337a52638B04362I7436D0044a97717n6905I2852b74582
$$ 149586 -204936 95871 32337 -152638 204362 97436 40044 -197717 -254622 92852 -274582
11788b62292g6266M267l50961A87338b2361j54280A49636d63721b9155l85299
$$ -262292 -76266 -71999 -422960 187338 -22361 -176641 149636 -463721 -29155 -414454
11778d14454E992K9460K18964a917j04332a2739B5874a3466C83591A0908i7081
$$ -414454 5992 35452 254416 -1917 -106249 -12739 25874 -13466 383591 10908 -97081
11766A484J76830a56013M8414K540D5107O725R6793a09463j99306a32377L0215
$$ 1484 178314 -156013 -107599 -105059 45107 51832 148625 -109463 -308769 -132377 -102162
11755a02162l89187J75511a43694e2556k0326b0895m3401k4564a9216r3733F7527
$$ -102162 -491349 -315838 -143694 -52556 -72882 -20895 -64296 -88860 -19216 -112949 67527
11743a53227B77177a28807A75391K5791E0407a42167A32694e3408J969B35853
$$ -153227 277177 -128807 175391 201182 50407 -142167 132694 -53408 -51439 235853
11732H7266a03885A30044P3682b58673A27742R2310C4979M82180A41745J55957
$$ 87266 -103885 130044 203726 -258673 127742 220052 34979 517159 141745 297702
11722B97702b51999B19624a17651A70888L3185j00209c131B66209K7540i2263
$$ 297702 -251999 219624 -117651 170888 204073 103864 -3131 266209 293749 -92263
11711B2329f3813A22622o836b6070A3853a61613B09478O6097i8847A71948J5381
$$ 22329 -63813 122622 115786 -26070 13853 -161613 209478 275575 -98847 171948 187329
11700A87329H4854A9819J53714I221M77990B318J56465i7282A75993d5806A67548
$$ 187329 84854 19819 173533 9221 487211 2318 158783 -97282 175993 -45806 167548
11688B51011a72004g1159C48295e1886A40521d1254D3569A6530J18949A3474a67975
$$ 251011 -172004 -71159 348295 -51886 140521 -41254 43569 16530 135479 13474 -167975
11676c7049o0719E4193f8511j98357G9722g8835A63489c96542F529J59685J77391
$$ -37049 -97768 54193 -68511 -266868 79722 -78835 163489 -396542 6529 166214 343605
11665C43605a18007F820c314H9115o84h6990A17793a81542C69390A0528a65236
$$ 343605 -118007 6820 -3314 89115 88431 -86990 117793 -181542 369390 10528 -165236
11653c9386A08316d0815F4535b3285E4555b26095g5682c4539F7998b22089B28346
$$ -39386 108316 -40815 64535 -23285 54555 -226095 -75682 -34539 67998 -222089 228346
11641c49949h79I5089J5271c31389K2286g6864k91558J32808A21297i4394L3312
$$ -349949 -879 95089 110360 -331389 -309103 -76864 -368422 -235614 121297 -94394 -61082
11630f1082A87412o4008C1126K46845P9757f9038D1794K19147H1592e0987P157
$$ -61082 187412 123404 31126 277971 357728 -69038 41794 260941 81592 -50987 -43830
11619d3830A87632L8707A07167N8689C3233a10512o9842D0677a0905A21997d6506
$$ -43830 187632 226339 107167 165856 33233 -110512 -180354 40677 -10905 121997 -46506
11607B837k23a6048l63900A50993l5149L8398j4770J12453N7642a60200A6658
$$ 2837 2614 -16048 -379948 150993 115844 154242 139472 251925 309567 -160200 16658
11595c0422B33505c80701D83168j24992j76594a28440A80449p5372J44683H1170
$$ -30422 233505 -380701 483168 358176 181582 -128440 180449 105077 249760 81170
11584a933C40612O605c11984d2007A51775n3427J34329a58737A52435J49624a50106
$$ -1933 340612 347217 -311984 -42007 151775 98348 232677 -158737 152435 302059 -150106
11572A86946k4251d6330A0619J34866P7095q2225J3527k3338r274h7227B22273
$$ 186946 162695 -46330 10619 145485 222580 140355 153882 130544 121270 -87227 222273
11560E21346k16852j04925a5763j81930r7949J35396A56766N9660E5753L0376
$$ 521346 304494 199569 -15763 -197693 -295642 -160246 156766 216426 55753 86129
11550H6129Q8573a27064A55618a14921j26899A33531a23451B20500k5122n2383
$$ 86129 174702 -127064 155618 -114921 -241820 133531 -123451 220500 195378 142995
11540A42995J62565e4661K5374k65847C39384g6162C19760a16570B17288a83977
$$ 142995 305560 -54661 -29287 -295134 339384 -76162 319760 -116570 217288 -183977
11529i6674F0779b98751a8603q6681A29162n6487j372a2079A32615C6880k058
$$ -96674 60779 -298751 -18603 -105284 129162 72675 71303 -12079 132615 36880 34822
11518C4822J44053A1486d8785I4814f7856B08486P4949J08805K9584A31658P2374
$$ 34822 178875 11486 -48785 94814 -67856 208486 283435 392240 421824 131658 204032
11507B04032J70006j54437J42164A00504c2445j17277m0754A74317K27122A58989
$$ 204032 374038 219601 361765 100504 -32445 -149722 -190476 174317 401439 158989
11496I9401m511J90673b0472B16346A4091L19962A40818i459A5798b07022A27819
$$ 99401 94890 285563 -20472 216346 14091 334053 140818 -9459 15798 -207022 127819
11484A34840K97111j45147A00335O2421J60581J10900A87040a74466B03008O6086
$$ 134840 431951 286804 100335 162756 323337 434237 187040 -174466 203008 269094
11474B69094M499k7800a34281C92878a02668A85295q6046a54736C38352k2066
$$ 269094 273593 245793 -134281 392878 -102668 185295 99249 -154736 338352 316286
11464C16286A18303m3195a41743f005H471K36860N1117E4907M23187E1919P4266
$$ 316286 118303 75108 -141743 -6005 8471 245331 296448 54907 478094 51919 126185
11453A26185R1134M5138a77602A73334E1988J79627G8018O7002J41935k3602b24507
$$ 126185 217319 262457 -177602 173334 51988 231615 78018 145020 286955 263353 -224507
11441e4499j26642D82508c7976D00699A01314i6520B33727b08246A56874Q412
$$ -54499 -181141 482508 -37976 400699 101314 -96520 233727 -208246 156874 165286
11431A65286E7862c7906C8491g2177n3396E0687K5598j9717b72242F5543C2514
$$ 165286 57862 -37906 38491 -72177 -125573 50687 76285 56568 -272242 65543 32514
11419b04889B1157d7844k437B32702l2407N2811A25580K70921A79653l7084C6924
$$ -204889 21157 -47844 -50281 232702 200295 253106 125580 396501 179653 142569 36924
11407B28498E823a10726j07091B7852J19257E1630i3872B93363A08176f7382N871
$$ 228498 5823 -110726 -217817 27852 147109 51630 -93872 293363 108176 -67382 -61511
11396f1511p2673A0763R9545C959J66994c36904J37285j51417a06920j04694i3247
$$ -61511 -134184 10763 110308 3959 170953 -336904 -199619 -351036 -106920 -211614 -93247
11384a4969B24851b00110c2016o00027D40509b32484R0128j18053H623g7694b4919
$$ -14969 224851 -200110 -32016 -632043 440509 -232484 -142356 -260409 8623 -77694 -24919
11372a04013B9716b65623C09399E5841a08728d9571A23747b31654O6296a535k58417
$$ -104013 29716 -265623 309399 55841 -108728 -49571 123747 -231654 -165358 -1535 -259952
11361b59952J18191p5005K9373K5413H6642c21593A57273a94470B4214f2205C1072
$$ -259952 -141761 -216766 -187393 -161980 86642 -321593 157273 -194470 24214 -62205 31072
11349d04301A22559f3759p8345c5322m7571G4417j3677N6840a478B19177M3524
$$ -404301 122559 -63759 -142104 -35322 -82893 74417 60740 117580 -1478 219177 262701
11338B62701a42899f5140l00991B8852l630K16961a80206A67002b20232h4294
$$ 262701 -142899 -65140 -366131 28852 25222 242183 -180206 167002 -220232 -84294
11327H6370j2603A0279R8346A7723c1603o177m6151m4030B77066d151k84053d7140
$$ 86370 73767 10279 108625 17723 -31603 -37780 -83931 -127961 277066 -4151 -288204 -47140
11314e0680C83641n6060b77624J20585N0509p189C0681c16543E095f90A72352
$$ -50680 383641 327581 -277624 -157039 -106530 -113719 30681 -316543 5095 -690 172352
11302a28262A67892c10951J25017A47539b25993K0473B97531A28827a3341I3122
$$ -128262 167892 -310951 -185934 147539 -225993 -205520 297531 128827 -13341 93122
11291c28012J57418A75832a3265m51072A83174a33187A01717a14642A80563I690
$$ -328012 -170594 175832 -13265 -464337 183174 -133187 101717 -114642 180563 9690
11280b28302P4302G1149a13952A27829b39449A13493c09840A56082J46628b07766
$$ -228302 -154000 71149 -113952 127829 -239449 113493 -309840 156082 302710 -207766
11269A34201a65535n9303I6430L6985n0158l3260a41501A34459c42692A20353
$$ 134201 -165535 -224838 96430 133415 83257 49997 -141501 134459 -342692 120353
11258A9365J69383a68532N4904l6565m3977A1569D759a13316A04445k664a11219
$$ 19365 188748 -168532 -113628 -150193 -194170 11569 4759 -113316 104445 101781 -111219
11246a21363j38841J3242A13701a8315C4151c37085A50459k5923e8893k45797
$$ -121363 -260204 -246962 113701 -18315 34151 -337085 150459 124536 -58893 -304690
11236c04690n7742P3878A70451a99820H8244L08181f0398K7227B871J88044c25146
$$ -304690 -362432 -288554 170451 -199820 88244 396425 -60398 -33171 2871 190915 -325146
11224a48763p7017j0266A7880P2507a01665A84821d5668F0530a36728A37862c18654
$$ -148763 -225780 -236046 17880 90387 -101665 184821 -45668 60530 -136728 137862 -318654
11212I123K55579b31696r0459h2345A11888b61223Q467A43801h2023k51494B10172
$$ 9123 264702 -231696 -322155 -82345 111888 -261223 -252756 143801 -82023 -333517 210172
11200g0323p256a4267j9699B70844m4435a5278B3845L57254b32152e1366k1334
$$ -70323 -77579 -14267 -33966 270844 226409 -15278 23845 381099 -232152 -51366 -72700
11189g2700j17714O0895A29121C3742f5275G5683J87618J4489a21574h467k55957
$$ -72700 -190414 -129519 129121 33742 -65275 75683 263301 277790 -121574 -8467 -264424
11178b64424b2923B0462K33210C1837a35260A55409c11100M4338P5253D32617
$$ -264424 -22923 20462 253672 31837 -135260 155409 -311100 -266762 -191509 432617
11167d37977a04760K8360K4522l4883D8144F727N8262b42517f9165E3704A1910
$$ -437977 -104760 -76400 -51878 -86761 48144 6727 64989 -242517 -69165 53704 11910
11155B22561b13980G6972Q5859a81151d3902B34862j211a23715M5862C7606J9341
$$ 222561 -213980 76972 162831 -181151 -43902 234862 233651 -123715 -77853 37606 56947
11144E6947a01028A31329J94846A60821a47623d874m6752A33945b62050a3481
$$ 56947 -101028 131329 326175 160821 -147623 -4874 -51626 133945 -262050 -13481
11133B06017i8863B30046b73719A95148C2083L5080J27246R4116a37015A61501
$$ 206017 -98863 230046 -273719 195148 32083 67163 194409 288525 -137015 161501
11122B7719d0607o0924B50155l4647g6951E8837b00299C02345A31254a85217C20179
$$ 27719 -40607 -101531 250155 215508 -76951 58837 -200299 302345 131254 -185217 320179
11110a37152B90806b13839B05569J0491A8292b55546H7494P5938a49752B68059
$$ -137152 290806 -213839 205569 216060 18292 -255546 87494 163432 -149752 268059
11099i6726A7339L02225M3983A77794R6944G6373N5855R4539H8668j4389f0453
$$ -96726 17339 319564 363547 177794 274738 76373 132228 226767 88668 74279 -60453
11087E25919a2668A10674L00674C6959K30807J11407a13628C69281p6328A07445
$$ 525919 -12668 110674 411348 36959 267766 379173 -113628 369281 292953 107445
11076E85680c8111E4798J39501A4835K82596J40929j80897J18103o4607L9806
$$ 585680 -38111 54798 194299 14835 297431 438360 257463 375566 310959 350765
11066C50765k726J17696r4958A11387L32625J17119J94392k11540J67861J50150
$$ 350765 348039 465735 370777 111387 444012 561131 755523 543983 711844 861994
11056H61994r7040n6591j86352L3725J1490j0536K29589k27340K38979k45609
$$ 861994 764954 708363 522011 555736 567226 556690 786279 558939 797918 552309
11046E52309J28288J74558m8432k01698J60724J71766l30640N78092D19344M1092
$$ 552309 680597 855155 806723 605025 765749 937515 606875 1184967 419344 460436
11036D60436O9691K8191K07345J05275j55190O3532B20422M83833r1844K53073
$$ 460436 530127 558318 765663 870938 715748 779280 220422 704255 612411 865484
11026H65484l2255r0081J32498j23377J72599j00419l28057K15843l08465n0118
$$ 865484 833229 743148 875646 752269 924868 824449 496392 712235 403770 353652
11016C53652L94975j83511m5691J18527j42960j2692K81373n2570j526B90565
$$ 353652 748627 565116 519425 637952 494992 482300 763673 711103 709577 290565
11005E30238J32159j95451P603o7709R7490r783R4651j6159J75236l13482n018
$$ 530238 662397 466946 474549 406840 504330 494547 589198 573039 748275 434793 429775
10994D29775J99910J73008q2073n294K19893l87411K39912J21585k55987P25790
$$ 429775 629685 802693 720620 715326 935219 547808 787720 909305 653318 1379108
10984A379108o83538k7558L63657j15175N48947j68894o0566M46388L62587K50627
$$ 1379108 695570 668012 1031669 916494 1465441 1296547 1235981 1682369 2044956 2295583
10974B295583L8869M06641J62695n2371l31506N6183r2003k73991k10527l01709
$$ 2295583 2334452 2741093 2903788 2851417 2519911 2576094 2484091 2210100 1999573 1697864
10964A697864l21395j8810L83927J7935q6970L7902l95536J35099O9757m4116
$$ 1697864 1376469 1357659 1741586 1759521 1672551 1710453 1314917 1450016 1519773 1475657
10954A475657j18657m02190K74537L2668l33044l13159M5183B89423J41540m0740
$$ 1475657 1357000 954810 1229347 1262015 928971 615812 660995 289423 430963 390223
10944C90223A54581K39617G0166K71094a73947B3726M4369R6611p4319b82659
$$ 390223 154581 394198 70166 341260 -173947 23726 68095 164706 90387 -282659
10933c8263A27622n6922a37712A65029g3624q3423A00753m497m5991K769J6944
$$ -38263 127622 70700 -137712 165029 -73624 -157047 100753 96256 50265 53034 69978
10922F9978J30435n4732a76236C23514a14527n7720h4153J8744B2602b75602O8031
$$ 69978 200413 145681 -176236 323514 -114527 -172247 -84153 -65409 22602 -275602 -207571
10911b07571B1134a80775C43127r5021j17334N3175o9338L1699L2205N387f34147
$$ -207571 21134 -180775 343127 248106 130772 183947 114609 146308 178513 183900 -634147
10899C4994g6980a1913B98340F8460J49455G0016a82130q6554A61273O9752c3185
$$ 34994 -76980 -11913 298340 68460 217915 70016 -182130 -268684 161273 231025 -33185
10887b0434j03379r1005B90310a30400E1445b1299A6632a08499e0810q3332A13824
$$ -20434 -123813 -214818 290310 -130400 51445 -21299 16632 -108499 -50810 -134142 113824
10875I2086J5933k8486e3774j1702q9214n8281D5246J63750h279A91830a66108
$$ 92086 108019 79533 -53774 -65476 -154690 -212971 45246 208996 -8279 191830 -166108
10863c634m1103j18861B70618A05696c4537B3898i9032l4639j27459J0404g723
$$ -3634 -44737 -163598 270618 105696 -34537 23898 -99032 -133671 -261130 -250726 -7723
10851B27512C5803N1356k6029K5469a22118b4231k5732j56545I5788m1752a39265
$$ 227512 35803 87159 61130 86599 -122118 -24231 -49963 -206508 95788 54036 -139265
10839B14859e298a525F5617i2236M5894r9292q7220L4300D9611a20817l05895
$$ 214859 -5298 -1525 65617 -92236 -46342 -145634 -232854 -198554 49611 -120817 -426712
10828d26712A6499g1088H2681P0963g1058q9361G1702b68503A3928i5981j19446
$$ -426712 16499 -71088 82681 153644 -71058 -160419 71702 -268503 13928 -95981 -215427
10817b15427R1778A91728b43276Q0718j02818j32267A35975O530b6062B01608
$$ -215427 -123649 191728 -243276 -162558 -265376 -397643 135975 142505 -26062 201608
10806B6772J62881F9906A9571b3158j47936N8869l060A79007h9121A1732R7691
$$ 26772 189653 69906 19571 -23158 -171094 -112225 -115285 179007 -89121 11732 109423
10795A09423A6961a4105p214j0129j90568H3741B8613L22695D0146K68078A09779
$$ 109423 16961 -14105 -21319 -31448 -222016 83741 28613 351308 40146 308224 109779
10783A21846b25082a6072n8497a979A8087c6360B39264f8101o020j13900h3746
$$ 121846 -225082 -16072 -74569 -1979 18087 -36360 239264 -68101 -74121 -188021 -83746
10771b47059P4664I824J65517N8563a21610D7225i3995l28105A28547a05872A39696
$$ -247059 -172395 9824 175341 233904 -121610 47225 -93995 -422100 128547 -105872 139696
10759F9369K76820b96682J34900A06879f7280j1185j55444H949c58487a17179
$$ 69369 346189 -296682 -161782 106879 -67280 -78465 -233909 8949 -358487 -117179
10748A7611J5109a10218B3894J56302J56579e8213k18580h237o3962J3879B6746
$$ 17611 32720 -110218 23894 180196 336775 -58213 -276793 -8237 -72199 -58320 26746
10736E0047a90028B7582H318K7545b18101h9400b2138H8600a07604D4322a88319
$$ 50047 -190028 27582 8318 35863 -218101 -89400 -22138 88600 -107604 44322 -188319
10724d4992J0283C53192C3344d2963A74997a04402C83653a28518f568j91095j03798
$$ -44992 -34709 353192 33344 -42963 174997 -104402 383653 -128518 -6568 -197663 -301461
10713c01461A45335O0121c6460A07049a39301f2635j07290D0060e2158n0098O270
$$ -301461 145335 205456 -36460 107049 -139301 -62635 -169925 40060 -52158 -102256 -95986
10702i5986k3783c5985D5481b14392g1989k85717c5746B1831Q8481j5029b50665
$$ -95986 -119769 -35985 45481 -214392 -71989 -357706 -35746 21831 110312 95283 -250665
10690a2863r0663B43159f53m40562J80466H41a30022A54765m0519j2536K2584
$$ -12863 -103526 243159 -653 -441215 -260749 841 -130022 154765 114246 101710 124294
10679A24294B7883c3037p0560A3929c9582A2960N30882d17643a13315D68291A59869
$$ 124294 27883 -33037 -103597 13929 -39582 12960 543842 -417643 -113315 468291 159869
10667i0942D14443A58541N4633L91563a987m12733k57190A04423e2607j47876
$$ -90942 414443 158541 213174 604737 -1987 -414720 -671910 104423 -52607 -200483
10657b00483N3564B26796E1006c4811A99969f2854l53755a86756D00820A28440
$$ -200483 -146919 226796 51006 -34811 199969 -62854 -416609 -186756 400820 128440
10646A06684g4407j50407R8222A19542a00299F6048c41562I4739J2744b73921
$$ 106684 -74407 -224814 -126592 119542 -100299 66048 -341562 94739 107483 -273921
10635G954J43446c78999J68058i8909L0748j16861j33217E5878L53985i751k64202
$$ 7954 151400 -378999 -210941 -98909 -68161 -185022 -318239 55878 409863 -9751 -273953
10624b73953m0813O0768C37169a09485m894g55D9190g3964r2922h93j33045c2151
$$ -273953 -314766 -253998 337169 -109485 -114379 -755 49190 -73964 -166886 -893 -133938 -32151
10611g328r2949p6032d2579R221E6522N4517C0240a05644E000a7138F2565a19005
$$ -7328 -100277 -176309 -42579 -33358 56522 111039 30240 -105644 5000 -17138 62565 -119005
10598e0330l07586i4999j95703J39014j62065c9370N542k05767J5559j0601A89911
$$ -50330 -357916 -94999 -290702 -151688 -313753 -39370 -33828 -239595 -224036 -234637 189911
10586A44975f0837A9857J07884a9020P981m46138P4752a68897a3994D8165N9829
$$ 144975 -60837 19857 127741 -19020 -11039 -457177 -382425 -168897 -13994 48165 107994
10575A07994a75947j07884G7269d4926k52867J43966p5148j25958h5082A78565
$$ 107994 -175947 -283831 77269 -44926 -297793 -153827 -228975 -354933 -85082 178565
10564b75841C28699a58192O8146A62350p6903c68038J68772k2126D4572J11655
$$ -275841 328699 -158192 -90046 162350 85447 -368038 -199266 -221392 44572 156227
10554A56227g026k42903A68766l9929a01268B58712a43168F6308g6324A40532
$$ 156227 -7026 -249929 168766 128837 -101268 258712 -143168 66308 -76324 140532
10543B08846G0837A1103K11217h082k0367A86656H6478i5804B13049b35840D35573
$$ 208846 70837 11103 222320 -8082 -28449 186656 86478 -95804 213049 -235840 435573
10531a81541g715n0249j30158n0346h1714j89894g663A251K78063a9296B03709
$$ -181541 -7715 -57964 -188122 -238468 -81714 -271608 -7663 1251 279314 -19296 203709
10519b79068A42100K31436b04164c451G8870j2971M8223J02802g4591E2422g1531
$$ -279068 142100 373536 -204164 -3451 78870 65899 114122 216924 -74591 52422 -71531
10507a1426j95390k65290C73217o5899a1161A38291C6681a15111H0629E092a47879
$$ -11426 -206816 -472106 373217 307318 -11161 138291 36681 -115111 80629 5092 -147879
10495c11322A28879k5059J6632a67593O084B34851d75162G7344J47911a01084
$$ -311322 128879 103820 120452 -167593 -161509 234851 -475162 77344 225255 -101084
10484D2819J45330K81769j14586J61493K11896B44120M67983C34805c5331C16007
$$ 42819 188149 469918 355332 516825 728721 244120 712103 334805 -35331 316007
10473A81808L4610c50485C89613A60366a08326j53439f4266A00540f4267A0025
$$ 181808 216418 -350485 389613 160366 -108326 -261765 -64266 100540 -64267 10025
10462c06905A88460n6926a9530A64426G7632J20916c76983b5431n3901A92019
$$ -306905 188460 131534 -19530 164426 77632 198548 -376983 -25431 -79332 192019
10451G5044a48134A68639a14135l2621C0376M360d80139C6855M5508A4635J27136
$$ 75044 -148134 168639 -114135 -146756 30376 34736 -480139 36855 82363 14635 141771
10440A41771b76536d3170k5351k4169k10518A83145l535a260j58302d9212C38842
$$ 141771 -276536 -43170 -68521 -92690 -303208 183145 179610 -1260 -159562 -49212 338842
10428B48034b93303c4012A41268a1097A76936C2237N8797J26390A7109a49239
$$ 248034 -293303 -34012 141268 -11097 176936 32237 91034 217424 17109 -149239
10417A57363H949f4187k67990D4914d1626n7533J9382K2495D9255O5432a62527
$$ 157363 8949 -64187 -332177 44914 -41626 -99159 -79777 -57282 49255 114687 -162527
10405E1477O6394b91066B26822a55539d7690j06453B62976g4510l2762F3940M8688
$$ 51477 117871 -291066 226822 -155539 -47690 -154143 262976 -74510 -107272 63940 112628
10394A12628d6955p3384A31305e1852I975f9758D4287Q910K68662P1304G6249
$$ 112628 -46955 -120339 131305 -51852 9975 -69758 44287 53197 321859 393163 76249
10382D25147D7521K33246A35541o5988j214h5625A29046Q7295K0710j00782J14718
$$ 425147 47521 280767 135541 69553 68339 -85625 129046 216341 237051 136269 250987
10371B50987O8711j05206n5347L78508k01433J64158r264j83041A08823N2923
$$ 250987 319698 214492 159145 537653 336220 500378 491114 308073 108823 161746
10361A61746J30126J74308B09435j01719K37144L5112j1041M8672j60394R442
$$ 161746 291872 466180 209435 107716 344860 379972 368931 417603 257209 266651
10351B66651P0208M4315N8129A94314L4975K79807D3066J64376J8559k6082m690
$$ 266651 336859 381174 439303 194314 229289 509096 43066 207442 226001 199919 195229
10340A95229K96755A18796R6371J97196A61794a1920l55230D1894c33544A62592
$$ 195229 491984 118796 215167 412363 161794 -11920 -367150 41894 -333544 162592
10329B73206l6765j384b638B311i7282B73063A23888J97067I1424a9022l15560
$$ 273206 236441 235057 -2638 2311 -97282 273063 123888 320955 91424 -19022 -334582
10318c34582B77742c29015A24960f3791A30300m3391A8507J24401f8462k26768
$$ -334582 277742 -329015 124960 -63791 130300 86909 18507 142908 -68462 -295230
10308b95230A90988K49166A56404h4892j16768A15590d4322A48720c46605B92762
$$ -295230 190988 440154 156404 -84892 -201660 115590 -44322 148720 -346605 292762
10297c92823B3913a50149K9913b2154F4416c8498j19098o7824C9284J2192a28927
$$ -392823 23913 -150149 -120236 -22154 64416 -38498 -157596 -225420 39284 51476 -128927
10285e7631A85816a44260N0209J5581l3691Q400B7889J2547g180A42114e9355
$$ -57631 185816 -144260 -94051 -78470 -112161 -103761 27889 40436 -7180 142114 -59355
10273a12715k5800m5358M8251j14159A54608l6719a34561A128b3815k35771C64764
$$ -112715 -138515 -183873 -135622 -249781 154608 117889 -134561 1128 -23815 -259586 364764
10261A07249K18721g1481A47497P2128J2932D9878K49798h1266r5945E8631e4952
$$ 107249 325970 -71481 147497 219625 232557 49878 299676 -81266 -177211 58631 -54952
10249c6508j23758G8223l2125d0021A92567n711E4942c47035B82458F432a80895
$$ -36508 -160266 78223 46098 -40021 192567 186856 54942 -347035 282458 6432 -180895
10237g8926F0154f0256j13720G0750b77850e2024A75397a58931H2552g4362b2821
$$ -78926 60154 -60256 -173976 70750 -277850 -52024 175397 -158931 82552 -74362 -22821
10225a66759r8787C27160E7470a87504P2038G7963l0362c81774c8712o6790A5107
$$ -166759 -265546 327160 57470 -187504 -115466 77963 47601 -381774 -38712 -105502 15107
10213B23906d14D9160a61903E1493b53665F8654c29773D20433A80143Q855J74994
$$ 223906 -414 49160 -161903 51493 -253665 68654 -329773 420433 180143 188998 363992
10202C63992i2720j5962R207J0318b2300A70708b73182P6509e7587l28298J82459
$$ 363992 -92720 -108682 -99475 -89157 -22300 170708 -273182 -196673 -57587 -385885 -203426
10191b03426I911Q166a99778A24009c78211B82947q9426a00545j66508N662f7648
$$ -203426 9911 18077 -199778 124009 -378211 282947 193521 -100545 -267053 -261391 -67648
10179A66833f9522H6065A7667a0409j84540H0256a72457r3739C3713f3169k7128
$$ 166833 -69522 86065 17667 -10409 -194949 80256 -172457 -266196 33713 -63169 -90297
10168i0297k37342a49457m4537b5533j3945j40344n926M0077E8333c48348P2973
$$ -90297 -327639 -149457 -193994 -25533 -39478 -179822 -185748 -145671 58333 -348348 -275375
10157b75375l1943f1249j9804C26738a5899j18810K378C3296A3489a57578q2143
$$ -275375 -307318 -61249 -81053 326738 -15899 -134709 -132331 33296 13489 -157578 -239721
10146b39721g9314o123d0442j22540j7269B10334b97508A19814J0758b07788A15998
$$ -239721 -79314 -85437 -40442 -162982 -180251 210334 -297508 119814 130572 -207788 115998
10134e73518A43885a41130j35734j70539a94844K7677B72079G9658c85367a30009
$$ -573518 143885 -141130 -276864 -447403 -194844 -167167 272079 79658 -385367 -130009
10123a84526P2261p5476n7211j33611A57237b7630j19506B29984b99986H5575
$$ -184526 -112265 -187741 -244952 -378563 157237 -27630 -147136 229984 -299986 85575
10112A28242g8101j2325a5026k33372L7773B3499b07098K6039B1523N3132k7643
$$ 128242 -78101 -90426 -15026 -248398 -210625 23499 -207098 -181059 21523 74655 47012
10101D7012O4056K56740r9527d38186A7131d24573g8206D7888a69790g4294E4591
$$ 47012 111068 367808 268281 -438186 17131 -424573 -78206 47888 -169790 -74294 54591
10089d93127a40505O902j4728A55710a59624k1838k87704B02599R3041i1960G4008
$$ -493127 -140505 -133603 -148331 155710 -159624 -181462 -469166 202599 295640 -91960 74008
10077A84224h8119H6489a99195M2134A13899a72684B31714a69006c6375A9999
$$ 184224 -88119 86489 -199195 -157061 113899 -172684 231714 -169006 -36375 19999
10066b04749i2988G5993j563c0101A79728f3423B16175a58669j51073i2213d3189
$$ -204749 -92988 75993 74430 -30101 179728 -63423 216175 -158669 -309742 -92213 -43189
10054B45565g5925B16363b70769J27404N8025m37592B89238D0786b01978P3702
$$ 245565 -75925 216363 -270769 -143365 -85340 -522932 289238 40786 -201978 -128276
10044a28276B66787A12653c56664J61620o8305I7522a07977j58532A22866C4374
$$ -128276 266787 112653 -356664 -195044 -263349 97522 -107977 -266509 122866 34374
10033F2764e7753a9020k27235R5036d8975D7928h347j09804l15045K16006q847
$$ 62764 -57753 -19020 -246255 -151219 -48975 47928 -8347 -118151 -433196 -217190 -226037
10022b26037C2340f3517B06200b37262q248J11029k4434J6847A95741a34922n7501
$$ -226037 32340 -63517 206200 -237262 -245510 -134481 -158915 -142068 195741 -134922 -192423
10011a92423h4102D2004L0661c88073a47760F3941a60447n390C28365b36630q9068
$$ -192423 -84102 42004 72665 -388073 -147760 63941 -160447 -165837 328365 -236630 -325698
10000c25698A38464M5472F8077b08581B32319H4109b21939A05002J17019I434
$$ -325698 138464 183936 68077 -208581 232319 84109 -221939 105002 222021 9434
9989a15597l35012a19319k49429A04851a2799m9852k2115H1643h6204c6717I0149
$$ -115597 -450609 -119319 -368748 104851 -12799 -62651 -84766 81643 -86204 -36717 90149
9977b32946A97298i2095p3943A77972G3811c9926j21571n0673j00231i262k25181
$$ -232946 197298 -92095 -166038 177972 73811 -39926 -161497 -212170 -312401 -9262 -234443
9966b34443G9272C5779b43836N8031A15710f8790D9367J68513a76449p7976j004
$$ -234443 79272 35779 -243836 -185805 115710 -68790 49367 217880 -176449 -254425 -255429
9955b55429B41045H0222a69957N6944j40104J02798E9951b51919J09078K2521
$$ -255429 241045 80222 -169957 -113013 -253117 -150319 59951 -251919 -142841 -120320
9945a20320E770e7074A78257b2243j90820K0034E3115K8190a50388K5800h375
$$ -120320 5770 -57074 178257 -22243 -213063 -193029 53115 81305 -150388 -124588 -8375
9933B551b96297Q8683D928J52760F8844a89495p1319Q2411j98725d954H9351L1328
$$ 2551 -296297 -207614 4928 157688 68844 -189495 -260814 -178403 -377128 -4954 89351 120679
9921A20679a97849E6984e32542B49401h5912e3j61035e6896m28608F7713c17602
$$ 120679 -197849 56984 -532542 249401 -85912 -53 -161088 -56896 -485504 67713 -317602
9909C1428R2092K33445a86892P0490L7624C07980b3411j33642A7642K93887b32741
$$ 31428 123520 356965 -186892 -116402 -78778 307980 -23411 -157053 17642 311529 -232741
9897c26452A69727b81337a22451J5655j76695e2530C8711c38371d5057m13791
$$ -326452 169727 -281337 -122451 -106796 -283491 -52530 38711 -338371 -45057 -458848
9887d58848a86108J4834j4943c2850k04332a932k89317P0676A11294J02962b3697
$$ -458848 -186108 -171274 -186217 -32850 -237182 -1932 -291249 -220573 111294 214256 -23697
9875h3686a2585j10540j83797d5162m3746m7568A39816b76256a10969A18647k7446
$$ -83686 -12585 -123125 -306922 -45162 -88908 -136476 139816 -276256 -110969 118647 91201
9864I1201C6920a61883K3263D71614b17761H3910f9331A08480a56904B25312a0873
$$ 91201 36920 -161883 -138620 471614 -217761 83910 -69331 108480 -156904 225312 -10873
9852A76209a74435q6052h3623H4707f2223E1962b54212L710B61162a27008j34813
$$ 176209 -174435 -260487 -83623 84707 -62223 51962 -254212 -250502 261162 -127008 -261821
9841b61821a01657D16J91657I798h2356r4898N0397e2022j01103A54737h8323
$$ -261821 -101657 416 192073 9798 -82356 -177254 -126857 -52022 -153125 154737 -88323
9829A54838J39181d7393k6611k4252n1631e694C970b18035g6493r1539E9860e122
$$ 154838 294019 -47393 -74004 -98256 -149887 -5694 3970 -218035 -76493 -168032 59860 -5122
9816c35437A51581A9408d7991j393l0897j57529j23949L604A3016f2528k7926
$$ -335437 151581 19408 -47991 -49384 -80281 -237810 -361759 -358155 13016 -62528 -90454
9805i0454G9648a09879a0356G9502j6122b22035A74858b64864n1058A10857b74905
$$ -90454 79648 -109879 -10356 79502 63380 -222035 174858 -264864 -315922 110857 -274905
9793c81155A99859e1806J1936A62325o230l6543J3195a67746I92L67a41739j75040
$$ -381155 199859 -51806 -39870 162325 156095 119552 132747 -167746 992 1359 -141739 -316779
9781c16779a5923J131A99361I9451e3317o840n876A17383J4109F1843d5095j87755
$$ -316779 -15923 -14792 199361 99451 -53317 -60157 -66033 117383 131492 61843 -45095 -232850
9769b32850d2349r586o8699j62723B96084e569j97559n604B06112b36507A36694
$$ -232850 -42349 -51935 -120634 -283357 296084 -5569 -203128 -208732 206112 -236507 136694
9757a24057r6781j68615J43665P0375Q292H4812l5513i2571A57519c40783a61274
$$ -124057 -220838 -389453 -245788 -175413 -167121 84812 49299 -92571 157519 -340783 -161274
9745C27072f2701A17533L30714b00602r4375F108a64539A19389c9563j00689m8579
$$ 327072 -62701 117533 448247 -200602 -294977 6108 -164539 119389 -39563 -140252 -188831
9734a88831P9186B02108f4638o3455k8923O4488k24263d7534A09477i9545L1233
$$ -188831 -109645 202108 -64638 -128093 -157016 -92528 -316791 -47534 109477 -99545 -68312
9723f8312q160k24070J08150K2772n7871H140a06610G684b87085j09949D1678
$$ -68312 -76472 -300542 -192392 -169620 -227491 8140 -106610 7684 -287085 -397034 41678
9711B4719a40428A3734K6228b15292j04283e8183r3430I3857i4707A22978c15275
$$ 24719 -140428 13734 39962 -215292 -319575 -58183 -151613 93857 -94707 122978 -315275
9699a70698l0486K1279e0185l7830a0571l3261l8499I3329j9347b552l4200j3589
$$ -170698 -201184 -179905 -50185 -88015 -10571 -43832 -82331 93329 73982 -2552 -36752 -50341
9687e0341o8638J9231A03682c71717c3974o486D8667a64865p7802A21146f251
$$ -50341 -118979 -99748 103682 -371717 -33974 -40460 48667 -164865 -242667 121146 -6251
9675c76006A8295P6408L5667q549m7064a47320L9372r2770J2934C8867K3585d653
$$ -376006 18295 94703 130370 121821 74757 -147320 -107948 -200718 -187784 38867 62452 -4653
9662c07520d5104A5108c24397h7224K1211a6700D5221b35740O0651g0638k29148
$$ -307520 -45104 15108 -324397 -87224 -66013 -16700 45221 -235740 -175089 -70638 -299786
9651b99786h223j61470B37348b15022D8922d524j9907A6104b41802j5344D3095
$$ -299786 -8223 -169693 237348 -215022 48922 -4524 -24431 16104 -241802 -257146 43095
9639d7249A41925b86796A02261a34693G9137a13986A01979b34592C3573J53825
$$ -47249 141925 -286796 102261 -134693 79137 -113986 101979 -234592 33573 187398
9629A87398i1087n7668I1903i4831B18102a15667G0221k2169a17533j66008a34767
$$ 187398 -91087 -148755 91903 -94831 218102 -115667 70221 48052 -117533 -283541 -134767
9617f8525j0684b9730p6599D835c56147i4739A53025o1366b0454p3774E217J35720
$$ -68525 -79209 -29730 -106329 4835 -356147 -94739 153025 91659 -20454 -94228 5217 140937
9605A40937j0950e7366j19382j44114A05874a17828j95462C64365A69501a3719
$$ 140937 129987 -57366 -176748 -320862 105874 -117828 -313290 364365 169501 -13719
9594b0122B9066a68757k31047e135B4885b49392A7741b6362j5313B53198A10014
$$ -20122 29066 -168757 -399804 -5135 24885 -249392 17741 -26362 -41675 253198 110014
9582g0998l85864a11202j27424A14189f2045n6985o93L760b4156o7373H6686b21320
$$ -70998 -456862 -111202 -238626 114189 -62045 -119030 -119723 -115963 -24156 -91529 86686 -221320
9569a25759A97614c48923A58524a73908d6877a4859D3219c06464C00196g9086
$$ -125759 197614 -348923 158524 -173908 -46877 -14859 43219 -306464 300196 -79086
9558b14339k69734A48004a79543A79494c21058a50602r5231c3725l232j74523
$$ -214339 -484073 148004 -179543 179494 -321058 -150602 -245833 -33725 -36957 -211480
9548b11480C9492g4875A0316g2222C6813L11570a93818i1635G4402b82511J08168
$$ -211480 39492 -74875 10316 -72222 36813 348383 -193818 -91635 74402 -282511 -174343
9537a74343b7952l6255B10516E987a59343a0607l6765B38801a93444M2926L8046
$$ -174343 -27952 -64207 210516 5987 -159343 -10607 -47372 238801 -193444 -150518 -112472
9526a12472j0857j68646l7842a15556j93440H5192g1417A96898O3641b13502B81176
$$ -112472 -123329 -291975 -329817 -115556 -308996 85192 -71417 196898 260539 -213502 281176
9514a762A38181P826i3429M3841n7526n5184G1381a44149n0414G4554a20773A87403
$$ -1762 138181 146007 -93429 -49588 -107114 -162298 71381 -144149 -194563 74554 -120773 187403
9501e2299j58048f786o2711D8631f8664A20665b04785K5077H5655a26661A00888
$$ -52299 -210347 -6786 -69497 48631 -68664 120665 -204785 -179708 85655 -126661 100888
9489c12666f6631B93643j13007q066a90159E7289c58770f7404m57904B85491c44666
$$ -312666 -66631 293643 180636 172570 -190159 57289 -358770 -67404 -525308 285491 -344666
9477A7301a70288C53838b50101B51835B4690J71313l8508b382j17304j23598d0156
$$ 17301 -170288 353838 -250101 251835 24690 196003 157495 -2382 -119686 -243284 -40156
9465c2319B19762a49640E011b34752A17306r386c7094j70562j18731O3894F5893
$$ -32319 219762 -149640 5011 -234752 117306 107920 -37094 -207656 -326387 -262493 65893
9453b5492F4971J382d9731l88133a05537C7485i6202A51163B2404b34281G1251
$$ -25492 64971 66353 -49731 -437864 -105537 37485 -96202 151163 22404 -234281 71251
9441B98022H2774a28962n5748A28165J7063b50118G9523b16753N4293g476m33775
$$ 298022 82774 -128962 -184710 128165 145228 -250118 79523 -216753 -162460 -7476 -441251
9430d41251F692J23846b23820G2055A4858c76089B0283i9402j01902b3399j2600
$$ -441251 6692 130538 -223820 72055 14858 -376089 20283 -99402 -201304 -23399 -35999
9419c5999k18783g4833A3119M5852f2084J7662k02941F242K62597b412k98664
$$ -35999 -254782 -74833 13119 58971 -62084 -44422 -247363 6242 268839 -2412 -301076
9408c01076A47020g8644k04760c4802B83404A4716J26994o5578d17316H9177D3063
$$ -301076 147020 -78644 -283404 -34802 283404 14716 141710 76132 -417316 89177 43063
9396d0190A35387b18443Q1691j6798B26366a16347j887A35738C2759K8146A6155
$$ -40190 135387 -218443 -136752 -153550 226366 -116347 -118234 135738 32759 60905 16155
9384G495b5855k0569F032d46080H5422a06934a7326l4441C0389J46409f40571
$$ 7495 -25855 -46424 6032 -446080 85422 -106934 -17326 -51767 30389 176798 -640571
9372b69533R5772k0191j95212A56702b9305A51022e5793a1742j59163O7982j5781
$$ -269533 -173761 -193952 -389164 156702 -29305 151022 -55793 -11742 -170905 -102923 -118704
9361a18704F7278M0928C6570J35432j5990p0571A8894c49695m2775a03695C7916
$$ -118704 67278 108206 36570 172002 156012 85441 18894 -349695 -392470 -103695 37916
9349H6635J56159g1710M779F7359b01214A13463b13228E7427a23131A3318M5665
$$ 86635 242794 -71710 -66931 67359 -201214 113463 -213228 57427 -123131 13318 58983
9338E8983b39524B8855a52034N9830b0684l07375E1199g4846K5837A65357c75098
$$ 58983 -239524 28855 -152034 -92204 -20684 -328059 51199 -74846 -49009 165357 -375098
9326A47121i1648j26422I2985d2811k67343J45240B0286L0874J34458d4811m6650
$$ 147121 -91648 -218070 92985 -42811 -310154 -164914 20286 51160 185618 -44811 -91461
9315i1461A18271C0536c51873J65895A48919F2115h8547I0667f3674k23956h6036
$$ -91461 118271 30536 -351873 -185978 148919 62115 -88547 90667 -63674 -287630 -86036
9303c3630p0186A91483c64061a15349J8157j97671B86145A28509e5046j6306B41384
$$ -33630 -103816 191483 -364061 -115349 -97192 -294863 286145 128509 -55046 -71352 241384
9291d1849F2441a909F8475b24830p9529a22099B72167r2103a5315F5918b59797
$$ -41849 62441 -1909 68475 -224830 -304359 -122099 272167 180064 -15315 65918 -259797
9279b19892m8777i1207r6031l5709O8742F0649J09161f1691A3131a3219A87284
$$ -219892 -268669 -91207 -187238 -222947 -154205 60649 169810 -61691 13131 -13219 187284
9267H83K03436b50551j38788a12904p5849K7504N3166e077A93944F2925g7358
$$ 883 204319 -250551 -389339 -112904 -188753 -161249 -108083 -5077 193944 62925 -77358
9255B95640c39275J66278d7144G3099J05297b49194B05700B4505b19983b8569
$$ 295640 -339275 -172997 -47144 73099 178396 -249194 205700 24505 -219983 -28569
9244f5745A45856a96737C1385K557d25315b05162G2992a10068K3527j21584E5956
$$ -65745 145856 -196737 31385 33942 -425315 -205162 72992 -110068 -86541 -208125 55956
9232g5090n8924h824k7613k49789g5582j92011B65711b65995E1908b42840J17834
$$ -75090 -134014 -8824 -36437 -286226 -75582 -267593 265711 -265995 51908 -242840 -125006
9221a25006j79269n07i2601A35560c6440j35041l0719j82P0540k38449A17347
$$ -125006 -304275 -304782 -92601 135560 -36440 -171481 -202200 -202382 -131842 -370291 117347
9209A88716e732A55735K3777J49283I6719b389j2242n04844b0758p4949A73016
$$ 188716 -5732 155735 179512 328795 96719 -2389 -14631 -519475 -20758 -95707 173016
9197b19837e3987B50466c41942J67751P0847m1017N657J1167B64044a37177B861
$$ -219837 -53987 250466 -341942 -174191 -103344 -144361 -138704 -127537 264044 -137177 2861
9185a12872o1879g6832k91398J56270j34130A378K96677g3769G8199a9324j8976
$$ -112872 -174751 -76832 -368230 -211960 -346090 1378 298055 -73769 78199 -19324 -38300
9174c8300B43728a17137j9710j97669A07876m6925N3288J33396d73063J34381
$$ -38300 243728 -117137 -136847 -334516 107876 60951 114239 247635 -473063 -338682
9164c38682B25347a34735E0357N2308a79363j2139Q0863l16650a17619A19387
$$ -338682 225347 -134735 50357 102665 -179363 -191502 -110639 -427289 -117619 119387
9153A61861o1654D8028J1251J01886a62720l19024a4050I533h8146A89988d8169
$$ 161861 100207 48028 59279 161165 -162720 -481744 -14050 9533 -88146 189988 -48169
9141A25515j8089B9404a2558m31661a3317j95092n5928A71917a00283k75867B0788
$$ 125515 107426 29404 -12558 -444219 -13317 -208409 -264337 171917 -100283 -376150 20788
9129D0711f4104a6972q854o3758J4592m9549A23761b00389m5713J16218K2952
$$ 40711 -64104 -16972 -25826 -89584 -74992 -124541 123761 -200389 -246102 -129884 -106932
9118a06932A07309A7485e4704B28593C3043j664b41997Q0646A96597b51013A16899
$$ -106932 107309 17485 -54704 228593 33043 31379 -241997 -161351 196597 -251013 116899
9106C28589g8599G2518j3485K4181g5205k22348D0047R0282h7029H940i9243B7662
$$ 328589 -78599 72518 59033 83214 -75205 -297553 40047 130329 -87029 8940 -99243 27662
9093A87284g8995j39282e2179m1636k4676d7411j87202b956D1281b37752C7072
$$ 187284 -78995 -218277 -52179 -93815 -118491 -47411 -234613 -2956 41281 -237752 37072
9081b375H3091i1855p3444O5401A32362G371P8733a01668I1988K5751G101b33598
$$ -2375 83091 -91855 -165299 -99898 132362 7371 86104 -101668 91988 117739 7101 -233598
9068A59992b82847e0000G611M202e3005B68071I602b72174C20216f3967k7975
$$ 159992 -282847 -50000 7611 11813 -53005 268071 9602 -272174 320216 -63967 -91942
9057i1942d0682k06343R3661A47085a29675B61769A07061c8560C1201d983k67866
$$ -91942 -40682 -247025 -153364 147085 -129675 261769 107061 -38560 31201 -4983 -272849
9046b72849P0294B28157H0368a31700q6168B45443A11066m6494a10515l23116
$$ -272849 -202555 228157 80368 -131700 -217868 245443 111066 64572 -110515 -433631
9036d33631C7328b97200a26844A31216b11715a03127j44870g1464A25921a62879
$$ -433631 37328 -297200 -126844 131216 -211715 -103127 -247997 -71464 125921 -162879
9025B97576b96756A21443m4187b49694J09979C656c29538p3620a23714C0459c83048
$$ 297576 -296756 121443 77256 -249694 -139715 3656 -329538 -403158 -123714 30459 -383048
9013f35588e6715I0743C1102L47078c7348j80536A43376i7084l58892a01976A84737
$$ -635588 -56715 90743 31102 378180 -37348 -217884 143376 -97084 -455976 -101976 184737
9001b58303j37204A22194j9303h2505B16682b11865A62014E5508c9759o2307L3272
$$ -258303 -395507 122194 102891 -82505 216682 -211865 162014 55508 -39759 -102066 -68794
8990f8794G79c12733E7852a78918b1492A7152d1967l3059B61293b44142h0714
$$ -68794 779 -312733 57852 -178918 -21492 17152 -41967 -75026 261293 -244142 -80714
8978a86043d3897n5393l9478I6856D2464h2657B29926b77021c9683k3697p3807
$$ -186043 -43897 -99290 -138768 96856 42464 -82657 229926 -277021 -39683 -63380 -137187
8967a37187b7340j03381A72234b36861d3766B58120d5591A11406J81808d31603
$$ -137187 -27340 -130721 172234 -236861 -43766 258120 -45591 111406 293214 -431603
8956H3073l5179L8544F724g2603k0132L1780C7119b01299j36678C3495e7997J6718
$$ 83073 47894 86438 6724 -72603 -92735 -60955 37119 -201299 -337977 33495 -57997 -41279
8944d1279H4048a6423C668L08668r5749d9310n2065d1018q32E39480B04329e9476
$$ -41279 84048 -16423 3668 312336 216587 -49310 -101375 -41018 -41850 539480 204329 -59476
8931a46802L652A84780i93B02844n1300K01092M83390J381767J855296N606626
$$ -146802 -143150 184780 -993 202844 151544 352636 836026 2217793 4073089 9679715
8921I679715p80346B227766I80360m82469r5201b01618d7732A91922q1697m8876
$$ 9679715 8899369 2227766 980360 497891 402690 -201618 -47732 191922 110225 61349
8911F1349J71541A14888L54049j20302a01197m9878k2718b0956r8642j82707A38394
$$ 61349 232890 114888 468937 348635 -101197 -151075 -173793 -20956 -119598 -302305 138394
8899c496n8704m9884k27603c2608D6374c6032A02055d2970K0993A27907O7586
$$ -3496 -62200 -112084 -339687 -32608 46374 -36032 102055 -42970 -21977 127907 195493
8888A95493d5510D1356f523l0009A29314i6474q6909a4359l17948M8844k789a01541
$$ 195493 -45510 41356 -6523 -36532 129314 -96474 -183383 -14359 -332307 -283463 -286252 -101541
8875d089A00291C5325c0610M717j63601M4141e518m3199j03475K6363c2004j9027
$$ -4089 100291 35325 -30610 -25893 -189494 -145353 -5518 -48717 -152192 -125829 -32004 -51031
8863e1031j39834B96194a37237G2870c85406G8502J6552d6510j18453L8323A50144
$$ -51031 -190865 296194 -137237 72870 -385406 78502 95054 -46510 -164963 -126640 150144
$$ [...]
##END NTUPLES=NMR SPECTRUM
##END=
