##TITLE=AC1600_BMGAH13330_8315788_LLG8LWJYbE
##JCAMPDX= 6.0         $$ Bruker NMR JCAMP-DX V2.0
##DATA TYPE= NMR SPECTRUM
##DATA CLASS= NTUPLES
##ORIGIN= BRUKER
##OWNER= Administrator
$$ 1.72 TOPSPIN		Version 2.1
$$ 2013-11-09 21:13:40.034 -0800  Administrator@X
$$ Compression mode = diff/dup
##.OBSERVE FREQUENCY= 400.02188249412
##.OBSERVE NUCLEUS= ^1H
##.ACQUISITION MODE= SIMULTANEOUS (DQD)
##.ACQUISITION SCHEME= undefined
##.AVERAGES= 64
##.DIGITISER RES= 22
##SPECTROMETER/DATA SYSTEM= spect
##.PULSE SEQUENCE= noesygpps1d.comp
##.SOLVENT NAME= COFFEE_meoh
##.SHIFT REFERENCE= INTERNAL, COFFEE_meoh, 1, 14.9608
##AUDIT TRAIL= $$ (NUMBER, WHEN, WHO, WHERE, PROCESS, VERSION, WHAT)
$$ ##TITLE= Audit trail, TOPSPIN		Version 2.1
$$ ##JCAMPDX= 5.01
$$ ##ORIGIN= Bruker BioSpin GmbH
$$ ##OWNER= Administrator
$$ $$ E:\/data/COFFEE/nmr/AC1600_BMGAH13330_8315788_LLG8LWJYbE/12/pdata/1/auditp.txt
$$ ##AUDIT TRAIL=  $$ (NUMBER, WHEN, WHO, WHERE, PROCESS, VERSION, WHAT)
(   1,<2013-11-09 21:13:34.988 -0800>,<Administrator>,<X>,<go>,<TOPSPIN 2.1>,
      <created by zg
	started at 2013-11-09 21:02:04.847 -0800,
	POWCHK enabled, PULCHK disabled,
       configuration hash MD5:
       C8 4E 4E 5D D3 5C D8 9E 9F 52 82 E0 59 8A DE 15
       data hash MD5: 64K
       D9 A9 8A 09 17 A3 35 20 AF D1 FB 88 45 0E 27 4A>)
(   2,<2013-11-09 21:13:38.003 -0800>,<Administrator>,<X>,<proc1d>,<TOPSPIN 2.1>,
      <Start of raw data processing
       efp LB = 0.3 FT_mod = 6 PKNL = 1 PHC0 = 0 PHC1 = 0 SI = 128K 
       data hash MD5: 128K
       59 5F A9 4A D1 04 20 4E A4 55 6F 3D C7 1E A5 12>)
(   3,<2013-11-09 21:13:38.988 -0800>,<Administrator>,<X>,<proc1d>,<TOPSPIN 2.1>,
      <pk PHC0 = -85.92407 PHC1 = 0 
       data hash MD5: 128K
       45 D0 BA 03 D1 15 40 86 5D 4C 44 B5 E1 92 EE E6>)
(   4,<2013-11-09 21:13:39.456 -0800>,<Administrator>,<X>,<proc1d>,<TOPSPIN 2.1>,
      <abs ABSG = 1 
       data hash MD5: 128K
       2A B8 BB A6 31 A3 FA 81 E1 7A 16 EA 90 79 2E F4>)
(   5,<2013-11-09 21:13:39.581 -0800>,<Administrator>,<X>,<proc1d>,<TOPSPIN 2.1>,
      <abs ABSG = 2 
       data hash MD5: 128K
       2E 18 35 F2 94 BB 7E 9A 81 1B 8D 80 5D 91 4E 79>)
(   6,<2013-11-09 21:13:39.659 -0800>,<Administrator>,<X>,<proc1d>,<TOPSPIN 2.1>,
      <abs ABSG = 3 
       data hash MD5: 128K
       9B 3E 79 70 20 D0 70 A9 51 A3 87 FF B7 B1 EA 2D>)
(   7,<2013-11-09 21:13:39.753 -0800>,<Administrator>,<X>,<proc1d>,<TOPSPIN 2.1>,
      <abs ABSG = 4 
       data hash MD5: 128K
       56 0B 68 B3 77 9D 72 20 53 41 2A 89 0D 1F 49 FA>)
(   8,<2013-11-09 21:13:39.847 -0800>,<Administrator>,<X>,<proc1d>,<TOPSPIN 2.1>,
      <abs ABSG = 5 
       data hash MD5: 128K
       01 23 C6 49 51 FC 58 D1 39 1B 87 13 4B B1 9B 43>)
$$ ##END=
$$ 
$$ $$ hash MD5
$$ $$ 66 5F 5C E8 D7 D9 64 E4 C2 B1 C7 E9 28 56 A3 5C
##$RELAX= 
##$RELAX= 
##$RELAX= 
##$RELAX= 
##$RELAX= 
##$RELAX= 
##$RELAX= 
##$RELAX= 
$$ Bruker specific parameters
$$ --------------------------
##$DU= <E:\>
##$EXPNO= 12
$$ [...]
150 150 150 150 150 150 150 150
##$TP07= 0
##$TPNAME0= <>
##$TPNAME1= <>
##$TPNAME2= <>
##$TPNAME3= <>
##$TPNAME4= <>
##$TPNAME5= <>
##$TPNAME6= <>
##$TPNAME7= <>
##$TPOAL= (0..7)
0.5 0.5 0.5 0.5 0.5 0.5 0.5 0.5
##$TPOFFS= (0..7)
0 0 0 0 0 0 0 0
##$TUNHIN= 0
##$TUNHOUT= 0
##$TUNXOUT= 0
##$USERA1= <user>
##$USERA2= <user>
##$USERA3= <user>
##$USERA4= <user>
##$USERA5= <user>
##$V9= 5
##$VALIST= <valist>
##$VCLIST= <CCCCCCCCCCCCCCC>
##$VD= 0
##$VDLIST= <DDDDDDDDDDDDDDD>
##$VPLIST= <PPPPPPPPPPPPPPP>
##$VTLIST= <TTTTTTTTTTTTTTT>
##$WBST= 1024
##$WBSW= 4
##$XGAIN= (0..3)
0 0 0 0
##$XL= 0
##$YL= 0
##$YMAX_a= 6305446
##$YMIN_a= -11930296
##$ZGOPTNS= <>
##$ZL1= 120
##$ZL2= 120
##$ZL3= 120
##$ZL4= 120
##$ABSF1= 14.9608
##$ABSF2= -5.597382
##$ABSG= 5
##$ABSL= 3
##$ALPHA= 0
##$AQORDER= 0
##$ASSFAC= 0
##$ASSFACI= 0
##$ASSFACX= 0
##$ASSWID= 0
##$AUNMP= <proc_prof1d_extract.lims>
##$AXLEFT= 0
##$AXNAME= <>
##$AXNUC= <1H>
##$AXRIGHT= 0
##$AXTYPE= 0
##$AXUNIT= <>
##$AZFE= 0.1
##$AZFW= 0.1
##$BCFW= 0
##$BC_mod= 0
##$BYTORDP= 0
##$COROFFS= 0
##$CY= 15
##$DATMOD= 1
##$DC= 0
##$DFILT= <>
##$DTYPP= 0
##$F1P= 0
##$F2P= 0
##$FCOR= 0.5
##$FTSIZE= 131072
##$FT_mod= 6
##$GAMMA= 0
##$GB= 0
##$INTBC= 1
##$INTSCL= 1
##$ISEN= 128
##$LB= 0.3
##$LEV0= 0
##$LPBIN= 0
##$MAXI= 10000
##$MC2= 0
##$MEAN= 0
##$ME_mod= 0
##$MI= 0
##$NCOEF= 0
##$NC_proc= -2
##$NLEV= 6
##$NOISF1= 0
##$NOISF2= 0
##$NSP= 0
##$NTH_PI= 0
##$NZP= 0
##$OFFSET= 14.9608
##$PC= 1
##$PHC0= -85.92407
##$PHC1= 0
##$PH_mod= 1
##$PKNL= yes
##$PPARMOD= 0
##$PPDIAG= 0
##$PPIPTYP= 0
##$PPMPNUM= 2147483647
##$PPRESOL= 1
##$PSCAL= 4
##$PSIGN= 0
##$PYNMP= <proc.py>
##$REVERSE= no
##$SF= 400.020009715651
##$SI= 131072
##$SIGF1= 0
##$SIGF2= 0
##$SINO= 400
##$SIOLD= 131072
##$SPECTYP= <>
##$SREGLST= <1H.CDCl3>
##$SSB= 0
##$STSI= 131072
##$STSR= 0
##$SW_p= 8223.68421052631
##$SYMM= 0
##$S_DEV= 0
##$TDeff= 65536
##$TDoff= 0
##$TI= <>
##$TILT= no
##$TM1= 0
##$TM2= 0
##$TOPLEV= 0
##$USERP1= <user>
##$USERP2= <user>
##$USERP3= <user>
##$USERP4= <user>
##$USERP5= <user>
##$WDW= 1
##$XDIM= 131072
##$YMAX_p= 377149338
##$YMIN_p= -13261
##$CURPLOT= <Network HP LaserJet P1505>
##$CURPRIN= <$Network HP LaserJet P1505>
##$DFORMAT= <normdp>
##$LAYOUT= <+/1D_H.xwp>
##$LFORMAT= <normlp>
##$PFORMAT= <normpl>
##$SURQMSG= 1
$$ End of Bruker specific parameters
$$ ---------------------------------
##NTUPLES= NMR SPECTRUM
##VAR_NAME=  FREQUENCY,     SPECTRUM/REAL,   SPECTRUM/IMAG
##SYMBOL=    X,             R,               I
##VAR_TYPE=  INDEPENDENT,   DEPENDENT,       DEPENDENT
##VAR_FORM=  AFFN,          ASDF,            ASDF
##VAR_DIM=   131072,        131072,          131072
##UNITS=     HZ,            ARBITRARY UNITS, ARBITRARY UNITS
##FACTOR=    0.0627417313425164, 1,          1
##FIRST=     8223.62146879497, -282,         -61596
##LAST=      0,             513,             -62560
##MIN=       0,             -13261,          0
##MAX=       8223.62146879497, 377149338,    0
$$ Real data points
##PAGE= N=1
##DATA TABLE= (X++(R..R)), XYDATA
$$ [...]
67938 65960 65607 65513 65434 65442 66032 67507 69514 71299 72275 72265 71459 70288 69284 68920 69489 71005 73060 74878
67920 74878 75727 75395 74293 73164 72705 73239 74522 75958 77141 78053 78562 78088 76207 73497 71188 69886
67904 69886 69122 68334 67755 67856 68352 68378 67663 66888 66731 67028 67234 67340 67761 68450 68736 68309 67792 67847 68052 67416
67884 67416 65951 65000 65656 67452 69111 70138 71036 72169 73175 73672 73912 74383 75025 75226 74560 73422 72875
67867 72875 73794 75949 77997 78590 77496 75511 73419 71491 69907 69028 68881 68803 68134 67099 66531 66726 67059
67850 67059 66843 66124 65301 64287 62592 60274 58270 57477 57767 58307 58699 59276 60276 61308 61926 62310 62946
67833 62946 63910 64919 65931 67240 68971 70861 72532 73719 74268 74248 74140 74567 75800 77692 80000 82466
67817 82466 84659 86144 86808 86692 85638 83626 81395 80004 79470 78493 75960 72227 68413 64927 61418
67802 61418 58015 55730 55379 56531 57871 58396 58104 57623 57422 57385 57059 56211 55069 54073 53483 53268 53224 53166
67784 53166 53078 53078 53180 53153 52738 51951 51038 50283 50120 51149 53490 56138 57609 57473 56836 57024 58255 59835
67766 59835 61137 61953 62310 62486 62985 64016 65181 66038 66701 67486 68256 68682 68883 69205 69456 69037 67873 66648
67748 66648 65980 65845 65895 65861 65494 64588 63349 62377 62048 62146 62243 62187 62067 62024 62216 62696 63102 62772 61384 59366
67728 59366 57521 56401 56112 56432 56905 56999 56411 55222 53767 52471 51763 51829 52312 52520 52116 51470 51232 51720
67710 51720 52770 53958 54827 55057 54591 53584 52276 50992 50100 49671 49304 48657 48115 48396 49413 50102 49660
67693 49660 48503 47649 47557 47961 48517 49114 49719 50286 50739 50789 50026 48536 47137 46598 46812 47159 47433 47843 48294
67674 48294 48359 48044 47942 48408 49111 49637 50071 50638 51163 51307 51141 51133 51664 52780 54273 55754 56683 56638 55664
67655 55664 54326 53437 53651 55070 57093 58781 59534 59421 58908 58429 58245 58375 58399 57626 55827 53774 52691
67638 52691 53085 54297 55259 55441 54986 54201 53224 52158 51237 50701 50568 50675 50881 51136 51386 51617 52057 53084
67620 53084 54692 56198 56860 56762 56722 57149 57407 56647 55046 53766 53692 54568 55530 56154 56731 57618 58676 59462
67602 59462 59797 59944 60183 60390 60240 59683 58983 58259 57297 55962 54530 53364 52450 51595 50947 50901 51457 52031
67584 52031 52072 51620 51100 50791 50652 50480 50017 49034 47557 45996 44928 44689 45190 46047 46875 47551 48239 49082
67566 49082 49875 50200 49917 49389 49173 49611 50642 51731 52074 51319 50177 49814 50365 50602 49522 47738 46577
67549 46577 46180 45481 44056 42965 43307 44663 45613 45407 44558 43964 43935 44116 44004 43507 43125 43511 44804 46459
67531 46459 47829 48694 49174 49375 49318 48997 48366 47454 46551 45991 45677 45284 45073 45855 47685 49218 49094 47618
67513 47618 46241 45586 44938 43693 42310 41456 41050 40728 40639 41061 41653 41853 41914 42795 44863 47219 48587 48625
67495 48625 48072 47724 47629 47364 46854 46542 46724 47090 47243 47377 47972 48923 49576 49712 49916 50693 51685 52179 52022
67476 52022 51611 51223 50849 50523 50394 50505 50819 51380 52110 52593 52452 51894 51458 51246 50860 50119 49413 49199 49559
67457 49559 50339 51354 52259 52630 52477 52370 52714 53131 52892 51820 50469 49511 49185 49251 49265 48975 48640 48830 49759
67438 49759 50986 51986 52745 53457 53931 53878 53628 53914 54803 55441 55119 54105 53142 52597 52502 52943 53824 54507 54370
67419 54370 53672 53297 53561 53779 53134 51554 49629 48081 47465 47904 48804 49201 48743 48102 48058 48444 48386 47464 46170
67400 46170 45230 44894 44945 45088 45194 45354 45849 46912 48375 49652 50177 49870 49144 48464 47883 47075 45871 44720
67382 44720 44376 45069 46210 47063 47447 47576 47557 47463 47658 48472 49543 50012 49577 48935 48937 49627 50380 50748 50813 50872
67362 50872 51082 51431 51841 52203 52351 52031 50978 49194 47158 45615 45056 45504 46696 48202 49359 49505 48566
67345 48566 47251 46468 46595 47351 48178 48622 48567 48298 48249 48611 49273 50148 51172 51899 51612 50194 48599 48008
67327 48008 48675 49991 51480 53182 55051 56528 56999 56430 55332 54253 53430 52827 52378 52168 52290 52538 52477
67310 52477 52042 51871 52653 54240 55764 56651 57106 57526 57864 57843 57473 57045 56760 56675 56937 57772 59135 60494
67292 60494 61094 60571 59324 58218 57754 57616 57208 56497 56016 55991 55888 55086 53750 52724 52627 53311 54167 54701
67274 54701 54769 54449 53851 53096 52440 52327 53132 54754 56532 57718 58027 57766 57496 57610 58127 58782 59331 59761
67256 59761 60155 60410 60281 59758 59151 58696 58264 57589 56631 55522 54387 53473 53273 54099 55490 56437 56351 55615
67238 55615 55064 55124 55606 56122 56449 56598 56734 57079 57728 58550 59332 59972 60464 60781 60864 60647 59951 58509 56436
67219 56436 54609 54167 55404 57411 59051 60053 60837 61558 61894 61791 61821 62432 63286 63714 63666 63763 64493 65696
67201 65696 66889 67750 68195 68317 68389 68729 69408 70205 70928 71564 72012 71961 71314 70579 70511 71360 72670 73794 74411
67182 74411 74532 74319 74033 73990 74393 75180 76079 76787 77143 77223 77309 77655 78223 78751 79079 79259 79330 79211 78976 79024 79647
67161 79647 80468 80633 79700 78108 76666 75765 75238 74809 74386 73971 73589 73425 73770 74679 75765 76562 77079 77803
67143 77803 79081 80604 81675 81962 81775 81534 81206 80498 79497 78769 78777 79526 80913 82997 85627 88049 89402
67126 89402 89583 89284 89149 89275 89504 89762 89907 89605 88695 87516 86639 86402 86851 87931 89492 91241 92879
67109 92879 94214 95067 95293 95118 95212 96099 97558 98839 99356 99006 98100 97336 97620 99299 101522 102846 102666
67092 102666 101731 101130 101147 101306 101169 100777 100485 100653 101383 102383 103189 103703 104338 105452 106824 107956 108773 109714
67074 109714 111180 113145 115325 117389 118950 119672 119582 119123 118730 118534 118654 119496 121367 123816 125853 126995
67058 126995 127729 128688 129724 130260 130308 130560 131486 132908 134609 136742 139287 141602 143052 143810 144543 145503 146412
67041 146412 147115 147799 148580 149391 150290 151422 152627 153624 154650 156364 158867 161301 162828 163612 164492 165922
67025 165922 167637 169195 170489 171817 173664 176309 179435 182269 184308 185784 187264 188991 190808 192500
67011 192500 193993 195367 196959 199222 202225 205453 208367 210947 213373 215440 216786 217612 218700 220716
66997 220716 223805 227765 232176 236408 240041 243407 247205 251446 255259 258026 260271 263030 266607 270395
66983 270395 273758 276695 279642 282984 286828 291073 295564 300221 304970 309558 313659 317348 321320 326357
66969 326357 332552 339292 345937 352266 358272 363857 369035 374211 379938 386396 393330 400535 408090 415963
66955 415963 423656 430580 436769 442926 449738 457376 465661 474334 482996 491192 498914 506808 515426 524486
66941 524486 533387 542401 552653 564722 577840 590876 603612 616509 629607 642432 654963 667905
66929 667905 681770 696219 710662 725031 739525 753954 767974 781870 796534 812547 829772
66918 829772 848020 867594 888755 910980 933242 954979 976390 997857 1019540 1041613 1064482
66907 1064482 1088527 1113916 1140806 1169369 1199341 1229842 1260115 1290320 1321227 1353197 1385877
66896 1385877 1418901 1452429 1486797 1521958 1557622 1593755 1630653 1668567 1707434 1746956 1786797
66885 1786797 1826741 1866758 1906929 1947229 1987438 2027316 2066809 2106010 2144958 2183560 2221613
66874 2221613 2258838 2295000 2330082 2364243 2397437 2429210 2459083 2487057 2513448 2538192 2560628
66863 2560628 2580054 2596304 2609656 2620414 2628772 2634834 2638453 2639251 2637101 2632445 2625676 2616336 2603510
66850 2603510 2587231 2568912 2549929 2530128 2508242 2483521 2456338 2427273 2396381 2363621 2329391
66839 2329391 2294136 2257757 2219983 2181175 2142223 2103529 2064442 2023943 1981755 1938646 1895741
66828 1895741 1853717 1812662 1772516 1733384 1695257 1657704 1620231 1582977 1546629 1511436 1476712
66817 1476712 1441723 1406776 1372936 1340732 1309701 1279217 1249248 1220081 1191766 1164157 1137217
66806 1137217 1110935 1085185 1059954 1035556 1012223 989628 967173 944738 922816 901836 881678
66795 881678 861903 842250 822750 803633 785267 768033 752030 736906 722094 707198 692187
66784 692187 677412 663492 650910 639447 628147 616151 603528 591022 579037 567219 555138
66773 555138 542967 531237 520255 510115 501017 493058 485756 478306 470431 462558 454996 447405 439405
66760 439405 431304 423700 416575 409366 401919 394862 388859 383862 379334 374830 370102 364920 359209 353274
66746 353274 347537 342036 336467 330774 325428 320980 317472 314395 311142 307429 303383 299362 295674 292344
66732 292344 289109 285674 281986 278262 274755 271542 268512 265551 262728 260287 258430 257048 255684 253769
66718 253769 250975 247450 243721 240315 237307 234286 230859 227230 224114 222003 220645 219344 217561 215088
66704 215088 211889 208228 204845 202478 200928 199034 195906 191935 188284 185582 183540 181669 179807 177907
66690 177907 175846 173721 171988 170956 170281 169205 167317 164957 162897 161627 160867 159828 158042 155852 153918
66675 153918 152366 150802 149100 147657 146730 145962 144846 143344 141791 140526 139816 139744 139798 138967 136803 134128
66659 134128 132164 131185 130618 130246 130476 131313 131856 131264 129737 128125 126864 125712 124331 122779 121443 120685
66643 120685 120514 120509 120180 119396 118370 117276 116183 115304 114856 114594 113955 112906 112116 111973 111931 111353 110549 110240
66625 110240 110283 109824 108688 107724 107441 107196 106246 105004 104447 104662 104796 104337 103671 103256 102926 102324 101470 100498
66607 100498 99249 97571 95790 94437 93638 93113 92668 92304 92004 91772 91818 92267 92746 92687 92017 91130 90201 89083
66589 89083 87969 87490 87847 88411 88621 88805 89599 90912 92001 92355 91979 90987 89470 87658 85805 83955 82221
66572 82221 81131 81165 81995 82679 82653 82107 81433 80794 80266 79897 79520 78900 78124 77449 76802 75966 75287 75524 76754
66553 76754 78064 78671 78838 79249 79918 80240 79884 79137 78469 78146 78212 78555 78962 79202 79055 78351 77206 76204
66535 76204 75899 76068 75889 75009 73968 73331 72922 72283 71373 70292 68788 66683 64598 63525 63715 64528 65397
66518 65397 66422 67878 69596 71024 71686 71462 70668 69874 69493 69478 69522 69461 69317 69047 68539 67808 66993 66167 65317
66499 65317 64422 63429 62305 61287 60870 61273 62077 62717 63175 63854 64833 65685 66036 65911 65440 64584 63331 61992
66481 61992 61123 61132 61949 63001 63614 63518 62932 62192 61519 61203 61568 62398 62767 61934 60310 59056 58747 58834 58463
66462 58463 57432 56222 55369 55015 54938 54919 55076 55694 56742 57778 58484 58972 59355 59390 58962 58538 58648 59120 59364
66443 59364 59252 59128 59116 59127 59447 60570 62250 63386 63164 61893 60506 59692 59663 60304 61179 61743 61766 61376 60613
66424 60613 59354 57767 56395 55640 55493 55858 56687 57674 58304 58451 58485 58643 58756 58786 59053 59600 59928 59719 59356
66405 59356 59238 59115 58625 58048 57855 57851 57483 56827 56556 56936 57461 57661 57767 58300 59255 59910 59450 57803 55845
66386 55845 54654 54543 55009 55574 56263 57106 57752 57953 58024 58381 58874 59028 58686 58024 57255 56747 57041 58151 59151
66367 59151 59166 58591 58580 59459 60444 60885 60904 60634 59764 58288 57000 56598 56749 56644 56161 55885 56158 56647 56865
66348 56865 56686 56263 55704 54996 54159 53448 53363 54312 56135 58066 59308 59659 59568 59640 60093 60542 60315 59158 57651
66329 57651 56715 56627 56729 56273 55332 54669 54837 55666 56591 57197 57352 57005 56160 55092 54380 54416 54901 55123 54896
66310 54896 54928 55926 57487 58349 57785 56389 55337 55186 55585 55878 55698 55095 54399 54021 54252 55103 56270 57249
66292 57249 57641 57503 57315 57402 57491 57108 56377 56001 56386 57126 57541 57370 56726 55737 54639 53960 54137 54989 55919
66273 55919 56547 56801 56513 55440 53821 52447 51909 52072 52502 53084 53906 54746 55193 55244 55386 55927 56524 56571 55863
66254 55863 54719 53575 52679 52133 51986 52189 52582 53005 53409 53850 54419 55172 56069 56964 57737 58381 58935 59351
66236 59351 59562 59616 59608 59458 58975 58227 57690 57858 58722 59708 60124 59680 58681 57802 57507 57614 57498 56826 56012 55844
66216 55844 56710 58259 59726 60497 60550 60489 61058 62420 63897 64530 63908 62440 60967 60159 60057 60001 59164 57469
66198 57469 55878 55518 56528 58042 59231 59989 60558 60910 60823 60420 60256 60794 61861 62721 62715 61832 60596 59398
66180 59398 58133 56582 54979 53896 53646 54052 54839 55929 57262 58565 59492 59942 60099 60228 60443 60702 60983
66163 60983 61444 62251 63179 63628 63285 62638 62542 63348 64722 66150 67203 67384 66308 64282 62309 61252 61203
66146 61203 61752 62503 63096 63180 62774 62400 62475 62743 62683 62317 62244 62923 64281 65965 67638 69010 69873 70176 69882
66127 69882 68832 67030 65066 63867 63900 64790 65847 66756 67609 68491 69276 69817 70160 70487 70898 71343 71774 72285
66109 72285 72956 73611 73954 73975 73986 74149 74233 74014 73617 73166 72400 71185 70212 70543 72301 74384 75722 76362 76938
66090 76938 77557 77772 77474 77161 77242 77547 77709 77653 77417 76767 75443 73790 72785 73194 74783 76498 77412 77375
66072 77375 76761 75846 74711 73645 73250 73853 74925 75418 74775 73487 72544 72417 72742 72927 72858 72847 73008 73015 72626
66053 72626 72260 72698 74135 75796 76677 76540 76003 75730 75849 76156 76559 77109 77779 78482 79262 80262 81476 82663
66035 82663 83552 84035 84185 84222 84449 84988 85540 85603 85103 84609 84713 85275 85553 85091 84244 83749 84023 84972 86295
66016 86295 87715 88983 89894 90406 90619 90645 90550 90420 90290 90008 89424 88806 88830 89817 91155 91905 92063 92779 95053
65997 95053 98523 101910 104435 106337 108110 109812 111295 112719 114473 116765 119468 122226 124571 126177
65983 126177 127163 127976 128791 129269 129109 128579 128157 127815 127051 125603 123779 122033 120497 118955 117108 114855
65967 114855 112497 110627 109595 109120 108583 107645 106374 104910 103330 101795 100436 99143 97804 96779 96734
65952 96734 97882 99688 101409 102619 103154 102944 102158 101259 100739 100910 101905 103549 105253 106488 107461 108832
65936 108832 110633 112048 112576 112846 113815 115616 117671 119542 121044 121868 121845 121499 121699 122698 123996 125176
65920 125176 126377 127908 129886 132321 135146 137981 140261 141835 143218 145156 148028 151576 155004 157502
65906 157502 159062 160691 163357 166706 169322 170302 170115 169840 170093 170867 171864 172594 172515 171482 169875 168093
65890 168093 166208 164266 162515 160975 159192 156813 154133 151638 149266 146573 143486 140370 137461 134716
65876 134716 132181 130052 128307 126702 125194 123925 122683 120835 118140 115360 113681 113587 114450 115199 115226 114679
65860 114679 114017 113329 112205 110331 108101 106399 105748 105869 106121 106128 105890 105544 105245 105169 105446 106126 107232 108634
65842 108634 109835 110255 109903 109473 109432 109417 109029 108899 110101 112507 114618 115407 115469 115813 116334 116460 116720 118331
65824 118331 121234 123855 125228 126282 128396 131575 134947 138327 142169 146346 150170 153593 157289 161273
65810 161273 164411 165755 165649 165025 164218 163030 161444 159594 157351 154587 151731 149484 148071 147169 146436
65795 146436 145653 144465 142615 140471 138761 137622 136391 134528 132376 130747 130091 130366 131453 133331 135959
65780 135959 139205 142860 146610 150158 153566 157342 161976 167519 173728 180424 187362 193882 199089 202481
65766 202481 204163 204428 203360 200945 197315 192733 187498 181961 176432 170942 165365 160017 155940 154198
65752 154198 154846 156860 159095 161177 163519 166834 171647 177917 184927 191863 198732 206439 215645 225837
65738 225837 235937 245587 255237 264950 273811 280804 285722 288807 289874 288413 284402 278427 270981 262160
65724 262160 252149 241517 230716 219699 208417 197407 187449 178680 170488 162343 154436 147369 141483
65711 141483 136651 132538 128836 125325 121939 118738 115730 112760 109739 106989 105206 104932 106089 107973
65697 107973 109698 110695 110933 110772 110582 110458 110266 109896 109421 109015 108783 108640 108399 108046 108027 109098 111693 115363
65679 115363 118954 121442 122623 123134 123947 125787 128836 132860 137624 143148 149568 156920 165238 174718 185480
65664 185480 197214 209382 221790 234687 248274 262399 276703 290638 303281 313771 322240 329779
65652 329779 336981 342897 346101 346586 345932 345622 345824 345927 345651 345267 345087 345143 345282 345299 344995 344088 342077 338322
65634 338322 332503 324934 316217 306622 296031 284351 271683 258180 244134 230146 216801 204172
65622 204172 192078 180791 170943 162627 155219 148332 142387 137829 134265 130849 127261 123854 120998 118707
65608 118707 116790 115059 113476 112248 111555 111064 110079 108464 106942 106083 105459 104418 103341 103266 104367 105655
65592 105655 106323 106606 106982 107288 107199 107166 108073 110071 112323 114055 115407 116999 119040 121283 123798 127256
65576 127256 132199 138307 144734 151039 157408 164094 171129 178727 187413 197405 208196 219133 230157
65563 230157 241578 253273 264501 274431 282565 288715 292871 295070 295172 292859 288019 280989 272255 262181
65549 262181 251246 240213 229614 219321 209020 198909 189454 180666 172173 163878 156140 149439 144292
65536 144292 141158 139760 138751 136863 134320 132331 131334 130735 130327 130685 131760 132298 131450 129986 129049 128472
65520 128472 127339 125629 124136 123009 121500 119221 116741 114719 113143 111701 110416 109583 109318 109327 109040 108108
65504 108108 106930 106439 107066 108154 108745 108654 108348 108140 108091 108430 109214 109768 109273 108037 107365 108007 109505 111280
65486 111280 113509 116410 119406 121698 123269 124646 125997 127095 128047 129381 131321 133458 135296 136763
65472 136763 137984 138775 138630 137248 134942 132367 129812 126960 123586 120276 117994 116902 116102 114797 113283
65457 113283 112374 112206 112117 111642 111078 110949 111276 111560 111312 110484 109423 108521 107909 107567 107595 108136 108957 109507 109689
65438 109689 110259 111932 114221 115780 116023 115900 116750 118782 121072 122787 123891 124691 125234 125466 125678 126380
65422 126380 127728 129296 130525 131216 131446 131132 129976 127957 125693 124034 123308 123067 122644 121831 120980 120577
65406 120577 120823 121589 122612 123645 124507 125086 125375 125510 125754 126350 127350 128538 129617 130494 131375 132589 134312
65389 134312 136463 138765 140848 142404 143368 143933 144251 144153 143387 142126 140945 140108 139192 137674 135758 134223
65373 134223 133512 133390 133524 133992 135010 136521 138369 140575 143048 145236 146577 147308 148396 150491 153334
65358 153334 156430 159893 164175 169163 174122 178658 183197 188222 193399 197937 201672 205211 208962 212486
65344 212486 215082 216606 217341 217368 216512 214796 212464 209544 205863 201604 197428 193813 190592 187355 184017
65329 184017 180694 177237 173249 168495 163070 157300 151731 147053 143645 141194 139096 137281 136306 136504 137328
65314 137328 137774 137365 136464 135697 135238 134706 133665 132161 130707 129773 129323 128977 128566 128345 128574 129067 129352 129261
65296 129261 129178 129603 130578 131703 132716 133894 135749 138402 141395 144068 145941 146770 146510 145386 143869 142372
65280 142372 141053 139942 139071 138304 137262 135700 133860 132199 130813 129463 128084 126895 125902 124707 123092
65265 123092 121541 120809 121070 121755 122272 122643 123307 124457 125686 126403 126513 126563 127037 127647 127634 126785 125842 125676
65247 125676 126314 127066 127426 127462 127346 126954 126191 125447 125391 126222 127301 127650 126862 125475 124377 123893 123556 122827
65229 122827 121793 120956 120488 120006 119162 118141 117417 117194 117254 117218 116781 115771 114279 112761 111824 111751 112285 112897
65211 112897 113250 113403 113651 114234 115077 115811 116093 115995 115997 116494 117355 118070 118311 118248 118280 118586 118980 119127 118904 118550
65191 118550 118498 118919 119432 119382 118480 117063 115666 114526 113653 113203 113489 114600 116256 118150 120191 122327 124264
65174 124264 125584 126088 125891 125236 124358 123510 122999 123066 123751 124905 126337 127957 129747 131561 133045 133844 133934
65157 133934 133667 133485 133665 134253 135114 135966 136567 136941 137343 137929 138663 139671 141406 144187 147675 151205 154628
65140 154628 158455 163034 167888 172135 175381 177944 180336 182853 185655 188874 192412 195818 198609 200724
65126 200724 202468 204050 205311 206050 206407 206709 206894 206321 204423 201555 198970 197744 197711 197648 196529 194495
65110 194495 192437 190852 189363 187351 184671 181525 177932 173736 169092 164562 160596 157190 154170 151510
65096 151510 149114 146480 143009 138737 134554 131542 130134 129910 130153 130476 130946 131658 132401 132874 133158 133697
65080 133697 134717 135895 136767 137228 137388 137100 136016 134156 132141 130725 130218 130364 130612 130477 129873 129238 129212
65063 129212 130070 131481 132777 133395 133178 132507 132117 132505 133402 134078 134258 134401 134896 135362 135172 134439 133969 134213
65045 134213 134723 134827 134443 133929 133374 132476 131131 129831 129250 129621 130634 131810 132725 132918 131977 130018 127852
65028 127852 126311 125356 124157 122142 119695 117661 116464 115976 116003 116471 117182 117790 118172 118534 119035 119545 119982
65011 119982 120623 121797 123350 124680 125372 125624 125992 126858 128208 129884 131881 134334 137190 139976 142062
64996 142062 143292 144250 145733 147926 150255 152050 153121 153588 153397 152399 150839 149415 148675 148591 148884 149524
64980 149524 150605 151879 152851 153414 154058 155218 156661 157801 158422 158815 159180 159210 158357 156329 153213 149288
64964 149288 144926 140640 137006 134400 132816 131965 131513 131219 130886 130334 129529 128755 128512 129125 130413 131828
64948 131828 132910 133548 133792 133596 132926 132036 131390 131193 131149 130797 130053 129273 128860 128912 129166 129156 128510 127376 126553
64929 126553 126863 128270 129843 130773 131111 131280 131225 130508 129138 127760 126958 126777 127031 127696 128723 129782 130519
64912 130519 130955 131435 132254 133421 134663 135565 135954 136228 137066 138637 140349 141622 142581 143726 145234 147031
64896 147031 149329 152472 156298 160203 163976 168056 172809 178008 183215 188246 192973 197124 200708 204295
64882 204295 208349 212446 215688 217799 219326 220775 222079 223011 223494 223224 221489 217855 212843 207527 202680
64867 202680 198639 195713 194094 193409 192921 192265 191509 190455 188548 185767 182990 180950 179325 177425 175316
64852 175316 173518 171866 169607 166648 163792 161481 159115 156104 152873 150242 148246 146281 144090 141987
64838 141987 140208 138656 137276 136232 135629 135386 135354 135356 135205 134973 135065 135698 136461 136826 136953 137498 138716 140242
64820 140242 141758 143297 144905 146558 148552 151339 154685 157504 158939 159329 159835 161348 163980 167286 170695
64805 170695 173989 177598 182167 187614 192945 197332 201056 205002 209431 213635 216554 217368 215698 211871
64791 211871 207028 202496 198841 195674 192379 188747 184948 181269 178053 175579 173789 172299 170887 169865
64777 169865 169718 170410 171254 171652 171848 172709 174699 177284 179563 181327 183197 185806 189203 193048 196994 200716
64761 200716 204051 207373 211482 216718 222436 227687 232214 236386 240356 243807 246539 248814 250979 253029
64747 253029 254712 255936 256921 257978 259116 259901 259829 258928 257690 256263 254050 250459 245772 240793 235856
64732 235856 230726 225403 220335 215672 210949 205894 201188 197942 196549 196327 196251 195847 195401 195443 196104 197037
64716 197037 197984 199163 200831 202686 204182 205421 207148 209694 212402 214385 215469 216044 216366 216464 216478 216543
64700 216543 216373 215382 213242 210027 205885 200991 195860 191259 187545 184319 180997 177573 174615 172594 171359
64685 171359 170240 168560 166163 163641 161989 161838 162944 164535 166143 167948 170260 172905 175345 177376
64671 177376 179470 182385 186464 191275 195892 199673 202926 206645 211416 216653 221220 224581 226895 228147
64657 228147 227939 226373 224340 222393 219927 216208 211796 208075 205495 203181 200324 197166 194362 192127
64643 192127 190452 189573 189741 190836 192680 195421 199245 203878 208760 213538 218192 222921 228160 234432 241790
64628 241790 249588 257119 264288 271315 278015 283820 288419 291858 293993 294290 292359 288383 282841 276069
64614 276069 268274 259807 251123 242497 233971 225631 217833 211005 205282 200488 196450 193064 189959 186465
64600 186465 182355 178442 175932 175120 175135 174997 174493 173944 173658 173874 174697 175765 176404 176524 176991 178652 181358
64583 181358 184394 187536 191052 194905 198650 202161 205908 210455 216044 222613 229741 236590 242426 247321
64569 247321 252006 256965 262032 266830 271069 274281 275772 275186 272873 269460 265297 260442 254930 248803
64555 248803 242083 234985 228108 222200 217648 214166 211006 207523 203630 199672 195961 192694 190223 188911
64541 188911 188509 188188 187557 187147 187434 187975 188260 188838 190500 192629 193604 192910 191573 190264 188252 184901 181059
64524 181059 178017 175902 174092 172596 171962 172142 172482 172675 172877 173022 172860 172701 173267 174671 176173 177114 177588
64507 177588 178099 179033 180549 182469 184234 185445 186529 188420 191497 195357 199684 204708 210537 216612 222262
64492 222262 227436 232462 237348 241722 245281 247949 249682 250476 250599 250499 250376 249930 248647 246302 243214
64477 243214 240024 237285 235244 233889 232956 231928 230345 228332 226543 225292 223972 221655 218212 214534
64463 214534 211822 210869 211771 213839 215918 217340 218571 220523 223279 225974 227844 228861 229370 229732 230466
64448 230466 231976 233925 235472 236496 238010 240971 245276 250340 256026 262378 268930 275117 281182 287990
64434 287990 296049 305328 315948 328472 343490 361430 382713 407513 435315 465328 497556 533152
64422 533152 573557 619687 671966 730662 795833 867152 943996 1025511 1110444 1196990 1282846
64411 1282846 1365392 1442143 1511520 1573135 1626854 1671494 1704865 1725160 1731894 1725398 1706077 1674545
64399 1674545 1631988 1579870 1519405 1451629 1377646 1298476 1214989 1128617 1041996 958325 879879
64388 879879 807391 740776 679989 625090 575990 532507 494538 461881 433901 409586 387989
64377 387989 368662 351627 336871 323892 311915 300687 290882 283364 278087 273937 269698 264916 259804
64364 259804 254669 249685 244937 240342 235610 230584 225576 221072 217119 213358 209797 207123 205922 205858 206033
64349 206033 206061 206275 206957 207985 209493 212182 216330 220815 223896 224973 225023 225201 225619 225703 225120 223856 221776
64332 221776 218713 214903 210893 207039 203382 199996 197142 195032 193639 192742 192072 191499 191228 191606 192579 193566
64316 193566 194149 194583 195226 195772 195696 195291 195476 196483 197537 198131 198784 199911 200617 199564 196793 193769 191570
64299 191570 189822 187644 184945 182273 179850 177411 174875 172637 171080 170141 169594 169538 170256 171591 172772
64284 172772 173192 173257 174118 176452 179822 183367 186714 189842 192437 194142 195482 197793 201842 206962 211937
64269 211937 216447 221100 226296 231606 236326 240157 243120 245141 246009 245672 244410 242761 241311 240468 240318
64254 240318 240645 241057 241096 240424 239048 237219 234900 231472 226392 220123 214005 209044 205128 201574 198032
64239 198032 194565 191240 188087 185336 183265 181852 180891 180329 180148 180051 179798 179860 181130 183694 186322 187537
64223 187537 187029 185698 184512 183652 182722 181486 180332 179987 180763 182045 182737 182264 180973 179526 178222 177066
64207 177066 176134 175476 174869 174036 173009 172046 171317 170973 171288 172363 173800 175124 176412 178058 179995 181777
64191 181777 183489 185961 189743 194362 199017 203618 208726 214738 221592 229130 237287 245912 254731 263424
64177 263424 271441 277819 281567 282357 280600 276826 271266 264179 256220 248213 240623 233504 226894 220974
64163 220974 215719 210594 204960 198841 193085 188564 185386 183069 181375 180515 180494 180673 180384 179790 179782 180975
64147 180975 183047 185154 186809 188243 189894 191739 193354 194716 196611 199833 203995 207665 209839 210854
64133 210854 211575 212150 212061 211094 209589 207801 205651 203306 201494 200893 201448 202462 203209 203400 203382 204056 206316
64116 206316 210274 215134 219967 224500 229033 233874 239185 245209 252262 260334 268844 276903 283842 289578
64102 289578 294557 299282 303779 307577 310346 312511 315044 318639 323183 328103 333039 338026 343103 348018
64088 348018 352388 355971 358589 359882 359399 356993 352941 347600 341135 333672 325522 317032 308394 299832
64074 299832 291850 284968 279174 273900 268598 263195 257967 253269 249480 246964 245841 245831 246456 247363 248412
64059 248412 249577 250873 252369 254252 256821 260267 264299 268115 271092 273588 276810 281737 288314 295804
64045 295804 303656 311797 320299 329100 338070 347075 355872 364075 371332 377495 382608 386701 389579 390798
64031 390798 389922 386957 382492 377314 371787 365629 358430 350437 342746 336569 332272 329294 327013 325410
64017 325410 324704 324660 324603 324009 322697 320578 317697 314514 311582 308711 304919 299631 293611 288334 284580 281956
64001 281956 279636 277208 274846 272943 271654 270742 269881 269167 269034 269579 270269 270636 271014 272215 274643 278079
63985 278079 282177 286701 291355 295926 300626 305886 311705 317652 323606 330013 337192 344886 352882 361583
63971 361583 371383 381757 391675 400954 410523 421125 432353 443540 455242 469123 486245 506079
63959 506079 527558 550735 576890 607159 641709 680470 724141 774006 830977 895329 967464
63948 967464 1048493 1139833 1242375 1356273 1481386 1617528 1764050 1919383 2081360 2248176
63938 2248176 2418820 2592247 2766125 2936514 3098724 3248315 3381477 3495125 3587094 3656129
63928 3656129 3701444 3722370 3718476 3689715 3636234 3558377 3457341 3335776 3197488 3046638 2887301
63917 2887301 2723263 2557521 2392029 2228473 2069265 1917185 1773994 1639973 1515052
63908 1515052 1399757 1294767 1200208 1115954 1042163 978797 924836 878673 839311 806607 780232
63897 780232 758996 741457 726749 714391 703622 693540 683903 675337 668457 663042 658338 654068 650824
63884 650824 649403 650007 652332 656299 662430 671536 684191 700513 720214 742704 767283 793468 821253
63871 821253 851059 883358 918154 954719 991829 1028411 1064040 1098824 1132884 1165951 1197317
63860 1197317 1226044 1251314 1272706 1290053 1302934 1310606 1312716 1309882 1303127 1292833 1278660 1260432
63848 1260432 1238497 1213026 1183636 1150235 1113896 1076355 1038731 1001114 963293 925413 887829
63837 887829 850701 813983 777705 742179 707933 675483 645121 616920 590910 567066 545091
63826 545091 524391 504388 484728 465138 445407 425782 407119 390236 375117 361014 347362
63815 347362 334362 322684 312842 304856 298245 292243 286232 280073 274024 268342 263129 258500 254647 251674
63801 251674 249490 247883 246565 245106 243032 240154 236809 233669 231230 229381 227480 224993 222130 219678
63787 219678 218040 216642 214551 211576 208535 206453 205688 205712 205571 204653 203303 202567 203033 204027 204370 203774 202966
63770 202966 202505 202151 201663 201447 201922 202716 203154 203275 203694 204534 205129 204911 204086 203248 202642 202051 201216 200166
63752 200166 199186 198562 198313 198224 198164 198223 198395 198412 198211 198363 199551 201669 203941 205933 207857 209735 210942 211086
63734 211086 210825 211224 212578 214437 216543 219039 221838 224518 227040 229925 233389 236816 239541 241839 244663
63719 244663 248524 253030 257498 261639 265514 269046 271800 273319 273629 273225 272453 271081 268824 266195 264272
63704 264272 263422 262748 261176 258731 256269 254337 252920 252113 252289 253436 254940 256297 257668 259551 262252
63689 262252 265851 270253 275059 279682 283871 287867 291866 295652 298920 301491 302980 302787 300967 298719
63675 298719 297313 296667 295658 293805 292002 291406 292124 293278 294003 294124 294111 294634 295958 297572 298537 298313 297125
63658 297125 295452 293419 290847 287705 284302 281124 278548 276579 274744 272439 269503 266305 263145 259946
63644 259946 256848 254870 255291 258146 261715 263960 264417 264441 265635 268392 272089 276298 281234 287009 293022
63629 293022 298441 303073 307346 311541 315560 319530 324218 330488 338488 347545 356801 365820 374759 384199
63615 384199 394790 406895 420451 435141 450704 467161 484883 504350 525657 548269 571525
63604 571525 595359 620163 645772 671031 694598 715775 734085 748384 757225 760279 758893 755006
63592 755006 749790 743454 735863 726978 716947 706127 694884 683066 669818 654234 636178 616226
63580 616226 595011 573027 551042 530228 511559 495238 480858 467983 456475 446459 438219 432034
63568 432034 427944 425646 424735 425073 426902 430549 435998 442701 449931 457412 465511 474673 484804 495472
63554 495472 506639 518796 532395 547546 564394 583281 604273 626950 651075 677162 705987
63543 705987 737824 772396 808986 845763 879331 906021 923926 933255 934883 929521 918483 904187
63531 904187 889147 874823 861742 850008 839109 827884 815505 802141 788022 772191 753054
63520 753054 730063 704171 676699 648457 619948 591699 564137 537564 512344 488761 466764
63509 466764 446313 427869 411933 398167 385679 374228 364353 356134 348673 341240 334205 328226 323108
63496 323108 318176 313428 309533 306790 304709 302692 300691 299098 298266 298140 298242 298127 298014 298773 301032 304481
63480 304481 308292 311989 315562 318962 322009 324795 327694 330867 334045 336879 339248 341109 342316 342782
63466 342782 342638 342025 340760 338433 334940 330860 327159 324452 322674 321465 320655 320135 319538 318518 317374
63451 317374 316919 317607 319135 320983 322983 325316 328444 333207 340382 349780 360309 371325 383383 397197
63437 397197 412473 428515 445540 464530 486079 510325 537712 568522 601255 632428 658602
63426 658602 678208 691288 698373 700284 698566 695298 692480 691758 694359 700885 711451 726346 746155
63413 746155 770746 798474 827055 855200 882856 909794 934517 954771 968811 975973 976443 971023
63401 971023 961227 949128 936520 923941 910650 895730 879146 861516 842956 822512 798848 771365
63389 771365 740661 708250 675968 645262 616717 590251 565782 543492 523420 505205 488580
63378 488580 473915 461911 452782 445946 440538 436135 433065 432069 433585 437300 442573 449341 458257 469745
63364 469745 483215 497593 512481 528433 546216 566183 588384 612851 639489 667870 697409
63353 697409 727789 759115 791513 824469 856609 886240 912055 933178 948732 957946 960932 958918
63341 958918 953333 944883 933906 921283 908358 895895 883539 870390 855697 838976 819873 798283
63329 798283 774453 748901 722366 695849 670439 646888 625478 606276 589422 575140 563779
63318 563779 555831 551526 550072 549357 546664 539845 528027 511603 491859 470467 448992 428566 409849
63305 409849 393197 378787 366584 356242 347176 338961 331700 325813 321352 317725 314266 310852 307709
63292 307709 304850 302065 299291 296574 293805 290986 288655 287409 286924 286069 284225 281932 279880 277939 275716
63277 275716 273575 272321 272047 272038 271839 271767 272215 272998 273732 274450 275510 277082 279077 281470 284381 287716 290953
63260 290953 293480 295224 296831 299134 302438 306417 310667 315169 320151 325771 332080 339148 346989 355415
63246 355415 364156 373068 382162 391556 401564 412690 425303 439376 454703 471240 489056 508129
63234 508129 528460 550256 573634 598235 623400 648731 674156 699501 724410 748749 772691
63223 772691 796251 819066 840884 862113 883708 906531 930746 955524 979238 1000265 1017878
63212 1017878 1032301 1043882 1052321 1056719 1056131 1049977 1038135 1020807 998307 971131 940394 907943
63200 907943 875521 843822 812846 783186 756252 732973 712960 695517 680926 670060 663028 658960
63188 658960 657130 657719 661395 668583 679223 692861 708861 726713 746170 766946 788441 809997
63176 809997 831216 851733 870986 888674 905250 921375 936968 951348 964163 975495 984975 991571
63164 991571 994504 993751 989321 980670 967276 949297 927216 901244 871669 839485 806095 772411
63152 772411 738691 705164 672500 641661 613495 588355 565880 545284 526127 508678 493402
63141 493402 480361 469379 460435 453486 448075 443573 439682 436326 433266 430283 427632 425798 424761 423953
63127 423953 422940 421730 420452 419265 418682 419397 421518 424383 427335 430320 433521 436894 440396 444237 448428
63112 448428 452401 455630 458472 461837 466005 470268 473829 476568 478723 480274 481086 481454 481999 483034 484398
63097 484398 486009 488129 490796 493338 494961 495771 496684 498242 500016 501452 502811 504741 507190 509388 510938
63082 510938 512339 514236 516596 518963 521308 524227 528320 533584 539552 545954 553126 561633 571527 582229
63068 582229 593334 605271 618797 634002 650235 667025 684649 703712 724630 747744 773549
63057 773549 802529 834880 870582 909525 951515 996433 1044490 1095966 1150521 1207172 1265187
63046 1265187 1324587 1385397 1446835 1507831 1568121 1628256 1688559 1748545 1807414 1864714 1920484
63035 1920484 1975075 2028839 2081645 2132603 2180430 2223929 2261866 2292659 2314755 2327249 2329526
63024 2329526 2320407 2298476 2263603 2217488 2162373 2099789 2031015 1958107 1883654 1809782 1738033
63013 1738033 1669991 1607238 1550725 1500894 1458450 1424261 1398310 1379523 1367078 1361281 1362617 1370472
63001 1370472 1383543 1401181 1423487 1450078 1479561 1510535 1542556 1575787 1610125 1645040 1679869
62990 1679869 1713806 1745846 1775308 1802382 1827707 1851287 1872043 1888383 1898843 1902204 1897541 1884570
62978 1884570 1863695 1835387 1799581 1755970 1704858 1647517 1585734 1521241 1455548 1390010 1325756
62967 1325756 1263624 1204277 1148390 1096615 1049315 1006430 967641 932617 901013 872329 845945
62956 845945 821353 798246 776415 755787 736571 719070 703083 687771 672441 657286 642971
62945 642971 629581 616456 603096 589726 576854 564723 553425 543064 533466 524084 514669 505741
62933 505741 497943 491181 484951 479395 475307 472948 471434 469647 467397 465287 463700 462349 460811 459069
62919 459069 457373 455863 454581 453726 453507 453645 453375 452256 450777 449700 448899 447411 444797 441826 439349
62904 439349 437003 433695 429168 424353 420147 416521 413078 409890 407380 405697 404623 403943 403558 403334 403110
62889 403110 402845 402637 402619 402930 403681 404816 406153 407680 409696 412442 415631 418515 420455 421368 421606 421551 421332
62872 421332 420900 420260 419547 418882 418206 417359 416246 414850 413203 411454 409885 408686 407740 406832 406034 405681 405985
62855 405985 406837 407959 409017 409656 409773 409780 410260 411237 412089 412345 412265 412414 412922 413401 413425 412835 411777 410628 409760
62836 409760 409133 408261 406788 405039 403781 403540 404250 405445 406587 407407 408159 409413 411410 413784 416150 418653
62820 418653 421594 424733 427503 429842 432231 434900 437625 440489 444167 448963 454040 458292 461810 465878
62806 465878 471553 478794 487043 496010 505470 514848 523668 532391 542241 554085 567823 582986 599438
62793 599438 617206 636017 655613 676509 700007 727243 758432 793115 830957 872301 918185
62782 918185 969859 1028003 1092235 1161561 1235403 1314000 1397741 1486364 1578891 1673894 1769456
62771 1769456 1863125 1952366 2035080 2109512 2173840 2226138 2264654 2287820 2294217 2283107 2255171
62760 2255171 2212412 2157109 2091026 2015643 1932842 1845060 1754741 1663662 1572790 1482867 1395167
62749 1395167 1311515 1233391 1161131 1094145 1031743 973573 919601 870166 825852 786741 751818
62738 751818 719742 690280 664320 642302 623333 606196 590595 576874 565063 554865 546209 539046
62726 539046 532807 526853 521484 517828 516642 517729 520537 524606 529334 534047 538747 544265 551307 559863
62712 559863 569954 582366 597964 616620 637536 660475 686027 714752 746755 782153 821302
62701 821302 864342 911141 961934 1017503 1078320 1143859 1213002 1284724 1358002 1431530 1504016
62690 1504016 1574533 1642021 1704687 1760376 1807364 1844286 1869554 1881672 1880239 1865962 1839504
62679 1839504 1800971 1750840 1690810 1623301 1550580 1474767 1398120 1322516 1248748 1176942 1107665
62668 1107665 1042128 981292 925194 873274 825040 780345 739318 702190 669008 639464 613140
62657 613140 589823 569348 551227 534759 519494 505315 492114 479758 468368 458216 449166 440623
62645 440623 432227 424340 417637 412439 408503 405156 401497 396934 391902 387775 385666 385394 385884 386357 386766
62630 386766 387295 387866 388146 387709 386282 384174 382361 381694 382016 382553 383145 384466 386784 389239 390933 392314
62614 392314 394700 398605 403278 408024 413254 419824 427850 436721 446097 456413 468378 482370 498343
62601 498343 516005 534959 554970 576364 600102 627286 658521 693651 731989 772754 815440
62590 815440 859772 905242 950755 994885 1036456 1074591 1108149 1135541 1155416 1167379 1171782 1168932
62578 1168932 1158771 1141255 1116738 1085972 1049957 1009915 967219 923202 878977 835374 793028
62567 793028 752622 714941 680442 648679 618634 589964 563642 540863 521486 504121 487749
62556 487749 472651 459643 448998 440427 433629 428263 423624 418861 413649 408438 403993 400759 398553
62543 398553 396776 395008 393467 392765 393177 394381 395972 397968 400604 403842 407315 410554 413126 414819 416031
62528 416031 417852 421430 427249 435106 444557 455148 466499 478687 492493 508833 527885 549158
62516 549158 572510 598720 628748 662630 699351 737736 777239 817871 859555 901655 943054
62505 943054 982460 1018518 1049824 1075238 1094257 1106822 1112601 1110760 1100776 1083389 1060393 1033566
62493 1033566 1003980 972314 939471 906692 875199 845805 818889 794757 773976 757188 744580
62482 744580 735758 730237 727769 728034 730444 734673 741107 750220 761524 773583 785029 795208 803846
62469 803846 810550 814761 815915 813630 807953 799375 788278 774374 757085 736386 712955 687641 661296
62456 661296 634941 609344 584419 559817 536233 515262 497681 482702 469402 457970 448879 441676
62444 441676 435653 431133 428982 429086 430330 431979 434078 436577 439132 441959 445802 450647 455368 459114
62430 459114 462170 464837 466258 465234 461755 456835 451100 444397 436683 428491 420373 412516 405109 398507
62416 398507 392771 387469 382222 377161 372581 368440 364519 360872 357757 355171 352758 350241 347730 345521
62402 345521 343766 342484 341769 341743 342216 342559 342147 341005 339879 339582 340335 341795 343536 345331 347080 348785
62386 348785 350645 352928 355615 358365 360967 363671 366892 370750 375158 380211 386125 392759 399601 406432
62372 406432 413737 422187 431885 442420 453534 465421 478366 492443 507694 524347 542722 563058
62360 563058 585587 610669 638770 670290 705408 743940 785378 829239 875285 923026 971036
62349 971036 1017201 1059889 1098402 1132007 1159111 1178166 1189149 1193387 1191860 1184404 1170758 1151640
62337 1151640 1128257 1101251 1070753 1037339 1002350 967214 932774 899366 867254 836850 808622
62326 808622 782902 759854 739600 722242 707463 694157 680858 666765 652073 637129 621684
62315 621684 605360 588453 571678 555220 538671 521915 505462 489714 474473 459587 445691
62304 445691 433819 424349 416681 409946 403821 398666 394992 392827 391542 390397 389221 388420 388287 388581 388858
62289 388858 388954 388969 389130 389903 391859 394917 397947 399707 400245 400853 402531 404970 407315 409413 411864 415120
62273 415120 419138 423885 429685 436859 445340 454906 465548 477320 489961 503030 516630 531818 550089
62260 550089 572369 598565 628026 660358 695788 734837 777724 824080 873103 923946 975845
62249 975845 1027849 1078494 1125873 1168044 1203303 1230216 1247789 1255937 1255632 1248205 1234407 1214325
62237 1214325 1188132 1156539 1120319 1079718 1034747 986038 935092 883703 833421 785584 741374
62226 741374 701412 665431 632756 603168 577047 554618 535337 518204 502485 488007 474962
62215 474962 463680 454417 446952 440422 433890 427179 420905 415654 411423 407979 405335 403555 402320 401060
62201 401060 399405 397268 394661 391850 389703 389447 391867 396795 403309 410245 416671 422304 427647 433467
62187 433467 440038 447066 454349 462150 470711 479749 488700 497307 505719 514095 522343 530159 537171 543206
62173 543206 548661 554522 561740 570514 580366 591039 603239 618415 637776 661522 689039 719706
62161 719706 753248 789161 826116 862387 896815 928883 957806 982100 1000386 1012232 1017930 1017803
62149 1017803 1012185 1001759 987439 969963 949918 927943 904539 879940 854552 829377 805544
62138 805544 783664 764194 748151 736672 729846 726734 726660 729705 735714 743666 752663 762954 775284
62125 775284 789567 804817 820169 835379 850431 865206 879594 893528 906744 918656 928350 934625
62113 934625 936401 933493 926879 917874 907171 894979 881764 868210 854457 839979 824373 807919
62101 807919 791317 775320 760786 748603 739260 732689 728691 727216 728079 730756 734752 739910 746049
62088 746049 752617 759111 765684 772927 781016 789435 797572 805361 813297 822054 832166 843830 856855
62075 856855 870889 885754 901469 917958 934991 952516 970835 990189 1010265 1030362 1050004
62064 1050004 1069245 1088423 1107884 1127953 1148835 1170311 1191674 1212159 1231253 1248406 1262595
62053 1262595 1272525 1277321 1276938 1271968 1263229 1251380 1236494 1217924 1194896 1167413 1136433 1103073
62041 1103073 1067903 1031098 992997 954251 915617 877741 841016 805546 771488 739527 710633
62030 710633 685088 662095 640794 621395 604789 591231 579954 570052 561113 552862 544752 536332
62018 536332 527669 519124 510893 503024 495635 488884 482783 477235 472153 467467 463202 459667 457307 456252
62004 456252 456244 457199 459504 463421 468440 473676 478779 484002 489362 494226 497917 500329 501654 501748 500201 496994
61988 496994 492755 488214 483518 478184 471636 463720 454790 445488 436434 427974 420123 412769 406000 400149
61974 400149 395426 391596 388193 385073 382590 381103 380406 379797 378726 377312 376181 375808 376113 376719 377515 378758
61958 378758 380601 382777 384931 387112 389655 392660 395893 399220 402854 407036 411730 416780 422253 428458
61944 428458 435715 444167 453711 464067 475070 486992 500391 515540 532111 549502 567307 585370
61932 585370 603607 621930 640145 657644 673374 686477 696964 705565 712894 718932 723214 725250
61920 725250 724811 722069 717506 711511 704113 695397 686211 678011 671805 667529 664751 663749 665431 670255
61906 670255 677749 687282 698916 712970 728817 744625 758540 769859 778700 784838 787418 785883 780553
61893 780553 771991 760266 745467 728621 711311 694285 677084 659334 641766 625463 610540 596269
61881 596269 582359 569366 557791 547394 537724 528835 521056 514361 508346 502682 497269 492116 487452
61868 487452 483831 481741 481095 481415 482482 484428 487208 490460 494103 498745 505287 514288 525750 539236
61854 539236 554064 569827 586984 606642 629428 654786 681586 709131 737257 765764 794212
61843 794212 822148 849099 874432 897505 917837 934831 947598 955449 958378 956745 950847 941409
61831 941409 930142 919013 908949 899946 892370 887323 885684 887609 893082 902036 913579 925998 938041
61818 938041 949441 959744 967387 970589 968478 960758 947066 927606 903821 877330 848490 816941
61806 816941 783319 749388 716531 685017 654862 626550 600682 577522 557069 539038 522727
61795 522727 507504 493576 481769 472507 465334 459334 453511 447038 439940 433397 428550 425005 421387
61782 421387 417329 413812 411347 409010 405877 402364 399397 396982 394448 391537 388536 385773 383640 382678
61768 382678 382942 383629 383987 384207 384850 385826 386688 387584 389058 391088 393102 394877 396669 398498 400064 401376
61752 401376 402798 404365 405710 406754 407875 409223 410414 411116 411459 411716 412002 412497 413518 415143 417059
61737 417059 418971 420831 422658 424516 426766 429884 433799 437767 441094 443721 446034 448502 451642 455814
61723 455814 460688 465297 468989 472061 475157 478381 481324 483725 485681 487423 489239 491425 493836 495603
61709 495603 495757 494155 491448 488248 484703 480856 476852 472611 467763 462237 456581 451354 446443 441382
61695 441382 436207 431592 428053 425346 422732 419604 415858 411904 408453 405993 404321 402755 400958 399265
61681 399265 398001 396824 395199 393281 391750 390801 389974 389209 389343 391027 393496 395113 395089 394181 393642 393949
61665 393949 394698 395320 395521 395241 394568 393811 393439 393769 394674 395690 396465 397097 398015 399641 402212 405758 409958
61648 409958 414037 417209 419368 421176 423307 425814 428337 430628 432631 434272 435469 436272 436768 436988 437055
61633 437055 437192 437289 436650 434556 431044 426837 422610 418602 414788 410988 406837 402088 397108 392782 389806
61618 389806 388249 387819 388256 389325 390667 391852 392566 392763 392726 392821 392910 392120 389514 385047 379583 373980 368442
61601 368442 362840 357290 352183 347807 344127 340881 337787 334655 331375 327847 324014 319927 315572 310747
61587 310747 305500 300759 297862 297057 296965 296092 294429 292895 291640 289912 287459 285056 283442 282615 282330 282419
61571 282419 282316 281185 279000 276788 275224 273697 271396 268704 266738 265866 265476 265057 264811 265194 266269 267594
61555 267594 268537 268856 269066 269891 271219 272102 272055 271748 271958 272482 272720 272779 273172 273826 274268 274622 275509 277029 278603
61536 278603 279851 280907 281853 282556 283124 283797 284262 283771 282220 280449 279298 278846 278762 278755 278380 277013 274530
61519 274530 271633 269116 267054 264996 262621 259971 257372 255430 254729 255163 255763 255587 254602 253496 252832 252715
61503 252715 252996 253414 253584 253193 252274 251072 249708 248146 246427 244731 243161 241684 240315 239226 238603 238443
61487 238443 238618 239093 239950 241078 241985 242192 241817 241472 241518 241745 241936 242290 242997 243844 244708 246003 247983 249930
61469 249930 250866 250981 251437 252719 254018 254544 254558 254646 254724 254421 253939 253870 254460 255535 256842 257992 258422 257962
61451 257962 257271 257168 257747 258490 258977 259003 258290 256803 255284 254813 255764 257615 259783 262191 264989 268185 271656
61434 271656 275157 278312 280936 283337 285886 288336 290105 291230 292368 293639 294169 293285 291647 290595 290651
61419 290651 291316 292213 293641 295819 298148 299682 300132 300045 300117 300611 301359 301978 301987 301086 299558 298216 297665 297655
61401 297655 297365 296231 294288 291841 289182 286618 284352 282190 279778 277333 275776 275812 277082 278505 279254
61386 279254 279153 278417 277431 276657 276339 276312 276373 276677 277438 278416 279168 279695 280347 281178 281939 282776 284252 286488 288845
61367 288845 290809 292645 294786 297052 298959 300481 301900 303169 304054 304846 306311 308841 312162 315990 320496
61352 320496 325909 332073 338619 345284 351848 358136 364331 370923 377928 384448 389488 393120 396389 400148
61338 400148 404433 408965 413669 418519 423332 428035 432779 437492 441644 444765 446878 448093 448147 446937 445211
61323 445211 443967 443144 441659 438947 435855 433657 432688 432408 432349 432493 432960 433914 435704 438691 442938 448411
61307 448411 455326 463829 473396 483113 492714 502784 513654 524481 533877 541201 546838 551302 554554
61294 554554 556320 556646 555816 553843 550407 545349 539033 532096 524948 517700 510477 503476 496631 489484 481787
61279 481787 474215 468115 464302 462242 460666 458970 457677 457542 458611 460506 463207 466929 471263 475157
61265 475157 478071 480632 483762 487618 491925 496815 502533 508557 514006 519054 524985 532452 540445 547493
61251 547493 553250 558319 563123 567747 572494 577727 583131 587797 591128 593184 594180 594178 593326 591903 589974
61236 589974 587405 584328 581197 578279 575417 572444 569540 567029 565060 563585 562472 561601 561059 561209 562363
61221 562363 564452 567288 571002 575785 581293 586859 592375 598394 605127 611857 617734 622720 627325 631717
61207 631717 635611 638924 642069 645553 649523 653764 657973 662065 666354 671399 677536 684654 692526 701197
61193 701197 710875 721573 733140 745546 758822 772561 785730 797195 806407 813513 818898 822818
61181 822818 825570 827780 830163 832841 835112 836088 835472 833539 830538 826469 821476 816074 810765 805642 800553
61166 800553 795505 790604 785577 779614 771985 762815 753052 743469 733856 723489 712281 700984 690130
61153 690130 679381 668401 657883 649018 642114 636382 631035 625886 620765 615108 608518 601277 593890
61140 593890 586466 578894 571336 564182 557687 551988 547380 544266 542783 542535 542731 542708 542566 543243 545644 549762
61124 549762 555003 561356 569589 580171 592606 606187 620846 636840 654130 672713 693141 715957
61112 715957 740734 766357 792248 818666 845733 872805 899100 924391 948676 971488 992031
61101 992031 1009949 1025519 1038984 1049961 1057742 1061995 1062860 1060370 1054232 1044424 1031744 1017314 1001672
61088 1001672 984685 966216 946428 925492 903620 881414 859594 838145 816419 794394 773264
61077 773264 754203 737029 720699 704808 689956 676818 665471 655628 647005 639375 632645 626951
61065 626951 622475 619260 617360 617000 618201 620413 622925 625573 628737 632739 637560 643130 649560 657139
61051 657139 666266 677231 689779 703141 716924 731799 748871 768464 789942 812672 836698 862457
61039 862457 890265 920246 952477 987049 1024065 1063594 1105620 1150181 1197592 1248248 1302118
61028 1302118 1358802 1418095 1479975 1543941 1609241 1676318 1747283 1824409 1908965 2002348 2107398
61017 2107398 2227332 2364049 2519105 2696411 2902998 3147786 3441061 3794345 4218030
61008 4218030 4718269 5297899 5961169 6716785 7577611 8561109 9690818 10992896 12487378
60999 12487378 14182677 16073505 18125494 20239864 22230867 23864332 24956969 25467241
60991 25467241 25504864 25260563 24924588 24645613 24514301 24533692 24587336 24459187 23925774 22865855
60981 22865855 21308663 19397639 17314947 15223129 13241701 11444769 9866040 8508677
60973 8508677 7358150 6392554 5587655 4919167 4364556 3903908 3519708 3196765 2922524
60964 2922524 2686856 2481511 2300177 2138597 1993736 1862926 1744372 1637833 1543514 1460248
60954 1460248 1385760 1318588 1258510 1204889 1155824 1109488 1065356 1023526 983616 945080 908084
60943 908084 873371 841382 811945 784650 759243 735790 714540 695392 677507 659896 642398
60932 642398 625575 609666 594314 579503 565915 553889 542661 531246 519617 508454 498104
60921 498104 488409 479321 471090 463887 457606 451934 446374 440464 434364 428991 425153 422724 420961 419405
60907 419405 418032 416802 415643 414822 414756 415388 416159 416731 417372 418583 420567 423078 425480 426966 427099 426257
60891 426257 425299 424702 424238 423433 422004 419810 416892 413737 411078 409046 406769 403177 398062 392103 386035
60876 386035 380238 375030 370831 367766 365408 363223 361131 359415 358208 357385 356942 357159 358265 360098 362247
60861 362247 364449 366716 369200 372058 375348 378884 382284 385320 388204 391330 394774 398274 401726 405398
60847 405398 409561 414077 418512 422465 425633 427730 428661 428733 428473 428149 427558 426355 424516 422407 420419 418568
60831 418568 416510 413994 411235 408673 406404 404043 401209 397987 394774 391829 389114 386423 383417 379681
60817 379681 375098 370123 365407 361072 356672 351954 347298 343221 339745 336629 333999 332298 331575 331246 330690
60802 330690 329822 328937 328223 327628 327053 326447 325826 325344 325225 325474 325758 325821 325916 326605 328148 330317 332797 335542
60784 335542 338656 342100 345600 348768 351397 353747 356447 359933 364025 368310 372781 377806 383529 389722
60770 389722 396231 403124 410342 417637 424964 432502 440049 446949 452887 458283 463540 468423 472691 476834
60756 476834 481464 486281 490398 493562 496337 499129 501861 504687 508276 513018 518522 524266 530295 536940
60742 536940 544227 551847 559394 566401 572500 577940 583629 590322 597924 605827 613658 621379 628968 636494
60728 636494 644417 653342 663325 673617 683167 691317 698061 703807 708839 712944 715552 716224 714915 711821
60714 711821 707216 701471 694916 687546 679141 669790 659970 649923 639307 627794 615686 603565 591523
60701 591523 579227 566580 553887 541400 529176 517408 506456 496348 486586 476666 466600 456767
60689 456767 447453 438699 430381 422215 413819 405105 396644 389383 383829 379607 375926 372337 368818 365290
60675 365290 361525 357644 354249 351665 349368 346742 344197 342876 343152 344087 344649 344807 344942 344714 343263 340380
60659 340380 336872 333705 331276 329555 328507 328161 328466 329273 330384 331720 333492 336069 339509 343381 347244
60644 347244 351045 354769 357962 360074 361154 361748 362175 362366 362403 362646 363233 363876 364313 364605 364898 365329 366255
60627 366255 368059 370403 372109 372161 370592 368174 365601 363282 361503 360294 359298 358174 356937 355573 353613
60612 353613 350687 347315 344464 342311 340060 337205 334335 332311 331156 330244 329264 328404 327731 326999 326165 325586
60596 325586 325416 325178 324301 322941 321938 321887 322473 322775 322146 320744 319319 318541 318472 318631 318522 318128 317867 318157
60578 318157 319101 320548 322340 324412 326750 329372 332413 336126 340651 345745 350873 355788 360959 367211
60564 367211 374902 383631 392762 401862 410461 417763 423061 426295 427759 427428 425096 421187 416794 412715
60550 412715 408945 405371 402476 401024 401409 403695 407878 413672 420325 427217 434476 442565 451410 460475
60536 460475 469508 478544 487138 494220 499009 501629 502572 501966 499715 496125 492018 488224 485062 482268 479415
60521 479415 476483 473964 472279 471181 470047 468692 467561 467140 467527 468629 470381 472697 475492 478868 482878
60506 482878 487191 491499 496403 503244 512832 524935 539359 556756 577692 601585 627503 655655
60494 655655 686930 720984 755841 789656 821963 852687 880652 903726 919913 927750 926141 914703
60482 914703 894265 866445 832734 794449 753399 711884 671764 633955 598993 567588 540231
60471 540231 516613 495868 477305 460653 445738 432263 419960 408710 398571 389777 382601 376994
60459 376994 372439 368381 364662 361237 357674 353480 348972 345235 342881 341276 339424 337257 335475 334292
60445 334292 333051 331273 329493 328548 328302 327609 325637 322817 320301 318730 317840 317144 316517 315938 315125 313871
60429 313871 312570 311944 312277 313302 314757 316502 318069 318756 318537 318330 318919 320047 321045 321872 322912 324068
60413 324068 324854 325270 325856 326827 327797 328423 328760 328910 328978 329450 330882 332950 334501 334951 335054 335819 337232 338619
60395 338619 339820 341298 343275 345426 347376 349006 350277 351203 351992 352849 353650 354183 354712 355899 358025 360582
60379 360582 362833 364603 366351 368509 370927 373025 374399 375082 375151 374439 373012 371725 371672 372982 374732 376222
60363 376222 377685 379405 380834 381281 381068 381270 382444 384295 386431 388763 391170 393440 395663 398174 401099
60348 401099 404426 408552 414098 420982 428235 434942 440909 446238 450802 454461 457319 459310 459881 458462
60334 458462 454993 449764 443091 435499 427880 420979 414890 409404 404661 401015 398403 396307 394341 392543
60320 392543 391088 389972 388983 387793 386236 384773 384421 385770 388202 390557 392523 394762 397680 400842 403953
60305 403953 407745 413291 420841 429984 440637 453024 466660 480122 492146 502405 510854 516883 519702
60292 519702 519334 516628 512348 506763 500156 493182 486476 480181 474074 467900 461384 454185 446200 437894
60278 437894 430034 423074 416888 411088 405403 399780 394280 389031 384269 380245 376951 373914 370499 366611
60264 366611 363011 360608 359446 358615 357173 354928 352298 349795 347740 346159 344734 343107 341372 339987
60250 339987 339089 338343 337647 337502 338192 339109 339457 339318 339389 339937 340731 341836 343647 346031 348236 349881 351376
60233 351376 353070 354670 355929 357344 359585 362538 365436 367755 369607 371411 373485 375883 378363 380595
60219 380595 382526 384323 385973 387349 388822 391239 394879 398892 402310 405275 408647 412742 417155 421701
60205 421701 426737 432434 438436 444393 450263 455821 460468 463973 467009 470521 474757 479252 483479 487090
60191 487090 489744 491249 491912 492358 492815 492865 492029 490359 488270 485987 483412 480464 477288 474078 470847 467494
60175 467494 464020 460581 457359 454462 451877 449415 446730 443564 440020 436570 433743 431782 430580 429806
60161 429806 429103 428241 427184 426048 425013 424274 423967 424025 424210 424391 424739 425519 426781 428406 430327 432434 434363
60144 434363 435783 436921 438443 440633 443080 445322 447478 449930 452697 455546 458561 462165 466528 471225
60130 471225 475565 479139 481998 484363 486183 487007 486504 485089 483746 483152 483280 483961 485297 487165 488817
60115 488817 489639 490098 491277 493465 495807 497346 497872 497635 496809 495516 494010 492564 491363 490536 489970 489037
60099 489037 486957 483608 479632 475651 471780 468027 464645 461797 459333 457266 456017 455809 456208 456711 457473
60084 457473 458906 460832 462627 464066 465480 467173 469174 471485 474006 476241 477639 478314 478935 479778 480322
60069 480322 479891 478218 475316 471351 466902 462835 459526 456549 453348 449803 445827 441021 435261 429243
60055 429243 423795 418928 414210 409858 406622 404575 402853 400861 399088 398380 398957 400551 402998 406121 409387
60040 409387 412331 415235 418845 423381 428217 432528 435868 438101 439219 439438 439201 438872 438557 438277 438053 437657
60024 437657 436532 434188 430667 426436 421878 417002 411622 405752 399735 393976 388559 383280 378084 373268
60010 373268 369053 365167 361253 357580 354931 353723 353632 354152 355036 356021 356721 357232 358365 360696 363674 366338
59994 366338 368759 372012 376617 381723 386139 389659 392934 396400 399857 402967 405720 408306 410790 413046
59980 413046 414915 416320 417277 417815 417987 417972 418026 418151 417863 416511 413859 410206 405981 401495 397061 393006
59964 393006 389448 386376 384089 383171 383752 385067 386111 386544 386680 386819 387068 387612 388647 389976 391163 392215
59948 392215 393637 395575 397348 398196 398195 397985 397841 397532 397065 396948 397475 398128 398114 397258 396070 395037 394230 393514
59930 393514 392713 391454 389271 386206 383117 381041 380255 380131 379849 379077 378004 376952 376052 375159 374115 373127
59914 373127 372752 373316 374475 375602 376513 377528 378943 380806 383170 386036 388988 391397 393267 395345 398049
59899 398049 400739 402561 403657 404943 406913 409371 412235 415841 420187 424518 428058 430795 433224 435702
59885 435702 438462 441934 446418 451409 455707 458445 459911 461266 463523 466764 470180 472837 474488 475682
59871 475682 477022 478372 478978 478346 476707 474486 471555 467430 462199 456848 452454 449313 447135 445833 445672
59856 445672 446688 448494 450866 454158 458829 464831 471736 479275 487456 496276 505487 514425 521912 526754
59842 526754 528800 529246 529411 529422 528671 527257 526076 525355 523969 520559 514690 506655 496893 486251 476138
59827 476138 467614 460515 454085 448130 442845 437804 432089 425625 419602 415233 412510 410448 408108 405044
59813 405044 401166 396677 392172 388450 386037 384762 383772 382126 379630 377056 375327 374579 374275 374045 373893
59798 373893 373591 372535 370497 368097 366086 364468 362770 360968 359613 359001 358651 357856 356543 355358 354891
59783 354891 354998 355017 354592 354086 354062 354544 355023 355088 354716 353999 352967 351833 351090 351182 352241 354173 356713 359306
59765 359306 361327 362669 363872 365463 367430 369530 371793 374406 377368 380600 384144 387907 391458 394511
59751 394511 397449 400915 405051 409530 414163 418913 423381 426954 429547 431714 433872 435974 438040 440408
59737 440408 443088 445463 447119 448550 450451 452559 453831 453661 452407 450812 449505 449134 450240 452546 454773
59722 454773 455760 455665 455627 456327 457374 458188 458962 460264 461966 463084 462804 461327 459616 458554 458462 459143 460199
59705 460199 461465 463302 466229 470101 473919 476786 478841 480900 483376 485985 488345 490322 491792 492644
59691 492644 493219 494231 495970 497894 499252 499727 499224 497530 494695 491504 488971 487334 485975 484345 482566
59676 482566 481024 479683 478068 475781 472820 469454 465897 462199 458430 454828 451653 448904 446325 443711
59662 443711 441048 438368 435724 433398 431829 431131 430905 430788 430981 431926 433561 435234 436343 436805 436894 436875 436828
59645 436828 436672 436318 435938 435936 436384 436518 435235 432258 428598 425609 423736 422376 420825 419039 417421 416177
59629 416177 415155 414277 413842 414221 415334 416583 417249 416870 415434 413447 411764 411005 411038 411202 411022 410416 409198
59612 409198 406887 403314 399063 395027 391756 389443 388171 387765 387682 387566 387753 388731 390235 391385 391718 391573
59596 391573 391433 391405 391500 391908 392637 393188 392955 391907 390694 390075 390220 390519 390142 388941 387664 387091 387054 386632
59578 386632 385234 383114 380885 378882 377091 375295 373228 370830 368428 366383 364595 362656 360499 358514
59564 358514 357056 356240 356116 356542 356897 356556 355806 355659 356534 357739 358518 358987 359657 360680 362084 364186 367106
59547 367106 370285 373131 375907 379413 384101 390006 397215 405718 414991 424402 433992 444452 456551 470921
59533 470921 487713 505472 520677 529684 531496 528048 521891 514520 506982 500689 496745 495085 494985 496018
59519 496018 497987 500400 502634 504409 505616 505938 505082 503208 500667 497419 493066 487410 480724 473576 466538
59504 466538 459890 453439 446782 439881 433057 426399 419668 413009 407187 402682 399037 395648 392737 390885
59490 390885 389989 389470 389357 390298 392492 395381 398498 401889 405473 408724 411392 414031 417373 421580 426504
59475 426504 432294 439219 446995 454688 461262 466114 469315 471531 473463 475086 475649 474724 472984 471606 471121
59460 471121 471339 472242 474359 478133 483412 489831 497332 505960 515381 525024 534697 544779 555665 567256
59446 567256 579111 590852 602078 611955 619328 623487 624618 623220 619289 612494 603069 592074 580636
59433 580636 569374 558731 549387 541843 535722 529929 523524 516351 509056 502858 499122 498622 501089 505695
59419 505695 511999 520107 529990 541203 553492 567253 582960 600385 618836 638006 657953 677920
59407 677920 695491 707379 711303 707147 696594 682098 666286 651706 640284 632709 628623 627428
59395 627428 628348 629499 627666 619928 605579 586117 563689 540227 517752 498194 482199 468734
59383 468734 456475 445276 435867 428606 423177 419191 416380 414286 412449 410999 410506 411108 412185 413106
59369 413106 413949 415269 417357 419916 422329 424154 425469 426810 428721 431382 434705 438668 443305 448470
59355 448470 453858 459302 464924 471142 478646 488124 499545 511877 523996 535966 548986 563942 580382
59342 580382 597041 612981 628024 642386 656204 669217 680736 690072 697060 701930 704596 704471 701193
59329 701193 695183 687233 677850 667341 656216 645095 634268 623706 613402 603449 593898 584797 576331
59316 576331 568685 561947 556328 552312 550148 549307 548843 548343 548236 549199 551559 555336 560465 566807 574168
59301 574168 582480 591813 602140 613176 624406 634877 642860 646170 643437 635208 623572 610602 597270
59288 597270 583785 570570 558442 547968 539113 531786 526380 523387 522633 523399 525299 528565 533340 539164
59274 539164 545426 551969 558957 566535 575026 585031 596745 609324 621564 633100 644296 654955
59262 654955 663875 670050 673746 675891 676678 675217 670475 662313 651731 640297 629235 618821 608650
59249 608650 598483 588575 579206 570343 562067 554903 549246 544726 540671 537096 534647 533553 533287 533392
59235 533392 534072 535575 537498 539208 540657 542196 543763 544843 545234 545191 544640 542802 539009 533479 526925
59220 526925 519746 512092 504411 497223 490378 483168 475380 467734 461025 455276 450081 445422 441660 438851
59206 438851 436525 434184 431782 429682 428319 427847 427979 428206 428295 428482 429035 429842 430646 431534 432827 434610 436681
59189 436681 438977 441714 445075 449036 453500 458295 463042 467374 471424 475751 480657 485879 491139 496620
59175 496620 502553 508571 513888 518053 521297 524248 527685 532388 538727 546283 554239 562303 570878 580146
59161 580146 589455 598072 606159 614336 622292 628561 631964 632790 632145 630517 627495 622642 616113 608455 600303
59146 600303 592284 584700 577187 569077 560282 551454 543189 535554 528605 522834 518599 515435 512441 509265
59132 509265 506298 503996 502391 501275 500535 500281 500853 502646 505727 509688 514069 518845 524286 530467 537201
59117 537201 544371 552091 560538 569770 579622 589657 599380 608644 617560 625829 632579 637310 640730 644146
59103 644146 648210 652645 656939 660693 663411 664676 664619 663788 662497 660756 658660 656269 653201 649078 644399
59088 644399 640154 636450 632326 627196 621701 616738 612420 608437 604667 600756 595764 589087 581354 573714
59074 573714 566477 559049 550955 542304 533527 525324 518628 513871 510299 506560 501971 496819 491668 486970
59060 486970 483129 480183 477438 474092 470250 466710 463791 461063 458207 455348 452412 449120 445926 444054
59046 444054 443950 444420 443977 442498 440861 439511 438312 437468 437585 438727 440252 441751 443473 445575 447613
59031 447613 449164 450490 452208 454637 457761 461582 466135 471415 477582 484987 493670 503004 512215 521114
59017 521114 529986 538855 547300 554968 561907 568326 574276 579549 583605 585677 585398 583408 580977 578945
59003 578945 577404 576382 576256 577233 579037 581483 584881 589353 594166 598365 601781 604766 607157 608282 608015
58988 608015 607039 605916 604491 602491 600119 597677 594988 591675 587805 583958 580817 578889 578493 579720 582506
58973 582506 586861 592916 600619 609563 619271 629505 640182 651166 662307 673600 685082 696598
58961 696598 707758 718086 727184 734801 740776 744921 747052 747126 745263 741547 736034 729001 720847 711532
58947 711532 700542 687853 674572 662038 650505 639372 628519 618652 610397 603875 599149 596144
58935 596144 593882 590785 586246 581176 576545 572201 567757 563848 561536 560832 560618 559857 558205 555653 552313
58920 552313 548549 544879 541722 539462 538391 538228 538075 537441 536968 537588 539242 541100 542801 544753 547397
58905 547397 550922 555641 561897 569489 577886 587149 598079 611157 625738 640528 654519 667308 678824
58892 678824 689039 697987 706059 714244 723730 735000 747551 760689 774203 787947 801246 813303
58880 813303 823864 832867 839846 844362 846715 847362 845861 841326 833873 824594 814043 801721 787377
58867 787377 771875 756371 741403 727276 714598 703814 694661 686562 679192 672290 665391 658241 651116
58854 651116 644333 637730 631000 624148 617290 610298 603083 595964 589361 583293 577531 572045 566936 562057
58840 562057 556976 551292 544883 538032 531399 525574 520486 515522 510445 505875 502626 500784 499662 498495
58826 498495 497037 495713 495289 496165 497883 499607 501134 503071 505970 509792 514352 519654 525428 530901 535568
58811 535568 539793 544161 548565 552486 555842 558929 561640 563364 563696 562775 560864 558021 554333 550127 545762
58796 545762 541313 536592 531451 526041 520772 515954 511539 507430 503931 501482 499895 498376 496554 495040
58782 495040 494553 494957 495580 496176 497005 498226 499784 501690 503780 505329 505549 504465 502632 499969 495675 489582
58766 489582 482869 476935 472062 467728 463791 460551 457862 455024 451819 448985 447265 446418 445686 445015 445259
58751 445259 447142 450416 454207 457817 461005 463765 466146 468257 470250 472369 475082 478961 484199 490401
58737 490401 496987 503698 510474 517110 523323 529090 534549 539715 544585 549399 554360 559120 562987 565665
58723 565665 567446 568701 569576 570207 570726 570963 570656 570067 569912 570410 570961 571118 571429 572839 575551 578952 582430
58706 582430 585743 588640 590602 591157 590201 587866 584182 578997 572203 563977 554685 544484 533245 521111
58692 521111 509008 498184 489156 481452 474456 468121 462677 458005 453625 449166 444620 440265 436464 433420
58678 433420 431038 429143 427787 427119 426918 426630 426004 425411 425427 426346 428205 430944 434402 438426 443098 448602
58662 448602 454757 461053 467234 473413 479391 484336 487493 488842 488732 487195 484151 480100 476094 472847
58648 472847 470133 467200 463645 459835 456456 453789 451581 449592 447920 446605 445363 444096 443300 443335 443598
58633 443598 443235 442519 442634 444090 446208 448333 450546 452874 454738 455735 456243 456723 457169 457778 459390 462484
58617 462484 466321 469819 472825 475963 479733 484453 490468 497566 504552 510285 514846 518961 522637 525302
58603 525302 527057 528769 530841 532713 533728 533827 533229 532036 530357 528394 526253 523984 521869 520342 519647
58588 519647 519830 520989 523205 526388 530512 535820 542460 550103 558259 566740 575383 583565 590555 596302
58574 596302 601429 606557 611985 617846 624106 630460 636657 642893 649677 657480 666754 677924 690978 705312
58560 705312 720431 736478 753663 771482 789044 805870 821787 836281 848548 858088 864748 868407
58548 868407 869189 867838 865297 861944 857678 852547 846768 840266 832716 823933 813798 801977 788235 772886
58534 772886 756600 739939 723430 707699 693024 679098 665780 653732 643785 636054 630244 626313
58522 626313 624105 622803 621588 620523 619971 619566 618749 617961 618175 619340 620387 620744 620868 621290 622143 623672
58506 623672 626107 628850 630816 631876 633022 634805 636464 637041 636577 635721 634762 633500 631703 629371 626845
58491 626845 624698 623182 621899 620476 619410 619597 621197 623737 627212 632271 639223 647627 656907 666749
58477 666749 676908 687382 698605 710646 722289 731912 739300 745627 751579 756493 759416 759895 757575
58464 757575 752258 744883 737417 731201 726172 722034 719174 717891 717676 718001 719137 721555 725125 729506 734703
58449 734703 740593 746340 750886 753776 755109 755041 753656 751052 747311 742600 737331 731891 726356 720974 716699
58434 716699 714468 714026 714340 715202 717503 721847 727785 734571 741734 748795 755470 762464 770998 781164 791604
58419 791604 801137 809669 817176 822968 826633 828683 829544 828716 825708 821097 815949 810733 805414 800076 794858
58404 794858 789674 784417 779061 773477 767775 762885 759928 758759 758036 757064 756634 757696 760151 763415 767197
58389 767197 771177 774764 777766 780564 783194 785113 786291 787619 789687 792044 794127 796092 798239 800569
58375 800569 803346 807107 811660 816139 820559 826091 833203 840803 848056 855786 865028 875321 885531 895457
58361 895457 905525 915755 926149 937351 949806 962876 975687 988166 1000255 1010912 1019007 1024726
58349 1024726 1029127 1032814 1035971 1039166 1043132 1048057 1053790 1060378 1067854 1076061 1085196 1095849 1107983
58336 1107983 1120689 1133538 1147229 1162193 1177543 1192262 1206520 1220902 1235138 1248617 1261422
58325 1261422 1273933 1286021 1297453 1308436 1318997 1328490 1336481 1343430 1349914 1356018 1362123 1369306 1378140
58312 1378140 1387922 1397763 1407629 1417790 1428342 1439914 1453640 1469699 1487017 1505018 1524279 1544787
58300 1544787 1565177 1584656 1604130 1624379 1644678 1664421 1684466 1705542 1726829 1747517 1768295
58289 1768295 1789990 1812289 1835193 1860040 1887364 1915413 1942555 1969734 1998754 2029689 2061864
58278 2061864 2095805 2132118 2169765 2207593 2246384 2287418 2330305 2374281 2420257 2469433 2521095
58267 2521095 2574026 2628842 2686732 2747155 2809097 2873457 2941772 3013597 3087437 3163275 3241877
58256 3241877 3322708 3404750 3488383 3574288 3661718 3750033 3840628 3935072 4032787 4132915 4236906
58245 4236906 4346781 4462483 4583629 4712121 4850082 4996818 5150821 5313261 5486484
58236 5486484 5670764 5865616 6072569 6293488 6528072 6776387 7041862 7328188 7635443
58227 7635443 7963111 8314664 8694962 9105459 9546715 10023565 10542855 11108042 11721220
58218 11721220 12388882 13120652 13924163 14806406 15778439 16853860 18045250 19368117 20846523
58209 20846523 22509943 24388547 26519099 28953722 31757824 35005437 38787111 43221096
58201 43221096 48449382 54624576 61902695 70433170 80335940 91690451 104562399 119041897
58193 119041897 135249288 153316321 173373459 195523758 219767149 245902728 273442541
58186 273442541 301470269 328396882 351825167 368894497 377149338 375418060 364094106
58179 364094106 344744389 319494180 290591219 260163796 230023443 201505859 175439841
58172 175439841 152234316 131985976 114565404 99706066 87092370 76409418 67355368
58165 67355368 59653381 53070646 47420752 42548910 38324851 34646705 31436452 28626061
58157 28626061 26152962 23966394 22027719 20302511 18758485 17370506 16120292 14990508
58149 14990508 13964644 13031974 12186404 11420211 10723695 10090072 9515150 8992614 8514631
58140 8514631 8076486 7675612 7306515 6961563 6636532 6330812 6042558 5768266 5507019
58131 5507019 5260669 5029655 4812459 4608958 4420290 4245397 4081380 3927217 3783585
58122 3783585 3649292 3521578 3399899 3285779 3178804 3076195 2976608 2881163 2790538 2704070
58112 2704070 2621878 2544836 2472202 2402014 2333952 2269239 2207790 2148249 2090706 2036515 1985348
58101 1985348 1935276 1885933 1838853 1794462 1751413 1709239 1669049 1631153 1594459 1558687 1524913
58090 1524913 1493459 1463349 1434210 1406689 1380679 1355096 1329635 1304882 1280615 1255980 1231403
58079 1231403 1208266 1186551 1164836 1142756 1121387 1100953 1080245 1058710 1037233 1016507 996357
58068 996357 976963 959027 942471 926592 911611 898384 886541 874673 862510 851149 841023
58057 841023 831291 821289 810838 799210 785716 771395 758225 746575 735264 724105 714289 706065
58045 706065 698220 690276 683076 676736 670070 662619 655347 648669 641688 634056 626703 619947 612652 604116
58031 604116 595187 586714 578453 570297 562990 556728 550449 543431 536268 529499 522597 515157 507842 501286
58017 501286 495180 489161 483531 478448 473547 468926 465346 462850 460413 457551 455010 453197 451276 448634
58003 448634 446035 444443 443753 443542 444031 445447 447349 449357 451688 454305 456478 457877 459166 460859 462534
57988 462534 463813 465099 466533 467278 466708 465431 464209 462674 460073 456638 453282 450411 447841 445490 443482
57973 443482 441863 440675 439949 439359 438436 437328 436709 436664 436493 435904 435514 435733 436045 435932 435669 435603 435376 434417
57955 434417 432590 429897 426254 421952 417586 413112 407806 401643 395842 391490 388435 386149 384800 384714 385539
57940 385539 386755 388499 391109 394348 397754 401384 405617 410573 416129 422119 428124 433468 437754 441005
57926 441005 443090 443584 442380 439820 436078 431137 425516 420063 414747 408635 401534 394718 389382 385164
57912 385164 380787 375465 369216 362539 356331 351390 347435 343344 338761 334605 331489 328651 325161 321300
57898 321300 317840 314746 311529 308319 305664 303643 301892 300184 298449 296690 295343 295103 295850 296370 295726
57883 295726 294336 293173 292592 292496 292832 293134 292313 289791 286290 282796 279325 275519 271763 268759 266488 264487
57867 264487 262706 261212 259570 257489 255790 255737 257569 260419 263470 266471 269427 272555 276386 281199 286538
57852 286538 291851 297269 303095 308887 313794 317605 320783 323678 326326 328717 330607 331300 330303 328054 325428
57837 325428 322754 319859 316816 314020 311752 310160 309327 308876 307912 305971 303585 301373 299177 296954 295856
57822 295856 297209 300619 304209 306732 308481 310129 311714 313069 314381 315853 317219 317846 316982 313894 308283
57807 308283 300728 292395 284252 276733 269994 264061 258835 254312 250701 248047 245945 243943 242002 240255
57793 240255 238708 237573 237450 238619 240472 242189 243652 245092 246278 246823 247076 247846 249339 251057 252722
57778 252722 254558 256641 258642 260349 261919 263538 265195 266802 268090 268480 267505 265377 262769 260083 257239
57763 257239 254018 250210 245584 240110 234126 228056 222227 217172 213557 211261 209027 205729 201730 198361
57749 198361 196357 195486 195349 195728 196277 196667 197039 197675 198337 198563 198445 198388 198192 197187 195282 193209 191639
57732 191639 190669 190178 190041 190003 189939 190192 191046 191945 191977 191153 190484 190677 191483 192422 193409 194382 194951 194821 194173 193333
57712 193333 192399 191319 190070 188680 187355 186509 186354 186538 186540 186223 185591 184327 182228 179902 178283 177506 176989
57695 176989 176526 176520 177089 177744 178165 178587 179233 180006 180910 182147 183615 184959 186357 188635 192364 197436 203793
57678 203793 211940 222408 235293 250696 269073 290680 315055 341534 370083 401387 436348 475548
57666 475548 518649 563690 606895 643202 667135 673994 661642 631928 590065 542087 492647 444751
57654 444751 400501 361334 327823 299774 276577 257385 241286 227595 215985 206273 198253 191741
57642 191741 186571 182542 179525 177514 176300 175239 173793 172241 171419 171647 172341 172735 172586 172146 171764 171591
57626 171591 171388 170660 169252 167689 166517 165512 164137 162619 161794 161857 162010 161590 160818 160103 159228 157687 155466
57609 155466 153110 151275 150367 150312 150441 149930 148563 146879 145521 144733 144457 144442 144211 143362 142059 140821 139786
57592 139786 138607 137109 135532 133982 132243 130294 128483 126964 125426 123630 121772 120100 118593 117265
57578 117265 116366 116016 115988 115979 115761 115035 113635 111943 110538 109352 107782 105799 104190 103374 102713 101510 100072
57561 100072 99208 99106 99342 99677 100276 101318 102833 104789 106946 108800 110027 110861 111810 113064 114387 115444
57545 115444 116138 116732 117658 118915 119730 119235 117536 115677 114515 114108 114232 114786 115486 115829 115732 115625 115569 114955
57527 114955 113541 112186 111913 112625 113363 113501 113143 112589 112067 111878 112280 113172 114174 114961 115380 115444 115473 115955
57509 115955 116974 117954 118226 117701 116864 116291 116287 116667 116803 116257 115454 115195 115373 114861 113017 110659 109002 108195
57491 108195 107558 106781 106117 105653 105198 104838 104951 105539 106044 105957 105319 104581 104174 104210 104403 104299 103740 102992 102358
57472 102358 101877 101466 101072 100496 99408 97788 96171 95179 94947 95093 95057 94453 93378 92375 91803 91323 90527
57455 90527 89859 90148 91219 91965 91962 91998 92519 92753 92133 91588 92283 93756 94530 94177 93605 93487 93510 93278 93058 93415
57435 93415 94623 96487 98324 99319 99368 99301 99744 100187 99901 99296 99371 100126 100679 100879 101611 103254 104896 105526
57417 105526 105135 104205 102913 101419 100284 99984 100336 100835 101225 101444 101402 101231 101431 102302 103386 103768 102825 100639
57399 100639 97953 95877 95270 96055 97293 98146 98685 99605 101329 103549 105443 106209 105575 104025 102457 101520
57383 101520 101329 101802 103002 104935 107194 109103 110337 111212 112193 113172 113477 112720 111377 110236 109422 108446
57367 108446 107203 106336 106372 106997 107561 107939 108452 109209 109988 110574 110869 110789 110479 110447 111063 112008 112582 112513 112091 111626
57347 111626 111114 110432 109631 109009 108982 109686 110627 111058 110902 110850 111247 111381 110436 108727 107341 106804 106747 106699 106448
57328 106448 105716 104282 102556 101437 101350 101848 102282 102431 102387 102253 102169 102353 102948 103944 105176 106241 106583 105984
57310 105984 104857 103832 103198 103033 103524 104724 106203 107423 108263 108768 108683 107831 106748 106305 106753 107663 108696
57293 108696 109844 111052 112179 113238 114165 114524 114080 113475 113622 114529 115426 115949 116398 116947 117437 117998 118973
57276 118973 120162 120976 121455 122296 123765 125461 127235 129327 131403 132598 132954 133745 135798 138433 140670
57261 140670 142488 144084 144865 144295 143144 142812 143670 144930 145878 146381 146406 146000 145708 146217 147427 148403 148387 147481
57243 147481 146344 145604 145532 145909 146213 146184 146098 146286 146613 146792 147034 147913 149670 152008 154509 156896 158907 160266
57225 160266 160912 161120 161350 162023 163265 164791 166188 167456 169011 171058 173209 174955 176252 177412 178686
57210 178686 180182 181962 183906 185625 186809 187554 188235 189223 190863 193383 196522 199454 201435 202469 203189
57195 203189 204229 205873 208110 210827 214013 217811 222154 226412 229782 232218 234606 237860 242229 247635
57181 247635 254205 262084 271078 280842 291178 301947 312970 324281 336139 348513 360933 373119
57169 373119 385376 398086 411162 424347 437642 451130 464826 479061 494479 511109 527991
57158 527991 544363 560825 578598 597951 618225 639196 661536 685777 711569 738182 765269
57147 765269 792905 821211 850121 879395 908919 939140 970853 1004193 1038094 1071238 1103283
57136 1103283 1134721 1165823 1196458 1226803 1257474 1288932 1321279 1354609 1388889 1423626 1458460
57125 1458460 1494263 1532859 1575374 1621431 1670231 1721818 1776995 1836760 1902455 1976095 2059954
57114 2059954 2156015 2266239 2393267 2540486 2711422 2909248 3136734 3396506 3691397 4024717
57104 4024717 4400273 4822418 5296571 5829742 6430323 7107353 7870350 8729748 9696812
57095 9696812 10782647 11997265 13349117 14844582 16487494 18279659 20222129 22315461
57087 22315461 24558618 26948047 29477340 32136004 34907501 37768436 40686174 43606881
57079 43606881 46433484 49011311 51144691 52645924 53388479 53331934 52511564 51011206 48939892
57070 48939892 46417886 43567827 40507900 37347067 34181753 31092830 28143560 25379620
57062 25379620 22830352 20509820 18418346 16546029 14877315 13394232 12077778 10909053
57054 10909053 9870766 8947965 8127577 7397807 6748056 6168743 5650912 5186434 4768751
57045 4768751 4392929 4054731 3750055 3475411 3228318 3006803 2808869 2632764 2477246
57036 2477246 2341047 2222332 2119181 2030471 1955939 1895591 1849359 1817080 1798484 1793441 1802250
57025 1802250 1824541 1856242 1887309 1903634 1892855 1849688 1777011 1683023 1577345 1468368 1362232
57014 1362232 1262885 1172524 1092020 1021272 959599 906017 859299 818085 781211 747970 717972
57003 717972 690853 666296 644113 624011 605213 586685 567975 549721 533105 518781 506455
56992 506455 495613 486401 479424 474648 471081 467921 465645 465348 467215 470408 474385 479323 484761 488711
56978 488711 488923 484697 476880 466580 454669 442297 430871 421259 413491 407369 402891 399990 398343
56965 398343 397743 398430 400880 405427 412084 420457 429802 439431 449185 459270 469517 478799 485208 486798
56951 486798 482502 472751 459294 444169 428780 413893 400189 388366 378798 371489 366430 363748 363480
56938 363480 365473 369610 375986 384794 396115 409792 425390 442344 460133 477982 494138 505754
56926 505754 510059 505898 494080 476480 455119 431887 408469 386135 365547 346845 329909 314735
56914 314735 301694 291256 283310 276937 271129 265580 260613 256596 253711 251960 250916 249673 247608 245204
56900 245204 243669 243728 245153 247408 250298 253898 258296 263534 269554 276211 283659 292681 304159 318056
56886 318056 333220 348342 362749 376065 387383 395143 397972 395695 389611 381716 373553 365763 358611
56873 358611 352555 348238 346298 347538 352873 362676 376364 393103 412736 435668 462060 491553 523499
56860 523499 556916 590414 622584 652129 676994 693818 699427 693217 677572 656015 631601 606820
56848 606820 583805 563990 548166 537221 532292 533910 541652 554951 573779 598275 628378 664223
56836 664223 706262 754369 807055 861787 915484 964264 1003291 1027759 1034327 1021889 991784 947812
56824 947812 895447 840099 785778 735267 690788 653889 625009 603850 590075 583357 583064 588555
56812 588555 599733 616885 639959 668275 700712 735689 770954 803647 830516 847995 852647 842426
56800 842426 817804 781507 737252 688894 640317 595083 555566 522467 495390 473786 457356
56789 457356 445827 438686 435341 435570 439737 448323 461147 477086 494524 511893 527761 540660 549078
56776 549078 551538 546789 534306 514835 490204 462401 432952 403181 374600 348505 325338 304737
56764 304737 286196 269482 254594 241635 230728 221831 214614 208590 203313 198362 193389 188421 184018
56751 184018 180848 179048 178093 177189 175733 173519 170750 167946 165705 164410 163976 163836 163356 162497 161931 162261
56735 162261 163229 164041 164339 164426 164567 164617 164473 164395 164619 165075 165709 166631 167676 168284 168163 167735 167545 167576 167545 167519
56715 167519 167730 168004 167963 167747 168054 169356 171355 173227 174190 173934 172869 171991 172216 173633 175419 176500 176392
56698 176392 175559 175073 175709 177255 178736 179361 179119 178499 177921 177523 177275 177141 177251 177838 178780 179376 179045 178158
56680 178158 177580 177414 176934 175945 175356 175877 176891 177312 177047 176875 177167 177505 177483 177251 177233 177696 178537 179264 179371
56661 179371 179040 179162 180317 182106 183857 185523 187271 188630 188929 188409 188082 188467 189174 189782 190378 191040 191451
56644 191451 191412 191294 191663 192704 194189 195800 197362 198931 200647 202314 203251 202976 202041 201783 203081 205554
56628 205554 208032 209614 210312 210867 211960 213442 214439 214352 213488 212482 211414 209981 208314 207051 206629 206895
56612 206895 207399 207696 207463 206732 205925 205320 204621 203475 202150 201139 200315 199178 197845 197007 196825 196660 196169
56595 196169 195923 196543 197766 198789 199115 198682 197590 196163 195011 194588 194732 194920 194819 194448 193925 193338 192794
56578 192794 192481 192669 193536 194910 196364 197836 199937 203185 207053 210280 212148 212943 213231 213395 214040 215995
56562 215995 219388 223321 227048 231033 236204 242530 249049 255135 260933 266442 270896 273461 274215 274041 273729
56547 273729 273447 272967 272080 270696 268778 266383 263800 261497 259845 258868 258219 257384 255979 254011 251856 249876
56531 249876 248062 246181 244223 242471 241102 240022 239134 238388 237468 235904 233842 232277 232044 232879 233868 234477
56515 234477 234602 234003 232487 230556 229088 228264 227522 226647 226168 226419 226889 227005 226975 227323 227949 228261 228107 228004
56497 228004 228415 229159 229700 229752 229467 229086 228632 228075 227688 227969 229055 230444 231480 231927 231854 231219 229971 228397
56479 228397 226917 225571 224101 222485 221070 220202 220124 221126 223239 225718 227353 227603 227128 227079 228069 229888
56463 229888 231874 233475 234671 235915 237554 239403 241115 242714 244329 245648 246219 246204 246247 246622 247070 247461
56447 247461 247937 248306 248060 247196 246444 246396 246932 247637 248205 248314 247750 246898 246416 246239 245641 244581 244049 244540 245127
56428 245127 244857 244297 244671 245993 247196 247846 248567 249700 250557 250412 249486 248565 248157 248416 249458 251232 253172
56411 253172 254366 254221 252956 251435 250503 250348 250510 250506 250355 250433 250931 251643 252365 253357 255233 258263 261830 264828
56393 264828 266677 267685 268257 268245 267564 267071 267933 270094 272206 273337 274046 275364 277372 279364 280948 282316
56377 282316 283626 284750 285613 286341 287023 287607 288063 288498 289110 290074 291355 292590 293377 293762 294224 295047 295962
56360 295962 296547 296714 296734 296997 297839 299315 301064 302658 304120 305727 307353 308514 309205 310126 311806 313931
56344 313931 315802 317067 317788 318197 318667 319497 320482 321068 321205 321600 322898 325066 327867 331308 335206 338849
56328 338849 341678 343938 346162 348365 350247 351936 353945 356524 359446 362290 364642 366253 367297 368289
56314 368289 369491 370638 371467 372150 373010 374159 375668 377654 379931 382045 383989 386404 389785 393992 398833
56299 398833 404425 410486 415933 419913 422779 425395 428005 430447 433046 436402 440493 444709 448707 452710
56285 452710 457096 462179 468148 474820 481700 488686 496314 504939 514189 523737 533968 545232 556994
56272 556994 568613 580533 593831 608903 625385 643106 662308 683130 705653 730305 757646
56261 757646 788026 821965 860274 903141 949807 1000131 1055756 1118563 1188582 1264912 1348185
56250 1348185 1440391 1542317 1652830 1770832 1896208 2028383 2165492 2305617 2447439 2588923
56240 2588923 2726638 2857310 2979003 3089772 3186085 3263734 3319877 3353375 3363783 3351105
56230 3351105 3316281 3261008 3186996 3095938 2990098 2872547 2746868 2616779 2485565 2355382
56220 2355382 2227236 2101910 1980683 1865039 1756082 1654481 1560493 1473707 1393215 1318498
56210 1318498 1249835 1187474 1130767 1078646 1030757 987569 949338 915398 884600 856229 830338
56199 830338 807281 787105 769531 754338 741389 730138 719583 709133 699280 690967 684437 679058
56187 679058 674032 668870 663500 658501 654913 653125 652085 650380 647977 646143 645707 646275 647176 648234 649387
56172 649387 650440 651598 653564 656688 660495 664366 668170 672040 676069 680485 685599 691332 697299 703562
56158 703562 710773 719374 729220 740192 752574 766553 781949 798832 817934 840081 865647 894879
56146 894879 928343 966671 1010131 1058770 1112855 1173081 1240436 1315638 1398228 1486154 1576503
56135 1576503 1666379 1752766 1832265 1902205 1962107 2013324 2057266 2094868 2127503 2156863 2183210
56124 2183210 2204652 2218754 2224289 2221253 2210233 2192524 2170009 2143918 2113721 2077530 2033264 1979360
56112 1979360 1915303 1842329 1763486 1682586 1603117 1527952 1459287 1398300 1345141 1299536 1261229
56101 1261229 1229879 1204936 1185734 1171430 1161022 1153825 1149666 1148092 1147847 1147959 1148890 1151547 1155492
56088 1155492 1159377 1163008 1167561 1173718 1180955 1188872 1197744 1207410 1217008 1226374 1236380 1247408 1258758
56075 1258758 1270105 1282226 1295552 1309261 1322568 1335753 1349190 1362569 1375939 1390383 1406664
56064 1406664 1424188 1442220 1461149 1481593 1503138 1524965 1547035 1569790 1593287 1617305 1641650
56053 1641650 1665838 1689293 1712335 1736021 1760549 1784905 1808619 1832677 1858035 1884430 1911334
56042 1911334 1938870 1967053 1995439 2024368 2055226 2088583 2123391 2158928 2196103 2235769 2277179
56031 2277179 2319363 2362787 2408385 2456096 2505547 2556980 2610382 2664969 2720712 2779061 2840933
56020 2840933 2905274 2970850 3038035 3107617 3179388 3253397 3331039 3413267 3499162 3587860 3680416
56009 3680416 3778109 3880441 3986636 4097589 4214435 4336672 4463709 4596885 4737904 4886707
55999 4886707 5042913 5207919 5383362 5568844 5763445 5968316 6185674 6416548 6661530
55990 6661530 6922355 7200742 7497301 7813631 8153635 8520585 8915056 9338199 9794739
55981 9794739 10290020 10826704 11407766 12040353 12733113 13492092 14323233 15236922 16246379
55972 16246379 17364160 18604859 19989588 21544251 23296792 25281857 27547148 30152498
55964 30152498 33168333 36683071 40811165 45688901 51463447 58284943 66293872 75598483
55956 75598483 86265078 98342175 111897415 127031824 143873069 162564394 183230346
55949 183230346 205896143 230391383 256266678 282660395 308063416 330159006 346090346
55942 346090346 353270606 350336852 337632946 316962747 290890285 262042936 232661991
55935 232661991 204400655 178300892 154891623 134336563 116561924 101346497 88394417
55928 88394417 77394457 68052019 60098746 53299704 47460879 42425817 38064567 34268896
55920 34268896 30953203 28049870 25500423 23253219 21266472 19506610 17942892 16547289
55912 16547289 15298324 14179952 13176514 12272367 11455596 10717732 10049714 9441569 8885758
55903 8885758 8377320 7910798 7480181 7081706 6713568 6372762 6055042 5757925 5481015
55894 5481015 5223266 4982503 4757559 4548319 4353569 4171288 4001216 3844708 3701635
55885 3701635 3569508 3446029 3330613 3222968 3121793 3025163 2930891 2836568 2740819 2644597
55875 2644597 2550021 2458184 2369374 2284695 2205457 2131075 2059478 1989743 1922705 1858966 1798068
55864 1798068 1739846 1684981 1633759 1585614 1540192 1497739 1458150 1420705 1384894 1350520 1317050
55853 1317050 1283940 1251620 1221054 1192359 1164837 1138224 1112671 1087585 1061751 1034808 1007635
55842 1007635 981269 956342 933376 912407 892357 871969 851408 831890 813766 796263 779147
55831 779147 763308 749280 736316 723427 710490 697956 686205 675478 665766 656518 647041 637208
55819 637208 627153 616481 604642 592081 580003 568892 558127 547251 536734 527229 518868 511573
55807 511573 505349 499968 494977 490306 486402 483577 481664 480393 479675 479459 479674 480227 480712 480428 479224 477963
55791 477963 477529 477684 477637 477352 477336 477392 476669 474944 472932 471126 469099 465976 460978 453605 444128 433821
55775 433821 423978 414789 405914 397841 391651 387653 385372 384763 386077 388350 389317 387341 382577 376031 368549
55760 368549 361023 354446 349111 344485 340291 336891 334300 331764 328762 325571 322372 318645 314035 308960
55746 308960 303798 298285 292360 286791 282161 277836 272801 267113 261824 257746 254909 252919 251282 249578
55732 249578 247723 245838 243646 240526 236540 232751 229908 227309 223653 218692 213320 208343 203947 200222
55718 200222 197370 195202 193117 190910 189285 189193 190782 193197 195398 197084 198785 201129 204080 206921 208768
55703 208768 209054 207796 205650 203468 201486 199074 195640 191481 187281 183067 178371 173337 168904 165778
55689 165778 163824 162575 161718 160958 160068 159328 159348 160288 161764 163628 166147 169208 172052 174109 175492 176406
55673 176406 176807 176971 177619 178873 179714 179079 177070 174571 172252 170496 169723 169997 170616 170854 170922 171617 173211
55656 173211 175256 177294 179155 180672 181665 182214 182508 182447 181741 180360 178549 176505 174341 172248 170367 168548
55640 168548 166489 164019 161082 157655 153941 150412 147403 144797 142330 139893 137292 134059 129946 125423
55626 125423 121380 118483 117041 117082 118118 119126 119303 118731 117962 117165 116146 114961 113975 113323 112769 112060 111030
55609 111030 109471 107315 104919 102786 101004 99322 97671 96231 95017 93881 92929 92458 92329 91847 90483
55594 90483 88491 86625 85518 85428 86309 87756 88984 89170 88039 86168 84667 84378 85237 86374 86903 86651
55578 86651 86188 86259 87165 88550 89762 90509 91155 92215 93701 95262 96889 99031 101939 105370 109050 112893
55562 112893 116394 118350 117821 115262 112200 109833 108257 106845 104974 102394 99317 96268 93619 91282
55548 91282 89016 86949 85514 84879 84697 84449 83932 83428 83435 84139 85121 85776 86104 86787 88326 90365 92089 93049
55530 93049 93397 93547 93959 94994 96609 98281 99517 100297 100820 101055 100848 100243 99277 97667 95155 92067 89098
55513 89098 86514 83977 81169 78205 75347 72682 70271 68367 67255 66920 67011 67133 67134 67070 66904 66373 65374
55496 65374 64342 63928 64288 65043 65915 66919 67798 67869 66854 65431 64547 64448 64770 65217 65739 66292 66911 67769
55478 67769 68776 69360 69084 68216 67289 66395 65441 64758 64726 65005 64843 64147 63544 63365 63172 62462 61353 60407 60108
55459 60108 60563 61381 61905 61859 61684 61884 62296 62527 62813 63713 65016 65789 65594 64947 64374 63670 62458 60920
55441 60920 59644 59087 59378 60314 61416 62362 63400 64914 66618 67693 67782 67266 66553 65734 65026 64735 64572
55424 64572 63772 62246 60928 60551 60827 61258 61988 63196 64343 64856 65070 65679 66602 67197 67365 67599 68075 68403
55406 68403 68350 68112 67823 67348 66634 65814 64885 63775 62756 62316 62525 62913 63101 63175 63367 63721 64179 64684 65057
55387 65057 65045 64597 63871 63036 62336 62275 63222 64720 65681 65508 64679 63936 63309 62359 61132 60308 60332 60829 61071
55368 61071 60796 60379 60323 60813 61730 62828 63778 64182 63856 63127 62673 62896 63506 63833 63502 62750 62144 62076 62494
55349 62494 63055 63588 64366 65783 67705 69369 70089 69930 69445 68930 68223 67163 65860 64449 62931 61429
55333 61429 60379 60202 60901 62074 63220 63970 64224 64255 64503 65024 65307 64920 64230 64089 64763 65522 65462 64466 63135
55314 63135 62027 61272 60796 60594 60685 60972 61210 61134 60669 60073 59754 59884 60310 60901 61737 62829 63937 64923 65997
55295 65997 67261 68281 68568 68296 68038 67956 67880 68064 69068 70713 71929 72000 71312 70577 69944 69322 68917 68826 68640
55276 68640 68122 67883 68663 70220 71663 72640 73523 74584 75707 76790 77729 78079 77439 76137 74917 73918 72708
55259 72708 71325 70446 70307 70171 69284 67819 66520 65872 65971 66740 67881 68813 69058 68607 67860 67371 67567 68358
55241 68358 68992 68740 67789 67054 67079 67547 67913 67993 67834 67518 67315 67505 67859 67771 67109 66518 66670 67643 69126 70725
55221 70725 71930 72389 72450 72823 73488 73595 72776 71827 71642 72118 72663 73148 73715 74144 74156 74027 74253 74812 75314
55202 75314 75627 75849 75905 75707 75473 75419 75363 75021 74404 73502 72033 70040 68382 67931 68536 69370 69999 70472 70689
55183 70689 70496 70249 70518 71266 72031 72811 73999 75465 76533 77028 77554 78452 79129 78897 78013 77462 77871 78919
55165 78919 79698 79570 78735 77924 77475 77015 76268 75705 75854 76321 76268 75725 75557 76110 76706 76685 76252 75974 76084 76633
55145 76633 77734 79218 80412 80701 80093 78999 77802 76833 76359 76228 75874 75055 74322 74419 75346 76356 76758
55128 76758 76517 76155 76284 77126 78319 79222 79505 79324 78907 78247 77360 76680 76885 78258 80308 82048 82705 82228
55110 82228 81186 80261 79957 80591 82117 83814 84694 84524 84125 84267 84702 84804 84719 85116 86056 86934 87487 88025
55092 88025 88634 88963 88935 88889 88822 88356 87734 87967 89497 91435 92710 93315 93832 94363 94702 94996 95418 95513 94748
55073 94748 93509 92695 92424 91952 90932 89968 89698 90024 90557 91262 92235 93212 93774 93900 93977 94333 94949 95574 95977
55054 95977 96087 95955 95563 94713 93305 91739 90755 90647 90767 90148 88629 87066 86315 86287 86231 85691 84813 83817
55036 83817 82699 81604 80979 81094 81721 82599 83844 85498 87008 87718 87712 87635 87774 87857 87653 87181 86342 85018
55018 85018 83646 82997 83161 83352 82988 82389 82107 82124 82161 82261 82518 82667 82486 82367 82874 83887 84585 84284 83013
54999 83013 81462 80577 80941 82179 83248 83629 83904 84737 85754 86137 86028 86473 87935 89674 90879 91725 92911
54982 92911 94653 96586 98372 99875 100893 101199 100877 100337 99867 99410 98846 98323 98116 98268 98534 98696 98767 98858
54964 98858 98983 99079 99128 99172 99295 99619 100124 100414 99955 98780 97684 97370 97640 97790 97586 97335 97155 96839 96433
54945 96433 96272 96304 96013 95262 94633 94644 95214 96142 97487 99066 100208 100568 100675 101065 101335 100794 99677 98956
54927 98956 99077 99664 100415 101582 103429 105757 108144 110328 112325 114505 117512 121707 126671 131619 136318
54912 136318 141238 146801 152784 158427 162834 165350 165881 164782 162227 157955 152035 145500 139571 134321
54898 134321 128830 122757 117051 112908 110585 109529 109164 109157 109332 109701 110435 111527 112636 113419 113858 114184 114694
54881 114694 115758 117659 120228 122901 125322 127681 130305 133192 136179 139372 143090 147427 152089 156617
54867 156617 160609 163779 165939 166956 166677 164887 161442 156493 150636 144751 139533 135013 130637 125917
54853 125917 120967 116375 112712 110231 108821 108055 107423 106717 106011 105134 103493 100779 97670 95382 94608 95160
54837 95160 96456 97934 99156 100001 100756 101610 102128 101773 100917 100682 101574 102810 103313 102978 102603 102863 103637 104178
54819 104178 103717 102088 99981 98451 98031 98373 98764 98818 98680 98761 99333 100195 100795 100810 100497 100174 99629 98582
54801 98582 97528 97364 98052 98449 97861 97043 97106 97919 98362 97881 97082 96763 96985 97280 97404 97614 98348 99783 101642
54782 101642 103373 104536 105022 104926 104416 103830 103756 104743 106810 109347 111579 113269 114922 117187 120040 122790
54766 122790 124970 126903 129149 131718 134336 137241 141087 146041 151487 156722 161469 165553 168608 170256
54752 170256 170255 168363 164555 159525 154424 149844 145521 141195 137215 133892 130841 127548 124235 121626 120090
54737 120090 119406 119180 119104 119015 119057 119551 120363 120713 119990 118517 117171 116546 116897 118467 121237 124541 127575 130215
54719 130215 132900 135889 139199 143099 147935 153409 158584 162710 165594 167156 167243 166019 163981 161334 157791
54704 157791 153235 148166 143250 138812 135058 132380 131001 130449 129786 128397 126335 124002 121690 119509 117566
54689 117566 116093 115247 114821 114314 113474 112672 112502 113096 114050 114929 115515 115583 114850 113351 111572 110001 108703
54672 108703 107544 106632 106286 106565 107057 107223 106918 106525 106516 106873 107051 106629 105917 105689 106333 107428 108227 108373 108104
54653 108104 107850 107802 107823 107696 107420 107257 107474 108039 108569 108615 108088 107476 107468 108159 108753 108380 107209 106269 106124 106226
54633 106226 105874 105279 105194 105824 106706 107422 107818 107652 106767 105650 105166 105482 105845 105686 105456 105968 107272 108618
54615 108618 109306 109208 108564 107651 106699 105948 105691 106186 107396 108832 109876 110321 110397 110268 109866 109316 109146 109740
54597 109740 110846 111931 112782 113428 113649 113066 111791 110635 110489 111588 113338 114647 114480 112496 109425 106660
54581 106660 105177 104824 104736 104382 103991 103982 104339 104818 105549 106965 109021 110888 111701 111469 111019 111124 111874 112718
54563 112718 112893 111970 110338 109116 109256 110684 112499 113899 114616 114660 114198 113717 113708 113964 113705 112720 111866 112039
54545 112039 113029 113950 114462 114914 115423 115594 115326 115286 116164 117786 119363 120493 121600 123354 125822 128285 129816
54528 129816 130067 129443 128588 127831 127210 126804 126680 126536 125798 124308 122671 121632 121240 120910 120248 119466 118899 118465
54510 118465 117887 117260 117008 117277 117617 117470 116772 115946 115383 115166 115238 115654 116599 118202 120297 122256 123194 122619
54492 122619 120986 119428 118754 118761 118611 117793 116604 115753 115617 115955 116304 116545 116970 117732 118431 118509 118034 117778 118384
54473 118384 119662 120922 121788 122435 123084 123608 123746 123540 123401 123765 124662 125560 125708 124814 123422 122530 122747 123836
54455 123836 125052 125786 125919 125728 125593 125738 126150 126680 127174 127412 127060 125923 124340 123106 122788 123205 123680
54438 123680 123682 123066 121930 120597 119740 120073 121658 123650 124913 124871 123783 122423 121567 121534 122002 122366 122430 122570
54420 122570 123098 123762 124135 124235 124308 124213 123584 122631 122215 122933 124544 126436 128223 129653 130406 130443 130310 130631
54402 130631 131420 132176 132544 132599 132619 132904 133696 134960 136328 137519 138670 139977 141173 141756 141617 141064 140325
54385 140325 139485 138888 139000 139774 140542 140768 140503 139988 139255 138337 137501 136925 136452 135970 135752 136081 136742 137289 137670
54366 137670 138266 139379 140951 142714 144390 145796 147021 148287 149416 149653 148520 146740 145723 145963 146469
54351 146469 145993 144392 142444 140757 139407 138406 137844 137534 137075 136484 136329 136891 137535 137305 136046 134580
54335 134580 133822 133970 134505 134758 134480 134121 134484 135893 137689 138886 139288 139676 140902 143160 146213 149794
54319 149794 153463 156490 158392 159512 160739 162661 165196 167886 170321 172339 173992 175237 175624 174605
54305 174605 172303 169568 166952 164019 160164 155764 151956 149418 147973 147200 146742 146064 144782 143364 142812
54290 142812 143309 143812 143335 142035 140643 139411 138223 137233 136642 136068 134920 133468 132816 133568 134926 135500
54274 135500 134857 133913 133825 134744 135835 136355 136317 136020 135428 134482 133688 133717 134456 135172 135746 136966 139210 141582
54256 141582 142977 143482 144012 144902 145657 145972 146170 146554 146950 147092 146942 146478 145641 144719 144295 144509 144702 144153
54238 144153 142930 141687 140763 139891 138811 137740 137017 136463 135463 133776 131974 130838 130469 130338 130173 130326
54222 130326 131099 132164 133005 133617 134304 134969 135134 134663 134067 133997 134703 135990 137353 138101 137766 136651 135744 135810
54204 135810 136602 137086 136426 134749 133010 132163 132398 133255 134322 135539 136741 137389 137219 136826 136991 137570 137742
54187 137742 137366 137318 138221 139535 140332 140362 139836 138662 136695 134458 132880 132324 132461 133043 134156 135639 136945
54170 136945 137799 138416 138796 138444 137274 136224 136255 137021 137277 136564 135725 135643 136149 136526 136565 136573 136645 136473 135845 134929
54150 134929 134073 133588 133715 134506 135650 136645 137195 137315 137142 136876 136876 137410 138238 138713 138476 137848 137434 137594 138411
54131 138411 139846 141572 142899 143341 143311 143808 145220 146709 147092 146252 145333 145469 146602 147764 148306 148450 148665
54114 148665 148947 148962 148564 147857 146983 146234 146136 146888 147758 147571 146003 144015 142830 142762 143213 143468 143260 142791 142497
54095 142497 142685 143237 143756 143997 143966 143656 143013 142258 141807 141794 141968 142218 142750 143587 144411 145123 146023 147078 147591
54076 147591 147166 146467 146322 146481 146095 145222 144923 145775 147115 148029 148456 148933 149689 150366 150456 149826 148962 148704 149470
54057 149470 150741 151574 151570 151016 150257 149497 149173 149816 151296 152836 154134 155896 158789 162275 165086 166611
54041 166611 167304 167880 168611 169441 170394 171770 174115 177936 183140 188796 193820 197957 201841 206020 210253
54026 210253 213921 216805 219067 220633 221142 220666 220036 220013 220354 220194 219249 218084 217084 215783 213637 210968
54010 210968 208528 206448 204266 201884 199809 198363 197254 196105 194946 193864 192643 191015 189056 187076
53996 187076 185371 184200 183699 183647 183624 183628 184210 185762 187959 190259 192662 195601 199252 203400 207922 212972
53980 212972 218615 224603 230694 237038 244112 252229 261050 269458 275980 279489 279633 276640 270869 262724
53966 262724 252932 242640 232987 224472 216837 209702 203313 198462 195588 194177 193216 192057 190634 189082
53952 189082 187588 186538 186279 186584 186761 186483 186242 186801 188432 190821 193456 195908 197985 199854 201928 204456
53936 204456 207329 210308 213320 216435 219742 223281 226878 230074 232542 234631 237091 240127 243064 245124
53922 245124 246224 246806 247302 248096 249630 252124 255327 258829 262485 266253 269902 273223 276374 279664 283066
53907 283066 286205 288686 290204 290579 290020 289206 288634 287949 286329 283567 280429 277849 276004 274284 271985
53892 271985 268911 265391 261758 257921 253556 248741 244071 240004 236401 232921 229583 226618 223985 221450
53878 221450 219041 217030 215504 214239 212965 211532 209907 208253 206859 205693 204207 201901 198957 195980
53864 195980 193330 191182 190004 190234 191365 192008 191233 189428 187591 186193 185083 184143 183503 183184 182916 182408
53848 182408 181622 180758 180060 179682 179635 179821 180069 180125 179698 178645 177146 175635 174600 174439 175337 177142 179428
53831 179428 181785 183973 185764 186921 187537 188135 189120 190338 191516 192907 195067 198072 201512 205188 209323
53816 209323 214064 219321 225157 231828 239267 247189 255958 266748 280278 295710 311113 324632 334758
53803 334758 339969 339119 332459 321911 310087 299066 289790 282111 275274 268804 263137 259203 257263 256361
53789 256361 255172 253289 251420 250293 249573 248141 245482 242503 240643 240231 240120 239054 236996 234791 232845
53774 232845 230693 227837 224528 221443 218863 216484 213921 211176 208585 206485 205034 204262 204123 204448 205006
53759 205006 205739 206865 208584 210751 213035 215382 218007 220847 223415 225432 227300 229546 231998 233959
53745 233959 235134 235829 236193 235782 234158 231491 228220 224507 220460 216640 213753 211876 210499 209376 208790
53730 208790 208798 208805 208288 207570 207379 207809 208230 208156 207712 207156 206412 205340 204193 203505 203645 204595 206033 207484 208570
53711 208570 209326 210255 211923 214476 217563 220674 223503 226033 228375 230544 232458 234189 236076 238394 240937
53696 240937 243184 244899 246392 248114 250220 252622 255189 257756 260059 261804 262777 262927 262546 262293 262701
53681 262701 263591 264295 264530 264637 264882 265016 264789 264395 263970 263142 261643 260043 259165 258950 258539 257487 256249
53664 256249 255401 254927 254499 254012 253570 253242 253052 253019 253127 253339 253667 254042 254263 254308 254510 255058 255466 255068 254006
53645 254006 253184 253227 254005 255206 256722 258303 259434 259966 260350 260961 261638 262267 263290 265134 267517 269849
53629 269849 272014 274179 276111 277369 278120 279136 280836 282821 284594 286389 288981 292804 297435 301881
53615 301881 305373 307901 310042 312261 314508 316537 318415 320527 323237 326696 330824 335208 339114 341921
53601 341921 343635 344876 346353 348396 350821 353085 354678 355589 356321 357274 358243 358782 358935 359189 359616 359487
53585 359487 358061 355585 353165 351600 350639 349511 347971 346472 345285 343902 341708 339024 336955 336066 335662
53570 335662 334647 332778 330771 329437 329081 329578 330572 331541 332045 332035 331800 331601 331567 331908 332866 334343 335840
53553 335840 337013 338159 339929 342605 345854 349150 352279 355350 358562 362158 366528 372028 378591 385712
53539 385712 393008 400640 408950 417791 426537 434731 442432 449853 456977 463646 469771 475341 480452 485494
53525 485494 491094 497773 505790 515369 526655 539260 552258 565047 578028 592076 607535 624119
53513 624119 641650 660383 680523 701765 723446 745002 766351 788011 810755 834781 859231
53502 859231 882810 904935 926055 946914 967866 988951 1010208 1031611 1052876 1073603 1093615
53491 1093615 1113092 1132466 1152123 1172040 1191723 1210702 1229124 1247619 1266460 1285077 1302584
53480 1302584 1318679 1333892 1349010 1364302 1379212 1392732 1404149 1413448 1420933 1426573 1429978 1431005
53468 1431005 1429984 1427130 1422058 1414296 1404226 1393127 1382142 1371382 1360153 1347833 1334331 1319776
53456 1319776 1304149 1287401 1269752 1251548 1232858 1213467 1193371 1173049 1153075 1133663 1114819
53445 1114819 1096767 1079875 1064241 1049667 1036144 1024087 1013948 1005734 999010 993205 987921 983127
53433 983127 979190 976522 975168 974873 975647 977922 981946 987276 993224 999656 1007015 1015647 1025576 1036997
53419 1036997 1050469 1066285 1083881 1102255 1120869 1139935 1159998 1181573 1205114 1230904 1258780
53408 1258780 1288243 1318980 1351093 1384768 1420029 1456998 1496097 1537670 1581601 1627515 1675187
53397 1675187 1724474 1775108 1826976 1880378 1935420 1991231 2046397 2100291 2153378 2206094 2258066
53386 2258066 2308768 2358244 2406526 2452833 2496151 2536456 2574592 2610878 2644422 2673990 2699069
53375 2699069 2719900 2736888 2750245 2759863 2765287 2765963 2761605 2752187 2737514 2717123 2690771 2658771
53363 2658771 2621724 2580188 2534856 2486822 2437327 2387266 2337110 2287149 2237549 2188239 2139077
53352 2139077 2090280 2042597 1996917 1953686 1912605 1872824 1833426 1793873 1754102 1714322 1674810
53341 1674810 1635948 1598305 1562530 1529078 1498048 1469270 1442521 1417735 1395024 1374446 1355702
53330 1355702 1338181 1321411 1305386 1290209 1275457 1260223 1243948 1227019 1210283 1194180 1178685
53319 1178685 1163945 1150459 1138466 1127626 1117581 1108518 1100807 1094384 1088967 1084738 1082324 1082078 1083791
53306 1083791 1087049 1091478 1096675 1102496 1109509 1118663 1130230 1143500 1157725 1172916 1189445 1207451
53294 1207451 1227051 1248685 1272555 1297912 1323468 1348497 1373074 1397332 1420935 1443335 1464146
53283 1464146 1483264 1500834 1517112 1532079 1545257 1556111 1564483 1570348 1573380 1573241 1570173 1564823 1557463
53270 1557463 1547805 1535608 1521044 1504394 1485796 1465457 1443823 1421336 1398166 1374181 1349112
53259 1349112 1322881 1296006 1269430 1243526 1217485 1190262 1162087 1134457 1108551 1084236 1060733
53248 1060733 1037574 1014565 991418 967941 944378 921177 898572 876592 855240 834464 814194
53237 814194 794581 775913 758139 740846 723950 708046 693760 681053 669487 658885 649298 640450
53225 640450 631640 622210 611905 600852 589374 577745 565938 553670 540721 527117 513039 498901
53213 498901 485558 473944 464214 455531 446972 438345 429889 421655 413701 406531 400652 395684 390487 384255
53199 384255 377193 370012 363118 356381 349507 342517 335906 330292 325824 322051 318462 314910 311367 307624
53185 307624 303613 299788 296656 294005 291077 287569 284072 281431 279946 279281 278856 278248 277455 276835 276610 276433
53169 276433 275684 274170 272261 270390 268726 267329 266201 265130 263857 262545 261723 261570 261648 261559 261486 261713 261955
53152 261955 261628 260610 259245 257725 256015 254386 253413 253183 253033 252440 251799 251808 252329 252447 251603 250057 248247
53135 248247 246298 244452 243348 243403 244267 245364 246602 247972 248759 247920 245308 241897 238751 236352 234961
53120 234961 234803 235524 236129 235993 235470 235098 234714 233887 232807 232005 231442 230591 229330 228095 227144 226248 225200
53103 225200 224123 223176 222415 222054 222348 223026 223292 222695 221671 220977 220829 220859 220714 220345 219812 219119 218317 217636
53085 217636 217383 217634 218069 218237 218077 218056 218657 219851 221241 222565 223782 224770 225297 225308 224930 224237 223310 222526
53067 222526 222357 222752 223129 223162 223232 223816 224713 225257 225155 224810 224841 225518 226684 228027 229328 230533 231602 232350
53049 232350 232561 232317 232032 232057 232302 232395 232183 231922 231907 231994 231634 230458 228786 227409 226830 226841 226893 226732 226498 226362
53029 226362 226301 226179 225852 225226 224380 223626 223305 223549 224236 225020 225311 224621 223204 222030 221698 221682 221214 220666 221184
53010 221184 222976 224825 225561 225261 224561 223599 222308 221176 220912 221570 222646 223899 225461 227247 228858 230041
52994 230041 230786 231046 230879 230779 231262 232079 232465 232275 232264 232982 233946 234325 234025 233714 234016 235012 236314 237281 237405
52975 237405 236856 236533 237258 238980 240921 242393 243233 243689 244188 245100 246417 247689 248581 249374 250627 252420
52959 252420 254288 255801 256833 257284 257026 256213 255206 254038 252402 250345 248526 247455 246819 245935 244537
52944 244537 242778 240815 238933 237802 237958 239108 240510 241992 243934 246173 247676 247666 246542 245282 244395
52929 244395 243850 243602 243544 243183 241997 240100 238101 236325 234582 232730 231000 229730 229094 229143 229725 230280 230133
52912 230133 229224 228249 227858 228027 228384 228838 229467 230025 229994 229210 228148 227537 227819 228949 230458 231660 232043 231607
52894 231607 230832 230234 230049 230320 231077 232284 233633 234610 234877 234545 234054 233737 233545 233182 232507 231756 231357 231507
52876 231507 231995 232447 232655 232618 232378 231997 231680 231736 232264 232993 233566 233945 234438 235344 236581 237561 237493 236066 233998
52857 233998 232616 232616 233380 233792 233464 232802 232090 231125 229752 228169 226556 224931 223534 222749 222308 221193 218840
52840 218840 216030 214012 213043 212404 211616 210950 210733 210720 210412 209613 208584 207801 207612 207895 208123 207914 207423 206924
52822 206924 206225 204879 202886 200874 199605 199486 200402 201713 202678 203246 204175 205983 208110 209652 210562 211416
52806 211416 212327 213017 213806 215440 217685 219179 219015 217637 215772 213473 210842 208779 208054 208170 208008 207215
52790 207215 206185 205088 203770 202440 201553 201108 200758 200603 201118 202272 203416 204161 204764 205506 206301 207129 208280
52773 208280 209790 211070 211422 210719 209405 208102 207386 207593 208500 209365 209568 209151 208644 208486 208696 208926 208718
52756 208718 207848 206596 205605 205330 205628 205915 205650 204702 203430 202430 202132 202562 203500 204703 205838 206384 205997
52739 205997 205074 204610 205289 206878 208650 210185 211558 212840 213747 213885 213281 212616 212855 214511 217146 219629
52723 219629 220992 221142 220794 220773 221395 222360 223105 223164 222336 220760 218974 217725 217446 217852 218294 218556 219057 220095
52705 220095 221161 221320 220172 218154 215981 214103 212743 212058 212053 212523 213322 214585 216434 218547 220237 221066
52689 221066 221214 221201 221363 221793 222632 224050 225820 227242 227807 227815 228011 228662 229326 229589 229649 229993 230785 231748 232506
52670 232506 232809 232574 231916 231108 230393 229886 229661 229751 230041 230318 230462 230410 229959 228991 227936 227519 227799 227936 227312
52651 227312 226565 226999 229152 232280 235058 236408 235942 234150 232153 230786 229901 228846 227472 226281 225703
52636 225703 225770 226455 227778 229482 231018 232014 232460 232491 232383 232707 233955 235865 237589 238662 239413 240303 241303
52619 241303 242090 242425 242109 240982 239224 237385 235953 235122 234992 235514 236153 236179 235558 235083 235327 235963 236376 236392
52601 236392 235993 234959 233450 232464 232920 234487 236037 237134 238374 240260 242433 244168 245117 245410 245512 246081
52585 246081 247503 249397 250903 251612 251826 251858 251582 250925 250321 250270 250691 251057 251014 250594 250016 249564 249520 249895 250291
52566 250291 250360 250307 250644 251399 251889 251391 249830 247720 245672 244168 243541 243827 244646 245549 246521 247825 249242
52549 249242 249861 248990 247137 245604 245132 245309 245414 245373 245579 246049 246168 245256 243176 240452 237971 236448 235941
52532 235941 235909 235862 235832 236028 236269 236093 235362 234401 233492 232590 231629 230812 230492 230924 232150 233873 235423 236241 236569
52513 236569 237329 239117 241621 244250 246991 250196 253700 256676 258463 259243 259804 260827 262404 264031 264986
52498 264986 264862 263751 261825 258950 255021 250595 246714 243919 241834 239948 238416 237734 237857 238126 237969
52483 237969 237313 236385 235546 235372 236398 238520 240948 242989 244663 246353 248148 249895 251678 253769 256121
52468 256121 258315 260140 261876 263756 265422 266218 266008 265526 265847 267592 270504 273616 275848 276625 276134 275006
52452 275006 273805 272740 271663 270195 267914 264640 260691 256768 253515 251159 249529 248334 247380 246632 246164
52437 246164 246053 246286 246732 247161 247225 246514 244826 242545 240604 239857 240402 241510 242204 241893 240721 239514 239282
52420 239282 240380 242090 243296 243691 244085 245403 247661 250137 252268 254066 255838 257920 260672 264300 268631
52405 268631 273301 278243 283775 290119 297001 303743 309558 313798 316173 316775 315692 312734 307883 301978
52391 301978 296375 291750 287623 283277 278710 274455 270907 268258 266778 266641 267612 269227 271142 273062 274660
52376 274660 276014 277847 280781 284505 288185 291594 295283 299590 304208 308823 313609 318690 323524 327289
52362 327289 329709 331244 332498 333637 334259 333776 332004 329480 327188 325934 326054 327479 329788 332282 334429
52347 334429 336357 338588 341237 343748 345621 347200 349590 353881 360336 368146 375986 383142 390131 397998
52333 397998 407115 417022 427350 438378 450550 463965 478526 494149 510590 527490 544939 563674
52321 563674 584300 606520 629401 652262 675025 697831 720543 742583 763254 782376 800589
52310 800589 818657 836569 853748 870178 886635 903589 920506 936600 951615 965408 977418
52299 977418 987285 995538 1002884 1009107 1013459 1015906 1017203 1017717 1016921 1014099 1008958 1001566 992349 982206
52285 982206 972056 962179 952530 943649 936507 931406 927772 925287 924444 925616 928338 932052 936974 943655
52271 943655 952091 961868 972856 985146 998554 1012767 1027851 1044050 1061092 1078183 1094708 1110543
52259 1110543 1125658 1139827 1152904 1165105 1176824 1188254 1199195 1209083 1217264 1223414 1227715 1230523
52247 1230523 1231946 1231907 1230456 1227720 1223587 1217706 1209868 1200201 1188970 1176407 1162816 1148646 1134347
52234 1134347 1120255 1106653 1093815 1081879 1070811 1060563 1051217 1042922 1035678 1029215 1023124 1017260
52222 1017260 1012064 1008295 1006221 1005237 1004564 1004163 1004600 1006046 1008005 1010202 1013139 1017259 1022008 1026416 1030548
52207 1030548 1035619 1042417 1050096 1056902 1061802 1065145 1068030 1071428 1075697 1080473 1084919 1088389 1090995 1093455
52193 1093455 1096442 1100117 1104196 1108213 1111802 1114906 1117643 1119807 1120677 1119669 1117132 1114086 1111132 1107937
52179 1107937 1103831 1098495 1091922 1084177 1075560 1066748 1058369 1050557 1043138 1036137 1029820 1024373 1019795 1016076
52165 1016076 1013291 1011567 1011092 1011989 1014005 1016452 1018716 1020795 1023143 1026080 1029492 1032940 1035901 1038067
52151 1038067 1039655 1041238 1043017 1044466 1045052 1045122 1045624 1046977 1048676 1050060 1051055 1052000 1053090 1054211 1055185 1056068
52135 1056068 1057319 1059625 1063329 1068130 1073610 1080011 1088141 1098623 1111668 1127495 1146293 1167638 1190579
52122 1190579 1214743 1240775 1269223 1299424 1330121 1360817 1391795 1422959 1453467 1482629 1510416
52111 1510416 1536730 1560813 1581980 1600604 1617678 1633411 1646789 1656697 1663079 1666702 1668155 1667510
52099 1667510 1664887 1660889 1656267 1651443 1646479 1641267 1635428 1628168 1618668 1606781 1593235 1579037 1564641
52086 1564641 1549718 1533677 1516500 1499120 1482917 1468822 1457019 1447544 1440827 1437378 1437172 1439693
52074 1439693 1444502 1451376 1460006 1470064 1481654 1495273 1511067 1528445 1546629 1565261 1584184 1602881
52062 1602881 1620508 1636461 1650704 1663547 1675267 1685894 1695280 1703317 1710049 1715423 1719008 1720252
52050 1720252 1719076 1715892 1710902 1703683 1693728 1681085 1666152 1649092 1629874 1608799 1586542 1563622
52038 1563622 1540140 1516146 1491971 1468088 1444830 1422357 1400801 1380388 1361509 1344642 1330010
52027 1330010 1317248 1305562 1294284 1283196 1272277 1261377 1250287 1239007 1227722 1216485 1205079
52016 1205079 1193264 1181059 1168734 1156612 1144949 1133893 1123328 1112680 1101050 1087685 1072327
52005 1072327 1055156 1036580 1017192 997721 978676 959985 941122 921642 901538 881174 861032
51994 861032 841468 822580 804398 787375 772436 760166 750004 740728 731738 723319 715546 707598
51982 707598 698639 688894 679196 669713 659791 649057 637947 626956 615857 604117 591823 579796
51970 579796 568860 559338 551292 544902 540354 537501 535931 535370 535819 537253 539522 542714 547283 553340
51956 553340 559950 565601 569403 571421 571889 570723 568049 564560 560810 556570 551468 546015 541412 538419
51942 538419 536986 536943 538476 541720 546349 551822 557791 564116 570785 577965 585878 594388 602802 610118 615263
51927 615263 617146 614976 608857 599822 588906 576363 562091 546654 531411 517474 504853 492817
51915 492817 480879 469232 458376 448673 440312 433410 427915 423484 419713 416555 414392 413613 414177 415644
51901 415644 417593 420004 423237 427644 433129 439102 444880 450027 454206 456925 457683 456327 452976 447687
51887 447687 440618 432529 424612 417585 411386 405998 402050 400120 399909 400762 402755 406519 412093 418749 426057
51872 426057 434367 443911 454068 463937 473173 481799 489683 496755 503420 509990 515823 519701 521222 521239
51858 521239 520647 519238 516145 511151 505056 498867 493046 487679 482908 478884 475433 472143 468853 465793
51844 465793 463053 460101 456096 450744 444688 438946 434045 429744 425480 420911 416088 411336 407070 403640
51830 403640 401165 399539 398641 398454 398882 399550 400070 400466 401061 401856 402353 402138 401289 399941 397866 394964 391902
51813 391902 389643 388421 387780 387587 388243 389715 391212 392306 393722 396285 399523 402011 402895 402404 401006
51798 401006 398845 396114 393372 391140 389458 387958 386239 384144 381963 380322 379594 379465 379308 378831 378057
51783 378057 376925 375505 374503 374829 376408 377963 378289 377405 376218 375447 375177 375174 375276 375530 376152 377322 379066
51766 379066 381514 385167 390512 397365 404951 412627 420084 426835 432098 435415 436912 436709 434648 430903
51752 430903 426221 421066 415037 407775 400036 393146 387601 382894 378653 375221 373006 371845 371319 371378 372437
51737 372437 374992 379248 384989 391835 399624 408387 417745 426638 433991 439461 443274 445656 446919 447805
51723 447805 449085 450776 452304 453364 454025 453940 452256 448642 443874 439053 434626 430565 427020 424325 422549
51708 422549 421440 420656 419794 418472 416792 415633 416102 418656 422911 428131 433557 438391 441869 443566 443624
51693 443624 442689 441688 441421 442096 443264 444375 445294 446127 446614 445950 443215 437953 430505 421970 413672 406404
51677 406404 400221 395030 391152 389014 388561 389405 391368 394373 397864 401040 403892 407441 412548 418851 425228
51662 425228 431008 436212 440781 444070 445260 443967 440386 435093 428835 422400 416598 412304 410319 410978
51648 410978 413855 417997 422450 426553 429780 431489 430934 427613 421705 414097 405762 397123 388250 379603
51634 379603 372043 365877 360435 355055 350051 346136 343216 340578 338161 336809 337069 338449 340152 341860
51620 341860 343434 344449 344626 344356 344315 344719 345341 345977 346493 346646 346289 345607 344864 344106 343449 343338 344157 345755
51602 345755 347751 350022 352509 354863 356864 358947 361749 365341 369522 374661 381386 389491 397988 406366
51588 406366 414935 423607 431187 436420 439166 440046 439489 437819 435933 435140 436255 439242 443773 449845 457914
51573 457914 468589 482106 498014 515479 533998 553553 574038 595021 616339 638478 661861
51562 661861 685989 709748 732501 754665 777440 802328 830645 862881 898292 935178 971430
51551 971430 1004697 1032378 1052037 1062023 1061698 1051344 1032075 1005550 973241 936044 894827 851176
51539 851176 807123 764182 723038 684134 648157 615829 587519 563178 542438 524773 509702
51528 509702 496846 485743 475797 466589 458059 450149 442576 435308 428985 424234 420634 416879 412048 406340
51514 406340 400580 395524 391706 389309 387781 385948 382963 379133 375603 373251 371912 370561 368223 364827
51500 364827 361221 358326 356448 355486 355376 355850 356092 355404 354275 354105 355621 358153 360682 362955 365140 366965
51484 366965 367869 367832 367434 367106 366761 366147 365228 364179 363178 362246 361163 359570 357280 354461 351423 348303
51468 348303 345077 341792 338690 336147 334466 333608 333192 332956 333151 334173 335827 337450 338855 340731 343811
51453 343811 348006 352586 356910 360746 364217 367794 371987 376729 381317 385396 389672 395236 402417 410804
51439 410804 420194 430859 442799 455137 466320 474702 479176 479810 477919 475112 472117 468713 464545
51426 464545 459483 453316 445837 437409 428897 420798 412947 405302 398538 393432 390049 387882 386498 385610
51412 385610 384850 384007 383394 383562 384576 385914 387085 388108 389358 391150 393497 396077 398374 400012 401015
51397 401015 401739 402579 403813 405625 408089 411161 414871 419523 425557 433204 442400 453109 465601 480333
51383 480333 497632 517633 540529 566788 597028 631666 670691 713716 760129 809195 860179
51372 860179 912347 964542 1014510 1058868 1094227 1118540 1131370 1133108 1124353 1105958 1079045 1044696
51360 1044696 1003916 958060 908915 858122 806894 756540 708747 664812 624886 588587 556128
51349 556128 528188 504711 484604 466806 451064 437404 425440 414673 405061 396741 389377 382275
51337 382275 375093 368109 361792 356450 352225 349086 346683 344510 342381 340631 339655 339320 338979 338093 336761
51322 336761 335561 334933 334859 335224 336222 338088 340482 342544 343742 344428 345311 346570 347730 348331 348441 348552 349127
51305 349127 350219 351435 352287 352610 352494 351865 350470 348492 346725 345716 344948 343375 340643 337385 334421
51290 334421 332213 331005 330766 330798 330049 328205 326096 324706 324227 324367 325123 326700 329011 331816 335188 339315
51274 339315 343932 348434 352440 355858 358540 360491 362382 365184 369085 373285 377014 380261 383280 385936
51260 385936 387960 389360 390051 389438 386993 383124 378821 374437 369408 363312 356745 350823 346150 342586 339749
51245 339749 337405 335480 333985 332942 332213 331515 330758 330205 330020 329797 328944 327509 326198 325503 325272 325320 325904
51228 325904 327132 328346 328744 328458 328387 328972 329817 330625 331779 333661 335945 338058 339872 341472 342627 343114
51212 343114 343364 344087 345300 346292 346640 346755 347353 348803 351150 354330 358142 362302 366655 371030 374777 376885
51196 376885 376902 375499 373836 372521 371354 369892 367964 365780 363806 362540 362226 362738 363752 364976 366217
51181 366217 367408 368595 369778 370717 371120 370984 370504 369653 368248 366546 365363 365299 366082 366926 367283 367048 366389
51164 366389 365738 365678 366361 367169 367355 366881 366285 365844 365332 364552 363637 362742 361806 360720 359435 357867 355926 353770
51146 353770 351755 350083 348702 347549 346615 345778 344833 343793 342890 342346 342380 343347 345370 347809 349622 350522
51130 350522 351302 352742 354624 356209 357262 358100 358906 359684 360746 362609 365197 367673 369358 370511 371919
51115 371919 373958 376347 378693 380941 383270 385789 388483 391324 394299 397314 400196 402811 405111 407050
51101 407050 408577 409790 410971 412258 413328 413628 412954 411615 410038 408483 407239 406762 407308 408556 409852
51086 409852 410731 411043 410779 410090 409408 409183 409451 409909 410427 411218 412476 414133 416093 418413 421067 423764 426234
51069 426234 428582 431126 433970 436971 440089 443590 447798 452759 458199 463855 469862 476783 485069 494394
51055 494394 503585 511310 516848 520327 522514 524544 527626 532591 539582 548194 557867 568136 578714 589513
51041 589513 600429 610893 619824 626449 631171 635282 639726 644375 648412 650918 650868 647150 639143 627236
51027 627236 612461 595694 577555 558929 541086 525129 511529 500309 491394 484705 480136 477613
51015 477613 477061 478203 480508 483511 487137 491561 496791 502494 508199 513625 518787 523888 529189 534947
51001 534947 541363 548493 556231 564491 573328 582717 592198 601102 609340 617752 627420 638761 651557 665651
50987 665651 681138 697900 715465 733539 752376 772450 794061 817363 842367 868606 895145
50976 895145 921331 947351 973584 999549 1024001 1046234 1066945 1087682 1109798 1134192 1161786
50965 1161786 1193744 1230957 1273486 1320758 1372299 1428089 1488149 1551959 1618398 1686076 1753516
50954 1753516 1819282 1882347 1942300 1998746 2050501 2095894 2133973 2164907 2189033 2206272 2216987
50943 2216987 2222754 2225422 2225737 2223750 2220295 2216865 2213720 2209034 2200499 2187262 2169847 2148900 2124752
50930 2124752 2097883 2068976 2038378 2005879 1971000 1933218 1892046 1847333 1799490 1749089 1696239
50919 1696239 1640781 1583101 1524409 1466030 1408763 1353031 1299342 1248312 1200448 1156189 1116004
50908 1116004 1080122 1048207 1019588 993851 970937 950585 932058 914726 898706 884500 872003
50897 872003 860331 848880 838172 829279 822511 817150 812418 808301 805191 803067 801376 799673 798149
50884 798149 797493 798303 800585 803767 807216 810777 814755 819428 824767 830667 837253 844841 853699 863925
50870 863925 875435 888032 901695 916852 934099 953497 974467 996682 1020746 1047580 1077388
50859 1077388 1109902 1145712 1186632 1234304 1288818 1349207 1415109 1487394 1567244 1655258 1751730
50848 1751730 1857283 1972534 2097225 2230168 2370248 2517108 2670544 2829426 2991503
50839 2991503 3154165 3315078 3472052 3622575 3763580 3891521 4002803 4094581 4165483 4215547
50829 4215547 4245489 4256234 4249166 4226507 4191218 4146699 4096697 4045051 3995088 3949226 3909188
50818 3909188 3876163 3850309 3830297 3813777 3798121 3780348 3756701 3723311 3677700 3619255 3548126
50807 3548126 3464239 3367641 3259173 3140241 3012357 2877532 2738838 2599928 2463940 2333213
50797 2333213 2209812 2095563 1991461 1897645 1814198 1741514 1679592 1627508 1583996 1548262 1519798
50786 1519798 1497697 1480728 1468072 1459404 1454113 1450827 1447983 1444635 1440532 1435602 1429580 1422021 1412457
50773 1412457 1400686 1387120 1372750 1358452 1344177 1329000 1311996 1293038 1272768 1251948 1230878
50762 1230878 1209227 1186403 1162294 1137804 1114451 1093247 1074120 1056630 1041016 1028108 1018314
50751 1018314 1011224 1006437 1004297 1005408 1009702 1016508 1025486 1037074 1051951 1070482 1092825 1119273 1150216
50738 1150216 1185927 1226549 1272097 1322273 1376541 1434689 1497204 1564772 1637453 1714563 1795257
50727 1795257 1878826 1964465 2051166 2138031 2224392 2309478 2392234 2471567 2546376 2615048 2675302
50716 2675302 2724957 2762704 2787837 2799472 2796668 2779385 2749035 2708179 2660146 2608870 2558345
50705 2558345 2511653 2470585 2436173 2409045 2388998 2374751 2364729 2357849 2352978 2347896 2339587 2325696
50693 2325696 2305114 2276981 2239921 2192924 2136626 2073022 2004035 1931013 1855659 1780725 1709229
50682 1709229 1643272 1583975 1532215 1488823 1454108 1427780 1409542 1399289 1396509 1400077 1409222 1424385
50670 1424385 1446417 1474873 1507642 1542382 1577797 1613296 1648000 1680675 1710423 1736965 1760292
50659 1760292 1780471 1797814 1812870 1826075 1837547 1847298 1855494 1862466 1868612 1874307 1879819 1885305 1890961
50646 1890961 1897091 1903995 1912019 1921957 1935224 1953173 1976131 2003380 2034189 2068549 2106767 2148624
50634 2148624 2193225 2239489 2286458 2333228 2379033 2423643 2467509 2511189 2554607 2596996 2637325
50623 2637325 2673992 2703439 2719512 2715683 2689114 2642815 2583710 2518932 2454062 2393641 2341360
50612 2341360 2298987 2265883 2240302 2220898 2206726 2196518 2188707 2181886 2174588 2164766 2150115 2128956
50600 2128956 2100478 2064298 2020376 1969354 1912436 1850835 1785734 1718732 1651733 1586137 1522551
50589 1522551 1461510 1404023 1351094 1303030 1259622 1220777 1186640 1157225 1132267 1111351 1093967
50578 1093967 1079556 1067817 1058960 1053404 1051172 1051736 1054464 1059015 1065240 1072893 1081616 1091147 1101411
50565 1101411 1112290 1123439 1134572 1146065 1158989 1174208 1191529 1210181 1230188 1252740 1278899
50554 1278899 1308363 1339941 1372952 1407578 1444022 1482032 1521357 1561944 1603158 1643136 1679575
50543 1679575 1711296 1738933 1764180 1788631 1813348 1839198 1867275 1898840 1934833 1975568 2021040
50532 2021040 2071498 2127488 2189329 2256837 2329823 2408591 2493585 2584585 2680585 2780425 2883151
50521 2883151 2987619 3092199 3195194 3295299 3391163 3480593 3560606 3628390 3681974 3719937
50511 3719937 3740954 3744035 3729202 3697691 3651518 3592849 3523568 3445223 3359484 3268960 3177512
50500 3177512 3089488 3008475 2936833 2876222 2828150 2793795 2773506 2766638 2771755 2786869 2809617 2837354
50488 2837354 2866962 2894571 2915709 2926016 2921849 2900410 2859892 2800100 2722917 2631766 2530440
50477 2530440 2422426 2311012 2199385 2090322 1985873 1887366 1795462 1710160 1631131 1558292
50467 1558292 1491947 1432252 1378804 1330960 1288323 1250581 1217072 1186971 1160004 1136604 1117163
50456 1117163 1101376 1088538 1078339 1071066 1067043 1066095 1067628 1071045 1075966 1082124 1089240 1097028 1105351
50443 1105351 1114387 1124558 1136067 1148358 1160185 1170458 1178976 1186235 1192647 1198216 1202897 1206873 1210390
50430 1210390 1213623 1216885 1220716 1225576 1231648 1239046 1247928 1258290 1270029 1283390 1298948 1316849 1336599
50417 1336599 1358158 1382813 1412246 1446865 1485746 1528052 1573736 1622932 1675556 1731647 1791175
50406 1791175 1853089 1915276 1975916 2034255 2089765 2141379 2188205 2230198 2267242 2297995 2320469
50395 2320469 2333439 2336524 2329267 2311071 2281893 2242141 2192104 2132542 2065930 1996161 1926678 1859520
50383 1859520 1796188 1738408 1687603 1644481 1609682 1584163 1568267 1560909 1560304 1565139 1574511 1587058
50371 1587058 1600691 1612952 1621237 1623084 1616924 1602533 1580411 1550930 1514467 1472042 1425199 1375365
50359 1375365 1323843 1272201 1221993 1174027 1128445 1085603 1046253 1010703 978368 948517 921117
50348 921117 896602 875050 855988 838982 824175 812222 803678 798339 795121 792754 790692 789316 789263
50335 789263 790760 793582 797358 801723 806358 811111 816055 821267 826632 831991 837405 843062 848873 854394
50321 854394 859306 863875 868668 873800 878728 882977 886821 890915 895328 899323 902136 903584 903821 902987 901472
50306 901472 900171 899958 900967 902775 905234 908754 913698 919879 926765 934001 941674 950237 960166 971497
50292 971497 983737 996372 1009329 1022647 1035845 1048043 1058656 1067417 1073587 1075874 1073670 1068105
50280 1068105 1061379 1055166 1050026 1046176 1044244 1045061 1048994 1055588 1063558 1070883 1075114 1074100 1066842 1053941
50266 1053941 1037267 1019049 1000920 983571 967144 951864 938206 926517 916724 908600 902160 897463
50254 897463 894054 891064 888273 886697 887532 890556 894255 897675 901419 906380 912206 917867 923259 929157
50240 929157 935566 941255 945357 948550 952002 955723 958684 960129 959992 958156 954138 947717 939337 929749
50226 929749 919593 909433 899718 890474 881307 871992 862907 854695 847678 841761 836857 833228 831367 831607
50212 831607 833857 837802 843441 851407 862567 877286 895215 915853 939125 965347 994755 1027116
50200 1027116 1061644 1097094 1132009 1165079 1195385 1222396 1245977 1266488 1284775 1301696 1317493
50189 1317493 1331616 1343194 1351465 1355624 1354390 1346137 1329714 1305137 1273423 1235882 1193847 1148968
50177 1148968 1103359 1059100 1017620 979709 945981 917029 893078 873753 858324 846066 836184
50166 836184 827532 818735 808729 797097 783801 768820 752354 735335 719349 705748 694974 686843
50154 686843 681294 678498 678280 679814 682043 684256 686184 687754 688880 689399 689120 688015 686347 684370 681862
50139 681862 678251 673360 667755 662228 657270 653340 651290 651928 655164 660000 665435 671037 676618 681780
50125 681780 686128 689733 693133 696867 701094 705618 710246 715055 720264 725837 731448 736983 742794 749165
50111 749165 755750 762090 768577 776262 785488 795295 804529 813113 821887 831598 842579 855063 869133
50098 869133 884533 901131 919591 940974 965616 992987 1022895 1056193 1093938 1136396 1183427
50087 1183427 1235433 1293139 1356409 1423864 1493788 1564914 1636100 1705745 1772103 1834225 1892372
50076 1892372 1947487 2000324 2050944 2098764 2142861 2182062 2214684 2238344 2250429 2249027 2233429
50065 2233429 2203847 2161035 2106366 2041934 1970122 1893092 1812936 1732097 1653130 1577899 1507347
50054 1507347 1442065 1382717 1329682 1282719 1241357 1205456 1175123 1150243 1130354 1114844 1102993
50043 1102993 1093909 1086741 1080919 1076090 1071973 1068483 1065787 1063884 1062311 1060633 1059099 1058251 1057892 1056978 1054701
50028 1054701 1051212 1047074 1042480 1037242 1031113 1023739 1014693 1004058 992731 981668 970902 959679 947445
50015 947445 934369 920984 907727 894767 881962 869041 856117 843864 832846 822800 813038 803415
50003 803415 794393 786288 779144 773396 769884 768943 770118 773094 778274 785969 795609 806321 817826 830095
49989 830095 842492 853999 864133 872976 880448 886264 890553 893801 896138 897376 897835 898311 898976 899069 898214
49974 898214 897506 898729 902800 909454 918173 928961 942442 959608 981288 1007407 1036839 1068247 1100852
49961 1100852 1134116 1167067 1198540 1227970 1255466 1281211 1305368 1328555 1351699 1375171 1398387
49950 1398387 1420335 1439992 1455984 1466337 1469068 1463000 1447886 1424030 1392079 1353107 1308769 1261304
49938 1261304 1213225 1166597 1122451 1081029 1042488 1006933 973779 941765 910011 878637 847996
49927 847996 817787 787601 758113 730887 706910 685913 667319 651308 638534 629067 622060 616422
49915 616422 611574 607582 604794 603394 603229 603959 605272 606923 608691 610559 612967 616621 621840 628213 635052
49900 635052 642169 650038 659264 670052 682175 695204 708561 721487 733172 742970 750422 755118 756821
49887 756821 755836 752984 748975 743802 736952 728126 717496 705320 691629 676469 660177 643235 626015
49874 626015 608821 592082 576351 562243 550372 541089 534113 528697 524415 521548 520432 520704 521623
49861 521623 522949 525020 528055 531957 536848 543121 550765 559124 567770 577190 588206 600912 614544
49848 614544 628182 641250 653524 665038 675860 685566 693093 697529 699038 698586 696833 693760 689275
49835 689275 683536 676458 667595 656987 645731 635170 625826 617569 610516 605033 600976 597686 594967
49822 594967 593467 593786 595699 598571 602103 606304 611180 617020 624644 634677 646593 659060 671258
49809 671258 683326 695456 707153 717665 726616 733875 739253 742785 744969 746247 746395 744868 741568
49796 741568 736801 730576 722531 712600 701318 689290 676760 663852 650875 638182 626024 614832
49784 614832 605358 598159 592921 588566 584086 579233 574432 570146 566335 562558 558645 555218 553350 553572
49770 553572 555339 557579 559723 562167 565843 571436 578878 587428 596195 604603 612380 619284 625073 629724
49756 629724 633489 636632 639274 641397 642686 642360 639547 634089 626682 618033 608226 597234 585748 574972
49742 574972 565709 558048 551847 547026 543356 540409 537965 536159 535085 534533 534219 534035 533955 534010 534517 535973
49726 535973 538418 541159 543527 545776 548843 553227 558514 564128 570209 577458 586284 596399 607254 618532
49712 618532 629975 640837 649849 655909 658743 658774 656519 652402 647089 641583 636629 632074 627069 620964
49698 620964 613947 606820 600300 594627 589735 585541 581872 578219 573951 568969 563990 559927 557178 555784
49684 555784 556064 558496 562934 568501 574530 581148 588612 596579 604605 613069 622935 634660 647881 662043
49670 662043 676625 690588 702332 710780 716179 719496 721350 721895 721463 720713 720118 719709 719414 719370 719686 719979
49654 719979 719155 715683 708269 696626 681686 664991 647827 630948 614883 600174 587229 576117
49642 576117 566627 558485 551512 545688 541096 537759 535504 534027 533017 532169 531171 529856 528315 526678 524755
49627 524755 522106 518488 514141 509525 504949 500535 496381 492607 489218 486084 483145 480601 478747 477534
49613 477534 476433 474937 473205 471927 471458 471354 471000 470483 470441 471142 472109 472717 472860 472964 473629 475279 477827
49596 477827 480438 481938 481741 480318 478672 477572 477391 478295 480112 482119 483457 483928 484169 484929 486366 488107
49580 488107 489808 491463 493232 495165 497168 499225 501600 504725 508805 513577 518595 523761 529526 536522
49566 536522 545036 554868 565566 576654 587605 597740 606369 613115 617998 621212 622871 623009 621693
49553 621693 619044 615291 610914 606593 602782 599430 596297 593445 591177 589647 588851 588901 589846 591188 592105
49538 592105 592395 592769 593938 595758 597632 599427 601569 604502 608538 614088 621438 630236 639673 649274 659234
49523 659234 669860 681044 692376 703447 713841 723118 731108 738127 744704 751076 757009 762095 766172
49510 766172 769541 772815 776550 781005 786229 792138 798303 803699 806888 806578 802103 793562 781715 767641
49496 767641 752307 736486 721074 707094 695002 684221 673950 664402 656691 651356 647565 644090
49484 644090 640612 637673 635667 634404 633523 632814 632100 631184 630092 629137 628574 628297 627989 627540 627310 627963 630019
49467 630019 633490 637960 642941 648091 653108 657666 661631 665241 668865 672538 675867 678418 680032 680704
49453 680704 680279 678498 675404 671484 667198 662487 657055 651111 645410 640402 635755 631058 626631 623035
49439 623035 620010 616649 612749 609325 607497 607365 608361 610288 613546 618610 625705 634822 645611 657358
49425 657358 669521 682379 696874 713786 733229 754889 778515 804096 831496 859524 885027
49414 885027 903246 909974 904058 888024 866438 843667 822751 805501 792923 785415 782673 783673
49402 783673 787117 792189 798823 807042 816171 825116 833381 841420 849810 858422 866594 873829 880063 885439
49388 885439 890108 894165 897463 899462 899419 896789 891442 883699 874336 864423 854863 845994 837773 830370 824359
49373 824359 820314 818421 818626 820934 825269 831017 836998 842054 845677 848040 849553 850470 850785 850243 848424
49358 848424 845042 840271 834701 828822 822604 815694 808034 800135 792758 786397 781127 776853 773562 771302
49344 771302 770011 769465 769366 769451 769524 769503 769469 769592 769920 770318 770648 770900 770982 770531 769200 767146 765045 763554 762914
49325 762914 763065 763870 765089 766432 767924 770109 773558 778165 783152 787800 791982 795886 799447 802353 804586
49310 804586 806705 809373 812617 815710 817895 819150 820151 821544 823373 825134 826269 826620 826575 826832 827887
49295 827887 829711 831950 834415 837229 840520 844171 847912 851500 854753 857542 859891 861984 864031 866190
49281 866190 868567 871122 873668 876182 879087 882919 887679 892900 898422 904749 912373 921126 930438 939909
49267 939909 949353 958612 967710 976867 985969 994333 1001541 1008261 1015566 1023515 1031021 1037209 1042381 1047595
49253 1047595 1053970 1062570 1074228 1088936 1105717 1123450 1141413 1158595 1172883 1181584 1182810 1176151
49241 1176151 1162409 1143326 1121463 1099472 1078866 1059638 1041227 1023763 1008242 995720 986551
49230 986551 980360 976582 974959 975474 977885 981536 985875 990964 997161 1004313 1011639 1018530 1025069 1031587
49216 1031587 1038042 1044163 1049956 1055747 1061896 1068827 1077133 1087190 1098638 1110656 1122705 1134676 1146426
49203 1146426 1157783 1169119 1181330 1194969 1209779 1225249 1241060 1256622 1270880 1283261 1294380
49192 1294380 1305100 1315214 1323860 1331067 1337966 1345384 1353053 1360479 1367880 1375904 1384948 1395139 1406596
49179 1406596 1419424 1433830 1450419 1469877 1492107 1516180 1541481 1568506 1598158 1630768 1666249
49168 1666249 1704709 1746118 1789305 1831569 1869249 1898692 1917381 1924913 1923047 1914659 1902787 1890517
49156 1890517 1880753 1875206 1873768 1875420 1879529 1885883 1893933 1902818 1911991 1921240 1930255 1938844 1947500 1957066
49142 1957066 1967805 1979296 1991126 2003135 2015132 2027089 2039620 2053548 2068890 2084876 2101078
49131 2101078 2117832 2135412 2153479 2171635 2189928 2208447 2226876 2244796 2262097 2278846 2295097
49120 2295097 2311037 2327008 2343223 2359793 2377092 2395625 2415376 2435808 2456758 2478997 2503672
49109 2503672 2531676 2563727 2600613 2642969 2691016 2744571 2802680 2862841 2921108 2973863 3019960
49098 3019960 3061100 3099754 3135806 3164471 3177863 3170098 3141878 3100060 3052508 3003310 2952276
49087 2952276 2897678 2838953 2777859 2718069 2663492 2616347 2576844 2544609 2519630 2501492 2488578
49076 2488578 2478904 2471326 2465405 2460684 2456855 2454099 2452332 2450420 2446997 2441851 2435708 2428942 2421451 2413724
49062 2413724 2406912 2401519 2396788 2391699 2386029 2380189 2374525 2369127 2363933 2358778 2353562 2348490 2343941 2340061
49048 2340061 2336685 2333577 2330410 2326687 2322119 2317073 2312285 2308209 2305050 2303216 2303147 2304670 2307121 2310219
49034 2310219 2314324 2319828 2326834 2335499 2346043 2358169 2371007 2383827 2396292 2407682 2416445 2421075
49022 2421075 2421286 2418123 2413146 2407685 2402453 2397440 2392369 2387503 2383785 2381910 2381545 2381879 2382735 2384658 2387904
49007 2387904 2391806 2395460 2398788 2402563 2407290 2412391 2416808 2420335 2423792 2427713 2431297 2433188 2433025 2431658
48993 2431658 2429901 2427707 2424693 2420939 2416949 2413095 2409315 2405164 2400065 2393797 2386819 2379915 2373499 2367521
48979 2367521 2361992 2357167 2353172 2349900 2347451 2346163 2346018 2346442 2347014 2348013 2349941 2352823 2356254 2359859 2363375
48964 2363375 2366533 2369246 2371768 2374411 2377203 2380014 2382842 2385831 2389232 2393525 2399294 2406798 2415902 2426629
48950 2426629 2439352 2454182 2470605 2488178 2507242 2528415 2551720 2576842 2604027 2633952 2666607
48939 2666607 2700922 2735757 2770888 2806975 2844993 2885817 2929804 2976457 3024783 3074267 3125278
48928 3125278 3178371 3233493 3290117 3347901 3406857 3466962 3527886 3589130 3650297 3711217 3771867
48917 3771867 3832146 3891722 3950186 4007259 4062618 4115512 4164856 4209904 4250679 4287743 4321808
48906 4321808 4353692 4384180 4413541 4441356 4467200 4491310 4514219 4535903 4555759 4573366 4588804
48895 4588804 4602182 4613408 4622608 4630183 4636110 4639547 4639622 4636399 4630712 4623143 4613542 4601392 4586300
48882 4586300 4568254 4547791 4525884 4503237 4479532 4453650 4424644 4392280 4356662 4317760 4275427
48871 4275427 4229540 4179986 4126706 4069962 4010392 3948765 3885837 3822456 3759592 3698208 3639272
48860 3639272 3583685 3531811 3483154 3437047 3393721 3354178 3318944 3287596 3259590 3234842 3213170
48849 3213170 3193991 3177136 3163278 3152861 3145168 3139249 3135288 3134158 3135922 3139804 3145436 3153241 3163491
48836 3163491 3175921 3190356 3206855 3224960 3243556 3261871 3280083 3298718 3318002 3337997 3358711
48825 3358711 3379703 3400103 3419459 3438210 3457132 3476688 3497032 3518129 3539616 3561046 3582540
48814 3582540 3604663 3627429 3650002 3671710 3692755 3713576 3734198 3754838 3776569 3800542 3826710
48803 3826710 3853864 3880713 3906568 3931357 3955695 3980749 4007372 4035314 4063625 4091622 4118969
48792 4118969 4145111 4169363 4191581 4212156 4231177 4248012 4261881 4272579 4280555 4286459 4290477 4291805
48780 4291805 4288870 4280352 4265966 4246050 4220740 4190070 4154704 4115973 4074996 4032094 3987032 3939553
48768 3939553 3889702 3837993 3785286 3732243 3679048 3625889 3573419 3522248 3472216 3422864 3374574
48757 3374574 3328516 3285332 3244563 3205672 3169003 3135379 3105255 3078732 3055990 3037157 3021902
48746 3021902 3009589 2999704 2991819 2985351 2979830 2975406 2972695 2972025 2973133 2975695 2979852 2985901 2993652 3002399
48732 3002399 3011538 3020881 3030233 3038990 3046502 3052715 3058062 3062762 3066657 3069746 3072330 3074396 3075367 3074847
48718 3074847 3073184 3070929 3068149 3064779 3061215 3057940 3054902 3051983 3049875 3049604 3051218 3053697 3056191 3058608
48704 3058608 3061044 3063549 3066653 3071135 3076799 3082288 3086648 3090412 3094587 3099282 3104061 3109035 3114733 3121181
48690 3121181 3127867 3134454 3140875 3146888 3152155 3156580 3160003 3161725 3161040 3158179 3154157 3149763 3145307 3141252
48676 3141252 3138196 3135950 3133232 3128566 3121161 3110827 3097619 3081817 3063798 3043676 3021376 2997221
$$ [...]
##END NTUPLES=NMR SPECTRUM
##END=
