##TITLE=AC1601_NICAH13331_8315839_jAzB6LRIxf
##JCAMPDX= 6.0         $$ Bruker NMR JCAMP-DX V2.0
##DATA TYPE= NMR SPECTRUM
##DATA CLASS= NTUPLES
##ORIGIN= BRUKER
##OWNER= Administrator
$$ 1.72 TOPSPIN		Version 2.1
$$ 2013-11-09 18:33:04.745 -0800  Administrator@X
$$ Compression mode = diff/dup
##.OBSERVE FREQUENCY= 400.02188249412
##.OBSERVE NUCLEUS= ^1H
##.ACQUISITION MODE= SIMULTANEOUS (DQD)
##.ACQUISITION SCHEME= undefined
##.AVERAGES= 8
##.DIGITISER RES= 22
##SPECTROMETER/DATA SYSTEM= spect
##.PULSE SEQUENCE= zg30
##.SOLVENT NAME= COFFEE_meoh
##.SHIFT REFERENCE= INTERNAL, COFFEE_meoh, 1, 14.98509
##AUDIT TRAIL= $$ (NUMBER, WHEN, WHO, WHERE, PROCESS, VERSION, WHAT)
$$ ##TITLE= Audit trail, TOPSPIN		Version 2.1
$$ ##JCAMPDX= 5.01
$$ ##ORIGIN= Bruker BioSpin GmbH
$$ ##OWNER= Administrator
$$ $$ E:\/data/COFFEE/nmr/AC1601_NICAH13331_8315839_jAzB6LRIxf/10/pdata/1/auditp.txt
$$ ##AUDIT TRAIL=  $$ (NUMBER, WHEN, WHO, WHERE, PROCESS, VERSION, WHAT)
(   1,<2013-11-09 18:32:57.901 -0800>,<Administrator>,<X>,<go>,<TOPSPIN 2.1>,
      <created by zg
	started at 2013-11-09 18:31:51.283 -0800,
	POWCHK enabled, PULCHK disabled,
       configuration hash MD5:
       C8 4E 4E 5D D3 5C D8 9E 9F 52 82 E0 59 8A DE 15
       data hash MD5: 64K
       A9 3B 40 D6 22 A1 61 C3 D1 69 94 E0 09 91 86 AA>)
(   2,<2013-11-09 18:33:00.792 -0800>,<Administrator>,<X>,<proc1d>,<TOPSPIN 2.1>,
      <Start of raw data processing
       efp LB = 0 FT_mod = 6 PKNL = 1 PHC0 = 0 PHC1 = 0 SI = 32K 
       data hash MD5: 32K
       59 01 62 EF AC D3 EA E6 9F 11 06 3A 9A A1 3C 8F>)
(   3,<2013-11-09 18:33:01.135 -0800>,<Administrator>,<X>,<proc1d>,<TOPSPIN 2.1>,
      <pk PHC0 = 93.24097 PHC1 = 0 
       data hash MD5: 32K
       F8 7B C9 06 EC 48 32 7B 9F 0C 9F FB 8C C7 E3 49>)
(   4,<2013-11-09 18:33:01.213 -0800>,<Administrator>,<X>,<proc1d>,<TOPSPIN 2.1>,
      <abs ABSG = 1 
       data hash MD5: 32K
       C2 DB 84 40 62 0F AB 48 9C BF 2C 09 DF 93 3B 77>)
(   5,<2013-11-09 18:33:01.292 -0800>,<Administrator>,<X>,<proc1d>,<TOPSPIN 2.1>,
      <abs ABSG = 2 
       data hash MD5: 32K
       65 00 83 63 69 9A 3A 3F 6C 87 46 B9 EF 62 02 07>)
(   6,<2013-11-09 18:33:01.385 -0800>,<Administrator>,<X>,<proc1d>,<TOPSPIN 2.1>,
      <abs ABSG = 3 
       data hash MD5: 32K
       F8 13 4E 71 71 9B 46 DC 23 F1 1B 2C 68 21 19 21>)
(   7,<2013-11-09 18:33:01.448 -0800>,<Administrator>,<X>,<proc1d>,<TOPSPIN 2.1>,
      <abs ABSG = 4 
       data hash MD5: 32K
       56 41 A1 DB A2 0E 5A 3B 3D D2 5C FF 69 B2 4D CD>)
(   8,<2013-11-09 18:33:01.510 -0800>,<Administrator>,<X>,<proc1d>,<TOPSPIN 2.1>,
      <abs ABSG = 5 
       data hash MD5: 32K
       E7 DC 79 AD D7 2B AE 10 03 64 7D 75 19 6B 05 D6>)
$$ ##END=
$$ 
$$ $$ hash MD5
$$ $$ 55 03 88 6B 9F 5E 6C DF CE ED F8 40 31 72 F1 F4
##$RELAX= 
##$RELAX= 
##$RELAX= 
##$RELAX= 
##$RELAX= 
##$RELAX= 
##$RELAX= 
$$ Bruker specific parameters
$$ --------------------------
##$DU= <E:\>
##$EXPNO= 10
##$NAME= <AC1601_NICAH13331_8315839_jAzB6LRIxf>
$$ [...]
150 150 150 150 150 150 150 150
##$TP07= 0
##$TPNAME0= <>
##$TPNAME1= <>
##$TPNAME2= <>
##$TPNAME3= <>
##$TPNAME4= <>
##$TPNAME5= <>
##$TPNAME6= <>
##$TPNAME7= <>
##$TPOAL= (0..7)
0.5 0.5 0.5 0.5 0.5 0.5 0.5 0.5
##$TPOFFS= (0..7)
0 0 0 0 0 0 0 0
##$TUNHIN= 0
##$TUNHOUT= 0
##$TUNXOUT= 0
##$USERA1= <user>
##$USERA2= <user>
##$USERA3= <user>
##$USERA4= <user>
##$USERA5= <user>
##$V9= 5
##$VALIST= <valist>
##$VCLIST= <CCCCCCCCCCCCCCC>
##$VD= 0
##$VDLIST= <DDDDDDDDDDDDDDD>
##$VPLIST= <PPPPPPPPPPPPPPP>
##$VTLIST= <TTTTTTTTTTTTTTT>
##$WBST= 1024
##$WBSW= 4
##$XGAIN= (0..3)
0 0 0 0
##$XL= 0
##$YL= 0
##$YMAX_a= 592161
##$YMIN_a= -505711
##$ZGOPTNS= <>
##$ZL1= 120
##$ZL2= 120
##$ZL3= 120
##$ZL4= 120
##$ABSF1= 14.98509
##$ABSF2= -5.573092
##$ABSG= 5
##$ABSL= 3
##$ALPHA= 0
##$AQORDER= 0
##$ASSFAC= 0
##$ASSFACI= 0
##$ASSFACX= 0
##$ASSWID= 0
##$AUNMP= <proc_prof1d_extract_pilot.lims>
##$AXLEFT= 0
##$AXNAME= <>
##$AXNUC= <1H>
##$AXRIGHT= 0
##$AXTYPE= 0
##$AXUNIT= <>
##$AZFE= 0.1
##$AZFW= 0.1
##$BCFW= 0
##$BC_mod= 0
##$BYTORDP= 0
##$COROFFS= 0
##$CY= 15
##$DATMOD= 1
##$DC= 0
##$DFILT= <>
##$DTYPP= 0
##$F1P= 0
##$F2P= 0
##$FCOR= 0.5
##$FTSIZE= 32768
##$FT_mod= 6
##$GAMMA= 0
##$GB= 0
##$INTBC= 1
##$INTSCL= 1
##$ISEN= 128
##$LB= 0
##$LEV0= 0
##$LPBIN= 0
##$MAXI= 10000
##$MC2= 0
##$MEAN= 0
##$ME_mod= 0
##$MI= 0
##$NCOEF= 0
##$NC_proc= -8
##$NLEV= 6
##$NOISF1= 0
##$NOISF2= 0
##$NSP= 0
##$NTH_PI= 0
##$NZP= 0
##$OFFSET= 14.98509
##$PC= 1
##$PHC0= 93.24097
##$PHC1= 0
##$PH_mod= 1
##$PKNL= yes
##$PPARMOD= 0
##$PPDIAG= 0
##$PPIPTYP= 0
##$PPMPNUM= 2147483647
##$PPRESOL= 1
##$PSCAL= 4
##$PSIGN= 0
##$PYNMP= <proc.py>
##$REVERSE= no
##$SF= 400.02
##$SI= 32768
##$SIGF1= 0
##$SIGF2= 0
##$SINO= 400
##$SIOLD= 32768
##$SPECTYP= <>
##$SREGLST= <1H.CDCl3>
##$SSB= 0
##$STSI= 32768
##$STSR= 0
##$SW_p= 8223.68421052631
##$SYMM= 0
##$S_DEV= 0
##$TDeff= 65536
##$TDoff= 0
##$TI= <>
##$TILT= no
##$TM1= 0
##$TM2= 0
##$TOPLEV= 0
##$USERP1= <user>
##$USERP2= <user>
##$USERP3= <user>
##$USERP4= <user>
##$USERP5= <user>
##$WDW= 1
##$XDIM= 32768
##$YMAX_p= 461313007
##$YMIN_p= -676709
##$CURPLOT= <Network HP LaserJet P1505>
##$CURPRIN= <$Network HP LaserJet P1505>
##$DFORMAT= <normdp>
##$LAYOUT= <+/1D_H.xwp>
##$LFORMAT= <normlp>
##$PFORMAT= <normpl>
##$SURQMSG= 1
$$ End of Bruker specific parameters
$$ ---------------------------------
##NTUPLES= NMR SPECTRUM
##VAR_NAME=  FREQUENCY,     SPECTRUM/REAL,   SPECTRUM/IMAG
##SYMBOL=    X,             R,               I
##VAR_TYPE=  INDEPENDENT,   DEPENDENT,       DEPENDENT
##VAR_FORM=  AFFN,          ASDF,            ASDF
##VAR_DIM=   32768,         32768,           32768
##UNITS=     HZ,            ARBITRARY UNITS, ARBITRARY UNITS
##FACTOR=    0.250966925370066, 1,           1
##FIRST=     8223.43324360094, -55178,       -163679
##LAST=      0,             96680,           -64345
##MIN=       0,             -676709,         0
##MAX=       8223.43324360094, 461313007,    0
$$ Real data points
##PAGE= N=1
##DATA TABLE= (X++(R..R)), XYDATA
$$ [...]
19560D4671d8923C310K69987I6717h9885B1453a26524G5856Q5375a48703D3006
19548b41830e7922A06631b75279a17459A341M9935G731J85323p3000b86445a02051
19536D1930c9718j97651O3638k22792a74043j58711d8842a2120n9525k00031f8206
19524A51948J56727p2571b1184m14564A0741J99234h4472F4681J20262g3921A74878
19512b22411J6714Q2838j04177c9594l175k31940C5288b82047B2391a09892d6354
19500h2000k31789a29542B9018b36982a1346m3144A6127a06391G1291M6477b16795
19488G5587i4277o2394k43976a74229j61591A21647d09314C7896b29483i7039
19477b19760A50056a65875A00405Q9077l0079d7969j00479A65673f5052A0583
$$ plain form
19560 44671 -48923 3310 273297 96717 -89885 21453 -126524 75856 161231 -148703 43006
19548 -241830 -57922 106631 -275279 -117459 1341 51276 7731 193054 120054 -286445 -102051
19536 41930 -39718 -237369 -173731 -396523 -174043 -332754 -48842 -12120 -71645 -271676 -68206
19524 151948 308675 236104 -21184 -435748 10741 209975 -84472 64681 184943 -73921 174878
19512 -222411 -205697 -122859 -227036 -39594 -42769 -274709 35288 -282047 22391 -109892 -46354
19500 -82000 -313789 -129542 29018 -236982 -11346 -54490 16127 -106391 71291 117768 -216795
19488 75587 -94277 -156671 -400647 -174229 -335820 121647 -409314 37896 -229483 -97039
19477 -219760 150056 -165875 100405 189482 159403 -47969 -148448 165673 -65052 10583
19466A6324L69620G9582P6343b10313O3057A28032a81585A34834i8108A6190J33310
19455A49500b68997j12882B02464e4224h015A27923b59388B05229O9496B4685
19444A19820b64531o111f2601j13563A4208b04946C5747J37807b27452m2934a1207
19432C15497c94320J60934k2233K0421a03058B12928I318a08103D29179A61116
19421C5392c47922l1551F3417O885J15321C43b92752a30616l30858A68186a60539
19409b60211i5354B51700C8012a23004j55623L7654k29328K24187F3635g2330
19398b88562I1119b88336C10018c35377R4138I1902c08133C20088j38064E6933
19387I0255L0800c52436f8386B8469e2271C16495b55715g7780A24852c72167A44528
$$ plain form
19466 16324 385944 79582 155925 -210313 -147256 128032 -181585 134834 -98108 16190 149500
19455 149500 -268997 -381879 202464 -54224 -8015 127923 -259388 205229 274725 24685
19444 119820 -264531 -270642 -62601 -176164 14208 -204946 35747 173554 -227452 -270386 -11207
19432 315497 -394320 -233386 -255619 -235198 -103058 212928 9318 -108103 429179 161116
19421 35392 -347922 -379473 63417 70302 185623 343 -292752 -130616 -461474 168186 -160539
19409 -260211 -95354 251700 38012 -123004 -278627 -240973 -470301 -246114 63635 -72330
19398 -288562 91119 -288336 310018 -335377 -241239 91902 -308133 320088 182024 56933
19387 90255 121055 -352436 -68386 28469 -52271 316495 -255715 -77780 124852 -372167 144528
19375c68073A28419P301K36973b27657f1385E2442c23486A36752L0167A6360Q8999
19364A05359a00823k32676J51010r9518l694F5215J53430F0791P3966a87203k6348
19353b13551A29052b52527L9862H7660a25642q8753R252P978B40093f8881D333
19341A25870a05971c5472l55696A10008a90462C1226c11949a50019q0463b3577
19330B48080E703a37133b2952A74534b90767C14361a65981m5068B9848a69559
19319a67573i321l21344h1356p2348a9957A20714g3993o6572F5367i3160j96935
19308b90095A9186N1184b44522A93986a12813A8962d02576B01377a71800B29058
19297f507o0490B63940b38016A55072c1563A12135a18125j15592a8464k28457
$$ plain form
19375 -368073 128419 135720 372693 -227657 -61385 52442 -323486 136752 166919 16360 105359
19364 105359 -100823 -333499 -182489 -282007 -285701 65215 218645 60791 134757 -187203 -213551
19353 -213551 129052 -252527 -212665 87660 -125642 -214395 -205143 -197165 240093 -68881 4333
19341 125870 -105971 -35472 -391168 110008 -190462 31226 -311949 -150019 -230482 -23577
19330 248080 5703 -137133 -22952 174534 -290767 314361 -165981 -211049 29848 -169559
19319 -167573 -9321 -330665 -81356 -153704 -19957 120714 -73993 -140565 65367 -93160 -290095
19308 -290095 19186 70370 -244522 193986 -112813 18962 -402576 201377 -171800 229058
19297 -6507 -66997 263940 -238016 155072 -31563 112135 -118125 -233717 -18464 -246921
19287b46921c3283B89499f1414K3906j17763N9071l4112A6974d7751b1660o721
19276b8381B6670a28001h189D12585C5937m640P4084a91382o4306A8780b01032
19264B4530a75916h5140p035P9j23223B26611h0924D2448K5896d6085k02991D9336
19251a78112A11740b73935g7642D375i1965l34389f9661G1651L22213a2894A3030
19239b7669q8577C3408a12581L3738j25737p7767b4947j1301m7366r7593h5243
19227a72676m60755F3217a87667K9935A29078o2688r087h6787B19674o2434a00858
19215B61433E4923K4654j9388a50456j75968F6686K06606b31580D1154a43205
19204a27799A44164a65319A83400c752j42386k90371a45738j2069i369H5782a44991
$$ plain form
19287 -246921 -33283 289499 -61414 -37508 -155271 -96200 -130312 16974 -47751 -21660 -28381
19276 -28381 26670 -128001 -8189 412585 35937 31297 105381 -191382 -255688 18780 -201032
19264 24530 -175916 -85140 -92175 -92096 -215319 226611 -80924 42448 68344 -46085 -249076 49336
19251 -178112 111740 -273935 -77642 4375 -91965 -426354 -69661 71651 393864 -12894 13030
19239 -27669 -116246 33408 -112581 -78843 -204580 -282347 -24947 -36248 -83614 -181207 -85243
19227 -172676 -633431 63217 -187667 -157732 129078 66390 57303 -86787 219674 157240 -100858
19215 261433 54923 79577 60189 -150456 -326424 66686 273292 -231580 41154 -143205
19204 -127799 144164 -165319 183400 -3752 -146138 -436509 -145738 -157807 -9369 85782 -144991
19192B37269a5148A97483p6436b77613f3152H5070a65733g8542r8632K9503c8552
19180a27744B23755a78198c7212j04431C4979d48926A20754f9224j42179j23122
19170c34525g9750k1762k03026b3621l21445h1569k62256P4866J01084o2901j92929
19159d23705J30295l2784C3270a43943j75843A39096L3657a40782a6490n0295
19149f6785L3067G6228J51580f1384C4756a33998b1082j49511E8553j6848b69145
19137a22401j99257a01949m5545O0039A39575C4482J43583b95670A20381a20010
19126A02347i033B13945e2776A06890a59886H2857b37915a01995q2794J7525g754
19114a7970m6472r3954a9414k69263A18897b80299g2671A8486f4280n0565N1358
$$ plain form
19192 237269 -15148 197483 121047 -277613 -63152 85070 -165733 -78542 -177174 -147671 -38552
19180 -127744 223755 -178198 -37212 -141643 34979 -448926 120754 -69224 -211403 -334525
19170 -334525 -79750 -101512 -304538 -23621 -345066 -81569 -343825 -268959 -167875 -230776 -423705
19159 -423705 -293410 -326194 33270 -143943 -319786 139096 172753 -140782 -16490 -66785
19149 -66785 -33718 76228 227808 -61384 34756 -133998 -21082 -170593 58553 41705 -269145
19137 -122401 -321658 -101949 -147494 -87455 139575 34482 178065 -295670 120381 -120010
19126 102347 -9033 213945 -52776 106890 -159886 82857 -237915 -101995 -184789 -167264 -7754
19114 -17970 -64442 -158396 -19414 -288677 118897 -280299 -72671 18486 -64280 -114845 -63487
19103f3487j93330A16047b18037h0390B06808b27379A8899a37309G6563f9321
19092h2387O961j94604a18959G0730a0596A40928i7438C46338b21217c2609m662
19081c7271j29724J0965j73417a09604j44407i3142E4596J29815a30415m6252
19071a76667l5747D5110O815Q0172b4486C2818J17153A6693J19017k2877d5036
19059i190j70898N6626C929P9117a57009e2089l51821b348j31469e3907q9691
19048a43598a2549r2463q1986B97226g9506Q353B3019a30091g273C77801G7809
19036A41062c742k17343A54537a15385B05646j9054a63729A58519d8853J8631
19026c0222k5012j6129C0345a42271j20976D7362b01998h7188n6167A23215J16753
$$ plain form
19103 -63487 -256817 116047 -218037 -80390 206808 -227379 18899 -137309 76563 -69321
19092 -82387 -75426 -270030 -118959 70730 -10596 140928 -97438 346338 -221217 -32609 -37271
19081 -37271 -166995 -156030 -329447 -109604 -254011 -93142 54596 184411 -130415 -176667
19071 -176667 -212414 45110 51925 132097 -24486 32818 149971 16693 135710 112833 -45036
19059 -9190 -180088 -123462 3929 83046 -157009 -52089 -403910 -2348 -133817 -53907 -143598
19048 -143598 -12549 -105012 -186998 297226 -79506 -71153 23019 -130091 -7273 377801 77809
19036 141062 -3742 -221085 154537 -115385 205646 186592 -163729 158519 -48853 -30222
19026 -30222 -55234 -71363 30345 -142271 -263247 47362 -201998 -87188 -143355 123215 239968
19015B39968N598a5983A78780n9800J0541k8635O8203o5151e8973k2941j91096
19004b73010J5363d1681g395C8391J15281a45018n8077d0301k80173J40611E0732
18992A3068a33923m4118M7258E4558a59680c8821a3369k86313B1905d7956l36517
18981c84473g1135G6646K2702i0824J3745r7653N49c4811l36363a58251a6710
18969i8181k74344e0942k9041j01703e4799C16110A30932c1239A70657P6343c8924
18957D9571b2614A64952F1881a29812k77617i3476p5400A88798l3926f0676H8503
18945g2061j81933H7761j4087c8527j10625O7580a6770j12285C07257I4125b00170
18933i9468A19478M1512a52549j22243f0513q0235e1125E9943M0084b12061A07269
$$ plain form
19015 239968 245566 -15983 178780 118980 129521 100886 169089 103938 -58973 -81914 -273010
19004 -273010 -257647 -41681 -7395 38391 153672 -145018 -203095 -40301 -320474 -179863 50732
18992 13068 -133923 -178041 -130783 54558 -159680 -38821 -13369 -299682 21905 -47956 -384473
18981 -384473 -71135 76646 99348 -90824 -77079 -174732 -174183 -34811 -371174 -158251 -16710
18969 -98181 -372525 -50942 -79983 -181686 -54799 316110 130932 -31239 170657 247000 -38924
18957 49571 -22614 164952 61881 -129812 -407429 -93476 -168876 188798 154872 -60676 88503
18945 -72061 -253994 87761 73674 -38527 -149152 -81572 -16770 -129055 307257 94125 -200170
18933 -99468 119478 160990 -152549 -274792 -60513 -140748 -51125 59943 100027 -212061 107269
18921A26643b06398O5464j07836e6296D8492J8049B3891K19335A3828Q6502I302
18909G7522J13774G7703b12773i2018G7070a0286E5215a667I947a80891I6832
18897h2638A6158L15395b5018A4869c1845j75753B31476a61309k84143e775l3096
18886c8871A66388b1877j02685O675G03P2423b76963B11517a59441l7180I0607
18874E5866c31678F4798d58453a84231A54410b98991A98248a48812N8055E2881
18863B3889a14491D2002b87489J06012A13126A0628a20340m9014P9797j10258
18853a99815m4802A14274d9942j90352N8129g08k07696B42711n1437a99725N2938
18842a46787f3903j57447j91999B46483c59283B20920c38463B87483b02091g9170
$$ plain form
18921 126643 -206398 -140934 -248770 -56296 48492 66541 23891 243226 13828 100330 9302
18909 77522 191296 77703 -212773 -92018 77070 -10286 55215 -1667 9947 -180891 96832
18897 -82638 16158 331553 -25018 14869 -31845 -207598 231476 -161309 -445452 -5775 -38871
18886 -38871 166388 -21877 -124562 -117887 703 73126 -276963 211517 -159441 -196621 90607
18874 55866 -331678 64798 -458453 -184231 154410 -298991 198248 -148812 -90757 52881
18863 23889 -114491 42002 -287489 -181477 113126 10628 -120340 -169354 -89557 -199815
18853 -199815 -244617 114274 -49942 -240294 -182165 -708 -208404 242711 191274 -199725 -146787
18842 -146787 -63903 -221350 -413349 246483 -359283 220920 -338463 287483 -202091 -79170
18831B89265F8161a64969I8976J6789a00255A1262a00120K8936K1149D1129b86671
18819H7649O5000b5219H336M43421b12733C84876a42192G3225L1627K02583i6686
18807G2596K6072O3662g6232k68442P5807R7728j3831A48961l1605J24915l1337
18796B10934d13754e5811k25767A29964N4327d46085g8086a9307k31268p4291
18786c24866l7715C00962I1960K49314b61999a19672b0752G9419d1134A52249
18775b12439R0170B16190a85691d5034m1591J7875k52242K8918J05092h9549C53948
18763H0586b04151g6433B02598d1926A95758D1263J7310g6000k3985n462j0364
18752a15811E10475a3882n2932m5603A60032b62555d0344j12873q071d2652n5237
$$ plain form
18831 289265 68161 -164969 98976 115765 -100255 11262 -100120 -71184 -50035 41129 -286671
18819 87649 152649 -25219 8336 451757 -212733 384876 -142192 73225 104852 307435 -96686
18807 72596 98668 162330 -76232 -344674 -268867 -171139 -184970 148961 117356 242271 210934
18796 210934 -413754 -55811 -281578 129964 184291 -446085 -78086 -19307 -250575 -324866
18786 -324866 -362581 300962 91960 341274 -261999 -119672 -20752 79419 -41134 152249
18775 -212439 -122269 216190 -185691 -45034 -86625 -68750 -320992 -292074 -186982 -89549 353948
18763 80586 -204151 -76433 202598 -41926 195758 41263 58573 -76000 -99985 -105447 -115811
18752 -115811 510475 -13882 -66814 -112417 160032 -262555 -40344 -153217 -161288 -42652 -97889
18741i7889A6737d95305J88761R86O0465A52058A5306B904J11168n0945G079K83752
18729B90831f2342l8251L3161K4682l26096a82030A2225h7646K996A25338a83195
18717a58566A12385d7161b019j61244B5906c08605b1804n7620F3582i3736L4051
18706e9685j80648a12521j02638I4273d73233C42578a12848A7971e9555A9438
18695a38374l73080a34936l9630k1631P1321E155j925R1906a07603G4677a27579
18683B61938a68082L6347j13700A12988d17046J12130B0129m843c5684I6625a97113
18671A0362c9691j73382q571L7471R1810A98004f2189B25419A5639J15168a38521
18659B9236a58687N9295A31234l9682K09992C1046M6833M8944d21458J26219J24267
$$ plain form
18741 -97889 16737 -495305 -306544 -305558 -245093 152058 15306 2904 114072 63127 7079 290831
18729 290831 -62342 -100593 -67432 -42750 -368846 -182030 12225 -87646 -84650 125338 -183195
18717 -158566 112385 -47161 -2019 -163263 25906 -308605 -21804 -79424 63582 -93736 -59685
18706 -59685 -240333 -112521 -215159 94273 -473233 342578 -112848 17971 -59555 19438
18695 -138374 -511454 -134936 -174566 -196197 -124876 5155 3230 95136 -107603 74677 -127579
18683 261938 -168082 -131735 -245435 112988 -417046 -304916 20129 15286 -35684 96625 -197113
18671 10362 -39691 -213073 -221644 -184173 -92363 198004 -62189 225419 15639 130807 -138521
18659 29236 -158687 -99392 131234 91552 301544 31046 77879 126823 -421458 -295239 -170972
18648a70972D8101K79306A35313a84840h6743A58717e0805D897i3770r3128a5571
18636g5714I5011i0152j55237A49360b22553m4272N6990O9262I6444L845O8559
18625A68848d05729A17137A2794L2399c53739J51288C94587b57040a07732A82561
18614a15306j36024A90735f3669j42205K9321l1471A38730n4140d0977l37720
18604c78697C45981A30495g4620L771k27885E6495h7025I6378L9929b50888A06126
18592d4479j24261M5941k00444b577k77104I78a7543j07228A78117G8717c49142
18580E2471a69747c8360J7401k45445A85437b86878M3788b9394j45052A6974d300
18568A80400a15723m683q1393F5801g7035b7891F4424M0341b47401B48242a34486
$$ plain form
18648 -170972 48101 327407 135313 -184840 -86743 158717 -50805 4897 -93770 -186898 -15571
18636 -75714 95011 -90152 -245389 149360 -222553 -266825 -209835 -140573 96444 100289 168848
18625 168848 -405729 117137 12794 45193 -353739 -202451 394587 -257040 -107732 182561
18614 -115306 -251330 190735 -63669 -205874 -176553 -208024 138730 84590 -40977 -378697
18604 -378697 345981 130495 -74620 -70849 -298734 56495 -87025 96378 136307 -250888 106126
18592 -44479 -168740 -122799 -323243 -2577 -279681 978 -17543 -124771 178117 78717 -349142
18580 52471 -169747 -38360 -20959 -266404 185437 -286878 -243090 -29394 -174446 16974 -4300
18568 180400 -115723 -120406 -201799 65801 -77035 -27891 64424 104765 -247401 248242 -134486
18556B3173c29244a7067l59629d4293k2733K7136n0688j90142c7024j84094o05
18545b21723D9276h5076A39867c82156g1708E6790a52974j22483n5587B32923
18534A40665b2760k03954j98713b03640A67882a44908A56077h7956j1036j22840
18524b21832C02313b68235L0013Q5281J0443C2894L32942a03483E9806d1907r0868
18513a32775N9162n563C3987b7517r1643N2114D6669L84486a3411j00167c7429
18501H79d5829l9454B2825b14013d832A1959a6602A3020b97144k6773A32086a23277
18488a14996b5831k7444o8155j77299e8916m81125A67634q1975L1851a74666g5569
18476B9314Q3938c30j82574e1961k01111h9460K6368C9831b65382a5630B29727
$$ plain form
18556 23173 -329244 -17067 -376696 -44293 -67026 -39890 -90578 -280720 -37024 -221118 -221723
18545 -221723 49276 -85076 139867 -382156 -71708 56790 -152974 -275457 -331044 232923
18534 140665 -22760 -226714 -425427 -203640 167882 -144908 156077 -87956 -98992 -221832
18524 -221832 302313 -268235 -238222 -152941 -142498 32894 365836 -103483 59806 -41907 -132775
18513 -132775 -73613 -79176 33987 -27517 -119160 -67046 46669 431155 -13411 -113578 -37429
18501 879 -45829 -85283 22825 -214013 -4832 11959 -16602 13020 -297144 -323917 132086 -123277
18488 -114996 -25831 -53275 -121430 -298729 -58916 -540041 167634 85659 117510 -174666 -75569
18476 29314 113252 -330 -182904 -51961 -253072 -89460 -63092 39831 -265382 -15630 229727
18464A26584h2462j6697E441a62206P9155c7139e010j46928B35855J57192a08927
18452b08676P5871A6914a7747A70833b08120A87596N2973a1439B42900j09505
18442A33395b17568d854r8287M7509n8423A81340c05430d1026j01010C33120g316
18430B72160a76191E3297c4252A11872a59859O4187l2676l1861H687b80107Q3749
18419a96358f3662G394K10120J80941c32789A8447g2531b7409j29556d3360m1779
18408h5139A87139i2705B18419m6999J8960L3545J4552e7092A13520C498f1776
18396A86607K79682a47546k35070B89509a75167b6089A52657Q8034c88686E4557
18385B49195b93566H8320d3701m3984q8590N0060j9493e1663J5807B41787a53746
$$ plain form
18464 126584 -82462 -99159 5441 -162206 -83051 -37139 -5010 -151938 235855 393047 -108927
18452 -208676 -132805 16914 -17747 170833 -208120 187596 240569 -11439 242900 133395
18442 133395 -217568 -4854 -103141 -55632 -114055 181340 -305430 -41026 -142036 333120 -7316
18430 272160 -176191 53297 -34252 111872 -159859 -95672 -128348 -160209 8687 -280107 -196358
18419 -196358 -63662 7394 217514 398455 -332789 18447 -72531 -27409 -156965 -43360 -85139
18408 -85139 187139 -92705 218419 171420 190380 223925 238477 -57092 113520 3498 -61776
18396 186607 466289 -147546 -382616 289509 -175167 -26089 152657 240691 -388686 54557
18385 249195 -293566 88320 -43701 -87685 -176275 -126215 -145708 -51663 -35856 241787 -153746
18373A12461e5078G9446J60789K3016c4199A83775b90365A70009e7360J4929j72557
18362b14988d028j59443j17752D5175c55002a37652d7957j25286B90414a15328
18351F8857d5287k62714n7775J28543C18412c6087m2973A03177h6507C9882J47447
18340A87329E199g4224o5011N8410J3895C541a08917j20286k55648a1667o6799
18329g8466L1353k04202A00568f599p6118F7799d7933j0408k35102K4082k47334
18318e16695I6141M7990b9352o4557A0546M4959a82793C7162d2280L750m0696
18307g9226D1387a12932A20639f3157j22508a2266L577B48759a83482m2641g4855
18295a64981A19777h7975l23744a03343M5451B10085c39246a22407A11683b78506
$$ plain form
18373 112461 -55078 79446 240235 263251 -34199 183775 -290365 170009 -57360 -42431 -214988
18362 -214988 -4028 -163471 -281223 45175 -355002 -137652 -47957 -173243 290414 -115328
18351 68857 -45287 -308001 -365776 -237233 318412 -36087 -79060 103177 -86507 39882 187329
18340 187329 5199 -74224 -139235 -80825 -66930 3541 -108917 -229203 -484851 -11667 -78466
18329 -78466 -47113 -251315 100568 -6599 -82717 67799 -47933 -58341 -293443 -269361 -516695
18318 -516695 96141 144131 -29352 -93909 10546 55505 -182793 37162 -42280 -38530 -79226
18307 -79226 41387 -112932 120639 -63157 -185665 -12266 -8689 248759 -183482 -226123 -74855
18295 -164981 119777 -87975 -411719 -103343 -57892 210085 -339246 -122407 111683 -278506
18284a29507a2833A79646B7066b30277a643B03518a82081h4396A77188a28193
18273A56073c38147A04139L1743a32168Q856j64461a13511j28951J10973E3206
18262a3902A04373a39306f4942B24507q8492a37405c9931D4499R0094a33296B20466
18250C41165d0825k26167m6418A4325N6265b12029A38374k7176M6630c53526L2535
18239c20991i9782C4046f8762A66426j9423d0049G9812e1352o1642A12822a74461
18227b37910C9433h1528d191p8645o6380F5492N7822c07353B73775D8554a81511
18215B4343O3381e1802A06336h3094A94117J6755P957h3609I5552c16204A43952
18203A34581a57505B26855c21937B90793b22872f5290j22010H5170J6729c1469
$$ plain form
18284 -129507 -12833 179646 27066 -230277 -1643 203518 -182081 -84396 177188 -128193
18273 156073 -338147 104139 135882 -132168 -123312 -287773 -113511 -242462 -131489 53206
18262 -13902 104373 -139306 -64942 224507 136015 -137405 -39931 44499 134593 -133296 220466
18250 341165 -40825 -266992 -313410 14325 70590 -212029 138374 111198 157828 -353526 -320991
18239 -320991 -99782 34046 -68762 166426 147003 -40049 79812 -51352 -112994 112822 -174461
18227 -237910 39433 -81528 -4191 -82836 -149216 65492 123314 -307353 273775 48554 -181511
18215 24343 87724 -51802 106336 -83094 194117 210872 218829 -83609 95552 -316204 143952
18203 134581 -157505 226855 -321937 290793 -222872 -65290 -187300 85170 101899 -31469
18192c7817j22008O4026A51694k0410b15406e1118E9309a849k2657A34340C2102
18180A03549O8053i0569j877j1214k12473H6572c6409A2883b97627a1122k52800
18169b63922K6440R699A32026c1795j2006j34889P366D7439R8178e5433j40699
18158a96132j37309B26838j08461n5726Q5843J49726E805b12528C273K7982g4219
18146E7705b0181I9861B0450c6888r0841G8360b6856j28407j095D7691b83720
18134b07915a00523E6721b01426p8218A2087g4583J9550R857F0598a01842L9362
18123f2480j26024A86277C132a76803A47383F5144a73987j55997A1224b34829
18112b75041k040A59573a08547j04631C7357b07315R7426K715A50587J30769H8575
$$ plain form
18192 -37817 -159825 -95799 151694 131284 -215406 -51118 59309 -1849 -24506 134340 32102
18180 103549 171602 -90569 -92446 -103660 -316133 86572 -36409 12883 -297627 -11122 -263922
18169 -263922 -237482 -227783 132026 -31795 -43801 -178690 -171324 47439 145617 -55433 -196132
18158 -196132 -333441 226838 118377 62651 148494 298220 5805 -212528 3273 31255 -74219
18146 57705 -20181 99861 20450 -36888 -127729 78360 -26856 -155263 -156358 47691 -283720
18134 -207915 -100523 56721 -201426 -279644 12087 -74583 -55033 -45176 60598 -101842 -62480
18123 -62480 -188504 186277 3132 -176803 147383 65144 -173987 -329984 11224 -234829
18112 -275041 -277081 159573 -108547 -213178 37357 -207315 -109889 -107174 150587 281356 88575
18100A99688i8107m0213e8641A8107f7631p2996A15703D5842B488J27951B172
18088b00220A95022a26291o7803P1959r3595c1173j67405B55786b55124L7983
18078b17141A38584J94131a76269b5609D4761j3860c6182C87846i5637k6745m5530
18067a67912B265J68464a14991l3077L5859b5263B33939B5035a47644B26164a52289
18055C0353A3267J06397l3806c186B9524h9317k40357a32272A60819a05790q6597
18044a92387B89463a28788B78323j117h7405A86544a90626C7030K43833A05434
18033B80980a10947p9779c0618k12037A23406F0162g9240A07509b46655A47833
18022F6897Q283b40143b9568n4778D26658B1521e5635E9007h6308B0305J70042
$$ plain form
18100 199688 -98107 -138320 -58641 18107 -67631 -140627 115703 45842 2488 130439 2172
18088 -200220 195022 -126291 -194094 -122135 -215730 -31173 -198578 255786 -255124 -217141
18078 -217141 138584 332715 -176269 -25609 44761 30901 -36182 387846 -95637 -122382 -167912
18067 -167912 2265 170729 -114991 -148068 -112209 -25263 233939 25035 -147644 226164 -152289
18055 30353 13267 119664 85858 -3186 29524 -89317 -329674 -132272 160819 -105790 -192387
18044 -192387 289463 -128788 278323 277206 -87405 186544 -190626 37030 280863 105434
18033 280980 -110947 -190726 -30618 -242655 123406 60162 -79240 107509 -246655 147833
18022 66897 75180 -240143 -29568 -84346 426658 21521 -55635 59007 -86308 20305 190347
18011A90347i8690l1740K0252j30569e173A30426b46282J04063j43229a4600F8918
17999b24626A4994g2485G7125l7996J55859a95653E48J55910L93862e09494a84099
17987i7608A65327A6731R4211a95636D6960b41902J6206D3957N6683a31674E9687
17975B34123a00886B7042J65714a54373A24353J73760a73767e8573H528i9272
17964A39421F3317h0916q2416C7280N0693a69196k24376j18616K40405C1745J53864
17953A85609n2872a5147j56358A3430J6846J39189F6723C3071R2857a03703c8643
17941g0689A12559a35554q7749N2934f3097m3034K5312A29921a36982M0306b9266
17929B1096J2369b83053K1376P4833F9101M8681J11284D7960g1830b202q8415
$$ plain form
18011 190347 -98690 -130430 -110178 -240747 -5173 130426 -246282 -142219 -285448 -14600 68918
17999 -224626 14994 -72485 77125 39129 194988 -195653 548 156458 550320 -509494 -184099
17987 -97608 165327 16731 110942 -195636 46960 -241902 -225696 43957 100640 -131674 59687
17975 234123 -100886 27042 192756 -154373 124353 298113 -173767 -58573 8528 -99272
17964 139421 63317 -80916 -163332 37280 87973 -169196 -393572 -512188 -271783 31745 185609
17953 185609 132737 -15147 -171505 13430 30276 169465 66723 33071 125928 -103703 -38643
17941 -70689 112559 -135554 -223303 -170369 -63097 -106131 -80819 129921 -136982 -96676 -29266
17929 21096 33465 -283053 -261677 -186844 69101 117782 229066 47960 -71830 -2202 -90617
17918i0617k25092a14429A80069b72438C78927B549J57318a35920k5179A93990
17907A12494n2348P8634B0386b97140A731a11366L8161b0316A28400k4793a83645
17895b81620e6431A37406a27430c7764j42981D3112a31919C3877a49246j64765
17885c14011P0915P8682d6729A83536b48675L4448C17693I1055a00423c521B17474
17873f8651H746c08884b0378F738O7558A3490J18604R4705n8269H391n72a13684
17860A20585c27018e176I7636a28985E144a05052A14474a58488B66000a17553
17849d25499B43986K264B1602J53706c5520B20553a39231B08873r2539D2103h3748
17837F9703i9825A09488J01539a58801b1956l0507A39119e8240F3105c74248J23206
$$ plain form
17918 -90617 -315709 -114429 180069 -272438 378927 2549 159867 -135920 -161099 193990
17907 112494 60146 138780 20386 -297140 1731 -111366 -73205 -20316 128400 103607 -183645
17895 -281620 -56431 137406 -127430 -37764 -180745 43112 -131919 33877 -149246 -314011
17885 -314011 -243096 -164414 -46729 183536 -248675 -214227 317693 91055 -100423 -3521 217474
17873 -68651 8746 -308884 -20378 6738 74296 13490 132094 226799 168530 8391 7819 -113684
17860 120585 -327018 -5176 97636 -128985 5144 -105052 114474 -158488 266000 -117553
17849 -425499 243986 246250 21602 175308 -35520 220553 -139231 208873 116334 42103 -83748
17837 69703 -99825 109488 211027 -158801 -21956 -52463 139119 -58240 63105 -374248 -251042
17826b51042A40667a67864d7719l24817B06204b97054i3968m01152A46193e0921
17815B21232b60351A90261B4991a40098c1634k9854i557A99321a89726K3945N7118
17804a08663j12555a06698N1803j85871a7806A01035b03000d7475j218H8661i004
17792c65901D3448h441j95225R2321n4942g1344q4318A01341Q2929a02461H9315
17780d9406k26372B55191a5639A42511A6105M27673A70641f044C5784d9508A49661
17768A44300b5797A12135R189c48338G6158c10624A25408R3717a45800p2390M3481
17757a74709B11597C0103c08868J18081Q9387F3584a90349A34864D4072K4929
17747F9001P5619D9826a56314A26297a93353D21093G2359K70181a68696A76720
$$ plain form
17826 -251042 140667 -167864 -47719 -372536 206204 -297054 -93968 -495120 146193 -50921
17815 221232 -260351 190261 24991 -140098 -31634 -61488 -9557 199321 -189726 -165781 -108663
17804 -108663 -221218 -106698 -54895 -240766 -17806 101035 -203000 -47475 -48693 88661 -9004
17792 -365901 43448 -8441 -203666 -111345 -166287 -71344 -155662 101341 184270 -102461 89315
17780 -49406 -275778 255191 -15639 142511 16105 443778 170641 -6044 35784 -49508 149661
17768 144300 -25797 112135 121324 -348338 76158 -310624 125408 219125 -145800 -218190 -174709
17757 -174709 211597 30103 -308868 -190787 -101400 63584 -190349 134864 44072 69001
17747 69001 144620 49826 -156314 126297 -193353 421093 72359 342540 -168696 176720
17736c2496F7975b21462E9700J24597G3662J37432c05744a48163A04662K0238
17726A24900b28513d8200j66723j0648c4043j03567j18097D9657b9474A42318
17715h1091b4150p7552A00217k3237a86732A21537b26818H5377a00235d5316B01664
17703a15522l9878A75048b18148B22042J1768Q9947j08052A2742C513M08574h0143
17691A32772b85459B29024h9957D5967b90949J31823G8777l2639N591i2945A34817
17679f9926A43011B9848R0662K0803a46338C0321H350a57170D9996L30973j47105
17668B33864m4538a18552B00034q8539j6437b41391b8583g689j45913e4976k08298
17657b63274b6606k34226B46034e4529E3588i9984A95446f8054A37791d1942A53703
$$ plain form
17736 -32496 67975 -221462 59700 184297 73662 211094 -305744 -148163 104662 124900
17726 124900 -228513 -48200 -214923 -225571 -34043 -137610 -255707 49657 -29474 142318
17715 -81091 -24150 -101702 100217 76980 -186732 121537 -226818 85377 -100235 -45316 201664
17703 -115522 -155400 175048 -218148 222042 233810 323757 215705 12742 3513 412087 -80143
17691 132772 -285459 229024 -89957 45967 -290949 -159126 78777 46138 51729 -92945 134817
17679 -69926 143011 29848 120510 141313 -146338 30321 8350 -157170 49996 380969 233864
17668 233864 189326 -118552 200034 111495 95058 -241391 -28583 -7689 -153602 -54976 -263274
17657 -263274 -26606 -260832 246034 -54529 53588 -99984 195446 -68054 137791 -41942 153703
17645A45509b2598C2965c55470H6661e5967j27957A08615a47221A71391a31950
17634a00349b5880A47993Q3997a3451l1822H6593A0570J48632H202P8677C8282
17622c50675E89342e514j30790c976A28171l3291b91577B50919a20480k66181
17612c86661h3402b6290B03188J41463a54248B34222a3683A96353g928n0942k68731
17601c27601L5732B87809a5859m3943C06023h9342e424k46299a01441d4084B257
17589D88353B0802J91415C2633j3044C704a08388L6064q1580O7581A26282B2296
17577A27315C2189b9356I8326j4971a34930A56312G3323J48505a66743A34678
17566C53715b0564C28831b33372A67067D4664K6909a08570B81706F1711A9014
$$ plain form
17645 145509 -22598 32965 -355470 86661 -55967 -183924 108615 -147221 171391 -131950
17634 -100349 -25880 147993 231990 -13451 -45273 86593 10570 159202 8202 86879 38282
17622 -350675 589342 -5514 -136304 -3976 128171 94880 -291577 250919 -120480 -386661
17612 -386661 -83402 -26290 203188 344651 -154248 234222 -13683 196353 -7928 -58870 -327601
17601 -327601 -291869 287809 -15859 -59802 306023 -89342 -5424 -251723 -101441 -44084 2257
17589 488353 20802 212217 32633 19589 3704 -108388 -72324 -153904 -86323 126282 22296
17577 127315 32189 -29356 98326 83355 -134930 156312 73323 221828 -166743 134678
17566 353715 -20564 328831 -233372 167067 44664 71573 -108570 281706 61711 19014
17555d0170B47966c0967H3332a40608D3356i2721b8528A1521g906A24460B4291
17543c93937J04123A25821k3934A203J64156b20891B50296h7034j68199d16A52016
17531a12798A80618N9105L3022J09888J6119A90173C3356J87341a38499e325C7482
17519E4515b51941A22217k849B5405K7844K23957q7104a31306a17B25816F8435
17507C7731M3603P8350a54636D4920J31816J36302j06495j2519a91124A06647
17496F8374K54885A38863n3200K76803A14438a77919B23617c49268A66188l8021
17486A28167c53783a30933B3672J7567J94755p4060l3875J85763A43082K25091
17476C68173j54273j1793H9827d7522a4180D4102K15821a64651f6722B16230H5742
$$ plain form
17555 -40170 247966 -30967 83332 -140608 43356 -92721 -28528 11521 -7906 124460 24291
17543 -393937 -289814 125821 101887 1203 165359 -220891 250296 -87034 -255233 -416 152016
17531 -112798 180618 239723 272745 382633 398752 190173 33356 220697 -138499 -5325 37482
17519 54515 -251941 122217 119368 25405 53249 277206 190102 -131306 -117 225816 68435
17507 37731 81334 159684 -154636 44920 176736 313038 206543 194024 -191124 106647
17496 68374 323259 138863 85663 362466 114438 -177919 223617 -349268 166188 128167
17486 128167 -353783 -130933 23672 41239 235994 161934 128059 313822 143082 368173
17476 368173 213900 202107 89827 -47522 -14180 44102 259923 -164651 -66722 216230 85742
17464D88202k39686b03729m1091C48731q8502g6102j244n5564A55341J13841p675
17453B61507A12433J21380o5246K34951D5513L0033N37155A70858K37792O9312
17443D77962A19783J46018o1986J32141E5569J78860j06098g3080q8250B10494
17432g7256A04381J72372M4530G510a70804B01748o12l1a5076B78756k7705N6612
17420C07663A26205n9627K48043a17614a5188I6494b43083D32878G9808b45705
17409A33976J80679D0550L52550A76080J57403A43493L3406J76941A09491n0204
17399E9287F270J97615J62188D966J45889h2979L0933A21033K29175H9485m1391
17388D8094A67M07249A5170M5353L04047A10921f7875C83627A55833m7081J37493
$$ plain form
17464 488202 248516 -203729 -244820 348731 260229 -76102 -77346 -132910 155341 269182 261507
17453 261507 112433 233813 168567 403518 45513 75546 612701 170858 408650 477962
17443 477962 119783 265801 203815 335956 55569 234429 128331 -73080 -161330 210494
17432 -77256 104381 276753 321283 7510 -170804 201748 201136 201105 -15076 278756 251051 307663
17420 307663 126205 66578 314621 -117614 -15188 96494 -243083 432878 79808 -245705
17409 133976 314655 40550 393100 176080 333483 143493 176899 353840 109491 59287
17399 59287 6270 203885 366073 4966 150855 -82979 -52046 121033 350208 89485 48094
17388 48094 167 407416 15170 60523 364570 110921 -67875 383627 155833 108752 246245
17377B46245I0577L04025h7444m0296B38158j02745J72912B0446b2885B4421a5140
17365A35450k9091J49227I6066a76909A48680a42545D33625B05018O5564n646
17355B64936J5766A25437g4877B8009M3856g9306b1999A77086O0617O6289I7385
17343i8201B46598A332L00871A5883N2060d7524f013q4311E8473J7976a72893
17331B76022b55917B3841J2852J2297b02445H3303K28745a28077b3711j0893E0019
17319E7625b598D4889J90315J38145A04501J21116J05178F1120b43475H6447K25044
17308C11491c71323A0907a74930B35040D3627j2711c12425C902Q2298B6723J55687
17297A82410m296M7607j05259m5404f469j4806H3035g5043B59892a08334I0564
$$ plain form
17377 246245 90577 394602 -87444 -127740 238158 135413 308325 20446 -22885 24421 -15140
17365 135450 106359 255586 96066 -176909 148680 -142545 433625 205018 270582 264936
17355 264936 280702 125437 -74877 28009 71865 -79306 -21999 177086 237703 303992 97385
17343 -98201 246598 1332 302203 15883 67943 -47524 -6013 -90324 58473 76449 -172893
17331 276022 -255917 23841 36693 48990 -202445 83303 312048 -128077 -23711 -34604 50019
17319 57625 -2598 44889 235204 373349 104501 225617 330795 61120 -243475 86447 311491
17308 311491 -371323 10907 -174930 235040 43627 30916 -312425 3902 86200 26723 182410
17297 182410 178114 225721 120462 75058 -6469 -21275 83035 -75043 259892 -108334 90564
17285B43956P5321j07315E6571K53102F7191J61667g8682m3532k6602A14552Q412
17274A22964D2786K48328j32680J14056E4720J09863h0521F4609J52477J29979
17264C47065j05996D0978K05056A05747J64474A12413K08407Q1817j91172P321
17254B18786q9817a45002C10063b03437E84074F0290J72339J50890B8336f267
17243B13237a7795B73738E7938B5593N2083L19133a21729q019A44704l3268c2238
17231C05562A52720E8605K9317Q6237Q8077q4171H5530K55320A11945P9210J81026
17220C72181E9266Q9911b1561C18647I9446L7473k3235J76986j22300h4032E2051
17208A13187K03133a0368C33361A17952J24510J54598j60065j6639n1665j7173
$$ plain form
17285 243956 319277 211962 56571 309673 67191 228858 -78682 -122214 -148816 114552 122964
17274 122964 42786 291114 158434 272490 54720 164583 -80521 64609 217086 347065
17264 347065 241069 40978 246034 105747 270221 112413 320820 402637 211465 218786
17254 218786 128969 -145002 310063 -203437 584074 60290 232629 383519 28336 -6267
17243 213237 -17795 273738 57938 25593 77676 396809 -121729 -129748 144704 111436 -32238
17231 305562 152720 58605 87922 174159 262236 178065 85530 340850 111945 191155 372181
17220 372181 59266 149177 -21561 318647 99446 136919 113684 290670 168370 -84032 52051
17208 113187 316320 -10368 333361 117952 242462 397060 236995 220356 168691 151518
17198A51518C9937i4331F40452c4662j56954A45983L39125a36453C42611r6656
17188B45955l9493E8977h9161D59994J16433j85783P2982k22585A14174k9718
17178H4456J56473J72186j19528k8156E422L67540a38740B07592K29717i3856
17167C48433j00917J42037j03700E9865J56455K95934j65715j67356Q7388N415
17157B71986g343B04713e5138D61773I8533a890C21230a15834B43726F0540M5038
17146A05578J1060L513J74387H8926R7501J67058j35824N3569q8062e664A16198
17134G41373C19838g713c88D69099j35705j66103n6102L95600F1921P5400L88674
17123E25995j43182a28743C22164B6374J2929N96327l10112A45134p0749K42444
$$ plain form
17198 151518 39937 -94331 640452 -34662 -191616 145983 485108 -136453 342611 245955
17188 245955 206462 58977 -89161 459994 576427 390644 463626 241041 114174 84456
17178 84456 240929 413115 293587 265431 5422 372962 -138740 207592 437309 -93856
17167 348433 247516 389553 285853 59865 216320 512254 346539 179183 266571 271986
17157 271986 -7343 204713 -55138 461773 98533 -1890 321230 -115834 243726 60540 105578
17146 105578 116638 120151 294538 88926 186427 353485 217661 271230 183168 -5664 116198
17134 741373 319838 -7713 -388 469099 333394 167291 111189 506789 61921 137321 525995
17123 525995 382813 -128743 322164 26374 39303 635630 325518 145134 74385 316829
17113C16829K26645B02992K22486J90681B32834I7080a62398C70665A64400L68610
17103E33010B20560M8683H7121M10353k1368A78757K4572m8003g4111D54965j18971
17092C35994j15009L79509p5447j97151j39313N24059k20580o313B25442K31643
17082D57085j2767j50205J38181A93527J35298j62754K52159n1622O439n0959
17072C22088j06089Q179J55291f142C15633R9997q1148J28597L0554m2632B03805
17060F04443k90885J50259B06608J21533M49121k1410C28460N3849M7004A53135
17049A13807J53274J52341j60515P6422J99312K16413l39860P1626r0765K92801
17039F84856k84179Q9683M63709B54673K54198K27118C15567L26980k88398K181
$$ plain form
17113 316829 543474 202992 425478 616159 232834 97080 -162398 370665 164400 533010
17103 533010 220560 269243 87121 497474 476106 178757 203329 155326 -74111 454965 335994
17092 335994 220985 600494 525047 327896 188583 712642 492062 485749 225442 457085
17082 457085 444318 294113 432294 193527 328825 166071 418230 366608 373047 322088
17072 322088 215999 224178 379469 -6142 315633 415630 334482 463079 493633 451001 203805
17060 604443 313558 463817 206608 328141 777262 755852 328460 382309 429313 153135
17049 113807 267081 419422 258907 335329 534641 751054 411194 482820 392055 684856
17039 684856 400677 490360 954069 254673 508871 735989 315567 642547 354149 356330
17029C56330L88859k92393n0852l4005O01226j00554k39662K87744C24378J48888
17019D73266j23724P25402E12452k04849K36437K79723M8431m20585k717P7156
17009E26048q740B51236K39497K72925k53056K05234k19792J71810M6053n3511
16999F60396l7587j33022J71334j5944j42733L2219Q5258j48823J22022Q0173
16989F73293J26843l1488o1702J26710k03695O3112j09852L64897l53500o4569
16979E30049L30791k47582j0156j49219J33029j16331M12313l6581J34590k50127
16969G30776m3080r8718j06900M81604j64372J14398m4708j7154O1762l03455
16959F10153O7706J3385j9643j32266k019L12846l4852Q7300j5076j45453K64798
$$ plain form
17029 356330 745189 452796 401944 367939 969165 868611 628949 916693 324378 473266
17019 473266 349542 1074944 512452 307603 544040 823763 872194 451609 448892 526048
17009 526048 517308 251236 490733 763658 510602 715836 496044 667854 713907 660396
16999 660396 622809 489787 661121 645177 502444 534663 619921 471098 593120 673293
16989 673293 800136 768648 706946 833656 629961 693073 583221 948118 594618 530049
16979 530049 860840 613258 603102 453883 586912 470581 882894 846313 980903 730776
16969 730776 687696 588978 482078 963682 799310 913708 869000 851846 913608 610153
16959 610153 677859 691244 671601 539335 537316 850162 815310 902610 887534 742081 1006879
16948A006879L65280F18165N91660m54592l3872J41423J67214P821l6900k65315
16938G35604K91328j93579J29521O7869l20690N2954P4553K87693o7496n6666
16928A001091K39883J39008o59464M60509j02813p7132L4355K56995n09l13203
16918I78720j1120J55726O1556m3041J46151k11457K92857l78601J77855L3741
16908A202387k33395K52999j2967L00678k51576L79268m38888O2605L9972j1158
16898A289925J28566K01393l81859L61493j15389L1866l2364j92263N0080M80962
16888A822410k29737J19457j51017J15803R1271K75347j01585k26881j5718M19195
16878B118545k66456J7931K44722j59624J41935L6704k49854K725j79488K19058
$$ plain form
16948 1006879 1372159 618165 1209825 755233 721361 862784 1029998 1037819 1000919 735604
16938 735604 1026932 833353 962874 1030743 710053 763007 837560 1125253 1057757 1001091
16928 1001091 1240974 1379982 720518 1181027 1078214 1001082 1035437 1292432 1291923 978720
16918 978720 967600 1123326 1184882 1141841 1287992 1076535 1369392 990791 1168646 1202387
16908 1202387 968992 1221991 1209024 1509702 1258126 1637394 1198506 1261111 1301083 1289925
16898 1289925 1418491 1619884 1238025 1599518 1484129 1515995 1483631 1291368 1341448 1822410
16888 1822410 1592673 1712130 1561113 1676916 1768187 2043534 1941949 1715068 1699350 2118545
16878 2118545 1852089 1870020 2114742 1955118 2097053 2133757 1883903 1886628 1707140 1926198
16868A926198L20237n8081j14485o2665J31797O9043K18217k11729n010L929J20325
16857B337776j82876K30028r1534K42890j622K17896k42028R5626n2396J66181
16847B719941L8081j82226N33092p0637k63597J82055l66351N04530k40570M10817
16837C265135P2694r4697L24584l20096k34535K16353j64413O56144m73503M66886
16827C714552j043J43621L4672R8800k22204J76297J11308K65142K17491o005
16817D532631m14313K79730K14808l9243l5557L24124J33211L14063q2494r0400
16807E136560M43370j7164K48812K8773k1511K08276L38645j35970K75174j93667
16797F311298M23572J20469M87075j75739N27669j73456K37526P8998L93887K18682
$$ plain form
16868 1926198 2246435 2188354 2073869 2011204 2143001 2212044 2430261 2218532 2213522 2217451 2337776
16857 2337776 2154900 2384928 2293394 2536284 2534662 2752558 2510530 2606156 2553760 2719941
16847 2719941 2758022 2575796 3108888 3038251 2774654 2956709 2590358 3094888 2854318 3265135
16837 3265135 3337829 3243132 3567716 3247620 3013085 3229438 3065025 3721169 3247666 3714552
16827 3714552 3713509 3857130 3891802 3990602 3768398 3944695 4056003 4321145 4538636 4532631
16817 4532631 4118318 4398048 4612856 4573613 4538056 4862180 4995391 5309454 5226960 5136560
16807 5136560 5579930 5562766 5811578 5840351 5818840 6027116 6365761 6229791 6504965 6311298
16797 6311298 6734870 6855339 7342414 7166675 7694344 7520888 7758414 7837412 8231299 8449981
16787H449981L29319L09459j2743L95792m590M39092L02417J22981L07552N25729
16777A1164989J40467N06596K14448R206R05439o1528P18935N23138K43655M63291
16767A4828636Q61073J61563R57876L83324N97212N99768R53269R27833O59640
16758B0930194L81622J401099M74371R53325J590057J068369P44846J344433J235964
16749C0124280J557880J457325J533747J874306J735247J814373K324552K164826
16741D4586536K561176K404634K928220K856299L045941L459505L470585M289381
16733F9602277L835021M558272M740652N405547N567676N743028O646598O403388
16725A12502459P055538P152010P145654P164598Q011328O804363P206098O384442
$$ plain form
16787 8449981 8779300 9088759 9076016 9471808 9467218 9906310 10208727 10331708 10639260 11164989
16777 11164989 11305456 11812052 12026500 12035706 12941145 12879617 13598552 14121690 14365345 14828636
16767 14828636 15689709 15851272 16809148 17192472 17789684 18389452 19342721 20270554 20930194
16758 20930194 21311816 22712915 23187286 24140611 25730668 26799037 27543883 28888316 30124280
16749 30124280 31682160 33139485 34673232 36547538 38282785 40097158 42421710 44586536
16741 44586536 47147712 49552346 52480566 55336865 58382806 61842311 65312896 69602277
16733 69602277 73437298 77995570 82736222 88141769 93709445 99452473 106099071 112502459
16725 112502459 119557997 126710007 133855661 141020259 149031587 155835950 163042048 169426490
16717A69426490O065586M702492L799729L081836J411231j91241j210974k641683
16709A84443466m038910m720449o339581o452374p346726p754192p603306p393516
16701A32794412p793326p885781o399787o903707o559319o256783n571757n497522
16693G9926430n013618m527300m068322l785435l679222l543367k972978l002462
16685D9333726k775102k454972k206303k157207k093583k103214j442543j930835
16677C2169967j655047j141840j032476j656700j367208j012514q05987j231186
16669B2267009q77735o25599p65894j112862n97189r07000n38222k85899p72910
16660A5783699m70179l90282p13013m59004q50064k89882n28385j08734o98522
$$ plain form
16717 169426490 175492076 180194568 183994297 187076133 188487364 188296123 187085149 184443466
16709 184443466 180404556 175684107 169344526 162892152 155545426 147791234 140187928 132794412
16701 132794412 125001086 117115305 110715518 103811811 97252492 90995709 85423952 79926430
16693 79926430 74912812 70385512 66317190 62531755 58852533 55309166 52336188 49333726
16685 49333726 46558624 44103652 41897349 39740142 37646559 35543345 34100802 32169967
16677 32169967 30514920 29373080 28340604 26683904 25316696 24304182 23498195 22267009
16669 22267009 21389274 20763675 19997781 18884919 18287730 17380730 16842508 16556609 15783699
16660 15783699 15313520 14923238 14210225 13751221 12901157 12611275 12082890 11974156 11275634
16651A1275634j39517k36913l46299k52461l25835k09808k13626l02214n78969
16642H669992K2030m81281J69740m23549J29776l84317k73221j99785k45559m51090
16632F532736Q5649n5285j86330L0818n10065m42384J08926l8913M0614m21257
16622E144509j0070m9856p2339N4486m45760J83765n30761J38529J12573k30588
16612D294488k58817K61698k81128k79665j21219J65609K321m5383l15551r6863
16602C325490N2921k19653K67393l7704j84882r3711O3041j49281n06020N56317
16592C073911j15217l58762K2040K72926l38668K67874j58058J07682l23244n1028
16582B399456K3797q2317j97265L01780k28965p3844j27969K51277k8593l00331
$$ plain form
16651 11275634 11136117 10899204 10552905 10300444 9974609 9764801 9551175 9248961 8669992
16642 8669992 8692022 8210741 8380481 7956932 8086708 7702391 7429170 7229385 6983826 6532736
16632 6532736 6618385 6563100 6376770 6407588 5897523 5455139 5564065 5525152 5565766 5144509
16622 5144509 5134439 5084583 5012244 5066730 4620970 4804735 4273974 4412503 4525076 4294488
16612 4294488 4035671 4297369 4016241 3736576 3615357 3780966 3783287 3737904 3422353 3325490
16602 3325490 3378411 3158758 3426151 3388447 3203565 3109854 3172895 3023614 2517594 3073911
16592 3073911 2958694 2599932 2621972 2894898 2556230 2824104 2666046 2773728 2450484 2399456
16582 2399456 2423253 2340936 2143671 2445451 2216486 2142642 2014673 2265950 2237357 1937026
16572A937026N96227j53547l49677j27m8365J63149m88059K59055q6013j52800
16562A676869K41324q5878J05465j39040r1821j37075K60186j73955k87663J60044
16552A528456r8573L6486j86611J85618k40990J86509L31179m39702N1209j16953
16542A236628j7878J21580N2461p268j61794L23171m69162M34232n05770J18934
16532A125134L2180J09807q1170l84745L02556P2739k01721K97182l5149j96872
16522A039941k6538L608l41392K14709j86568K31720r0894Q1397L85962n27651
16512G84294O2186L78517m61173Q6705l03102M52133l48215P1592J64932J64030
16502A051899l0051j22594L923j40652L40271m42898J81253k33137L05640l92601
$$ plain form
16572 1937026 2533253 2379706 2030029 2029902 1981537 2144686 1656627 1915682 1829669 1676869
16562 1676869 1918193 1832315 1937780 1798740 1706919 1569844 1830030 1656075 1368412 1528456
16552 1528456 1429883 1466369 1279758 1465376 1224386 1410895 1742074 1302372 1353581 1236628
16542 1236628 1218750 1340330 1392791 1385523 1223729 1546900 1077738 1511970 1006200 1125134
16532 1125134 1157314 1267121 1185951 801206 1103762 1176501 974780 1271962 1236813 1039941
16522 1039941 1013403 1017011 675619 890328 703760 935480 844586 925983 1311945 784294
16512 784294 846480 1224997 763824 850529 547427 999560 651345 722937 887869 1051899
16502 1051899 1021848 899254 903177 762525 1102796 659898 841151 608014 913654 521053
16492E21053K8312J20970L009Q8590J729J20683p7771K47423m31533j04606L78224
16481H96083J60053m41509M16791j53635D32140K48595l39969K02802M46288m60421
16471E29435Q654j15083M0815K9661K25190j42005p6363j66172K23511J68635
16461G26278j4766k17036J38060j37305J31321j02789k7718J02458P1813j17693
16451E52623p1176N9486K77671l60860M7837J56763k26570N9104k41755J86531
16441D39654K31350l11133L90229j72148j89194R9906r5554j909K51693q3168
16431E59726k32330K36339L7005B84310J72904J94585l04595j3527j0257M94496
16421H17916D06778A79489J08819N2761J83431o1581k14848N07743A42728K72358
$$ plain form
16492 521053 549365 670335 673344 761934 763663 884346 806575 1053998 622465 517859 896083
16481 896083 1056136 614627 1031418 877783 432140 680735 340766 543568 989856 529435
16471 529435 538089 423006 463821 493482 718672 576667 500304 334132 557643 726278
16461 726278 711512 494476 632536 495231 626552 523763 496045 598503 670316 552623
16451 552623 481447 540933 818604 457744 505581 662344 435774 494878 253123 439654
16441 439654 671004 359871 750100 577952 388758 488664 393110 391201 642894 559726
16431 559726 327396 563735 600740 284310 457214 651799 347204 333677 323420 817916
16421 817916 406778 179489 288308 341069 524500 462919 248071 755814 142728 415086
16411D15086A90942K01764o2879K5126K6734Q8179j82625r4312J48410A55035
16400D20492F6176K58526I3140K98431A70192R4014M2348l9024j6887m9066J59553
16389C61130Q8569B09221m1319J95777L08500I1949K55385a0400j7395H2745K56683
16378C39428M8790A16158K12083n6307H2139J39802E0922K72326j56058R9835
16368B67025j06517A6620J31928n1158J88863k5557B4258L2786L44781a01494
16357B97567P4997F9759B8201N25402K2738j57682o9269r9166f4231j1373G7882
16345d198l2188B79306J44959A45830J50466A3093N9814L38484j29704E7667e8635
16333A23827E0299J02433J96393c2172A16443K40845J03934a445C57757j4971
$$ plain form
16411 415086 190942 392706 329827 354953 381687 469866 287241 192929 341339 155035
16400 420492 66176 324702 93140 391571 170192 264206 306554 267530 250643 201577 361130
16389 361130 449699 209221 167902 363679 672179 91949 347334 -10400 -27795 82745 339428
16378 339428 388218 116158 328241 271934 82139 221941 50922 323248 167190 267025
16368 267025 160508 16620 148548 97390 286253 260696 24258 57044 401825 -101494
16357 297567 372564 69759 28201 553603 576341 418659 349390 250224 -64231 -75604 77882
16345 -4198 -36386 279306 424265 145830 296296 13093 72907 411391 281687 57667 -58635
16333 123827 50299 152732 349125 -32172 116443 357288 461222 -1445 357757 342786
16323C42786k1131J45697E0330J12924G1981J85667A05693K36909q6373g7246
16312D0535L12932A75881G3966J06886k2489G6763J8130K42434I8016A2043J08301
16301A20344a01966C70901A65344m3717J4419m2908g8620A40151M801J36061q4261
16290A96752b1704A03P9469J10523M0797n9578D0622P4498A414b00961D36523
16278D2330L93403a12614C31164A45080a31300A45016K03781b00678i3983K7633
16268f6350E2494F545K76106O3808D0172c15928a49057J8752A29384A4161a25714
16256i5082M6984F7351Q6105l3183l6410a38498B41293M589d8289C15237A10459
16244f1650C5699N0984K25454j54946N5048a00413c5220A4978K87450J2320G89
$$ plain form
16323 342786 321655 467352 50330 163254 71981 257648 105693 342602 256229 -77246
16312 40535 353467 175881 73966 180852 158363 76763 94893 337327 98016 12043 120344
16301 120344 -101966 370901 165344 121627 136046 93138 -78620 140151 144952 281013 196752
16290 196752 -21704 103 79572 190095 230892 171314 40622 115120 1414 -200961 436523
16278 42330 435733 -112614 331164 145080 -131300 145016 348797 -200678 -93983 -66350
16268 -66350 52494 6545 282651 346459 40172 -315928 -149057 -130305 129384 14161 -125714
16256 -95082 -48098 67351 153456 120273 83863 -138498 241293 245882 -48289 315237 110459
16244 -61650 35699 86683 312137 157191 212239 -100413 -35220 14978 302428 314748 789
16232f9964I2649K23295g5419F750M5812J70310a58176m6058F4428b39091A71123
16220F9215N723J6192M5470O588K2155E7702J31360c21192A73198H2450J10352
16209A92802b13087a02570B39636j08927K32878c39531H0823d7449B27056b2900
16198E1799J76537f3186B66441a5487G5062b5670l12820A31841m1215B8104d398
16186B46909l7224b13653a04260E4766a74563A81346q4343i3559H8538J51336
16176B39874h2601k3619F7827o920J61052I286b1922j77992A43966f8029G5920
16164d3550B40139n264a91262m5358H7419L05496A34363b0944j66885C01413o9997
16153B31416l4111K5180j6990a9770B86280a41892C74554j61883c98867a41052
$$ plain form
16232 -69964 92649 315944 -75419 6750 52562 222872 -158176 -204234 64428 -239091 171123
16220 69215 74938 91130 136600 143188 165343 57702 189062 -321192 173198 82450 192802
16209 192802 -213087 -102570 239636 130709 363587 -339531 80823 -47449 227056 -22900
16198 51799 228336 -63186 266441 -15487 75062 -25670 -338490 131841 90626 28104 -4398
16186 246909 209685 -213653 -104260 54766 -174563 181346 97003 -93559 88538 239874
16176 239874 -82601 -106220 67827 60907 221959 9286 -21922 -199914 143966 -68029 75920
16164 -43550 240139 234875 -191262 -236620 87419 392915 134363 -20944 -187829 301413 231416
16153 231416 197305 222485 205495 -19770 286280 -141892 374554 212671 -398867 -141052
16142H0161i1736j62712A98239R6529b0376B2883a42618D0078L20448A64236a06177
16130C0617P542J09993E4820J42172Q1829c39536A53975f3727K6050B73042A06876
16118a7284F5075q229P2354L0674m6942a79996e2766j0556j48800k939E2011N8394
16106A10405l2286b75163B5667K2351j9985K57502A16192D4580J77253N0188g0777
16094b65079a4330j04803A17756E6616h9810h226l99746E96J68118h7302l5665
16083a22967F4346a43284f3419J3641k15818b9161k06224b625j52443L4453j06955
16072b27570A2107M1230J521b32274A29282a43869f1033O274H2424R4a74503G8474
16059A59453m0518d3503k9752A57900a10988A00011b3822D20854A17369J33332
$$ plain form
16142 80161 -91736 -254448 198239 294768 -20376 22883 -142618 40078 360526 164236 -106177
16130 30617 38159 148152 54820 196992 278821 -339536 153975 -63727 -37677 273042 106876
16118 -17284 65075 56846 129200 159874 112932 -179996 -52766 -63322 -212122 -215061 52011 110405
16106 110405 78119 -275163 25667 48018 28033 285535 116192 44580 221833 272021 -70777
16094 -265079 -14330 -119133 117756 56616 -89810 -8226 -407972 596 168714 -87302 -122967
16083 -122967 64346 -143284 -63419 -49778 -265596 -29161 -235385 -2625 -155068 -120615 -227570
16072 -227570 12107 53337 54858 -232274 129282 -143869 -61033 -54759 82424 82518 -174503 78474
16059 159453 118935 -43503 -73255 157900 -110988 100011 -23822 420854 117369 250701
16049B50701m6755C56e9322F3016k4671K6823q486j27J28496n5894J4409c1040
16036H2853b92906H6779a50605j15326M5449b6363m1600p0767C13800c34146A1369
16024H2940b07208A16455b0149A35132Q167a89849Q4100l16643c6785P473k91912
16013c21224D7445N7948b05322F900a434j28587c2838A52018i6205K4440A69501
16001b46309B39963n7434f5369B30585a5028k49200A39285a57451k42405A39141
15990A57891M0442a31909D01594C5688f7209K1741j42709A37574l942J28333j14032
15979A47933j2614k8350a29116K4069A2423J0460L5338k5098b03575m3187A11942
15967b6049I052J54407a58813A51185I910a09840k2636m2573j43355b4611l56270
$$ plain form
16049 250701 203946 356 -59322 63016 38345 65168 56682 56555 185051 129157 143566 -31040
16036 82853 -292906 86779 -150605 -265931 -220482 -26363 -67963 -138730 313800 -334146 11369
16024 82940 -207208 116455 -20149 135132 143299 -189849 -105749 -422392 -36785 -29312 -321224
16013 -321224 47445 105393 -205322 6900 -1434 -130021 -32838 152018 -96205 -71765 169501
16001 -246309 239963 182529 -65369 230585 -15028 -264228 139285 -157451 -399856 139141
15990 157891 198333 -131909 401594 35688 -67209 -45468 -188177 137574 133632 261965 147933
15979 147933 135319 106969 -129116 -105047 12423 22883 58221 33123 -203575 -246762 111942
15967 -26049 9052 163459 -158813 151185 9910 -109840 -132476 -175049 -318404 -24611 -380881
15956c80881B20915d51111C70694b1660k6154k38520h7990B60295d73355A46483
15945c0626j46391A8044b32991e4837k11615I113K44946E5347N4140a77176B66837
15933A73690b52572j2586J02564j01238A16197m8208a57563B50823a43033j92110
15923c35143J60193C4439b9928q6235k54103B07327a31609n0894r9760A17898
15912b89208A72226G9669k5436J74838b30359B03141a02361A1779a85500C7816
15901g1702k3294j92771f6651B44c539j09883A52578l2614A0861O2778h6310q4448
15889a70758k0330C2047c46510d9261A11767b2152A60026c24891J1639i3089p8665
15878a71754J595F3774a30885j35892c1441C3504K76045d186l52955a66935m1205
$$ plain form
15956 -380881 220915 -451111 370694 -21660 -47814 -286334 -87990 260295 -473355 146483
15945 -30626 -177017 18044 -232991 -54837 -266452 9113 254059 55347 109487 -177176 266837
15933 173690 -252572 -265158 -162594 -263832 116197 67989 -157563 250823 -143033 -335143
15923 -335143 -174950 34439 -29928 -116163 -370266 207327 -131609 -182503 -282263 117898
15912 -289208 172226 79669 54233 229071 -230359 203141 -102361 11779 -185500 37816
15901 -71702 -94996 -287767 -66651 244 -3539 -113422 152578 119964 10861 73639 -86310 -170758
15889 -170758 -191088 32047 -346510 -49261 111767 -22152 160026 -324891 -313252 -93089 -171754
15878 -171754 -170159 63774 -130885 -266777 -31441 33504 309549 -4186 -357141 -166935 -208140
15867b08140Q0856A10822a4066C05022D0286R790d27439J55809i2052p2684d18
15855a36008p0342A03758f9502b7101j72950Q80J5423A56800b97380E7459b762
15843a37420n9034E0967a46379C1489K92834j57037d44590O0366g6021A08552
15832A42623a45218H8215g5151A29355b78778A29502a39944C27001A5429K91215
15822C06644A44779b89306o399O7555B11208i9401O057H6324J11475g5366G5813
15810g0934B2239B306a00087A9199a42872o7826A77281a869F3968J58258h901
15798i7139I2499a24563A11259h3258q9041G4905a57428g207l52689h0403l6959
15787a17362p2690f5612B08289I7895l4918e7752A34770b18692o506C5929Q30
$$ plain form
15867 -208140 -127284 110822 -14066 305022 40286 50076 -427439 -271630 -92052 -164736 -418
15855 -136008 -206350 103758 -69502 -27101 -200051 -199171 -183748 156800 -297380 57459 -2762
15843 -137420 -196454 50967 -146379 31489 324323 167286 -444590 -384224 -76021 108552
15832 142623 -145218 88215 -75151 129355 -278778 129502 -139944 327001 15429 306644
15822 306644 144779 -289306 -295705 -228150 211208 -99401 -93344 86324 197799 -75366 75813
15810 -70934 22239 2306 -100087 19199 -142872 -210698 177281 -1869 63968 222226 -8901
15798 -97139 92499 -124563 111259 -83258 -172299 74905 -157428 -7207 -359896 -80403 -117362
15787 -117362 -190052 -65612 208289 97895 62977 -57752 134770 -218692 -225198 35929 36759
15776C6759b37698i5883A79527J63794G8416A260b13599h4931j79502A11707k5555
15765H6152a68415a4893A86865a41555C39953j25374c7561k61693c6810j8457
15755e5267j1418b3610N564q2342j18150o2453A05566a405B91878m4656A9163
15743E1440J37968i3992D9330d09617a42387j04057B58941F3964j9590b02049
15732a45442B0832J17883R5542A4623i6523A06077C6907K40323g4261A36829E8273
15720a10721C9545a66700A2142O0825P7199b74611J06999G4948i4065F5908b48659
15708A59495a95385i356C0478b4288C19020A44945a24696A560R8376B6433b95529
15696a19361k7779A6547g3715j11622j34116b1302D85717A10170D2916a03124
$$ plain form
15776 36759 -237698 -95883 179527 343321 78416 1260 -213599 -84931 -264433 111707 86152
15765 86152 -168415 -14893 186865 -141555 339953 214579 -37561 -299254 -36810 -55267
15755 -55267 -66685 -23610 -18046 -100388 -218538 -280991 105566 -1405 291878 247222 19163
15743 51440 189408 -93992 49330 -409617 -142387 -246444 258941 63964 44374 -202049
15732 -145442 20832 138715 234257 14623 -96523 106077 36907 277230 -74261 136829 58273
15720 -110721 39545 -166700 12142 72967 150166 -274611 -167612 74948 -94065 65908 -248659
15708 159495 -195385 -9356 30478 -24288 319020 144945 -124696 1560 99936 26433 -295529
15696 -119361 -147140 16547 -73715 -185337 -319453 -21302 485717 110170 42916 -103124
15685A4578e9104K2282E6446e8761l38702J73743N9251k5146A60366K05258G9071
15673G9106o876c9250A59063a7128F7132K276a17956O325B3526i770j24906d884
15660D1861a08515k2759m3758b7233B74556a80898A91757D1592b18895P223c154
15648e2155B53003l9008b01407E0915Q2285J52636A38149g56j06747m24327f1347
15636B4243c0573m22768i1045K3687A98068q3623i4587c4251A07476b41921C9870
15624C1704O4529A3285K60030J67753a93649R5476P004F750a49078a8165A51803
15612A48479a31037m001a7966A82731a37748l3501A76286a89726f7753j57440
15602b25193a09924a9065F03N4592d5439G3728B3506c4332j4290j9113l49303
$$ plain form
15685 14578 -59104 -36822 56446 -58761 -397463 -223720 -164469 -189615 160366 365624 79071
15673 79106 72230 -39250 159063 -17128 67132 69408 -117956 -111631 23526 -9770 -134676 -4884
15660 41861 -108515 -131274 -175032 -27233 274556 -180898 191757 41592 -218895 -211672 -3154
15648 -52155 253003 213995 -201407 50915 133200 285836 138149 -756 -107503 -531830 -61347
15636 24243 -30573 -453341 -91045 -67358 198068 114445 -94587 -34251 107476 -241921 39870
15624 31704 96233 13285 273315 441068 -193649 -98173 -91169 6750 -149078 -18165 151803
15612 148479 -131037 -135038 -17966 182731 -137748 -171249 176286 -189726 -67753 -225193
15602 -225193 -109924 -19065 603 55195 -45439 73728 23506 -34332 -48622 -67735 -417038
15591d17038c6078B38472O3833p8496c4541J0108l88377J17889F1140J46676c10089
15579b72030D1267a19541k69313H6788l6747b26983R8533R509j19858h0383j95371
15568b75754d9302K0080B69194H2633b274F2521d9723A1167b060k5711B89981
15556f5188A38225A3971J33165K43205b63509a23982D5125J47374a65794J7165
15546a48629A41170k0820k9981b96333e1761F7177J41809a25794B06072D1573
15535A97633I2329h0858j31040A28980b80353D78633B11647e7694A22359b4946
15524A48908a71467q0355J22035B5005h6003A43344b4929k79486C20278j2816
15514C07462A16981B6713K99314A20114e3066B97418A33134a04212C83020g2050
$$ plain form
15591 -417038 -36078 238472 302305 223809 -34541 -24433 -412810 -294921 61140 207816 -310089
15579 -272030 41267 -119541 -388854 86788 50041 -226983 -128450 -118941 -238799 -80383 -275754
15568 -275754 -49302 -29222 269194 82633 -2274 62521 -49723 11167 -2060 -27771 289981
15556 -65188 138225 13971 147136 390341 -263509 -123982 45125 192499 -165794 -148629
15546 -148629 141170 120350 90369 -296333 -51761 67177 208986 -125794 206072 41573
15535 197633 92329 -80858 -211898 128980 -280353 478633 211647 -57694 122359 -24946
15524 148908 -171467 -251822 -129787 25005 -86003 143344 -24929 -304415 320278 307462
15514 307462 116981 26713 326027 120114 -53066 297418 133134 -104212 383020 -72050
15503C09217A883a26496d0728l11945c2367B1635K00071k9560a85138C46962a58166
15491c3422j57757j5154i6670L3258I8948a72734A9279a42270A9362J1673J86073
15480B17108a59225O6879J489F2335i3547J2026F9670J95085k0060a93442q1257
15469b74699p9723g8682A18212A5864Q9836b15238A62781B9737J20769a18202
15458b1231I3686a19052B33353r7055J78481I4750h6626D5455h7752B1379J04379
15447A25758E8070e9636B29512A1506f1958A77119D2008K0352b60569D5400b7409
15435a83288C0311c6480j58136c849C83624a63945A37067A284K07467a27582M014
15424a23568A14648l671J53740N9236K3563a06038G8544A7380b61237J18521j8666
$$ plain form
15503 309217 1883 -126496 -40728 -352673 -32367 21635 221706 192146 -185138 346962 -158166
15491 -33422 -191179 -206333 -96670 -63412 98948 -172734 19279 -142270 19362 31035 217108
15480 217108 -159225 -92346 -90857 62335 -93547 -81521 69670 264755 244695 -193442 -274699
15469 -274699 -354422 -78682 118212 15864 105700 -215238 162781 29737 150506 -118202
15458 -21231 93686 -119052 233353 136298 314779 94750 -86626 45455 -87752 21379 125758
15447 125758 58070 -59636 229512 11506 -61958 177119 42008 62360 -260569 45400 -27409
15435 -183288 30311 -36480 -194616 -3849 383624 -163945 137067 1284 208751 -127582 -123568
15424 -123568 114648 110977 264717 323953 347516 -106038 78544 17380 -261237 -142716 -161382
15413a61382E6865J5272i5650j4050c0384n8097k6284J8024H5530a13212B40968
15401B2187J18752e5024a4646F6889a42013H9016a61919g5969K6301A30916b86579
15389b62026a05106B86490C9218I852a37164E7213a47572j17016J02342c9423
15378c5435m9918k08464a13356K3791b9047E8479a06756A50035J32241d4260J9606
15367b4654C37544g7265a3446j91499q100C94648a96927a6677k44377I5449b65720
15355A65297c6218B0203a07706C845K49784n3114k2602f6925k12018N3846B84002
15343A58633J6266a58654M0111j83170B27309C4643a07529K782A48726O4709d0039
15331A56288a13170B07286a53633l3430C0126a53576I1863J50354E5752a38950
$$ plain form
15413 -161382 56865 72137 -95650 -109700 -30384 -88481 -114765 -96741 85530 -113212 240968
15401 22187 140939 -55024 -14646 66889 -142013 89016 -161919 -75969 -49668 130916 -286579
15389 -262026 -105106 286490 39218 9852 -137164 57213 -147572 -264588 -162246 -39423
15378 -35435 -85353 -293817 -113356 -89565 -29047 58479 -106756 150035 282276 -44260 -24654
15367 -24654 337544 -77265 -13446 -204945 -213045 394648 -196927 -16677 -261054 95449 -265720
15355 165297 -36218 20203 -107706 3845 253629 200515 177913 -66925 -278943 -225097 284002
15343 158633 174899 -158654 -118543 -301713 227309 34643 -107529 -104747 148726 213435 -40039
15331 156288 -113170 207286 -153633 -187063 30126 -153576 91863 242217 55752 -138950
15320A38171o4287b15824Q9401j31603N0903A54776a08437j26677e92A56565B1776
15308a23592B47229A17637i9529H7964K6454J17335k248O5272f768L213C06403
15296A12290b21785A4023Q4936K35691G4117g407o8288b7388H0647j1431b3142
15284a32307B31719a57162C5148e0686j48659A53207E0614J08417O4514H8955
15273b753A66195B3633a1706n420C73495F3322L6363g4520p1877k82730J16979
15262c12148D45956a4267A26050M3645R0193E460a45988E89598a38382B53946
15251a10053B01101K4870J3176J236738O7866n30959K52497K1577F38305A03907
15240a26512A10206J19914a1418D8118A6725P8937K8345a44968O1797A24925J3442
$$ plain form
15320 138171 73884 -215824 -126423 -258026 -207123 154776 -108437 -235114 -592 156565 21776
15308 -123592 247229 117637 -99529 87964 114418 231753 229505 294777 -6768 -3555 306403
15296 112290 -221785 14023 98959 334650 74117 -7407 -75695 -27388 80647 69216 -23142
15284 -132307 231719 -157162 35148 -50686 -199345 153207 50614 159031 223545 88955
15273 -2753 166195 23633 -11706 -17126 373495 63322 99685 -74520 -146397 -429127 -312148
15262 -312148 445956 -14267 126050 169695 259888 5460 -145988 589598 -138382 253946
15251 -110053 201101 225971 239147 1475885 1543751 1012792 1265289 1286866 638305 103907
15240 -126512 110206 230120 -11418 48118 16725 95662 124007 -144968 -83171 124925 138367
15229A38367m1239d32014A02461a0587I1726a08467j02384A82812h1401D3472
15218b48631e4027B77228A09713b2533B78976p2005a50878A59465b5715d284j04391
15207a08675F008a80035A80238a14718A74376D8305i0768B72202J32371D6172
15196C22262b77042e7478A05488g2486C34872D2436J4961e7204J3329k963p6806
15185a23644A47966d2076A28480E2303Q0454a20602A41222a4022B60644E9323
15174b31672Q4465A16419e3615B06211m3134f1001A13758J49499G3795R2217G4024
15162A11744J23737p6346a73451d1554K0140B72390j15517a08386b4152l3618
15152e7770A65239P9260C3352O6903J19897i0923A89896P4843a887r1272b3302
$$ plain form
15229 138367 97128 -432014 102461 -10587 91726 -108467 -210851 182812 -81401 43472
15218 -248631 -54027 277228 109713 -22533 278976 206971 -150878 159465 -25715 -4284 -108675
15207 -108675 6008 -180035 180238 -114718 174376 48305 -90768 272202 404573 46172
15196 322262 -277042 -57478 105488 -72486 334872 42436 57397 -57204 -43875 -46838 -123644
15185 -123644 147966 -42076 128480 52303 132757 -120602 141222 -14022 260644 59323
15174 -231672 -147207 116419 -53615 206211 163077 -61001 113758 263257 73795 166012 74024
15162 111744 235481 159135 -173451 -41554 -21414 272390 156873 -108386 -24152 -57770
15152 -57770 165239 244499 33352 100255 220152 -90923 189896 264739 -1887 -93159 -23302
15140A36331Q9959g0873A16756P2196d2791F1405J27598k7618f6871j01774D65895
15128A12244B8622J24986R2488c8323B97101C2207a21612C53360I2362a99253
15117B16711q6789i0235A8099J37658C717g6285b5533C74932A16187J43425L55983
15106F15595F8852J37458q8719E4932Q761K90293N3830G9013N8044J50896k0892
15095B67061j8939b83548d254m7930A42972l9812g1114a2184I9201b6356e230
15083B47473O662A7667L85060H5044R3898R0867j18030K1707M2703M10279b3035
15071a86043f8923A63763a01718A72391i4488k33187c7476B08054k7551L3801
15061B14304K56707A11390k3804b15987i2156E9078a43133B59614f0463C66141
$$ plain form
15140 136331 226290 -70873 116756 188952 -42791 61405 189003 161385 -66871 -168645 465895
15128 112244 28622 153608 246096 -38323 297101 32207 -121612 353360 92362 -199253
15117 216711 129922 -90235 18099 155757 3717 -76285 -25533 374932 116187 259612 615595
15106 615595 68852 206310 117591 54932 63693 353986 407816 79013 137057 287953 267061
15095 267061 248122 -283548 -4254 -52184 142972 103160 -71114 -12184 99201 -26356 -5230
15083 247473 254135 17667 402727 85044 178942 269809 151779 173486 216189 626468 -23035
15071 -186043 -68923 163763 -101718 172391 -94488 -327675 -37476 208054 180503 214304
15061 214304 471011 111390 87586 -215987 -92156 59078 -143133 259614 -60463 366141
15050G3911J54481b19303B87702B8284K01227a29692A03781J1133b8788C91812
15039A03730L39544j71154G0897c0265D01887A45211K48455p8799n9331a35432
15028H1480K64505h2769C76948A4152b69035a9788E2997J74041B4009K85615H402
15016c0191C02540A10178K2022n5302O3778b48192R2021A98849I174J8337K04816
15005B32327J36974G1493M3616k966K67810a986p1602B90158H3352b94043B23182
14993D56737a95583E7345J71118G0165R0437l6755Q4177a9391B52328c08910C5922
14981A42724M9033J82077j35841a59182A53175o2624J40259j07732N21629i7421
14970A59273J18914l5254a55524D8640M7322K23041a1359A90783J24378e7731
$$ plain form
15050 73911 228392 -219303 287702 28284 229511 -129692 103781 114914 -28788 391812
15039 103730 443274 272120 70897 -30265 401887 145211 393666 314867 255536 -135432
15028 81480 345985 -82769 376948 14152 -269035 -19788 52997 227038 24009 309624 8402
15016 -30191 302540 110178 132200 76898 140676 -248192 -156171 198849 9174 27511 232327
15005 232327 369301 71493 115109 112143 379953 -1986 -73588 290158 83352 -294043 223182
14993 456737 -195583 57345 228463 70165 160602 123847 208024 -19391 252328 -308910 35922
14981 142724 191757 373834 237993 -159182 153175 90551 230810 123078 644707 -97421
14970 159273 278187 242933 -155524 48640 95962 319003 -11359 190783 315161 -57731
14959a06579A50683C4586J6540j0020j7243c6353B79307A25320J10011a3668C20263
14947E0698J83730N36J26030h2739A35975A4871K90423p007j02756o8077M23117
14936E50571k11800O1643A84204J50839K64100j94393e5660C91815A42795P057
14926A49852J70504Q1867e3581B19484E3980g9013B14558F3770k1608L22599p9089
14915B85672k0472l1690K32750A67262K14604O7400Q7796A41964K0478P4819k1528
14904B15733O361L80136k56646a57343C11645Q3163I3671L80696A39928K1952
14894A61880j6858K62108j9840j02392p5679K17792P1128A56993L96722o8882
14884D84833G5797K26581J48002L9721j88776j27263P4612l9457a9936D29466
$$ plain form
14959 -106579 150683 34586 51126 41106 23863 -36353 279307 125320 235331 -13668 320263
14947 50698 234428 234964 360994 -82739 135975 14871 305294 298287 195531 127454 550571
14936 550571 338771 400414 184204 335043 599143 404750 -55660 391815 142795 149852
14926 149852 320356 402223 -53581 219484 53980 -79013 214558 63770 42162 364761 285672
14915 285672 265200 233510 466260 167262 381866 449266 537062 141964 162442 237261 215733
14904 215733 222094 602230 345584 -157343 311645 394808 93671 474367 139928 161880
14894 161880 145022 407130 387290 284898 209219 427011 498139 156993 553715 484833
14884 484833 75797 302378 450380 490101 301325 174062 248674 209217 -19936 429466
14873c1959E46619A03103M6099K71847N0534k02284k2091K45208M5988n1051j20440
14862C66913P9188j47650K48681A45278J20196q186M14602B33662l1010K77795
14852D80447r2661J17072n4191A71781J88623j70608M98047B49011M1971p4423
14842B16559K52222L66606B15885J04113K82232j78352J19758l0281k02099n279
14832C05977J43197j47153O4194L1037J3743r3151q8575K07331j38659J0220J49921
14821D58082j84469K93292D9762J45441l8151L64166k09174B2936N60963j63861
14811D20038J75136j50355A91763L35554k16660L2370J48545l6655P4739J52197
14801F81853k91467J87414K49853B13856K23153o5720R7173E8437K97412M4490
$$ plain form
14873 -31959 546619 103103 149202 421049 471583 269299 247208 492416 538404 487353 366913
14862 366913 446101 298451 547132 145278 265474 257288 671890 233662 202652 480447
14852 480447 387786 504858 450667 171781 360404 189796 687843 249011 290982 216559
14842 216559 468781 835387 215885 319998 602230 423878 543636 513355 311256 305977
14832 305977 449174 302021 366215 397252 410995 317844 229269 436600 297941 308161 458082
14821 458082 273613 566905 49762 195203 157052 521218 312044 22936 583899 420038
14811 420038 595174 444819 191763 527317 310657 343027 491572 454917 529656 681853
14801 681853 390386 577800 827653 213856 437009 371289 468462 58437 355849 400339
14791D00339O9008j38791j6261K14681r3A37342M95434m8830k59827K70867B64615
14779C37622j852J23457B29042L89237o6629j04961o3044J84026B62514Q1556
14769C44070K82493q8645J43316m3133k66413p4748N26346A17568M53090P7018
14759F47676L842K88935m61464K17765j49395K69455l64553K20064j75219j4769
14749D82337K18474j62823K3928J0734K40087r8680L2560C54179K10166j58481
14739D05864P2788J60357k09429L44577l61977M65748j61858m6169j55518j04012
14729D10371K73460J03564k70832J58962K89103D36849L07646K3822j48742o4797
14719E54778m6328J38203P3699n8872N7421k47653M09758m9146j5801K9149k2847
$$ plain form
14791 400339 469347 330556 314295 528976 528883 137342 632776 583946 324119 594986 264615
14779 337622 335770 459227 229042 618279 551650 446689 383645 567671 262514 344070
14769 344070 626563 537918 681234 638101 371688 296940 823286 117568 570658 647676
14759 647676 651518 940453 478989 696754 547359 816814 452261 672325 497106 482337
14749 482337 700811 537988 561916 572650 812737 714057 746617 354179 564345 405864
14739 405864 478652 639009 429580 774157 412180 877928 716070 669901 514383 410371
14729 410371 683831 787395 516563 675525 964628 436849 744495 768317 619575 554778
14719 554778 508450 646653 720352 661480 718901 471248 881006 831860 816059 845208 822361
14708H22361p733P9911j83022p6375J32160j09915j8328n2975K22622j42292L27203
14697I93617O9869k37959n733k52633K20626J48408O4226K98846n41409J37837
14687H95695j42293n7529P5371Q9337k43455K07273P4582O074M0271k14367j10442
14676F20517K14230k15896M29627D64989L90271J12211k34216R357J86369j05529
14666H23452P7652q005n767j92425J09220O6507Q8838q9179J63233l10031L29350
14655A052845R5440j81602k34119J42569K3587o4710L317j20324J6017L13990
14645A047010j34095K34229m9310p584m2458o4200J13123o4054q0347j15098J89830
14634A027046L43987l67820M7274n3198Q1134J0561J91381l4428J25300j69862
$$ plain form
14708 822361 814628 894539 711517 635142 767302 657387 639059 586084 808706 666414 993617
14697 993617 1063486 825527 819794 567161 787787 936195 1000421 1299267 757858 895695
14687 895695 753402 695873 771244 860581 617126 824399 898981 905055 945326 730959 620517
14676 620517 834747 618851 1048478 464989 855260 967471 733255 742612 928981 823452
14666 823452 901104 893099 887332 694907 804127 870634 959472 870293 1033526 723495 1052845
14655 1052845 1148285 966683 732564 875133 898720 834010 837327 717003 733020 1047010
14645 1047010 912915 1147144 1097834 1090250 1047792 983592 1096715 1032661 952314 837216 1027046
14634 1027046 1371033 1003213 1050487 997289 1078423 1088984 1280365 1245937 1371237 1201375
14624A201375J64569l82586J27868J62996r6700J14037k04695J50525L04756k26135
14614A316010k41668M27188J11416j98213k62629L49792l33167r8019O00712l21766
14604A349656Q4375j94397J66992j77425q0258M91751j50349m886L8526j46146
14594A377839p1776J61607Q7160N4163K6064r0221K37751o9990l27181K54859
14584A640275m6930m0728L22000n3959k94014j04034M93756n34946M93106k38902
14574A635624K5045R0579p861K92780k96382L92616j57122J36377l58095O0520
14564A814081J37887J26618k9769L03079M1499j63900K25358K03244K02713q018
14554B852792O485R17912j53149O30459P11120J735260L398040R463620J7754791
$$ plain form
14624 1201375 1365944 983358 1111226 1274222 1177522 1291559 1086864 1237389 1542145 1316010
14614 1316010 1074342 1501530 1612946 1414733 1152104 1501896 1168729 1070710 1671422 1349656
14604 1349656 1434031 1239634 1406626 1229201 1148943 1640694 1490345 1485459 1523985 1377839
14594 1377839 1306063 1467670 1554830 1608993 1635057 1544836 1782587 1712597 1385416 1640275
14584 1640275 1593345 1552617 1874617 1820658 1526644 1422610 1916366 1381420 1874526 1635624
14574 1635624 1660669 1751248 1743387 2036167 1739785 2132401 1975279 2111656 1753561 1814081
14564 1814081 1951968 2078586 2048817 2351896 2393395 2229495 2454853 2658097 2860810 2852792
14554 2852792 2859277 3777189 3624040 4254499 4965619 6700879 10098919 19562539 37317330
14545C7317330M642326B0733969H748760C895199j537542l42807l37627J0561
14537A687784j57205N8977K81845m65025N90387j3879o1720Q5502k01427k23011
14527A582228K40844K18184L60808o88027L08903P4143J54380j11153J81355k66837
14517B054828J64300K524K11819R5180m7360J2919l03365L0886K17269J29399
14507B568399k30103K14729l0985K08834j17810m7895j23453R4194j6371J60783
14497B680322j16767N6163J97722L00885J28783l22988J05273N0384J25076k25174
14487B979679O9389J89847j37849k4245L13890M12513l81554k76990K29596P0354
14477C444630J06965j20448m6532o9288L94930J49500n09696O16271k82279K3466
$$ plain form
14545 37317330 41959656 20733969 8748760 3895199 2357657 2014850 1677223 1687784
14537 1687784 1530579 1589556 1871401 1406376 1996763 1982884 1921164 2006666 1805239 1582228
14527 1582228 1823072 2041256 2402064 1714037 2022940 2097083 2251463 2140310 2321665 2054828
14517 2054828 2219128 2221652 2433471 2528651 2481291 2494210 2190845 2221731 2439000 2568399
14507 2568399 2338296 2553025 2522040 2730874 2613064 2565169 2441716 2535910 2519539 2680322
14497 2680322 2563555 2619718 2817440 3118325 3247108 2924120 3029393 3079777 3204853 2979679
14487 2979679 3049068 3238915 3101066 3076821 3390711 3803224 3421670 3144680 3374276 3444630
14477 3444630 3551595 3431147 3384615 3315327 3710257 3859757 3350061 3966332 3684053 3707519
14467C707519p3069J23689J02966M3856j03051N52633l27400N41396r72483R05377
14457D501433m46261Q6830O9007K84405j8239M9785Q6187o6990n7352L08025j30984
14446D665846M67745k83517L2292L35321n4197M43491o19905J96846n3643N51339
14436E681618o1852j27941M26983k00636J50602J82525j44664k4012L08207p2850
14426F117980M26220N3058k73486J63897R2465K21412J12186J29544k10622K51079
14416G083733L98553l87693N27141l05321K00718q8842M12040R8970l0670R9071
14406H007700N59675m48j03956N45694r0077J77662L01998j00039K39989J06985
14396I645183J80539J91822L46475o0707k08393N55453O5425K56408L23345K55180
$$ plain form
14467 3707519 3634450 3758139 3861105 3904961 3801910 4354543 4027143 4568539 3596056 4501433
14457 4501433 4055172 4142002 4211009 4495414 4477175 4526960 4613147 4546157 4488805 4796830 4665846
14446 4665846 5133591 4850074 4882366 5217687 5163490 5606981 4987076 5183922 5130279 5681618
14436 5681618 5619766 5491825 5918808 5718172 5868774 6051299 5906635 5882623 6190830 6117980
14426 6117980 6544200 6597258 6323772 6487669 6580134 6801546 6913732 7043276 6832654 7083733
14416 7083733 7482286 7094593 7621734 7316413 7517131 7428289 7840329 7939299 7908629 8007700
14406 8007700 8567375 8566927 8462971 9008665 8918588 9096250 9398248 9298209 9538198 9645183
14396 9645183 9825722 10017544 10364019 10303312 10094919 10650372 10715797 10972205 11295550 11550730
14386A1550730L45530M6654L20187l22803N48252K09979j9252M31159L04797K88292
14376A3703525j05636L21136L63084M08268N9089O01472J60351M97861O880M33809
14366A6449839O03001J73488L79546K98566N94109K31157M09272L77853P44117
14357B0260948J89683J69808R03270P08298M01367L27022O74248N47884N76667
14348B4759195P33285K55120J063410K92315R04307O75664R78383Q21367J069296
14339C1552342P95486P15066R33753J078878J123547J358127O88296J331502J335653
14330D0912650J457897J443981R08976J671160J445999J816663J590974K258169
14322E3506469J659736K092293J628011K379208K336947K726977K400867K926299
$$ plain form
14386 11550730 11896260 11942914 12263101 11940298 12488550 12698529 12679277 13110436 13415233 13703525
14376 13703525 13597889 13919025 14282109 14690377 14749466 15350938 15511289 16009150 16016030 16449839
14366 16449839 17052840 17226328 17605874 17904440 18498549 18729706 19138978 19516831 20260948
14357 20260948 20450631 20620439 21523709 22232007 22633374 22960396 23634644 24182528 24759195
14348 24759195 25492480 25747600 26811010 27103325 28007632 28683296 29661679 30483046 31552342
14339 31552342 32347828 33062894 33996647 35075525 36199072 37557199 38245495 39576997 40912650
14330 40912650 42370547 43814528 44723504 46394664 47840663 49657326 51248300 53506469
14322 53506469 55166205 57258498 58886509 61265717 63602664 66329641 68730508 71656807
14314G1656807K866597K790312L479758K953961M214528L649673L997228M105602
14306I9714466M339119N109823N087750N567671N635271O156458O652906P028995
14298A45292459P024536Q168840Q294729Q836421R533253R802648J0586307J0744501
14290B18283694J1980601J2248854J3247873J3726471J4282374J4720340J5262622
14283C13752829J5442674J6292927J6112654J5795178J4790331J4438712J3303560
14276D19928865J2010809J0040728R014414O862388L455803j934077j973028j642886
14268D55763016l294775n156779q990466j1664984j3210429j4789682j5724560
14261C82931341j6433141j7208364j6569842j6882680j6252954j5674955j4809429
$$ plain form
14314 71656807 74523404 77313716 80793474 83747435 87961963 91611636 95608864 99714466
14306 99714466 104053585 109163408 114251158 119818829 125454100 131610558 138263464 145292459
14298 145292459 152316995 160485835 168780564 177616985 187150238 196952886 207539193 218283694
14290 218283694 230264295 242513149 255761022 269487493 283769867 298490207 313752829
14283 313752829 329195503 345488430 361601084 377396262 392186593 406625305 419928865
14276 419928865 431939674 441980402 450994816 457857204 461313007 459378930 457405902 455763016
14268 455763016 452468241 447311462 438320996 426656012 413445583 398655901 382931341
14261 382931341 366498200 349289836 332719994 315837314 299584360 283909405 269099976
14254B69099976j3634249j3742216j2979444j2096058j1793689j0632352j0169750
14247A84052218r725676r017304q239914p591245p487996p031213o469885n841860
14239A22647125o058445n047136m709692m743177m578694m355056l780215l900085
14231H5474625k782755l614225l684303k700795k824527k722055k324145k342615
14223F2479205k258257k191311k185404j629343j986249j903335j888569j119224
14215D7317513j454723j627674r48001j385679j442686j174661j588629r63560
14207C6731900j72167q38397j467116j566657o05583o83493j076057k3866j192551
14198B9106013o30220r79219q71151o49545n25321l59325n63542r91668o97556
$$ plain form
14254 269099976 255465727 241723511 228744067 216648009 204854320 194221968 184052218
14247 184052218 174326542 165309238 157069324 149478079 141990083 134958870 128488985 122647125
14239 122647125 116588680 111541544 106831852 102088675 97509981 93154925 89374710 85474625
14231 85474625 82691870 79077645 75393342 72692547 69868020 67145965 64821820 62479205
14223 62479205 60220948 58029637 55844233 54214890 52228641 50325306 48436737 47317513
14215 47317513 45862790 44235116 43287115 41901436 40458750 39284089 37695460 36731900
14207 36731900 36559733 35721336 34254220 32687563 32081980 31398487 30322430 30298564 29106013
14198 29106013 28475793 27496574 26625423 25975878 25450557 25091232 24527690 23536022 22838466
14189B2838466o7143q35420q34455j66900n34244l63455l95324n51619k41912
14180A8847994o50272k26935k48398n42897l40284k72238m56496j73446j87005
14171A5750023m92988p04003j19754l08301j01872m95575l1148l49612j03127
14162A3043643j49919j66807m56636k31850J27326n10623K9373j99970l81587
14153A1102950R0657k63969m17170j95766J30134r5765n51970j42409j35419J02727
14143I624000l64858O4710k91302j33505j06002q6298m19023N1314J71886o54325
14133G856597K53449P2632l38490k09231P362l6806l02175o1939j41450O098k8816
14122G077231o07721L26418J07564O6063k35549p486j41190j79182O9685m52480
$$ plain form
14189 22838466 22771323 21935903 21101448 20934548 20400304 20036849 19641525 19089906 18847994
14180 18847994 18197722 17970787 17722389 17179492 16839208 16566970 16110474 15937028 15750023
14171 15750023 15257035 14553032 14433278 14124977 14023105 13527530 13496382 13146770 13043643
14162 13043643 12893724 12726917 12270281 12038431 12165757 11655134 11684507 11484537 11102950
14153 11102950 11193607 10929638 10512468 10316702 10446836 10351071 9799101 9656692 9521273 9624000
14143 9624000 9259142 9323852 9032550 8899045 8793043 8706745 8287722 8339036 8510922 7856597
14133 7856597 8110046 8182678 7844188 7634957 7642319 7605513 7303338 7241399 7099949 7106047 7077231
14122 7077231 6469510 6795928 6903492 6969555 6734006 6726520 6585330 6406148 6475833 6023353
14112F023353J33405k63448r4317l4284J69056q1566k08947k06493l75036L14505
14102E376228K77786n26202L08626m01368p8195J50375P6384j17228k77525p2443
14092D716438K0447Q6514m9718O0389l82601N5458J07940O2173k87556r6819j10671
14081D181994m9474J23836J64509l22357l62854M74824m19558J38490P4576k97244
14071C706742K24007m38103N12371l97738K32300k54302j31024K89878m84659
14062C259472M60165j90033K0252N9983m9839j87531J48964j50059K49786m35566
14052C185594r3166j01877L53478k36033N2677j41412k31763L23915m64940M77613
14042C124086m35851O9422N8762o2778K34529k32788J90642J19059j81572k07994
$$ plain form
14112 6023353 6156758 5893310 5798993 5764709 5933765 5852199 5643252 5436759 5061723 5376228
14102 5376228 5654014 5127812 5436438 5035070 4956875 5107250 5183634 5066406 4788881 4716438
14092 4716438 4736885 4823399 4773681 4834070 4451469 4506927 4614867 4677040 4389484 4292665 4181994
14081 4181994 4132520 4256356 4420865 4098508 3735654 4210478 3790920 3929410 4003986 3706742
14071 3706742 3930749 3492646 4005017 3607279 3839579 3585277 3454253 3744131 3259472
14062 3259472 3719637 3529604 3549856 3609839 3560000 3372469 3521433 3371374 3621160 3185594
14052 3185594 3092428 2990551 3344029 3107996 3160673 3019261 2787498 3111413 2646473 3124086
14042 3124086 2688235 2757657 2816419 2753641 2988170 2755382 2946024 3065083 2883511 2675517
14032B675517n3454j07459j1971j9726N7227L15501n01069K77130l46302o707
14022B278687k64156K28193L9225k50126M37862o2003N6459j28985n9516o4048
14012B211592L978k02795L21956k3810p0022l88839K94527k33240J39505Q562
14002B061414J26634o04292M11405j58748O5775R5892l22114N0399L89687j28617
13992A987435M09922j60668L13718P95781K578445P092287J7824308J2231143
13984D3072371j9207367A1554087m365479k048264j013671p23393k41185l51760
13976B810335n07609M08113p2103o84676J45523K31718j1347J49519n11805M8360
13966B006028J51316k50716K88657n47060M19914k76175N01559m89628j71217
$$ plain form
14032 2675517 2622063 2514604 2502633 2482907 2540134 2855635 2354566 2631696 2285394 2278687
14022 2278687 2014531 2242724 2281949 2031823 2469685 2407682 2464141 2335156 2275640 2211592
14012 2211592 2215570 2012775 2334731 2310921 2240899 1852060 2146587 1913347 2052852 2061414
14002 2061414 2188048 1583756 1995161 1836413 1902188 1998080 1675966 1726365 2116052 1987435
13992 1987435 2397357 2236689 2550407 3346188 5924633 13016920 30841228 43072371
13984 43072371 23865004 11554087 7188608 5140344 4126673 3403280 3162095 2810335
13976 2810335 2302726 2710839 2638736 1954060 2099583 2331301 2319954 2469473 1957668 2006028
13966 2006028 2157344 1906628 2195285 1648225 2068139 1791964 2293523 1803895 1632678
13957A632678p1969L61888k81283O24755n16463K39802m57426L39558o8215k41071
13947A562254O839k027o428k62265L19287J22039k98753J39622k6195l3700j04384
13936A416289L9888k13532p336K02405M26941m54876j85996K16541J90327j41568
13926A489083k99776K78040j2669k85237K36091j04236j25087K32491n3911J14129
13916A468918m05262K71717j78599k7637K06715r167k1660J98903q4913k65349
13906A153666p627K7846P8212o0975J80835j10540J04752k93700J51313l0681
13896A193101N7786k29288J59407L7972r1914O2407J43236m95001K44834k39659
13886H42881M03709j26156k66848L28269o7747q3742M6569K72156j08710l25996
$$ plain form
13957 1632678 1560709 1922597 1641314 2266069 1749606 1989408 1531982 1871540 1803325 1562254
13947 1562254 1569093 1567066 1560638 1298373 1617660 1739699 1440946 1580568 1554373 1520673 1416289
13936 1416289 1456177 1242645 1235309 1437714 1864655 1409779 1223783 1440324 1630651 1489083
13926 1489083 1189307 1467347 1454678 1169441 1405532 1301296 1176209 1408700 1354789 1468918
13916 1468918 1063656 1335373 1156774 1129137 1335852 1326685 1305025 1503928 1419015 1153666
13906 1153666 1146039 1173885 1252097 1191122 1371957 1261417 1366169 1072469 1223782 1193101
13896 1193101 1250887 1021599 1181006 1218978 1127064 1189471 1332707 837706 1082540 842881
13886 842881 1246590 1120434 853586 1181855 1114108 1030366 1076935 1349091 1240381 914385
13876I14385M0379K61969l71869J37109K60834n15741J01544j12995K55736K13968
13866A185319j08879J3806j94426L38537j72089k04447j01990N43591m21672P882
13856H85632K4235n0104J20744M9547q5122l79589M17153k80314o9197r7614M42947
13845I78318j27040l3273M0004J29564m27051J36073j41579N17637k31567n0474
13835G90612L0146C34996N35246j83515P1894k00331P5171K97772p9880l4716
13825H16637k808j69367q6096L39356l31004Q4L83517j21941j71376M7895J75935
13814H80832K25369m88501K23072l57614L5396K61342l14922N85461o3875j82281
13804H04279k02169J86517P0375j14924o6854k82387L52400j32262K31191q0150
$$ plain form
13876 914385 954764 1216733 844864 981973 1242807 727066 828610 715615 971351 1185319
13866 1185319 1076440 1090246 895820 1234357 1062268 857821 755831 1299422 877750 885632
13856 885632 909867 859763 980507 1030054 944932 565343 982496 702182 632985 535371 978318
13845 978318 851278 818005 858009 987573 560522 696595 555016 1072653 841086 790612
13835 790612 820758 334996 870242 686727 758621 558290 633461 931233 851353 816637
13825 816637 813829 644462 558366 897722 566718 566802 950319 828378 657002 704897 880832
13814 880832 1106201 617700 840772 483158 518554 779896 464974 1050435 986560 804279
13804 804279 602110 788627 859002 744078 677224 394837 747237 614975 846166 766016
13794G66016L47414m66095J01014j71677k3438j1670K26698C48443K94777j54278
13784D88942N2287L4132K08651C12947M12712L925J44948j85180J25545k95488
13774E19409Q830k6321K36045N8933j97201j8669J36349j44573P8774j97496l1733
13763D22347J419L78126l30379j19265K09426O0311K94277j36942k0774k85300
13753D73246j5134J24848j71309K02910o7581q5736J76417N6761m9696k90526
13743C54200K25570j12764j64930M77360j48629k24463j9351J1995L48947k71817
13733D76118j44431L93257Q0268J47186l32104B87487J22290l1189J89312B40871
13722F09762j25532M4019m2012M4287j30793J68562k71255O11355C30938J85516
$$ plain form
13794 766016 1113430 647335 748349 576672 553234 541564 768262 348443 643220 488942
13784 488942 541229 575361 784012 312947 725659 729584 874532 689352 814897 519409
13774 519409 528239 501918 737963 796896 599695 581026 717375 572802 651576 454080 422347
13763 422347 423766 801892 471513 352248 561674 621985 916262 779320 758546 473246
13753 473246 458112 582960 411651 614561 546980 461244 637661 694422 644726 354200
13743 354200 579770 467006 302076 779436 630807 406344 386993 398988 747935 476118
13733 476118 331687 724944 805212 952398 620294 287487 409777 378588 567900 240871
13722 609762 484230 528249 486237 530524 399731 568293 297038 908393 330938 516454
13712E16454j89209L20499j42720R4357J8545k73898J04130j68962J60122K33306
13702F72624j67345j28667J37968A68690o885K75887r9122L81048B72465J04334
13692C76799J61458j67012q5975j40343K55505K66859d2243E23998j21181r5520
13682C07297o8809L6195J35488p5204K27980J77534k60645q5214J42590k1416
13672E15796O5301k67563J27076r9542M04667C48942L98440l24277J5917n774
13662D33248j18638n493J78835A07896R3978K65118A39689N9613L34819N6288
13652E90409j43644k3574p1659A9634M40466A29350K68449j37964J04570L67806
13642G32211j89120B70568K76111B59774J69818J87981j72913o1032j16787J22884
$$ plain form
13712 516454 327245 647744 505024 599381 617926 344028 448158 279196 439318 672624
13702 672624 505279 376612 514580 168690 161805 437692 338570 719618 272465 376799
13692 376799 538257 371245 285270 144927 400432 667291 -42243 523998 402817 307297
13682 307297 238488 274683 410171 334967 562947 740481 479836 394622 537212 515796
13672 515796 581097 313534 440610 341068 745735 348942 747382 423105 439022 433248
13662 433248 314610 309117 487952 107896 201874 466992 139689 199302 534121 590409
13652 590409 446765 423191 351532 19634 460100 129350 397799 259835 364405 732211
13642 732211 543091 270568 546679 259774 429592 617573 444660 383628 266841 389725
13632C89725j00948J27469n3171J11319A30604L78718k46311J58422Q4328j2323
13622D93438j56946K628L65431j70828k64311K90858j05235q6544L8693M5750
13612D52934j79881J1685K00892j65354L86130C48580K7074J04728C5226L13859
13602C49085G9076J83041Q4632J2158P5733O429b2779C68472j4946M7630o1611
13591C39545k415J54448G116K03654K60986k20055J6328e110D79260R2946B68434
13579A74178K21461f0432C83813o4819D9714N19561O7573B14815J37225J95137
13569E47177e0979D00486J2262A58816J76544j03387f9394C74655m7279K08818
13559E36194C5081b9199D13696J4902J9277A99014Q3563q4434J37087J62017B14793
$$ plain form
13632 389725 288777 416246 363075 474394 130604 509322 263011 421433 505761 493438
13622 493438 336492 339120 704551 533723 269412 560270 455035 368491 407184 452934
13612 452934 273053 284738 485630 320276 706406 348580 375654 480382 35226 349085
13602 349085 79076 262117 346749 358907 434640 441069 -22779 368472 353526 401156 339545
13591 339545 337130 491578 7116 210770 471756 251701 268029 -5110 479260 572206 268434
13579 174178 395639 -60432 383813 318994 49714 569275 636848 214815 352040 547177
13569 547177 -50979 400486 412748 158816 335360 231973 -69394 374655 327376 536194
13559 536194 35081 -29199 413696 428598 447875 199014 282577 198143 335230 497247 214793
13547B32456Q1963J49417A17229K48824k5810N7165A21771K77785j89660J500
13537B11396j0567K21992j60080i2964C37979m2910L8338A27069f2732A38201
13526C20177a19453C39453A27032B1124K47355J15411B7746N60348B29428F2355
13515E77267A97195J31428A31601m6334A9388J35624l6738J07236p6583l7274
13505A11653L04920A13118J53658I0674P0828A5413L76475A22095k759K58457
13495C77793r327c2184C21394b894A27690J88005P441A05995j7971N02767k07562
13484C83229j00977o1262L19807B65219k4066I4272P6379P2891j1820J08290B1462
13472A02405K68028A33442m2695R6296J94364j73453n4088J54834H3943a29554
$$ plain form
13547 232456 314419 463836 117229 366053 340243 397408 121771 399556 209896 211396
13537 211396 200829 422821 262741 -92964 337979 295069 333407 127069 -62732 138201
13526 320177 -119453 339453 127032 21124 268479 383890 27746 588094 229428 62355
13515 577267 197195 328623 131601 85267 19388 155012 118274 225510 148927 111653
13505 111653 416573 113118 266776 90674 161502 15413 391888 122095 119336 377793
13495 377793 368466 -32184 321394 -2894 127690 315695 323136 105995 88024 590791 383229
13484 383229 282252 220990 540797 265219 241153 94272 170651 243542 231722 340012 21462
13472 102405 370433 133442 90747 187043 381407 207954 153866 308700 83943 -129554
13461B83909r4647G4052Q1976p3134J38927R0442J20097j08092j8666G3107L27308
13450D00415n2837l1464A34190J05118J94968H5923L36577a05943D0681L8627
13440G9308J79524h2699A98067b43153D90405A26353D3191K43199l9186J27866
13430C75070j8397j34818K71240k8539j96335a88618A02793b45408A44354f9521
13419B82759a4377E0755N25043D4973N19880k79640J9404a66185C6081L0712C0198
13407a71561B45361N9065a71816M9855B93556A28659J69704j11720J22716b93166
13396G952K50487J5183C8900K12192q6625g5800D4804a1298B06693N1999d4072
13384D45997a90634B45531J96572c193j05861C06605O2471A11655P2927B7638
$$ plain form
13461 283909 189262 74052 156028 82894 221821 312263 432360 324268 305602 73107 400415
13450 400415 347578 316114 134190 239308 434276 85923 422500 -105943 40681 79308
13440 79308 258832 -82699 198067 -243153 490405 126353 43191 286390 247204 375070
13430 375070 356673 221855 493095 464556 268221 -188618 102793 -245408 144354 -69521
13419 282759 -14377 50755 575798 44973 564853 285213 304617 -166185 36081 66793 30198
13407 -171561 245361 304426 -171816 -121961 293556 128659 298363 186643 309359 -293166
13396 7952 258439 273622 38900 251092 164467 -75800 44804 -11298 206693 258692 -44072
13384 445997 -190634 245531 442103 -3193 -109054 306605 369076 111655 184582 27638
13373A68541I216K45851h5564H6586L5160J06183o6960a40232A68815L26208k22532
13362B72491F4561L94630j61245H9317a08653j2435A10493f5769D86258A29411
13351D79713j72205B8288K97490H7558K02177J20569j93522M35650A75031R6688
13341B71719J14033r0402G4190d9228C74876l1537G7771J07718E7999J52065f8165
13329A59510m2999n4948j6938L0264J04196F5821M8407f7815B93739n6774l0995
13318B05970P846L6667n3037J54251l2037D4711R0243E3382b01127F2387f6342
13306A35812k2422J39144n3702J05796a19792C75648a44478F5860O1723m1419
13296H6164J06526F4596J06235E6105J73576K7215p2928c34392B24388m2148K37686
$$ plain form
13373 168541 9216 255067 -85564 86586 121746 227929 160969 -140232 168815 495023 272491
13362 272491 64561 459191 297946 89317 -108653 -121088 110493 -65769 486258 129411
13351 479713 307508 28288 325778 87558 289735 410304 216782 652432 175031 271719
13341 271719 385752 295350 74190 -49228 374876 343339 77771 185489 57999 210064 -68165
13329 159510 116511 61563 44625 74889 179085 65821 114228 -67815 293739 236965 205970
13318 205970 213816 250483 197446 351697 319660 44711 134954 53382 -201127 62387 -66342
13306 135812 113390 252534 198832 304628 -119792 375648 -144478 65860 127583 86164
13296 86164 192690 64596 170831 56105 229681 256896 183968 -334392 224388 182240 419926
13285D19926A51545K50849j86302n7690h5329C04335j39494l174e8187H1616F354
13273B05462O5311A07599L28407C6590i5310A13686f4091C67063b0939B0564N23158
13262E43722I0705f2577A54350p6900k6625d7596B74826F0007J77923P2823H4417
13250A98612R3537r6750b04719A11918K40405j38335E359M3186R7264h7830I3873
13238I3970l2034N1417h2261k8507E0410j5278J88305L5245A2493L6998b443C33844
13225b57502D71799A94092p5900R7273A244J96328J0904c4554B89504a04335a6833
13213c5114r5217C12906b51193a13656D2821J86227c25111A98528H8274R3673
13203A81947l7933n2768a30279A15586a205B35857j9245c37439B08288N1371H0520
$$ plain form
13285 419926 151545 402394 216092 158402 -85329 304335 164841 161667 -58187 81616 6354
13273 205462 270773 107599 436006 36590 -95310 113686 -64091 367063 -20939 20564 543722
13262 543722 90705 -62577 154350 77450 50825 -47596 274826 60007 237930 310753 84417
13250 198612 292149 195399 -204719 111918 352323 213988 5359 48545 145809 -87830 93873
13238 93970 61936 113353 -82261 -110768 50410 35132 223437 258682 12493 49491 -2443 333844
13225 -257502 471799 194092 118192 215465 1244 197572 208476 -34554 289504 -104335 -16833
13213 -35114 -130331 312906 -251193 -113656 42821 229048 -325111 198528 88274 181947
13203 181947 144014 91246 -130279 115586 -1205 235857 216612 -337439 208288 259659 80520
13191a54606C81138A86065H372f0734m0887L2762B72661a30071l67430a73975
13180A01676J9573K91392f2194C93361g9454A13524c8755G7161a99967B75871
13169I2487J54972a30160I3354P6108h6816A07371M8711K61083D7655J96548J46614
13158C90817o7665Q1369b89331D18614p2850m6730H4398c8956j05636c3098D3284
13146A62542K7555F5081e1361D05751j98821I3663i7765B89994c8312C56265B8863
13134a09906F047g6640A93707h805B29536J1728A12039i374j88138c6435k15545
13123b51980B21515j03846J37903n4294D9720L32835m6781A34279d866j58843
13113a63709e3608A50412b98445C7291a87062A60244E7044K83966e6942j56694
$$ plain form
13191 -154606 381138 186065 8372 -60734 -101621 -68859 272661 -130071 -497501 -173975
13180 101676 121249 412641 -62194 393361 -79454 113524 -38755 77161 -199967 275871
13169 92487 247459 -130160 93354 169462 -86816 107371 156082 417165 47655 244203 390817
13158 390817 323152 404521 -289331 418614 345764 299034 84398 -38956 -144592 -33098 43284
13146 162542 190097 65081 -51361 405751 206930 93663 -97765 289994 -38312 356265 28863
13134 -109906 6047 -76640 193707 -8805 229536 241264 112039 -9374 -197512 -36435 -251980
13123 -251980 221515 117669 255572 201278 49720 382555 335774 134279 -4866 -163709
13113 -163709 -53608 150412 -298445 37291 -187062 160244 57044 341010 -56942 -213636
13103b13636e5420C4739P9437J53769q6009b6717D718L9232K27101g1715F0469
13091A58290e8372b3752G9521L5749L16262k10584e178A01240m6554a89345c9026
13079A72737q3010j330K4486J04864F2630F543b6804G7474b59230B2127M0482
13068F2609M900A1683a54249A15797C4333L1470K49563a7805B10287i8343B39874
13056c6598A58721F4778M46836a68341f7484A2169L25476E4938J37592D4438L77887
13045D22325A53288O6043q5502a20994B49710F3613o85a55815c9049B24171H4854
13033C9338e0831B03188B0356a18635j47654B28410q7660g7921a9188A72106R9601
13022B71707b6567P63H6315B1694m664b62969F9111K2433J93362B4328K50475
$$ plain form
13103 -213636 -55420 34739 114176 267945 181936 -26717 4718 43950 271051 -71715 60469
13091 158290 -58372 -23752 79521 115270 431532 220948 -5178 101240 54686 -189345 -39026
13079 172737 89727 88397 112883 217747 62630 6543 -26804 77474 -259230 22127 62609
13068 62609 67509 11683 -154249 115797 34333 65803 315366 -17805 210287 -98343 239874
13056 -36598 158721 64778 511614 -168341 -67484 12169 337645 54938 192530 44438 422325
13045 422325 153288 219331 133829 -120994 249710 63613 62928 -155815 -39049 224171 84854
13033 39338 -50831 203188 20356 -118635 -266289 228410 140750 -77921 -19188 172106 271707
13022 271707 -26567 -25804 86315 21694 17030 -262969 69111 91544 284906 24328 274803
13011B74803G6839J45454q6327K8222K0988p4325N1765c40028A09205O4514O4044
13000B37763I0984R5673a21849B13210N7449E1800J2743Q6277Q9890E6559K4179
12989H0738h1930A96243A2313e1613j51916P5932F9679j6959J56982b29130A77041
12977a59187c5911k15645C08313K1717b56384A83800b16608G161K38K05355I0489
12965D8283k113Q3470a26415E3890A4048b20230B54197a78053E3851J89867b69042
12953a7577H6771J2547J18939I4511Q9310A9429K86472a93455c2813j31782C3183
12941f111j05695B04475J17338j47462o1439a08993C85345c7348A30620f6090
12930C8726Q4258C2169J88457m9530m5474J87905a02232j56312f6275A38195L8455
$$ plain form
13011 274803 76839 222293 135966 164188 185176 110851 162616 -340028 109205 173719 237763
13000 237763 90984 186657 -121849 213210 270659 51800 64543 150820 240710 56559 80738
12989 80738 -81930 196243 12313 -51613 -203529 -127597 69679 52720 209702 -229130 177041
12977 -159187 -35911 -251556 308313 330030 -256384 183800 -216608 7161 7399 212754 90489
12965 48283 46170 129640 -126415 53890 14048 -220230 254197 -178053 53851 243718 -269042
12953 -17577 86771 99318 218257 94511 183821 19429 305901 -193455 -32813 -164595 33183
12941 -6111 -111806 204475 321813 174351 112912 -108993 385345 -37348 130620 -66090
12930 38726 122984 32169 220626 171096 125622 313527 -102232 -258544 -66275 138195 176650
12919A76650b54587A5260B326J78956H1214b8933q9164A71873G4108N5954m8965
12908H1097b17371C01634e750j04276N4176A08354C66a78804B51003d8674G3012
12896H6094L00144h8154D32278a67591C2539O9429P2519K6844I6600l2908B3144
12884D6846J3817L76686A34059O9548E8052K12039D5963K65064B9057a35301B9458
12872B95407j45358c19768A98177A2266M90206A73440k4576b80941B11334J8327
12862B29661k1490h6493j95069F5240J86625b08780G8428b49302A06225i445M36
12851i009l2316A44718l1866e8191A80732d0854B318J43763E6504i2288k13372
12840c05660A1488g4858D50685B18177b8147A45574Q2461L5626a57421f1824K0189
$$ plain form
12919 176650 -254587 15260 2326 181282 81214 -28933 -118097 171873 74108 130062 81097
12908 81097 -217371 301634 -5750 -110026 -55850 108354 366 -178804 251003 -48674 73012
12896 86094 386238 -88154 432278 -167591 32539 101968 174487 201331 96600 63692 23144
12884 46846 60663 437349 134059 203607 58052 270091 45963 311027 29057 -135301 29458
12872 295407 150049 -319768 198177 12266 502472 173440 148864 -280941 211334 229661
12862 229661 208171 -86493 -281562 65240 251865 -208780 78428 -249302 106225 -9445 -9009
12851 -9009 -41325 144718 112852 -58191 180732 -40854 2318 146081 56504 -92288 -305660
12840 -305660 11488 -74858 450685 218177 -28147 145574 228035 263661 -157421 -61824 -41635
12829d1635k5876A6025J21438i9401I1029A523J77761a69240e3045A59750D2443
12817b23491i7160q461i255E5525b1338A53162j266i355A13367J23608c5784A77753
12804D41322b74020A47642D2716a11455l3957B43121c45405I9006m8995K101D147
12792g2364j50268I1462k1377c02965c2130j03274I3669I716J07623f2011r0557
12781a52568B24056D3049i7763l35240A837J75275p5011j8314e4477C9626J13615
12770A53241J36633f4800C23776b5115F530a0435r2146D7248a09446R526C80437
12758F0878j0899J00626J65267i866A68596b82291a12339B01263G6442O7890k1752
12747A22580J07605b0148o3165j96711A29933a40939h076B71272B9111a68994
$$ plain form
12829 -41635 -67511 16025 137463 -99401 91029 1523 179284 -169240 -53045 159750 42443
12817 -223491 -97160 -105621 -9255 55525 -21338 153162 151896 -9355 113367 236975 -35784 177753
12804 441322 -274020 147642 42716 -111455 -145412 243121 -345405 99006 50011 52112 4147
12792 -72364 -222632 91462 70085 -302965 -32130 -135404 93669 9716 117339 -62011 -152568
12781 -152568 224056 43049 -97763 -433003 1837 177112 102101 83787 -54477 39626 153241
12770 153241 289874 -64800 323776 -25115 6530 -10435 -102581 47248 -109446 -99920 380437
12758 60878 49979 150605 315872 -9866 168596 -282291 -112339 201263 76442 144332 122580
12747 122580 230185 -20148 -83313 -280024 129933 -140939 -8076 271272 29111 -168994
12736B04561h5623H4213J12012b08494A65611c84591B19579l7488H8567R4570
12726A83137p4723l6413B8275a2333r0221F693d4766f21j07222A36362A9102f8646
12713a0637C54059j74621F2446K0359j0620J60784N3445j25695M2241r3683j1246
12702I8031O6234J16380F3919a11612K9171A07462J16494K9851f4280c1226A11845
12690h1633m0153j45096d5513E4058b1212H2830b46283B32613i7764b9720A30150
12678B5452b20247j09906B32603G8183K10621m6164M2933q8528a04478A39624
12667A97689n1402b9504F129K1185A3608a59120j13528h2013A13380a50401E299
12655c8105A63721F5886b69517N2098B64082b0190q095n9548H2280M06738D3208
$$ plain form
12736 204561 -85623 84213 196225 -208494 165611 -384591 219579 182091 88567 183137
12726 183137 108414 72001 28275 -12333 -102554 6693 -44766 -621 -107843 136362 19102 -68646
12713 -10637 354059 179438 62446 82805 72185 232969 286414 160719 202960 109277 98031
12702 98031 164265 280645 63919 -111612 -82441 107462 223956 253807 -64280 -31226 111845
12690 -81633 -121786 -266882 -45513 54058 -21212 82830 -246283 232613 -97764 -29720 130150
12678 25452 -220247 -330153 232603 78183 288804 242640 285573 197045 -104478 139624
12667 197689 146287 -29504 6129 27314 13608 -159120 -272648 -82013 113380 -150401 5299
12655 -38105 163721 65886 -269517 -217419 264082 -20190 -28285 -87833 82280 489018 43208
12643D7740J29960B9060e5469D629R183J87227e4214g57D2711K86153K141d0733
12630E6455m521b15869B9459c3831A55840d12A6461O3421M2570C853J56992O5161
12618B26006G7760A5215a01984j25525i6361f909D3170p778j4785R1612J51168
12607B63387A15032j0914G648R7048m3303e1620A60833K35290a61140c0421B2745
12595D2772K11190G1395b44469A9394K86503c2707e072k24643A4935b2009B14243
12583A69036c01627k0686g7399j48077c0797E722N9849k2127i9143p7670I2808
12571E31603e5515A04824M11078g6136G2498K54265o2771B1345F685J0341c2784
12559A58404a95784C4463d03935f7308a4080j64105d5803m9612H2140J67481G8050
$$ plain form
12643 47740 177700 29060 -55469 4629 13812 201039 -54214 -757 42711 328864 331005 -40733
12630 56455 51934 -215869 29459 -33831 155840 -412 16461 79882 122452 3853 160845 226006
12618 226006 77760 15215 -101984 -227509 -96361 -6909 43170 35392 20607 112219 263387
12607 263387 115032 104118 7648 104696 61393 -51620 160833 396123 -161140 -30421 22745
12595 42772 253962 71395 -244469 19394 305897 -32707 -5072 -229715 14935 -22009 214243
12583 169036 -301627 -322313 -77399 -225476 -30797 5722 65571 43444 -99143 -176813 92808
12571 531603 -55515 104824 515902 -76136 72498 326763 263992 21345 6685 17026 -32784
12559 158404 -195784 34463 -403935 -67308 -14080 -178185 -45803 -95415 82140 249621 78050
12547h8560C58591C9043K03619A04383J35771C4994h2086F6909a9074j36415a326
12535d1614B4013J00309c73442e7295k4920K9092G570Q8585K71378C2551J36536
12524A69087J32046b91451b2197B1980M0816a0256H6422Q9357b7813A97576f6700
12512G13R6145K19154j34872B0231P6430J77652D3230e0549B85864N3227g3121
12500f5365n8222B87701b70149A07671K00885b10541A42391b5755B1439L1069
12490E2508J95133i6264B02841e983A08465b23046D1916g3904r0643A05766b8644
12478A51135A0410O7214d6024J8691C645i7394D4512J45416a02087A46462e8454
12466b91033A1404M09173a20460k475p5999Q9878n0721a2165j26072B35772a30746
$$ plain form
12547 -88560 358591 39043 242662 104383 240154 34994 -82086 66909 -19074 -155489 -1326
12535 -41614 24013 124322 -373442 -57295 -82215 -53123 7570 96155 367533 32551 169087
12524 169087 301133 -291451 -22197 21980 62796 -10256 86422 175779 -27813 197576 -66700
12512 713 96858 316012 181140 20231 96661 274313 43230 -50549 285864 339091 -73121
12500 -65365 -123587 287701 -270149 107671 308556 -210541 142391 -25755 21439 52508
12490 52508 247641 -96264 202841 -5983 108465 -223046 41916 -73904 -164547 105766 -28644
12478 151135 10410 77624 -46024 -27333 3645 -97394 44512 189928 -102087 146462 -58454
12466 -291033 11404 420577 -120460 -122935 -198934 -109056 -159777 -12165 -138237 235772 -130746
12454a06072M8458l49549A19094g6216k07978f2013m6099G0340b2007A51634e2549
12442a53384B83977g9085A8448J26572a10956e5465l41879i0928n7146j9763B44152
12430A82784a25616j27589D741a14122a7810C07639h1275k78086B621J33475e2231
12418B32050a45287A41216M5748q5256b22868A0235K4258c75252B36292Q0168
12408C16460h0232j01926l4946C5756J67057i2887c5084j94878A13173B5468a6625
12396i3365j95456A86646r1333k4145a08412B60399J1485c2443C68835A9432Q9947
12385A09379m3712j8542a96914C6600K11444H1280b46157f9843B0342K40129B9409
12373g4470m1003C3451b67924j05355B01278a03536A97000b50930H7345L7620
$$ plain form
12454 -106072 -57614 -407163 119094 -76216 -284194 -62013 -108112 70340 -22007 151634 -52549
12442 -153384 283977 -79085 18448 145020 -110956 -55465 -397344 -90928 -148074 -167837 244152
12430 182784 -125616 -253205 4741 -114122 -17810 307639 -81275 -359361 2621 136096 -52231
12418 232050 -145287 141216 186964 101708 -222868 10235 34493 -375252 236292 316460
12408 316460 -80232 -182158 -217104 35756 202813 -92887 -35084 -229962 113173 25468 -16625
12396 -93365 -288821 186646 95313 71168 -108412 260399 271884 -32443 368835 19432 109379
12385 109379 65667 47125 -196914 36600 248044 81280 -246157 -69843 20342 260471 29409
12373 -74470 -115473 33451 -267924 -373279 201278 -103536 197000 -250930 87345 124965
12363A24965g7906H2359a54714A03451l6095J60008b72170a06468B53948m5031
12353B08917d9530B80266a36382M9310c7095r2512b6961j1396A99579n9163d0698
12341a04505j37174M1576D1703c9777j26465f5656j2706A34981L7414J1243d7216
12329C75856i627B39138b5732n9854k17243a48712O5622A00185d26585a12721
12318A94759f3365o7035B16360d4216H7037J46153b56016j17029e9555b4020p5449
12307i9469M3901K3817A09503c52109h3379j09817L6290E5089f7514H4805l7659
12296D7146a61045M1546l2133p1907A10193J36846e2876A34060J30401B3456K62531
12285B85987j28487O467J7185Q2559H3374K41633A38395g895C56503h4271B14736
$$ plain form
12363 124965 -77906 82359 -154714 103451 67356 227364 -272170 -106468 253948 208917
12353 208917 -49530 280266 -136382 -87072 -37095 -129607 -26961 -38357 199579 140416 -40698
12341 -104505 -241679 -200103 41703 -39777 -166242 -65656 -78362 134981 172395 183638 -47216
12329 375856 -9627 239138 -25732 -85586 -302829 -148712 -83090 100185 -426585 -112721
12318 194759 -63365 -130400 216360 -44216 87037 233190 -256016 -373045 -59555 -24020 -99469
12307 -99469 -55568 -31751 109503 -352109 -83379 -193196 -156906 55089 -67514 84805 47146
12296 47146 -161045 -119499 -151632 -223539 110193 247039 -52876 134060 264461 23456 285987
12285 285987 157500 163967 181152 263711 83374 325007 138395 -7895 356503 -84271 214736
12273A29852j1591b2426E6908a9639A63912a05063f049C18544b31126A98938a48667
12261H7794d581D7477b03382B17857e6262A50652a29337j66094i2582F0909L0509
12250I1418j6308c47939A32022J72185b92519A31688g7569C95660a47554O2832
12240h4722A2889a89783O7507J2300F4702l2281N83424c2645B45295n3166F85
12228b2419B05573J50349C9534M46395d9508C22450g7593a989A06321b8264D93297
12216D25306A82635K51863c8932A6935a12476D13374n008a33264C14634D1567
12205B67785a7543k25798R2694A1540P4915K28971a05387A30766o0658N6341J837
12194A28286D618N7215N9671f2837B07873p5552K5001b7852j7075r935a4189C46459
$$ plain form
12273 129852 118261 -22426 56908 -19639 163912 -105063 -6049 318544 -231126 198938 -148667
12261 87794 -4581 47477 -203382 217857 -56262 150652 -129337 -295431 -92582 60909 91418
12250 91418 75110 -347939 132022 304207 -292519 131688 -77569 395660 -147554 -84722
12240 -84722 12889 -189783 -122276 -109976 64702 32421 615845 -32645 245295 192129 685
12228 -22419 205573 355922 39534 485929 -49508 322450 -77593 -1989 106321 -28264 493297
12216 425306 182635 434498 -38932 16935 -112476 413374 408366 -133264 314634 41567
12205 267785 -17543 -243341 -150647 11540 86455 315426 -105387 130766 70108 126449 128286
12194 128286 4618 61833 121504 -62837 207873 132321 157322 -27852 -44927 -54862 -14189 346459
12181B40430L6903A08584l2976L1457b87087i6815A11474Q9385a07399A82503
12170I4613K84845A1952Q7545A7356M3272a70914I3479J50850A18443L6766J36218
12159B91427J66241G4261a04337I8842e0690j91810a9266k5367F4138J7757a55578
12147A6988e4492j22774H5818K2254a50370d5191k0565B35806F3285b30345A97648
12135A54169f6353B44908p3089e4491g69C8413a1205F5487A4703K7522b9638j3795
12123d3433k99746J67972G4677b4491p107B02028g4943B18473e3855k75653A21869
12111c4871r5489A29780a90981H2990i1311A42841a07303a2511C30371d7352k55081
12100c02433M247C7139K4320b5808r8371E1362M5063b05069P4420A42702b12139
$$ plain form
12181 240430 277333 108584 75608 107065 -287087 -96815 111474 200859 -107399 182503
12170 94613 379458 11952 99497 17356 60628 -170914 93479 244329 118443 155209 291427
12159 291427 457668 74261 -104337 98842 -50690 -242500 -19266 -44633 64138 81895 -155578
12147 16988 -54492 -177266 85818 108072 -150370 -45191 -65756 235806 63285 -230345 197648
12135 154169 -66353 244908 171819 -54491 -769 38413 -11205 65487 14703 42225 -29638 -43433
12123 -43433 -343179 -175207 74677 -24491 -31598 202028 -74943 218473 -53855 -329508 121869
12111 -34871 -130360 129780 -190981 82990 -91311 142841 -107303 -12511 330371 -47352 -302433
12100 -302433 -298186 37139 61459 -25808 -124179 51362 96425 -205069 -130649 142702 -212139
12088A92116c8828I6323a29883A38207d950j06977q9619d0648A64616J9824e5327
12076I8591a68781E62366R53383l69092n19979H4637O8602p3885a48176L4207
12066a13969g926H4564l5395a33050A0071f0908A93850J69723a98756E8875M7793
12055A06668l1809O5173b39309b6420A81043A5836d67442A61095e185A96576k9223
12044A67353F2053d6522A22551c60302d9660A10297c05969e2389H6138P884B5258
12032c5424A80485A8274b1538o3729B17739I5454a09277e1824A73445b71251C57655
12020A93204m2042d599B03920e7237j21505C21022C9400b36767f5968f505A69089
12008i1176l079j28166a06358C01186q7288D5834e4951A97807d0382M048A03709
$$ plain form
12088 192116 -38828 96323 -129883 138207 -4950 -111927 -201546 -40648 164616 184440 -55327
12076 98591 -168781 562366 1515749 1146657 626678 84637 153239 79354 -148176 -113969
12066 -113969 -7926 84564 49169 -133050 10071 -60908 193850 363573 -198756 58875 106668
12055 106668 74859 140032 -239309 -26420 181043 15836 -467442 161095 -5185 196576 167353
12044 167353 62053 -46522 122551 -360302 -49660 110297 -305969 -52389 86138 94022 25258
12032 -35424 180485 18274 -21538 -85267 217739 95454 -109277 -51824 173445 -271251 357655
12020 193204 151162 -4599 203920 -57237 -178742 321022 39400 -236767 -65968 -6505 169089
12008 -91176 -94255 -222421 -106358 301186 213898 45834 -54951 197807 -40382 -36334 103709
11996b6053j15417m4138Q8009j65388f2280n8195l2212g1754l42943a09096j36045
11985b45141R9619A42723N6471c18484J12486o0274B32499E0552b41354k47895
11975d89249A59980E2104J97769B5397P5671A0481k850N0693P4454a30421N0186
11964h0235B51446l8417A8434K03384J15783d39296a68227j75507a61169B29228
11953a60985a7996D1409i2744M6356B18566a94230B4026J49819a56981B17354
11942E5866J19393b5932k82377N1429e9428j97928F6723a85101k25733B76629
11931a37975a4384C8213K15042r3041a04073A48977b22043A37530f8508k01811
11921b70319B30458k8195h0307A05056d4775j89511M2462j8694A4569Q2867C843
$$ plain form
11996 -26053 -141470 -185608 -97599 -262987 -62280 -120475 -152687 -71754 -414697 -109096 -245141
11985 -245141 -145522 142723 199194 -318484 -205998 -266272 232499 50552 -241354 -489249
11975 -489249 159980 52104 249873 25397 101068 10481 7631 58324 132778 -130421 -80235
11964 -80235 251446 213029 18434 221818 337601 -439296 -168227 -343734 -161169 229228
11953 -160985 -17996 41409 -92744 -46388 218566 -194230 24026 173845 -156981 217354
11942 55866 175259 -25932 -308309 -256880 -59428 -257356 66723 -185101 -410834 276629
11931 -137975 -14384 38213 253255 160214 -104073 148977 -222043 137530 -68508 -270319
11921 -270319 230458 202263 -80307 105056 -44775 -234286 -191824 -210518 14569 97436 3843
11909f3178C19037a44631g940A44383J21459b26218G4507J80897a48316C6769
11898d90253J92712P4773C8820b02743P499E9777K3129a03467B34657c7727k80868
11887c18595d5561j23325e6023o823K6522k14980k09966d9810A99112b27107K1252
11876b05855b4070k25778A10239b07516a0283A33440F0763a89201K1218B22960
11865C1116N1881e8886J8110p5311E2528d4773l33518a16476N3523o4668d2537
11853f8419l9663j14121A51295J3774e5980A19664K8278a2280j47562I4158J93345
11842B87503b1373k42686E8369e307j74740L4937E8483a52813E9202a33820A6016
11830a60220D8169a69255o8083P0768f6278k40858a29652K177B58863a18636C193
$$ plain form
11909 -63178 319037 -144631 -7940 144383 265842 -226218 74507 255404 -148316 36769
11898 -490253 -297541 -222768 38820 -202743 -195244 59777 82906 -103467 234657 -37727 -318595
11887 -318595 -45561 -168886 -56023 -62846 -36324 -251304 -461270 -49810 199112 -227107 -205855
11876 -205855 -24070 -249848 110239 -207516 -10283 133440 60763 -189201 -167983 222960
11865 31116 82997 -58886 -40776 -116087 52528 -44773 -378291 -116476 -62953 -127621 -42537
11853 -68419 -108082 -222203 151295 165069 -55980 119664 147942 -12280 -159842 94158 287503
11842 287503 -21373 -264059 58369 -5307 -180047 -145110 58483 -152813 59202 -133820 16016
11830 -160220 48169 -169255 -237338 -166570 -66278 -307136 -129652 -127475 258863 -118636 3193
11818A4221b30492A11727c9346D5445a07435A09444k4349a46584A61859D0041
11807e4949k4849j96637B26466j878C3774N1687N7210o8658K4166a58111C51260
11795f717B50574D4201J98103a18284C73153b32276A47872F4907a19675D9085
11784a64907E6542j9780J75062i3437j04258g5356B9065J80638b07145b4351A82407
11772g0918l1848k65236A674J21586k0583K373B4461a73053A70497a764k96097
11761b97861a21776A60674B0900a33397A46511e0533A88182a86632j3686D2964
11750E06088a72814l0575K9561A88104a38503F2239a10470G862L2301J52941N0221
11739B43325b59457c3266q666B31i7876B8244a85509A38942L6874d3812J7049
$$ plain form
11818 14221 -230492 111727 -39346 45445 -107435 109444 85095 -146584 161859 40041
11807 -54949 -79798 -276435 226466 224588 33774 85461 142671 74013 98179 -158111 351260
11795 -6717 250574 44201 242304 -118284 373153 -232276 147872 64907 -119675 49085
11784 -164907 56542 36762 211824 -93437 -197695 -75356 29065 209703 -207145 -24351 182407
11772 -70918 -102766 -368002 1674 123260 102677 105050 24461 -173053 170497 -1764 -297861
11761 -297861 -121776 160674 20900 -133397 146511 -50533 188182 -186632 -200318 42964
11750 506088 -172814 -203389 -173828 188104 -138503 62239 -110470 7862 40163 193104 243325
11739 243325 -259457 -33266 -41932 231 -97876 28244 -185509 138942 175816 -43812 -26763
11728b6763A62348e9341j16223G1140f6194j78135Q4794M2391j23855c6329A12317
11716A4917J19158d0792A68295l4030a01176A14892f0181B47193j20643f4953
11705a08099c168A66473Q0854b16342A06929b11540B45189D4534a41254d5850
11694B2552J15718m3965j7356a80100B13319C2365a74093e9493K7944A27011Q8668
11683B15679a68593D58088a2066k6314B56610f659H3870a2234A41099E1250K02987
11672B54237r1644p1532K86752j7244d9167H4385A949c7977l68152B79042A08359
11660A09741b43933P9792G7106J08729A6116j799b88765g301A51581e7717p0910
11649a28627m796C1421a94388E9943P0253a09036E66312b08418k9454r3881a16706
$$ plain form
11728 -26763 162348 -59341 -175564 71140 -66194 -244329 -159535 -117144 -240999 -36329 112317
11716 14917 134075 -40792 168295 134265 -101176 114892 -60181 247193 126550 -64953
11705 -108099 -3168 166473 247327 -216342 106929 -211540 245189 44534 -141254 -45850
11694 22552 138270 94305 76949 -180100 213319 32365 -174093 -59493 -31549 127011 215679
11683 215679 -168593 458088 -12066 -38380 256610 -6659 83870 -12234 141099 51250 254237
11672 254237 162593 91061 377813 360569 -49167 84385 1949 -37977 -406129 279042 108359
11660 109741 -243933 -164141 77106 185835 16116 14317 -288765 -7301 151581 -57717 -128627
11649 -128627 -133423 31421 -194388 59943 130196 -109036 566312 -208418 -237872 -331753 -116706
11637D5059g2267k28289r1299D3181M84a54347I5454C8212J09120a76801P8647
11626i8154D25016b8100B359J72559O9408J29411a76903c5575A53267g5177K5337
11615d9840G7655a77047a5017H4392a42111A32116g7613j65024C9415P5180a9348
11603D48523c0278j33352a0250k15476E8139f5861H5235A7391N1066a17057A35257
11591A46433m7610j9990a61936A14985a40371C72143I8601K3487L14887E006b27082
11579G5475j9001k7064L175O2983c24075A15064K9533n3569K60780a32541m1989
11568a74530A26810J02509M6783g7596A94470b44184A50256h5950A52324e2594
11557A42240a11731A78850G8335J32556A4460c6583B94858j03576K16737H5717
$$ plain form
11637 45059 -72267 -300556 -391855 43181 43665 -154347 95454 38212 147332 -176801 -98154
11626 -98154 425016 -28100 2359 174918 244326 373737 -176903 -35575 153267 -75177 -49840
11615 -49840 77655 -177047 -15017 84392 -142111 132116 -77613 -242637 39415 114595 -19348
11603 448523 -30278 -163630 -10250 -225726 58139 -65861 85235 17391 68457 -117057 135257
11591 146433 98823 78833 -161936 114985 -140371 372143 98601 122088 436975 5006 -227082
11579 75475 56474 29410 32585 95568 -324075 115064 144597 91028 351808 -132541 -174530
11568 -174530 126810 229319 276102 -77596 194470 -244184 150256 -85950 152324 -52594
11557 142240 -111731 178850 78335 210891 14460 -36583 294858 191282 408019 85717
11546A74368k4582b14079B48459I6272J00346O953B8638K96835E0113k015b79950
11534B34229a61821c820l9077m8326H7730h844C92979e5306H8523J49168g4434
11522A61904L9038o0218a9206B149L81570g320H8824K1152K034J01624a30907
11510A84938F8693A3055K2203K00737g2699A54661j8102e8044J2178D7938J46106
11499A94044l0557l2425K4840p1876J57475a05275D5177b39185C16414e0284B17350
11487C46442A45502i199A05631M9032l6970q305k3019A0112K58658J07094I7279
11475A13307J63849j20789a70676A59973j8526L19608d9637B92400E5690J18791
11465A74481J2491h9576j13F2785J2677m489K20226c8214A58490O0865f6652d680
$$ plain form
11546 174368 149786 -214079 248459 96272 196618 203571 28638 325473 50113 48098 -279950
11534 234229 -161821 -3820 -42897 -91223 87730 -8844 392979 -55306 88523 237691 -74434
11522 161904 200942 140724 -19206 2149 383719 -7320 88824 109976 112010 213634 -130907
11510 184938 68693 13055 35258 235995 -72699 154661 136559 -58044 -45866 47938 194044
11499 194044 163487 131062 155902 84026 241501 -105275 45177 -239185 316414 -50284 217350
11487 346442 145502 -9199 105631 154663 117693 109388 86369 10112 268770 375864 97279
11475 113307 277156 156367 -170676 159973 141447 461055 -49637 292400 55690 174481
11465 174481 186972 -89576 -89689 62785 75462 70973 291199 -38214 158490 219355 -66652 -4680
11452C779N518d620k5032D4768L1110a34084H0379B031c66589C15538c3087C4861
11439A13817K03024b03918B02247A5456K1286K61042A5130J16661a2427j70148
11429a82575o97C36233g7713m7207B26669k875e2209k0024m17358a46197O7667
11418g8530B3746i9705K2948C34701c16288Q2228J741A86816g086k03232B21478
11406a07750B99378b25543e2633G5792c04005B19020J9649a84673B29500f2354
11395h168B55458J03722A18765a44510A14782k8818a86041a1898N857j23625p0089
11384a99755r0701l7655g810k01858A31088J4846f8155K8595B42777D6881J91581
11373B38462b7595A62474M2314l8691f3499p4983D4722f8163l4861B499b39931
$$ plain form
11452 3779 9297 -4620 -29652 44768 75878 -134084 80379 2031 -366589 315538 -33087 34861
11439 113817 316841 -203918 202247 15456 36742 297784 15130 131791 -12427 -182575
11429 -182575 -183272 336233 -77713 -124920 226669 223794 -52209 -72233 -489591 -146197 -78530
11418 -78530 23746 -99705 -76757 334701 -316288 -234060 -232319 186816 -7086 -210318 221478
11406 -107750 299378 -225543 -52633 75792 -304005 219020 238669 -184673 229500 -62354
11395 -8168 255458 359180 118765 -144510 114782 85964 -186041 -11898 -6041 -129666 -199755
11384 -199755 -290456 -328111 -7810 -209668 131088 145934 -68155 -39560 242777 46881 238462
11373 238462 -27595 162474 204788 166097 -63499 -138482 44722 -68163 -103024 2499 -239931
11361d942I3693a31256k7000d7530N726J0176A89393n8536J33289A15038E5632
11349A99073b42092A33589g103A8630L4439J37456C5536c8141B38063D5579A9772
11337b6612l6129A39346K0248b08081d2587j6212k6045A00257b22204k26446E2756
11325d21046A82194A0119L15390A20328a18495j76542d7606j27135o5313A87075
11314a0730j75137E5852J80854b3535A14886M8981R6431I1268d34926a4196m19426
11303d33622B1001M277J64397d5731H7493c86487i0025I7914a26906A3361a00833
11291A42446E379i838m82886a2458j18303B8257b30755k74486h7422j48778E6614
11279b14852a8865H5965J66385a80142C10805A54358b0779j23333l925A92117
$$ plain form
11361 -4942 93693 -131256 -158256 -47530 -41804 -31628 189393 130857 264146 115038 55632
11349 199073 -242092 133589 -7103 18630 53069 190525 35536 -38141 238063 45579 19772
11337 -26612 -62741 139346 159594 -208081 -42587 -58799 -84844 100257 -222204 -448650 52756
11325 -421046 182194 10119 325509 120328 -118495 -295037 -47606 -174741 -240054 187075
11314 -10730 -185867 55852 236706 -23535 114886 163867 260298 91268 -434926 -14196 -433622
11303 -433622 21001 25278 189675 -45731 87493 -386487 -90025 97914 -126906 13361 -100833
11291 142446 5379 -9838 -492724 -12458 -130761 28257 -230755 -505241 -87422 -236200 56614
11279 -214852 -18865 85965 252350 -180142 310805 154358 -20779 -144112 -148037 192117
11268B07150a09127B8287a8913A22383a00901D5172Q1652b06248B5020M79204
11258E04224c6525q8971C11128n5267A6397a46843P2908B1948L550a27005d1030
11246a3744q7353j4495A19283b37141E12586D3849a01823A1357a25816L5662B0337
11234A31861K53839h5967j8676j5035m4212F2701J39450a7502B93896J94655A82247
11222b56872O598a25109q8831E607a4153A42045a07909C0213i4960j0575j61463
11211b66998m0649A19363c3816B33316F2890K94498b8699H2208M9336a18164a0326
11199b570A78749K95742a88210F234a27964C92411j55787a04567r0108g1047C5856
11187A9994a06536j57368j7407J30994e626p4130j62422q6615A60680M3623I134
$$ plain form
11268 207150 -109127 28287 -18913 122383 -100901 45172 126824 -206248 25020 504224
11258 504224 -36525 -125496 311128 255861 16397 -146843 -73935 21948 25498 -127005 -41030
11246 -13744 -101097 -115592 119283 -237141 512586 43849 -101823 11357 -125816 -90154 20337
11234 131861 385700 -85967 -104643 -119678 -163890 62701 202151 -17502 293896 488551 182247
11222 -256872 -250274 -125109 -213940 5607 -14153 142045 -107909 30213 -94960 -105535 -266998
11211 -266998 -307647 119363 -33816 233316 62890 357388 -28699 82208 131544 -118164 -10326
11199 -2570 178749 474491 -188210 6234 -127964 392411 236624 -104567 -194675 -71047 35856
11187 19994 -106536 -263904 -281311 -150317 -5626 -79756 -242178 -328793 160680 204303 9134
11175I55g1518j46782f7703l61943a72988I3658a6222j97995C94257d783F4705
11163A208i4599j42237B30616i1136H2338c0301j84444D5502J55448e75802d0333
11151b66938a10004Q238k1306A3620f2501A49287b6245k22899E3694a63650e6557
11139c0322D83254a6335B01144H137K33926p3379B6744a78195A81717m9033b87489
11127B57588r7839e7733J7956l6744B23081r0227E7677b94987B05804b4971A18392
11115B204K94903i4559D3963a54838J0866A56786n8083C5914b9205A87087c1166
11103D8601L3390qc4917D32822C5214K54304F9974J27468a23647O0844C8416M17234
11091D55650I1374M3743F5021J18400n0286M4473a1712A44626r491b55484D27847
$$ plain form
11175 955 -71518 -218300 -67703 -429646 -172988 93658 -16222 -214217 394257 -4783 64705
11163 1208 -94599 -236836 230616 -91136 82338 -30301 -214745 45502 200950 -575802 -40333
11151 -266938 -110004 -101766 -123072 13620 -62501 149287 -26245 -249144 53694 -163650 -56557
11139 -30322 483254 -16335 201144 8137 242063 168684 26744 -178195 181717 132684 -287489
11127 257588 159749 -57733 -39777 -76521 223081 132854 57677 -294987 205804 -24971 118392
11115 2204 297107 -94559 43963 -154838 -143972 156786 98703 35914 -29205 187087 -31166
11103 48601 81991 81983 -34917 432822 35214 289518 69974 197442 -123647 -62803 38416 455650
11091 455650 91374 135117 65021 183421 133135 177608 -11712 144626 135135 -255484 427847
11079e6405A32098L34144A05403M11099F7199J23400J56424p3949n5300J09503
11069C27277c0711A31945J40813J42863B05461L92891k4850D1852M64146J12702
11059F18700B56499L39437j85990J03646j3689M26063C26959m3726K03735K00916
11049F87884l860j874j04873r916P1084l9444r7849K34296l5778j24666r1561
11038D83443J36303l8660R1125R4503K72424D47255J57681L3363j90885J11183
11028E58597K3267j8562P246M52745k93470O3470C60335k385J54426J41384j82751
11017D71009K756L86252A20227N07241k9604j59048j29837K01465K0211J91189
11007G21844R5597A14554J79056J94818R4469K40068l96806l8532K19285o1256
$$ plain form
11079 -56405 132098 466242 105403 516502 67199 190599 347023 273074 217774 327277
11069 327277 -30711 131945 272758 415621 205461 598352 573502 41852 505998 618700
11059 618700 256499 595936 409946 513592 499903 925966 326959 283233 486968 687884
11049 687884 684024 682150 577277 567361 638445 599001 501152 735448 699670 575004 483443
11038 483443 619746 581086 672211 766714 1039138 447255 604936 638299 447414 558597
11028 558597 581864 563302 570548 1023293 729823 793293 360335 357950 512376 653760 471009
11017 471009 473765 860017 120227 627468 597864 438816 308979 510444 530655 721844
11007 721844 817441 114554 293610 488428 582897 822965 426159 387627 606912 545656
10997E45656A64542O51686k21916K15603l23620q8475K68596j18584B50972O84034
10987I35006j69977K13555Q0320D44596J34769L95330m1656k28450L77428J31486
10977A213503p4723O06679L11866J6447q6581N33937l72423K29193r0997q5570
10967B201331k28519k72015k10843j16910N8278J49229O9445L22283k75193J54476
10957A851562j56684J02648n65468K54320l05399l36785Q7298k2641l97890K40874
10947G51835B91705K11432C6535J34698m9226K93187M1528A02975N4208f8502
10936B70668G5775J49022E2250L7719f3313B66243j02917J36001a13421A64100
10925a64028B36145b22206k7305n664b5661b91B81314j30042C8593b7C67300b53545
$$ plain form
10997 545656 164542 816228 594312 809915 486295 397820 666416 547832 250972 935006
10987 935006 765029 978584 1058904 444596 579365 974695 933039 704589 1082017 1213503
10977 1213503 1138780 1745459 2057325 2073772 1987191 2521128 2148705 2377898 2286901 2201331
10967 2201331 1972812 1700797 1489954 1373044 1431322 1580551 1649996 1972279 1697086 1851562
10957 1851562 1694878 1797526 1232058 1486378 1180979 844194 931492 908851 510961 751835
10947 751835 291705 503137 36535 171233 122007 415194 456722 102975 157183 -68502
10936 270668 75775 224797 52250 89969 -63313 266243 163326 299327 -113421 164100
10925 -164028 236145 -222206 -249511 -255175 -25661 -291 281314 151272 38593 -27 367300 -253545
10912a84440i279A32652E0352A7725K26974a13742I3981l6585e6132A3443a46542
10900a39465H5609B1375J50124A8774a02303H0022m335k7955O0151K23164G9523
10888A37014j4017a98978h3319A85271n8778b06523H9474g4569A56103a9992j49549
10877a69541A11512B9770a69441H424c05619g3091a0777p958j25620A74298k4059
10866A50239l8076l2428a37861C92322j62510b80760a23495m9746A47157l7837
10856A09320a78325L9517C8878J71876J00044q5754r2820c70114B27157b04389
10845F9407a97495L5352H5049f6148B43101o8173A1998d5346A61624C6080J83525
10834B19605l8985d0936A35884b21966R3555p1310g6468A51561J8333j3214E1588
$$ plain form
10912 -184440 -9279 132652 50352 17725 244699 -113742 93981 57396 -56132 13443 -146542
10900 -139465 85609 21375 171499 18774 -102303 80022 75687 47732 107883 331047 79523
10888 137014 122997 -198978 -83319 185271 126493 -206523 89474 -74569 156103 -19992 -169541
10877 -169541 111512 29770 -169441 8424 -305619 -73091 -10777 -18735 -144355 174298 150239
10866 150239 112163 79735 -137861 392322 229812 -280760 -123495 -173241 147157 109320
10856 109320 -178325 -138808 38878 210754 310798 225044 132224 -370114 227157 -204389
10845 69407 -197495 -162143 85049 -66148 243101 174928 11998 -45346 161624 36080 219605
10834 219605 180620 -40936 135884 -221966 -128411 -199721 -76468 151561 169894 156680 51588
10822b39134b7535j60988A03448f3802F2083A5875h3397k92181J09379B64659
10811A00075a44515b4747l0971A61280p0393d03109a85404q487A9041L8211a50639
10799b67127A1719K34629i0108L6587j94136m9192J21093K5203K2259B01745K59503
10788D61248b6547G4192K03791j29914b46055I3801a03447j64989f6669q6959
10778a53628D5985J1237a74095c9829j47891A23040c291A64550a02067l1934B1384
10766a30203C7517b03897f3393D0429K61238b54862c4531A37059F0899a56247
10755a3353j78977B03276a0041l524k43717C7723G167J57463a2833j42039j65108
10744c19980J09321o0140a7295o8564j27465b3153D500J23370k4272B0374e0125
$$ plain form
10822 -239134 -27535 -188523 103448 -63802 62083 15875 -83397 -375578 -266199 264659
10811 100075 -144515 -24747 -55718 161280 90887 -403109 -185404 -193891 19041 57252 -150639
10799 -267127 11719 246348 -90108 -53521 -247657 -296849 -175756 -150553 -128294 201745 461248
10788 461248 -26547 74192 277983 148069 -246055 93801 -103447 -268436 -66669 -153628
10778 -153628 45985 57222 -174095 -39829 -187720 123040 -3291 164550 -102067 -134001 21384
10766 -130203 37517 -203897 -63393 40429 301667 -254862 -34531 137059 60899 -156247
10755 -13353 -192330 203276 -10041 -13565 -257282 37723 7167 164630 -12833 -154872 -319980
10744 -319980 -210659 -270799 -17295 -85859 -213324 -23153 4500 127870 103598 20374 -50125
10732f4012C92474A51430c15532B8109a81161m42P4772F6983m204J72625a9929
10720a935q8811J7371B45545c31110a42136A44696i3470C38615i3652m167B5574
10708a7218j90893K9947l25862G0868j5212i1553k70419B51011d9295A27823c3385
10696b56278b6707p9050e1546m2407a9490O046r8506D8222a47280D7071c65419
10684d7796m5436I0522A136f7665j23458h0113k5844o4534A82789E0271A2726
10672A4230J6132O5979g7416k02586N2938Q3624n3099j08065j73935a51261j15417
10661b66678B48262h0980l0735j70994h4661k71815b8854L508B86726a3917j36626
10650a50543j28326d4810k14651J15019I916g2130k38629h3623L616L0977B30491
$$ plain form
10732 -64012 392474 151430 -315532 28109 -181161 -181603 -106831 66983 62779 235404 -19929
10720 -1935 -90746 -73375 245545 -331110 -142136 144696 -93470 338615 -93652 -97819 25574
10708 -17218 -208111 -178164 -504026 70868 55656 -91553 -361972 251011 -49295 127823 -33385
10696 -256278 -26707 -105757 -51546 -93953 -19490 -13444 -111950 48222 -147280 47071 -365419
10684 -47796 -93232 90522 1136 -67665 -191123 -80113 -105957 -170491 182789 50271 12726
10672 14230 30362 96341 -77416 -280002 -227064 -143440 -196539 -304604 -478539 -151261 -266678
10661 -266678 248262 -80980 -111715 -282709 -84661 -356476 -28854 -25346 286726 -13917 -150543
10650 -150543 -278869 -44810 -259461 -144442 9916 -72130 -310759 -83623 -80007 -49030 230491
10638e5936G267e1785r419l39504D5226d52724J10173g9274K2454B58998f0109
10626a12972k04792a9211M386B43909f546j34355A3843a38810j67509D1975b37981
10614b11487b0144k71172g5560J1545p4754m6494O8936I8457c80136A18001a7485
10602a40521C081L78J28100a89130d5159B35422r3227D6626K76715f3824j65669
10591b29493F4035a18105l7105G6167j9413b5235m35447b12604C9254g353F4424
10579F9756J82520b0766o0043o7663D9624K54284a65123A30769c62372c5764J2268
10568b3496E7035d0333A2992a10910P133B02481f0082j94704E7128c0414f902
10556c12851H0584d0176I8602B5513J64444a01591K2937A1569f4654r3695A6157
$$ plain form
10638 -55936 7267 -51785 -61204 -400708 45226 -452724 -342551 -79274 -56820 258998 -60109
10626 -112972 -317764 -19211 -14825 243909 -6546 -140901 13843 -138810 -306319 41975 -237981
10614 -211487 -20144 -291316 -75560 -64015 -138769 -185263 -116327 98457 -380136 118001 -17485
10602 -140521 3081 3459 131559 -189130 -45159 235422 142195 46626 323341 -63824 -229493
10591 -229493 64035 -118105 -155210 76167 56754 -25235 -460682 -212604 39254 -7353 64424
10579 69756 252276 -20766 -80809 -148472 49624 303908 -165123 130769 -362372 -35764 -23496
10568 -23496 57035 -40333 12992 -110910 -103777 202481 -60082 -254786 57128 -30414 -6902
10556 -312851 80584 -40176 98602 25513 189957 -101591 -78654 11569 -64654 -158349 16157
10544A61231h3841j3939j04162B93557i8058B61433e3395r47A31736l6981a70338
10532I7443f2492j5537A19031K4145E5720a69656A64099a10476r316b6234r6634
10521a22868A4231J95867a7169k69030J13924b6570G0643b7674m5290I5214f695
10509B8052b60666a8243p1145H205J54204n8961d5957k3509b8965A11287f4064
10497a55399F6045f967k5533a4820l8023C26892a46135C6337a5042k64968m0154
10486c20164D31693F157a71302B35162p261n4531j9964P7301r9544o3566a72671
10474b5130A33073J66415a93802A27125m1719Q478N1715a5306D9378p789a75709
10462c14200a41970A74043K12586i6707A85742A7792R5164a42538k67911A01875
$$ plain form
10544 161231 -83841 -97780 -201942 293557 -98058 261433 -53395 -54342 131736 94755 -170338
10532 97443 -62492 -78029 119031 143176 55720 -169656 164099 -110476 -119792 -26234 -122868
10521 -122868 14231 210098 -17169 -286199 -172275 -26570 70643 -27674 -72964 95214 -6695
10509 28052 -260666 -18243 -89388 8205 162409 103448 -45957 -69466 -28965 111287 -64064
10497 -155399 66045 -6967 -32500 -14820 -52843 326892 -146135 36337 -15042 -280010 -320164
10486 -320164 431693 6157 -171302 235162 227901 173370 153406 230707 131163 67597 -172671
10474 -25130 133073 299488 -193802 127125 85406 93884 145599 -15306 49378 41589 -175709
10462 -314200 -141970 174043 386629 -96707 185742 17792 112956 -142538 -410449 101875
10451B9823a1518k7414H3178Q3666a01928q8066f3329j54049C71389b44499g9656
10439f689m0604k91572B14365f3819B15856a47586L1542k21948a13156M9427C6006
10427A04703J06918l6271p8883a66971j48161f8064D7051J24674b4481j77376
10417b01857L9475d6640k38108C78999a05220j51292j19720D448d8620A65322
10406d97854c5792j14186j119A84801A494c30768d6201l24183a13760j99159A66294
10394D0485e4797A29815L41739k16334E2006d1433A10541b783I4695K14976Q0085
10383C89756A81298a02776C93018A93855H2764j1839J91815I7877K98643j09259
10373B87261G0264A6489L07022g7682C61897p5006J10678J98924O7042k24204
$$ plain form
10451 29823 -11518 -38932 83178 166844 -101928 -189994 -63329 -217378 371389 -244499 -79656
10439 -6689 -47293 -338865 214365 -63819 215856 -147586 -116044 -337992 -113156 -63729 36006
10427 104703 211621 175350 96467 -166971 -315132 -68064 47051 171725 -24481 -201857
10417 -201857 -162382 -46640 -284748 378999 -105220 -256512 -376232 4448 -48620 165322
10406 -497854 -35792 -149978 -151097 184801 1494 -330768 -46201 -370384 -113760 -312919 166294
10394 40485 -54797 129815 471554 255220 52006 -41433 110541 -2783 94695 309671 389756
10383 389756 181298 -102776 393018 193855 82764 70925 262740 97877 396520 287261
10373 287261 70264 16489 323511 -77682 361897 286891 397569 596493 663535 439331
10363D39331j56989q2148p1303Q4090j1858O5806m0477J34288j06909o4406o6977
10352A22448L03041Q9597j73071l6293c0284H5666K26016m3114A14446K46514
10342C60960A24439k1281b0212A37775L88183a0491B0243c07425A94810i149H4222
10330B86656E2275Q5724E4577M02639a15446B31442I1370n000K9238O0426d5020
10318i1939j15454c4319G1750l3781K73893a7831j03571j15541c0247k0975C47055
10306G154b5108C57060A4339b06698G1456a30008j06687A83520A4986a8564A95422
10294c34198C0838a699k44729L5634A10107b78704J24072f3834A91935D6537f8464
10282a23050H9865g0217A41187N4248g1467p0301i874m1619A43163n1077a07405
$$ plain form
10363 439331 282342 200194 128891 212981 201123 266929 226452 360740 253831 189425 122448
10352 122448 425489 515086 342015 305722 -30284 85666 311682 268568 114446 360960
10342 360960 124439 103158 -20212 137775 525958 -10491 20243 -307425 194810 -9149 84222
10330 286656 52275 137999 54577 457216 -115446 231442 91370 86370 115608 176034 -45020
10318 -91939 -207393 -34319 71750 37969 311862 -17831 -121402 -236943 -30247 -51222 347055
10306 7154 -25108 357060 14339 -206698 71456 -130008 -236695 183520 14986 -18564 195422
10294 -334198 30838 -1699 -246428 -210794 110107 -278704 -154632 -63834 191935 46537 -68464
10282 -123050 89865 -70217 141187 195435 -71467 -141768 -9874 -51493 143163 92086 -107405
10270e5698m1613A30097a83846g4C34511F5891J91217A15244J79473D3323K67972
10259C11295B5990K58451o6758K21668G3712N2103c0753j58690B02063L64781
10249E66844f0453a8041I6598N1429c51440j19028h5948A30308J41694A4574J22970
10238A37544F4444e6121k5360c1446A06963J9634h6947E7580c2807E868J98277
10227B04145d6825A82615C567b44374H0611B9093b24498L2461g9655p3183P152
10216a45686D2653d5240C51757C0552a01608B3436b43895R5212b9974B23092a30468
10204A41736J28656c8728r1457b1597A03623N5272E3907h4851j03219c7495j85468
10193b22963j15967j19386b21767A4855b57981e1297B6423a76795j62022b5391
$$ plain form
10270 -55698 -97311 130097 -183846 -74 334511 65891 257108 115244 294717 43323 311295
10259 311295 25990 284441 217683 439351 73712 125815 -30753 -189443 202063 566844
10249 566844 -60453 -18041 96598 148027 -351440 -470468 -85948 130308 272002 14574 137544
10238 137544 64444 -56121 -81481 -31446 106963 126597 -86947 57580 -32807 5868 204145
10227 204145 -46825 182615 3567 -244374 80611 29093 -224498 -192037 -79655 -152838 -145686
10216 -145686 42653 -45240 351757 30552 -101608 23436 -243895 -148683 -29974 223092 -130468
10204 141736 270392 -38728 -130185 -21597 103623 158895 53907 -84851 -188070 -37495 -222963
10193 -222963 -338930 -458316 -221767 14855 -257981 -51297 26423 -176795 -338817 -25391
10182H1659D0561a81156g1708k9374B9215b9033C88279g1253l35890g7236k55875
10171c33111B4470d489A78266d5265F3761a36324N352p4235G507c30691a14312
10159I5251J29567C5188J21813B814K38594q1609C5683a97647j369F7185e03865
10147E6500a18437k69568a48560C5092M2883b8475B17312D3452e6552j68335B25625
10135e4186g717B3550J2631a87576M9440B89781a00239j02649j82153a73956k34436
10124d08392B59765b25372M6328E4413b19711A1918b38373g4716l9045m2897E2189
10112d4018B6918c6889q0404C73329I7779J09712c98244a17386p4386I9940m3014
10101E6926g472A29218c40667A08337D6542g5388A08392J60270i7931A56036b59153
$$ plain form
10182 81659 40561 -181156 -71708 -101082 29215 -29033 388279 -71253 -407143 -77236 -333111
10171 -333111 24470 -4489 178266 -45265 63761 -136324 -130972 -205207 7507 -330691 -114312
10159 95251 224818 35188 157001 2814 241408 159799 35683 -197647 -199016 67185 -503865
10147 56500 -118437 -388005 -148560 35092 77975 -28475 217312 43452 -56552 -224887 225625
10135 -54186 -7717 23550 36181 -187576 -138136 289781 -100239 -202888 -385041 -173956 -408392
10124 -408392 259765 -225372 -179044 54413 -219711 11918 -238373 -74716 -113761 -156658 52189
10112 -44018 26918 -36889 -117293 373329 97779 207491 -398244 -117386 -191772 99940 56926
10101 56926 -7472 129218 -340667 108337 46542 -75388 108392 268662 -97931 156036 -259153
10089G5046J10364c3261A16715K83178j20075J3378J91170A15357b470C02986
10078a52468O4704m6987E133a24651l06823j8576i8740k60982a40872m1885B579
10066I2733l6960c06312C4231d6613k40310B04697h0859b002q6493A61484d9461
10054I9922i3247c1985m3815j45132B19651a90601j02189D7262b47704A4827a53018
10042g844j34017c9120m75696a54081G579a86526d7191C2934b72944l873b5037
10030c00554A87315c2279k29396H0368a59252L9579A95843o330J09577b3699m6499
10019g0198l1058b5991A6195c26655B67128e44698a34265k55191L8351A80533
10008b09364P6285C59319H728J13296b50808D70018A49980a09170a1409k22767
$$ plain form
10089 75046 185410 -33261 116715 399893 279818 293196 484366 115357 -2470 302986
10078 -152468 -87764 -134751 5133 -124651 -431474 -450050 -98740 -359722 -140872 -182757 2579
10066 92733 55773 -306312 34231 -46613 -286923 204697 -80859 -2002 -88495 161484 -49461
10054 99922 -93247 -31985 -75800 -220932 219651 -190601 -292790 47262 -247704 14827 -153018
10042 -7844 -141861 -39120 -514816 -154081 7579 -186526 -47191 32934 -272944 -276817 -25037
10030 -300554 187315 -32279 -261675 80368 -159252 -119673 195843 189513 299090 -23699 -70198
10019 -70198 -101256 -25991 16195 -326655 267128 -544698 -134265 -389456 -351105 180533
10008 -209364 -133079 359319 8728 122024 -250808 470018 149980 -109170 -11409 -234176
9998b34176L6818c7093A0441c17799a38834A04771J02761a5829j24861J0537A791
9986b03607E5466a31367j17527a24256k91667e1685D1622e4621k6423k74132f9370
9974F1306N9837k9781e4812B821K47015b30603d5263q7741n185j72027A40424
9962D1837r187b43889J05700c2420A67423o9437G632J38720F4405K8932B0298
9950A75932f6307k2305B13483E613J99262h874A22011b21871a6040j29015q2779
9939b27834F5175B2080J61714c0629k06014J06974o7513B2014b97146B13756A2831
9927B36320a47099o2297e152p6468J8626j37999e9345k65599i6776l47993C07534
9915e11866H3104b14000B3514b41539L1193F7014j1962b4230A76422o3020d20406
$$ plain form
9998 -234176 -197358 -37093 10441 -317799 -138834 104771 207532 -15829 -140690 -130153 1791
9986 -203607 55466 -131367 -248894 -124256 -415923 -51685 41622 -54621 -81044 -355176 -69370
9974 61306 121143 91362 -54812 2821 249836 -230603 -45263 -133004 -138189 -310216 140424
9962 41837 32650 -243889 -138189 -32420 167423 97986 7632 146352 64405 93337 20298
9950 175932 -66307 -88612 213483 5613 204875 -8874 122011 -221871 -16040 -145055 -227834
9939 -227834 65175 22080 183794 -30629 -236643 -129669 -197182 22014 -297146 213756 12831
9927 236320 -147099 -209396 -5152 -81620 -62994 -200993 -59345 -324944 -96776 -444769 307534
9915 -511866 83104 -214000 23514 -241539 -210346 67014 55052 -24230 176422 113402 -420406
9903C9735N4258G584b09706E0599a4797n1224b7596j21201c6946G6276K30325
9892C06601a59030f5426k18449Q7525R6790j29046J04312k31609A25813b20970
9881B13688a80941N0751q9170j5844a02276B05855a38575f8982j91148f152l37590
9870c43742A0588a99476A79672j3363a61441p8115A5063L777a50102j32156d3371
9858D3024L9288a93978m8015D9991d1855C917K296c1719k12092E860K91334F211
9845a15450q9124m1974A68965b76592M3297B51373A22319b98286A68589C7831
9834A73056a32451j06227b5676k46610F5173d08306B19967E3866d01567r9884
9824e01451G5406f0989J0147k92131i0531j44284A40550f4371C55148A66088f6141
$$ plain form
9903 39735 93993 7584 -209706 50599 -14797 -66021 -27596 -148797 -36946 76276 306601
9892 306601 -159030 -65426 -283875 -196350 -99560 -228606 -124294 -355903 125813 -220970
9881 213688 -180941 -130190 -219360 -235204 -102276 205855 -138575 -68982 -260130 -6152 -343742
9870 -343742 10588 -199476 179672 166309 -161441 -239556 15063 18840 -150102 -282258 -43371
9858 43024 82312 -193978 -241993 49991 -41855 3917 6213 -31719 -243811 5860 297194 6211
9845 -115450 -204574 -246548 168965 -276592 -233295 251373 122319 -298286 168589 37831
9834 173056 -132451 -238678 -25676 -272286 65173 -408306 219967 53866 -401567 -501451
9824 -501451 75406 -60989 -50842 -342973 -90531 -234815 140550 -64371 355148 166088 -66141
9812a88916g8400J5731l5839F0374a35411B46094h5489c8702j73981e8765n3733
9801a12498n3319k90326G0650a17897o5334j18485m8867R6036h587j75066g7985
9789e080q778A69642b06492m4356K4922Q4875j89895A02805J27115b79266i7519
9777A1771J8690c76218E5938d48154a13873G4571K8439j0292e6198i938o8178
9766g8116O014j37734c1329j99618C58874c34365D745J84912c58829J78738h6671
9754F2708A6355J89616a61435N7670j03434B22718A7696a53439m2568M3346A9153
9742d12743J05578D8318b5058G2660i5022A59449a3089l39895N4023P6868R2938
9731a29155N0078n7974D2347b10090j1693F6571b55865c1404I8427c47737b4278
$$ plain form
9812 -188916 -78400 -62669 -98508 60374 -135411 246094 -85489 -38702 -212683 -58765 -112498
9801 -112498 -165817 -456143 70650 -117897 -183231 -301716 -350583 -254547 -8587 -183653 -77985
9789 -5080 -13858 169642 -206492 -250848 -225926 -141051 -330946 102805 229920 -279266 -97519
9777 11771 30461 -376218 55938 -448154 -113873 74571 103010 92718 -56198 -9938 -78116
9766 -78116 -72102 -209836 -31329 -230947 358874 -334365 4745 189657 -358829 -180091 -86671
9754 62708 16355 205971 -161435 -103765 -207199 222718 17696 -153439 -196007 -152661 19153
9742 -412743 -307165 48318 -25058 72660 -95022 159449 -13089 -352984 -298961 -222093 -129155
9731 -129155 -79077 -137051 42347 -210090 -221783 66571 -255865 -31404 98427 -347737 -24278
9719A26310l4158F54K03292a11810o8877j64530R4225J16898D4338b13640Q9363
9708a24277F4083G866f4708j51491g7482C90246b29526B82300N6133A7848c46447
9696g8675j34917P3530n7960Q1236L2098A6731a09031j18841D3410N6370b13861
9684B63265a46144B25327b64326A62502c12734e5055q7592L9360K071A565J5511
9673A7076N2257A6822P2425a14069b8345k26411M1318a1869A31044a92392D7950
9661b14581J8117R5213i648B12519c9513j56313M3676L5720K170A35918D6113
9649A23030A9136a07016M2500l5001A14558B1598J53015H0410l8304d8242j97405
9638b45647a08769a2639B24487D298a24508B46924c3716n9068A64373a95425m4033
$$ plain form
9719 126310 92152 654 203946 -111810 -180687 -345217 -250992 -134094 44338 -213640 -124277
9708 -124277 64083 7866 -64708 -216199 -77482 390246 -229526 282300 338433 17848 -346447
9696 -78675 -213592 -140062 -198022 -116786 -84688 16731 -109031 -227872 43410 99780 -213861
9684 263265 -146144 225327 -264326 162502 -312734 -55055 -142647 -103287 -101216 1565 17076
9673 17076 69333 16822 89247 -114069 -28345 -254756 -213438 -11869 131044 -192392 47950
9661 -214581 -196464 -101251 -9648 212519 -39513 -195826 -152150 -116430 -114260 135918 46113
9649 123030 19136 -107016 -64516 -99517 114558 21598 174613 80410 42106 -48242 -245647
9638 -245647 -108769 -12639 224487 4298 -124508 246924 -33716 -92784 164373 -195425 -239458
9627b39458a00771A38459i9589j53005O0882g5173j26933J8975P5858A2094a34280
9615b97455P1258P1053d0546r9995B9287i9381G4256b89552a15353A93653q35
9604A92818a01699p5111A2211e311B95181a28806H0111l8822b02402B54506d4325
9592a81214d7232j45577q4972A35590a28156C32724b10260r806j53655B45993
9581c14178R4552o7898a34351B50500C5671h9571a2404I5892c72288h5334a7975
9569d5740k12214a3710k41835R8997B09203b1280r8352n9089b7279I7074C7571
9557B76285a36676f1759k71181a2392F320b39305A11958a58327p5114B78033d38045
9545b26081k9740e8912J5869j57669Q4219e752A95565a10669I5641O4759d7783
$$ plain form
9627 -239458 -100771 138459 -99589 -252594 -191712 -75173 -202106 -183131 -107273 12094 -134280
9615 -297455 -226197 -155144 -40546 -140541 29287 -99381 74256 -289552 -115353 193653 192818
9604 192818 -101699 -176810 12211 -5311 295181 -128806 80111 41289 -202402 254506 -44325
9592 -181214 -47232 -192809 -277781 135590 -128156 332724 -210260 -220066 -373721 245993
9581 -314178 -219626 -287524 -134351 250500 35671 -89571 -12404 95892 -372288 -85334 -17975
9569 -45740 -257954 -13710 -255545 -156548 209203 -21280 -119632 -178721 -27279 97074 37571
9557 276285 -136676 -61759 -332940 -12392 6320 -239305 111958 -158327 -233441 278033 -438045
9545 -226081 -255821 -58912 -43043 -200712 -116493 -5752 195565 -110669 95641 160400 -47783
9533f1813l06701a62853e700k31232I9165d93224a33538A19284b1048r8460k14491
9522c33999a33486G9872c61303J72706B91604a6494m0854A5863e5777A45923a42655
9510A32361A5786Q7285n1429J37343a77707h7676C51898b91818f4569D41683A9175
9498a24174n6773C76667d0271l7449C0004b92093A13662b76185A08362B3662J9916
9487D3578d43250e5516A53455f6505j49439H2256a44386A60783k7891a41228k05801
9476c47029E8685c63004J23103B07979a39273f891A68559b55178D05817a63600
9465A98978r7916a28966K7577b3164H3474P4822b49814d9200k36252D8432c2098
9453c36057J38878k977C35002b47863A25039k5755c54728H3940C3577a01665l6508
$$ plain form
9533 -61813 -368514 -162853 -5700 -236932 99165 -493224 -133538 119284 -21048 -119508 -333999
9522 -333999 -133486 79872 -361303 -188597 291604 -16494 -57348 15863 -55777 145923 -142655
9510 132361 15786 103071 51642 188985 -177707 -87676 351898 -291818 -64569 441683 19175
9498 -124174 -180947 376667 -40271 -77720 30004 -292093 113662 -276185 108362 23662 43578
9487 43578 -443250 -55516 153455 -66505 -215944 82256 -144386 160783 132892 -141228 -347029
9476 -347029 58685 -363004 -239901 207979 -139273 -6891 168559 -255178 405817 -163600
9465 198978 101062 -128966 -101389 -23164 83474 158296 -249814 -49200 -285452 48432 -32098
9453 -336057 -197179 -200156 335002 -247863 125039 99284 -354728 83940 33577 -101665 -138173
9442a38173K0727M9686a5125j21157B42068a90344R1855j94751a38879A093a66629
9430F8036b8818m06542A20337c13493I7439Q2743k0352F6240l0942a13211A55025
9418a15495F2406d00740N5952C73388E3740d3473k15034a17951a759k1948C08741
9406C03461a18091j97117E7388a4323n8199H4871A4147K27220E8938c13818A76838
9394h5318A55059h308j36335A43308r254a7553k35581f3638C69469C3027b4173
9382G6335a84919C45673d43314h5603l26963a25426J103k59778f6020o7356l74856
9371e08232A5275J45892c76069J64489N0538j16358D0771g4783k65486J57867
9361a82402c5429F8286a08923C35604j14271I9458f8114g111n3128f585A5469
$$ plain form
9442 -138173 -117446 -67760 -15125 -136282 242068 -190344 -98489 -293240 -138879 1093 -166629
9430 68036 -28818 -435360 120337 -313493 97439 180182 159830 66240 35298 -113211 155025
9418 -115495 62406 -400740 -344788 373388 53740 -43473 -258507 -117951 -1759 -23707 308741
9406 303461 -118091 -315208 57388 -14323 -72522 84871 14147 241367 58938 -313818 176838
9394 -85318 155059 -8308 -144643 143308 134054 -17553 -253134 -63638 369469 33027 -24173
9382 76335 -184919 345673 -443314 -85603 -412566 -125426 -124323 -384101 -66020 -133376 -508232
9371 -508232 15275 161167 -376069 -211580 -161042 -277400 40771 -74783 -340269 -182402
9361 -182402 -35429 68286 -108923 335604 221333 99458 -68114 -7111 -60239 -6585 15469
9349h3866k37379D9039m282M4503b12335m6141b0533j89041A43432E8714R6752
9338A55466a26159N4756A60305b38428m1204f8405C4271e6483D7349J31996a74090
9326b09455B4955P4730C738b29994p0888k48930a77483B5229J9026f3069r949
9315g3018l33686p6373K3020B47550D4757b97609a28631a4288c198A96990c56790
9303a23180I5751a762D1898C063i9003K3684K7482D1496f2835Q37q2916j140j91288
9290c37342a21967A38934N6854b36320M421K7004B87628C1959a10341l6213g2584
9278A57166a48083k42445A35207i0483l9746b0091l8845A21323n3827J55688P9968
9267C03152d36770D39372B11453i7750K1205A01117c39732a25539b2015m7951
$$ plain form
9349 -83866 -321245 49039 44757 89260 -212335 -258476 -20533 -209574 143432 58714 155466
9338 155466 -126159 -71403 160305 -238428 -279632 -68405 34271 -56483 47349 179345 -174090
9326 -209455 24955 99685 3738 -229994 -300882 -549812 -177483 25229 44255 -63069 -73018
9315 -73018 -406704 -483077 -460057 247550 44757 -297609 -128631 -14288 -3198 196990 -356790
9303 -123180 95751 -1762 41898 3063 -99003 -75319 -47837 41496 -62835 -61998 -144914 -146054 -337342
9290 -337342 -121967 138934 195788 -236320 -231899 -204895 287628 31959 -110341 -146554 -72584
9278 157166 -148083 -390528 135207 -90483 -130229 -20091 -58936 121323 67496 223184 303152
9267 303152 -436770 439372 211453 -97750 -76545 101117 -339732 -125539 -22015 -69966
9257f9966B31610b99839f7127q3171M4996M8281A3273b38875f6166o6036k34740
9246c66942J51374B46424e1102B23144B1594g4248O641r9336k8116O9167m1351
9235a67243J5346j31465G0073P9451b20048a04423C09871b95719A64499g2082
9224c28942C4316H143J03644a0922k99983B06169F6743c19763A06327c9270A80616
9212c9537A07380P097J08486d8775j8731k47343B303i841k09275B8243c26592
9200b32756q7675a21413i708l52505f4202k3231C10218a72974b232l51063J38399
9189b14896P647d6537r8280C3936a5388k956j47279a4130B38523b60119e0389
9177A14023B0691a63493B2291a50366C7050d8163l54648a89464D8721c4703A85939
$$ plain form
9257 -69966 231610 -299839 -67127 -150298 -105302 -57021 13273 -238875 -66166 -132202 -366942
9246 -366942 -215568 246424 -51102 223144 21594 -74248 -67607 -166943 -195059 -125892 -167243
9235 -167243 -151897 -283362 70073 149524 -220048 -104423 309871 -295719 164499 -72082
9224 -328942 34316 8143 111787 -10922 -310905 206169 66743 -319763 106327 -39270 180616
9212 -39537 107380 114477 222963 -48775 -67506 -314849 2303 -9841 -219116 28243 -326592
9200 -232756 -320431 -121413 -9708 -362213 -64202 -87433 310218 -172974 -2232 -353295 -214896
9189 -214896 -207249 -46537 -144817 33936 -15388 -18344 -165623 -14130 238523 -260119 -50389
9177 114023 20691 -163493 22291 -150366 37050 -48163 -402811 -189464 48721 -34703 185939
9165a02961A88348b1245k12196A53913A6266a29612M9212L7495C18246a25051
9154h5032A04203b44035j57466a11339K1317a7192k28664l6665a25474l6299j57415
9143c19188a03875J7476D56386g405J803m0229r3618k51727B24675j11522a71345
9131B4679J71624q3852b01781C6645f8486l33141J49021C18216l6446a58406b7936
9119c3628L861K247F8885d03964a69938L5191N463J2897p198b1231m4780D2699
9106g4019H8700J71222G8066c44597a9857I0475i6568A184J7205b9454A78136
9094b4357C97174i8798n8385j12440j86672C0715b4533A50126P8839g0989j8981
9083h9970J2770B6049a98637E3295i026I7677j1972k4602a48602B25K21527J00387
$$ plain form
9165 -102961 188348 -21245 -233441 153913 16266 -129612 -80400 -42905 318246 -125051
9154 -85032 104203 -244035 -401501 -111339 -90022 -17192 -245856 -282521 -125474 -161773 -319188
9143 -319188 -103875 -86399 456386 -7405 -5602 -45831 -139449 -391176 224675 113153 -171345
9131 24679 196303 112451 -201781 36645 -68486 -401627 -252606 318216 281770 -158406 -27936
9119 -33628 -29767 -27520 68885 -403964 -169938 -134747 -129284 -116387 -123585 -21231 -66011 42699
9106 -74019 88700 259922 78066 -344597 -19857 90475 -96568 1184 18389 -29454 178136
9094 -24357 397174 -98798 -157183 -269623 -456295 30715 -24533 150126 228965 -70989 -89970
9083 -89970 -77200 26049 -198637 53295 -9026 97677 85705 61103 -148602 225 221752 322139
9071C22139A2609d6063C9771b69319G9036b21458A73463e2636j75111a9247j02329
9060a21576A21593a32042Q733A91276f3074J5989A56265a36021A04093c35053
9049d8253A84176c68209A64831b5531E2904a34082A14078a86882a3879r0703H9767
9037b91984N3414E8622j9084a55594O2829b2926A81791g2068l48457J24124F4544
9025d1733A28812e2184j8534L3654j25385j14301e1387A81359a65527N8684b2550
9013a9693j70671M6010k55637h0494d104F7716P1189a36360A59727j8975l2761
9002A07991b67436Q5484A47490c98656F2188L47643b01311h1623l27447d5454
8991e4794A3085h4174j26537f005B41845G657a4866m4955r4716l0215l4541A83710
$$ plain form
9071 322139 12609 -46063 39771 -269319 79036 -221458 173463 -52636 -227747 -19247 -121576
9060 -121576 121593 -132042 -123309 191276 -63074 -47085 156265 -136021 104093 -335053
9049 -48253 184176 -368209 164831 -25531 52904 -134082 114078 -186882 -13879 -104582 89767
9037 -291984 -238570 58622 39538 -155594 -92765 -22926 181791 -72068 -420525 -296401 64544
9025 -41733 128812 -52184 -70718 -37064 -162449 -276750 -51387 181359 -165527 -106843 -22550
9013 -19693 -190364 -144354 -399991 -80494 -4104 67716 138905 -136360 159727 140752 107991
9002 107991 -267436 -181952 147490 -398656 62188 409831 -201311 -81623 -409070 -45454
8991 -54794 13085 -84174 -210711 -6005 241845 7657 -14866 -59821 -154537 -184752 -219293 183710
8978a77549c9696A82769o3417a2615l179m9331j18955H1698b42014D1914c2790
8966c21848i1365a3755A55850f8364k7702L952F162P7444n334d64644a05267l97095
8954e02362B18078a90559A89540Q2222b23673j10216h660j46009n529c4545b437
8942b03396c2920B63755a47962d2425C8337e5371A68564E5145J0216K04051H1736
8930A88729b50576I6031d4190C01631J14531p9226K64251K644352Q039499J091953
8920A2376991C117121H62462Q927B01934L4805D2593i5876J8481E7641K73284
8910C30925F7697O5810J61726n1578D9210a84762a8615j79741a2047j49230c1317
8898B29881b29895a11493E91099H5898l5543C881d2410B65032f2881k1906b8818
$$ plain form
8978 -177549 -39696 182769 119352 -12615 -15794 -65125 -184080 81698 -242014 41914 -32790
8966 -321848 -91365 -13755 155850 -68364 -96066 -92114 6162 83606 78272 -464644 -105267 -502362
8954 -502362 218078 -190559 189540 271762 -223673 -333889 -8660 -154669 -160198 -34545 -2437
8942 -203396 -32920 263755 -147962 -42425 38337 -55371 168564 55145 65361 269412 81736
8930 188729 -250576 96031 -44190 301631 416162 336936 601187 3245539 11285038 12376991
8920 12376991 3117121 862462 871389 201934 236739 42593 -95876 -77395 57641 330925
8910 330925 67697 133507 295233 243655 49210 -184762 -18615 -198356 -12047 -161277 -31317
8898 229881 -229895 -111493 591099 85898 50355 3881 -42410 265032 -62881 -84787 -28818
8886f3445J4736C8818a09451G835K68245A08615n1336c1848C24185g8419L8478
8875c9941A67097a6563j72570H3702b0128D2962a37363k01693a01372O659q2536
8864a77249Q7657b6391k26751A00898a94359A34258c2661j78358j06434A77222
8853A02796c82287e5166F3770g8976A48251K03588D3510b5696B25667a24884a317
8841b64786B17765C0462g9217P906A3294b4987j2052A26597P3835b5537B13749
$$ plain form
8886 -63445 -48709 38818 -109451 7835 276080 108615 57279 -31848 324185 -78419 -39941
8875 -39941 167097 -16563 -189133 83702 -20128 42962 -137363 -339056 -101372 -94713 -177249
8864 -177249 -89592 -26391 -253142 100898 -194359 134258 -32661 -211019 -317453 177222
8853 102796 -382287 -55166 63770 -78976 148251 351839 43510 -25696 225667 -124884 -1317
8841 -264786 217765 30462 -79217 -71311 13294 -24987 -37039 126597 200432 -25537 213749
$$ [...]
##END NTUPLES=NMR SPECTRUM
##END=
