##TITLE=AC1602_NICAH13332_8315892_13fwTwvQwe
##JCAMPDX= 6.0         $$ Bruker NMR JCAMP-DX V2.0
##DATA TYPE= NMR SPECTRUM
##DATA CLASS= NTUPLES
##ORIGIN= BRUKER
##OWNER= Administrator
$$ 1.72 TOPSPIN		Version 2.1
$$ 2013-11-09 19:09:50.146 -0800  Administrator@X
$$ Compression mode = diff/dup
##.OBSERVE FREQUENCY= 400.02188249412
##.OBSERVE NUCLEUS= ^1H
##.ACQUISITION MODE= SIMULTANEOUS (DQD)
##.ACQUISITION SCHEME= undefined
##.AVERAGES= 8
##.DIGITISER RES= 22
##SPECTROMETER/DATA SYSTEM= spect
##.PULSE SEQUENCE= zg30
##.SOLVENT NAME= COFFEE_meoh
##.SHIFT REFERENCE= INTERNAL, COFFEE_meoh, 1, 14.98509
##AUDIT TRAIL= $$ (NUMBER, WHEN, WHO, WHERE, PROCESS, VERSION, WHAT)
$$ ##TITLE= Audit trail, TOPSPIN		Version 2.1
$$ ##JCAMPDX= 5.01
$$ ##ORIGIN= Bruker BioSpin GmbH
$$ ##OWNER= Administrator
$$ $$ E:\/data/COFFEE/nmr/AC1602_NICAH13332_8315892_13fwTwvQwe/10/pdata/1/auditp.txt
$$ ##AUDIT TRAIL=  $$ (NUMBER, WHEN, WHO, WHERE, PROCESS, VERSION, WHAT)
(   1,<2013-11-09 19:09:43.052 -0800>,<Administrator>,<X>,<go>,<TOPSPIN 2.1>,
      <created by zg
	started at 2013-11-09 19:08:37.036 -0800,
	POWCHK enabled, PULCHK disabled,
       configuration hash MD5:
       C8 4E 4E 5D D3 5C D8 9E 9F 52 82 E0 59 8A DE 15
       data hash MD5: 64K
       CB B4 08 E1 4D 17 36 E8 1A 33 66 AF 02 17 7B 4D>)
(   2,<2013-11-09 19:09:45.974 -0800>,<Administrator>,<X>,<proc1d>,<TOPSPIN 2.1>,
      <Start of raw data processing
       efp LB = 0 FT_mod = 6 PKNL = 1 PHC0 = 0 PHC1 = 0 SI = 32K 
       data hash MD5: 32K
       64 25 AE 60 86 E0 7D 96 3D B2 4D A2 FF BE 65 06>)
(   3,<2013-11-09 19:09:46.318 -0800>,<Administrator>,<X>,<proc1d>,<TOPSPIN 2.1>,
      <pk PHC0 = 92.43896 PHC1 = 0 
       data hash MD5: 32K
       A1 59 7E C1 E3 41 8D F3 64 E4 2B 5E 91 6B 63 DB>)
(   4,<2013-11-09 19:09:46.443 -0800>,<Administrator>,<X>,<proc1d>,<TOPSPIN 2.1>,
      <abs ABSG = 1 
       data hash MD5: 32K
       B8 BC E9 7F 0D 65 23 33 C0 2E F8 49 B2 AB 21 98>)
(   5,<2013-11-09 19:09:46.505 -0800>,<Administrator>,<X>,<proc1d>,<TOPSPIN 2.1>,
      <abs ABSG = 2 
       data hash MD5: 32K
       A2 17 2F EF C2 D0 DC 1D ED 69 FC 95 D4 B9 3A FF>)
(   6,<2013-11-09 19:09:46.568 -0800>,<Administrator>,<X>,<proc1d>,<TOPSPIN 2.1>,
      <abs ABSG = 3 
       data hash MD5: 32K
       2B 65 7C 2A C7 E1 03 12 F5 88 FD 24 0C 8E 8D 02>)
(   7,<2013-11-09 19:09:46.661 -0800>,<Administrator>,<X>,<proc1d>,<TOPSPIN 2.1>,
      <abs ABSG = 4 
       data hash MD5: 32K
       68 55 49 3D 32 B4 7D 07 BA 23 71 69 5F 96 55 E2>)
(   8,<2013-11-09 19:09:46.755 -0800>,<Administrator>,<X>,<proc1d>,<TOPSPIN 2.1>,
      <abs ABSG = 5 
       data hash MD5: 32K
       5E 1F 10 C5 D4 52 27 5F 0D 34 A3 A8 34 81 F6 4A>)
$$ ##END=
$$ 
$$ $$ hash MD5
$$ $$ AB 5B C7 2D BE 56 C4 E3 AE 95 E8 AA BD 1C EC BD
##$RELAX= 
##$RELAX= 
##$RELAX= 
##$RELAX= 
##$RELAX= 
##$RELAX= 
##$RELAX= 
$$ Bruker specific parameters
$$ --------------------------
##$DU= <E:\>
##$EXPNO= 10
##$NAME= <AC1602_NICAH13332_8315892_13fwTwvQwe>
$$ [...]
##$TP= (0..7)
150 150 150 150 150 150 150 150
##$TP07= 0
##$TPNAME0= <>
##$TPNAME1= <>
##$TPNAME2= <>
##$TPNAME3= <>
##$TPNAME4= <>
##$TPNAME5= <>
##$TPNAME6= <>
##$TPNAME7= <>
##$TPOAL= (0..7)
0.5 0.5 0.5 0.5 0.5 0.5 0.5 0.5
##$TPOFFS= (0..7)
0 0 0 0 0 0 0 0
##$TUNHIN= 0
##$TUNHOUT= 0
##$TUNXOUT= 0
##$USERA1= <user>
##$USERA2= <user>
##$USERA3= <user>
##$USERA4= <user>
##$USERA5= <user>
##$V9= 5
##$VALIST= <valist>
##$VCLIST= <CCCCCCCCCCCCCCC>
##$VD= 0
##$VDLIST= <DDDDDDDDDDDDDDD>
##$VPLIST= <PPPPPPPPPPPPPPP>
##$VTLIST= <TTTTTTTTTTTTTTT>
##$WBST= 1024
##$WBSW= 4
##$XGAIN= (0..3)
0 0 0 0
##$XL= 0
##$YL= 0
##$YMAX_a= 642958
##$YMIN_a= -548746
##$ZGOPTNS= <>
##$ZL1= 120
##$ZL2= 120
##$ZL3= 120
##$ZL4= 120
##$ABSF1= 14.98509
##$ABSF2= -5.573092
##$ABSG= 5
##$ABSL= 3
##$ALPHA= 0
##$AQORDER= 0
##$ASSFAC= 0
##$ASSFACI= 0
##$ASSFACX= 0
##$ASSWID= 0
##$AUNMP= <proc_prof1d_extract_pilot.lims>
##$AXLEFT= 0
##$AXNAME= <>
##$AXNUC= <1H>
##$AXRIGHT= 0
##$AXTYPE= 0
##$AXUNIT= <>
##$AZFE= 0.1
##$AZFW= 0.1
##$BCFW= 0
##$BC_mod= 0
##$BYTORDP= 0
##$COROFFS= 0
##$CY= 15
##$DATMOD= 1
##$DC= 0
##$DFILT= <>
##$DTYPP= 0
##$F1P= 0
##$F2P= 0
##$FCOR= 0.5
##$FTSIZE= 32768
##$FT_mod= 6
##$GAMMA= 0
##$GB= 0
##$INTBC= 1
##$INTSCL= 1
##$ISEN= 128
##$LB= 0
##$LEV0= 0
##$LPBIN= 0
##$MAXI= 10000
##$MC2= 0
##$MEAN= 0
##$ME_mod= 0
##$MI= 0
##$NCOEF= 0
##$NC_proc= -8
##$NLEV= 6
##$NOISF1= 0
##$NOISF2= 0
##$NSP= 0
##$NTH_PI= 0
##$NZP= 0
##$OFFSET= 14.98509
##$PC= 1
##$PHC0= 92.43896
##$PHC1= 0
##$PH_mod= 1
##$PKNL= yes
##$PPARMOD= 0
##$PPDIAG= 0
##$PPIPTYP= 0
##$PPMPNUM= 2147483647
##$PPRESOL= 1
##$PSCAL= 4
##$PSIGN= 0
##$PYNMP= <proc.py>
##$REVERSE= no
##$SF= 400.02
##$SI= 32768
##$SIGF1= 0
##$SIGF2= 0
##$SINO= 400
##$SIOLD= 32768
##$SPECTYP= <>
##$SREGLST= <1H.CDCl3>
##$SSB= 0
##$STSI= 32768
##$STSR= 0
##$SW_p= 8223.68421052631
##$SYMM= 0
##$S_DEV= 0
##$TDeff= 65536
##$TDoff= 0
##$TI= <>
##$TILT= no
##$TM1= 0
##$TM2= 0
##$TOPLEV= 0
##$USERP1= <user>
##$USERP2= <user>
##$USERP3= <user>
##$USERP4= <user>
##$USERP5= <user>
##$WDW= 1
##$XDIM= 32768
##$YMAX_p= 464238300
##$YMIN_p= -697381
##$CURPLOT= <Network HP LaserJet P1505>
##$CURPRIN= <$Network HP LaserJet P1505>
##$DFORMAT= <normdp>
##$LAYOUT= <+/1D_H.xwp>
##$LFORMAT= <normlp>
##$PFORMAT= <normpl>
##$SURQMSG= 1
$$ End of Bruker specific parameters
$$ ---------------------------------
##NTUPLES= NMR SPECTRUM
##VAR_NAME=  FREQUENCY,     SPECTRUM/REAL,   SPECTRUM/IMAG
##SYMBOL=    X,             R,               I
##VAR_TYPE=  INDEPENDENT,   DEPENDENT,       DEPENDENT
##VAR_FORM=  AFFN,          ASDF,            ASDF
##VAR_DIM=   32768,         32768,           32768
##UNITS=     HZ,            ARBITRARY UNITS, ARBITRARY UNITS
##FACTOR=    0.250966925370066, 1,           1
##FIRST=     8223.43324360094, -184086,      -65085
##LAST=      0,             -61406,          184201
##MIN=       0,             -697381,         0
##MAX=       8223.43324360094, 464238300,    0
$$ Real data points
##PAGE= N=1
##DATA TABLE= (X++(R..R)), XYDATA
$$ [...]
23846 -68263 264313 153544 -224485 -124999 -92086 -72454 -123868 128791 -82113 -72766 3833
23834 -8521 -109416 -322842 -116920 289700 -238761 -265955 2118 -128691 -81865 261277 -184756
23822 -2539 -134977 -261171 8958 120220 26586 24527 53296 -178806 -359208 -153945 -425779
23811 -425779 -90081 325900 36615 29688 119549 48770 -6995 -181973 -101517 -86681 -176103
23800 -176103 -263110 -101254 75013 153901 47870 -17064 42882 -371608 -180623 225231 -147888
23788 -142268 -119134 56988 78536 37263 213409 -40909 -253019 186596 -63968 -172689 50546
23776 68664 -45927 -165769 87260 -186680 -8967 -252633 506334 -273161 -265219 114253 385115
23765 385115 273684 -183754 79483 165395 135860 357666 -58977 -91300 -246028 162058
23754 43057 -241016 37552 -164770 -49469 289671 -255457 -394665 68791 67577 -68235 -204926
23743 -204926 -248875 88393 82296 135239 172336 302458 35917 137567 -15548 41190 321124
23732 321124 292808 -160863 -249504 -286993 38140 -44306 170914 -7904 -291783 43186 -16798
23720 -215060 262881 -62429 128379 -81415 -100226 -258753 -147962 -312613 289368 238518
23710 238518 -24160 130068 -126218 -93771 -108036 149317 338144 237482 -95820 -215997
23700 -215997 -46705 -205424 -82664 -146364 -165228 290167 -157172 -151193 -27591 109449 -125748
23688 -127277 -298544 -96024 106961 32742 275208 -47703 -29935 -67728 -26448 -118893 -427547
23677 -427547 -152473 -160288 -128639 67700 -88543 59915 -10883 -308141 -105527 -454015 -144708
23665 -159147 29366 20450 209891 275801 -112668 19818 58256 -147967 90184 122388 161042
23654 161042 -9562 -31889 -74631 -99837 -334047 -197241 -43791 -69718 -25317 471123 93954
23642 -164872 -73482 83301 -73821 50289 286292 83820 -100514 -192685 121815 -54311 161032
23630 -131579 68679 -6993 59549 -81262 -32057 -38066 46197 139765 -23408 123279 -24183 -243172
23618 -243172 282301 -207132 96598 -410804 287860 -265235 -9972 -98685 -72340 -199772
23608 -199772 81716 17333 36207 -39145 -131480 57993 246655 144933 -65714 -39948 -316529
23597 -316529 -325988 -81228 -27447 -7648 31582 -27994 -286433 54599 435 469173 -27005 -320262
23585 -320262 -84850 -129864 411156 311855 114457 25142 -103735 -138218 104656 -118091
23574 33211 140137 -195493 -52935 287938 -255817 -403749 134813 -223740 -142397 13750
23563 -151132 -218215 -85234 -15594 -60626 98013 -130491 -34523 -172629 34168 230170 -211290
23551 -305259 60325 -243147 -101037 197359 65880 -9260 291698 224540 41305 -115288 -138536
23540 -138536 48544 -3128 -10394 -140861 183560 233350 134238 -130447 -49077 -145440 -241211
23529 -241211 -147188 -58479 109037 -313489 -161214 -99385 -18831 22086 -118130 107135
23518 97277 63167 -139469 87060 103483 125424 135630 -85974 41846 -312492 116773 6520
23506 108481 20629 -128628 77495 157324 170275 25606 213980 303021 40602 61940 -84723
23494 9249 -102559 -78272 -280848 -106173 156993 -82971 -163668 -38084 -68628 -30804 -243732
23483 -243732 -20878 68671 -154846 57591 -10101 -57228 -93209 211940 215616 -175529 -92622
23472 -92622 -6057 8436 -273266 -75788 51394 62513 -453959 -55338 -150072 -271830 165480
23460 -228481 -270428 -198170 169823 -507252 -75161 -238884 183480 183599 55717 -88638 -41506
23448 -102021 -139617 58597 116018 236802 235305 -62219 697 -45969 187066 89942 -101512
23436 -354140 -378378 69041 131437 76633 297920 -321009 -151914 150988 -107355 131101
23425 -156384 -19591 92567 -262775 221772 -102043 -313211 145699 -220107 113657 205749
23415 205749 -36629 41723 58984 -51724 -57012 -192613 242757 166219 -8874 83125 -63047
23403 -81414 -206773 268710 186728 22157 -90417 121399 -364835 141967 -124462 39943
23392 -76487 180140 -198130 196233 -285991 44768 -144618 -275930 -63012 32424 74498
23382 74498 106736 58412 129741 -45709 -246821 -210838 -6088 87456 -40606 -264704 61135
23370 140565 32936 -98226 -202801 -143103 337296 -215476 -88028 -160477 177819 6978 -109403
23358 37630 -107183 -148716 -51630 -70718 50535 -66835 -169743 27360 -187969 -292420 -61396
23346 -54829 -135355 234783 203577 -249030 -84988 -35223 -190256 269658 258091 39158 -82123
23334 188772 -10546 -256783 -219778 -59034 -230923 -111083 225058 -189077 -42805 -54088
23324 -54088 57371 64464 -91818 -448769 -11412 -33784 -125317 366910 -58756 -22983 -217690
23313 -217690 183435 58826 -3631 -218012 -76784 -195787 -29956 -85117 -161871 434508 -374618
23301 21764 -302636 -676 -335312 39321 51797 77140 58707 247658 -276081 74692 -26678
23289 -238252 -151586 -190796 -134651 131640 -211561 355508 -440928 -30064 -165900 -64034
23278 -138856 -20053 99323 26903 -76214 274074 239336 -50721 82269 143845 106080 87520
23267 87520 -76902 -109269 -259344 -168596 116359 -20295 -64212 -9781 -215038 84393 -270761
23255 -341463 151837 86545 -137836 58302 125668 -140576 -206932 -132378 45109 38137 80219
23244 80219 41399 30292 242297 231181 -233875 64045 -139205 94223 97232 -5200 -42369
23233 -42369 -233276 212590 -168364 33705 -159907 -336354 148611 150881 41487 -258790
23222 -71210 -258945 -73937 -62306 126990 106622 180374 -88988 -33804 292369 332597 288044
23211 288044 -244106 19271 -141862 -12884 -4101 -198530 -26221 27157 206300 63642 192581
23200 192581 -1182 101802 -142816 61534 -203466 -67534 -89061 30779 -118228 -262325 -427848
23189 -427848 -72872 -121475 -269230 122916 25240 -28204 -65159 -37327 -150378 9826 -282575
23177 -79188 -238666 -364519 79572 53719 150995 -314466 213713 -20806 -140354 287412
23166 -47781 -77325 -128632 190329 -144049 -97748 -114385 -158725 -88367 328596 -158060 61043
23154 55372 188509 -223539 -133748 128324 1307 104280 93294 -162741 49773 2413 4622
23143 4622 86353 32534 -64427 -38368 -84308 14859 -214913 42891 2553 98290 3976 -161218
23130 58276 -152923 -346987 129411 -266143 -125172 127494 -226390 -221981 90506 -14253
23119 -279431 -133381 -115175 24083 -144202 -362675 115090 -65541 -155642 133440 4356 -122970
23107 -11941 128237 93459 481179 98943 290286 -166361 182280 1275 -113428 -78340 -123291
23096 -123291 111236 112755 -61991 180632 -23225 141809 209112 -129443 113942 245966
23086 245966 -81827 -323658 83222 16252 -119963 81742 -354472 -357638 146647 54740 -50645
23074 10027 -182171 1499 -144595 96939 110532 218909 12586 -217285 82203 441674 16510
23062 203169 150414 24290 -196733 4258 -209196 -31000 80643 62370 48575 209518 6346
23050 -400881 -2890 2534 -129005 -59276 -96202 -325300 -82980 76676 100556 138697 -71307
23038 -250431 -81115 -169582 12061 178930 -42608 -301429 -235177 -159894 -90500 280315 7360
23026 199368 -65904 -159649 143106 146736 43199 386738 119324 52201 54755 11483 -85320
23014 3084 -179975 34523 81969 -192466 183497 -72491 128201 -309007 4364 -2336 22002
23002 71257 -322125 234538 -370182 -128343 121357 -102596 465 -104789 -6607 -182999 -43650
22990 345303 -103146 -279338 38429 -129411 286999 -430945 187296 -83295 63951 -195311
22979 -35743 281079 -121708 -2629 -254432 196532 115072 -125954 540 -115762 25899 264217
22968 264217 84814 -158242 177995 -78541 55012 -53214 253807 80912 43742 1506 212632
22957 212632 -247151 -170695 34267 1737 28661 157459 -62789 121703 47965 20328 -313069
22945 199098 131613 140487 296559 -37428 -260888 -44034 -319586 -184345 -73159 244171 246891
22934 246891 -61540 15174 32805 45241 -372428 124942 5536 167879 215433 274486 -27768
22922 34399 60815 -78354 130540 -54130 43358 26976 64866 -9477 29835 19690 129478
22911 129478 -331967 136937 155876 -147356 -87609 36580 -93076 -22689 111810 -105919
22900 147510 -43186 -258505 48074 -366899 81762 -66837 -353539 -167652 -50755 61047 297161
22889 297161 -270152 1396 261043 241926 63971 -414308 -136761 -24288 -123924 -11315 -225332
22878 -225332 108332 245135 277752 -329117 230223 354178 77684 -1635 -176812 -148055
22868 -148055 -59565 -326469 -46186 14364 -221222 -99390 -22174 -138807 16325 -307810 140397
22856 -120608 19787 -80040 -95806 35427 -217798 247611 -53560 -333206 24891 -85960 235480
22844 -293036 158793 -99178 334275 -16850 19571 -71741 -1595 58453 -49116 -181668 -163545
22833 -163545 72575 223585 -99274 -10203 -61982 -80996 -314808 -150955 -71654 -16438 -320020
22822 -320020 48985 287638 -129622 -10967 -260318 183932 127473 -220143 -150201 -142843 -5428
22810 57460 136052 -212983 -91617 -222303 -138893 14929 -11018 89590 -161615 -235306 66782
22798 -118389 -435824 207257 -257248 -134896 124318 -51507 -182475 -82264 243852 4138
22787 78589 -108909 128254 3372 112900 -74661 185078 31520 -20415 239364 34505 -30055
22775 -247485 14024 -99184 -14924 415494 41044 -311110 304144 72424 97824 -102178 -204723
22764 -204723 -135651 242165 312471 -66466 -230414 -154090 -193771 -157805 -149993 288595 228768
22753 228768 49414 20939 104466 -123277 -145913 -90388 51347 -241463 -110419 -156106 214563
22741 115014 -172117 -155737 -71068 187280 5318 149857 -108282 -49224 -49479 -437882 -145257
22729 182780 113302 89361 -270794 -53327 -64108 105493 -5650 -11508 -121637 -106461 109956
22717 179564 43137 199791 33283 69846 -203146 -250827 22541 -202555 117831 25026 -104241
22705 241316 417648 28445 105066 -232024 -222653 -93093 222603 -281451 257786 -78085 -320518
22694 -320518 229285 -33265 91807 89203 -56227 37789 -178578 -305357 -116139 -325308 119229
22682 -184655 -221288 -59945 -152792 156275 -140428 75838 -83119 -284380 -5350 136784 283724
22671 283724 -129671 -237859 102080 -4337 -205544 -35589 208031 -112626 79137 -85752
22660 -27114 132064 17509 175924 -305800 93104 -60336 102521 -48891 -194088 -185757 -411254
22649 -411254 -150127 -22148 242930 -89848 -153054 97670 139455 -115396 88789 -138401 -219269
22638 -219269 223471 -207077 -89073 289474 349431 132974 100143 -121574 -225270 -148309
22628 -148309 -24138 -193041 -209804 79177 57965 108039 -293602 -13163 45370 -37798 -37298
22617 -37298 -132503 -249389 -29994 156732 -75739 -347053 -28206 40354 -233684 -400895 111362
22605 -64859 -72425 115196 32826 -101203 -252524 66750 -32815 237980 16051 426820 178379
22593 -111383 429466 106357 218644 -35059 31679 -63069 -257626 -143175 304241 65482
22582 64951 -127572 -311992 40702 -227127 -260131 -101061 -55604 -181577 -67208 36357 -287659
22570 -148759 102504 -337276 -26505 -111273 -31393 -54533 -105966 -81310 -35009 205688 -184613
22558 -189683 128389 301404 259324 3599 -90047 -63277 -231974 333007 -347680 152330
22547 331590 -222924 48794 -125256 4337 24190 -451079 -286970 195285 -203302 -196762 76125
22535 117191 -119414 -216252 261126 -210685 -19361 -58186 18081 53130 -97472 23077 -70307
22523 121227 155694 -190847 -201398 369669 147303 -85909 -111224 -32569 -114320 234513 -20599
22511 34596 -310163 -312783 -144046 170918 -299121 61200 213739 -66531 -71729 47765 142048
22500 142048 7023 -184902 -85805 12948 181236 151519 -64773 -260785 -136901 -26490 48778
22488 48319 12014 236503 248419 122873 107633 -29066 -67554 -235845 -218615 -234090 24052
22476 -334647 28628 -192626 49189 61498 -16824 -182911 349138 -157883 271494 -152545
22465 -251366 -210417 -113202 89997 -271715 -251042 -39598 -239297 136105 -78474 36363 -72034
22453 -58785 -61503 -129532 49923 -345740 107592 344641 -248467 -182736 53681 -140358 299807
22441 -136785 -53004 243565 316997 123259 -80776 179048 -149799 -114183 33666 4975 -121212
22429 -102849 -178931 88619 35786 -89501 12748 402862 -84020 -47637 31674 -237616 -84452
22417 -120804 212322 1396 -97149 -360795 -110582 139061 -168431 43420 -227824 29675
22406 202406 -389161 -246484 105294 68 -132067 158695 -9354 -379272 140266 -209217 40909
22394 -12615 -218587 -7903 312307 222086 96737 -214245 -160924 74087 -26061 198875 -268234
22382 24750 211263 -161194 191822 71793 101882 -94937 601466 -344610 -163760 -59106
22371 -118257 18872 -94954 112993 -308604 300486 89616 -45399 -21968 -215524 157985
22360 -417309 -26444 94804 38151 -286474 -501150 51230 -131129 -18671 -159405 -117812 -76510
22349 -76510 -61817 -424176 -113675 32538 67933 -329495 207078 145692 19725 -248303 45208
22337 225503 -52724 123650 -162028 300031 -58712 -428809 41841 -209291 69817 67745 -201365
22325 165091 141365 -133232 115899 -302976 47779 -194235 -127487 20685 193531 39924
22314 -197225 164491 -323057 370277 -409817 -106048 -181489 -138219 -149740 50675 110619
22304 110619 -182002 14296 64885 -184163 -45831 -12652 2963 184202 136853 -81865 -278609
22293 -278609 -44601 -11429 150427 -334625 27383 25506 347859 -266582 119318 -291852
22282 101040 85336 -33992 -188474 -212742 2356 -59956 93023 -415312 -109160 194585 70328
22270 58765 268786 -235379 211103 -100438 -142291 58843 226907 -115600 -122365 41122 -275799
22258 -411641 -249631 -209473 -109390 7068 -107247 -98526 48582 194417 77836 -164869 178295
22246 -212851 -167534 -16930 -264574 85284 -229498 32397 -165578 -249034 -190931 -14298 -24878
22235 -24878 281953 -121982 -70015 18743 -223515 -157490 -13801 -141304 22326 55697 109772
22224 109772 204833 17417 98587 1151 -196018 49974 -152763 112112 -309961 9070 -115336
22212 31406 -13576 80639 -220550 116011 -5380 -207106 309967 -262342 162909 18298 -180601
22200 93459 -424793 303129 415475 -131329 -28954 226529 -245055 51457 -53297 -176806
22190 -176806 -181332 14766 12292 276322 129781 -98913 -237775 -307918 -172199 -122287 -264739
22179 -264739 -68123 168351 104800 -106692 -6125 78595 -65685 -32087 -55902 -186952 4994
22167 -6920 -21591 -114066 32587 70868 188921 -29390 86420 266683 -335666 -238126 121744
22155 178420 150446 -57879 -176840 -38491 79045 125855 71627 -47640 234430 -73037 -195211
22144 -195211 142954 -118742 -113862 41836 25312 -299753 -242622 -172228 190528 -224184 -3002
22132 -67677 -355838 324809 -156297 -84310 -116424 -289614 -7762 131289 123325 -90409 -70077
22121 -70077 -72539 154512 62895 -41041 140207 -154333 20294 -200769 -106235 25676 -204834
22109 201862 222662 47270 -347850 -69500 -281813 193993 -112462 -130926 -195020 -181989 10037
22097 -32120 -5002 -96841 141333 269648 16498 -148642 -53942 132995 344082 -62602 81468
22085 80097 -48255 -131008 -86216 -219458 58032 156426 298075 -101745 -143482 -134731 -318236
22074 -318236 42278 -49433 -386034 331331 175237 261414 -58207 25427 -554204 162949
22063 -16578 -168309 61608 -116603 -365896 383931 -1404 96351 -162432 -449882 -4580 -227556
22052 -227556 101119 -225999 26880 -142271 220530 185284 -103012 -91486 -25935 -77389
22042 -77389 76751 -194158 74693 -186329 -69749 -209378 185563 209636 95854 -26829 69435
22030 199719 75988 218344 -162160 -413979 -147908 -265303 394575 -113658 157571 -30840
22019 -223968 -63240 -92912 109618 -189015 -91678 -145996 88143 -84427 -177519 46648 -117812
22007 -111440 164371 -176524 -178243 -164124 11956 158566 -231666 -155559 -88192 -244902 99758
21995 -149400 151779 -31561 87583 -76272 -123974 -286089 119288 -239205 -21690 -59406 93656
21983 284111 -16304 -93958 -163192 -132943 -165963 79299 108834 205095 46138 42825 208809
21972 208809 -107601 -52376 31544 -29616 -158151 156539 222533 -98810 -16313 -102604 -43721
21960 -224676 -158937 13537 -52369 -286143 -121194 -53955 19309 -425328 -27037 -202973 328982
21948 176690 -61959 -252500 9385 -48873 -227967 -462343 10425 291309 -119056 136255
21937 -146578 -146902 -224316 -86128 315757 127400 -179510 -136461 60650 -120731 63037 -50901
21925 -128861 53164 -29648 -55476 -76670 22111 257999 -52359 -323006 47676 -48770 -166748
21914 -166748 -334692 115900 76586 -95962 7723 23887 -30320 -26724 -182379 67852 -26663
21902 96427 150068 -119418 -33949 71456 50300 -69368 -121919 -113599 -178363 77504 -154236
21890 -152529 -374814 132168 -162839 -278694 35507 -65427 -10796 -46462 380443 -92246
21879 236682 27581 -327421 231472 -173725 97991 -166496 194655 44439 -171355 -56131
21868 -11164 -99445 -72474 -212103 -170090 -323086 -225819 -137317 -119448 -66557 -226057 -226407
21857 -226407 -95078 -167822 -117968 91217 -258423 -190973 -370794 30958 -40739 -239994 -47255
21845 68216 142027 416924 84653 -10226 -13229 -195595 -308653 155729 -147264 -212456 -3605
21833 41710 -326000 -286188 -45150 -35854 72253 45551 93962 165594 127606 130600 126740 234760
21821 234760 -3097 91321 -146221 -23593 193113 340455 -36987 12672 -141218 -81239 90553
21809 108770 -121182 -108570 -114585 -30617 -52222 -108471 -33989 -427771 10048 -371767 76760
21797 -185495 151802 -164057 183008 129378 -222477 -12977 -337055 32150 103261 521803
21787 521803 -198783 -72978 54911 -196129 26320 -128893 -30524 64666 191913 -64076 -135078
21776 -135078 -18253 -367835 71734 -76197 -50423 -116565 -134223 93006 -141538 2399 102581
21765 102581 -158806 -140667 167569 149555 -232513 -252162 -24444 12964 203833 60324 -27941
21753 205658 146068 318104 -150484 -291400 -56026 213096 163212 -113918 -356349 67942
21742 -242601 -377127 -116365 -190022 -33105 -202485 -10661 175991 -261363 -126444 238668
21731 181820 308691 -107202 -146262 214560 -369596 323704 -117026 63504 -377084 337552
21720 -25175 -139699 -250958 71078 -100159 -295672 -42272 -37432 84953 -205192 147276 122143
21709 122143 -63106 -233705 85106 -308977 -10701 -304334 -196047 219438 -172280 -149167
21699 -149167 -125533 55775 -267902 -163820 4064 -137095 203198 -70978 -45530 100758 -10359
21687 320690 -355925 -227264 99400 -84446 129208 -21260 48892 -153524 61226 62006 -27813
21675 -100349 83722 176484 67094 9920 174392 -105362 -69199 -107387 152800 -61915 33216
21663 46428 62147 102360 -83799 -166710 -20105 -20390 -185387 314044 -640440 -190122 262903
21651 96272 85887 -15066 -183548 71463 359898 -137821 -245636 -45865 130829 55117 6000
21639 -108371 -592357 -269196 -211119 29728 13016 -83243 -456464 177539 -236166 294385
21628 240202 336 210777 66307 -183761 -132609 -166290 451137 350776 -242362 143152 7519
21616 53409 47533 -110737 -96694 -24104 -163291 37458 -270922 23159 -393126 243550 53966
21604 -128007 -2755 -84620 -72941 63041 -154828 92582 12046 231933 -148678 -99102 114905
21592 -129102 13412 -320774 -179180 -55159 76029 288117 17459 -63367 101274 178779 38720
21580 -112524 16098 140419 -145655 -329418 40366 237757 -44652 26156 -424374 46944
21569 -79836 15647 78167 -145140 -81210 44417 -59634 -299360 21761 -71487 -139497 249012
21557 227049 -136911 -289593 525814 -49487 54703 -184278 -88626 95246 -34399 78312 -124097
21545 -184224 -202744 -32636 -38403 8211 113032 -99570 -169961 -77891 -225931 -88161 99656
21533 80361 129742 87069 -165335 278858 -17664 -121930 34424 15216 -426393 -68328 350604
21521 -31648 -2480 -21821 -15148 -8236 -198945 94121 54614 283873 -201997 -280515 310210
21509 217402 -197303 -90099 23420 -103331 -182932 78558 44776 -109680 -143838 -197298 32793
21497 -104211 -216115 -257888 142224 51353 151423 308925 -66729 -34356 -203753 -98289
21486 -146502 180992 254631 -191398 173598 -175890 -215398 10533 -56366 -352976 111596
21475 285632 -297829 -369507 -214140 -44026 -88337 -105226 -111751 -138412 -50641 -193188 -32129
21463 -101660 15725 38294 -36776 -182380 -182841 105134 -205617 -384711 39084 -283978 -1608
21451 55038 73647 -46074 -168678 52113 -300458 -197362 -118442 65546 39250 22694 -259306
21439 -475 227783 106003 -31052 409115 -54054 455442 79792 94680 167964 -52246 -208275
21428 -208275 -84111 116397 -207652 -241806 -211354 -124150 -76109 -104472 -129702 214251 -218500
21416 -58342 -52028 168482 267746 215258 74680 -278642 95416 -90857 -50817 -245141 -146463
21405 -146463 -77405 102706 157789 -242350 -198467 -42986 14450 -146929 117738 112746 64619
21394 64619 -66737 -73890 -224229 -103969 -211137 -251200 -511004 -54931 -150436 -149435 -146599
21383 -146599 -283975 -210908 -489505 -69432 -91618 -170612 35358 29263 -140981 -192330 -216761
21372 -216761 48916 -36687 -10962 -64186 -176028 86128 -24625 -78473 -320356 -103859 -236722
21361 -236722 376691 -162762 10872 -76762 -40708 -9094 -218775 -25046 -156553 35994 -162979
21349 43530 30856 -136000 -111454 -49348 -52985 -65920 -354187 -393784 -120428 34796 139964
21338 139964 108374 -163244 21643 -188150 113792 -33716 5736 43454 73990 -152685 -197341
21327 -197341 43050 52877 -432335 35531 -83306 -64965 -45534 121244 109576 458145 -89034
21315 -115017 -33989 55210 210762 106729 269037 -147707 -76729 -219744 -143235 -218303
21305 -218303 -253180 41873 -287246 -264549 -112648 -145481 -339665 -189542 -101737 111288
21294 -280240 139484 31935 239890 -204691 86616 -173019 -47718 173541 -68754 -318136
21284 -318136 -150155 226865 -234758 -189635 28769 -198097 -195277 65698 -113000 40951 -289006
21272 4168 -65215 -218301 -373238 -214409 187307 17658 -172758 -3021 208118 -323706 -276322
21261 -276322 -112741 -78620 -19723 82473 -102651 47672 -31571 26444 -213901 -94156 143950
21249 -492436 -312523 302606 8405 90753 -180252 339934 -44140 -168502 163544 -201532
21238 -162098 99975 -82724 -33726 -115268 74142 68202 166345 -439931 -222079 -175942 -316761
21227 -316761 40691 -142351 41620 -217853 104208 -91266 -220223 134040 -217196 19717
21216 -55771 182232 135073 -117530 -89153 243222 74320 -447509 -65168 58211 355536 108669
21204 -29686 224274 -338498 6743 -115349 -7920 -96965 -97647 53258 -89382 -147647 -37695 -85214
21192 -85214 8493 81987 30031 -161375 75571 -239451 44443 3474 -255750 -178000 146070
21180 -223846 90406 -136627 -3878 55148 -44077 -391343 -109814 -190210 -22904 50631 128815
21169 128815 -53579 -4198 -167830 9800 260096 89403 77559 64568 205975 -283028 -115654
21157 -7542 -71841 140834 -69577 133800 416815 -276838 -244665 -85407 36597 -40707 -331147
21146 -331147 38921 -47929 -20404 226877 -324150 -159473 72171 -119973 -151038 297523
21135 49804 411621 210131 6994 152203 138397 67614 222843 -140818 -194314 63451 27219
21123 235776 -26515 16114 -138922 24252 176411 184339 -84908 -207957 128911 -45478 -203510
21112 -203510 82608 -124734 130277 -466531 -59877 -65446 -27400 326786 125507 22540 -58588
21100 -111105 163623 -125327 -35578 20948 129323 17877 -32090 333821 38967 -84267 135372
21088 -283470 -181934 -55467 -92611 464670 150088 -284838 -238655 -44374 14538 -74847 193282
21076 115219 -117666 -232814 -9141 -9155 -35448 -93376 -282990 -151145 -355330 -329642 -114675
21064 -69565 85056 -313907 158807 -330432 185944 -177250 367761 -2515 171602 -162179
21053 -4884 356302 -64199 -2575 -28162 -230128 -68698 222637 -205107 -157408 -168338 -338178
21042 -338178 23062 -91711 -175596 -87108 36467 -205860 172885 14720 149505 74106 -70598
21030 -129950 160730 -99761 -13714 -315449 -4927 -61657 -128280 -231155 -91769 -181541 32176
21018 -262645 -298164 51050 -318858 -114006 691 -63665 42692 199955 29025 341150 88737
21006 840 -97307 -34769 92385 -6772 337330 -61540 86850 93235 -162840 163307 64095 -29831
20993 -56216 -240271 87537 104292 25752 398952 139615 -172996 -184026 -219208 118834 59804
20982 59804 33909 32911 -192224 154731 -8494 -345567 -87925 -105961 -118779 -273687 325037
20970 -143231 -184115 -210068 13937 -127033 -218762 139448 -190854 -49170 -4876 99100 -100454
20958 -188631 -59221 -118160 341440 -23882 137548 -40964 -125469 71156 -60250 -329321 -48285
20946 -426882 -58678 -372459 -346320 -238162 -299108 -62827 64 -213832 288340 -3627 322038
20934 305391 -148197 189405 38418 -176383 -59836 11519 -370602 -59620 -38399 -69936 -166153
20923 -166153 -138053 -223579 204612 -6491 9283 158251 -221580 -51331 -137002 -125880 1130
20911 -178279 82390 -13114 -156188 -84093 45197 118954 222230 152895 12710 -243539 -272616
20900 -272616 -29493 -107028 -192876 199494 29826 79457 -27757 -59654 -13636 26237 -100427
20888 -50194 -189458 273227 -24744 -202128 -108154 21759 -200768 -156184 -148077 -123456 2665
20876 -226229 -115551 219363 3495 244814 -455075 -104573 -197521 39911 84114 -227282
20865 -155861 -28712 -85268 96645 -39896 -60361 58567 73342 -104829 128152 -135775 53711
20853 -114079 -119710 -81096 -259595 -24533 -101633 -213021 -14459 -210910 -11648 -69006 12932
20841 199892 -122381 -66603 81539 11192 -223618 -15373 -203067 151050 -264694 -70858
20830 172111 94675 185841 -454749 106527 220402 88426 375887 -21280 -5472 69811 -439003
20818 79775 -10697 -410041 -57725 -161543 -338269 -64718 49309 -125846 -124749 57866 37256
20807 37256 -70088 -154786 144245 -359766 -109461 -332644 137048 88438 436301 -161238
20796 -107122 113382 -342837 -98773 18709 194370 96995 -272831 7213 -76952 160064 182664
20785 182664 91573 -125836 -178526 246748 47294 -71878 -34514 222947 -109686 72241 -62594
20773 20123 -105112 -91260 -1618 40486 216117 120739 70452 -222521 -256911 -129170 173110
20761 128595 -208453 190423 -115510 69820 12086 257400 -325270 183362 -128005 -93848
20751 -93848 41953 173265 143264 -172994 -61477 10147 -80809 -98885 223739 -49710 129652
20739 -34604 -144994 -352478 -38655 -211895 -51884 -344088 27321 50534 247303 -468110
20728 218284 -256667 -52652 -189863 -178414 191171 -515911 50741 -164693 -154469 -257511
20718 -257511 103202 208553 115244 22962 -56418 257066 -129304 -116371 86966 121120 -86073
20706 -52766 122472 -113129 -68250 -150660 208902 -278118 115599 -160016 158193 -33104
20695 -380761 -242780 84001 229685 -122319 341571 -360759 130884 61212 -454502 -299004
20685 -299004 248225 -224321 -189967 -17473 234550 -21807 -245883 285363 -65299 -78236
20675 -78236 -128984 -94092 -360304 -230950 162621 -48080 124302 28759 -135441 -87543 -134258
20664 -134258 199259 -229107 77658 -374585 25157 -153371 42156 -90826 -175718 -257089 -322088
20653 -322088 67343 -190077 -39505 226229 216302 -120552 306176 -174366 -103436 -265415
20643 -265415 -252206 -84067 -18717 185338 -182380 297513 -90733 -392944 28506 -74472 116212
20631 -149372 -2483 -119874 -204608 -119418 -164324 -322863 -118378 -140012 -15591 -9840 40972
20619 137657 72148 -250920 -332 -25764 167766 -69528 269324 17237 51587 5290 95452
20608 95452 -160814 -192645 -245353 29670 -33937 -17563 87227 19964 -36625 -119496 -127995 -175636
20596 -175636 -144532 133056 168240 -171937 -195412 -142994 65696 -32392 -233981 -83725 45433
20584 -105520 40033 -436251 48524 98037 96032 261112 195272 -100433 95039 236405 -75704
20572 -85350 -368175 -10672 -123341 8882 -141686 42004 -88282 -183837 -78482 -7078 81751
20560 -192278 -40831 -127219 -189539 -368534 242655 15622 -44096 -231111 -89867 -144336 42567
20548 -624991 203520 -183530 13495 -93972 -10560 -36638 -20047 209808 -185998 -157137 -262805
20537 -262805 -136647 196851 -278544 66234 -238454 176754 6148 -76617 -239809 -299497
20527 -299497 164537 47099 -13538 -225911 18551 -98467 39830 31671 -73802 116135 -249320
20515 54892 -83116 157051 2891 -161535 -128344 -119465 127978 -55377 35503 -94019 148868
20503 224802 -169590 -261203 -287327 24373 -9021 -298883 340028 215329 158868 -102636 -303497
20492 -303497 -260449 238676 148866 -162934 -11839 -185210 56905 -214743 105980 -59247
20481 -216628 189136 -65417 97746 -180007 -325037 155564 -325111 -191255 -215073 -180034
20471 -180034 172591 -180900 110892 264288 -1179 179519 -51614 173109 232918 206931
20461 206931 60691 145278 217153 -141607 -74059 -23127 332931 -186302 -111829 66680 55786
20450 55786 -203694 -40685 375949 -17137 254996 -36907 -452251 16313 34528 -105489 -249124
20439 -249124 -272146 -77596 -15687 30733 -4974 166845 -150337 -140741 -447057 -105745 36229
20427 -338539 31842 17487 237086 -112936 91001 -257318 -4798 -82458 -88804 -42794 114509
20415 -58369 86376 187845 -95894 -90369 421065 297102 -31522 -144752 92393 -253044 -19780
20403 33047 42172 -163800 -106634 -69206 55734 -323295 -12508 -330887 -95049 -96391 22495
20391 34343 96827 -301905 -11017 -101261 98594 58187 -11955 -222302 -82026 -267522 -49654
20379 -69301 -134754 56100 168143 -162170 -123039 167769 145835 174319 -44625 -76297 -22227
20367 33523 -17271 194817 -32433 -77886 -93937 -126399 352868 -313539 -14055 -288564 -223486
20356 -223486 -92028 -286572 266158 20961 -221733 -123525 -152249 316652 -216334 -187472
20346 -187472 25235 53267 -60430 -21434 -489789 -180371 -78744 -39243 -311822 -22813 421474
20334 -8816 207599 -96766 -15989 -85629 43983 -82192 -229828 -76094 106956 7143 130384
20323 130384 148523 205991 -146025 -319484 215629 -38518 -8997 44738 23902 -81007 -107332
20312 -107332 -163150 -127730 -10866 65499 -589487 194989 240348 -94578 -184544 93530 88432
20301 88432 76870 -104920 -80137 163279 -38134 -173418 -170800 -74392 -122653 57632 -85683
20289 -94966 99549 40506 60715 33118 4241 -161998 52217 -200184 -281175 269117 -198042
20277 266126 -141333 -277369 -131529 -27307 175846 44726 -56631 259210 22793 -43031
20266 283006 -3239 -29499 -319731 -203138 17359 -411080 -135471 -28351 -113694 -48769 -224819
20255 -224819 32080 111851 -99075 -119223 -68046 -175164 -7391 -144748 -131888 -108191 60129
20243 65783 -406594 148901 -134523 -75044 -155804 -268419 -19352 -195246 -210641 -131832 115764
20231 -250106 99368 30120 266081 112446 141455 -17230 -2234 -165507 383925 39059 142728
20220 142728 -131348 103343 -103500 -21944 -197236 -96175 189096 -139765 247167 -300691
20209 -9229 -383466 -262421 -79277 -93366 -341452 261031 -5805 160197 102440 -35152 -57815
20198 -57815 8615 -12899 -116523 -94477 282162 20586 -59801 243823 22042 -258419 -162522
20187 -162522 -353056 127127 -172211 -280307 -85450 -281635 -41989 35049 -67966 -129673
20177 -129673 146406 -340350 -109978 -97987 197355 -198215 48627 385418 -115885 16816
20166 -59251 -151909 -292825 -333649 -107540 -220521 -403268 -96691 -287089 -44600 77131 47389
20155 47389 -248649 253519 -67528 45842 -189570 -488422 61680 -215415 -402867 82536
20144 -189202 309376 -73733 94432 -70470 8032 141127 -100399 -197364 -84706 75379 -67555
20132 -88663 351829 -489152 153934 144919 -143513 175783 -132739 -346768 -195016 -360902
20122 -360902 201599 -92547 336598 46824 -156873 -154808 57661 83590 -61561 -362260 194436
20110 59954 -55971 -132856 -97346 -11716 -216511 200797 78429 108000 88341 109363 -218 240738
20097 -287696 -46353 61672 213637 -184409 -118867 148291 -33823 -274068 204579 -112707
20086 25850 -1934 -11631 34981 -203743 120297 -4087 -2057 -319403 -256469 118895 -94123 361391
20073 114096 -157306 14179 143101 124620 -449382 -231187 22835 53795 -2538 -119609 -39616
20061 -258430 78117 174247 191001 -83940 -52640 114210 -67318 -118378 54798 46554 33437
20050 33437 81392 36432 -269630 -156397 -214548 71270 688 -284830 232701 124225 56606
20038 -8505 -74120 266780 20032 -146233 3160 -123745 -124715 180456 -161265 41094 -320554
20026 -150372 -32150 -189238 -240737 -197348 -209381 -180291 -178709 -40799 76625 -168098 80850
20014 -268034 -207419 -35565 -265481 -268874 -194162 -258818 96553 -111449 26638 -388428 -352919
20003 -352919 -328093 -112572 164598 129185 -37931 96842 164502 -41402 -30696 -109927 -181220
19992 -181220 176150 101237 -53538 48611 -199132 -81041 -98917 -102555 327434 -117999 -220171
19981 -220171 -148007 -158875 -81991 257905 -309425 -149887 464506 13225 -13670 -341462
19971 -341462 133565 88999 -54862 -273599 -405565 -56725 43790 128613 95999 131471 345917
19960 345917 -14694 -71439 -243084 -101984 -52186 -233089 21084 114660 -188290 -372335
19950 -372335 78532 147188 -51020 -111207 130560 60110 871 -139715 178869 -243875 148223
19938 -42333 -169423 201884 -99479 -193128 20872 -99341 131449 -236580 -49234 370963 -75577
19926 184845 -320855 -308518 -95313 -9582 -130345 113237 103544 -111941 -308192 -29290 -153622
19915 -153622 -102124 77786 -309497 79622 -47017 110886 216329 63450 -124259 -119922 47732
19903 -402132 38078 -108345 -115795 381109 -75274 110220 181965 278624 -244541 6863 -21645
19891 189007 -109390 -285792 -117686 93839 -78617 -375154 -183124 -54889 -361705 -213931
19881 -213931 -49468 -152833 377754 11748 151538 -118924 216664 -60862 -229135 -382942
19871 -382942 -61730 -208085 140225 -97414 6306 125356 161789 28826 106140 259672 143578
19860 143578 -30797 -196516 128371 -37832 -85269 -26250 -12905 147527 -172499 -43367 -118095
19849 -118095 -188678 4933 257875 58606 -10796 102194 -195915 3072 -202091 -160304 25492
19837 -90859 -158302 41104 -194882 7470 -178174 -78923 57104 -124294 -297896 182824 51257
19825 -172914 -222279 63181 11645 -49303 171453 -123574 -295843 -291559 149235 -151889 -73493
19813 246151 -156131 -277808 -443666 154405 -3697 -106423 69169 120191 288663 -293491
19802 66102 -288788 -67807 -130481 -36489 110563 -126510 53563 -228164 139349 492216
19792 492216 233541 -211318 -9465 -83164 -279107 133363 -27998 -714 84246 134187 -128611
19780 102388 -323755 -138933 16225 9518 -312229 -94878 -103641 -128494 212137 176285 41473
19768 -195634 122551 -216134 -236273 -79793 -167680 -258322 -76955 22405 -79978 142023 -189939
19756 277011 -499336 88579 112628 144869 -116699 173889 -200486 -351265 -133594 281298
19745 -94119 10111 245272 229726 65218 -146248 -153986 -116188 110951 -131314 -226486 -241907
19734 -241907 -535986 -45826 -8459 -217142 49056 -117917 -136197 103398 -202171 -175440 120244
19722 -315484 134090 -207950 -104204 -24771 -80621 35084 -197217 301110 120924 -263197
19711 258151 -446723 -59336 -29957 -98557 -46366 47361 166308 -236522 -410291 -317688 -77451
19699 -253305 -227000 -24764 -189715 -55202 170515 43366 -200862 97866 109376 242330 -75714
19687 -213982 -263436 -95947 -98832 287820 -394331 -79968 -151730 -262034 -60796 -89921 277422
19675 -166051 -17037 -16124 -152029 73608 -216810 -76564 206002 -152144 -42718 23263 -327312
19663 -235842 102877 111326 -27315 9938 -315246 -49058 147494 119539 -23507 -152851 50156
19651 -267597 -181864 -38476 -101663 -185856 29263 102439 -329160 -414 -318901 -218342 -493413
19640 -493413 207458 -54370 -51688 -214322 155649 87160 71063 81928 -4605 48885 -225429
19628 426063 41989 -197797 -102230 -254947 107309 23195 36148 70114 -447456 -74671 15510
19616 -12474 124624 97794 -153829 -88772 -26364 124619 -43700 181563 -325587 300292
19605 -166002 73576 122561 629175 22033 -152805 38882 -105228 -188282 26576 271885 -47807
19593 -182526 123035 143557 363260 -364389 119160 -125434 63796 174838 21064 -264286
19582 155849 -46551 104823 -179975 2953 -54985 -86998 -169604 116637 -342449 -118540 -89887
19571 -89887 122394 26971 160883 -156525 -101841 -60013 -81326 292827 -79534 53550 112322
19560 112322 -100352 -133124 -249171 -190991 51908 24254 -59501 -342594 166353 207722 -224849
19548 55752 -177775 -194866 56267 -242181 -83126 32462 -151584 -204640 -190377 -345037 -311080
19537 -311080 10677 -325802 -74196 -177299 73777 -211472 314495 -93171 -226837 -160354
19527 -160354 -10238 -214368 -60411 -146551 -114453 -229763 -82431 208090 177453 -101151 -4332
19515 -11042 -142880 -216772 111495 39008 301462 -291105 -10378 100955 109724 -62206 -187237
19504 -187237 -113061 176274 106030 56736 281746 51693 -298902 50831 298608 -102556
19493 -187414 -161045 -29290 -169154 -251173 154905 4498 64758 -10715 -94690 -57066 65141
19481 13409 -55171 -166488 -199195 224714 64239 -29379 93275 77801 -117927 103390 -602
19469 -111873 -214828 79435 -47562 255329 98474 94227 479234 533066 -72667 29009 220751
19458 220751 48042 -207223 121346 -323457 39673 -190205 -362906 -281695 44704 -175787
19447 153196 110567 -925 -117796 -88742 36717 197850 20907 -58231 -56228 -116380 -321062
19436 -321062 -95502 228673 -18723 -194290 -36547 -265538 -195236 27517 48565 8756 5607
19425 5607 154360 -85669 65586 -78705 -222632 -114891 -267490 133457 -324996 -233150 -102694
19413 113765 -34914 181531 -23217 149084 -28176 73238 138793 137040 -57168 -34722 -301603
19402 -301603 -187690 137612 183704 -239796 -119091 -47105 -241096 -185047 -395978 -43947
19391 122409 -117906 -301683 21502 -322142 38208 -62765 -4587 -85279 135213 -146186 -194192
19380 -194192 145009 120266 -131692 -71095 -200950 -22814 -125058 -297278 45840 -285067
19369 -117462 -117045 234202 -71297 61755 178788 43343 -316144 -75423 169133 -27007 -361637
19358 -361637 -139560 -34014 -151381 -297941 -156053 -130466 -15838 -400043 262061 -81577
19347 -63952 2422 -351230 -305383 -248791 169019 -10992 -149152 -95671 -85118 -260452 49046
19335 264781 -39520 2233 -333207 -119027 -96338 -243848 -177283 -81580 -162427 -97740 -133863
19324 -133863 192410 -294354 -18644 -248407 -146932 -106157 236616 -62146 13690 98343
19314 98343 -42839 -53721 -261473 -63863 92453 168998 -199899 174344 -278709 5614 -93822
19302 -222928 -330744 115175 125044 -61134 275032 -347200 -26570 -263671 50493 103785 -336443
19290 91849 -259004 214014 -600562 -144875 239568 277259 -215200 230198 83067 -150731
19279 -285718 86818 72921 41660 139640 64248 135704 96222 -100003 61720 -89606 514162
19267 -163396 -127771 171034 -230393 98290 12134 4446 100516 -274279 -301671 -65800 284905
19255 -29182 -29466 -173725 -88602 146993 -320999 124705 -235924 194742 -345245 4366 16200
19244 16200 204791 -240421 -66764 -11352 -126586 167870 -38606 -255636 -283534 53813 -232624
19232 -105373 17941 -32477 -11809 40952 157235 34754 137970 97163 134850 231817 180007
19221 180007 -13060 -171281 -184345 -234830 335684 17369 -89191 273980 -109663 55943 -118218
19209 -250595 -131242 -203301 127093 -118481 83295 -74944 -371758 -405325 165149 30718
19198 -351442 -200776 53394 -271337 -153266 94953 -110764 -116627 -232122 -289744 -262059 332408
19186 -294038 -56836 -103534 278561 -19988 -109720 165125 209541 -66509 -173650 -242415 202075
19174 -386400 45628 143606 -162751 -174186 51360 69364 194408 -201304 -40092 160474 -291622
19162 217328 -210158 -47461 -113097 191925 89054 -7500 -88894 22327 351118 28764 36194
19151 36194 -10522 27296 -382635 -37783 -40873 -97863 -244461 -103772 -176856 -34309 -28562
19140 -28562 -158808 -62405 -84567 -11126 -98283 -144842 -178901 -515070 -67058 41693 -61014
19128 82862 -153373 -556069 -264445 9827 -118784 -86339 129478 -138882 218054 -118247
19117 -265703 209473 -254598 -46609 -418 -117941 113632 149937 -225756 187211 404479
19107 404479 -56961 113536 124719 115716 -210037 77063 262377 179442 -81776 -209954 -145803
19096 -145803 -128300 -135289 -138423 -268886 175847 35218 -185257 -186102 -7287 -40240 151767 -305740
19083 -206514 -402731 -25039 -29358 238892 -53424 -193200 -275983 -489015 -217788 127207
19072 140853 257651 -273288 -232410 -32198 -273504 -10435 52218 -25316 -2405 20520 93809
19061 93809 -46780 -134966 -36209 187337 171100 65819 -366148 -112625 51352 183997 116137
19050 116137 -158272 -111144 -119672 -193565 -70073 43933 149340 -111834 -471152 189675 -10963
19038 7485 -116782 76256 90770 16313 -117240 -86397 -121285 -67965 253520 220923 45891
19026 -86659 40117 51620 47272 270543 199415 445 45862 45313 -69808 115921 -192521 -85087
19013 -452869 -16782 206889 -76759 -151558 82625 108886 129217 78196 80600 238197 -70341
19001 408337 -40755 -127158 187070 261694 -23200 11006 -230863 -153850 166756 -131549 -22768
18989 -258268 235857 304171 49799 -177601 -267910 -160280 51619 125753 -169333 -124395 -96784
18978 -96784 -156144 107415 -2842 -208277 -445371 177562 -198194 -84764 -112759 -271403 193246
18966 56912 -74132 -512153 -67 -323305 -245736 319579 -99984 -92734 -20212 121561 -5448 91508
18953 -203341 -31965 221323 -67744 24170 -241770 -137246 -106776 -165466 171513 -251933
18942 -9464 -102879 -8112 -60480 213686 73826 -187255 -186576 43213 245804 95845 -72962 -24176
18929 253948 -343087 -93115 -17509 -169603 120881 -295157 197994 -227649 -31186 -167007
18919 -167007 201702 -8672 83308 -338308 140808 -250132 50650 401883 38702 -48325 133809
18907 -134006 101592 -390778 221131 -28120 -38534 -245844 -215784 -54905 164575 -24782
18896 -16557 -23695 145629 54199 8728 -41095 256148 -85000 -210830 -187828 -80614 -12105
18884 -215057 -91570 -95360 243311 -152200 -115968 207486 -177263 108665 181848 -110100
18873 341712 -86123 112621 22309 -63926 -147908 -226189 147632 -138731 -53291 -135445 -257871
18862 -257871 -56430 -129065 -323493 1392 107909 -273015 -635294 337361 -78896 -106716 -132268
18851 -132268 49924 -300665 36786 -160121 -155315 -93487 -295626 130363 -224536 -233840 -294510
18840 -294510 -100706 283997 125075 -319754 148864 -47698 27917 -274568 80138 -96278
18829 426 -13187 9191 115460 -158332 105689 -43566 -148045 -146396 256311 -95627 -298148
18818 -298148 -224975 181257 151681 115773 40218 -149489 85756 -149344 176986 251346 -164618
18806 432340 65141 -176402 174082 278114 172214 109889 -105438 9100 63648 58445 -74197
18794 31994 140674 -188135 77713 -16379 105523 -51649 -63507 -134642 109906 -13893 40789
18782 -160791 99367 153409 -178911 29019 -50228 206371 -33940 -153742 -62015 260058 -255521
18770 -90527 -190491 -257926 -280040 4966 18773 -104972 -7686 -63518 -151867 -198245 -281223 83931
18757 -184204 64430 -464223 235313 -46291 188238 -54347 -260698 -112633 81800 -53488
18746 -43070 113884 56555 -158627 -58568 -107184 -396288 -80286 -151564 9790 93090 111755
18735 111755 -61012 -107612 92216 3436 20903 -311296 -211890 -11429 135585 162543 -84592
18723 73348 195225 -137685 61544 235200 27548 -148047 22643 -45119 78956 181529 120350
18712 120350 -118502 -333110 -155502 -118869 -163571 42280 173877 -267357 -39059 -129 152180
18700 -150326 -15163 -6165 -87759 -133533 101680 192589 55133 -289028 133319 -3395 -54972
18689 -54972 -242510 276897 150892 -249468 24931 266792 -162206 143570 -115265 128928
18678 -135573 -280495 -329490 -58005 -224294 -380241 276771 -2787 68822 52819 -149114 -200433
18667 -200433 -174476 -473429 16689 -9991 -297253 -98944 -5300 -268026 -3010 400821 -153084
18655 69844 -193320 62182 -126466 -229657 177930 169491 59304 -111191 329541 218509
18645 218509 -131862 -54860 -8600 -37348 168827 30626 -213386 38819 -288712 14824 -286828
18633 64277 -29965 251818 -86879 139682 -139289 179180 -45539 8516 204173 -110782 -414159
18622 -414159 -19906 -182431 20865 -175991 13104 255903 24683 61000 10209 -328971 45010
18610 -42902 -267013 -185301 -44658 13208 -16369 25354 -70240 49050 110660 109658 -143117
18598 -259359 -100667 -2350 37782 -191275 374922 285946 25051 -78131 101018 -97134 -233683
18587 -233683 -126703 -120072 -23277 -55099 268664 -327041 -123571 -362267 -127000 192084
18576 51617 -138744 226570 -55206 -32606 190670 -143301 -20204 -334159 -27312 -192803
18566 -192803 -163049 65603 220199 -346550 -141557 -125187 -12655 -225353 92401 64541 -132895
18554 -188353 42677 -91741 -421938 -67895 -91695 -106157 -106433 -42782 -113776 -155439 -173239 213085
18541 -173934 -306760 284762 33144 163231 -164524 -59054 -468405 -252666 -217552 1822
18530 90722 97968 6014 -300122 -160573 -379107 -154114 -74111 -48276 -186845 -152451 -257047
18519 -257047 -212104 -275114 -120800 -159780 312351 10761 -138819 -87756 -85856 -93757 70425
18507 272111 -87434 -52955 122483 -18946 13831 -166825 -125014 -426151 -254600 -100511
18496 86546 103921 107015 460629 -304570 -194205 -190427 -167532 -117 -92129 37562 -5865 -325830
18484 -325830 -145884 32799 52188 -354353 204758 -494687 74972 -145116 223927 41641
18473 229032 93971 121848 -167719 -216320 248379 -61900 -99509 -35180 61993 197462 -204996
18461 -78754 13337 270201 152235 253887 147323 -344288 103422 -139160 -18649 -297065
18451 -297065 -145862 116674 -7857 60630 119799 -127523 -155062 -202909 23600 -48836 -172053
18440 -172053 -277771 263436 143425 -349585 245055 -288433 22940 -83232 -65732 -56315
18430 -56315 -235081 47149 -26796 -178138 160804 -73345 -176911 250564 -82151 107106
18419 284729 -77774 6071 -89505 -187536 7630 203787 136278 57990 110601 228174 -70711
18407 -49044 239776 -17587 277476 6941 175734 -201867 230135 -84786 121100 22977 -253130
18395 -265171 405327 189032 -145955 -305691 -311444 -296812 -84080 133229 -354635 46589
18384 -320484 -111085 -400901 173165 -313791 305509 138140 47673 31488 -19015 57046
18373 62741 -130941 -119285 120684 -213154 -167177 55332 -321129 -128953 111198 -61652
18362 34681 -208276 -28000 -58337 -125195 16825 -237522 -130531 22066 -249141 -46775 198159
18350 310218 -217341 202896 -73508 -406650 23656 110688 -51691 15469 51049 97447 83624
18339 83624 124829 -182227 -120186 209004 12461 304555 -414185 297203 90242 -397 7272
18327 396624 -88088 -6450 181676 283248 -232336 12596 -84312 135389 -6114 79322 118429
18316 118429 -214698 -590093 348161 658 -200951 -365771 242067 -363468 -141567 -44075
18305 -340865 -253245 -101531 -24122 -26474 46592 -208630 178946 -42842 139767 -35342 -186158
18294 -186158 1724 29754 -134442 16693 62586 -203386 228456 221456 203104 171095 251450
18283 251450 243691 -268321 -100997 -102017 121361 -106396 -173525 -126406 91483 139025 110529
18272 110529 36480 51662 -127032 -169720 -211597 196349 -7096 153421 -51521 137071 170931
18261 170931 201100 167433 -419701 -308712 -169208 -338824 42211 -378851 1482 -141932
18250 96221 177585 -186491 -162920 122182 48040 31358 -165286 178791 -209558 -122758 -321954
18239 -321954 171179 -83429 105078 73356 -60321 -132153 -150891 98022 -38400 -195943 -527277
18228 -527277 -351014 -160631 262863 -2148 -168092 -269885 77756 -35193 -136243 53674
18217 -190219 5772 -82634 143584 -295999 -5240 -114029 -260887 -246328 -125958 217769 -387217
18205 180889 -196290 -88423 -256593 3137 -89300 -102114 -102522 -29969 -216025 66565 11133
18193 -60791 -51599 12052 -180858 -458749 -9307 -150613 -96376 -34932 -193326 -186423 20170
18181 -89156 123420 -212628 -50866 -264212 -103537 39370 142777 -316619 261178 -162710
18170 2301 -49243 -143128 299541 -128479 82493 -246910 -201662 152479 88622 -210030 -26282
18158 285727 -415844 -156682 73369 154980 135300 205283 -284314 3565 -120294 -57491 -11778
18146 -239263 294404 -145415 -171311 -166438 -7212 -108171 87826 -55415 -286433 -323832 -154423
18134 -194636 51906 139941 45202 -148682 27284 287033 -150147 -38832 127901 28118 -3466
18122 142594 41048 -131617 -28208 48900 -180678 -46387 -107116 -72619 -278271 67481 -270743
18110 16853 -153678 72367 231495 -29463 54913 75520 -34778 58203 -175908 65591 -215765
18098 114940 -317169 184921 -211393 -212540 44388 163029 186036 -45481 -208966 19899 88179
18087 88179 -59663 -138226 93700 -50643 -521919 9808 -183018 -33056 -95559 25972 -172669
18075 171005 -90187 323876 -27592 -110510 -217857 -86071 148793 -103810 -225298 -260410
18065 -260410 145824 -109017 84070 -326127 109111 144243 -152252 -227541 460523 83466
18054 -74888 -184272 25184 43809 -320935 182165 -220273 -234642 -184365 -323397 -16307 -112158
18043 -112158 -150568 282494 -104653 123062 224325 337152 69350 -29820 3449 -182928
18032 -236418 -453607 -195801 -320892 -147804 197045 -157055 268810 -175850 -29998 -242121
18022 -242121 180750 57335 101381 134791 268078 -4674 293664 -100657 80395 28523 -141176
18010 96691 -275176 -39388 -96464 110012 64920 -11849 -131358 -252370 115891 37074 58234
17999 58234 -412605 217686 176644 -44714 -261470 -176630 67705 -57609 -151096 -302119 44111
17987 65041 101474 195662 -89320 135041 65666 232947 161875 42973 5982 90213 -30783
17975 28846 -45401 -58816 -60184 -68283 -68803 213891 -172180 -297814 24033 -178591 166204
17963 60827 163415 176764 -101992 -203664 -233905 170189 177983 -172187 85060 -205299 66715
17951 184169 142140 -234344 135046 38026 52043 -23885 99850 -243049 -181024 85601 191962
17940 191962 176637 151263 185604 271204 -197047 171715 -213963 -168763 209205 64174 153044
17929 153044 -1209 -5471 -51722 -114437 187537 -72399 -122517 103014 90345 91694 -219000
17917 -273507 245618 61349 -323468 164272 125827 -32047 70146 -53424 71179 190194 -102216
17905 -207567 -67887 280054 16889 103198 470041 -9311 -59346 209323 23778 -82213 143953
17893 -93117 -44467 -46725 57356 -14317 136934 -41155 -409373 -180224 -252880 -295436 -111756
17881 -113795 178420 -93994 -24489 79432 49491 -89811 -76062 81130 115585 223109 -106301
17869 -264274 -12306 -254072 15099 -62848 -82358 -136117 -247746 231099 -40987 -254207 15224
17857 95948 -132484 -246915 92150 -109634 -90296 -46012 -48765 -228721 -167399 -216699 -30892
17845 175927 225540 -11460 142743 24502 43916 -87276 66720 -145359 -167270 107133 307371
17834 307371 -182216 135924 83482 30792 37483 167422 41908 142368 139106 380003 334206
17823 334206 -43107 -299380 157090 -249640 -135573 -84161 81832 -74269 77095 -269167
17812 56221 -101751 136960 103364 228373 -10589 130798 7074 62804 -258514 131667 112471
17801 112471 -12532 -100310 -48455 -163879 194438 91355 44735 159821 213463 77812 101010
17790 101010 -6291 -177365 -137903 288814 -61417 44967 -130270 -183964 397893 -158755 -227494
17779 -227494 224219 129888 -111091 -346490 69920 -45435 81816 291865 161056 -174266
17768 158140 -46328 25942 106276 176636 88570 -222182 -88954 -12135 50635 -5545 226515
17756 56970 320988 -35058 102019 43366 -54960 -126613 -299788 -87715 -57948 -126589 183119
17744 -18588 -221868 28207 -213245 -78883 308120 -203800 178699 43522 -107374 -174654
17734 -174654 -255753 -33482 -53710 44089 -27070 -336964 -179151 74383 -18242 -95552 281013
17722 244015 145354 3178 -38008 148851 -34841 119598 180394 17959 444713 90240 -50328
17710 -182374 178118 -123287 153574 129375 -21496 -296204 73368 83108 51828 -115692 -64309
17699 -64309 -101423 -40985 4875 -68275 139234 -57294 192443 78562 167131 -184248 299660
17687 -322879 69053 -80354 -529068 152304 157162 -266568 -8290 -345381 -173282 -111339 130525
17675 -146655 63057 9027 -93513 272803 251045 53368 -320489 -167184 347512 -249815 233490
17663 325911 79102 -127381 127329 63856 -250208 62152 243294 226573 55417 395755
17653 395755 105015 260111 -35788 -83716 -495838 160194 130953 -101378 -37996 -81711
17643 -81711 207363 151288 -11587 66707 -22225 174715 -361532 -24366 224640 211387 42709
17631 59163 52983 216955 170859 355470 223727 131566 -25392 36800 -295906 70337 34569
17619 114224 598376 156585 -83664 45229 -14794 -126515 192517 -52156 -38314 -177494
17609 -177494 197495 105264 10046 356786 -99967 187020 32155 -71094 -5161 248104 35126
17597 -341985 63630 -44488 -181695 51083 -80312 -79487 -219626 136079 124901 171804 43608
17585 -80793 -42048 -22528 88429 190356 -164166 -2663 187756 -143964 47522 -47486 91965
17573 179450 -254289 -252024 55079 337329 -152924 152203 -40781 -40380 16790 322020 125885
17561 -226674 -44439 -308555 -317562 -15475 -45450 -74308 124714 82471 154288 17874 149566
17550 149566 269049 100507 -260725 90891 -222687 304358 81370 -14848 108991 -78560
17539 132116 208351 211140 -31773 -49342 -70298 254357 47467 -209690 98848 154510 153094
17528 153094 58397 -48193 -116582 -235881 -172654 476663 -68453 234382 63581 -24788 405713
17516 21760 171327 28451 72611 247764 -208197 175302 -48945 255405 -133357 250124
17505 -231348 401197 248125 -79948 150353 -91238 221153 46943 137422 -9569 113492 14767
17493 134370 461046 -139673 -7041 -76343 278380 -8196 -104537 -125224 127799 77064 -72692
17481 229951 262957 385887 -27162 298754 214524 -90007 -302446 52670 113652 286001 71872
17469 -225047 122445 469123 55591 -48920 100824 73360 129046 409607 -92753 -23666 89347
17457 -160141 157287 143885 316069 242610 279458 69436 55709 -60179 74128 289813 139657
17445 79056 -22854 572188 47367 74436 15837 379911 226372 186541 87725 313114 -188129
17433 161557 85571 248412 393697 17270 137779 73924 232759 321039 20800 237798
17423 237798 112178 84003 240471 392163 463790 144974 211591 307701 103075 381797
17413 381797 15995 371900 283005 218821 93234 125357 275360 25194 232480 14080 193208
17402 193208 -293311 73169 148115 3558 -80970 223133 -262394 -171699 120422 13395 192994
17391 192994 100060 -94425 86738 -97527 61165 164446 -176577 143615 210299 104224 -141971
17379 165864 275001 104034 179132 -122492 77035 130722 195239 250952 97953 25210 45893
17368 45893 247508 -301692 218960 -17433 63259 -7082 411069 209404 277867 -195996 41872
17356 -200641 -46393 -231319 523658 92418 -198207 136236 109367 40324 75424 48518 52094
17345 52094 -68188 340410 309786 119952 -139891 176396 292325 96555 110687 168127 123160
17334 123160 128322 -149406 389743 226544 188305 232507 75378 151492 260579 183703 374667
17323 374667 104105 303861 260127 117819 -216376 273508 -204771 431474 24808 174074
17313 174074 -30272 335166 162503 -80508 255090 508248 185776 285688 173131 574405
17303 574405 321371 487459 283266 132255 364338 148254 198505 99524 128798 535453
17293 535453 89047 -162882 194376 254154 37451 274626 262047 385993 197171 250050
17283 250050 376813 -141890 331726 358921 288576 293212 93625 -93223 582301 420575 58032
17271 -299760 66283 380977 266863 259487 363713 145232 132422 17779 117974 342740
17261 342740 142062 -126428 -169228 202325 461939 -173767 -88627 387965 314142 73063
17250 284855 263888 147588 320897 619749 456437 99841 -249593 543328 270892 -93842
17239 180407 115437 531368 247395 242946 -399771 481703 30040 197680 70528 113765 163008
17228 163008 192797 444827 187977 241877 170805 186366 199179 127770 227122 249226 158990
17217 158990 24108 130690 366080 436026 -17899 127306 180746 -114843 324999 180323
17207 180323 -103870 146108 368840 130880 473024 225706 18505 95137 156505 -61508
17196 -227551 343633 454113 325847 281313 -71866 -130003 341086 69554 200717 400606
17186 400606 330401 124444 370872 348310 274296 -64632 -3352 443893 298150 243298 248215
17175 248215 415702 156767 405403 315486 -5396 13164 434435 216123 432768 121105
17164 146631 141064 318401 589389 198663 145752 -29490 366876 162426 351379 420246
17154 420246 385614 82492 348348 380179 349808 245717 456857 263342 95708 58334 120138
17143 120138 479326 409964 94816 121574 454229 66568 387115 250884 286776 500491
17133 500491 221055 206701 407966 383700 352172 565982 246809 159127 185198 8941 438920
17122 438920 224311 373623 343516 497276 52404 104514 75151 511890 500486 250605
17112 250605 38059 499309 580057 58646 464639 535784 335534 436216 249765 202197
17102 202197 562785 414479 474305 494929 556763 413440 69534 539068 406460 292117
17092 292117 401458 433653 473305 432876 322305 464369 368475 419132 435031 -78978 270443
17080 2611 339036 535134 421687 531488 358360 352365 244945 -1101 344392 449374 261704
17069 261704 351928 303853 547528 484044 787388 438611 248561 253748 632751 544420 603154
17058 603154 225190 276774 465225 952814 200111 997180 519931 358177 500796 401732
17048 401732 389049 472174 406588 571081 663688 329962 377150 361223 363725 372153 781272
17037 781272 131584 282034 718137 494857 924235 660871 462458 586975 492142 444600
17027 444600 672858 663030 263771 620620 625027 266211 782628 519804 771207 467083
17017 467083 421604 585174 727090 450654 623031 958102 487213 621144 700251 419511
17007 419511 880974 198838 663670 651921 578943 583082 794694 692906 394323 612703
16997 612703 782046 626851 314822 832408 667821 624993 588543 943223 658569 734760
16987 734760 947126 488213 637878 618523 937713 455732 574036 763205 768723 585766
16977 585766 484140 879504 553677 934038 768004 950215 966909 668078 794893 700788
16967 700788 979341 665693 991313 997219 839541 911361 778724 802209 1153887 713618
16957 713618 1019617 743888 1006167 927850 1099562 912982 1237641 1023630 1041669 829789
16947 829789 871827 1030251 1146550 1104504 1208608 1109711 1258822 875475 1305240 1517616
16937 1517616 1299499 1035206 1051088 735176 1481121 1317880 1241250 1183067 1666547 1157256
16927 1157256 1237648 1194746 1545021 1199258 1297649 1288515 1077472 1106114 1239167 1284474 1188087
16916 1188087 1193969 1233738 1354368 1623545 1310554 1496692 1224120 1536610 1221597 1757678
16906 1757678 1617833 1194430 1357784 1451483 1540954 1607326 1404637 1925212 1594467 1475480
16896 1475480 1436371 1855568 1491396 1588026 1629411 1888004 1722881 2076255 1993932 1513098
16886 1513098 1692569 1810042 1955716 2150370 1956949 2072779 2092098 1977923 2157951 2188214
16876 2188214 2105216 1888067 2181071 2133498 2202225 2038324 2378089 2323218 2065848 2410680
16866 2410680 2445709 2222353 2158368 2302135 2327381 2431313 2711061 2582304 2705218 2618848
16856 2618848 2616299 2514804 2689199 2765688 2628285 2967630 2976632 3022874 3056553 2932916 3076471
16845 3076471 2788578 2855188 3111234 3112847 3287793 3331643 3328821 3385776 3390760 3577697 3641857
16834 3641857 3334539 3980773 3698634 4287953 3817280 4043265 4203119 4170292 3872255 4086878
16824 4086878 4426379 4289674 4659010 4723082 4912785 4625598 4771325 4979625 4993727 4795140
16814 4795140 5380423 5234187 5575088 5503556 5633726 5826987 5906126 5858009 6253848 6443751
16804 6443751 6279473 6648882 6681096 6931561 6800482 7065164 7161575 7440604 7997470 7965452
16794 7965452 8119583 8251284 8539716 8833282 8971411 8991438 9225719 9599979 9843541 9991803
16784 9991803 10072887 10758752 10889718 11491041 11855221 11884525 12556903 12921917 13447260 13361939
16774 13361939 13792669 14315712 14595700 15099960 16201377 16182333 17086892 17565113 17823991
16765 17823991 18827687 19319175 20257215 21313275 21701868 22470265 23587060 24465180 25788541
16756 25788541 26850447 27756450 29119469 30467969 31841098 33100570 34679040 36702408
16748 36702408 38580120 40221780 42274785 44617646 46955506 49037612 52278414 54972660
16740 54972660 58393364 61821405 65271978 69549997 73286184 78501568 83176269 88664317
16732 88664317 94713656 100879338 107368032 114370524 121985159 129586397 137762238 146204968
16724 146204968 154880771 163412156 172039383 180553495 187941824 194790603 200919302 205892205
16716 205892205 208756054 210190311 210648421 208826308 205453322 200844584 195154808 188186784
16708 188186784 180390541 172009813 163738552 154911779 145425263 137224871 128607499 120613876
16700 120613876 113085784 105855614 99226048 93153398 87564294 81986807 76558004 71967663
16692 71967663 67861922 63719590 60170336 56744936 53581805 50595172 47510469 45075315
16684 45075315 42593847 40417153 38286726 36307217 34907140 32984543 31392420 29977560
16676 29977560 28684645 27612218 25896594 25058800 23822495 23033051 22109556 21315943 20196732
16667 20196732 19422018 19225969 18019520 17554721 16965876 16321365 15514889 15134780 14606127
16658 14606127 14094083 13612582 12999337 12825943 12194481 11998546 11433530 11583091 10770800
16649 10770800 10650435 10268121 9930025 9430622 9349740 9021516 8852634 8739354 8602322
16640 8602322 8077604 7808262 7394808 7676087 7542141 7152880 6735567 6739012 6394869 6514833
16630 6514833 6675790 5949183 5826079 5779407 5760359 5879637 5525018 5257687 5002862 5090697
16620 5090697 4993434 5012835 4305501 4681712 4681064 4507154 4273550 4783108 4706036 4321229
16610 4321229 4125108 3787736 3828781 3865058 4195198 3629907 3806885 3585110 3577852 3033453
16600 3033453 3450943 2912661 3413566 3046029 3268737 3208304 3058142 2872502 2850827 2909928
16590 2909928 2747990 2782821 2740919 2953644 2727971 2576326 2611231 2710384 2446532 2546342
16580 2546342 2234689 2542080 2156171 2344745 2367879 2280687 2242518 2084953 2115158 2087099
16570 2087099 2379924 2048828 1881951 2145013 1939129 1892038 2302241 1948899 1726308 1939882
16560 1939882 2070693 1382888 1569931 1531441 1872953 1857332 1841683 1700663 1474249 1281077
16550 1281077 1621665 1562128 1522966 1623197 1333675 1342257 1636582 1361252 1508706 1156687
16540 1156687 1248226 1693868 1219505 1123529 1442672 1531686 1194389 1141587 1126413 1362321
16530 1362321 1538848 947372 965396 1191070 931731 961625 1189802 1267681 911869 1247791
16520 1247791 943656 991536 1047030 983935 792213 1079870 562440 596415 1057231 1020483
16510 1020483 921676 693335 419223 656858 776206 811313 941869 1037832 733780 1052563
16500 1052563 1010608 544615 843401 838157 828524 669480 917072 803682 362861 728615
16490 728615 701276 759984 954192 707195 795316 776573 724529 809633 785008 619387 705949
16479 705949 543046 722409 370113 705243 913450 866196 987909 711026 305104 705909
16469 705909 810723 257775 790480 487528 593339 458725 404671 524978 840198 834196
16459 834196 758882 533893 446607 401210 619256 145992 224635 144483 632852 466294
16449 466294 644317 624720 211938 271845 476757 188908 425349 182878 536332 581670
16439 581670 262703 789634 395059 696621 390553 220595 539430 303476 178017 786274
16429 786274 168847 814179 600330 88102 589591 377660 429938 450606 705163 353611
16419 353611 398012 380440 325630 416267 226592 257609 648593 461825 233369 270008 564917
16408 564917 483695 309639 374568 292810 438348 202417 569284 339669 174225 173281 283469
16397 283469 523214 291454 464692 227501 344138 256541 395602 305383 14818 16505
16387 16505 715068 371881 229773 2795 186641 142095 486901 306264 316981 181423
16377 181423 9117 662787 207894 199650 300895 94158 81805 248872 519777 630741 132660
16365 286177 513446 257492 493703 -196338 242463 192556 -20292 -29242 188708 621955
16355 621955 277825 59239 182974 353596 -104155 425626 385403 46546 256284 -28748
16344 153866 46405 -57729 76312 45414 -73706 319197 88702 204076 326386 420599 78439
16332 129220 164454 -110185 -58628 24465 400746 307498 55081 13096 80514 368363 85574
16320 312682 -46313 101295 238857 160307 292136 -4474 57873 23850 62830 130130 251097
16309 251097 219461 214461 121304 181484 314874 245647 4470 189803 190407 81784 -197821 165296
16296 283756 50205 273868 176324 82359 -82714 159818 293591 75676 335865 242114 -155508
16284 238152 -78794 110173 380736 172163 301261 234117 203844 108640 125530 196720 76588
16272 -13639 314683 364071 281181 178949 165549 37545 20459 -21896 120011 -42458 297388
16260 86454 389419 6092 64247 11262 165633 184547 -90299 240244 53578 189408 245666
16249 245666 -31278 115663 105329 47607 91764 65999 45651 180679 189868 121547 -203837
16237 121285 -26553 -49598 750 -116543 -412122 545387 145476 103985 35138 -76589 -80545
16226 -80545 -128759 -45855 -212976 40961 -59686 136424 42655 275781 338981 117004 -114803
16214 -22747 179946 -56028 334723 183493 146012 218797 193548 218924 -115168 -139553 62834
16202 69076 355738 324913 -12478 173966 59782 5798 128563 -76864 -234778 157016 143681
16191 143681 -11547 247826 -126789 33628 -110121 41433 -2649 -712 456220 -143396 -105551
16180 -105551 266846 121465 164310 -36331 276648 -132644 61978 8065 27060 137317 143576
16169 143576 81808 -149113 190832 -28166 269530 -182119 11838 164361 111393 217216
16159 217216 119262 -29305 173655 -149975 11160 -160430 -95561 202066 326254 -37851
16148 -47413 58711 -51343 124122 -178558 -214546 -232437 183249 140017 25073 308402 25728
16136 137192 171522 -389805 191983 50573 -26544 202925 24051 -49079 -54204 -62308 21301
16124 -88864 -147860 -151619 262271 286013 -62490 -174920 -283416 -94922 73251 -209205 -46931
16112 -31214 4963 190613 -86770 239745 180342 121560 34396 614612 2142 135492 103671
16101 103671 -12390 -66625 -161904 306579 74652 43938 423042 226565 174201 -129101 30646
16089 108687 211741 105190 -216191 -3381 124570 -261763 -81062 263431 -25556 98640
16078 113494 377344 45497 70272 -3889 -167567 258299 -94340 -25021 12939 -113687 25063
16066 -105657 23652 -54367 31008 -204482 -132641 -36486 -421866 -254929 -213098 -188688 -70636
16054 -483274 -381183 -303201 -73611 316703 -89401 -92341 153667 -284224 23006 -348030 446314
16042 128358 -51002 87846 435395 -561758 -104629 -294381 16245 147782 -74650 -68496 -285118
16031 -285118 -279663 293978 31695 -172551 42000 37796 22487 -63328 170817 -287240 -101389
16019 248834 -118877 -25865 24628 -84950 85794 -60973 -485773 11944 222995 -154360 -424465
16008 -424465 -146459 -71881 -36666 -150730 -132189 14383 21659 420156 -134445 51390 135677
15997 135677 102379 511870 -155629 77477 -80014 -24905 123977 277014 186376 -407701
15986 65 -359966 286706 -229811 -67485 -212631 1912 160601 368128 69290 -16685 135911
15974 62490 -107528 121194 190087 246114 -218880 -256994 2460 -145429 130877 114725 -136629
15962 54763 69210 -133722 -55384 -76908 3866 -343455 86166 -146620 -154430 296881 -156486
15950 316984 439772 -31535 -77344 -61765 -111411 -80841 137512 -86899 -125962 -438261 -439359
15939 -439359 -475182 -49689 104686 92008 -198005 126829 123144 -76799 -162272 124124 1036
15927 -71924 220469 -212080 8365 -98322 -68448 -126645 -115843 -190069 -349918 69970 287003
15916 287003 35097 -150730 30150 355076 -451384 -252567 -264762 198294 229846 -27451
15905 -243206 -296963 67552 277076 -143276 -92049 326143 169798 44569 150439 -393174
15894 4162 -254188 -91607 -256742 88962 8047 -280100 30113 -98935 -47645 75549 108586
15883 108586 -82764 400899 58151 -95635 -194533 269058 -12003 -15343 -34755 -267015 -139526
15872 -139526 20212 18651 13321 175972 -2845 -167669 -61833 284857 -62448 -117020 -84658
15861 -84658 239486 56092 9618 -275533 87717 -268482 -192922 -112945 363777 245100 -195430
15849 8819 27980 -72708 151308 298209 -6962 130167 68626 -69931 2134 261980 59161
15837 -151904 -19687 -269970 119389 278823 -144973 -122546 -240094 17174 -89999 -118755
15827 -118755 210011 -47501 -341698 -110200 -175747 -144960 154794 -121739 50847 157260
15817 157260 27829 52414 -228221 -124058 193052 211339 315710 126559 137004 138828 -320744
15805 36915 153953 -204546 -91401 -44520 301505 40209 -307655 25024 -124784 45375 -395805
15793 -133437 -81104 8205 230900 -62229 -33390 -246054 -49738 -249998 57347 -190195 31613
15781 83802 -109492 -79894 16517 -140700 30439 85561 -127884 -62823 -99184 -20386 -103911
15770 -103911 -287869 -395515 123118 -202825 -411445 31714 -84798 -134488 -259315 -71248
15759 68424 -46022 -26736 -128845 87152 29952 74730 171947 50582 222426 59039 56463
15748 56463 203185 20945 215037 343304 -49045 -75199 -202528 212688 85025 14501 -268456
15736 46533 -199613 -195753 322965 -176525 -68029 -290570 -157331 282079 -199962 -423613
15726 -423613 -113051 -65014 14513 20633 -183628 -206850 -215547 -62368 -62726 170968 -107781
15714 391 222419 218789 -22976 210777 -210479 -137045 -322047 -83163 -245261 -69191 128485
15702 121903 9091 -169891 -197807 -147715 53531 -6591 93913 6195 105893 -127370 -173100 223268
15689 126043 187083 144 -130711 126423 219697 -358196 102878 -40518 -23168 -187054 -364098
15678 -364098 4568 -170460 -288707 8550 -72804 117797 8158 25476 146674 -97879 71600
15666 187075 -24377 -116890 -131224 -110900 6530 19935 -151837 54179 -88138 203648 34674
15654 265200 -116027 -327360 -290022 -46456 -184528 -46225 -67517 155251 -342971 -221496
15644 -221496 -90010 -158578 19157 -177245 77186 12562 118473 61374 172438 -232042 129773
15632 -59389 71806 -335515 68322 18666 90055 -112115 -157305 -71996 -122817 -54037 184076
15620 189498 32894 206910 56273 -234514 -9173 30628 -311414 -38478 19574 146116 -151822
15608 -163425 -14133 -120227 85562 12744 258809 -75248 115530 -201557 203353 -75012
15597 263248 -148247 186790 58689 -354282 74682 24707 -173485 443022 -108314 -57272
15587 -57272 48306 154491 186917 -301704 140421 -17081 -156733 -131714 -54835 261442 -108029
15575 240205 11924 77794 91858 -64347 -97231 -246672 -125284 125751 338294 66717 -77289
15563 83888 -144394 117250 35509 -101099 -229335 -10228 25786 -460163 205964 -31076
15552 -31623 -195114 -128103 351056 -63060 -193966 -21503 74071 -7303 -229267 -289359 159670
15540 -172391 148151 -15422 276039 -257536 -117593 -304921 152163 -29355 -72237 -91394
15530 -91394 -93729 -18792 54387 -110251 -188759 144623 10658 -312802 166835 -103460 -77220
15519 -77220 -5819 -6470 283921 -59672 186410 229113 11368 54393 -272147 -77814 -66348 248793
15506 -48961 36063 -191877 56781 305229 -127135 -172469 -270015 -247401 49159 -285794 -26235
15494 110908 -149533 189709 -106346 -10099 140393 106084 202269 -127624 -194032 120049
15483 -187686 -123895 -177202 315635 -89538 154475 181046 205947 -166113 -12965 -39330 59617
15471 -130612 91354 37186 -342396 -76025 -40369 77743 193738 257050 -322847 -69510 4465
15459 27157 214041 -88150 146045 254763 -234364 208140 445562 -184981 -1997 158450
15448 15005 -30039 41813 -91438 -175897 -54753 -19791 195958 -61443 98111 -79884 -349491
15437 -349491 198242 -246 -77559 241281 -41400 -18260 48418 -72672 221019 -43082 -174912
15426 -174912 55973 -314335 -264827 102935 -4485 -64335 127314 -72780 416514 194167 182653
15415 182653 -93699 -32349 -96767 -185383 -133426 -120479 -154740 -196981 -203124 -42005 -287293
15404 -287293 324978 40946 -125966 -35493 -34857 -118912 101964 -182584 -77745 -166579 -122699
15393 -122699 -130446 -53249 -37434 -135449 12587 -25371 160393 -44140 -73199 -77583 -88749 -188611
15381 -188611 71649 -65679 -217716 -50328 156131 -148873 152079 -198070 315806 3495
15370 225232 -36010 -148614 -590109 148489 -255062 156971 190509 236221 255691 30650
15359 -148221 -240357 -36049 -149785 59393 -245231 84269 190103 42680 3048 -112670 237582
15347 -79397 211795 141478 186336 -119835 98001 6378 56038 -58423 -148612 78851 45848
15336 45848 -107424 105087 103469 149451 -357377 -28628 -98219 -95812 103807 -119003 -126962
15325 -126962 -52430 51137 158069 -188686 -407890 255134 5921 -47455 -9615 66217 -114927
15313 49900 6078 197355 -25234 -63967 106139 -355588 80873 -86859 -225935 197755 -232062
15301 143899 -63874 -109113 -4210 76515 186605 -29706 -172633 128053 -143171 -4168 78333
15289 110048 82847 124344 213197 -47775 1131 66987 -76003 -177304 99616 -71889 -72735 5350
15276 182976 -211828 22326 242300 -111515 278821 193113 -155516 -241418 232089 53468
15265 71489 62990 22729 39625 -37571 134848 217899 37598 415875 105747 201135 120643
15254 120643 -181241 -62144 -138046 2607 -95176 601318 1254204 1549750 1009522 1607310
15244 1607310 900932 229621 -42127 155976 -17808 12383 145725 -269675 -249308 5459
15233 -151237 47597 178546 -192484 90428 -219979 -39670 -7698 -72414 -2470 298162 131814
15221 393037 184356 -43218 124089 259333 4484 122307 -139481 152490 237291 -110082
15210 164350 -29033 -26473 -159951 298507 294304 196793 209180 -148421 -30563 169720 2752
15198 455360 225501 -205012 227194 282145 124224 -85013 312122 63383 119259 -231755
15187 -84688 -20269 -31812 262397 -74975 102065 243987 142710 325922 234720 38434 129431
15176 129431 -192 243363 314211 198147 234505 218848 209802 47115 24221 37763 -228792
15164 244704 10051 -40004 -99945 391921 95696 139698 -153246 100153 215553 54437 76608
15153 76608 -17997 58429 -256285 -142342 -282261 -67431 218962 91702 409069 82894 38808
15141 153282 34014 217784 281179 232759 -166631 -151572 22036 49049 -121138 -137368 82071
15129 343621 295604 246710 174171 59427 97275 749887 177305 281111 -18585 110528 71435
15118 71435 10045 -5923 545262 -263606 -256674 243562 -18425 229623 -109281 -69819 195106
15106 311398 205142 103399 -70279 230338 172648 21817 368502 328369 129677 327648
15096 327648 65305 33365 35644 35842 250707 16381 206411 62301 -136129 213267 315569
15085 315569 -13518 210009 35775 230394 -29308 90527 116807 429016 -4256 -36626 43635
15073 108073 80868 -285800 99132 263944 260932 -267864 22565 209853 253157 265523 291391
15062 291391 204367 147564 194964 254992 181087 261603 89819 119552 157960 43824 185630
15051 185630 364209 260867 226053 -95683 -95642 275768 6917 237197 62618 -8879 -50192 -163116
15039 -163116 24902 60394 356798 101451 12472 332652 135348 424158 145235 219150
15029 219150 197872 7707 128278 174585 60762 -60117 80110 389653 -10688 38749 244278
15018 244278 138454 115990 129414 -7252 3226 300066 211742 391517 -113934 69866 299671
15007 299671 -52609 231978 255996 -23421 237868 516152 235550 203676 139412 100079 206674
14996 206674 308056 435596 334964 342253 314703 85426 85443 626779 160425 261365 249823
14985 249823 43733 -26809 46180 -70754 345802 240127 280480 305425 241804 328320 294969
14974 294969 218028 68153 217176 159228 226087 186524 283802 -68049 155416 3720 85455
14963 85455 126583 139029 204998 142326 320932 356946 -156316 121301 137135 153811 -146947
14951 38257 188578 193318 343280 111646 157150 200451 26782 480486 422723 273730 621801
14940 621801 623 419690 27751 170907 552209 -136959 321778 605358 98990 459445
14930 459445 370345 543414 81230 260749 293941 352640 539932 351377 288304 491118
14920 491118 151478 22640 50965 -22627 -31851 399397 216718 367815 179895 -98571 508352
14908 396587 354308 194098 438560 438119 326044 259163 414833 49659 344859 451088 315487
14897 315487 520456 397804 338859 275798 539685 629918 255845 619985 265412 326422
14887 326422 392900 99128 419184 338778 403672 365830 309255 340735 324610 386920 552765
14876 552765 43016 361392 262431 568297 224377 343088 -1808 650885 601771 574773 293145
14865 293145 384855 368588 204059 341860 208058 288500 274232 498523 -31071 259392
14854 428440 403822 785263 678589 377123 317091 441079 315893 518148 536246 218614
14843 202173 308915 218158 608308 459135 490630 522672 710821 406814 507775 326588
14833 326588 486571 167716 388344 624852 626218 436730 569857 507247 412485 384790
14823 384790 447569 506210 281643 315299 537448 497919 685189 629354 478864 534643 472599
14812 472599 570494 973105 342245 458247 677294 531918 510440 623844 561568 698598
14802 698598 702696 365834 361298 319406 634569 574617 698396 657247 445696 815087 230364
14790 709431 700202 628852 646344 398338 411309 505700 881570 943615 487632 637416 616703
14779 616703 568550 693876 595408 765671 359812 536334 424895 451764 491389 618471
14769 618471 488798 412686 621229 239393 601032 529505 505205 645345 731886 576395
14759 576395 560241 504204 360441 537014 430344 825316 516003 693975 754428 719066
14749 719066 592837 577823 683245 890847 675323 731757 875950 527975 583429 690222
14739 690222 684983 822206 676678 770947 759004 769481 423638 878773 950294 850434 823637
14728 823637 673582 619671 678226 749297 889442 746238 803046 560418 566096 897010 763070
14717 763070 648641 813218 746811 705359 793830 829626 996260 733717 884794 427896
14706 854045 652057 1101663 1169296 946900 937718 892916 1072049 1109390 605648 794602
14696 794602 1252017 1170314 1010607 1009607 1069603 827807 1286678 694283 980567 1065528
14686 1065528 664049 821501 715839 872422 954638 1105168 980560 1046240 1009675 997411
14676 997411 729161 1236331 927110 1251067 940626 1418753 766494 941722 898904 1132172
14666 1132172 1168241 959558 1092053 1153692 933091 832663 782504 965136 943576 803870
14656 803870 1040909 1044514 924897 1012731 1231336 1195299 857074 1121127 820091 1258077
14646 1258077 1145589 1211548 1184919 1212145 1045154 1303701 1031673 1412820 943167 1074019
14636 1074019 1797992 1246873 1074076 1365486 1294956 1096751 1546734 1313277 1234032 1104514
14626 1104514 1202585 1433458 1493151 1384568 1667579 1595101 1411099 1314316 1316399 1844188
14616 1844188 1418134 1548478 1900289 1643684 1195665 1862345 1372167 1199731 1397211
14607 1397211 1704421 1695328 1699320 1351885 1673078 1411970 1644006 1510336 1697274 1529110
14597 1529110 2095467 1938481 1704569 1847614 1619361 2078882 1756000 1706439 1860951 1541424
14587 1541424 1728820 2105905 1878414 1611244 1833354 1733854 1868057 2136769 2035545 1829350
14577 1829350 1974403 2333063 1894947 2057946 2036570 2356497 1788818 1993225 2000708 2311329
14567 2311329 2470888 2426716 2469036 2554933 2765036 2886384 2547950 2549183 2658154 2937408
14557 2937408 2866922 3506949 3280378 3609162 3660053 4419204 4569602 6032091 7523595
14548 7523595 11261842 20391419 35472718 43486476 27683420 12196147 5657679 3495015
14540 3495015 2601123 2544345 2219875 2155646 2175179 1863926 1826462 2017830 2318808 1954264
14530 1954264 2180634 2362686 2548672 2550985 2240432 2692130 2438919 2140359 2125283 2331959
14520 2331959 2496217 2563747 2463170 2910938 2563870 2656553 2748003 2680009 2842074 3139698
14510 3139698 2988501 3169254 2830310 2994420 2847613 3121152 2917360 3202907 3124352 3365547
14500 3365547 3177939 3274794 3502515 3020408 3448920 3327171 3432014 3343039 3120464 3524812
14490 3524812 3398299 3450944 3563522 3775970 3577201 3859137 3979188 3775696 4134389 3603568
14480 3603568 3869424 3970252 3745434 3794594 4152626 4013299 4444311 4368548 4448645 4530001
14470 4530001 4457851 4484940 4147778 4214427 4730579 4515133 4661688 4717850 4582779 4887273
14460 4887273 4890492 5406046 5191285 5002398 5043971 5052910 5347898 5153902 5633194 5380154
14450 5380154 5660480 5369831 5411424 5535585 5530453 5626056 5913823 6026943 6068185 6018477
14440 6018477 6087167 6116582 6444498 6336796 6622618 6677434 6499542 7086003 6713146 7262037
14430 7262037 6876543 7003664 6940273 7291385 7352467 7437680 7525104 7645643 7604921 7787482
14420 7787482 7910672 8204879 8103826 8528947 8574385 8907323 8427239 8659867 8874779 9087923
14410 9087923 9268121 9409875 9361323 9368510 9920767 9902452 10035667 10031159 10343999 10333821 10492306
14399 10492306 10726264 10755942 11151661 11605241 11537084 11986107 11676559 12202985 12066792 12533873
14389 12533873 12794645 13207817 13296770 13538758 13575382 14372300 14132088 14379184 14905205 15027293
14379 15027293 15529424 15534240 15808946 16390460 16545397 17013237 17381620 17482200 17808396 18192922
14369 18192922 19017678 18986876 19226287 19581467 20292461 20998880 20746849 21515644 22227643
14360 22227643 22824520 23315853 23444843 23848133 24443873 24805618 25679709 26323946 27302627
14351 27302627 27405080 28250779 28922191 29588958 30558450 31190112 31628315 32813442 33675273
14342 33675273 34463757 35577379 36461557 37492405 38006114 39683683 40789859 41888566
14334 41888566 43387161 44313427 45623796 47183197 48462405 49982993 51560280 53072867
14326 53072867 55071435 56830649 58522390 60887599 63233320 65094304 67379626 69608636
14318 69608636 72295875 74744553 78254957 80836657 84168602 87368105 90918741 94843156
14310 94843156 98536887 102690455 106912124 111432897 116388582 121741861 127292872 133177624
14302 133177624 139012722 145380506 152492824 160076904 167899109 176194707 185036715 193946591
14294 193946591 203992203 214715194 225515377 236920191 249075261 261932345 275228926
14287 275228926 288849106 303202570 317639322 332531126 347887280 363052711 378176181
14280 378176181 392847847 406840028 420089026 432171608 443140272 452038185 459130531
14273 459130531 463735502 464238300 461286734 458386935 456109072 453567829 450511026 442603671
14265 442603671 432909027 422237838 409968541 396790435 382127957 366953315 351125474
14258 351125474 335983430 320373834 305517399 290884475 277546152 264166908 251325934
14251 251325934 238963891 227120242 216001582 205829826 195552715 185956120 177529476
14244 177529476 169385842 161120474 153874617 146781787 139981488 133821232 127974156 122742009
14236 122742009 117488321 112564906 107404625 103265783 99155082 95250243 91958349 88424699
14228 88424699 84444633 81325388 78373429 75581949 72821783 70347050 67557142 65347802
14220 65347802 63334807 61326650 59012062 57202191 55405323 53496917 52017957 51131828
14212 51131828 49229166 47456502 46141833 44724809 43741180 42540243 41818964 40346837
14204 40346837 39069534 38300485 36695717 35973736 35454276 34556909 33400693 32323533 31546096
14195 31546096 30921282 30383126 29201220 28620838 28439341 27407884 26412136 25774105 25399383
14186 25399383 24959951 24265758 23548841 23049569 22701431 22183594 21720917 21568003 21052696
14177 21052696 20302923 19975324 19750376 19468451 19121651 18544234 18134977 18096798 17777164
14168 17777164 17304676 16523446 16607223 16232852 15649665 15797308 15617512 14894417 14907712 14511974
14158 14511974 14642604 14239886 13498271 13435970 13506609 13487069 12969868 12676071 12417412 12388408
14148 12388408 11962370 12162184 11748153 11834762 11700327 11433054 11035524 10791374 10739643 10801967
14138 10801967 10602160 10189765 10118940 9902120 9899679 9561809 9432195 9608412 9476703 9181019
14128 9181019 9382432 9210551 8986300 8676208 8503440 8601502 8169506 7984202 8156662 8065343
14118 8065343 7594555 7761773 7923386 7552023 7333520 7205397 7324647 7449360 6971252
14109 6971252 7029125 6952873 6866413 6554122 7043759 6355209 6449299 6341870 6362744 6489049
14099 6489049 6113597 6376102 6186899 6015018 6088914 6043697 5445851 5680011 5462876 5552475
14089 5552475 5719072 5440526 5056360 5512970 5281404 5148801 4865851 5235127 5090110
14080 5090110 4990129 5144978 4710763 4643258 4874303 4647828 4606031 4591179 4277388 4616622
14070 4616622 4102222 4705410 4525432 4387228 4372238 4074517 4298246 4255211 4019455 4310375
14060 4310375 3724523 4009596 4148316 4400081 4190755 3904866 3654403 4419445 3356507
14051 3356507 4016832 3693138 3784962 3831708 3809571 3315176 3333334 3456399 3498699 3447803
14041 3447803 3521274 3440936 3248749 3466229 3327999 3476029 3470867 3060233 3415008 3498492
14031 3498492 2817583 3220409 3174454 2982582 3370375 2978320 3166709 2995821 2848689 2880394
14021 2880394 2822465 3124794 2784532 2775520 2797831 2632973 2888012 2960304 2528774 2449507
14011 2449507 2415173 2250009 2530507 2648929 2659844 2444769 2150507 2031611 2401970 2612076
14001 2612076 2117204 2196048 2265677 2136973 2407815 2409716 2167792 2313612 2231563 2330578
13991 2330578 2235439 2946299 3560040 6332170 13639432 28691634 43179235 30705171
13983 30705171 15944394 9109392 6576840 5241287 4109845 3698597 3361835 3339398
13975 3339398 3344033 3045116 2792125 2561636 2375070 2911048 2634332 2356483 2404929 2519970
13965 2519970 2324304 2297330 2429338 2407200 2268624 2007227 1953204 1997114 2152997 2024393
13955 2024393 2064628 1734729 1762564 2214919 1968252 2382610 1760316 1883744 1806868 1919662
13945 1919662 1643298 1630602 1687545 1682742 2093636 1810210 1882533 1617584 1815753 1807839 1789133
13934 1789133 1905369 1683269 2129042 1791924 1588757 1477350 1337740 1714764 1607803
13925 1607803 1685702 1517156 1590789 1643952 2073754 1761483 1287254 1619973 1529480 1895833
13915 1895833 1437961 1449257 1554807 1286226 1718897 1587797 1483575 1603739 1272374 1654165
13905 1654165 1419095 1361406 1236941 1509796 1642526 1668738 1450164 1467661 1331145 1406155
13895 1406155 1676040 1269738 1206882 1510453 1433669 1448487 1153535 1081141 1071854 1203817
13885 1203817 1566789 1135527 1196660 1265986 1391061 1417675 1187912 1136510 988671 1215637
13875 1215637 1047362 1128548 838422 1150788 1075579 1144886 1423917 1211627 918548 1116767
13865 1116767 1284776 1549641 1241274 977234 1091588 1153747 1327429 1190183 1279313 1496818
13855 1496818 970832 1111137 1153118 1065686 1065931 1389208 1092794 1045592 863917 1001421
13845 1001421 1074736 912349 1099101 1338038 427823 1151731 1018779 789957 1197953 941069
13835 941069 1154059 1065751 1247635 1298449 485389 1049594 1202443 1116456 963440 802811
13825 802811 907259 853352 949192 757856 968679 750207 863082 667714 687484 867291
13815 867291 864775 903858 831077 843754 1033041 639234 776512 999657 835642 737059 1152727
13804 1152727 864981 774060 534224 761863 1002117 910044 800428 741316 821249 768947
13794 768947 656292 784558 720033 819315 1197053 1041014 700021 680947 878246 855847
13784 855847 1109028 762531 466354 979685 1057515 418827 729618 785720 407798 812956
13774 812956 803749 725717 698093 714801 659542 814634 1045807 882006 757246 836658 726333
13763 726333 774078 713574 921786 585211 629810 571823 748235 862327 795324 1012495
13753 1012495 582517 852182 867015 732598 490883 1043104 820732 726897 668954 324749
13742 725895 581031 616716 655136 518220 679530 824366 592403 787646 725382 490145
13732 490145 983286 539396 749550 307119 361972 451006 508116 734676 545094 634741
13722 634741 757162 431965 626870 499367 515395 872832 540737 524377 656875 362944
13712 362944 697115 476396 499297 678697 339062 556054 530650 741629 725830 465356
13702 465356 502649 519783 776879 602169 516083 614898 883060 663311 329342 823786
13692 823786 512727 174130 457776 335223 631261 393858 333577 277202 438685 474863
13682 474863 640129 589868 514447 518138 555848 645443 530957 448351 543042 521371 599595
13671 599595 528521 718933 341935 446684 160968 655933 356482 232204 516673 607649
13661 607649 456824 561101 326390 442531 604556 571845 693341 220090 178955 382841
13651 382841 379164 458047 589207 437060 339372 405659 600299 280680 707524 831740
13641 831740 508834 624367 486736 351643 166022 275230 173944 470441 375118 166185
13630 35854 799156 735758 581362 563088 442448 440036 225658 142733 74986 271583 844425
13619 844425 576444 467937 295498 325696 350256 536003 351291 275868 657399 488902
13609 488902 563744 447522 116335 579523 179469 434385 184293 143867 247887 366309
13599 366309 207072 629433 377383 222696 -67567 503361 442871 456334 468484 308778
13589 308778 278916 549957 465758 474239 146466 216058 369354 628017 574576 183288 317831
13578 317831 315882 216198 15071 194169 614486 308563 306956 375513 68795 478599 518708
13567 518708 127053 373408 320229 315645 572904 478664 237808 376139 389174 244602
13557 244602 289356 688167 328354 390928 79351 501152 94863 375181 183758 408136
13547 408136 166447 201402 210991 410569 274389 311674 517679 275004 458044 324020
13537 324020 265318 272914 381448 390374 298956 23059 359965 121522 213122 138388 41933
13525 195812 441729 168787 61242 235758 478581 231291 463215 446673 54811 298914
13515 298914 -31584 317195 472116 257479 275190 373758 447290 384610 245666 184470 282109
13504 282109 329659 355281 128784 172839 309808 321869 99429 375694 541416 362433
13494 362433 138429 507797 229210 238680 51522 142514 52863 170797 176822 187944 362181
13483 362181 268782 437283 386483 437143 308325 287946 -31480 157360 381202 344908 159594
13471 416308 543464 277426 -258821 329383 122018 85195 273815 35929 -47957 127967
13460 369131 -72761 309249 68700 382941 190675 238387 127714 175660 373412 268162
13450 268162 97499 472470 123300 189911 449308 382590 151596 -26315 95868 11474 218048
13439 218048 141569 275425 238935 229766 423959 -353658 417341 17362 344340 219401
13429 219401 292789 279222 161401 94409 195978 224651 33062 265377 37884 482820 358174
13418 358174 207993 -3119 -102124 467169 32022 118631 194244 193163 132474 41114 18605
13406 407014 557246 400108 77599 185528 2623 67443 350281 -27229 511098 -73005 210109
13394 54501 -87645 373696 426169 -54833 314074 294637 618292 73951 159391 280372 728468
13383 728468 312788 106778 31402 12626 265264 415799 293181 -234516 150840 221968
13373 221968 146002 117961 -238647 214078 145544 156260 62266 230202 -64148 266242 230505
13362 230505 315336 304303 369653 72812 396838 100357 222569 446345 187549 -7500 219433
13350 286730 182787 413765 149533 297168 137677 282748 184815 452808 520717 288959
13340 288959 247069 -133274 226700 217433 235347 75527 410909 -82229 144004 -133504 299806
13328 109899 219679 294678 281051 -107224 172205 340712 -39890 313338 294757 204687
13318 204687 174147 73430 264250 158678 462409 222366 392339 192843 407520 273944
13308 273944 364634 -88419 -1688 7862 139663 -60269 274096 -140190 -155131 80706 6321
13296 12418 62028 170084 346247 191409 -25515 180189 152082 166778 290334 411071
13286 411071 128772 -50858 202116 91975 137305 27261 306600 314545 171958 302187 120884
13274 298906 159149 60233 -5490 59079 181952 -280206 104157 290800 -65335 43639 111271
13263 111271 159869 46678 39930 -70997 193572 62434 102061 364180 150651 348877 -54207
13251 -110484 191281 -288558 393468 64995 -73813 33940 324521 114082 7985 15527 187517
13240 187517 95160 37314 -10670 420267 251108 136061 -37553 86663 212278 -67033 140045
13228 433205 90843 298663 -73433 99538 348459 -143525 -38027 34989 -106976 190985
13217 -4039 269012 -51573 -62392 78359 -71271 400182 128379 191750 179974 413845 142219
13205 154560 323056 208987 89744 251730 300252 248624 8384 237157 209392 122574 -8856
13193 -42988 -200725 -50348 77985 -139533 9603 29045 347750 261068 -242504 316409 405388
13182 405388 -303088 166495 107127 370581 -49067 357814 205517 313913 -158669 121491
13171 216504 26786 124520 438 206172 -62001 26161 139414 115863 -5126 31033 53269 -31919
13158 40231 -44960 -39847 394098 266001 -18085 87907 -11645 88448 -21816 289189 81927
13146 142152 -132191 -63347 -90986 93073 -44609 -49803 129979 1558 -198830 81163 -39428
13134 -85995 60401 529089 314980 -30781 390341 286455 172103 272179 103565 -193248
13123 137562 258778 35522 -265759 -231568 25872 54121 77107 354934 -80773 -449472 352861
13111 326855 -219662 282413 66510 244083 77276 163155 -195419 285452 306407 -135712
13100 110792 272809 77895 337382 106142 155447 96587 63524 -19651 -26573 -51808 42211
13088 157119 398638 -14521 110369 -268936 -33731 124610 -81467 -121972 -25909 44062 94952
13077 94952 308349 7733 115563 -64749 13653 -85858 -3154 298157 188763 77344 29773
13065 371052 -53000 465124 191033 -71718 103126 162606 40630 277402 207155 -48771 144176
13053 76923 78803 302339 -96836 291631 217737 477647 539366 509672 151430 -173108 267794
13041 98398 545779 86854 138500 26869 62204 -2442 169283 13353 179316 456929 434885
13030 434885 44926 -3306 -69850 285922 226836 75164 -121016 -287871 82305 315322 214341
13019 214341 25893 315840 121528 256334 136015 283507 195793 279274 64620 321335
13009 321335 115939 295287 49294 172233 87023 121956 76361 -244646 385715 23178
12998 131842 300928 -268612 -28656 84929 -308082 -19465 180327 -219923 102786 -268978
12987 -396827 92350 -172246 244849 364697 -91829 131112 -34346 200708 21848 -39590
12976 18825 -84898 118414 83470 -106461 264418 43355 265302 67044 -45830 544 -19801
12964 74440 -205201 340333 35337 115592 -214669 -82342 260499 -409288 31083 276580
12954 276580 335576 112852 -204673 18692 -117178 -76979 191933 16794 -88866 293011
12943 36042 159314 113231 466874 -188790 5966 30262 142635 94137 -77766 -118686 348939
12931 -20050 -323966 159715 -206016 97307 151167 -26505 90696 583153 83986 370338 294580
12920 294580 82972 -64724 -64523 102595 125042 -27404 -202825 -164162 -146135 364387 151195
12908 47317 97822 -82728 126292 -6757 66607 67600 -11649 75153 81110 50709 -27113 -15746
12896 -15746 40330 -54428 255714 -26888 177333 -94263 87476 242540 151226 -201759 79695
12884 66725 -53951 -127822 -239591 226776 -136833 -75120 7237 57865 55707 264709 238812
12873 238812 119471 275007 -50426 -7960 -131476 7916 321373 -6704 42493 115620 43248
12861 -10728 -217882 -17589 30796 -323429 153707 -128433 45724 -15736 214952 112427
12851 112427 -37995 -169986 369269 41566 335232 94884 204591 -184835 -41804 285679
12840 176 -42437 -38378 142719 266730 292473 -10013 89526 19828 346816 62209 -38874 2864
12827 49241 -49815 118555 -240084 -203872 251487 87819 -8799 79156 -158098 38051 -140964
12815 -155869 -127144 -106789 81372 195081 -46313 87493 -115345 -132067 -241127 -58649 11147
12803 -383833 -55433 115697 -88595 10383 497466 -55741 -193874 -55554 119451 -73490 -8886
12791 84746 -25532 -12683 186388 118066 71085 125912 -27687 148733 -92448 -137236 257047
12779 -85865 162709 -103615 71235 43018 65196 -115660 -87058 -87909 -140715 -93252 217878
12767 -116135 161193 376427 9504 230944 -75020 211224 102914 -38355 274455 170282
12757 170282 142115 171909 302375 63680 -239303 -68689 -166323 132549 -271841 -24259 -303299
12746 -303299 -186403 124636 123861 140836 44001 172757 -153419 -252795 -150560 -46633 -22268
12734 150292 94717 239642 65869 14472 447570 277280 -158984 122883 -2566 -19126 53589
12722 -16344 -5078 131807 -96118 -57407 79677 92091 59123 355171 208340 140550 146207
12711 146207 117703 -195839 -152115 333427 246974 -92553 388478 49590 162366 171868 -39958
12699 311195 305333 121159 674 266451 115008 -183528 171584 -1771 -250202 -232336 -116395
12688 -116395 -195189 -159058 5761 26501 86088 302880 412127 173577 275249 278497 -27757
12676 39728 490573 392654 98566 584310 -186264 -2499 -13206 26650 84497 -117477 180427
12664 325834 -235716 128054 -110257 -8984 301159 -4553 325869 105233 -113985 -38870
12653 25816 818 23271 78379 168714 33520 -79976 -208683 -106226 218755 -112157 95129
12641 -183286 52156 -89999 37866 -89456 -180493 104633 -117294 -70780 -13504 -59841 82929
12629 43100 8128 204740 694439 335269 131307 44731 112230 311890 237990 226710 335828
12618 335828 -135708 137621 8912 103333 -103892 -151467 -165956 86043 -127709 -128043 122073
12606 -35607 -2736 47791 -347988 -161546 -81158 61521 31275 153370 -63767 313526 381905
12595 381905 248976 -23091 -70440 -55980 -134064 -186131 -7330 -18295 -123800 -161415 -42048
12583 129325 -281335 -53097 206549 248469 -358973 -286590 153537 64976 661 -202700 -43674
12571 142875 27131 -269270 71927 -99620 137835 -207450 159486 -268662 234841 -87683
12560 198516 159757 12545 -55597 31535 206708 163710 -62079 201437 174457 137924 147653
12549 147653 -29891 -106897 124882 -28025 -4264 -168365 49460 23889 -166581 45736 -4509
12537 66718 -223834 319557 203570 -127226 -27223 -71760 88563 -31050 130754 -232919
12526 89014 247115 -92898 29084 266891 233523 -51482 55761 7958 329079 -183314 240195
12514 -77235 129371 -60562 55264 184294 255024 -39624 -42141 53170 -57052 -134220 -65287
12502 123354 55971 -174433 363154 23643 299041 278299 259698 -12848 111032 163133 -100446
12490 -11022 -20527 66916 107806 -128908 -8676 81753 -57189 -53784 16149 -36242 -14152 -4510
12477 -58034 -346231 220993 190739 -249704 181739 -117750 -65856 -9070 -198060 53333 31351
12466 31351 88880 133618 233463 46741 8392 124236 -25432 -193632 277560 -221689 63210
12454 59658 -94559 -261011 -120535 180614 -133351 288207 -146479 -83221 -205767 233778
12443 -126716 -89315 -191911 72972 133507 154560 160922 -204076 -205261 -153173 30644 -152296
12431 -21047 183969 -9667 -103263 304725 113351 -80336 -109165 -41337 -6572 -3555 218379
12419 492378 55472 -47972 -139084 -98116 105984 145270 29903 96344 -445400 -311082 209674
12407 19684 -89710 -381398 158285 -43800 -153399 -8274 -156133 203044 69874 -61083 155353
12395 -158605 -60114 164114 -45863 -13878 37036 181121 98414 -46296 43990 -155249 4419
12383 -169210 298087 11062 224363 79379 94403 228177 45937 168991 -42633 42438 169677
12372 169677 -248287 -184522 179925 25155 107472 162673 -180949 -190961 -88149 39922 -231479
12360 -62863 -120155 48475 53370 308046 110089 -173762 291587 -81740 -355374 131329 -28681
12348 200803 125968 157888 -202025 105922 -97030 37378 -52133 -106067 -123369 -192380 90343
12336 -284527 88867 -15685 179579 207399 155787 170150 38560 -108529 92318 129757 189490
12325 189490 210944 291203 -170353 170642 -207809 104144 27117 45013 75704 12878 -50091
12313 -123792 239565 229742 -238999 -88834 -300942 -109325 -160030 72842 -62234 -182095 172775
12301 -240033 -2139 52486 -11623 -205406 -75939 291615 13576 298774 55619 128317 -233972
12289 -265597 36831 -1985 -63511 308015 146186 -69991 -121529 -97379 -46599 -97131 106736
12277 335982 94515 396027 167130 248842 181588 564131 -171338 -105405 -189354 43874 198374
12266 198374 119924 -152530 131846 73350 -119244 -114026 229437 6200 233914 -301742 150008
12254 137262 389492 293879 282229 -223557 177925 271240 214877 -82134 91529 316657 -23686
12242 -8983 -91402 221050 546004 35732 175821 362697 -52990 229320 -2280 -19012 95377
12230 175984 218020 101287 -38883 320364 176368 348 406400 262865 175922 87696 50981
12219 50981 274611 131927 243412 -40684 98977 2131 133733 -116691 33002 -5508 36788
12207 218295 -99570 260430 -158562 368264 27269 85731 77549 -133967 -105261 348027 161530
12195 212257 141372 158529 -95378 119995 23261 308085 19614 282145 295945 -46087 -41007
12184 -41007 232354 73552 606057 215337 -88152 198570 194115 219788 139677 -272292 83592
12172 75182 99072 -189222 469854 -101066 281034 320769 27557 459810 -89241 39798 30369
12161 30369 -134139 123776 213299 -126374 60645 -39477 -69581 44997 122472 -153933 -331379
12150 -331379 284802 -47665 -132173 35812 -140359 11771 74089 -42762 127769 195507 360143
12139 360143 112358 68687 -24482 -238568 243405 -81294 141655 389293 -206612 56169
12128 -358335 5415 -182550 -120532 -9752 -22127 -295566 -287049 -144683 -5423 -12649 -13181 88876
12115 -105690 23029 -143601 37119 59002 216518 -180102 95363 43466 329345 103301
12104 127627 20311 -160405 104669 57205 6742 232653 -82578 -71738 154 -120451 191215
12092 313685 -26443 -82274 65916 107678 -132860 -35396 90145 -23707 -156743 166140 -87129
12080 -17365 -165288 -111303 215694 -243638 84749 137383 6488 1684 145143 649557 1273718
12069 1273718 900471 250667 171269 242444 -164105 77448 195233 -28296 13161 159880
12059 159880 17859 35881 -156590 275711 -40358 112162 -155998 202285 28279 22391 102862
12048 102862 -1984 15985 -84620 -48079 -248313 -102631 -8029 117209 201389 -261202 -205804
12037 -205804 94757 -247420 -240688 274880 -77509 71335 98355 -7701 -254574 86220 -124619
12025 205910 109228 199064 -100846 -91999 87978 170926 235375 47408 -110637 -168064 -268018
12014 -268018 -173388 -36379 -25816 -113321 -89989 89226 110709 -697381 -460641 -81127 101343
12002 165321 37912 25291 -46426 154743 117822 54101 -24795 232668 56581 -75343 103419
11990 -91255 -256207 130903 -232937 213056 82173 -21980 -159394 29695 62463 77316 63006
11979 63006 -405176 -134452 128980 -64336 109639 -136345 87365 5077 -374499 28201 204158
11968 204158 216244 -67406 39718 376261 -67111 -73238 112843 167824 126302 252389 -308314
11956 -222541 27544 97072 70463 42938 -236245 -17835 -33228 163434 -60953 -10946 80577
11944 74771 -132697 -57688 174833 17691 104494 -91233 -191857 123668 106340 173145 -147510
11932 -99002 -214953 -102205 16858 -225270 307647 -141033 -48259 10512 -87932 -2413 -62121
11921 -62121 79401 61634 -13092 -288713 -130195 46487 -84317 -24380 29899 1108 -83753
11909 -195357 -372715 -208066 348115 -190396 -10826 301967 -334545 112243 266623 -386001
11898 215961 88628 94553 -109001 -87119 129050 -252058 -11145 -320368 -201709 100820
11887 -127694 -23816 -66075 34353 -5379 -70003 203839 -231119 -366785 68158 39594 163410
11876 163410 -95306 157043 55525 -159682 127396 -292571 -200581 538 92143 -14115 -180947
11865 -180947 219937 9613 -276296 30015 168098 -18113 -69534 41087 -114263 177600 -155323
11853 -110622 170082 89666 272195 -200774 188787 -7600 118434 -113280 519051 -126382
11842 -29537 369435 -216565 323796 98153 -106312 43446 113804 -133959 113754 -150540
11831 -411429 -104850 100956 -203749 -460162 220966 -7730 -96238 -174221 -264945 11302 -312760
11819 -50788 320481 36832 -23635 43112 46700 -200959 -27647 -46584 84590 -27741 -87334
11808 -87334 84773 33357 285389 305612 120009 5097 122081 137435 -354740 -108754 124446
11796 82265 132560 198571 -285425 -43353 64303 24457 -41650 -211041 -36085 29991 -102957
11784 -6226 -56230 -388815 -261160 -52410 303125 -292436 -7280 148627 192404 -266613 162781
11772 177835 -249597 49918 -173780 83700 -39937 -192207 -61285 -96599 -139401 -116872 -86849
11761 -86849 280002 -223948 -176160 -27040 -113334 79088 61400 -193745 -328495 -39810 122321
11749 -27025 54522 -66917 25580 -264603 1344 -39079 80844 -378815 107352 493995 -248843
11737 51850 -94807 297171 92220 6525 -127346 154427 228248 -125892 43596 -21880 108459
11725 296996 -111601 -18201 524584 51040 -203726 -4346 -55727 -33058 134103 196859 -2939
11713 -127549 146254 97896 30403 -352399 -165676 -105342 -207554 262294 -29885 73015
11702 -165885 -151901 233812 83656 -150981 -193702 -46400 -128408 340853 -198472 172900
11691 -215538 -80605 -197264 190873 -103379 39584 -48803 -93910 275744 75306 719 -298374
11679 46087 253348 150792 159507 399912 -24194 87660 396179 139785 28058 -38883 -27037
11668 -27037 237773 -59769 -131276 126252 272620 -108513 56094 -167585 -5053 -118174 -101309
11657 -101309 135305 365118 25447 2013 86636 129571 210562 -112575 -83018 -487464 245460
11645 1496 444624 44491 178166 -149331 -287293 -144495 189780 125369 -266042 -18526
11634 47454 -12409 -168010 -191161 101632 -137449 -83674 -113266 22043 -219920 208448 -166168
11622 222307 437108 3082 13846 90624 353787 47086 4236 98192 426196 -169572 -30683
11610 94522 160543 -129482 -29569 204630 -132265 -62434 -13211 -126359 29196 22462 81549
11599 81549 214014 119308 25801 351910 150090 51809 -240154 318680 -23656 -35864 -167773
11588 -167773 364997 6398 125525 -114194 214793 95610 168435 219133 376058 256430
11578 256430 181031 -228367 62090 -134328 71993 116554 96670 27664 439424 103042 -268588
11566 -72848 336189 385499 -21375 170674 179332 215855 -217319 -302346 141139 228479 187925
11555 187925 100050 141057 -169038 4399 -116135 6916 42601 -154612 152081 164171 29733
11543 -26190 245138 -15106 -148079 -8840 -148327 -272930 2647 17072 168427 179098 190585
11532 190585 -364298 -79784 186709 393062 -59413 231252 241368 19356 427707 -123253
11521 167601 19328 -119157 -113784 385531 81683 272606 96923 348158 267620 234078 204259
11510 204259 116109 313364 225210 253146 -42619 -106395 125569 283213 192611 -39322 94614
11498 77205 158298 207217 111255 119735 -7340 29821 -4580 -153768 170481 444916 -133662
11486 446677 2733 -58541 256208 222557 -101904 -24505 65097 -17688 -80148 198330 107099
11475 107099 30364 60036 308491 257898 116313 325427 239205 30146 -148642 96923 39982
11463 385826 -21192 -222752 57481 -67616 25210 147833 138507 -156921 158865 11195 463451
11452 463451 -140593 162057 123174 12900 17428 265087 -43217 268331 -35907 90616 247135
11441 247135 229290 -311583 -75380 -359340 -77668 99740 -19797 -138089 -160519 354466 235725
11430 235725 -323916 -224806 -48611 456664 -46287 67642 -180231 221037 146781 -216387
11419 202668 -193764 179049 -200936 42014 28940 16684 105897 -77174 -108676 -90149 26801
11407 -152183 -57603 -165050 -131154 -145370 155386 115084 272177 -29095 313374 231769 337523
11396 337523 -135061 87583 -87408 -63815 -276415 -12640 34481 -334979 26732 -226318 26434
11384 -72177 -65517 -88090 -155525 19226 169113 -23779 -85989 10597 414459 182981 -400328
11372 -73401 -182637 -2662 -213329 142155 -43051 304745 317798 -10633 27895 -104711 -57443
11361 -57443 -25520 11581 471444 -87305 -179736 11479 -81328 88619 -80411 -406039 3355
11349 56690 64161 29259 179903 -175692 -154941 -24733 106943 193396 -141198 -108270 24198
11337 97427 245685 151719 -89951 236011 -66227 138148 33064 127566 -224781 -13246 141020
11325 309871 -394466 -316685 -22957 -8900 326708 -35572 136089 -223310 -64762 41440 213964
11314 213964 14154 -222784 169005 -71302 -115107 41729 317111 -81281 307864 68940 -82216
11302 145501 46980 77095 -54134 -141411 -126821 -246129 118797 -12857 -13037 -24118 -165822
11291 -165822 -144726 -126786 -85419 193568 -158841 -188069 63664 -10957 105395 -131384 -113814
11280 -113814 -31772 -271480 -71849 -53111 55158 89824 115165 69145 -134840 8324 -74765
11268 -4184 268967 -269419 76149 -43244 4305 20631 30650 -15671 -195009 -252197 181339
11256 72954 190830 61408 -354407 155909 -176944 -232064 109378 95235 68271 64081 80120
11245 80120 -1672 -274494 101548 -106121 184111 113342 284106 -166336 -14254 216022
11234 268779 -147630 198716 -135672 -36747 -280072 -353 72016 -273614 71152 -223668 -11855
11222 -110028 -32771 26333 -8710 75472 167960 -41193 -192725 -99691 -218699 -396725 74706
11210 58688 22645 39441 16340 220814 -48374 -36255 67686 -308213 -130738 141703 -264243
11198 59874 -189623 -250661 -406748 -215519 31609 -156096 252754 -368734 -1311 -137423
11188 -137423 1835 -138571 -141198 -294987 90606 -342470 -98885 -23989 24105 167414 -31924
11176 -91148 -48012 132846 -74012 -85507 -181054 194905 -119593 -112651 -323904 -15589 -21181
11165 -21181 -385472 -216853 -437298 -155176 29246 -139076 326437 -61394 127738 133025
11155 133025 -179894 -5062 299041 -14985 248685 15901 251443 -177612 69105 -420387
11144 150105 51683 -29215 256582 -41952 -93341 13909 -181232 60723 -148933 80830 75153
11133 75153 295203 59857 -7079 237794 210500 22542 -188504 51206 174159 65957 -26323
11121 -251099 151322 -36914 -356743 -376850 -286655 114444 -31042 -13581 -45347 5417 56656
11110 56656 191870 12987 -58952 120350 319479 -139873 -107807 275806 209668 196634 171822
11099 171822 68387 120407 -120931 77388 220571 140216 208589 325840 -57655 11315 48701
11088 48701 474649 -18577 473777 90880 598402 358926 230010 365281 170038 571087
11078 571087 155591 259350 402620 517668 27851 323584 -3113 304108 406578 402093
11068 402093 378151 487173 415032 382020 584128 52451 389232 303113 464663 391478 492244
11057 492244 149090 555901 397247 332672 636322 912465 656860 737654 816992 806575
11047 806575 645353 435751 346876 684478 826071 549617 706916 330384 494955 918396
11037 918396 480272 394543 693388 570619 286909 647486 519030 305628 638090 619417
11027 619417 607701 751148 865335 812881 505463 641108 832007 476916 902222 485472
11017 485472 392928 510417 695687 644236 640541 271152 584132 404533 556921 384998
11007 384998 469669 653764 668993 133018 528000 617838 259053 648601 567250 511705
10997 511705 607605 291340 272111 614381 892713 489156 628652 442571 751286 832612
10987 832612 742071 781576 794076 780618 1000180 1049430 1363043 1265300 1373968 1704156 1578170
10976 1578170 1781108 1854551 2180649 2441634 2339445 2744188 2704732 2780367 1713070 2225723
10966 2225723 2268881 1594995 1581262 1378906 1463125 1621184 2017517 1635567 1944863 1970591
10956 1970591 1975232 1802152 1267715 1186538 1045149 912791 601088 574674 173700 353023
10946 353023 82014 108465 361457 163604 145879 366430 190568 173627 226272 -20925 160574
10934 -195277 118346 165649 138424 157651 34518 307390 -68151 -170315 -131843 188626 86819
10922 -67284 153177 181075 203072 -76304 41362 -244612 58155 -127715 -7354 -15161 -88660
10911 -88660 -67574 -473917 -104514 65487 -7324 -386152 98285 350735 -252356 329249 180170
10900 180170 60305 -254723 -360413 71320 16354 96121 -29312 173380 514496 89711 274499
10889 274499 -131156 -19215 18297 -19658 -221264 -13685 275681 316745 -326044 -187715
10879 -187715 -116464 140001 239259 -121263 179963 43774 -89738 -102290 -138244 128674 100899
10868 100899 175298 -46427 68159 476932 195740 266845 121065 403976 -53562 154180
10857 156587 397679 -99186 -34771 -206551 -167421 -215370 -81140 270941 -19693 -315070 -117546
10845 266389 -38464 -112602 158433 -170787 102449 -86844 63857 144797 183371 222648 27755
10833 -352310 65331 101352 28504 134687 -294506 -76497 233890 64564 -127253 -170771 -258231
10822 -258231 -151949 -57886 -35386 -134975 27910 -288420 -225990 -173229 -100020 -190752 126825
10810 -251197 -276250 -161615 -89295 199277 -13544 147822 -217131 73463 -48622 -188055
10800 -188055 -25530 -29492 142023 -127497 6373 -78577 71402 -481497 87663 25861 -313433
10788 -241917 -239451 -222251 2618 213650 -203781 44044 -76264 -58073 -174209 1235 -83435
10776 194502 -217804 -157396 -309449 -26269 -14846 -20316 -181763 89623 18766 -28991 -252538
10765 -252538 32811 -164890 -269905 -184480 174123 -86615 -258977 -222472 -185085 -12398 -240035
10754 -240035 -414266 -1204 53254 -9404 3184 -55342 -19199 -60193 122928 204020 -36785 83402
10741 69329 123248 -91192 -40466 -158179 73337 -218641 281071 -58163 -83757 59095 72490
10730 72490 -221617 -323679 -6930 10044 -27128 -153764 -220162 260721 -242739 -196956 -166038
10719 -166038 -201910 -1681 50835 48790 -206516 -130728 25954 180908 -63559 23574 100311
10708 100311 23769 -156878 -38192 31959 -59774 -17654 -260670 115441 197690 -23189 25629
10696 -156061 -397961 -142509 -34542 -505576 -193170 191902 17192 123322 -185151 -69296
10685 -74980 193852 -88603 -255919 -138056 -66735 109961 -242974 290659 -96897 -104049 -110275
10674 -110275 -211072 -300318 -128669 116558 -142673 133076 -104933 -308639 -83835 -235972
10664 -235972 2256 -240069 5635 33422 6257 -65024 -216531 32453 -55996 223607 -268644
10652 -243714 -151913 168953 108400 31399 -383366 149528 47320 -280102 -34691 -352362
10642 -352362 -133314 -243943 239342 178162 294877 79827 -113492 -128111 -94443 151662
10631 162046 -118771 50351 -104600 -28177 48630 52032 78950 -252872 84591 42676 -232836
10619 -136621 188467 83149 -167982 -217709 270277 -36436 -220358 211322 -229469 61978
10608 -30676 -51936 -174860 156629 -190474 138517 -87934 -238634 26211 66542 -238017
10597 -189688 373894 -92758 -43823 -32362 41997 20581 -107819 -50336 -87613 89642 -213168
10585 -80631 -439519 -257914 -40852 94666 -122563 -197954 -107610 -37038 14569 -167286 -39785
10573 -56214 153085 51920 40123 -89530 -49538 66657 69413 179478 176932 66624 -135225
10561 -54749 -117239 107827 -22366 81873 28797 353100 107809 -468 -18066 -217362 -140247
10550 -140247 251698 178493 -148292 -321342 273704 84936 -314564 -122649 -164204 110175
10539 25957 -120663 121482 -119105 -129232 267737 45200 -76403 -170585 4536 -3202 154907
10527 231613 -242159 -50220 -194646 114680 -145147 -180372 -112288 -8120 127927 1363 -211400
10515 41266 149598 49989 23040 -370547 -92774 28866 -440260 95938 -113725 -86947 -145563
10504 -145563 -124496 -162735 69888 38091 179175 -144294 -77248 -43139 -71850 -49505 -78987
10493 -78987 189800 -155887 -20445 -32641 31640 -19060 -54030 -124282 -210211 198091 173117
10482 173117 343770 483067 319880 53419 61481 14848 191553 183868 -13627 -104537 244840
10470 184771 74231 166415 -249567 153579 169920 -57017 -136155 -325269 -138380 -87796 197647
10458 140924 -50809 25938 91992 -105926 -114937 -50667 6538 108476 202081 -333697 -63597
10446 -17894 -43203 -213517 256710 -89379 151145 -40716 -88959 3623 108300 -55000 4647
10434 -164531 82785 144588 -265615 -275247 -130966 125719 -124026 -158375 -136822 -249796 -48626
10422 -350963 -119580 -234479 8733 48776 68653 131224 -136744 -101657 93959 -144497 -150976
10411 -150976 216011 54742 137434 55379 -99498 12182 -256195 -137747 318473 -3436 -80670
10400 -80670 31965 -219552 -223997 169512 -104560 -107591 32090 331376 -405890 52417 30306
10389 30306 254387 74598 -238396 -5619 302374 -7053 -136163 148679 88503 188392 517690
10378 517690 547404 -43896 440347 86010 171029 106206 237555 485383 -57098 211349 307177
10367 307177 581108 93704 386180 150076 153501 229692 226885 277309 205050 371882 248499
10356 248499 296526 233137 305680 539744 469240 600781 375174 520990 36845 142985
10346 142985 110063 274297 363634 284016 348583 281392 279055 113048 -90233 223065 75119
10334 215200 353207 -196837 101054 376821 -308163 21519 126292 68968 -61387 -12544
10323 235819 -32037 133428 182373 98168 219131 118466 -211576 109773 553 189337 140568
10312 140568 91832 225380 87426 126888 -176630 205383 175641 238368 274402 -50901 28067
10300 -255950 33363 -143140 118164 -138384 -110753 -26290 -168334 94394 141555 140821 144166
10289 144166 -279203 -89890 178811 224685 -81379 -178432 -295879 3823 -240890 -76993 -257582
10278 -257582 -195953 -196610 -62940 -275153 -22994 -20299 -310694 266165 439339 192026 -84113
10266 -121443 -159496 -231148 106364 279204 161783 474112 313547 211169 533819 701626
10256 701626 90568 259530 295005 8483 260904 -73036 143561 77635 111929 33456 -172374
10244 123069 129682 -218135 70341 -124674 103859 -183696 238248 -195516 53277 63557
10234 63557 -133637 139840 258895 -275266 -274832 -180019 -59123 -281832 107625 252691 20275
10222 -372182 -34835 -215907 -253259 -224562 -202480 24378 -74548 24644 -384313 -302633 -215689
10211 -215689 -38600 -44616 75240 38247 -122913 -124680 22135 -89041 80814 -242187 103307
10199 -170514 -95585 -194568 -48982 144014 308428 -107285 -43257 -218571 -457104 -70358
10188 250691 -481374 301252 26773 174959 -105280 -85352 -108648 -8295 18829 70049 110633
10177 110633 -193051 -610795 -181242 37495 -380770 -201398 26731 -147420 -101831 -45606
10166 -229986 -270817 -194953 -191141 -136051 55330 -281265 -136968 -299402 -141385 -201848 -314624
10155 -314624 63053 11260 43540 -207165 -22863 -123926 -166926 -132259 354539 311688 210012
10144 210012 -187026 44088 18930 217516 90330 3095 68982 -161662 -196716 -2858 -141093
10133 -141093 13053 137959 -349225 355627 -180272 198161 -90386 -98076 -83273 -66209 -58280
10122 -58280 1610 326524 -211489 -242024 -126012 -289574 193435 -178744 208798 -377671
10111 -73847 86272 -326334 -85815 73736 -253768 360806 -72990 -122040 30080 -191891 76226
10099 -231591 95926 270439 12951 -342208 160484 7014 -204052 278879 -218342 84983
10088 -50004 -298496 -95495 -335216 172008 -212630 -237152 68538 -144482 107079 -124375
10077 -88758 118226 173726 -349528 182782 -39588 -408441 -46935 -79218 -112837 44981 -16155
10065 -30175 107228 -72500 -300134 -145271 -441037 9784 152789 49364 162187 -110415
10054 7138 -247078 -61394 160966 76822 101608 98996 -119686 40212 -154666 -238863 -129442
10043 -129442 -177558 320211 86459 -23501 -198183 -32527 -9286 -104011 42203 20690 137719
10032 137719 -6901 -52532 -275732 -57469 -164897 -94140 -251599 -117499 -124602 -183791 30049
10020 109228 -47281 52499 217989 -43533 -216146 -276168 -222830 -2081 -16298 -60816 -189120
10009 -189120 182631 -76509 132781 -6845 -160970 -174339 -40068 -198272 -2850 76163 10855
9997 11173 -56534 -74233 395004 -149792 -229945 69700 214551 -226628 -67991 347578 88988
9985 -193994 -169621 -412208 -262017 -371788 -190170 198067 -174966 163192 -141636 111032
9974 110822 -340144 -401355 -54564 -32066 17554 -117886 -392273 -168631 46686 -131711 -187232
9963 -187232 -141870 214800 -97710 -93750 142777 -61758 -6895 18587 74079 -285816 -178681
9952 -178681 -209332 64989 -79410 169993 -279190 -70776 -104201 -312997 -211035 -61087 259656
9940 -166432 81370 -188074 138579 -159810 -207507 -127682 194411 234145 -97668 -101507 -112714
9929 -112714 -173613 -32284 -153854 -15871 39720 -266057 102833 -78179 -57172 -114581 117346
9917 -302231 28456 50023 -241221 120539 -394978 -149193 -147335 -305842 111065 -271027
9906 -13962 -175859 -119957 -175873 125208 97003 -306794 -104098 195250 -274032 -35613 -247197
9895 -247197 -192595 -90891 -63455 -25065 29101 -476746 -245581 -157080 128807 -130541 -116996
9884 -116996 13856 -187923 -176 45155 -482521 49721 -230172 -89880 47167 161536 210872
9873 210872 37912 -103445 60690 220909 5407 -242277 -7711 -23622 -196440 95586 -107511
9861 -88804 -100491 -63305 -188717 -313394 -198972 -297503 10247 -156553 99950 -183681 -65298
9849 -124028 -280752 340094 -211856 84162 189819 71494 199635 250841 -243752 109005
9838 72194 -136339 -122701 -131399 -184277 -89388 107885 22130 -140840 -298250 -15436 -148527
9827 -148527 90831 -138044 68191 -115476 -134206 -42493 109191 -10011 -1894 -141820 -105726
9816 -105726 -82923 135033 -69642 -97691 74090 -2818 -202747 111835 -242396 -191402 110543
9804 29286 96933 175822 168447 338872 342938 -159818 -317977 216587 63220 353491 -557782
9792 224169 38271 -216629 -271263 -154424 158896 210303 -23548 -209593 -262128 -57979 63786
9780 -571426 -149328 -24957 -75193 -47809 -231513 31056 -80545 -450686 -281129 -341066 -144228
9768 -205652 132939 -27485 123266 46894 39757 -119985 -37200 -151844 -185254 -123073 -238010
9757 -238010 -272096 -395088 -92525 -160061 -149766 121513 -124373 212396 -11308 -166730 8581
9745 142778 -311325 144042 -200156 -106123 272590 -82565 -104404 -160982 -284286 98938 -21309
9733 12823 -90557 -460977 -29643 -114128 -159540 -508636 -357613 5832 349831 -8027 205130
9721 -302962 -218088 -40123 57459 -163643 47803 19576 202580 -140292 -49471 58717 53650
9710 53650 78764 98639 337098 -333518 -8596 -1272 187704 -344883 -130965 -250470 -47081
9698 -182882 302459 332689 -107751 -255913 202435 93909 258449 59210 -119107 150046
9687 -220742 64983 61525 -337606 -286882 -20417 204790 -296044 1597 89132 91174 62128 32570
9675 32570 -134296 -97450 -231079 139022 -137758 -96339 -124510 -217885 -177887 -2874 -68247
9664 -68247 201667 -236687 -371027 131964 -157760 -221333 -91925 -233195 9628 71739 233746
9653 233746 -74142 44637 109375 -111383 -174876 -344556 226916 107763 -74318 48785 -135198
9641 77213 73408 -29125 -498279 321000 -109186 17848 -19529 -157155 -74247 22810 -216546
9629 60433 177824 117795 -81704 -104589 -164499 -144287 -156195 270428 177583 -123624 -197643
9618 -197643 31258 -322685 93483 108357 -192597 -71314 22056 66170 77623 -179044 39370
9606 -166219 -64087 -148772 47637 -236200 56718 -74627 35801 -114394 -404026 -233699 211635
9594 149412 -276427 27702 -28891 440096 -276072 -137880 8686 175563 -368562 96901 235
9582 -143628 -21360 245398 -236529 235741 -13751 -85886 11570 -212733 -214427 -118720 -149182
9571 -149182 100210 3452 -203693 -89955 -80698 83717 -45283 -123022 -27792 -75273 -251607
9560 -251607 137342 -212199 9294 119351 -54018 -151163 172495 -304941 -11065 -16863 555
9548 41053 -177620 -68977 -70033 244032 -92049 -47867 -243894 -77390 109590 -89052 65827
9536 -434816 -214752 -108093 113937 -38417 138505 -115178 85211 73862 -175962 -139099
9526 -139099 -199578 -179170 237238 22678 -290678 90645 -100528 -50501 -112807 -225775 79222
9514 -111419 -163244 -90576 119654 -295766 -6980 202240 -167842 21603 -342908 -221234 -83851
9502 -37731 307246 -138742 -100330 -15687 14422 16294 144423 -64966 -107674 -379420 -130597
9490 -160378 -336484 75656 -78361 232240 215903 11721 -137343 110735 -235179 -262940 -287960
9479 -287960 -298726 112332 84122 -128246 -23683 240183 -239500 248364 -258986 -285788
9469 -285788 -290424 -108543 111004 -258360 -139927 -102760 -31688 141097 -97843 191099 -175364
9457 -8029 6153 -218527 -364078 43743 -198813 -114239 -193555 -429868 -148736 -45528 -158033
9446 -158033 206379 -137310 -187266 -24249 -26989 113715 -104616 -302796 -94287 24677 -188732
9434 -180502 -134477 301083 342629 31640 84603 23678 278741 -43188 147819 -232437 334621
9422 44135 -133079 41505 -33132 56643 -286733 -147131 -252264 -117931 154842 172208 -212352
9410 42781 -37267 157873 -81149 -12918 -175206 92385 71101 -133664 -239391 57894 52891
9399 52891 -33186 -216887 -7948 -310774 -247826 128278 -234699 144629 -187477 -174596 -209319
9388 -209319 -58979 -238525 -75286 137029 -17483 -46021 75156 335709 -478657 -11810 136469
9376 32566 -62678 70946 -49610 -24856 -12011 -205297 -240457 24334 -139195 -21763 20034
9364 -124294 118430 -147323 -175954 -82798 -12525 -210324 250643 19115 108667 -74812 -221648
9353 -221648 -213652 -294881 81580 108166 180845 -62639 -45971 68624 -316311 -230704 45682 -229119
9340 -67337 -52246 -253591 30330 7173 54136 -55558 88302 -40469 -106565 -97481 -43508 -275353
9328 -275353 -294050 -10312 97756 -311986 -381155 -208513 169492 305826 192014 -208215
9317 95481 -158976 -31010 1495 133020 -96720 4238 -219132 -30194 -249180 179813 63658
9305 97628 -105676 284676 11747 27889 -109496 -35969 -38500 -288215 40787 143021 -237008
9293 -27664 -129940 28045 66917 -117294 -27533 -373971 -140747 -28944 -148895 290933 96792
9281 66108 172701 -43888 -80206 108175 -483187 120424 -2444 108448 -90200 167075 -72113
9269 -140389 16967 67431 2568 -19407 -52812 -148124 -316756 53073 200380 35674 -395649
9257 70233 -226023 4812 -194819 33004 67727 341692 54668 -119070 -5263 -416430 131854
9245 -52350 -272717 -279546 81223 -295277 45487 -29861 101970 -38212 201885 -200593 -95612
9233 -3945 -388101 54540 -168563 79291 -375660 -150948 -187470 -50732 231537 236224 -318653
9221 -277708 184188 52582 -223812 132644 7000 -81732 30785 1933 -320893 -154968 257599
9209 -211739 538 62881 -197470 -240304 -33619 -68052 6675 286693 -98597 128743 -216074
9197 -291196 6897 -145835 43755 -128661 80470 99863 -33777 -51600 -151330 -211462 -24907
9185 -143716 -253009 -253090 -41173 -60321 -100624 153272 207889 -12601 -161252 4246 -314171 -206397
9173 -206397 -113555 -5096 518366 -169269 -232086 -33978 -209687 100870 -200448 -276395 -176774
9162 -176774 -225048 -143357 26825 -157321 -12730 9765 208266 -299540 -186675 101036 -206488
9150 97301 144704 81274 172823 -88438 -55013 -439611 12387 -91768 248627 -7774 -13700 -97920
9138 -97920 -176362 147805 106748 -393724 97617 123287 229998 -96659 -26209 -129839 47005
9126 -335942 230193 -332865 -186892 -119422 82882 -100371 112867 -106379 -13096 171236
9115 -61263 107228 17913 -96834 -265577 -209124 -174954 -511394 34885 -99467 -53483 -66945
9104 -66945 122148 313130 105410 31324 151122 307131 5749 -253910 -494354 -115806
9093 -226047 159413 22688 -115618 -140988 -330977 16686 192335 81857 352733 -196067
9082 182824 -206674 -371478 -43382 -13215 102187 -2500 45823 -305662 -100362 -73469 -196588
9071 -196588 -93268 -86908 -189905 -134727 -53510 -145365 -55696 24087 -278701 336622 71043
9059 -82766 -83411 -56379 202371 -99070 291956 -234966 -505508 -174250 -119011 -292920 -158772
9048 -158772 -46672 -359272 98701 -30894 -30608 -214267 229950 156863 -44541 -117090 -273847
9037 -273847 -152521 -98419 -134109 -32953 -135849 -235618 -93810 -238737 135746 -88250 -451849
9026 -451849 -253943 39056 -49262 -14395 -75718 -138224 -85218 94697 40024 13172 205721
9015 205721 -26131 249671 6727 -235965 -92285 -63584 69115 -5971 -113298 -208238 -7134 -93101
9003 -93101 -38013 -170674 -187907 -51990 -368597 71216 99449 270003 -228780 2472 188268
8992 188268 217436 -213829 -137998 -338112 -18511 37910 -204157 80143 78356 -92663 462897
8980 -290314 -56216 44192 25615 -15916 126438 -60477 52286 -73915 401916 -127201 -106405
8969 -106405 -93215 212013 -122173 -214132 186910 -135401 -26934 227984 -325337 190784
8958 -415952 -217970 111071 -2450 -259190 -253560 -16293 37597 23935 -47096 20581 70270
8947 70270 -102273 149193 -89380 -61946 115972 -312025 74367 -24029 -103078 -240078 -18787
8935 -110151 379062 511103 -300717 -206528 -328547 -166059 51524 15993 232250 562590
8925 562590 406112 1220122 3027139 7417545 13033049 4380023 1276477 219027 471106
8916 471106 393540 143521 146842 133544 127930 51429 248088 98336 411092 235459 -194276
8904 192353 6801 763 -46879 -275728 -94160 -187956 116186 37471 37702 -112431 -220989 45446
8891 -432824 48211 -154647 57749 -519156 -25161 -541643 97287 199283 91296 -147125 -176081
8880 -176081 55929 100096 70040 111668 -209765 -105394 -251066 -258112 -215947 57217 179249
8869 179249 232810 -304447 -224991 -108863 -275429 -67883 -217453 -142112 -216052 -347218 -140380
8857 -24281 25085 -137103 109358 -271928 -174904 250924 7083 -224081 -131566 -289269 156852
8845 290838 -109277 -55568 217337 -400908 -95586 -1631 -211014 -120906 -209911 60139 64579
8834 64579 -221926 -182803 -219056 -271400 -131474 -511494 246040 287280 -190992 40588 -198891
8822 -149086 144503 244899 89931 -279403 -245337 -257305 62696 269335 -125556 330718
8811 182148 -239923 -197090 42672 72895 220466 59650 5196 -311284 -15083 229007 -136771
8799 -96269 110745 189270 139664 -91008 69928 -16094 118937 49092 -425102 -66156 -150067
8788 -150067 -222808 153903 -185032 -83340 -133977 13759 -365647 -162759 -230492 375568 281300
8777 281300 -169231 199359 -24410 -374913 -73550 62140 -91494 -174662 -116878 -334454 -66670
8765 -148676 -254066 -186028 -238989 -547709 -277419 214899 -81462 -11747 104329 -98069 -57174
8754 -57174 65411 -25418 139617 -105666 -71681 -35389 57442 -190639 -302825 61713 161632
8743 161632 -148870 151225 128833 -29472 104810 -85369 181169 103017 -75114 -153760 42116
8731 201841 -137394 -314297 19225 54519 -152234 -572860 -29935 91611 -87640 -216720 195789
8719 253287 -160086 -102210 14078 59431 174703 154874 -162656 -32915 -99262 172514 -220817
8707 7176 -47943 -154807 -114777 -45884 39495 92682 -16829 -9654 -109627 -162524 614 -125322
8694 -256454 -13047 123899 -83339 -295552 17531 93792 -129698 -94385 -145902 -255503 -259255
8683 -259255 305758 -28839 -33084 -197465 61584 -70034 -79164 229833 -93945 203388 -111528
8671 -241410 -385094 -407648 -83014 -46062 -91778 -33175 3964 189276 -157119 -38488 -260386
8660 -260386 -9257 -198452 -137072 123317 -102590 256354 -38390 -51365 -315472 156741 -386450
8648 72048 -82444 -78399 -83215 40842 -3190 31032 91241 -219267 29370 295560 -229441 -316939
8636 -316939 -99722 -11405 158650 96493 72035 -187111 199238 -2486 17171 96034 -18383
8624 46947 -213180 226609 -457343 -4842 -132542 -25927 193967 86588 353542 -61849 116008
8612 -42016 331002 -185047 235630 -188309 97555 -157354 170698 -211878 -143424 24527
8601 -170840 -212919 -8589 85560 93652 167809 10787 -137263 -71386 -53759 -9751 -134035 -145921
8589 -145921 41089 -330829 87110 -139617 -167511 -165426 -337147 -28501 -110360 -79602 256950
8577 -17103 -173080 149066 -225714 93220 -377242 38 14916 255383 28270 149796 -191985
8565 -98780 -189655 -350858 100145 -552218 233389 -200876 -123178 -162733 -75383 -16769 172416
8553 -146369 -62882 108162 5266 -124028 -51289 -71591 244280 269102 -61237 238291 -73660
8541 -74836 -283558 -263107 -174090 -461297 -266574 -192622 -173862 96719 -106843 -237531 -423826
8530 -423826 69728 -125383 254428 -39735 297490 119055 115225 -379317 76138 163157 -152007
8518 11195 -264080 -60784 -115513 67887 -165908 -190258 -181489 -149653 204021 -260970 118870
8506 -156903 -153139 131558 65594 -165787 -185573 -170622 3464 -32143 -179466 200096 -316079
8494 -118182 301035 53480 3164 -115911 -44024 37942 74417 -105076 17110 -185948 -71125
8482 130927 -150137 157393 280643 -104 -150238 -505378 -238249 61232 -134225 -64699 30178
8470 -399892 -184421 -453904 110988 -118620 246622 244304 -112317 -152817 -137967 -77977 -529896
8459 -529896 52698 -51923 67218 -351609 -187009 -148559 62064 -173818 -212605 28259 -442475
8447 -154681 -353360 45253 -270380 -23705 -9055 -8263 147195 19905 -113040 -80001 -84078 12589
8434 279079 -355420 209465 -99924 -60090 -141349 98396 159247 -235778 -339425 23976 215519
8423 215519 256444 109183 -68362 404546 117668 -33092 -174551 94449 -12907 -231300 -252720
8412 -252720 210300 76531 -297688 -400843 126047 -64948 -103030 -136619 278195 -144340
8401 174578 -219340 12569 -132322 -22372 -103592 -230372 -87643 -200400 69158 177439 276810
8390 276810 -140999 236451 38753 -357610 -48318 -14098 43374 -188170 -13304 11040 -57855
8378 129237 2769 -371730 -143247 -69556 -115276 83062 -13447 187343 -44204 -281175 83259
8366 71480 -283283 -4404 -51541 46157 -27546 46910 -63601 59717 64303 -47221 -46808 -25997
8354 -25997 -18077 -283225 -36521 102779 -76339 -112647 61191 -84576 -330186 258763 -160268
8342 -330152 -269669 -106682 -70712 18980 -142403 526100 -112621 -99442 -187688 59129 -56718
8330 -90681 130631 -369681 -58563 -182965 -309416 -165688 74052 -230110 -42722 28027 -423283
8318 -125342 -178737 -139279 -171645 -196843 -323090 202211 -219729 78766 34741 -213470 295588
8306 117029 245408 14196 199837 -198447 25286 -264896 -38489 -34236 -5207 -56186 257147
8294 64885 227091 -23750 -95383 11655 -147682 -9595 -307626 -113910 -595321 -100416 -125920
8283 -125920 -266774 24463 93577 86494 -87359 -180445 -230701 17534 -89335 -23547 89662 147897
8271 147897 -186682 -275836 60970 -318955 -325710 36053 -141196 -300111 -7332 257212 147335
8260 147335 -217901 -67157 229029 62660 53547 -135163 -492893 -43356 -157771 24504 -26619
8248 19458 -170003 -38854 -32940 127677 -26418 113591 -36492 -17848 86579 -162130 -218060
8237 -218060 55774 229433 -100446 -231836 -192549 -194063 -168474 -319415 -165999 -41529 314398
8225 -97036 344059 -102937 -141633 133147 -178171 208765 -172626 172805 -160475 98083
8214 83477 207681 -111561 39389 -79741 -107338 -183831 -42952 -5558 320581 68173 -84060
8202 89139 -284856 -114659 -92853 -125977 134409 268305 -206637 -81996 4384 219714 -1633
8190 -163780 89836 -118342 -266143 -77554 -108559 -67456 112573 169969 -275758 115864 -212941
8178 -94741 -299486 -80984 195637 153786 -81151 -412850 -84769 -390739 -77242 -118639 8868
8166 -336898 126415 -84729 -254285 -204581 -388546 -201386 145460 230088 -131569 15038
8155 -333170 -192002 -278621 -24910 195041 -191348 145704 -30299 33287 -145971 -148835 -149722
8144 -149722 -23619 229878 144322 -270566 323538 60030 -94316 -130031 210796 203415 -120719
8132 -111383 113216 -61538 109905 -557 137738 101265 -176016 -285738 -274625 173172 135760
8121 135760 -491025 -16828 77644 -345552 139090 -390523 110361 -168200 -58171 -115912
8111 -115912 126746 -116907 -190192 481606 -90583 -63573 8139 93597 60289 192652 -213323
8099 -161154 -237905 20682 -178526 -123904 -52087 154857 -23927 24312 -304497 124469 77077
8088 77077 247214 -117679 -55672 173286 25564 265987 -139494 -27855 213115 14007 10077
8077 10077 47953 -128700 -311045 -273954 55630 -216039 59525 42560 -17497 71205 -41530
8065 49984 220068 147769 11138 -70404 -320488 -14145 14251 -226973 -100600 -257421 -140526
8054 -140526 6416 38907 -19523 -169137 -172589 -145391 -225833 -78379 33996 -70695 -54823 -29974
8042 -29974 -317767 -254995 -310947 -14661 74339 -77654 148856 -66296 195294 150316 235337
8031 235337 -431426 33921 -377635 324892 -53083 -55835 69459 -221889 -245995 230252 -125194
8019 -115202 145309 70598 -14305 -103960 9240 241842 -104611 193816 -148147 -78711 286769
8007 -38796 29066 95541 -11480 -268064 177305 73464 275028 -159812 -166082 -244988 -98615
7995 54878 146814 -333027 -161080 -237237 -330124 -75125 64483 -186731 150676 119158 214993
7984 214993 83479 -126470 5183 -53269 -28001 -52243 54502 -68157 -48380 -5558 -253253 -149946
7972 -149946 -178855 116107 -135760 276069 -109801 -324867 -74915 -100145 182868 -251946
7961 360810 -29361 29175 -134247 -7971 26515 -9917 -102072 138963 16419 -411149 21900
7949 93819 -144505 -196051 -289477 92188 134430 -205722 23422 -172034 -375034 -94986 -205178
7938 -205178 202580 -469486 91664 114596 -193822 -93269 -91421 -220316 -66091 -168401 -35564
7926 169571 9836 -215074 -59511 -78602 -50506 -114897 -166574 334634 -102442 3276 115836
7915 115836 266656 70948 -28560 -54726 -138694 -45250 -147691 -16662 43462 -303305 91312
7903 157732 167462 -81911 -333538 -96491 34063 111490 160379 -89575 -99050 130494 186000 -5114
7890 -46433 -38961 260196 -150713 195302 7756 219188 -90531 -253341 -169055 52987 10564
7878 -34255 -28180 -221194 214862 -45801 -32522 -399560 -221481 94306 -67388 -115438 51569
7866 -108680 51653 320719 -201693 -55431 16823 -249713 75382 69277 -399956 157788 -32791
7854 35035 -138103 -46646 17186 -167159 19738 -56405 -33618 -189274 -89780 -52724 44249
7842 -154156 -171517 50109 95545 -74288 -154890 -65218 -221038 282982 -27396 96535 -314696
7830 -392203 320121 148319 -232716 201156 50176 167538 70050 -44211 59778 -270590
7819 -93966 10003 -146182 -316122 -209811 -76906 -58689 -82586 66280 126601 17965 55064
7808 55064 179213 74201 -160988 -197924 154987 -109850 123982 -6125 115793 -180407 -223265
7797 -223265 -55774 -73581 368814 172109 -32534 1964 87467 140565 51840 -219188 32922
7785 -185234 417179 -2962 -40868 -153381 74604 -133156 -50571 -155432 120630 128861 -89863
7773 -61475 52524 -33897 377588 -49861 -39831 87930 -269621 -45819 -389537 177401 -110778
7761 -169012 148134 -330088 88805 71673 205188 -219180 336803 16970 -179209 -218036
7751 -218036 210005 97952 126034 -200357 -127559 199877 72272 -177505 -262760 -57958 -11638
7739 82791 -217705 -29761 47777 20210 254960 -49743 -3829 -239100 -674078 -274458 40653
7727 -10361 -192390 -136712 -25383 -41738 -90033 34418 -118979 193594 -180742 -140694 -147953
7716 -147953 -174397 -74861 -80673 44221 136224 -81957 -111306 -8591 250672 -82265 1191 -160273
7703 -87453 236013 -105413 -127110 -75037 78756 -82946 181246 -5020 27468 138154 58040
7691 25053 -142380 17488 97044 168254 -183646 34585 -210221 -34883 123383 -114329 10210
7679 -87225 312872 199674 -163016 266686 -329686 -203919 -75257 43774 -173953 423612
7668 -50111 284650 187731 -519756 -340701 262096 238612 -81717 -311605 -310008 24527 -221308
7656 -110580 155251 10961 -411904 -22188 60589 -164916 -39737 -62377 -84793 -147263 -56399
7644 -164471 191354 15233 -235026 -9658 128112 18535 -96366 23522 102724 35936 78846
7633 78846 31722 -9321 -55567 718 100760 120899 -93897 -113680 -100465 42133 -290245 39016
7620 -261309 -108633 154264 -156414 -380888 128124 -338386 210011 181819 -8820 84117
7609 -199489 160280 148244 220358 -193505 -51161 111402 287614 43242 28191 80904 59843
7598 59843 -19955 -155803 23388 94684 -237486 -27949 -316611 55263 239608 166345 262694
7587 262694 66773 -183977 -127928 5281 -167840 -29223 41996 -237183 142180 117807 -58318
7575 75450 -247076 -97450 -230168 326775 -81288 -219303 201663 153851 -163147 263647
7564 268042 339616 52785 192241 92177 -199192 113071 -46172 67040 -215577 370 -223415
7552 79713 60268 130754 -98790 51923 98263 -89430 -91078 243201 268201 -327002 -198915
7541 -198915 -66469 -291693 -15869 171644 -135847 -276538 -78570 -11702 -41810 -76163 -169
7529 -253014 -142579 -343025 -1385 8239 340112 190913 2908 151105 -247466 -65056 215451
7517 -271213 229219 -416813 363771 19775 -396356 84789 227126 104433 117306 70396
7507 70396 -112197 81123 -67113 -270221 -33420 -130447 -81072 -108690 -196424 -143031 -195470
7496 -195470 -240803 -36569 -184975 99721 117149 226504 94100 -42262 197862 -320765 78662
7484 -368900 -100806 -149747 -308535 232114 -105605 174206 89121 160134 -189356 188116
7473 13650 -227042 -123882 82717 -321839 -413481 -127226 -98878 119567 91612 -145200 -172486
7462 -172486 22789 4376 -138766 186351 -147502 205768 -204400 -116830 -118408 -281794 164729
7450 -27259 89136 -428467 -190682 -9921 316492 -26604 24037 248742 85816 12250 -334169
7438 113052 105415 19970 92617 -78895 -28107 103592 -37995 92386 -266907 23648 162079
7427 162079 28112 -178245 -8777 -189050 -38641 -138641 -137879 -6573 -82736 -102217 -209504 -213338
7415 -213338 -16542 307040 46950 35087 -127468 62076 1241 200353 121753 105102 -30782
7403 285008 23148 -86744 -100141 -188189 -185078 -230363 -222839 -122947 -265994 -64785 32072 -54550
7390 52147 -303479 256242 -405287 -14494 46004 87 -41782 -169169 140100 65028 132353
7379 132353 -169569 140887 -100021 -81660 13189 -220950 -181408 -255196 96735 83902 176012
7368 176012 405373 -207975 432696 135679 256080 35860 -254231 105863 -24007 76958
7357 294996 -259758 168902 -217463 -121074 67183 -257965 -283056 213495 133808 -95818 -74728
7346 -74728 -62594 -77466 22960 -79289 -141750 268861 -201625 282063 90015 203813 220690
7335 220690 -178692 -99493 -131518 47220 145742 191808 -267112 -398046 66088 -33208 237467
7323 83128 204543 260762 -251352 83449 21664 -225840 271555 -259737 -217243 116585 124762
7312 124762 -108985 303748 22938 -227115 -90525 -226150 -40230 -6490 -76716 -36179 21668
7300 159884 163035 -333832 -150276 -85533 -187146 -39756 -110417 -17515 -194926 -185531 -337778
7289 -337778 -10347 -111528 121485 -43737 -271917 -105761 -68922 -153240 217774 144886 -384588
7277 20907 331457 -134589 -33152 -108792 -123787 -220564 -252845 142735 308162 -219586 5321
7265 -148609 167786 49431 -133592 62636 -5709 93370 -497071 13211 -106484 212899 -51030
7253 136895 32394 187255 126490 66381 -137948 -52433 -63597 126909 -161037 -9985 -121104
7242 -121104 -131111 30264 29380 -445287 -130455 28183 50630 29169 -119165 250171 -85664
7230 202933 -3926 132086 162329 189585 -204199 162737 -118355 -140057 -53998 140880 -88225
7218 -258588 -3783 -108575 -58980 73308 -51852 -258211 -241590 330609 -17086 -228899 19845
7206 -57688 -73939 241201 171834 -229824 -155033 -3837 -171329 -162513 -102474 22474 77387 -323245
7193 26221 60415 76707 257687 170708 -37032 -129841 15640 -137818 53775 -91538 91278
7181 -139062 -188164 -196600 -110648 204717 -1015 -47001 -18013 -123573 -132939 -90996 -184884 -93949
7169 -93949 -12070 -145381 -152875 -165502 83690 -107585 -121486 -192409 -68896 -32437 -133899
7158 -133899 150580 -115876 -30183 -51002 -238420 99778 -3370 15589 152821 -101500 88242
7146 -216643 -158484 290846 97936 -191712 -59811 -347759 -129941 418567 -144481 136110
7135 -173678 179486 -106566 -163620 315341 16504 211116 -212636 88138 159437 -253183
7124 12271 18685 101190 35989 -198585 -2435 32517 23328 111979 -264922 -127832 62974 -72071
7111 -90971 66050 -85676 -163918 190360 46722 -73675 243680 -144714 42032 -240 -49599 117181
7098 68244 158606 26233 -214940 283240 64109 -137384 72625 -129414 73590 171366 -305309
7086 -324868 -363257 342844 -40610 73319 -179965 -135336 -252366 -180937 59080 -197762 271136
7074 -82257 -361094 93910 -27662 -145616 -131452 -13386 -224558 49705 -5292 135146 295559
7063 295559 145543 176025 188370 282517 -103185 -114511 -86745 68596 -92802 -204800 -73890
7051 -200723 -151273 -226810 119030 -41540 28710 -14540 36757 -112211 -173488 11260 -159551
7039 185869 -75366 -183087 -12543 110692 111488 112250 -138698 -58762 -207278 56712 14453 44487
7027 44487 -12324 -105406 90167 -276398 19513 -233766 -282365 110582 -239934 235888 -132582
7015 104876 -223288 -52588 67359 235058 -26786 65132 -296749 -35834 -223839 -349465 -316383
7004 -316383 -94834 -208796 32250 230013 13445 325535 -218018 28022 -41401 27823 -60691
6992 -98306 -214537 -359313 198573 171172 -78218 313813 -168691 239804 -110093 -86714
6982 -86714 265176 -95260 90105 -189245 23957 33636 -309282 -159351 67581 -295342 264994
6970 4784 -293421 -35692 125249 184922 -140961 91735 106652 -239937 -364035 -176712 -102974
6959 -102974 32468 -92424 86808 -49860 -192260 -120104 183772 8124 -219728 -254800 170890
6947 35772 192276 302577 -18560 -55254 -82898 -35959 95422 270725 -333343 66366 190915
6936 190915 119848 -25529 384360 -178103 -218386 -78916 173489 131350 -64852 -366747 -297975
6925 -297975 -168914 34387 -8956 -108928 7124 1682 -285806 -142165 -264073 166487 -61638
6913 -129279 45383 -4422 13578 -251959 -535539 -119043 205508 16544 -131750 -186865 -393355
6902 -393355 -155014 -207909 -23494 142916 -36752 230131 76591 -114476 233855 -100184
6891 -187553 -454976 52908 70369 -429594 1561 -90678 -359959 56058 -346501 95868 40573
6879 -13641 -164554 289843 77307 -101859 -65863 -10055 103078 -72430 114795 45054 -98256
6867 -49242 202518 94244 -403182 75426 -93896 175661 -161744 -94708 -196271 11699 203789
6856 203789 -79817 181959 4690 -15363 92983 166354 84351 -420126 -77590 366922 177770
6844 -294255 27966 41612 126968 85295 121875 -6496 75100 75552 -99900 -408730 -84164 113288
6831 75596 -152710 174135 -165898 -36957 -353332 19376 72988 105163 139176 -396305 -34937
6819 -45773 -79534 -182809 242220 148680 54765 -226197 22261 -78892 303629 120965 -117111
6807 59034 -90490 -81779 -55094 79229 -186122 -104794 -100665 288764 -87640 -92803 -51790 -379723
6795 -379723 -165720 -32765 21629 152542 68879 -16002 -145902 191603 4936 149276 -110413
6783 74657 59774 -130842 -51882 -100345 259167 179612 345368 18955 -51475 420773 168949
6771 86684 142425 -126113 -99527 7068 -342197 110977 15978 83181 -48667 7800 -278993
6759 251652 111586 68852 -229072 129313 487004 -132811 -96487 -83214 -42128 313837
6748 48354 115947 66279 -293376 -42857 53184 111787 418671 -105343 -394009 -19550 363979
6736 7668 -358156 70212 -248880 -287194 -15723 -127690 -49749 175830 235415 220672 105117
6724 10665 14680 -370873 28394 47693 -237599 231778 -406363 26933 -151568 -202534 127981
6712 339407 -91014 -53793 -360654 -89448 114852 167036 -16064 -155883 -151069 -43299 -51168
6701 -51168 48325 -84630 -342844 -113121 -42720 -186290 -270878 53049 49046 -76646 124385
6689 -175927 -263478 -298750 -63099 -148737 -133177 329076 383050 187649 49537 -285141 -139496
6677 -418838 398983 303817 -260989 -140657 -3153 -63259 204959 262852 49571 83759 38509
6665 -104903 245806 295576 -46406 -242676 -38863 112900 -50763 101774 166431 1285 16796
6654 16796 38826 -282985 341801 -155873 -452830 236682 94979 -144533 463457 -30060
6643 -68988 -63183 5966 -54984 -130512 -31287 -60681 311310 -18653 -14825 -36642 -45704 -202912
6631 -202912 -137259 168821 -181261 -68550 -152065 -60262 13498 -64970 67240 43435 -85542
6619 942 78967 -55991 -73810 107968 -208189 -263369 8312 -10291 -21926 215606 -197825 393037
6606 -77911 49193 -139524 22831 -180558 -87549 -78243 74657 170858 -131009 -168890 -9312 11434
6593 -11658 105455 292350 -254012 271786 71233 764 -129676 12559 -38279 86969 -213101
6581 -201807 257830 80697 142169 -47857 151907 144249 18516 138246 -47741 84406 67153
6570 67153 -155115 -84234 -214704 -190542 -161963 82278 22079 -157805 -69948 38941 -9604
6558 -410821 154181 149734 -52244 -322198 -187473 -43883 -140541 -25841 -274093 125766 170111
6547 170111 -17258 18604 -192001 -148629 180400 -184686 117967 -287959 -46152 105297
6536 -31776 -283650 68765 -61251 1702 -76941 -60878 102080 -322198 84555 54083 -5849 185582
6523 161847 -171726 -80936 -76849 -395404 -292318 -147420 239547 -362361 -50772 -89042 -381774
6512 -381774 -268676 -35348 -6264 259765 -153611 77090 -185355 -100613 -237923 -171899 -40046
6500 -263165 -134306 -217521 -9640 -23447 11282 140668 -90576 -369299 -22500 86141 115387
6489 115387 254441 100115 -173000 -296361 -261999 -107579 15399 -2677 51479 -20791 -248741
6478 -248741 -61928 -172069 -5168 142214 66944 -197331 -6979 -138616 13500 75683 -50723
6466 139673 77643 -174528 118313 -10546 278801 -32276 98672 82487 -115650 -16611 -153056
6455 -153056 45917 -33495 -136534 -113299 17944 410684 -348577 -9490 131373 -154430 259538
6443 119772 370668 -129859 -68033 -8108 -390346 75082 41487 38716 -191019 -273684 -100979
6431 -27707 353418 -60634 -6617 25850 -258514 14599 2744 66500 11041 -98809 -213430 -97353
6418 -60507 -61903 -70139 613241 -113260 171088 -46275 -115612 208899 37619 -179673 -148963
6407 -148963 178030 68096 102077 50911 158992 -111797 173230 68899 145787 -266690 94361
6395 10551 220313 -337117 149339 -206576 -287738 11158 -32857 -43997 -151330 -57170 -187748
6384 -187748 -330107 -275138 -94404 22257 -96800 -277070 -146739 135526 86503 258694 37225
6372 -84012 -281426 -3797 -19043 54014 -55166 -147130 -449651 -44585 444124 -35234 135164
6360 80602 380458 2898 -287608 -269959 -30947 52246 16299 -33112 -120552 64192 -61212 -238446
6348 -238446 -154097 124646 49933 -266600 -215858 -3945 -85293 84957 -109083 -354307 51139
6336 -197952 -152268 161302 -140513 -58782 19364 -94389 91675 -103001 -134846 669 -117123
6324 162941 -68016 -90508 38203 25509 -224525 56210 -84540 91348 125516 -317593 -30019
6312 -254227 -66793 232757 87799 218519 113938 130649 297469 204817 -135191 -40337 -2144
6300 -3894 -56908 -24991 393931 408670 543262 -234719 60951 54531 -150202 -46071 -331339
6289 -331339 -140701 129395 -93160 88654 110009 151482 -283631 -211483 117060 -87138 276174
6277 -139725 -244033 -97273 193400 33522 -174898 -57523 -319462 -86909 125837 -1821 86797
6265 -46530 -26451 129008 -127223 -181747 104855 13941 391516 308059 -285315 -196474 17288
6253 81606 67400 376476 90646 224015 238241 -118850 -68622 105544 -228792 335242 61843
6241 -135848 -54838 -68570 -266127 126440 178070 -190744 -155861 -375793 -109934 -352382
6231 -352382 -322780 54592 -22683 178412 -173395 -152289 111975 247492 -146870 207775
6220 -169741 324138 -57605 77941 48383 26603 -79494 157530 -63394 -172854 22743 182800
6209 182800 -97166 -132438 123641 -68549 -134494 -254395 114451 29587 106425 -37753 -277167
6198 -277167 -135378 -39659 123303 120826 -45620 125383 42339 -20605 115715 -408052 241083
6186 -125921 253090 -109077 78120 6579 -145649 -4303 -46436 -264014 37835 -324359 343252
6174 -133437 -279656 61330 147752 -14817 149615 47206 -297200 -101720 -179424 196693 -127032
6162 -159649 16169 82463 41536 6884 193618 13521 63516 -135618 -9469 -198271 98200
6150 155061 327421 -198878 -219968 -37111 142429 -141774 -303223 -124430 126421 43726
6139 277003 172154 -82598 -270971 -127735 -28750 -163253 9170 -285117 110613 168834 -240847
6127 173342 -52725 -228613 -5185 -24613 196977 -193325 -75778 -100111 -94873 -35301 -61266
6116 -61266 56170 369395 -331329 -182677 1010 -358700 87093 164135 28271 85563 -40920
6104 123021 70601 -126144 -284917 -70005 -23004 -173270 -391099 43382 -141062 -127688 -20725
6092 -68297 -116443 2219 126446 142418 28638 -58965 -149304 -102178 -4661 -170622 203146 186762
6080 186762 -93339 155804 -106575 -64645 -3784 -131108 -54638 -44712 18328 -142063 6165
6068 -98878 -189902 -4362 72208 22092 -98114 -412196 83241 82191 43470 -29553 -275285 79287
6055 105788 -37614 -51546 24449 33183 -37568 136210 25275 55047 220321 -176325 -610600
6044 -610600 -40847 -102280 186951 310141 -75154 289817 160910 -99972 -53288 -174657 185688
6032 -378841 141102 -312727 124401 239247 -76546 98910 465086 -463285 29407 28131 -75244
6020 -254563 -86816 102470 -35478 -42238 -61205 72142 -24340 254353 35246 112656 87060
6009 87060 154030 278549 -94023 -89778 46752 -9115 77022 207646 49889 -550792 -105307
5997 -110008 179239 -148138 -156153 101451 -139673 -156526 42541 135570 -40728 -86717 88128
5985 -479479 49548 -152671 61788 107797 -198274 -258467 218188 -393279 -35986 331693 -103967
5973 7278 -260269 -21421 46866 116256 70490 -34100 104702 -79919 -53484 221035 -237712
5961 39264 -220737 -48692 -36678 -295690 204215 -35465 -46968 21264 133271 76608 -246303
5949 -126807 82569 -102765 -365315 -19573 -31291 20150 -146105 272726 156828 45665 -103776
5937 101533 218399 81335 112803 146959 64587 105452 148644 -177034 -49035 256211 95446
5925 42814 229051 -52914 303336 -45314 -328171 -271103 -261501 156496 123826 -104858 8330
5913 -131555 -158146 -140500 134446 12929 -11373 -176922 151502 33004 -21588 -151638 87763
5901 162415 26112 74393 128267 -426326 32072 -106071 -92864 309910 -161951 -50244 -38366
5890 -38366 -192957 -24480 -253338 -20200 -380382 -224574 190201 221300 226502 6582 255469
5879 255469 -29389 -40446 -110302 283602 -301591 165491 160172 -412522 -38295 80400 342454
5868 342454 67078 -44970 -74956 -70023 104250 -170720 178174 -228416 -152638 26379 151737
5857 151737 -243834 -34448 93890 -78727 78297 248764 -77664 96662 -199869 -37773 58710
5845 4888 156942 -83733 59567 -178359 -211980 -258794 -34692 95439 403487 -210523 -58760
5833 78890 -216365 162746 83652 18130 -107348 222720 -79804 -126107 -6200 -74651 104758
5821 201260 283929 101548 41681 -129360 -50040 -141249 101498 401241 -53983 342867 -169262
5809 429480 -183421 -110838 -195299 -3937 158742 -189105 -4638 -249322 94540 -33539 -177634
5798 -177634 226571 139098 -160814 26251 -40218 -86579 99492 -74104 38358 220904 181354
5787 181354 -132381 -43766 -343494 197783 92798 135891 203457 -167568 45025 131444 99349
5776 99349 164487 203731 -313715 52250 -82148 -167736 -164874 89467 -32385 -204972 -18667 -114957
5764 -114957 336238 -147584 -74977 108802 -87654 -55499 -302930 185339 52491 -102470
5753 -46554 93148 -237908 101479 -152552 67115 -64659 108348 -205785 46355 -76495 -209312
5742 -209312 -69718 241461 -73177 -103742 115408 37438 -3120 -152089 -336832 89785 -228548
5730 169598 -97361 -308647 129057 118143 96641 -82372 26038 -229575 178327 -57489 -11885
5718 -206532 -145386 5057 -19521 108245 -128359 113320 -218891 -267625 -55065 181089 -93929
5706 -136992 -249805 -70721 97769 164640 223759 -8835 198385 234424 -191772 136114 252970
5695 252970 -61777 -27841 -65221 51658 -177347 134482 -251774 193943 -213711 171785
5684 235122 -90899 32386 227883 -254144 -27655 54529 -46942 137528 7743 163062 75908
5672 8363 364247 -105969 -518504 33091 -78919 -230127 14886 -33334 140371 99266 -182220
5660 -90883 -378057 -80600 136102 -197696 174832 92268 -7062 -170216 -164989 -255204 -23869
5648 294770 53103 242089 -24543 -132735 66675 493400 141012 208189 -115413 -96314 -212254
5637 -212254 89144 91549 56733 188405 116480 -16154 -66057 -25132 -17261 206092 63636 173095
5625 173095 100651 -121146 -94818 -247192 -60257 -209024 -104157 185060 -221300 200564
5614 78149 206444 3746 -211509 224203 67472 -30225 -7750 188134 150892 50260 -34880
5602 -271920 115955 131168 44869 -213936 175666 356293 269267 167504 -7217 334353 23788
5590 -60411 -133815 -147056 32392 5279 15727 -1922 205323 8889 48468 -144528 -57521 72982
5577 -227840 -278553 169424 -45549 188210 31355 -114324 6200 -63574 -173814 -109672 174997
5565 264963 -86672 57791 89858 -274855 98217 99838 -252209 -3538 -200689 -64710 -41283
5554 -41283 -72620 174675 62837 -76378 118945 149842 -66709 144299 -91930 -150331 208476
5542 -188771 -25227 -43166 -118270 161876 -6896 -132787 162282 275066 -148903 -65367 -131768
5531 -131768 -138549 87189 -520734 -27084 -87358 -155444 113205 -413496 62350 -138273 -73963
5520 -73963 318141 219429 -71991 293002 -177379 89646 7136 22038 -40989 112276 316008
5509 316008 172998 198859 49393 211528 21153 -237845 44643 -49046 -7224 -143606 -66453
5497 -6932 -110681 -120152 153723 239733 -34486 130916 75293 2404 -267501 -254764 -41762 42672
5484 66016 -543682 -210715 -242687 -76011 62945 -161011 12938 202248 -349839 -13051 -187248
5473 -187248 164186 164803 50978 362827 -37265 96007 -80825 41174 117341 -76195 219771
5461 -103650 -274047 38311 26474 42174 -24376 119767 64600 -74748 309395 451786 60345
5449 217543 -172984 48354 -279968 -278449 -124279 -109423 290950 -68178 -5759 490813 42963
5437 78955 28888 -195662 81592 204041 -3241 152080 240093 -246247 -71160 213340 143020
5426 143020 263449 -4731 5289 202084 -145266 272341 -124326 170081 169358 62940 -177250
5414 -70400 -205221 -79297 28909 96741 111962 -18748 -32245 -340326 200185 232887 43883
5402 162282 282275 90946 -59173 501639 -198671 -239131 152725 -8549 45163 -167810 -164317
5391 -164317 295058 2684 97287 333549 -31467 -160182 -192178 404389 173546 245190 -57468
5379 -65790 3581 -47940 361309 -143566 -494873 -236451 26611 30509 53924 -60497 -14921
5367 -228636 21100 -119103 213652 -21280 101391 126663 166575 -155312 248689 -79559 -38721
5355 -240242 88598 -121570 -215511 -67218 21017 192498 90742 -168433 -129249 75304 -302512
5343 172573 23409 34925 -42266 114799 207853 44944 183129 39437 -16999 18348 65029
5332 65029 -180203 -125009 -83074 35673 122590 217940 -110161 155521 -36389 -29499 525986
5320 -148232 -140016 287181 -159793 -270129 356338 23027 -60158 -83945 -20359 73005 -378258
5308 -52491 100301 -291258 -227595 387205 -144810 140810 139915 39665 7881 -294635 32255
5296 50171 -178854 44818 67525 173832 -324810 103210 19799 38763 -249671 -191807 -375693
5285 -375693 -228241 36776 12936 219733 241458 -440993 249264 -145390 288533 33277
5274 -204243 265752 25185 50850 -31115 104999 34211 138058 -186642 28808 -113005 -44772
5262 -51201 317187 148751 -176366 400342 -355633 -113022 -146756 -55312 -88317 371872
5251 23022 -166164 -138054 153978 -110894 -38087 -91714 287713 61975 -327359 132152 -151708
5239 97431 86504 244317 -98751 148760 -24735 -312420 233666 197737 91679 302087 -112560
5227 -233500 -102417 88242 -182200 199187 -101608 -135904 -7040 291 205605 7945 -333040
5215 262097 67331 10029 3008 -354607 -295344 156374 31969 -68040 -64243 118024 -222631
5203 -38772 -264005 225461 149728 -62176 -117747 -122035 288086 -30182 306273 378052 -129123
5191 155550 434027 -156694 -118718 263074 209779 76997 130809 270388 38326 150080 2876
5179 -64531 -140032 134351 -210043 26008 574269 -123819 -79512 208027 87452 -171834 55502
5167 -228085 4202 60784 71483 -156290 162575 -28553 29900 -98998 83696 -114594 -396529
5156 -396529 -40119 160844 117187 -38500 8721 -159928 60633 83519 126682 152479 96269
5145 96269 179034 279604 26243 -202123 74733 106961 86534 -335412 -50384 342973 194023
5134 194023 159179 -61300 52475 313881 -301763 -473867 -35448 181423 -175493 -5214 -101495
5123 -101495 -221164 67158 329913 -2873 127588 -50958 -166658 -76803 62618 64910 280754
5112 280754 116929 81163 176920 127625 -428880 -167149 -85147 132321 367297 270694 -177656
5100 -179127 134929 -115701 209605 315260 172848 59933 -190931 101038 -63096 199118
5089 360420 -375419 -251147 43423 134448 -74123 -56520 273270 -55561 -125218 -106795 -119558
5078 -119558 -394792 -43233 -46350 -84388 854 -70028 88410 -399038 -124477 82358 82052 317211
5066 317211 -259683 21569 -119449 50709 -360388 -89279 -203543 -119852 -368246 -269500 63417
5054 -154539 39579 -27336 -250722 -180956 124330 39710 134343 278685 176435 -120847 221884
5042 -5807 49699 144387 30526 -35585 10734 375700 -209634 464231 150919 16214 -37455
5030 65550 112137 130270 -125050 110981 183125 62689 51678 -48353 28568 -68863 97072
5018 -127511 157010 -46797 -152126 42677 79515 282656 171378 335565 -186100 -332663
5008 -332663 -2045 119099 212687 90867 -233888 -47671 34176 6070 103444 -192288 10348
4996 -224458 209054 145238 291134 183479 -190362 -171668 -220196 212362 200842 -36349 -293644
4985 -293644 267309 1873 -45301 -162293 -117246 -252362 141513 -79549 -30584 -270815 -132947
4973 -271665 -32682 -176064 -227790 -73615 -237329 -112058 -108039 105443 160540 -100567 -244447
4962 -244447 -11498 -68402 34314 -189425 6878 182335 180419 181469 128653 27930 -105651 44747
4949 80731 2107 146099 -97711 98020 83170 506043 56942 105852 -135549 -207105 220951
4937 130746 -72523 -107935 -88901 -103699 -15259 -241400 -146097 -47530 -80658 -210505 250459
4925 -325646 451685 -38041 305899 -287156 70602 218069 -343618 -146805 122041 -8779
4914 -116945 -72593 -43516 -90864 8498 -87277 50219 -62786 -67614 47394 84006 115762 -33878
4901 -419787 101265 -407442 -120911 249056 -166600 154592 198196 -133052 168770 -9203
4890 209899 10614 -214734 -67791 303877 94526 -122071 -185643 -114672 216989 65956 -2149
4878 -140449 119527 -154205 122043 -112788 43780 -69566 138913 248806 34292 200787
4868 200787 -20612 -18013 71637 32300 -31557 -59649 74708 40956 -335513 -258689 -79588 -127234
4856 -127234 37734 117518 -125367 43 33477 170325 -48599 42677 53300 73594 168733 75236
4843 15312 330612 -62538 -230820 -188170 -160099 -162314 98532 -189076 19772 -13694 -22250 -221611
4831 -221611 44791 -272217 56896 -300180 -44145 -32102 -235183 41582 128421 59597 67097
4820 67097 -282007 -181335 141735 355542 218663 155227 37345 -146347 213292 166063
4810 166063 28203 -112817 23612 -269116 -443643 31331 142567 -189905 103760 239238
4800 239238 35868 -21153 105466 127686 94921 -90623 -85165 -1078 -266881 64891 -8623 186376
4787 236674 120417 -244543 184955 -65425 209446 19787 -87061 -6346 -34035 274817 -39169
4775 278603 -5854 21406 -238423 -27801 -97813 168180 162174 2438 56588 -95090 -741 226048
4762 107479 -83374 50881 -94512 -40427 53302 99592 162884 52050 63079 -180878 -296931
4751 -296931 5533 -303788 -188626 -48802 -52372 -20258 -88360 143065 -331550 2883 -16335
4739 -31097 -151702 -35903 -145047 -6331 -91364 -273786 -3627 302164 -152981 -229480 33496
4727 125070 -118899 66262 -12296 -89051 -310234 -303007 127023 54920 -9033 -172112 246317
4715 -28983 -22167 208604 -144335 66345 76739 -151489 366053 95289 -124719 -47668 64571
4703 -18065 -199719 -3058 -32670 45911 -180545 -445171 -156186 228071 -61205 -141881 -3548
4691 220166 -84568 -111496 -58964 -177004 245645 133745 -187391 67023 193447 -159818
4680 40935 -18205 132316 500403 256696 12620 66210 -84608 -123530 66481 242570 247058
4669 247058 230886 172325 166737 139595 313108 -33798 896 -27300 192080 258775 -341944 317794
4656 165835 -78244 -4202 165947 -87776 118341 313615 48826 156283 -395304 258573 -92360
4644 73169 -189590 133862 295914 109430 -24514 176001 155164 -139580 -53587 -227644
4634 -227644 -226418 72613 67276 -57980 149383 -68359 -460978 -155993 -396533 229893 -388506
4622 -195204 223213 15628 -137831 -74666 207279 -197656 163333 -70025 -312122 -206654
4612 -206654 -408924 -173396 -193238 -40941 -268797 -161888 136308 -206736 87600 -316349
4601 127071 248152 -4197 118979 -6071 113658 104432 68263 -61263 80114 -11338 -62395 -173730
4589 -173730 309453 -164314 41246 -86240 373796 -127548 186227 224019 162974 -127139
4578 -187551 110162 -48738 12454 232268 109596 191759 123776 346217 84812 -220321 229905
4566 -287980 -64662 -392404 338192 787 25103 3435 -191034 198286 85426 15916 -373482
4554 133185 7339 264198 16092 336034 40484 243289 80474 391017 -121231 -185327 29217
4542 100415 351396 -61690 133130 -290194 -20507 241965 -180319 34000 -23208 13851 -203045
4530 -87263 197146 -3634 -332114 17495 -228299 -69740 74563 -319786 -160442 109794 -59811
4518 117753 -16000 -61466 210909 146310 352067 -31341 165175 238196 -453161 53411 -130571
4506 -209353 74511 -344 -232071 -121539 165899 55374 244039 -301997 258877 -152808 375792
$$ [...]
##END NTUPLES=NMR SPECTRUM
##END=
