##TITLE=AC1602_NICAH13332_8315892_13fwTwvQwe
##JCAMPDX= 6.0         $$ Bruker NMR JCAMP-DX V2.0
##DATA TYPE= NMR SPECTRUM
##DATA CLASS= NTUPLES
##ORIGIN= BRUKER
##OWNER= Administrator
$$ 1.72 TOPSPIN		Version 2.1
$$ 2013-11-09 19:22:50.682 -0800  Administrator@X
$$ Compression mode = diff/dup
##.OBSERVE FREQUENCY= 400.02188249412
##.OBSERVE NUCLEUS= ^1H
##.ACQUISITION MODE= SIMULTANEOUS (DQD)
##.ACQUISITION SCHEME= undefined
##.AVERAGES= 64
##.DIGITISER RES= 22
##SPECTROMETER/DATA SYSTEM= spect
##.PULSE SEQUENCE= noesygpps1d.comp
##.SOLVENT NAME= COFFEE_meoh
##.SHIFT REFERENCE= INTERNAL, COFFEE_meoh, 1, 14.96103
##AUDIT TRAIL= $$ (NUMBER, WHEN, WHO, WHERE, PROCESS, VERSION, WHAT)
$$ ##TITLE= Audit trail, TOPSPIN		Version 2.1
$$ ##JCAMPDX= 5.01
$$ ##ORIGIN= Bruker BioSpin GmbH
$$ ##OWNER= Administrator
$$ $$ E:\/data/COFFEE/nmr/AC1602_NICAH13332_8315892_13fwTwvQwe/12/pdata/1/auditp.txt
$$ ##AUDIT TRAIL=  $$ (NUMBER, WHEN, WHO, WHERE, PROCESS, VERSION, WHAT)
(   1,<2013-11-09 19:22:45.495 -0800>,<Administrator>,<X>,<go>,<TOPSPIN 2.1>,
      <created by zg
	started at 2013-11-09 19:11:15.880 -0800,
	POWCHK enabled, PULCHK disabled,
       configuration hash MD5:
       C8 4E 4E 5D D3 5C D8 9E 9F 52 82 E0 59 8A DE 15
       data hash MD5: 64K
       8D 1D DC E1 A0 82 15 75 6A FB 09 83 26 DE 74 F6>)
(   2,<2013-11-09 19:22:48.589 -0800>,<Administrator>,<X>,<proc1d>,<TOPSPIN 2.1>,
      <Start of raw data processing
       efp LB = 0.3 FT_mod = 6 PKNL = 1 PHC0 = 0 PHC1 = 0 SI = 128K 
       data hash MD5: 128K
       D0 EB A3 5E 9F 96 34 A9 67 B7 65 14 27 11 44 ED>)
(   3,<2013-11-09 19:22:49.589 -0800>,<Administrator>,<X>,<proc1d>,<TOPSPIN 2.1>,
      <pk PHC0 = -85.18799 PHC1 = 0 
       data hash MD5: 128K
       2D 91 32 46 82 D3 6B 75 31 44 6A 47 0F 0C 84 5B>)
(   4,<2013-11-09 19:22:50.057 -0800>,<Administrator>,<X>,<proc1d>,<TOPSPIN 2.1>,
      <abs ABSG = 1 
       data hash MD5: 128K
       D0 39 51 ED F3 63 BC 02 FF 72 8E CB 35 86 40 BD>)
(   5,<2013-11-09 19:22:50.182 -0800>,<Administrator>,<X>,<proc1d>,<TOPSPIN 2.1>,
      <abs ABSG = 2 
       data hash MD5: 128K
       8F C7 50 DB 4C 78 53 1F 07 DB 71 B0 47 A6 49 FE>)
(   6,<2013-11-09 19:22:50.292 -0800>,<Administrator>,<X>,<proc1d>,<TOPSPIN 2.1>,
      <abs ABSG = 3 
       data hash MD5: 128K
       28 B8 69 62 B3 42 90 FA 9D 27 C1 EE 78 EF E0 40>)
(   7,<2013-11-09 19:22:50.370 -0800>,<Administrator>,<X>,<proc1d>,<TOPSPIN 2.1>,
      <abs ABSG = 4 
       data hash MD5: 128K
       AB 6C 73 DF 5C D2 F9 E3 C8 C7 49 06 C1 77 1F 5E>)
(   8,<2013-11-09 19:22:50.448 -0800>,<Administrator>,<X>,<proc1d>,<TOPSPIN 2.1>,
      <abs ABSG = 5 
       data hash MD5: 128K
       2D 47 E3 67 02 AE 36 3E E4 04 49 E7 47 69 2C AE>)
$$ ##END=
$$ 
$$ $$ hash MD5
$$ $$ 43 A3 28 7D 3D 5B 75 B9 5C 45 8D 14 9A C3 2D 0C
##$RELAX= 
##$RELAX= 
##$RELAX= 
##$RELAX= 
##$RELAX= 
##$RELAX= 
##$RELAX= 
##$RELAX= 
$$ Bruker specific parameters
$$ --------------------------
##$DU= <E:\>
##$EXPNO= 12
$$ [...]
150 150 150 150 150 150 150 150
##$TP07= 0
##$TPNAME0= <>
##$TPNAME1= <>
##$TPNAME2= <>
##$TPNAME3= <>
##$TPNAME4= <>
##$TPNAME5= <>
##$TPNAME6= <>
##$TPNAME7= <>
##$TPOAL= (0..7)
0.5 0.5 0.5 0.5 0.5 0.5 0.5 0.5
##$TPOFFS= (0..7)
0 0 0 0 0 0 0 0
##$TUNHIN= 0
##$TUNHOUT= 0
##$TUNXOUT= 0
##$USERA1= <user>
##$USERA2= <user>
##$USERA3= <user>
##$USERA4= <user>
##$USERA5= <user>
##$V9= 5
##$VALIST= <valist>
##$VCLIST= <CCCCCCCCCCCCCCC>
##$VD= 0
##$VDLIST= <DDDDDDDDDDDDDDD>
##$VPLIST= <PPPPPPPPPPPPPPP>
##$VTLIST= <TTTTTTTTTTTTTTT>
##$WBST= 1024
##$WBSW= 4
##$XGAIN= (0..3)
0 0 0 0
##$XL= 0
##$YL= 0
##$YMAX_a= 5940877
##$YMIN_a= -12105468
##$ZGOPTNS= <>
##$ZL1= 120
##$ZL2= 120
##$ZL3= 120
##$ZL4= 120
##$ABSF1= 14.96103
##$ABSF2= -5.597152
##$ABSG= 5
##$ABSL= 3
##$ALPHA= 0
##$AQORDER= 0
##$ASSFAC= 0
##$ASSFACI= 0
##$ASSFACX= 0
##$ASSWID= 0
##$AUNMP= <proc_prof1d_extract.lims>
##$AXLEFT= 0
##$AXNAME= <>
##$AXNUC= <1H>
##$AXRIGHT= 0
##$AXTYPE= 0
##$AXUNIT= <>
##$AZFE= 0.1
##$AZFW= 0.1
##$BCFW= 0
##$BC_mod= 0
##$BYTORDP= 0
##$COROFFS= 0
##$CY= 15
##$DATMOD= 1
##$DC= 0
##$DFILT= <>
##$DTYPP= 0
##$F1P= 0
##$F2P= 0
##$FCOR= 0.5
##$FTSIZE= 131072
##$FT_mod= 6
##$GAMMA= 0
##$GB= 0
##$INTBC= 1
##$INTSCL= 1
##$ISEN= 128
##$LB= 0.3
##$LEV0= 0
##$LPBIN= 0
##$MAXI= 10000
##$MC2= 0
##$MEAN= 0
##$ME_mod= 0
##$MI= 0
##$NCOEF= 0
##$NC_proc= -2
##$NLEV= 6
##$NOISF1= 0
##$NOISF2= 0
##$NSP= 0
##$NTH_PI= 0
##$NZP= 0
##$OFFSET= 14.96103
##$PC= 1
##$PHC0= -85.18799
##$PHC1= 0
##$PH_mod= 1
##$PKNL= yes
##$PPARMOD= 0
##$PPDIAG= 0
##$PPIPTYP= 0
##$PPMPNUM= 2147483647
##$PPRESOL= 1
##$PSCAL= 4
##$PSIGN= 0
##$PYNMP= <proc.py>
##$REVERSE= no
##$SF= 400.02000962448
##$SI= 131072
##$SIGF1= 0
##$SIGF2= 0
##$SINO= 400
##$SIOLD= 131072
##$SPECTYP= <>
##$SREGLST= <1H.CDCl3>
##$SSB= 0
##$STSI= 131072
##$STSR= 0
##$SW_p= 8223.68421052631
##$SYMM= 0
##$S_DEV= 0
##$TDeff= 65536
##$TDoff= 0
##$TI= <>
##$TILT= no
##$TM1= 0
##$TM2= 0
##$TOPLEV= 0
##$USERP1= <user>
##$USERP2= <user>
##$USERP3= <user>
##$USERP4= <user>
##$USERP5= <user>
##$WDW= 1
##$XDIM= 131072
##$YMAX_p= 391899701
##$YMIN_p= -12851
##$CURPLOT= <Network HP LaserJet P1505>
##$CURPRIN= <$Network HP LaserJet P1505>
##$DFORMAT= <normdp>
##$LAYOUT= <+/1D_H.xwp>
##$LFORMAT= <normlp>
##$PFORMAT= <normpl>
##$SURQMSG= 1
$$ End of Bruker specific parameters
$$ ---------------------------------
##NTUPLES= NMR SPECTRUM
##VAR_NAME=  FREQUENCY,     SPECTRUM/REAL,   SPECTRUM/IMAG
##SYMBOL=    X,             R,               I
##VAR_TYPE=  INDEPENDENT,   DEPENDENT,       DEPENDENT
##VAR_FORM=  AFFN,          ASDF,            ASDF
##VAR_DIM=   131072,        131072,          131072
##UNITS=     HZ,            ARBITRARY UNITS, ARBITRARY UNITS
##FACTOR=    0.0627417313425164, 1,          1
##FIRST=     8223.62146879497, -1438,        -63983
##LAST=      0,             2338,            -64317
##MIN=       0,             -12851,          0
##MAX=       8223.62146879497, 391899701,    0
$$ Real data points
##PAGE= N=1
##DATA TABLE= (X++(R..R)), XYDATA
$$ [...]
65266 151067 149363 147870 146344 144490 142447 140655 139321 138233 136973 135160 132746 130227 128361 127456
65252 127456 127188 127278 127930 129252 130591 130968 130125 128748 127701 127320 127383 127438 127099 126181 124628 122437 119899
65235 119899 117834 117089 117548 118148 118194 118175 118810 119826 120470 120827 121654 122957 123747 123471 122840 122791 123334 123966 124647
65216 124647 125608 126480 126409 125088 123207 121754 121105 120888 120539 119931 119542 119909 120903 121720 121756 121270 120978 121208
65198 121208 121765 122418 123060 123424 123114 122148 121134 120657 120643 120601 120390 120482 121357 122836 124220 125065 125622 126410 127494
65179 127494 128476 129183 130033 131525 133564 135561 137104 138271 139288 140173 140832 141311 141809 142489 143351 144220 144815
65162 144815 144917 144619 144456 145185 147293 150615 154499 158467 162683 167588 173076 178317 182584 186096 189809
65147 189809 194503 200276 206787 213673 220841 228657 237861 248943 261577 274967 288737 303073 317910
65134 317910 332513 346153 358757 370557 381514 391497 400645 408911 415467 419296 420388 419649 417496
65121 417496 413339 406857 399074 391427 384065 375795 365650 353813 340946 327325 313034 298531 284440
65108 284440 270966 257999 245743 234772 225326 216928 208960 201424 194868 189626 185388 181504 177479
65095 177479 173128 168432 163457 158448 153915 150467 148449 147620 147272 146766 145956 145087 144451 144245 144614 145517
65079 145517 146557 147245 147558 148028 149100 150525 151566 151716 151099 150272 149755 149698 149898 150104 150262 150348 150099 149239
65061 149239 147959 146756 145656 144081 141833 139760 138941 139467 140589 141860 143402 145053 146053 145954 145318
65046 145318 145091 145614 146603 147813 149250 150826 152145 152670 152067 150493 148659 147339 146672 146140 145386 144681
65030 144681 144276 143665 142063 139509 136958 135179 133968 132645 130987 129398 128346 127879 127675 127425 127147 127115
65014 127115 127417 127649 127242 126109 124723 123484 122314 121120 120445 121179 123515 126527 129060 130885 132742
64999 132742 135282 138298 141087 143331 145367 147670 150261 152622 154049 154104 152953 151371 150344 150484 151702
64984 151702 153361 154756 155602 156227 157285 159140 161519 163787 165522 166732 167662 168527 169352 169874 169628 168299
64968 168299 166008 163159 160082 156986 154067 151386 148711 145877 143290 141662 141123 140933 140230 138784 136859
64953 136859 134727 132655 131115 130618 131238 132446 133418 133557 132881 131949 131245 130641 129690 128456 127651 127807 128624
64936 128624 129368 129624 129485 129224 128980 128669 128054 127118 126419 126722 128146 130046 131815 133386 134726 135444 135305
64919 135305 134726 134292 134179 134422 135294 136775 138069 138371 137934 137681 137956 138336 138580 138936 139442 139648 139312 138837
64901 138837 138801 139491 140981 143215 145848 148415 150818 153359 156316 159869 164346 169909 175924 181227 185221
64886 185221 188266 190928 193417 195909 198705 201662 203982 205062 205232 205327 205771 206379 206748 206580 205853 204814
64870 204814 203531 201459 197972 193432 189150 185979 183564 181286 179283 178036 177533 177489 177929 178859 179711 179813
64854 179813 179142 177954 175978 172765 168702 164831 161607 158563 155370 152489 150485 149232 148118 146730
64840 146730 145035 143205 141468 139985 138746 137795 137503 138200 139496 140350 140073 138972 137814 137018 136605 136656
64824 136656 137360 138653 140092 141199 141803 142079 142325 142746 143444 144550 146259 148601 151287 153927 156439 159089
64808 159089 162148 165614 169263 172891 176554 180690 185927 192474 199709 206574 212444 217469 222036 226141
64794 226141 229352 231168 231247 229471 226067 221651 216965 212419 207857 202840 197216 191486 186545 183007 180745
64779 180745 179088 177435 175640 173916 172501 171493 170972 171149 172228 174017 175843 177137 178078 179388 181493
64764 181493 184170 187135 190552 194693 199368 204085 208634 213200 217984 222959 227938 232610 236609 239772
64750 239772 242315 244534 246470 248084 249527 250852 251621 251289 250010 248601 247584 246660 245327 243650 242054
64735 242054 240447 237900 233350 226728 219322 212820 207834 203581 199180 194940 191873 190245 189252 188165
64721 188165 187051 186148 185177 183770 182195 181133 180925 181410 182313 183428 184615 185979 187952 190818 194197
64706 194197 197276 199550 201070 202083 202727 203052 202974 202147 200210 197328 194279 191795 189936 188226 186261
64691 186261 183967 181365 178396 175108 171900 169286 167394 165860 164324 162894 161979 161819 162421 163799 165928
64676 165928 168418 170666 172519 174492 177095 180210 183471 186950 191086 196041 201642 207920 215155 223115
64662 223115 230647 236480 240301 242743 244395 245166 244688 242997 240552 237724 234546 231008 227304 223625 219817
64647 219817 215576 211055 207029 204247 202690 201643 200496 199277 198405 198167 198565 199578 201334 204029 207786
64632 207786 212577 218182 224384 231341 239702 249971 261630 273222 283541 292435 300126 306062 309105
64619 309105 308902 306433 302908 298552 292883 285742 277595 269030 260486 252333 244689 237224 229656 222427
64605 222427 216339 211450 206992 202593 198891 196488 194865 193065 191155 190187 190699 191904 192650 192704 192788 193667
64589 193667 195509 197961 200531 202871 204892 206692 208386 210091 212001 214311 216948 219531 221767 223779
64575 223779 225925 228341 230812 233039 234922 236568 238150 239823 241648 243493 245064 246075 246387 245903 244368
64560 244368 241410 236926 231373 225544 219947 214477 208740 202633 196518 190901 186086 182144 179062 176788
64546 176788 175190 174037 173096 172293 171793 171857 172499 173307 173755 173696 173416 173215 173166 173312 173777 174461 174858 174558 173827
64527 173827 173323 173259 173204 172729 171878 170904 169944 169170 168881 169097 169389 169459 169656 170500 171833 172927 173400 173617 174134
64508 174134 175158 176626 178420 180326 182137 183965 186152 188712 191193 193310 195451 198268 202021 206592
64494 206592 211892 217857 224166 230392 236464 242619 248776 254237 258212 260499 261509 261691 261095 259542 257130
64479 257130 254384 251858 249615 247251 244392 241058 237561 234201 231088 228143 225233 222411 219966 218078
64465 218078 216461 214587 212305 209999 208162 207076 206920 207805 209538 211632 213711 215712 217702 219838 222506
64450 222506 225973 229711 232635 234314 235460 236833 238254 239271 240310 242334 245594 249494 253637 258339
64436 258339 264072 270996 279048 287945 297097 306138 315670 326953 340730 356892 375346 396591 421227
64423 421227 449569 482167 520211 564984 617217 677333 745946 823529 909632 1002680 1100460
64412 1100460 1200636 1300953 1399306 1493726 1582331 1663394 1735385 1796699 1845269 1878812 1895675
64401 1895675 1895475 1878995 1847733 1803463 1747726 1681476 1605404 1520712 1429416 1333895 1236555 1139973
64389 1139973 1046806 959100 877794 803107 735189 674193 619931 571844 529340 492095 460003
64378 460003 432801 409641 389218 370539 353469 338330 325178 313916 304742 297746 292105 286492
64366 286492 280436 274476 268819 262734 255797 248871 243044 238179 233281 227935 222610 217854 213927 211026
64352 211026 209133 207746 206446 205685 206307 208289 210678 212908 215523 219289 224123 229276 234208 238887 243380
64337 243380 247488 250830 253159 254537 255190 255235 254649 253452 251719 249377 246370 243176 240797 239952 240514 241989
64321 241989 244111 246556 248431 248771 247488 245349 243040 240650 238010 235092 232019 229095 226836 225575
64307 225575 225019 224475 223502 222027 220021 217524 214955 212814 211034 209105 206934 205073 203912 203145 202263
64292 202263 201113 199657 197611 194801 191743 189480 188820 189855 192059 194654 197016 199020 201117 203929
64278 203929 207679 211953 216065 219713 223344 227788 233451 239827 245804 250429 253514 255780 258382 261993
64264 261993 266219 270135 273369 276199 278510 279346 278018 275175 272187 269828 268174 267382 267709 268854 270057
64249 270057 270925 271464 271302 269641 266146 261272 255497 248926 241872 235144 229287 224052 219043 214501 210975
64234 210975 208571 206997 206184 206399 207738 209799 211910 213590 214788 215657 216082 215660 214372 212999 212361 212257
64218 212257 211735 210444 209079 208333 208027 207558 206694 205578 204378 203258 202343 201372 199736 197223 194414 192085
64202 192085 190504 189591 189364 189913 191213 193273 196093 199161 201416 202182 201907 201602 201807 202504 203755 205857
64186 205857 209021 213364 219144 226544 235203 244398 253748 263534 274215 285747 297263 307257 314223
64173 314223 317442 317276 314626 310203 304262 296787 287779 277583 267060 257231 248586 240926 233918 227500
64159 227500 221701 216490 212045 208690 206278 204046 201484 199039 197560 197324 198002 199245 200814 202341 203489
64144 203489 204331 205295 206887 209602 213715 218722 223300 226350 227982 229136 230509 232218 234147 235928 236753
64129 236753 235956 233867 231555 229654 227885 225832 223701 222029 220944 219987 218689 217297 216821 218161 221209
64114 221209 225208 229990 236228 244150 252741 260847 268505 276418 284655 292813 301148 310421 320530 330192
64100 330192 338197 344288 348802 352211 355207 358468 362119 365976 370364 375967 382847 390426 398544 407503
64086 407503 416692 424162 428273 429114 427771 424884 420586 415140 408696 400746 390705 378973 366798 355138
64072 355138 344112 333511 323380 314121 306272 300034 294881 289922 284933 280660 277795 276045 274700
64059 274700 273724 273616 274398 275381 275956 276177 276568 277709 279942 283064 286370 289361 292365 296152 301028 306691
64043 306691 312853 319572 326974 335089 344034 354005 364945 376392 387714 398415 408308 417468 425851
64030 425851 432831 437431 439278 438996 437322 434224 429370 423143 416527 410175 404241 398933 394484 390621
64016 390621 386835 383278 380609 378836 377090 374858 372541 370333 367375 362763 356834 350680 344776 338903
64002 338903 333097 327795 323092 318713 314776 311825 309885 308242 306516 305296 305164 305602 305593 305103 305280 307114
63986 307114 310434 314374 318392 322495 326817 331441 336560 342426 349002 355917 362960 370496 379179 389284
63972 389284 400422 411909 423289 434522 445913 457991 471265 485841 501247 516853 532562
63961 532562 548977 566851 586612 608555 633248 661301 692743 727107 764422 805884 853301
63950 853301 908158 971581 1044948 1129892 1227628 1338918 1464996 1608061 1770260 1952299
63940 1952299 2153289 2371752 2606299 2855405 3116981 3388254 3665657 3944626 4219697
63931 4219697 4484942 4734204 4961079 5159308 5323762 5451152 5539688 5588194 5595707 5561754
63921 5561754 5486777 5372209 5220425 5034793 4819902 4581665 4326899 4062293 3793428 3524708
63911 3524708 3260109 3003673 2759027 2528658 2314048 2116510 1937545 1778218 1638335
63902 1638335 1516392 1410283 1318038 1238139 1169422 1110813 1061107 1018900 982639 950759 921822
63891 921822 894710 868787 843952 820508 798884 779209 760944 743030 724623 705798 687465
63880 687465 670571 655585 642778 632669 625819 622175 620922 621225 623085 627358 634879 645590 658578
63867 658578 673025 688996 707102 727363 748668 769526 789194 807853 825861 843239 859840
63856 859840 875541 889952 902234 911558 917697 921017 921953 920655 917058 911089 902742 892045 878955
63843 878955 863325 845122 824766 803083 780771 758000 734596 710401 685331 659409 633028
63832 633028 606937 581619 556893 532532 508981 486904 466167 446105 426888 409781 395581
63821 395581 383434 371763 359958 348522 337910 327990 318558 309695 301460 293725 286481 279984 274469
63808 274469 269994 266579 264198 262571 261239 259893 258429 256741 254821 253008 251630 250404 248666 246339
63794 246339 244113 242478 241111 239574 238024 236729 235328 233228 230461 227497 224459 221249 218317 216421
63780 216421 215442 214264 212284 210396 209851 210575 211228 210738 209184 207341 205947 205449 205863 206648 207072 206933 206639
63763 206639 206435 205961 204885 203632 202960 202946 202850 202061 200785 199596 198717 198019 197525 197530 198219 199462 200972 202458
63745 202458 203582 204085 204121 204275 205065 206495 208185 209766 211054 212095 213286 215208 218004 221022 223485
63730 223485 225409 227474 230025 232793 235668 239077 243230 247517 251213 254399 257609 260850 263679 266149
63716 266149 268914 272335 276112 279941 283844 287539 290163 291114 290758 289835 288555 286743 284523 282278 280116
63701 280116 277935 275848 273944 271790 268873 265629 263348 262806 263514 264570 265745 267311 269307 271535 274123
63686 274123 277492 281659 285941 289459 291858 293511 295145 297227 299542 301360 302138 302035 301639 301261 300688
63671 300688 299642 298287 297132 296520 296393 296592 297212 298441 300066 301425 302013 302021 302067 302503 303131 303429 302814 300855
63653 300855 297670 294051 290786 287797 284388 280387 276469 273145 270006 266432 262568 259081 256276 254089
63639 254089 252707 252462 253069 253665 253827 254148 255563 258354 261931 265272 267577 268840 269976 272116 275686
63624 275686 280370 285879 292287 299530 307118 314625 322109 329846 338053 347089 357467 369252 381874
63611 381874 394975 409067 424839 442166 460454 479724 500632 523471 547861 573431 600065
63600 600065 627315 654233 680053 704342 726106 743460 754879 760512 761760 759856 755391 748979
63588 748979 741615 734204 727012 719629 711257 701121 688818 674203 656887 636315 612729 587638
63576 587638 562809 539119 516987 497383 481257 468034 455970 444439 434837 428634 425466 423928
63564 423928 423431 424215 426069 428315 430989 434977 440771 447839 455386 463069 470837 478780 487348 497096 507918
63549 507918 519141 530707 543696 559321 577893 599179 623296 650701 681604 715794 752648
63538 752648 790652 827054 858582 882758 898537 906131 906740 902274 894660 885240 874952 864888 856074
63525 856074 848573 841202 832374 821050 806844 789549 768840 744450 716547 685903 653685 621080
63513 621080 589163 558943 531123 505648 481912 459695 439599 422138 406790 392525 379152
63502 379152 367461 358032 350465 343924 337842 331881 325788 319712 314311 310169 307281 305348 304217 303705
63488 303705 303309 302577 301688 301271 301668 302641 303783 304962 306367 308321 311083 314660 318797 323183 327589 331729
63472 331729 335203 337797 339760 341584 343521 345419 346893 347421 346426 343639 339447 334686 329983 325450 321006
63457 321006 316790 313127 310227 308074 306618 305968 306373 307980 310612 313807 317070 320145 323139 326508 330841
63442 330841 336374 342701 349161 355602 362534 370361 378818 387496 396772 407776 421389 437584 455808
63429 455808 475714 497367 520802 545411 569660 591463 609105 622001 630623 635943 639209 642122
63417 642122 646695 654630 666848 683527 704307 728438 755212 784502 816553 850865 885410 917230
63405 917230 943785 963706 976666 983137 984220 981228 975100 966366 955680 944107 932585 921164
63393 921164 908803 893890 875025 851673 824426 794671 763819 732713 701691 671074 641427
63382 641427 613354 587182 562990 540854 520940 503330 487904 474567 463491 455022 449337 446262
63370 446262 445347 445944 447296 448960 451353 455622 462657 472295 483654 496082 509529 524213 540473
63357 540473 558955 580401 604911 631696 659871 689247 720097 752346 785379 818477 850953
63346 850953 881809 909642 933116 951300 963536 969457 969543 965362 958776 950796 941436 930632 918873
63333 918873 906735 894124 880242 864147 845090 822529 796367 767380 737122 707132 678309
63322 678309 651155 626378 604868 587115 572941 561942 553939 548811 545977 544183 541787 537266 529658
63309 529658 518826 505330 489926 473143 455369 437266 419851 403979 389836 377117 365702
63298 365702 355969 348349 342750 338580 335235 332310 329428 326298 323110 320486 318650 316866 314159 310498
63284 310498 306774 303588 300601 297350 294178 291857 290514 289415 287824 285722 283722 282509 282342 282829 283131
63269 283131 282643 281522 280446 279918 280014 280679 281881 283432 284980 286350 287697 289187 290787 292433 294205
63254 294205 296147 298139 300156 302497 305516 309208 313245 317381 321652 326209 331140 336421 341921 347500
63240 347500 353267 359739 367508 376649 386588 396746 407273 418965 432375 447142 462355 477481
63228 477481 492671 508214 524069 540112 556481 573256 590007 606120 621599 637122 653256
63217 653256 670040 687432 705618 724494 743178 760443 775547 788361 798813 806538 810990 811634
63205 811634 808127 800666 790200 777995 764885 751044 736477 721555 706990 693459 681370 670919
63193 670919 662353 656122 652747 652503 655337 661139 669949 681818 696630 714200 734430 757171 782049
63180 782049 808608 836540 865540 895076 924570 953866 983283 1013100 1043176 1073063 1102324
63169 1102324 1130619 1157563 1182612 1205077 1224227 1239362 1249761 1254593 1253058 1244709 1229508 1207577
63157 1207577 1179091 1144579 1105096 1061900 1016124 968946 921809 876017 832160 790231 750365
63146 750365 713236 679749 650474 625269 603238 583234 564772 548393 534837 523925 514615 506030
63134 506030 498026 490808 484566 479528 475868 473322 471297 469524 468235 467606 467500 467900 469105 471208 473879
63119 473879 476969 480866 485782 491173 496358 501347 506477 511529 515875 519345 522266 524727 526461 527593
63105 527593 528892 531001 533757 536407 538235 538968 538935 538892 539326 539924 540109 539986 540157 540585 540424 539311 538098
63088 538098 537766 538224 538837 539593 540853 542218 542678 542020 541266 541413 542435 543870 545739 548294 551289 554179
63072 554179 556955 560280 564816 570718 577725 585354 593034 600430 607757 615617 624485 634562 646000 658933
63058 658933 673273 688811 705643 724242 744971 767789 792553 819397 848634 880440 914753
63047 914753 951267 989445 1028787 1069181 1110744 1153191 1195695 1237629 1279153 1320769 1362607
63036 1362607 1404548 1446834 1489987 1534094 1578486 1622122 1663977 1703112 1738719 1770091 1796230
63025 1796230 1815512 1826178 1827314 1819099 1802187 1777278 1745353 1707867 1666413 1622477 1577589 1533282
63013 1533282 1490706 1450635 1414082 1382558 1357426 1339342 1328588 1325493 1330057 1341511 1358929 1382248
63001 1382248 1412092 1448553 1490637 1537046 1587011 1640087 1695538 1752441 1810306 1869205 1929136
62990 1929136 1989440 2048938 2106587 2161891 2214767 2265140 2312594 2356124 2394064 2424388 2445281
62979 2445281 2455395 2453542 2438502 2409579 2367206 2312608 2246906 2171095 2086931 1997272 1905138
62968 1905138 1812789 1721887 1634052 1550684 1472500 1399687 1332396 1270752 1214584 1163524 1117216
62957 1117216 1075103 1036298 1000150 966771 936451 908712 882576 857746 834797 813990 794519
62946 794519 775234 755689 736124 716849 698040 679847 662259 645027 628067 611892 597347
62935 597347 584903 574345 565038 556386 548200 540857 534988 530785 527658 524725 521555 518293 515241 512572
62921 512572 510405 508808 507644 506581 505380 504103 502979 502110 501312 500217 498563 496388 493875 491017 487590
62906 487590 483529 479154 474858 470759 466846 463238 459928 456386 451983 446978 442601 439785 438131 436515
62892 436515 434529 432739 431602 430746 429580 428143 426912 426038 425264 424478 423936 423874 424247 424949 426045 427639
62876 427639 429657 431812 433704 435013 435749 436256 436767 437048 436736 435886 434824 433530 431713 429484 427377 425496
62860 425496 423339 420797 418684 417704 417437 417071 416674 416895 417622 417966 417627 417375 417871 418728 419152 418888 418167 417189
62842 417189 416122 415178 414254 412832 410683 408367 406580 405262 403879 402365 401225 400697 400354 399652 398462
62827 398462 396960 395332 393800 392636 391944 391555 391317 391359 391919 393023 394511 396365 398782 401845 405214 408301
62811 408301 410764 412756 414744 417185 420364 424303 428665 432966 437072 441379 446252 451508 456778 462252
62797 462252 468503 475581 482897 490259 498390 507956 518496 528990 539258 550226 562880 577592 594484
62784 594484 613843 635875 660562 688138 719397 755082 795096 838648 885201 934977 988523
62773 988523 1045942 1106611 1169398 1232992 1296031 1357012 1414094 1465072 1507714 1540376 1562415
62762 1562415 1573948 1575204 1566178 1546999 1518407 1481623 1437761 1387712 1332751 1274917 1216440 1158797
62750 1158797 1102499 1047632 994365 942993 893958 847955 805725 767485 732703 700690 671333
62739 671333 645029 621896 601322 582493 565207 549929 536995 525975 516051 506890 498883 492468
62727 492468 487528 483683 480991 479992 481073 484000 488165 493031 498240 503574 509081 515181 522419 531142
62713 531142 541559 554048 569077 586703 606378 627549 650462 676204 705900 739994 778336
62702 778336 820783 867605 919452 977147 1041527 1113199 1192306 1278516 1371259 1469874 1573466
62691 1573466 1680737 1790003 1899273 2006203 2108109 2202224 2285950 2356789 2412149 2449607
62681 2449607 2467617 2465907 2445067 2405848 2349096 2276390 2190483 2094852 1992800 1886967 1779517
62670 1779517 1672450 1567589 1466435 1370201 1279873 1196032 1118644 1047300 981806 922401 869235
62659 869235 821796 779120 740533 705876 674877 646679 620409 596118 574638 556362 540525
62648 540525 525918 511945 498580 485641 472805 460371 449299 440122 432283 424915 417928 411872
62636 411872 407028 403149 399990 397524 395615 393948 392369 390938 389567 388000 386291 384922 384163 383574 382375
62621 382375 380184 377331 374642 372967 372596 372925 372927 372165 371222 371037 372059 374210 377346 381460 386528 392425
62605 392425 398859 405335 411446 417484 424425 432954 442723 453014 463925 476401 491133 508032 526857
62592 526857 547793 571138 596831 624556 653973 684500 715128 744835 772979 798941 821554
62581 821554 839387 851634 858437 860256 857280 849527 837215 820823 800988 778444 753821 727343
62569 727343 699033 669560 640588 613816 589703 567518 546580 526968 509034 492808 478203
62558 478203 465321 454200 444628 436515 430078 425210 421138 417305 414237 412769 412544 412188 411019 409736
62544 409736 409155 409146 409262 409718 410987 412895 414838 416681 418840 421560 424650 427881 431209 434621 438113 441785
62528 441785 445698 449767 454188 459778 467438 477285 488751 501543 516115 533172 553109 576034 602052
62515 602052 631398 664490 701862 743791 790013 840029 893620 950656 1010445 1071690 1133107
62504 1133107 1193606 1251701 1305188 1351728 1389585 1417690 1435426 1442741 1440259 1428921 1409555 1382973
62492 1382973 1350386 1313445 1273860 1233164 1192891 1154834 1120978 1092969 1071551 1056578 1047711
62481 1047711 1045150 1049520 1061091 1079334 1103291 1132204 1165662 1203207 1243816 1285706 1326671 1364710
62469 1364710 1398332 1426296 1447371 1460677 1465965 1463059 1451022 1428460 1394929 1351734 1301213 1245573
62457 1245573 1186603 1125952 1065125 1005224 947098 891727 840185 793145 750642 712437 678544
62446 678544 649329 625071 605511 589991 578100 569933 565481 563933 563985 564797 566251 568356 570915 573867
62432 573867 577381 581289 584894 587625 589458 590295 589368 585777 579336 570459 559569 547215 534472 522438
62418 522438 511233 500129 488758 477693 467684 458860 450868 443376 436217 429384 423150 417871 413488
62405 413488 409475 405490 401749 398516 395617 392817 390426 389032 388708 388846 388787 388329 387611 386857 386334 386316 386859
62388 386859 387708 388546 389325 390275 391592 393125 394415 395196 395878 397375 400235 404058 408012 411833 415998 420920
62372 420920 426413 432211 438644 446311 455200 464648 474225 484218 495017 506487 518403 531313 546468
62359 546468 564840 586565 611405 639398 670839 705985 745071 788424 836150 887587 941211
62348 941211 995075 1047281 1096184 1140477 1179141 1211212 1235583 1251377 1258621 1258331 1251657 1239077
62336 1239077 1220644 1196903 1169081 1138242 1104646 1068387 1030507 992926 957121 923282 891136
62325 891136 861286 835177 813685 796160 781017 766942 753291 739686 725700 710963 695281
62314 695281 678536 660702 642032 623091 604456 586404 568934 552023 535782 520449 506362
62303 506362 493933 483502 475056 468086 461863 455957 450506 445973 442709 440765 439962 439968 440341 440676 440784
62288 440784 440715 440663 440954 441985 443941 446579 449521 452731 456507 460949 465722 470357 474552 478158 481213
62273 481213 484149 487563 491571 495739 499919 504729 510811 517969 525611 533770 543062 553767 565681 578968
62259 578968 594408 612595 633559 657555 685597 718637 756605 798823 844968 894923 947820
62248 947820 1002035 1056187 1109459 1160614 1207306 1246972 1278257 1301252 1316456 1323935 1323430 1314887
62236 1314887 1298630 1275173 1245000 1208528 1166184 1118636 1067057 1013259 959421 907421 858241
62225 858241 812005 768778 729308 694797 665797 641524 620539 602069 586415 574030 564594 557298
62213 557298 551764 548182 546541 546177 546368 546993 548203 549647 550571 550780 551020 552126 554073 556144 557815 559067
62197 559067 559870 559830 558578 556348 553922 552002 550715 549791 549161 549312 550894 553960 557788 561615 565468 570078
62181 570078 576053 583400 591818 601046 610732 620183 628537 635162 639838 642743 644456 645884 647986 651599
62167 651599 657545 666614 679199 695119 714109 736448 762841 793699 828659 866686 906307 945841
62155 945841 983811 1019199 1051002 1077606 1097160 1108864 1113558 1112785 1107528 1098058 1084509 1067028
62143 1067028 1045516 1019854 990637 959428 928082 897853 869106 841760 815990 792569 772521
62132 772521 756314 743506 733278 725228 719427 715773 713545 711749 709827 707878 706159 704529 702682
62119 702682 701021 700819 703005 706947 711148 715132 719791 725496 730757 733519 733249 730942 727534 723412 719267
62104 719267 716166 714348 712729 710022 705784 700156 693261 685367 677141 669302 662333 656769 653307 652252
62090 652252 653190 655520 658950 663262 668133 673547 679979 687731 696555 706336 717664 731160 746614 763374
62076 763374 781238 800355 820553 841464 863098 885566 908343 930487 951532 971568 990615
62065 990615 1008704 1026560 1045332 1065381 1086073 1107031 1128963 1152788 1178371 1204460 1229481
62054 1229481 1252144 1271700 1288000 1301007 1310050 1313986 1312366 1305999 1295911 1282086 1263695 1240237
62042 1240237 1211923 1179159 1142345 1102267 1060180 1017183 973832 930572 888351 848472 811782
62031 811782 778203 747167 718428 692268 668910 648048 629130 611936 596605 583225 571634
62020 571634 561487 552169 542835 533000 523074 513841 505487 497664 490455 484450 479650 475122 470252 465644
62006 465644 462106 459344 456513 453730 452064 452087 453240 454781 456674 459342 463089 467946 473623 479432 484721
61991 484721 489506 494260 498887 502484 504355 504815 504580 503770 501907 498601 493789 487502 479908 471546 463147
61976 463147 455229 448067 441918 436822 432221 427214 421454 415591 410660 407103 404450 401870 398955 396009
61962 396009 393600 391900 390627 389622 389169 389478 390071 390113 389364 388414 387899 387829 387940 388334 389439 391382 393776
61945 393776 396142 398408 400995 404572 409725 416657 425150 434884 445796 457984 471173 484478 496937
61932 496937 508336 519410 531032 543223 555044 565546 574695 583220 591586 599309 605334 608849 609648
61919 609648 607957 604271 599297 593698 587713 581158 573935 566441 559384 553352 548687 545730 544959 546786
61905 546786 551249 557987 566508 576427 587361 598705 609649 619507 627906 634588 639188 641372 641108 638608
61891 638608 634081 627776 620245 612250 604288 596440 588819 581884 576024 570968 565930 560448 554846 549767
61877 549767 545287 540605 534597 526678 517193 507025 496899 487054 477488 468372 460109 453035 447100 441963
61863 441963 437448 433868 431745 431264 432210 434475 438360 444192 451943 461479 472857 486015 500467 515823
61849 515823 532465 551071 571523 592953 614873 637506 660813 683985 706269 727482 747192
61838 747192 764164 777430 787274 794300 798013 797422 792791 785659 777073 766969 755555 744219 734460
61825 734460 726750 721182 718540 719815 724861 732342 740981 750253 759812 768833 776266 781417 783971 783527
61811 783527 779434 771192 758894 743152 724705 704360 683230 662529 642840 623918 605514 588082
61799 588082 572219 557760 544080 531154 519579 509546 500515 492107 484612 478256 472542 466791 460958
61786 460958 455502 450775 446792 443293 439771 435853 431902 428847 427101 426059 424993 423923 423182 422669 422149
61771 422149 421904 422375 423367 424275 424958 425772 426939 428470 430625 433733 437598 441698 446039 451130 457000 462905
61755 462905 468299 473552 479352 485817 492543 499169 505553 511524 516727 520641 522699 522654 520885 518099 514604
61740 514604 510206 504960 499638 495127 491507 488025 483940 479243 474566 470582 467552 465386 463954 463083
61726 463083 462301 461077 459621 459069 460355 463081 466075 468847 471741 474715 476944 478031 478823 480400 482750
61711 482750 485051 486862 488415 489954 491418 492627 493268 492786 490871 488021 485143 482518 479622 475974 471734
61696 471734 467414 463464 460239 457887 456029 453918 451160 447964 444558 440755 436453 432184 428662 425926
61682 425926 423379 420660 418085 416171 415090 414696 414801 415144 415336 415092 414545 414089 413845 413416 412285 410407
61666 410407 408333 406717 405823 405567 405886 406767 407835 408231 407274 405259 403369 402697 403453 405140 407200 409332
61650 409332 411342 412984 414047 414561 414925 415738 417286 419151 420575 421388 422274 423866 425893 427697 429308
61635 429308 431353 433826 435732 436250 435661 434634 433175 431041 428828 427646 427602 427411 425934 423534 421389
61620 421389 419891 418357 416253 413986 412224 410814 408867 405875 402396 399426 397306 395529 393547 391340
61606 391340 388967 385932 381528 375801 369691 364038 358835 353738 348943 345050 342069 339138 335440 331134
61592 331134 327057 323661 320633 317529 314400 311540 308925 306260 303527 301097 299210 297632 295979 294176
61578 294176 292415 290822 289400 288176 287174 286241 285105 283635 281971 280420 279260 278556 278087 277573 277089
61563 277089 277098 277903 279194 280345 281083 281616 282223 282931 283622 284179 284568 284930 285578 286642 287828 288738 289375 290071
61545 290071 290966 291867 292589 293076 293248 293099 292980 293342 294165 295063 296006 297332 298830 299508 298750 297216 296018
61528 296018 295339 294528 293295 292070 291204 290532 289890 289471 289371 289236 288707 287874 287001 286079 285018 284033 283458 283250
61510 283250 283058 282782 282707 282993 283356 283466 283455 283741 284398 284997 285182 285211 285709 286884 288184 288890 289011 289434 291019
61491 291019 293587 295950 297042 296875 296293 295978 296067 296612 297876 299905 302132 303787 304535 304482 303869 303133 302980
61474 302980 303823 305184 306268 307182 308972 312231 316190 319489 321477 322415 322832 323109 323432 323707 323588 322852
61458 322852 321615 320036 318181 316444 315662 316262 317537 318386 318594 318813 319399 320022 320542 321517 323395 325701
61442 325701 327480 328341 328733 329346 330567 332344 334270 335822 336774 337360 337918 338407 338518 338238 338103 338682 339908
61425 339908 341136 341923 342506 343320 344257 344798 344845 344945 345566 346644 348138 350448 353691 357000 359287 360573
61409 360573 361787 363296 364448 364710 364449 364153 363613 362447 360989 360017 359811 360002 360160 360123 359836 359318 358737
61392 358737 358254 357851 357502 357320 357294 357127 356703 356476 356976 358049 359025 359586 359996 360493 360929 361195 361588 362508 363942
61373 363942 365447 366572 367275 367956 369053 370508 371806 372663 373468 374761 376461 378071 379506 381233 383484
61358 383484 385801 387527 388449 388761 388775 388946 389924 392228 395824 400112 404344 408126 411644 415396 419487 423362
61342 423362 426508 429310 432671 436717 440455 443070 445068 447675 451416 455774 460017 463812 467007 469390
61328 469390 470901 471839 472623 473483 474433 475421 476317 476857 476717 475835 474665 474076 474779 476783 479470 482253 485078
61311 485078 488424 493038 499644 508491 519010 530220 541750 554152 567940 582617 597102 610946
61299 610946 624542 638024 650480 660456 667034 670198 670400 668054 663488 657156 649674 641494 632601 622719
61285 622719 611888 600605 589281 577845 566119 554370 543115 532563 522632 513527 505874 500176
61273 500176 496417 494240 493270 493112 493305 493495 493630 493968 494922 496719 499108 501498 503626 505972 509206 513409
61257 513409 518154 523187 528538 534018 539174 543890 548546 553372 558099 562424 566402 570102 573351 576168
61243 576168 579100 582659 586639 590358 593377 595622 597053 597666 597717 597481 596797 595222 592727 589978 587850
61228 587850 586827 586830 587468 588481 590092 592817 596736 601131 605193 609020 613540 619427 626370 633502 640280
61213 640280 646851 653747 661360 669528 677542 684657 690700 696062 701095 705654 709361 712182 714547 716940
61199 716940 719513 722187 724971 728061 731692 736157 741996 749820 759677 770757 781959 792504 801721
61186 801721 808614 812451 813771 814052 814110 813429 811359 808203 804594 800413 795108 788676 781510 773532 764374
61171 764374 754416 744854 736513 729155 722044 714618 706503 697577 688313 679504 671315 663039 654110 644869
61157 644869 635967 627433 618865 610263 602149 594934 588591 582906 577775 573294 569807 567794 567386 567978 568510
61142 568510 568175 566721 564177 560507 555613 549561 542785 536116 530425 526085 522823 520240 518357 517474 517618
61127 517618 518478 519891 522103 525396 529632 534422 539631 545578 552762 561565 572218 584836 599312 615292
61113 615292 632369 650341 669228 689134 710154 732298 755336 778701 801708 823865 844919
61102 844919 864684 883026 899946 915363 928795 939538 947197 951750 953044 950699 944748 935974 925249
61089 925249 912772 898337 882078 864479 845780 825883 804930 783634 762841 742928 723670
61078 723670 704667 685941 668177 652225 638223 625486 613429 602297 592678 584535 577181 570066
61066 570066 563231 557133 552444 549869 549566 550688 551928 552668 553302 554424 556123 558147 560440 563289 567174
61051 567174 572530 579485 587773 597003 607004 617824 629518 642147 655874 670909 687518 706109
61039 706109 726915 749387 772397 795510 819598 845709 873790 903203 934060 967231 1003203
61028 1003203 1041783 1082839 1126540 1172829 1221290 1271478 1322858 1374706 1426936 1480914 1538737
61017 1538737 1601958 1671734 1749724 1837630 1936023 2044890 2165379 2300138 2452693 2628454
61007 2628454 2836486 3088799 3397941 3776804 4240080 4803228 5480405 6287053 7244801
60998 7244801 8379034 9709736 11248513 13001503 14954095 17026443 19039929 20753857
60990 20753857 21971893 22638003 22843468 22755358 22545029 22362618 22324556 22468446 22699216
60981 22699216 22799725 22530288 21748773 20460876 18782187 16869069 14873972 12928921
60973 12928921 11134457 9548866 8189433 7046818 6099239 5318974 4676386 4145371 3706058
60964 3706058 3342337 3039049 2782742 2563255 2373009 2205836 2057385 1925378 1808214
60955 1808214 1703890 1610778 1528346 1456207 1393185 1337958 1289835 1248237 1211976 1179525 1149466
60944 1149466 1120505 1091925 1064332 1039035 1016329 995263 975376 957386 941639 927099 912764
60933 912764 899110 887210 877185 868394 860391 852875 845435 838262 832463 828790 826646 825233 825026 827064
60919 827064 831311 836867 843460 851568 861238 871894 883379 896170 910352 925140 939660 953657
60907 953657 967271 980633 993743 1006237 1017185 1025578 1031133 1034242 1035040 1032914 1027138 1017788 1005927
60894 1005927 992874 979225 964544 948177 930437 912669 895952 880111 864217 847744 830896
60883 830896 814121 797656 781361 764703 747158 728913 710990 694491 679892 667125 655829
60872 655829 645292 634681 623781 613170 603392 594394 586045 578588 572081 565917 559548 553229 547479
60859 547479 542200 537006 532067 527880 524415 521119 517603 513734 509298 504248 499131 494644 490850 487313
60845 487313 483826 480422 476922 473131 469302 465731 462036 457528 452208 446736 441467 436184 430736 425240
60831 425240 419673 413987 408687 404472 401229 398132 394959 392596 391863 392463 393456 394316 395098 395989 397092 398490
60815 398490 400258 402481 405255 408431 411425 413670 415211 416438 417312 417479 417148 417116 417665 418088 417765 417140
60799 417140 417130 417884 418676 418837 418365 417735 417442 417634 417882 417365 415549 412696 409567 406741 404246 401663 398364
60782 398364 393880 388416 382978 378644 375567 372874 369683 366078 362876 360518 358559 356417 354247 352671
60768 352671 351812 351101 350094 348971 348096 347624 347793 349035 351252 353459 354782 355627 357195 359847 362571 364145
60752 364145 364410 364261 364708 366126 368239 370703 373660 377499 382054 386423 389912 392822 395850 398959 401305
60737 401305 402089 401065 398389 394474 389878 384935 379593 373896 368322 363227 358342 353433 349071 345944
60723 345944 343593 340719 336730 332219 327939 324119 320892 318493 316731 314947 312835 310772 309137 307851
60709 307851 306778 306013 305540 305079 304472 303787 303041 302283 301920 302228 302601 302141 301123 300940 302326 304493 306369
60692 306369 307744 308764 309256 309259 309471 310442 311959 313841 316593 320509 324744 328240 331125 334345 338265 342441
60676 342441 346549 350695 354978 359476 364577 370662 377517 384530 391284 397499 402720 406672 409635 411817
60662 411817 412667 411566 409009 406237 403823 401410 398767 396148 393528 390426 386848 383610 381319 379606
60648 379606 377825 375971 374406 373088 371663 370193 369293 369415 370204 370603 369567 366709 362354 357098 351535
60633 351535 346370 342362 339749 337985 336410 335023 334197 333820 333319 332506 331788 331464 331351 331341 331803 333030 334542
60616 334542 335346 334816 333163 331174 329667 329057 329212 329701 330211 330723 331329 332004 332620 333098 333553 334233 335243
60599 335243 336352 337319 338384 340038 342106 343583 343842 343690 344595 347047 350232 353125 355188 356068 355545 354140
60583 354140 353042 352890 353068 352676 351792 351247 351456 352090 352764 353495 354468 355850 357950 361128 365358 370226 375564
60566 375564 381795 389422 398380 408203 418624 429520 440271 449704 457001 462375 466432 469079 469515 467316
60552 467316 463073 457878 452540 447500 443162 439999 438462 438960 441698 446337 452115 458568 465977 474888
60538 474888 485460 497571 511243 526482 542787 559225 574984 589513 602189 612248 619109 622571
60526 622571 622676 619602 613678 605423 595683 585813 577271 570576 564893 559069 552937 547175 542242 538179
60512 538179 535334 534353 535174 536717 538011 539186 541078 544225 548609 554050 560545 568472 578690 592163
60498 592163 609263 629686 653204 680148 710916 745303 782593 821989 862675 903698 944042
60487 944042 982557 1017622 1047153 1069286 1082890 1087323 1082102 1067181 1043248 1011398 972759 928752
60475 928752 881423 833089 785751 741071 700445 664536 632900 604593 579068 556181 535668
60464 535668 517248 501102 487557 476248 466229 456977 448732 441721 435636 430086 425060 420662 416770
60451 416770 413207 409855 406459 402751 398986 395775 393090 390019 386015 381868 378818 377070 375909 374982
60437 374982 374570 374609 374349 373298 371883 370784 370119 369596 369046 368405 367537 366491 365726 365649 366071 366435 366429 366104 365660
60418 365660 365421 365816 366863 367840 368004 367543 367294 367550 367824 367946 368653 370622 373426 375989 377808 379178 380446
60401 380446 381627 382703 383817 385063 386449 388051 389878 391587 392744 393460 394389 395959 397929 399874 401757
60386 401757 403769 405896 407952 409878 411725 413477 415162 417046 419445 422343 425395 428242 430639 432364
60372 432364 433351 433970 434927 436721 439270 442133 444979 447698 450206 452294 453670 454142 453812 453173 452913 453505
60356 453505 454977 457080 459653 462743 466435 470759 475778 481646 488421 495903 503792 511908 520069 527760
60342 527760 534249 539202 542936 545766 547244 546434 542948 537394 530728 523610 516545 510197 505019 500733
60328 500733 496671 492655 489105 486226 483497 480199 476085 471331 466140 460780 455829 452024 449785 449016
60314 449016 449276 449949 450508 450951 451955 454263 457929 462447 467620 473967 482222 492793 505809 521285
60300 521285 538925 557908 577093 595295 611278 623688 631311 633334 629429 619866 605732 588691
60288 588691 570201 551128 532208 514470 498879 485813 475353 467703 462774 459619 456969 454361
60276 454361 452128 450342 448492 446311 444142 442125 439737 436660 433547 431261 429641 427699 424926 421800
60262 421800 418969 416474 413959 411324 408876 406924 405367 403748 401791 399872 398766 398864 399800 400964 402060
60247 402060 402984 403437 403153 402477 402301 403250 405065 406865 407968 408476 409120 410480 412337 413843 414298 413632 412230
60230 412230 410652 409622 409824 411390 413841 416724 419938 423177 425586 426622 427039 428321 431096 434560 437491
60215 437491 439423 440886 442940 446487 451531 457061 462059 466630 471682 477544 483562 489211 494828 500857
60201 500857 506980 512642 518003 523736 530080 536716 543426 550235 556863 562648 567202 570771 573718 575980
60187 575980 577235 577315 576257 574211 571593 569139 567397 566183 564758 562537 559380 555233 549927 543544 536749
60172 536749 530462 525268 521285 518464 516662 515422 514001 511807 508788 505337 501902 498632 495297 491596
60158 491596 487641 484000 481077 478627 476230 474104 472914 472764 472955 472982 473200 474101 475386 476246 476280 475696 474863
60141 474863 474155 474019 474635 475641 476692 478161 480734 484390 488399 492379 496720 501801 507323 512659 517411
60126 517411 521358 524343 526535 528405 530121 531345 532025 532995 535275 538946 543231 547556 552042 556923 561946
60111 561946 566610 570754 574709 578994 583901 589203 594147 597859 599972 600862 601254 601591 601800 601499 600336
60096 600336 598150 595060 591507 588115 585336 583115 580929 578140 574403 569930 565504 562100 560187 559344
60082 559344 558736 557989 557379 557149 556894 555830 553499 550074 546139 542293 538866 535838 533057 530435 527757
60067 527757 524436 519965 514690 509618 505178 500661 495275 489314 483743 478937 474459 469946 465599 461725
60053 461725 458258 454904 451558 448553 446596 446207 446983 447748 447812 447786 448700 450640 452868 454974 457176 459616
60037 459616 462209 465199 469063 473702 478443 482985 487640 492368 496321 498768 499894 500247 499954 498990 497785
60022 497785 496870 496045 494388 491185 486639 481653 476957 472491 467765 462898 458871 456310 454363 451518 447399
60007 447399 442920 438669 434178 429088 424056 419904 416587 413618 410882 408392 405778 402771 399851 397707
59993 397707 396322 395217 394343 394099 394647 395839 397723 400553 404276 408469 412795 417187 421630 426066 430409
59978 430409 434407 437667 440076 441976 443590 444531 444300 443086 441580 440050 438031 435022 431261 427722 425376
59963 425376 424354 423861 423134 422358 422192 422515 422448 421822 421702 422906 424760 426109 426856 427616 428375 428568 428236 428048
59945 428048 428230 428476 428967 430487 433263 436484 439233 441217 442372 442528 441911 441384 441648 442555 443562 444540
59929 444540 445793 447557 449885 452849 456554 460942 465713 470442 474863 479173 483961 489661 496145 503063
59915 503063 510347 518017 525695 532869 539587 546291 552870 558404 562062 563835 564140 563119 560640 556766
59901 556766 551893 546524 541076 535846 531058 526893 523391 520254 516990 513493 510339 508280 507609 508310 510489
59886 510489 514091 518377 522373 525924 529743 534337 539485 544950 551024 557936 565149 571796 577650 583247
59872 583247 589105 595073 600433 604479 606954 607954 607523 605588 602384 598582 594617 590126 584533 578044
59858 578044 571477 565210 558993 552896 547751 544257 542221 541070 540729 541581 543939 547973 553899 561703 570720
59843 570720 579794 587821 593983 597734 598998 598405 597064 595985 595735 596436 597743 598827 598675 596714 593116
59828 593116 588364 582577 575537 567524 559744 553450 548626 544155 539420 535134 532210 530444 528963 527507
59814 527507 526437 525774 525162 524805 525445 527147 528887 529702 529602 528973 527690 525280 521540 516590 510779 504940
59798 504940 500246 497243 495232 493123 490678 488502 487037 486055 485052 483679 481800 479576 477575 476471
59784 476471 476456 477062 477631 477853 477871 477927 478041 478014 477779 477593 477790 478441 479442 480792 482525 484449 486290 488039
59766 488039 489803 491337 492192 492445 492833 493989 495883 498175 500723 503463 506122 508419 510396 512371 514697
59751 514697 517681 521475 525869 530419 534979 539947 545793 552416 558994 564470 568290 570911 573404 576221
59737 576221 578518 579175 578340 577345 577143 577575 578198 578971 579747 579965 579460 578984 579251 579861 579835 578909 577702 576789
59719 576789 576185 575601 574775 573617 572339 571268 570313 568944 567013 565257 564534 564894 565852 567212 569062 571247
59703 571247 573522 576096 579428 583584 588256 593283 598602 603885 608937 614386 621192 629292 637394 644411
59689 644411 650556 656637 662725 668003 671719 673848 674814 674912 674212 672964 671819 671356 671328 670664 668470 664883
59673 664883 660703 656428 651984 647242 642315 637314 632231 627217 622657 618705 614916 610587 605555 600576
59659 600576 596848 595087 595107 596347 598665 602291 607044 612071 616565 620476 624269 628338 632894 638062 643599
59644 643599 648736 652717 655398 656928 657014 654926 650232 643186 634471 624884 615248 606196 597989 590694 584468
59629 584468 579336 574788 570007 564624 558963 553510 548414 543625 539298 535823 533392 531558 529379 526207
59615 526207 522330 518525 514940 510874 505841 500337 495146 490339 485528 480761 476554 473233 470843 469544
59601 469544 469397 469792 469818 469324 469052 469569 470604 471615 472491 473407 474439 475612 477016 478573 479928 480759 480968
59584 480968 480483 479245 477579 476211 475553 475217 474475 473067 471272 469357 467267 464860 462200 459534 457091
59569 457091 454907 452859 450813 448763 446824 445120 443712 442533 441379 440080 438702 437431 436217 434796
59555 434796 433206 431945 431409 431425 431670 432254 433478 435286 437428 439999 443312 447333 451709 456299 461121
59540 461121 465959 470730 476326 484296 495376 508918 524092 540972 559780 579351 596931 609542
59528 609542 615428 614693 609130 601359 593498 586382 580064 574852 571486 570373 571007 572299 573273 573378 572402
59513 572402 570350 567453 564083 560550 556859 552671 547493 540975 533124 524348 515322 506709 498933 492215
59499 492215 486735 482609 479622 477151 474519 471458 468244 465527 464017 464053 465268 466830 468173 469390 470766
59484 470766 472245 473637 475221 477726 481644 486722 492151 497199 501738 506271 511296 516608 521422 525303
59470 525303 528603 531742 534422 535998 536376 536112 535659 534947 533696 531879 529927 528620 528537 529380 530144 530359
59454 530359 530853 532795 536308 540639 545438 550992 557235 563414 569064 574640 580745 587190 593155 597891
59440 597891 600873 601526 599310 594156 586702 578088 569482 561626 554720 548652 543173 537900 532563 527490
59426 527490 523468 520798 518842 516978 515598 515611 517306 520454 525241 532185 541181 551485 562763 575423
59412 575423 589753 605465 622294 640443 660129 681004 701809 720024 732205 735910 731678 722442
59400 722442 710913 698380 685969 675612 669177 667542 670837 678189 686448 690577 686909 675752 660005
59387 660005 641960 622398 602028 582219 564316 549217 537540 529300 523542 519144 515968 514485
59375 514485 514474 514995 515587 516554 518078 519912 522074 524965 528595 532413 536091 539824 543683 547432 551229
59360 551229 555775 561393 567587 573922 580736 588525 597107 606014 615304 625455 636636 648586 661071
59347 661071 674028 687324 700821 714707 729446 745249 761808 778587 795176 811273 826466
59336 826466 840196 851949 861407 868423 872942 875022 874900 872879 869082 863405 855772 846370 835544 823556
59322 823556 810600 797058 783610 770978 759484 748883 738682 728607 718665 708817 698948 689425
59310 689425 681329 675568 671853 669035 666521 664835 664717 666273 669327 674048 680772 689544 700255 712948
59296 712948 727493 742997 757793 769836 777062 777915 772199 761352 747520 732383 716938 701939
59284 701939 687953 675157 663522 653137 644051 636032 628925 623047 618739 615688 613194 611091 609905
59271 609905 610155 611967 615373 620424 626883 634192 641841 649471 656604 662711 667634 671572 674493 675915
59257 675915 675386 672888 668598 662515 654571 645020 634625 624385 614956 606187 597417 588465 580182 573691
59243 573691 569163 565685 562270 558680 555401 553186 552607 553612 555461 557430 559515 562038 564701 566677
59229 566677 567786 568893 570731 572852 574191 574327 573608 572268 570122 567181 564005 561044 557914 553793 548603
59214 548603 543543 540199 539188 539781 540766 541488 541995 542488 542894 542999 542872 543079 544303 546641 549417 552029
59198 552029 554850 558827 564106 569704 574805 579759 585301 591256 596777 601567 606095 610673 615084 619231
59184 619231 623445 627844 631876 634824 636526 637415 638133 639214 640776 642378 643431 643909 644390 645326 646583
59169 646583 647822 649032 650502 652501 655132 658274 661592 664847 668325 672665 678093 683998 689433 693825
59155 693825 697121 699497 701187 702406 703164 703103 701712 698771 694662 690268 686404 683134 679676 675199 669797
59140 669797 664486 660221 657025 654050 650288 645204 638969 632280 625878 620141 615035 610254 605330 599906
59126 599906 594223 589170 585505 583115 581352 579939 579066 578710 578569 578817 580340 583776 588679 594024 599296
59111 599296 604668 610299 615962 621438 626884 632578 638440 644043 649083 653616 657737 661217 663764 665604
59097 665604 667390 669360 670958 671517 671031 669863 668042 665438 662504 660180 658901 658169 657264 655913 654132
59082 654132 651863 649180 646514 644184 641716 637993 632232 624771 616855 609623 603242 597006 590272 583186
59068 583186 576476 570703 565892 561704 557690 553464 548896 544175 539585 535320 531580 528600 526343 524366
59054 524366 522306 520260 518374 516334 513690 510555 507495 504867 502752 501404 501157 501780 502420 502342 501408 499930
59038 499930 498506 497931 498629 500068 501204 501597 501642 501679 501538 501171 501107 501968 503962 507109 511528 517189 523773
59021 523773 531106 539448 549105 560023 571868 584168 596272 607552 617793 627014 634859 640746 644730
59008 644730 647525 649395 649689 647955 644875 641577 638569 636009 634535 634952 637232 640506 644060 647800 651763
58993 651763 655700 659241 662099 664029 664849 664582 663396 661490 659163 656910 655154 653964 653188 652750 652640
58978 652640 652826 653394 654718 657233 661120 666385 673105 681371 691023 701633 712786 724379 736717 750193
58964 750193 764649 779103 792484 804623 816112 827122 836869 844481 849866 853447 855441 855755 854159
58951 854159 850180 843206 833217 821119 807967 794122 779561 764597 749672 734749 719654 704947
58939 704947 691774 680703 671258 662753 655081 648481 642948 638223 634111 630489 627067 623472 619675 616267
58925 616267 614101 613509 613882 614178 613885 613338 613077 613178 613322 613307 613228 613282 613499 613661 613495 613149 613415 615084 617987
58906 617987 621023 623339 625195 627500 630895 635561 641642 649394 658946 670082 682209 694569 706772
58893 706772 719182 732383 746161 759406 771299 782187 793105 804836 817739 831897 846941
58882 846941 862039 876570 890576 904241 917222 928920 939005 947169 952721 955089 954601 952212 948526
58869 948526 943535 937157 929535 920889 911557 902150 893208 884680 876147 867526 859235 851666 844767 838077
58855 838077 830923 822757 813599 803992 794279 784243 773731 763261 753416 743926 734010 723532 713238
58842 713238 703809 695227 687058 678926 670646 662297 654180 646398 638582 630449 622416 615167 608666 602176
58828 602176 595305 588587 582979 579210 577564 577749 578848 579858 580482 581140 582260 583971 586474 590177 595250
58813 595250 601326 607806 614220 620361 626311 632240 637853 642233 644695 645702 646397 647316 648094 648335 647995
58798 647995 646818 644217 640102 635188 630061 624478 618013 610957 604027 597507 591245 585308 580067 575693
58784 575693 572052 569183 567493 567255 568166 569611 571325 573628 577013 581622 587135 593028 598748 603697 607280
58769 607280 609079 608885 606573 602170 596113 589180 581994 574743 567436 560169 553008 545884 538760 531715
58755 531715 524805 518220 512639 508968 507348 506810 506252 505434 504790 504679 505221 506393 507840 508972 509718 510872
58739 510872 513210 516731 521154 526516 532556 538158 542400 545845 549816 554613 559393 563631 567631 571621
58725 571621 575371 578842 582266 585414 587693 589166 590627 592486 594493 596828 600411 605641 611655 617460
58711 617460 623192 629633 636966 644514 651417 657169 661778 665641 668893 670731 669813 665523 658428 649397
58697 649397 638820 626770 613312 598452 582409 566140 550944 537229 524304 511660 499840
58686 499840 489707 481512 474995 469758 465169 460534 455842 451764 448598 445883 443421 441855 441646 442113
58672 442113 442221 441755 441152 440752 440887 442130 444701 448012 451552 455847 461797 469366 477533 485278 491945
58657 491945 497065 500535 502777 504013 503604 500833 496123 490713 485301 479726 473959 468567 464093 460564
58643 460564 457718 455167 452307 448646 444429 440539 437707 436121 435669 436074 436792 437365 437960 439130 441013
58628 441013 443205 445438 447831 450312 452364 453633 454347 454858 455108 454952 454750 455146 456346 457938 459512 461193
58612 461193 463420 466369 469818 473526 477497 481836 486551 491663 497243 503009 508087 511644 513820 515625
58598 515625 517824 520268 522392 523929 524982 525735 526349 526799 526685 525583 523861 522730 523232 525502 529224
58583 529224 534273 540482 547221 553818 560253 566949 574043 581257 588379 595452 602534 609638 616840 624142
58569 624142 631342 638333 645501 653533 662900 673743 686102 699964 715171 731577 749259 768334
58557 768334 788608 809542 830420 850286 867899 882165 892738 900028 904578 906560 905873 902606 897348
58544 897348 891030 884435 877838 871089 863916 856069 847340 837654 826911 814532 799469 781234 760823
58531 760823 740180 720769 703044 687072 672935 660504 649490 639896 631881 625137 619066 613667
58519 613667 609528 606761 604658 602600 600563 598465 595878 592854 590221 588503 587184 585562 583679 581868
58505 581868 580022 577990 576159 574939 574061 573006 571801 570892 570545 570758 571342 571771 571504 570839 570813 571869 573349
58488 573349 574802 576871 580153 584051 587747 591718 597215 604696 613687 623814 635039 647157 659968
58475 659968 673653 688182 702669 716121 728485 740015 749900 756503 758912 757535 753338 747288 740327
58462 740327 733115 725793 718551 712101 706990 702901 699426 697178 697320 700336 706029 714248 724596 735762
58448 735762 746189 755247 762901 768610 771565 771686 769303 764168 756000 745793 735348 725583 716436 708249
58434 708249 701819 697041 692905 689160 686798 686559 688062 690758 694657 699764 705747 712552 720462 729205
58420 729205 737897 746153 754377 762626 770048 775805 779749 781881 781968 780080 776822 772705 767895 762691 757478
58405 757478 752096 746109 739851 734336 729864 725693 721395 717626 715132 713809 713242 713431 714509 716316 718709
58390 718709 721828 725733 730125 734558 738541 741527 743418 745040 747398 750496 753481 755828 757654 759117
58376 759117 760439 762310 765292 768908 772330 775714 779724 784032 787810 791602 797074 804699 813267 822032
58362 822032 831632 842348 853093 862996 872661 882951 893687 904366 915026 925571 935206 943395
58350 943395 950467 956623 961349 964501 967013 969792 972840 976083 980051 985050 990598 996389 1002847 1010147
58336 1010147 1017775 1025705 1034866 1045681 1057321 1069252 1082326 1097264 1113157 1128569 1143208 1157393
58324 1157393 1170793 1182915 1194189 1205374 1216290 1226063 1234175 1240635 1245732 1250293 1255484 1261688 1268227
58311 1268227 1274687 1281606 1289342 1297388 1305588 1314909 1326110 1338608 1351589 1365195 1379663 1394327
58299 1394327 1408658 1423417 1439617 1456994 1474469 1491485 1508072 1524359 1540836 1558314 1576944
58288 1576944 1596097 1615778 1637005 1660115 1684036 1708120 1733296 1760365 1788560 1816963 1845986
58277 1845986 1876125 1906564 1936527 1966824 1998598 2031618 2065202 2099782 2136068 2173735 2212318
58266 2212318 2252431 2294763 2339053 2385396 2435181 2489133 2545750 2603436 2662939 2725772 2791418
58255 2791418 2858115 2925449 2994173 3064323 3135515 3208407 3284013 3362177 3442331 3525011 3611131
58244 3611131 3700760 3794131 3892755 3997875 4109062 4225996 4350294 4483698 4625757 4775244
58234 4775244 4932662 5099570 5276922 5465950 5669019 5887589 6120949 6368963 6634125
58225 6634125 6918889 7223384 7548272 7897447 8275143 8682925 9122648 9599775 10120399
58216 10120399 10687685 11304966 11979598 12720037 13532265 14423681 15407584 16499424 17712428
58207 17712428 19062683 20575620 22282550 24215702 26414328 28932969 31838548 35207067
58199 35207067 39136252 43762836 49265979 55868178 63851842 73573480 85449172 99928831
58191 99928831 117484445 138575987 163541806 192442121 224917640 260022738 295963899
58184 295963899 329913667 358307728 377795720 386383303 383982505 372033203 352622575
58177 352622575 327801804 299398340 269105537 238519564 209027568 181661617 157039584
58170 157039584 135411755 116759595 100890438 87508052 76268595 66829617 58882825
58163 58882825 52163388 46447142 41550185 37328617 33670604 30485549 27699549 25254052
58155 25254052 23100328 21193763 19495383 17975821 16612707 15384748 14271793 13259176
58147 13259176 12337681 11499372 10736434 10043092 9414957 8846362 8330789 7863333 7440118
58138 7440118 7055762 6703817 6379192 6078002 5795906 5529053 5276058 5036777 4809841
58129 4809841 4593578 4388539 4196581 4017861 3850899 3694991 3550292 3415852 3289834
58120 3289834 3171442 3060718 2956750 2858039 2764311 2676133 2593058 2513931 2438674 2367962 2301437
58109 2301437 2237951 2177217 2119572 2064499 2011079 1959488 1910363 1863140 1816780 1771661 1728893
58098 1728893 1688154 1648120 1608791 1571440 1536343 1502400 1468992 1436476 1404850 1373710 1343625
58087 1343625 1315881 1290688 1267102 1244705 1223814 1204026 1184188 1163985 1144085 1124549 1104570
58076 1104570 1083952 1063432 1043399 1023620 1004325 986113 968698 951146 933489 916744 901311
58065 901311 886805 873476 862064 852025 841639 830383 819604 810285 801698 792919 784161 775719
58053 775719 766876 756878 746118 735550 725753 717039 709562 702760 695580 687790 680189 673138 665959 658316
58039 658316 651039 644828 639150 633217 627189 621579 616257 610860 605497 600187 594188 586690 577734 567845
58025 567845 557275 546302 535703 526171 517587 509560 502246 495980 490415 484812 479021 473578 468891
58012 468891 464803 460930 456985 452819 448473 444212 440340 437038 434429 432629 431600 431104 430869 430681 430415
57997 430415 430187 430369 431157 432228 433104 433616 433616 432604 430311 427395 424798 422532 419963 417150 414925 413543
57981 413543 412288 410649 408902 407129 404723 401477 398330 396358 395571 395321 395310 395567 395978 396534 397623 399418
57965 399418 401271 402287 402284 401689 400760 399509 398191 397277 396913 396796 396599 396244 395733 394895 393396 391041 388099
57948 388099 385196 382694 380383 378088 376257 375417 375289 375183 375219 376290 378716 381830 385186 389350 395037
57933 395037 402140 410064 418424 426919 435084 442624 449549 455608 460174 463061 464823 465769 465338 463050 459472
57918 459472 455549 451470 446901 441928 436977 432124 427187 422314 417823 413671 409714 406296 403900 402362
57904 402362 401024 399521 397838 395747 392902 389471 386002 382569 378665 374101 369505 365700 362972 361126
57890 361126 359914 359144 358557 357876 356961 355919 355066 354710 354877 355348 356018 357048 358484 359952 360928 361249 361197
57873 361197 361148 361178 360906 359778 357770 355767 354836 355045 355484 355473 355167 354777 353994 352717 351665 351560 352197 353079
57855 353079 354566 357403 361259 364715 366906 368371 370066 372249 374655 377077 379141 379963 378796 376024
57841 376024 372897 370077 366880 362341 356842 352106 349466 348469 347493 345432 342453 339374 336839 334984 333394
57826 333394 331386 328879 326939 326811 328301 329799 330105 329577 329233 329503 330321 331771 333969 336750 339959 343530
57810 343530 346763 348158 346769 343321 339258 335048 330209 324639 318997 313874 309438 305898 303470 301833
57796 301833 300337 298860 297849 297452 297316 297385 298208 300191 303095 306524 310375 314478 318228 321007 322790
57781 322790 324104 325537 327393 329572 331677 333407 334953 336792 339144 341874 344916 348405 352185 355475
57767 355475 357327 357399 356203 354534 352692 350279 346852 342630 338259 333929 329260 324277 319933 317185 315901
57752 315901 315207 314594 314160 313990 314036 314563 316070 318605 321601 324491 327128 329564 331814 333946 336117 338393
57736 338393 340621 342461 343509 343589 343052 342482 341971 341111 339897 338993 338683 338226 336977 335550 334944 334971 334558
57719 334558 333367 331968 330497 328306 325101 321392 317573 313576 309763 307115 305945 305204 303649 301093
57705 301093 297972 294354 290057 285349 280903 277266 274696 273185 272273 271243 269924 268948 268851 269222 269197 268450
57689 268450 267249 265799 264054 262101 260314 259050 258444 258465 259068 260322 262473 265822 270556 276806 284817
57674 284817 294874 307183 322088 340320 362685 389627 421438 458647 501569 549391 599948
57663 599948 650047 695339 730277 749613 750771 734639 704279 663664 617432 570315 525670 484907
57651 484907 448640 417647 392230 371479 354081 339491 327785 318780 311974 306965 303322 300388
57639 300388 297748 295638 294351 293545 292692 291971 292169 293731 296265 298785 300250 300225 299354 298761 298642 297935 295782
57622 295782 292817 290406 289075 288298 287438 286151 284226 281813 279700 278661 278521 278355 277510 275972 274012
57607 274012 272098 270928 270871 271394 271622 271374 271058 270707 269852 268396 266893 265764 264837 263838 262868 262115 261496
57590 261496 260808 259963 258865 257272 254981 252113 249205 246996 245914 245643 245398 244805 244201 243871 243375 242010
57574 242010 239632 236658 233563 230835 229025 228254 227845 227027 225799 224628 223612 222566 221679 221299 221153 220549
57558 220549 219347 218086 217139 216424 215939 215907 216275 216712 217211 218077 219255 220370 221492 223109 225076 226378
57542 226378 226329 225413 224519 223903 223356 222866 222537 222158 221358 220111 218840 218169 218633 220259 222258 223496 223549 222987
57524 222987 222478 222088 221686 221501 221770 222194 222339 222452 223365 225542 228534 231416 233559 235003 236229 237550
57508 237550 238694 239139 238876 238600 238960 239883 240770 241136 240820 239791 238139 236225 234566 233459 232802 232259 231595
57491 231595 230850 230237 229866 229591 229165 228449 227440 226237 225149 224611 224704 224941 224919 224980 225767 227201 228503 229273
57473 229273 229877 230520 230534 229120 226386 223174 220139 217461 215233 213517 212032 210288 208201 206297 205136
57458 205136 204767 204863 205201 205802 206643 207411 207681 207320 206665 206291 206619 207718 209343 211048 212389 213187 213590 213796
57440 213796 213861 213907 214338 215497 217119 218444 218995 219018 219105 219651 220804 222631 224991 227293 228746 229010 228539
57423 228539 228176 228381 228922 229323 229449 229587 230075 231064 232481 233946 234812 234657 233779 232837 231970 230798 229340
57406 229340 228331 228324 229047 230027 231271 232749 233733 233489 232321 231265 230871 230972 231350 231907 232272 232081 231710 232002
57388 232002 233181 234710 236298 238342 241157 244415 247657 250877 254271 257782 261114 263943 266043 267459
57374 267459 268487 269183 269090 267928 266311 265134 264448 263616 262419 261160 259800 257972 255933 254505 253895 253536
57358 253536 253301 253779 254985 255925 256039 256077 256875 258156 259336 260600 262284 263901 264793 265195 265739 266360 266636
57341 266636 266836 267651 269113 270670 272185 274029 276281 278553 280600 282447 284004 285165 286231 287643 289318
57326 289318 290743 291642 292047 291944 291433 291101 291557 292618 293492 293814 294003 294617 295805 297369 298896 299847 299953
57309 299953 299556 299246 299334 299921 301190 303022 304617 305175 304896 304724 305065 305433 305416 305371 305907 307177 308969 311151
57291 311151 313733 316670 319802 322931 325867 328437 330513 332075 333405 335049 337286 339717 341889 344293
57277 344293 347949 352769 357229 360259 362642 365693 369279 372261 374444 376794 379817 382927 385674 388581
57263 388581 392300 396627 400784 404217 406877 409054 411181 413526 416025 418577 421270 423981 426165 427643
57249 427643 429276 432026 435545 438548 440476 441871 443159 444186 445193 447126 450429 454322 457850 460993
57235 460993 464189 467362 470112 472451 474801 477426 480237 482939 485132 486599 487736 489421 492203 495885
57221 495885 499986 504283 508785 513608 518984 524937 530799 535580 539048 542047 545576 549975 555086 560585
57207 560585 565907 570520 574652 579239 584766 590701 596407 601999 607779 613431 618465 623186 628568 635326
57193 635326 643670 653735 665590 678778 692323 705405 717865 730071 742443 755109 767989 781235
57181 781235 795496 811483 829331 848718 869476 891564 914453 937216 959482 981690 1004128
57170 1004128 1026249 1047296 1067028 1085522 1102841 1119428 1136221 1153717 1171260 1187837 1203346
57159 1203346 1218593 1234362 1251041 1268856 1287820 1307544 1327642 1348350 1370431 1394593 1421308
57148 1421308 1451025 1484160 1520909 1561232 1604710 1650264 1696474 1742601 1788964 1835894 1882696
57137 1882696 1928104 1971456 2012977 2053241 2092975 2133192 2175012 2219492 2267990 2322362 2384248
57126 2384248 2454317 2532506 2618640 2712368 2813064 2920527 3035586 3159445 3292801 3436206
57116 3436206 3590861 3758260 3939345 4134888 4346590 4577021 4828596 5103367 5403733
57107 5403733 5732697 6093640 6490729 6929660 7417594 7962931 8576304 9272180 10069543
57098 10069543 10992236 12070041 13339338 14841697 16622028 18728118 21209214 24110381
57090 24110381 27464900 31289522 35582345 40320117 45456970 50929153 56662837 62577521
57082 62577521 68585788 74594950 80503320 86175564 91405960 95911591 99385465 101581796
57074 101581796 102370800 101733460 99725268 96451810 92065070 86761788 80772083 74342831
57066 74342831 67720659 61133430 54772030 48779538 43250758 38237705 33756646 29796394
57058 29796394 26327359 23308583 20691970 18426272 16462038 14755212 13267668 11966300
57050 11966300 10822671 9812953 8917294 8119076 7404586 6762652 6184007 5660958 5187402
57041 5187402 4758512 4370106 4018640 3701656 3417472 3164047 2938498 2737953 2560430
57032 2560430 2404697 2269748 2154937 2060397 1986743 1934185 1902219 1890500 1899624 1929366 1974086
57021 1974086 2019234 2044216 2031382 1974088 1877379 1752640 1612395 1468196 1329577 1202721
57011 1202721 1090203 992372 908510 836839 774844 720485 672714 630615 592953 558967 528715
57000 528715 501988 477608 454351 431882 410202 388992 368251 348847 331545 316025 301736
56989 301736 289279 280047 274837 273597 276175 282318 291179 301680 313251 325325 336216 343489 345603
56976 345603 342606 335248 324239 310409 294828 278436 262084 246984 234509 225263 218857 214752
56964 214752 212984 213904 217663 224173 233391 245482 260791 279440 300652 322488 342459 358280 368062
56951 368062 370492 365475 354343 338860 320256 299635 278727 259379 242536 228503 217881 211246
56939 211246 208101 207267 208517 212956 221607 234458 251128 271580 295753 322960 351802 380050 404449
56926 404449 421468 428759 425730 412923 391609 364059 333288 302006 272081 244862 221144 200694
56914 200694 182683 166860 153616 142799 133484 125216 118480 113465 109334 105343 101810 99228 97175
56901 97175 95017 93110 92422 93271 95180 97730 100918 104837 109553 115265 122300 131151 142602 157351
56887 157351 175240 195320 216800 239222 261348 280704 294923 303131 305646 303066 296297 286795
56875 286795 275902 264241 252370 241581 233335 228274 226408 227941 233271 242595 256196 274867 299435
56862 299435 330078 366576 408654 455329 504183 551907 595155 630373 653638 662101 655758 637165
56850 637165 609597 576200 540406 505807 475068 449493 429701 416221 409505 410037 418496 435461
56838 435461 461165 496056 541213 597388 663735 737973 817132 896810 969846 1027418 1062533
56827 1062533 1072458 1058189 1022892 971269 909111 842047 774503 709923 651350 601146 560346
56816 560346 528751 505714 490884 484567 487592 500655 523657 555834 596339 644165 697220 751688
56804 751688 802366 843530 869992 878290 867557 839352 796833 744215 686402 628015 572257 520884
56792 520884 475232 436658 405918 382695 366131 355512 350333 350218 355153 365530 381629 403041
56780 403041 428444 455536 481107 501654 514380 517680 511021 494840 470708 441064 408420 374826
56768 374826 341875 310674 281657 254847 230513 209226 191106 175481 161660 149722 140085 132467
56756 132467 125775 119142 112741 107345 103228 99827 96488 93158 90104 87292 84540 82156 80730 80124
56742 80124 79337 77751 75921 74666 73889 72982 72003 71664 72275 73352 74275 74774 74824 74601 74577 75210 76464 77994
56724 77994 79690 81602 83456 84783 85525 86058 86613 87134 87654 88345 89152 89793 90127 90243 90253 90353 90873 91852
56706 91852 92738 93057 93176 93878 95315 97016 98800 100960 103571 106215 108414 109702 109386 107106 103789 101240
56690 101240 100414 100629 100712 100312 99774 99342 99011 98839 98981 99449 100041 100430 100394 100092 100051 100675 101957 103889 106727
56671 106727 110345 113726 115842 116856 117703 118657 119179 119138 119177 119695 120328 120758 121319 122404 123911 125608 127487
56654 127487 129450 131142 132437 133614 134771 135520 135546 135088 134594 134279 134170 134296 134648 135193 135911 136559 136576 135696
56636 135696 134439 133485 132739 131733 130704 130383 130772 131099 131113 131491 132683 134207 135347 135826 135485 134127 132044
56619 132044 129995 128307 126602 124680 123009 122025 121604 121473 121502 121335 120458 118919 117374 116256 115606 115729
56603 115729 117059 119081 120428 120490 120077 120093 120440 120663 120740 120694 120339 119988 120567 122418 124719 126592 127926 128683
56585 128683 128456 127404 126589 126572 126610 126018 125434 125775 126911 128324 130164 132509 134428 135099 135244 136167 137854
56568 137854 139307 140363 141860 144273 147451 151567 157138 164093 171886 180551 190643 202129 214214
56555 214214 226281 238045 248719 256926 261750 263270 262124 259185 255621 252392 249451 246002 241730
56542 241730 237359 233984 232193 231661 231214 229523 226313 222660 219634 217072 214297 211573 209766 208808 207575
56527 207575 205466 203127 201345 200049 198815 197766 197413 197834 198344 198012 196458 194149 191826 189703 187576
56512 187576 185697 184806 185000 185265 184672 183423 182141 180756 178953 177167 176168 175926 175774 175433 175028 174290 172721
56495 172721 170542 168683 167770 167668 167908 167992 167477 166409 165472 165090 164724 163785 162817 162890 164059 165417 166459
56478 166459 167383 168157 168354 168001 167631 167411 167068 166722 166921 167761 168820 169988 171484 173041 174083 174803 176043
56461 176043 177866 179281 179655 179413 178963 178045 176668 175710 175809 176417 176692 176762 177344 178620 180220 181956 183855
56444 183855 185630 186807 187346 187680 188134 188633 188998 189262 189647 190279 190935 191155 190789 190320 190378 190904 191172 190732
56426 190732 189986 189674 190034 190664 191059 191158 191358 192054 193161 194188 194759 194915 194869 194772 194748 194855 194857 194431 193716 193193
56406 193193 192917 192464 191876 191912 192912 194092 194602 194640 194871 195383 196007 197050 198824 200841 202365 203378 204253
56389 204253 204992 205673 207074 209692 212571 214289 214839 215276 215817 215715 214980 214778 215789 217396 218842 220141
56373 220141 221464 222619 223595 224778 226244 227563 228562 229626 231030 232601 234143 235508 236243 236012 235355
56358 235355 235158 235363 235146 234492 234474 235709 237565 239251 240782 242472 244322 246262 248266 249950 250859 251382
56342 251382 252524 254484 256327 257351 257894 258486 259134 259885 261176 263179 265549 268224 271635 275710 279543
56327 279543 282536 285142 287986 291004 293974 297155 300792 304532 307808 310323 311907 312523 312704 313295 314436
56312 314436 315473 316155 317060 318548 320102 321196 322043 323034 324252 325976 328849 332940 337384 341510 345652
56297 345652 350324 355313 360188 365016 369920 374477 378257 381487 384675 388017 391654 395992 401272 407257
56283 407257 413692 420645 428042 435528 443160 451651 461420 471921 482359 492646 503220 514421 526397
56270 526397 539208 552735 566894 582061 598770 616971 636256 656905 679897 705746 734189
56259 734189 765215 799433 837163 878214 923032 973081 1029638 1093089 1163958 1243594 1333264
56248 1333264 1433428 1544569 1667805 1803920 1952463 2112296 2282188 2460267 2643799
56239 2643799 2830253 3017747 3203569 3382983 3550363 3700968 3830962 3936494 4013891 4060610
56229 4060610 4075534 4058720 4011441 3936095 3835697 3713747 3574556 3422787 3262250 3095804
56219 3095804 2926599 2758297 2593629 2433797 2279883 2133751 1996889 1869364 1750814
56210 1750814 1641534 1541704 1450435 1366505 1289392 1218837 1154187 1094988 1041505 993776 950823
56199 950823 911565 875808 843596 814323 787373 762987 741671 723222 706966 692364 678837
56188 678837 665835 653680 643523 635764 629423 623634 618702 614851 611056 606259 600873 596042 592186
56175 592186 589208 587273 586350 585793 585445 586323 589083 592549 594990 596227 597368 599120 601531 604793 609023
56160 609023 613617 617913 622284 627690 634508 642566 651789 662082 673040 684579 697338 711894 728295
56147 728295 746990 769232 795716 825741 858694 895609 938364 988201 1045826 1111918 1186328
56136 1186328 1267580 1354109 1445003 1538411 1630212 1715693 1792035 1858430 1915026 1963196 2005859
56125 2005859 2045654 2082807 2115517 2141786 2160068 2169316 2169823 2163479 2152088 2136009 2115029 2089229
56113 2089229 2057771 2018060 1967653 1906387 1835708 1757264 1673544 1588675 1506791 1430182 1360112
56102 1360112 1298158 1245215 1200298 1161956 1129947 1104132 1082926 1064642 1049353 1037797 1029447
56091 1029447 1023331 1019552 1018203 1017874 1017231 1017084 1018972 1022665 1026980 1032005 1038438 1045657 1052641 1060005 1069006
56076 1069006 1079268 1089549 1100017 1111714 1124437 1137175 1149899 1163035 1175975 1188116 1200508
56065 1200508 1214532 1229845 1245510 1262020 1280112 1298870 1317253 1336233 1357010 1378446 1398899
56054 1398899 1419195 1440982 1463435 1484670 1505274 1527109 1549565 1570434 1589852 1609983 1631338
56043 1631338 1652756 1674575 1698360 1723724 1748768 1773629 1800407 1829605 1859737 1890292 1922121
56032 1922121 1955017 1987994 2021826 2058366 2097563 2137938 2179515 2223313 2268688 2314378 2361493
56021 2361493 2411998 2464913 2517616 2570316 2625547 2683913 2744175 2806893 2873909 2944661 3017132
56010 3017132 3092025 3171838 3256367 3343490 3433871 3530235 3632366 3737660 3846395 3961587
56000 3961587 4083764 4210801 4342822 4482353 4629835 4784123 4947071 5122144 5308818
55991 5308818 5504146 5709621 5930398 6167942 6419962 6687690 6976334 7287865 7620325
55982 7620325 7975076 8357903 8772268 9218525 9700506 10225726 10798533 11420494 12097976
55973 12097976 12841533 13657850 14551096 15532657 16620615 17830023 19174320 20677076 22371996
55964 22371996 24292119 26472422 28965117 31841581 35182233 39083754 43682378 49160805
55956 49160805 55740225 63692340 73364970 85175816 99578147 117045522 138055120
55949 138055120 162989550 191964788 224679012 260266976 297036492 332193115 362010382
55942 362010382 382746776 391899701 388941504 375113188 352661411 324164233 292179216
55935 292179216 259044398 226691869 196522245 169393810 145683566 125378503 108203752
55928 108203752 93767392 81660952 71497596 62929571 55667725 49482687 44184634
55921 44184634 39612219 35639435 32174237 29141007 26471215 24110498 22020405 20166912
55913 20166912 18515215 17037668 15716502 14534739 13472225 12512982 11648036 10867921
55905 10867921 10159679 9513723 8926438 8393228 7905402 7456175 7043400 6664088 6312229
55896 6312229 5984215 5680720 5401041 5140832 4897249 4671090 4462037 4266794 4083695
55887 4083695 3914221 3758264 3612631 3475868 3349892 3235256 3129279 3030274 2938864 2853446
55877 2853446 2768990 2682435 2595280 2509263 2423682 2338717 2257035 2179931 2105549 2032879 1963836
55866 1963836 1899452 1837603 1776683 1718305 1664356 1614369 1567581 1524616 1485335 1447873 1411414
55855 1411414 1377175 1345224 1313252 1280059 1247361 1216544 1186454 1156038 1126454 1098809 1072346
55844 1072346 1046375 1021526 997669 973246 948167 924706 903961 884080 863606 843923 826540
55833 826540 810478 794339 778624 764027 749596 734651 720600 708860 698754 689200 680650 673451
55821 673451 666062 656864 646301 635506 624259 611982 599346 587213 575244 563044 551466 541371
55809 541371 532449 524509 518442 514532 511281 507429 503762 501456 500028 498523 497498 498129 500310 503061
55795 503061 505909 508511 509952 509818 509178 509196 509552 509315 508413 507102 504874 501178 496583 492193 488453 485194
55779 485194 481987 477775 471168 461974 451577 441235 431070 421272 412889 406594 402015 399167 399152 402295
55765 402295 406837 410557 412542 412432 409431 403479 396196 389214 382494 375477 368840 363608 359415 355034
55751 355034 349984 344403 338057 330738 323074 315745 308436 300565 292487 285032 278439 272604 267728 263852
55737 263852 260443 257238 254759 253199 251705 249649 247695 246632 245971 244680 242486 239524 235602 230825
55723 230825 226139 222139 218093 213184 207941 203423 199755 196546 193990 192394 191307 190279 189905 191006
55709 191006 193347 196101 198986 202043 205009 207879 211290 215277 218451 219461 218502 216343 212834 207719
55695 207719 201942 196588 191222 184898 178270 173020 169492 166544 163614 161388 160352 160068 160022 160064 159959 159606
55679 159606 159752 161458 164759 168640 172249 175353 177833 179619 180858 181289 179858 176070 171413 168209 167163
55664 167163 167123 167071 167017 166950 166327 165067 164052 164147 165374 167248 169264 170899 171839 172406 173295 174807 176691 178519
55646 178519 179721 179622 178190 176474 175507 175003 173948 172251 170821 170086 169388 167914 165413 161954 157716 153112
55630 153112 148448 143485 138019 132818 129156 127347 126471 125589 124550 123584 122820 122382 122344 122398 122048 121185 120062
55613 120062 118775 117230 115496 113667 111513 108817 105960 103589 101848 100452 99322 98552 97919 97064 96030
55598 96030 95071 94070 92718 91068 89372 87641 85971 84959 85051 85728 86081 85923 85643 85310 84784 84397 84540
55581 84540 84784 84427 83732 83635 84373 85422 86674 88521 90743 92464 93398 94134 95025 95835 96687 98259 100634
55564 100634 102875 104125 104358 103804 102532 100937 99732 98999 98026 96465 94858 93658 92544 91197 89948
55549 89948 89120 88421 87523 86614 85887 85103 84179 83550 83434 83323 82805 82293 82329 82699 82890 82939 83131 83258 82994 82767
55529 82767 83431 85089 86812 87581 87072 85565 83598 81807 80685 80194 79805 78995 77693 76216 74878 73726
55513 73726 72656 71705 71091 70870 70764 70474 69963 69222 68045 66383 64694 63442 62432 61149 59694 58770
55497 58770 58713 59089 59335 59317 59149 58942 58824 58811 58657 58274 58210 59051 60315 60738 59879 58732 58474 59229 60394
55478 60394 61492 62295 62689 62952 63650 64789 65542 65301 64603 64423 64962 65715 66388 67043 67476 67183 66071 64761
55460 64761 63959 63808 63852 63512 62573 61407 60654 60595 60922 61171 61140 60794 60100 59224 58662 58827 59587 60450 61065 61343
55440 61343 61257 60874 60495 60449 60692 60829 60594 60135 59761 59512 59120 58374 57450 56781 56616 56887 57512 58559 59918
55421 59918 61061 61478 61209 60655 59993 59166 58328 57823 57679 57561 57308 57149 57339 57935 58995 60561 62325 63672
55403 63672 64263 64265 63899 63088 61732 60046 58456 57332 56835 56760 56571 55929 55190 55003 55403 55845 56145 56748 57842
55384 57842 58780 58812 58016 57144 56777 56909 57057 56629 55469 54179 53567 53668 53810 53701 53832 54583 55638 56640
55366 56640 57703 58720 58913 57808 56160 55104 54823 54842 55199 56262 57616 58264 58016 57672 57662 57516 57095
55349 57095 57280 58735 60731 62033 62486 62872 63507 63854 63515 62784 62094 61572 61385 61894 63048 64028 63995 62990
55331 62990 61741 60765 60044 59425 58893 58485 58294 58551 59316 60094 60237 59758 59271 58975 58314 56975 55666 55334
55313 55334 55945 56596 56681 56409 56285 56576 57279 58166 58887 59315 59705 60208 60462 60163 59776 60022 60769 61200 61138 61341
55293 61341 62198 62947 62727 61815 61186 61176 61229 60786 59896 58982 58420 58374 58739 59196 59502 59700 59936 60134 60030 59496
55273 59496 58658 57762 57042 56712 56980 58025 59826 61982 63790 64714 64786 64420 63925 63369 62787 62258 61831 61636
55255 61636 61988 63055 64454 65511 65950 65979 65801 65449 65095 65082 65470 65886 65931 65472 64526 63192 61718 60307
55237 60307 58919 57674 57254 58220 59926 60879 60419 59401 58923 59044 59213 59323 59713 60469 61259 61687 61497 60732
55219 60732 59972 60089 61324 62911 63917 64175 64090 63875 63438 62792 62135 61622 61309 61196 61138 60970 60858 61209 62063
55200 62063 62950 63512 63798 63802 63307 62571 62483 63506 64989 66089 66838 67594 67976 67286 65734 64356 63772 63779 64144
55181 64144 64972 66156 67117 67393 67073 66554 66192 66250 66729 67170 66972 65982 64575 63190 62111 61577 61678 62163
55163 62163 62638 62957 63173 63230 63085 62969 63174 63714 64517 65682 67133 68283 68669 68699 69114 69812 69922 69055 67737
55144 67737 66487 65228 63932 63159 63494 64841 66617 68319 69570 70005 69593 68900 68691 69220 70093 70713 70775
55127 70775 70409 69979 69679 69360 68836 68218 67764 67516 67368 67430 67975 69028 70293 71448 72259 72449 71883 70913
55109 70913 70169 69930 69954 69980 70076 70442 71161 72191 73331 74229 74715 75095 75750 76518 76846 76502 75726 74753 73775
55090 73775 73337 74055 75717 77282 78086 78514 79153 79875 80282 80600 81435 82786 83904 84171 83786 83461 83680 84298
55072 84298 84760 84677 84160 83557 82962 82220 81341 80555 79989 79660 79799 80694 82044 83033 83314 83472 84114 84943 85216
55053 85216 84812 84261 83893 83535 83030 82521 82142 81787 81259 80366 78877 76784 74651 73331 73107 73354 73268 72696
55035 72696 72063 71698 71588 71742 72371 73507 74708 75453 75728 75929 76221 76395 76462 76872 77820 78672 78672 78009 77621
55016 77621 77926 78297 77897 76601 74977 73787 73672 74790 76475 77640 77855 77679 77697 77677 77168 76443 76185 76384
54998 76384 76294 75585 74986 75488 77216 79345 80977 81925 82659 83646 84802 85655 85978 86087 86417 87048 87722 88115
54980 88115 87904 86837 85096 83391 82327 81728 80970 79972 79429 79928 81151 82205 82602 82714 83333 84875 86917
54963 86917 88509 88962 88403 87530 86911 86651 86682 87131 88206 89816 91461 92611 93197 93663 94403 95171 95269 94379
54945 94379 93017 91950 91306 90572 89408 88170 87524 87722 88430 89138 89630 90060 90630 91254 91621 91609 91475 91553
54927 91553 91892 92387 93137 94455 96509 99163 102167 105320 108449 111419 114234 116988 119731 122543 125713
54912 125713 129604 134252 139253 144091 148391 151842 154136 155066 154471 152084 147770 142041 135952 130244 124890
54897 124890 119736 115117 111341 107923 104120 100187 97367 96447 96902 97706 98389 98910 99027 98456 97445 96653
54881 96653 96466 96810 97595 98965 101141 104287 108443 113302 118195 122699 127182 132286 137918 143198 147481
54866 147481 150920 153930 156591 158737 160124 160264 158604 155198 150789 145889 140279 133862 127488 122239
54852 122239 118136 114320 110371 106787 104112 102192 100460 98432 95829 92711 89659 87395 86010 84950
54838 84950 83879 83042 82570 82017 81075 80324 80616 81906 83246 83973 84345 84873 85475 85656 85347 85139 85601 86607
54820 86607 87510 87916 88025 88188 88381 88374 88180 88018 87839 87307 86347 85400 84957 85082 85565 86302 87302 88457 89602
54801 89602 90732 91946 93126 93875 93855 93140 92212 91588 91400 91399 91439 91840 93013 94719 96071 96431 96088 95817
54783 95817 95944 96154 96096 95898 95993 96652 97719 98777 99533 100135 101056 102564 104352 105780 106454 106524 106559 107247 109093
54764 109093 112115 115830 119712 123729 128260 133478 139053 144568 150017 155537 160732 164566 166092 165216
54750 165216 162642 159232 155572 151975 148541 145085 141214 136668 131531 126118 120835 116217 112804 110703
54736 110703 109380 108166 106883 105824 105230 105077 105315 105941 106799 107599 108296 109193 110513 112073 113505 114618
54720 114618 115410 115962 116633 118240 121671 127085 133626 140068 145743 150656 154726 157319 157910 156973 155554
54705 155554 153813 150672 145404 139071 133692 130201 127899 125753 123400 120811 117863 114674 111790 109570
54691 109570 107762 106029 104485 103386 102688 102295 102343 102798 103146 102996 102666 102601 102441 101326 99106 96706 95187
54674 95187 94877 95426 96276 96980 97374 97575 97652 97383 96632 95852 95742 96381 97145 97569 97855 98355 98968 99329 99287 98932
54654 98932 98370 97729 97250 97105 97179 97213 97103 96925 96787 96751 96806 96805 96503 95884 95329 95297 95802 96327 96300 95595 94636 94104
54632 94104 94492 95757 97336 98588 99307 99827 100580 101577 102357 102443 101802 100892 100294 100289 100661 100841 100353 99311 98412
54613 98412 98272 98742 99096 98930 98629 98767 99252 99392 98787 97859 97368 97587 98144 98608 98975 99458 99973 100124 99750
54594 99750 99253 99231 99872 100876 101789 102221 101932 101018 99991 99307 98848 98183 97377 97093 97709 98667 99007 98382 97357
54575 97357 96834 97280 98281 98755 97905 96131 94694 94313 94481 94460 94430 95099 96442 97594 98041 98235 98812 99628
54557 99628 99999 99709 99360 99708 100819 102062 102920 103559 104441 105528 106342 106811 107544 108971 110648 111889 112745
54540 112745 113826 115332 116859 118100 119163 120099 120608 120449 119812 119142 118758 118695 118686 118338 117590 116890 116630 116548
54522 116548 116087 115248 114554 114211 113858 113243 112598 112182 111996 112085 112516 112845 112252 110631 108934 107955 107330 106347
54504 106347 105209 104717 105027 105566 106046 106740 107733 108677 109372 109837 109659 108132 105438 102929 101660 101254 100870
54487 100870 100738 101743 103735 105370 105848 105892 106533 107646 108345 108376 108324 108626 109143 109689 110352 111065 111531 111881
54469 111881 112868 114877 117141 118554 119077 119665 120769 121579 121132 119660 118351 117954 118125 118161 117950 117981 118670
54452 118670 119981 121634 123379 124991 126165 126624 126319 125446 124325 123307 122673 122450 122385 122228 121941 121466 120449
54435 120449 118566 116075 113654 111668 110022 108785 108357 108732 109153 109003 108642 108807 109550 110386 111216 112326
54419 112326 113535 114202 114250 114496 115658 117616 119880 122190 124233 125320 124937 123454 121808 120651 120085 119981
54403 119981 120176 120479 120837 121399 122170 122814 123075 123214 123654 124329 124836 125188 125966 127574 129709 131715 133233
54386 133233 134311 135032 135234 134618 133180 131493 130399 130253 130612 130892 131143 131824 132906 133652 133457 132534 131553
54369 131553 130888 130514 130422 130728 131386 132086 132534 132679 132654 132654 132916 133602 134630 135736 136860 138316 140468 143333
54351 143333 146643 150151 153670 156916 159680 162210 165107 168583 171958 174084 174206 172339 169021 164927
54337 164927 160630 156483 152663 149359 146755 144706 142655 140157 137429 135077 133358 132007 130723 129419
54323 129419 127939 126042 123941 122533 122675 124313 126572 128630 130243 131429 132007 131623 130192 128145 126205
54308 126205 124914 124377 124352 124529 124733 124982 125412 126057 126660 126853 126617 126361 126374 126406 126027 125261 124549 124166 124025
54289 124025 123962 123838 123392 122481 121558 121408 122120 122761 122478 121648 121484 122559 124134 125074 125085 124863 125120 125773 126250
54270 126250 126406 126742 127568 128361 128421 127938 127856 128687 130001 131173 132051 132670 132880 132723 132751 133481 134721 135880
54252 135880 136745 137532 138290 138717 138558 137862 136880 135967 135537 135794 136511 137268 137884 138450 139008 139481 139869 140272 140673
54233 140673 140826 140350 138910 136517 133783 131627 130457 129811 129061 128228 127740 127669 127730 127925 128615 129897 131385
54216 131385 132701 133712 134198 133844 132856 132102 132169 132585 132440 131593 130721 130186 129384 127534 124813 122297 120811
54199 120811 120145 119540 118731 118256 118729 120069 121566 122530 122746 122440 122064 122090 122788 124064 125511 126647 127141
54182 127141 126971 126479 126180 126354 126869 127460 128074 128831 129737 130647 131461 132135 132523 132390 131677 130653 129755 129303
54164 129303 129278 129301 128909 128014 127043 126492 126412 126442 126274 125880 125397 125016 124975 125385 126004 126380 126331 126105 126021 126081 126068 125895
54142 125895 125741 125847 126262 126792 127148 127117 126616 125673 124549 123826 124111 125449 127168 128504 129352 130221 131529
54125 131529 133110 134409 135000 134936 134680 134717 135174 135804 136291 136454 136144 135260 134058 133245 133474 134802 136809 139093
54107 139093 141374 143235 144156 143950 143025 142093 141686 141900 142500 143240 144046 144824 145208 144820 143813 142816 142141 141453
54089 141453 140511 139847 140262 141842 143860 145458 146069 145487 144111 142948 142759 143240 143513 143369 143470 144406 146172
54072 146172 148567 151381 154042 155825 156778 157929 160224 163711 167986 172854 178086 183006 186897 189620
54058 189620 191407 192244 191838 190072 187261 184056 181243 179315 178040 176731 175161 173873 173385 173534 173935
54043 173935 174701 176210 178512 181415 184935 189159 193857 198694 203618 208652 213589 218445 223916 230680
54029 230680 238234 245134 250498 254689 258443 261941 265087 268171 271763 276048 280512 284209 286337 286828
54015 286828 286442 285999 285399 283762 280655 276757 273018 269506 265481 260429 254642 248804 243394 238535 234132
54000 234132 230042 226219 222815 220040 217918 216206 214539 212558 209985 206820 203553 200983 199583 199070
53986 199070 198743 198173 197407 196567 195638 194759 194306 194423 194750 195056 195878 197896 200658 202552 202303 200030 196630
53969 196630 192743 188742 185207 182676 181046 179803 178779 178218 178163 178266 178263 178208 178253 178548 179358 180819 182586
53952 182586 184213 185858 188060 190788 193347 195498 197908 201048 204260 206643 208495 211082 215014 219583
53938 219583 223850 227810 232207 237535 243554 249604 255168 260150 264773 269199 273266 276682 279536 282523
53924 282523 286534 292013 298755 306356 314818 324506 335517 347338 359503 372422 386978 403067 418982
53911 418982 432585 442806 449731 453713 455052 454349 452433 449753 446327 442340 438233 434066 429374 423946
53897 423946 418240 412718 407258 401659 396250 391386 386699 381508 375718 369611 362870 354730 345296 335866
53883 335866 327465 319669 311444 302710 294443 287487 281880 277275 273354 269723 265957 262012 258265 254925
53869 254925 251662 248069 244250 240654 237433 234284 230934 227553 224518 221915 219352 216301 212581 208598
53855 208598 205135 202773 201403 200280 198693 196603 194542 192914 191613 190409 189468 189164 189463 189823 189713
53840 189713 189040 188048 187093 186511 186367 186184 185277 183577 181835 180798 180468 180416 180432 180459 180257 179685 179146 179165 179593
53821 179593 179792 179640 179787 180778 182450 184360 186203 187532 187678 186593 185492 186021 188794 193043 197606 201871
53805 201871 205858 209859 214166 218889 223880 228978 234342 240349 247113 254269 261290 267844 273717 278597
53791 278597 282225 284757 286791 288865 291006 292828 294007 294532 294599 294493 294532 294790 294760 293615 291044 287570
53775 287570 283828 279836 275317 270436 265660 261064 256335 251409 246527 241704 236780 232099 228376 225630
53761 225630 222914 219498 215713 212189 208848 205325 201915 199318 197634 196287 194863 193393 191858 190042
53747 190042 188027 186333 185392 185215 185622 186405 187217 187687 187831 188114 188895 189938 190513 190010 188610 187493 188078
53730 188078 190668 193961 196308 197381 198212 199671 201440 202596 202748 202386 202316 202938 203942 204669 204867 204963 205396
53713 205396 205948 206104 205959 206254 207558 209827 212661 215480 217495 218274 218528 219685 222394 225946 229431 232849
53697 232849 236583 240354 243364 245245 246373 247382 248807 251031 254101 257604 261023 264078 266515 267841
53683 267841 267763 266752 265727 265202 265039 264938 264707 264074 262750 260838 258857 257235 255992 254994 254226 253661 253081
53666 253081 252217 250943 249299 247501 245996 245277 245513 246441 247655 248830 249638 249737 249086 248138 247507 247471 247895
53649 247895 248506 249047 249210 248756 247876 247217 247376 248347 249570 250524 251146 251733 252616 253952 255672 257538 259385
53632 259385 261335 263568 265803 267346 267939 268294 269342 271080 272692 273824 275169 277526 280749 284001 286762
53617 286762 289194 291734 294675 298058 301662 305184 308659 312547 317099 321848 326171 330223 334788 340159
53603 340159 345729 350898 355869 361126 366458 371018 374286 376544 378326 379711 380329 379882 378512 376741 375214
53588 375214 374362 374110 373907 373180 371877 370482 369398 368413 366905 364567 361795 359291 357438 356166 355276 354650
53572 354650 354144 353508 352616 351646 350814 349955 348621 346763 345086 344386 344511 344353 343098 341259 340181 340602 342053
53555 342053 343658 345119 346642 348190 349252 349421 348940 348455 348379 348694 349351 350534 352345 354447 356379 358228
53539 358228 360607 363842 367547 371207 374848 378768 382968 387360 392372 398715 406492 415075 423997 433420
53525 433420 443508 453908 464280 474947 486515 499015 511823 524351 536509 548669 561529
53514 561529 575917 592303 610428 629617 649438 669856 690874 712408 734573 757727 781971
53503 781971 806759 831194 854765 877668 900372 922942 944939 966055 986595 1007046 1027293
53492 1027293 1046687 1064952 1082561 1100062 1117493 1134816 1152393 1170472 1188482 1205512 1221451
53481 1221451 1237085 1253038 1269162 1285077 1300716 1316029 1330548 1343601 1354760 1363823 1370546 1374661
53469 1374661 1376036 1374663 1370633 1364302 1356268 1346932 1336137 1323531 1309280 1294218 1279203 1264479
53457 1264479 1249707 1234456 1218500 1201690 1183829 1164823 1144876 1124418 1103933 1083923 1064887
53446 1064887 1047000 1029852 1012791 995595 978534 961841 945609 930388 917290 906999 898981
53435 898981 892126 885968 880779 876763 873827 872108 872023 873569 876118 879155 882883 887826 894138 901505 909547
53420 909547 918142 927560 938376 951008 965219 980335 996104 1013134 1032332 1054098 1078162 1104021
53408 1104021 1131379 1160279 1190919 1223339 1257405 1293201 1331168 1371509 1413693 1457071 1501835
53397 1501835 1548678 1597534 1647437 1697861 1749342 1802240 1855656 1908289 1959946 2011445 2063302
53386 2063302 2115258 2166829 2217551 2266692 2313543 2358176 2401318 2443190 2482850 2518925 2550715
53375 2550715 2578470 2602856 2624201 2641976 2654954 2662175 2663780 2660531 2652511 2638816 2618723 2592567
53363 2592567 2561115 2524523 2482554 2435693 2385551 2334082 2282704 2232091 2182318 2133032 2083830
53352 2083830 2034886 1987057 1941129 1897053 1854206 1812328 1771755 1732565 1693874 1654381 1613496
53341 1613496 1571696 1529989 1489483 1451327 1416324 1384229 1353792 1323964 1294946 1267817 1243272
53330 1243272 1221017 1200285 1180694 1162525 1146245 1131704 1117818 1103328 1087928 1072380 1057509
53319 1057509 1043599 1030913 1020065 1011237 1003527 995891 988577 982850 979390 977740 977386 978571 981697
53306 981697 986568 992596 999381 1006862 1015350 1025588 1038282 1053248 1069503 1086443 1104434 1123890
53294 1123890 1144451 1165632 1187795 1211746 1237658 1265008 1293309 1322175 1350785 1378128 1403866
53283 1403866 1428320 1451442 1472403 1490450 1505638 1518393 1528829 1536838 1542472 1545747 1546330 1543881
53271 1543881 1538621 1531176 1521860 1510412 1496481 1480108 1461599 1441151 1418833 1394833 1369577 1343545
53259 1343545 1317096 1290473 1263841 1237177 1210261 1183021 1155890 1129509 1104003 1078804 1053417
53248 1053417 1028037 1003090 978387 953253 927494 901739 876702 852434 828510 804599 780624
53237 780624 756631 732899 710100 689007 669931 652537 636253 620869 606763 594534 584313
53226 584313 575426 566875 558124 549224 540219 530797 520646 509822 498507 486639 474050 460801 447144
53213 447144 433378 420053 408066 398019 389487 381355 372996 364835 357664 351727 346600 341660 336457
53200 336457 330781 324625 318123 311558 305427 300278 296175 292456 288365 283909 279733 276173 272932 269772
53186 269772 266923 264515 262116 259322 256383 253744 251321 248825 246546 245112 244480 243842 242670 241282 240187
53171 240187 239314 238195 236571 234571 232535 230831 229607 228618 227600 226806 226752 227302 227581 227093 226404 226234 226280
53154 226280 225576 223786 221502 219371 217558 216140 215399 215450 215896 216113 215725 214719 213387 212197 211536 211409
53138 211409 211555 211782 211957 211729 210739 209251 208168 208184 209137 210413 211720 213176 214834 216454 217777 218861
53122 218861 220115 221930 224121 225850 226436 226311 226713 228195 229845 230366 229644 228819 228941 230012 231277 232048
53106 232048 232132 231747 231106 230054 228234 225732 223260 221341 219651 217697 215927 215405 216332 217596 218070 217711
53090 217711 217059 216302 215426 214769 214649 214619 213801 211988 209915 208399 207694 207665 208028 208266 207827 206735 205691 205269
53072 205269 205319 205400 205483 205836 206445 207012 207441 207903 208380 208526 208108 207283 206259 204951 203267 201578 200621 200862
53054 200862 202053 203435 204344 204694 204974 205665 206578 206897 206088 204684 203899 204446 205937 207484 208549 209056 209050
53037 209050 208650 208234 208173 208308 208026 207050 205869 205189 205155 205352 205359 205052 204468 203740 203131 202820 202565 201914 200907
53018 200907 200280 200689 201898 203035 203555 203644 203683 203700 203572 203459 203731 204494 205468 206344 207085 207797 208467 208919 208966
52999 208966 208571 207947 207490 207442 207578 207379 206654 205880 205727 206337 207252 208008 208609 209327 210175 210747 210640 210054 209878
52980 209878 210903 212857 214514 215004 214815 215125 216388 218092 219835 221880 224340 226506 227649 228191 229419
52965 229419 232005 235248 237802 238856 238647 238155 238368 239509 240890 241674 241688 241242 240359 238651 236022 233005
52949 233005 230266 228107 226618 225880 225757 225785 225557 224999 224148 222949 221562 220512 220179 220305 220338 220134 219942
52932 219942 219846 219608 219056 218307 217598 217102 216879 216793 216574 216207 216124 216617 217166 216888 215754 214872 215244 216570 217677
52913 217677 217956 217946 218509 219785 221161 222041 222364 222375 222190 221784 221249 220773 220303 219535 218405 217328 216718 216441
52895 216441 216053 215428 214836 214449 214145 213860 213769 213972 214239 214243 213924 213564 213632 214581 216515 218920 220863 221648 221254
52876 221254 220215 219196 218658 218608 218593 218184 217568 217430 218132 219340 220583 221867 223406 224994 226107 226531 226585
52859 226585 226657 226829 227014 227235 227684 228588 230082 232076 234173 235786 236435 235972 234638 232872 231014 229057
52843 229057 226743 223887 220524 216750 212649 208483 204795 202134 200697 200291 200478 200693 200428 199570 198460
52828 198460 197474 196662 195959 195557 195776 196616 197709 198680 199330 199487 198995 197918 196545 195124 193710 192338 191132
52811 191132 190213 189646 189508 189848 190523 191221 191730 192111 192606 193495 194967 196907 198825 200234 201136 201843 202284
52794 202284 201876 200283 197985 195710 193522 191015 188355 186562 186457 187603 188712 188947 188541 188173 188186 188575
52778 188575 189372 190643 192136 193267 193589 193134 192236 191164 190112 189428 189603 190803 192437 193382 192910 191444
52762 191444 190192 189884 190041 189667 188449 186966 185873 185366 185466 186281 187657 188954 189585 189662 189837 190591 191855
52745 191855 193177 194040 194176 193794 193484 193767 194848 196717 199168 201607 203348 204444 205862 208422 211874
52730 211874 215358 218351 220579 221491 220714 218971 217637 217241 217102 216607 216074 215995 216101 215722 214665 213254 211803
52713 211803 210485 209482 208794 208028 206735 204965 203308 202372 202308 202686 202813 202334 201559 201055 200974 201080 201318 201902
52695 201902 202840 203895 205083 206623 208276 209363 209765 210254 211436 212925 213986 214388 214134 213021 211259
52680 211259 210014 210394 212060 213596 214110 213766 212953 211806 210562 209610 209005 208530 208261 208477 208960 209048 208540
52663 208540 207946 207715 207820 208223 209055 210090 210692 210715 210915 212106 214329 217136 220219 223337 226084 228233
52647 228233 230037 231780 233247 233932 233571 232241 230292 228408 227270 226763 225894 223982 221596 219836 219024
52632 219024 218666 218445 218513 218882 219263 219630 220365 221672 223354 225353 227971 231175 234106 235759 235980 235400 234500
52615 234500 233208 231485 229832 228865 228531 228139 227184 225868 224689 223824 223221 223043 223594 224774 225995 226810
52599 226810 227310 227807 228479 229481 231039 233085 235044 236350 237078 237775 238763 239868 240754 241196 241113 240660 240327
52582 240327 240690 241925 243683 245434 246849 247903 248775 249638 250475 251161 251742 252386 252979 253028 252246 251008 249945
52565 249945 249294 248904 248625 248270 247428 245866 244048 242739 242086 241587 240965 240497 240372 240252 239763 238920 237851
52548 237851 236594 235450 235015 235385 235761 235350 234339 233482 233045 232791 232762 233272 234126 234618 234553 234619 235422 236667
52530 236667 237665 238260 238735 239145 239308 239286 239340 239392 239083 238466 238169 238599 239343 239702 239625 239735 240508 241776 243103
52511 243103 244306 245421 246380 247097 247865 249387 252120 255619 258737 260620 261416 261899 262483 262812 262278 260666
52495 260666 258250 255518 253010 251218 250287 249829 249270 248399 247430 246577 245826 245141 244606 244224 243794 243180 242580
52478 242580 242379 242767 243578 244405 244813 244567 243789 242868 242155 241827 241993 242753 244029 245554 247143 248895 250950
52461 250950 253155 255101 256487 257372 258088 258961 260034 261086 261953 262728 263399 263453 262228 259790 257038 254804
52445 254804 253154 251741 250384 248980 247296 245320 243523 242293 241326 240085 238614 237374 236455 235596 234921
52430 234921 234899 235481 235929 235808 235607 236117 237522 239346 240920 241733 241748 241586 242023 243132 244277 245053 245766 246726
52412 246726 247679 248323 248954 250161 252202 255089 258882 263415 268136 272800 278048 284702 292656 300968 308770
52397 308770 315400 319859 321047 318802 314161 308340 301879 294888 287621 280584 274423 269827 267135 265925
52383 265925 265399 265259 265760 266812 267630 267649 267317 267549 268757 270789 273509 276928 280915 285162 289365 293205
52367 293205 296453 299390 302831 307277 312271 316984 321119 324711 327357 328543 328749 329298 330738 332074 332121
52352 332121 331101 330243 330154 330322 330143 329751 329617 329816 330063 330278 330823 332183 334561 337823 341838 346747 352735
52335 352735 359478 366090 371886 377141 382872 389939 398594 408824 420706 434161 448639 463358 477909
52322 477909 492617 508379 526079 545849 566722 587179 606270 624163 641542 658666 675269
52311 675269 691197 706783 722476 738289 753760 768432 782292 795683 808764 821085 831883
52300 831883 840827 848323 855004 861141 866735 871879 876643 880647 883144 883697 882559 880225 876784 871830
52286 871830 864994 856495 847204 838192 830172 823411 818076 814408 812438 811824 812346 814426 818762 825408 833564
52271 833564 842352 851495 861184 871669 883185 895910 909694 923929 937920 951336 964203 976635
52259 976635 988662 1000196 1011093 1021367 1031391 1041586 1051850 1061561 1070288 1078212 1085702 1092814
52247 1092814 1099446 1105610 1111145 1115387 1117599 1117662 1116056 1113229 1109348 1104548 1099074 1093181 1087161 1081441
52233 1081441 1076358 1071895 1067968 1064843 1062872 1061844 1061112 1060531 1060795 1062499 1065192 1067756 1069614 1071221 1073412
52218 1073412 1076577 1080541 1084955 1089563 1094173 1098670 1103187 1108158 1114008 1120855 1128633 1137397 1147169 1157473
52204 1157473 1167434 1176590 1185295 1194009 1202397 1209552 1215098 1219766 1224816 1231031 1238208 1245374 1251536 1256453
52190 1256453 1260729 1265164 1270149 1275600 1281053 1285584 1288196 1288876 1288898 1289369 1289643 1287909 1283365 1276973 1269975
52175 1269975 1262509 1254124 1244830 1234995 1224706 1213994 1203444 1193923 1185776 1178770 1172730 1167697 1163546
52162 1163546 1159997 1157100 1155255 1154625 1154898 1155809 1157558 1160411 1163994 1167240 1169056 1169014 1167489 1165219 1162709
52147 1162709 1159953 1156701 1152963 1149242 1146210 1144176 1142858 1141686 1140299 1138693 1136960 1135067 1133092 1131465
52133 1131465 1130689 1130840 1131583 1132765 1134734 1138000 1142857 1149505 1158349 1169858 1184133 1200762 1219133 1238886
52119 1238886 1260110 1283131 1308045 1334444 1361622 1388956 1415943 1441908 1465999 1487573 1506526
52108 1506526 1523203 1538044 1551251 1562643 1571881 1578936 1584140 1587586 1588858 1587850 1585623 1583675 1582299
52095 1582299 1580387 1577084 1572920 1568920 1565230 1561243 1556541 1551000 1544235 1535659 1525129 1513119 1500365
52082 1500365 1487732 1476257 1466764 1459380 1453752 1449708 1447477 1447418 1449776 1454486 1460938 1468254 1476265 1485842
52068 1485842 1497724 1511272 1525111 1538795 1552963 1567849 1582560 1596167 1608688 1620489 1631262
52057 1631262 1640168 1646709 1650966 1653156 1653411 1651894 1648855 1644560 1639253 1633095 1625995 1617625 1607610 1595581
52043 1595581 1581120 1564081 1545094 1525406 1505943 1486666 1466913 1446170 1424466 1402401 1381023
52032 1381023 1361404 1344044 1328765 1315259 1303485 1293463 1285020 1277997 1272482 1268532 1265772 1263403
52020 1263403 1260525 1256457 1251007 1244560 1237625 1230211 1221899 1212575 1202642 1192287 1181100 1168789 1155869
52007 1155869 1143024 1130023 1115834 1099733 1081837 1062620 1042391 1021319 999456 976524 952096
51996 952096 926279 900107 874946 851499 829428 808059 787410 768474 752333 739030 727591
51985 727591 717133 707528 698722 689875 679813 668235 655936 643796 632007 620388 608953 597838
51973 597838 586934 575933 564647 553156 541721 530728 520664 511998 505071 500131 497329 496600 497570
51960 497570 499695 502596 506311 511129 517067 523457 529258 533855 537351 539958 541380 541134 539291 536439
51946 536439 533016 529127 525139 521926 520233 520082 521127 523349 527090 532589 539861 548958 559927 572458
51932 572458 585867 599552 613153 626067 637104 645001 649275 650263 648257 642982 634168 622380 608845
51919 608845 594453 579302 563344 547142 531664 517561 505021 494229 485538 479060 474463 471512
51907 471512 470627 472567 477547 484824 493154 501361 508365 512976 514189 511862 506942 500820 494539 488611
51893 488611 483309 478760 474821 471110 467173 462396 455871 446926 435995 424552 413853 404095 395134
51880 395134 387604 382551 380076 379050 378457 378514 380193 383971 389402 395591 401777 407604 413133 418490 423315
51865 423315 426776 428439 428876 429022 429030 428246 426302 423667 420861 417688 413757 409528 406230 404694 404690 405533 406932
51848 406932 408963 411551 414331 416933 419092 420548 421069 420498 418519 414585 408571 401540 395224 390418 386231
51833 386231 381329 375624 370328 366550 364398 363329 362841 362651 362687 363144 364285 365932 367418 368189 368241 367752
51817 367752 366598 364579 362006 359684 358251 357646 357213 356193 354242 351743 349643 348834 349576 351497 353952
51802 353952 356277 357889 358558 358639 358774 359204 359553 359367 358613 357520 356150 354419 352432 350519 348890 347445
51786 347445 345907 343974 341350 337922 334083 330675 328437 327506 327460 327674 327592 327011 326355 326467 327736 329510
51770 329510 330748 331233 331800 333373 336184 339993 344580 349776 355457 361832 369364 378020 386894 394946 401796
51755 401796 407373 411179 412632 411994 410150 407401 403257 397605 391336 385359 379662 373866 368180 363143
51741 363143 358788 354748 351041 348049 345871 344390 344010 345537 349097 353842 359107 365265 372822 381066
51727 381066 388316 393512 396989 399630 401814 403474 404845 406680 409629 413440 416713 417516 414632 408566
51713 408566 401269 394614 389160 384511 380577 377817 376222 374711 372132 368540 364933 361907 359190 356545
51699 356545 354431 353550 354177 356181 359177 362277 364212 364369 363544 363079 363319 363432 362705 361467 360600 360593 361207
51682 361207 361594 360523 357032 351317 344886 339519 336053 334191 333184 332464 331917 331856 332729 334684 337539 341220
51666 341220 345971 351962 358930 366521 374719 383613 392888 401896 410018 416603 420697 421410 418705 413512
51652 413512 407028 400194 393843 388855 385897 385231 386830 390374 394931 398989 401175 400939 398523 394548 389679
51637 389679 384436 378953 373008 366400 359229 351828 344622 338110 332635 328028 323793 319878 316929 315571
51623 315571 315731 316909 318755 320921 322794 323948 324714 325708 326885 327654 327888 328135 328717 329298 329633 330101 331068
51606 331068 332172 332820 333108 333670 334656 335294 334636 332593 330204 328988 329927 332878 336979 341557 346482 351713
51590 351713 357017 362380 368259 374848 381178 385490 386645 384876 381150 376153 370126 363454 357017 351868
51576 351868 348632 347359 347971 350696 355821 363096 371775 381423 392357 404952 418770 432879 447013
51563 447013 461917 478375 496231 514614 532842 550930 569387 588919 610268 633936 659777
51552 659777 686885 714009 739969 763520 782935 796168 801793 799703 790698 775544 754853 729763
51540 729763 702085 673413 644396 615208 586446 559193 534307 512019 492195 474691 459466
51529 459466 446524 435719 426473 417930 409678 402183 396222 391941 388730 385848 382852 379577 376153 373043
51515 373043 370713 369216 368325 367901 367820 367799 367836 368641 370916 374227 377279 379391 380955 382273 382850 382230 380732
51498 380732 378708 375769 371598 367051 363492 361251 359577 357990 356776 356095 355554 355078 355424 357209 359760
51483 359760 361561 361757 360848 359923 359449 358919 357454 354604 350575 345852 340845 335931 331478 327546 323775
51468 323775 319856 316004 312583 309439 306089 302571 299606 297750 296797 296269 296065 296270 296646 296776 296616 296571
51452 296571 297017 297989 299317 300813 302332 303936 306067 309348 314034 319727 325767 331943 338800 347198 357519
51437 357519 369265 381401 392972 403228 411274 416053 417028 414804 410813 406391 402300 398889 396220
51424 396220 393785 390522 385565 379051 371979 365286 359314 354127 350008 347377 346324 346457 347200 348108 348930
51409 348930 349649 350595 352366 355427 359722 364688 369618 373998 377620 380495 382680 384187 385009 385255 385178 385055
51393 385055 385080 385415 386233 387656 389652 392099 394949 398384 402818 408770 416667 426742 439189 454352
51379 454352 472654 494322 519427 548179 580888 617363 656627 697518 739450 782049 823910
51368 823910 862131 893432 915704 928375 931565 925325 909795 885764 854805 818883 779922 739650
51356 739650 699484 660284 622256 585409 550285 518146 490222 466784 447008 429732 414242
51345 414242 400480 388813 379683 373207 368816 365357 361772 357750 353685 350076 347164 344996 343523 342453
51331 342453 341233 339407 336980 334275 331547 328918 326606 324892 323787 322989 322311 321866 321646 321145 319767
51316 319767 317518 315019 312891 311421 310770 311061 312110 313444 314793 316304 318122 320038 321828 323652 325732
51301 325732 327842 329516 330679 331624 332428 332842 332810 332542 331849 329967 326547 322510 319286 317227 315373 312942
51285 312942 310508 309249 309454 310359 311372 312793 315054 317834 320478 323030 326213 330352 334853 338961 342580
51270 342580 345967 348889 350605 350695 349545 347964 346574 345713 345638 346569 348487 351016 353548 355528 356658 356910
51254 356910 356395 355233 353568 351678 349978 348809 348108 347304 345742 343321 340615 338212 336107 333985 331979
51239 331979 330662 330218 330030 329376 328185 326805 325300 323455 321394 319726 318935 318886 319016 318791 317903 316285
51223 316285 314136 311888 310020 308866 308547 308969 309843 310818 311680 312542 313792 315741 318204 320497 322068 323098
51207 323098 324274 325992 328096 330452 333283 336668 340096 342911 345011 346771 348474 350099 351461 352223
51193 352223 352008 350936 349766 349052 348326 346703 344158 341554 339503 337865 336446 335389 334659 333792 332599
51178 332599 331574 331248 331553 332174 333050 334105 334936 335263 335361 335529 335456 334693 333545 332902 333215 334142 335189 336226
51160 336226 337369 338830 340972 344096 347959 351781 354871 357077 358565 359419 359629 359293 358662 358014 357496 357001
51144 357001 356193 354827 353143 351842 351523 352065 352553 351916 349817 346900 344075 341596 339096 336455 334201
51129 334201 332787 331924 331040 330176 329958 330716 332114 333658 335190 336730 338179 339422 340580 341987 343900
51114 343900 346251 348665 350747 352427 353977 355636 357405 359365 361890 365179 368718 371672 373848 375902
51100 375902 378476 381483 384421 387025 389330 391288 392668 393334 393434 393299 393225 393273 393173 392502 391080 389236
51084 389236 387643 386825 386775 386960 386723 385814 384606 383775 383769 384584 385946 387519 388953 389928 390331 390393 390573 391279
51066 391279 392673 394706 397324 400596 404579 409155 414216 420063 427417 436885 448533 461977 476544
51053 476544 491166 504479 515543 524458 532058 539190 546682 555663 567063 580495 594181 606389
51041 606389 616690 625540 632892 637655 638433 634622 626957 617212 607279 598221 590050 582217 574030 564660
51027 564660 553274 539631 524448 508906 493976 480438 469198 461009 455775 452562 450460 449248
51015 449248 449168 450377 452814 456377 461002 466614 473159 480597 488721 497006 504820 511861 518301 524458 530450
51000 530450 536322 542425 549420 557729 567067 576672 585937 594727 603198 611510 619668 627426 634353 640274
50986 640274 645627 651101 656825 662280 667159 671937 677235 682962 688603 694274 700906 709208 718748 728324
50972 728324 737050 744950 752679 760928 770146 780727 793360 809098 828911 853119 881289 912723
50960 912723 947061 984498 1025470 1070083 1117817 1167855 1219686 1273165 1327864 1382669 1436336
50949 1436336 1488257 1538267 1585820 1629973 1670432 1708173 1744660 1780626 1815932 1850472 1884891
50938 1884891 1920407 1957985 1997492 2037460 2075802 2111020 2142682 2170634 2194108 2212014 2223911
50927 2223911 2230071 2230435 2223991 2209409 2185968 2153641 2112695 2063657 2007436 1945054 1877307 1805067
50915 1805067 1729809 1653388 1577252 1502294 1429541 1360465 1296332 1237565 1184111 1136087 1093592
50904 1093592 1056052 1022338 991661 963978 939340 917202 896647 877141 858789 841945 826744
50893 826744 812991 800335 788536 777649 767912 759454 752183 746023 741079 737395 734577 731917 729020
50880 729020 726242 724400 724038 724949 726409 727869 729467 731902 735862 741588 748839 757118 765913 774948 784394
50865 784394 794759 806424 819307 833068 847589 863149 880215 899222 920486 944133 970127
50854 970127 998639 1030420 1066545 1107547 1153015 1202335 1255782 1314622 1380066 1452346 1530945
50843 1530945 1615515 1706263 1803410 1906610 2015103 2128242 2245451 2365579 2486605 2606192
50833 2606192 2722294 2833039 2936366 3030428 3114477 3188979 3254712 3312153 3362081 3406436 3448054
50822 3448054 3489530 3532664 3578975 3630278 3688424 3754476 3828104 3907405 3989038 4068657 4141527
50811 4141527 4202957 4248410 4273699 4275512 4251858 4201884 4125426 4023054 3896597 3749293 3585203
50800 3585203 3408506 3223450 3034613 2846752 2664192 2490408 2328003 2178672 2043043
50791 2043043 1920911 1812000 1716469 1634430 1565071 1506577 1457033 1415211 1380455 1352038 1328869
50780 1328869 1309723 1293616 1279917 1268142 1257616 1247465 1237071 1226484 1216034 1205477 1193891
50769 1193891 1180662 1166213 1151411 1136468 1120864 1104246 1086934 1069494 1052187 1034948 1017640
50758 1017640 1000268 983193 967108 952459 938929 925973 913960 904194 897489 893256 890449 889055
50746 889055 890033 894012 900637 909228 919531 931722 946155 963418 984366 1009814 1040109 1074944
50734 1074944 1113517 1155024 1199288 1246911 1298584 1354172 1412582 1472368 1532294 1591493 1649594
50723 1649594 1706798 1763508 1819722 1874868 1928240 1979291 2027526 2072408 2113451 2150110 2181540
50712 2181540 2206785 2225317 2237183 2242682 2242531 2238607 2234051 2232148 2235174 2244380 2260525 2283840 2313718
50699 2313718 2349044 2388796 2431879 2476450 2519889 2559434 2592310 2615060 2623448 2613767 2584430 2536156
50687 2536156 2470792 2390372 2297376 2195416 2089017 1982452 1878872 1780516 1689270 1606597
50677 1606597 1533125 1468881 1414010 1368873 1333330 1306399 1286956 1274442 1268620 1268965 1274624 1284684
50665 1284684 1298081 1313512 1329940 1347049 1364685 1381958 1397474 1410569 1421820 1432180 1442047
50654 1442047 1451419 1460555 1470085 1480600 1492401 1505524 1519820 1535057 1551193 1568619 1588063 1610243
50642 1610243 1635540 1663915 1695172 1729363 1766899 1808105 1852659 1899594 1947867 1996833 2046172
50631 2046172 2095468 2143913 2190465 2234422 2275850 2315206 2352538 2387534 2420576 2452967 2484903
50620 2484903 2513081 2531277 2534142 2520589 2493807 2458833 2420502 2382831 2348979 2321145 2300555
50609 2300555 2287513 2281326 2280353 2282511 2285901 2288893 2289844 2286963 2278364 2262057 2236125 2199422 2152266
50596 2152266 2096211 2033087 1964476 1892039 1817851 1743961 1671713 1601776 1534785 1471636 1413043
50585 1413043 1359131 1309730 1264945 1225066 1189961 1158955 1131456 1107371 1086671 1068885 1053412
50574 1053412 1040068 1028816 1019150 1010440 1002956 997845 995810 996373 998835 1003328 1010299 1019359 1029565
50561 1029565 1040766 1053832 1069335 1086693 1105072 1124682 1146522 1171019 1197434 1224685 1252362
50550 1252362 1280710 1309904 1339569 1368906 1397036 1423278 1447388 1469723 1491035 1511955 1532753
50539 1532753 1553710 1575623 1599738 1627244 1659018 1695816 1738382 1787221 1842468 1904154 1972441
50528 1972441 2047476 2129103 2216929 2310658 2410238 2515578 2626070 2740364 2856760 2974003
50518 2974003 3091569 3208783 3323533 3432186 3531034 3617639 3690623 3748505 3789269 3811173
50508 3811173 3813675 3797414 3763458 3712773 3646505 3566727 3476790 3380728 3282282 3184620 3090929
50497 3090929 3004941 2930568 2871032 2828293 2802884 2794021 2799975 2818694 2848018 2885223 2926504 2967162
50485 2967162 3002203 3026710 3036134 3026957 2997330 2946978 2876712 2788464 2685651 2572758 2454077
50474 2454077 2332947 2212183 2094623 1982713 1877713 1779793 1688999 1605856 1530960 1464235
50464 1464235 1404839 1351817 1304710 1263446 1227784 1197130 1171017 1149466 1132535 1119662 1109883
50453 1109883 1102881 1099415 1100375 1105564 1113683 1123351 1133839 1144855 1156079 1167210 1178405 1190421 1204191
50440 1204191 1220190 1238112 1257120 1276304 1294860 1311856 1326125 1336710 1343464 1347040 1348315 1348008
50428 1348008 1346860 1345772 1345460 1346165 1348010 1351528 1357496 1366271 1377592 1390972 1405945 1422010 1438992
50415 1438992 1457743 1479930 1506616 1537344 1571063 1607646 1647932 1692481 1740930 1792477 1846290
50404 1846290 1901337 1956448 2010808 2063874 2114633 2161582 2203785 2241356 2274361 2301606 2321071
50393 2321071 2331141 2330860 2319259 2295411 2259362 2212502 2156806 2094029 2025836 1954414 1882698 1813973
50381 1813973 1751097 1695840 1648832 1610296 1580728 1560713 1550221 1548442 1554249 1566423 1583297 1602618
50369 1602618 1622003 1639377 1652744 1659821 1658373 1647125 1626229 1596759 1559866 1516596 1468390 1417313
50357 1417313 1365361 1313632 1262532 1212816 1165913 1122951 1083740 1047111 1012136 978819 947755
50346 947755 919507 894318 872135 852865 836689 824064 815304 810304 808808 810729 815986 824273 835284
50333 835284 849038 865587 884523 905042 926373 947749 967980 985451 998774 1007410 1011817 1013152
50321 1013152 1012679 1011285 1009674 1008971 1010464 1014249 1018733 1022294 1025077 1028262 1031810 1034084 1033889 1031794 1029070
50306 1029070 1026293 1023625 1021565 1020511 1020111 1020006 1020885 1023873 1028957 1034859 1040580 1046431 1053348 1061804 1071696
50291 1071696 1082820 1095020 1108081 1121880 1136603 1152646 1170401 1190385 1213533 1241004 1273498
50280 1273498 1310940 1352925 1398872 1446742 1491351 1524941 1540799 1536935 1516323 1483961 1444190
50269 1444190 1400347 1355537 1312741 1274248 1241220 1213597 1190357 1170309 1152921 1138135 1125408
50258 1125408 1113592 1102100 1091595 1083078 1076769 1072396 1070086 1070219 1072621 1076660 1082150 1089631 1099742
50245 1099742 1112742 1128543 1146722 1166564 1187647 1210393 1235508 1262768 1290833 1318332 1344629
50234 1344629 1369382 1391955 1411726 1428687 1443332 1456035 1466736 1475057 1480465 1482322 1479873 1472225
50222 1472225 1458412 1437760 1410316 1376883 1338734 1297553 1255573 1215194 1178080 1144723 1115056
50211 1115056 1089279 1067800 1050585 1036886 1025486 1014894 1003393 989506 972814 954231 935259
50200 935259 916960 899686 883495 868432 854445 841380 829259 818295 808391 798866 788979 778637
50188 778637 768344 758543 749283 740414 731696 722733 713232 703449 693987 685030 676187 667225 658486 650270
50174 650270 642298 634276 626609 619978 614414 609348 604465 599923 595819 592039 588767 586523 585476 585118
50160 585118 584843 584566 584548 585041 586320 588745 592455 597165 602536 608583 615541 623467 632209 641641 651623
50145 651623 661702 671017 678629 684090 687910 691335 695367 699849 703803 706819 709818 714253 720890 729727
50131 729727 740848 754801 772142 793082 817754 846497 879587 916873 957866 1002104 1049276
50120 1049276 1098983 1150462 1202495 1253604 1302545 1348830 1392831 1435300 1476761 1517257 1556355
50109 1556355 1593075 1625866 1652883 1672418 1682991 1683234 1672178 1650032 1618567 1580408 1537895 1492664
50097 1492664 1446113 1399808 1355245 1313387 1274602 1239043 1206977 1178869 1155206 1136188 1121525
50086 1121525 1110534 1102417 1096448 1092037 1088855 1086927 1086363 1086918 1088024 1089371 1091215 1093878 1097080 1100022
50072 1100022 1102066 1103069 1103015 1101599 1098418 1093413 1086897 1079092 1069820 1058876 1046608 1033903 1021514
50059 1021514 1009572 997845 986253 974985 964374 954893 947044 940907 935959 931765 928714 927600 928536
50046 928536 930836 933986 938133 943522 950118 958062 967783 979190 991252 1002881 1013828 1024237 1033863
50033 1033863 1042395 1050100 1057302 1063443 1067518 1069434 1070139 1070328 1069724 1067850 1064817 1061003 1056445 1050957 1044547
50018 1044547 1037454 1030021 1022685 1015829 1009485 1003425 997657 992552 988399 985150 982794 981740 982705 986430
50004 986430 993486 1003956 1017166 1032091 1048220 1065752 1084846 1105074 1125829 1146910 1168422 1190485
49992 1190485 1213341 1237387 1262455 1287074 1308798 1325349 1335276 1337605 1331359 1315756 1290856 1257843
49980 1257843 1218554 1174745 1127901 1079680 1032146 987190 945758 907852 873162 841456 812568
49969 812568 786546 763799 744610 728389 713901 700375 687932 676732 666326 656208 646533 637755
49957 637755 629952 623002 617105 612478 608745 605323 602403 600928 601413 603347 606004 609400 614132 620563
49943 620563 628523 637567 647047 655951 663199 668509 672845 677616 683238 688612 692179 693376 692800 691010
49929 691010 687492 681030 670930 657702 642661 627099 611885 597604 584835 574096 565529 558794
49917 558794 553420 549235 546370 544923 544732 545397 546392 547289 548049 549013 550412 552064 553818 556091 559504 564092
49901 564092 569317 574844 580778 587150 593795 600932 609252 619092 629924 640911 651468 660975 668538
49888 668538 673573 676332 677373 676870 674833 671594 667465 662237 655608 647887 639611 630623 620232 608321
49874 608321 595725 583460 572107 561972 553293 546077 540075 535083 530977 527484 524322 521616 519831
49861 519831 519228 519758 521443 524415 528528 533380 538808 544917 551513 558052 564402 571218 579250 588575 598728
49846 598728 609256 619836 630116 639771 648521 655975 661691 665633 668252 669852 670101 668449 664783 659360
49832 659360 652339 643826 634343 624882 616392 609360 603795 599435 596004 593382 591502 590075 588734 587589
49818 587589 587376 588699 591330 594598 598285 602706 608009 613927 620321 627446 635411 643704 651558 658524
49804 658524 664425 669034 672245 674456 676331 678097 679355 679683 679125 677911 676010 673231 669530 664837 658665
49789 658665 650332 639732 627670 615301 603423 592355 582173 572758 563819 555269 547617 541700 537843
49776 537843 535323 532794 529377 525402 522084 520372 520116 520438 520787 521324 522343 523890 526190 529972 535811
49761 535811 543318 551520 559899 568564 577423 585772 592941 598887 603924 608187 611601 614058 615276 614645
49747 614645 611497 605649 597648 588620 579867 572338 566237 561143 556509 552052 547767 543852 540602 538099
49733 538099 536024 534048 532376 531523 531574 532212 533547 536279 540612 545500 549501 552085 553675 554828 556023
49718 556023 558119 562239 568965 577998 588670 600501 613276 626875 640964 654513 665713 672884
49706 672884 675602 674668 671092 665627 659178 652837 647127 641758 636541 632111 629296 628143 628041 628417 628701
49691 628701 627824 624618 618965 612055 605264 599126 593613 588948 585655 583992 583831 585223 588724 594909 603642
49676 603642 614079 625472 637852 651807 667750 685615 705148 725916 746627 764738 777482
49665 777482 783639 784231 781386 776809 771456 766193 762118 760143 760720 764170 770929 780864 792245 801685
49651 801685 805566 801861 790913 774695 755430 734696 713456 692595 673237 656473 642784 631829
49639 631829 622900 615621 610125 606576 604677 603773 603289 602926 602522 601989 601403 600886 600214 598719 595848 591794
49623 591794 587358 583092 578700 573440 567097 560457 554688 550262 546546 542592 538285 534588 532637 532625 533633
49608 533633 534439 534494 534299 534980 537302 540884 544450 547048 548961 551151 553904 556452 558105 559292 561035
49593 561035 563573 566087 567889 569353 571286 573696 575764 577042 578152 580004 582655 585386 587712 589768
49579 589768 591649 592972 593523 593986 595445 598138 601168 603623 605643 608164 611826 616415 621315 626179 631170
49564 631170 636721 643218 650788 659215 667974 676408 683964 690274 695032 697875 698522 697045 693926 689791
49550 689791 685181 680567 676357 672741 669665 667175 665673 665585 666784 668597 670440 672241 674171 676138 677754
49535 677754 678829 679836 681845 685798 691788 699115 707167 716058 726237 737732 750236 763899 779547
49522 779547 797921 818838 841103 862925 882356 897860 908915 916068 920263 922136 921993 920305 918039
49509 918039 916481 916707 919121 923612 930210 939254 950453 962040 971479 977001 977901 973455 962664 945589
49495 945589 924155 900874 877268 854127 832683 814346 799300 786253 773829 761695 750324
49484 750324 740307 732084 725811 721135 717443 714565 712862 712440 712591 712321 711270 709842 708498 707188 705595
49469 705595 703844 702773 703246 705235 707849 710349 712780 715456 718341 721366 724977 729651 734976 739768
49455 739768 743192 745421 747200 749177 751545 753830 754997 754180 751396 747258 742165 736232 729865 723704
49441 723704 717924 712203 706495 701251 696807 693184 690670 689810 690443 691426 691929 692564 694735 699226 705905
49426 705905 714483 724956 737461 752170 769320 789022 811128 835501 862326 892002 924799 960357
49414 960357 996844 1030284 1055523 1068824 1069817 1061048 1046207 1029040 1013024 1000676 992769 988682
49402 988682 987624 989292 993480 999629 1006874 1014315 1021267 1027585 1033730 1040257 1047268 1054523 1061816 1068862
49388 1068862 1075021 1079616 1082493 1083844 1083515 1080920 1075719 1068272 1059389 1049881 1040266 1030571 1020475 1010023
49374 1010023 1000118 991872 985534 980524 976532 974016 973474 974758 977348 980869 984998 989228 993100 996460
49360 996460 999162 1000792 1001013 1000072 998595 996920 994904 992358 989302 985739 981486 976502 971267 966578 962953
49345 962953 960435 958941 958492 958897 959555 959924 960063 960223 960061 958843 956537 954024 951902 949649 946423 942190
49329 942190 937474 932483 927254 922357 918628 916206 914590 913654 913840 915232 917229 919437 922197 925788 929694
49314 929694 933194 936317 939741 944028 949390 955962 963817 972758 982444 992722 1003630 1015120 1026978
49301 1026978 1038986 1051081 1063486 1076687 1091088 1106546 1122282 1137185 1149944 1158988 1162829 1160831
49289 1160831 1153508 1142094 1128084 1113125 1098750 1085841 1074644 1065413 1058563 1053916 1050381 1046848
49277 1046848 1043074 1039263 1035261 1030810 1026322 1022710 1020482 1019538 1019726 1020998 1022968 1024873 1026183 1026867 1026947
49262 1026947 1026166 1024255 1021338 1017850 1014169 1010353 1006203 1001732 997588 994797 993974 995271 999286 1007292
49248 1007292 1019822 1035506 1052268 1069319 1086791 1103396 1115914 1121646 1120479 1113866 1102703 1087196
49236 1087196 1068232 1047733 1027601 1009001 992559 978596 967144 958300 952545 950218 950684 952585
49224 952585 954930 957423 959764 961423 962481 964080 967494 972910 979542 986753 994574 1003113 1011949 1020442
49210 1020442 1028524 1036843 1046014 1055925 1065964 1075812 1085678 1095745 1105758 1115420 1124921 1134762 1145202
49197 1145202 1156123 1167360 1178887 1190736 1202968 1215612 1228441 1240929 1252780 1264392 1276520
49186 1276520 1289461 1302757 1315580 1327232 1337569 1347377 1358125 1370792 1385018 1399933 1415696
49175 1415696 1433519 1454165 1477246 1502287 1529739 1560407 1594461 1631590 1671740 1715051 1761074
49164 1761074 1808257 1853795 1893711 1923765 1941350 1946808 1942712 1932099 1917677 1902128 1888023 1877022
49152 1877022 1869488 1864971 1862734 1861881 1861608 1861623 1862092 1863072 1864356 1866024 1868806 1873627 1880923 1890501 1901893
49137 1901893 1914734 1928955 1944748 1962278 1981409 2001793 2023168 2045406 2068361 2091883 2116017
49126 2116017 2140976 2166840 2193378 2220186 2246916 2273456 2299963 2326633 2353317 2379566 2405176
49115 2405176 2430541 2456264 2482712 2510319 2540122 2573635 2612289 2657400 2710653 2774311 2851032
49104 2851032 2943683 3054769 3184857 3330660 3484647 3637235 3780885 3913878 4040556 4165768
49094 4165768 4286254 4386906 4447683 4456566 4416841 4342420 4246882 4136651 4012325 3873950
49084 3873950 3724538 3569944 3416787 3270761 3136227 3016439 2913314 2826919 2755692 2697503
49074 2697503 2650415 2612607 2582206 2557584 2537610 2521409 2508042 2496518 2485890 2475417 2464947
49063 2464947 2455055 2446285 2438335 2430550 2423074 2416741 2411725 2407216 2402709 2398699 2395606 2392885 2389867 2386799
49049 2386799 2384341 2382684 2381808 2381992 2383133 2384128 2383967 2383202 2383424 2385423 2388698 2392628 2397268 2402906 2409573
49034 2409573 2417098 2425098 2432874 2439798 2445710 2450482 2453383 2453528 2450903 2446331 2440508 2433689 2426158 2418271
49020 2418271 2410013 2401261 2392572 2385008 2379003 2374030 2369574 2365858 2363386 2362288 2362324 2363124 2364198 2365169 2366210
49005 2366210 2367934 2370728 2374488 2378971 2384020 2389415 2394919 2400536 2406355 2412105 2417262 2421523 2424808 2426872
48991 2426872 2427443 2426699 2425116 2422856 2419847 2416314 2412605 2408515 2403609 2398335 2394080 2391898 2391811 2393495 2396847
48976 2396847 2401549 2406830 2412180 2417806 2424068 2430979 2438564 2446999 2455855 2463810 2469815 2474243 2478324 2482678
48962 2482678 2486965 2490790 2494370 2498158 2502087 2505418 2507446 2508468 2509782 2512402 2516004 2519774 2524073 2530391
48948 2530391 2539514 2550722 2563236 2577590 2594847 2615070 2637304 2660721 2685125 2710668 2737668
48937 2737668 2766528 2797345 2829838 2864029 2900690 2940693 2984169 3030707 3079981 3131748 3185675
48926 3185675 3241717 3300330 3361716 3425175 3489741 3555059 3620929 3686392 3750215 3812231 3873348
48915 3873348 3934116 3993997 4052189 4108376 4162400 4213749 4261780 4306143 4346732 4383556 4416880
48904 4416880 4447223 4474951 4500059 4522506 4542608 4560943 4577977 4593833 4608335 4621278 4632712
48893 4632712 4642939 4652061 4659693 4665366 4669136 4671486 4672613 4672075 4669175 4663444 4654648 4642636 4627383
48880 4627383 4609097 4588051 4564259 4537432 4507375 4474464 4439644 4403823 4367241 4329443 4289757
48869 4289757 4247641 4202689 4154650 4103571 4049831 3994033 3937008 3879769 3823138 3767443 3712814
48858 3712814 3659710 3608772 3560272 3514175 3470782 3430747 3394345 3361246 3331075 3303701 3278828
48847 3278828 3255982 3235127 3216657 3200520 3186109 3173491 3163958 3158673 3157280 3158543 3161778 3166906
48835 3166906 3173612 3181484 3190826 3202402 3216368 3232097 3249008 3266868 3285352 3304064 3323022 3342458
48823 3342458 3362113 3381370 3400203 3419356 3439370 3459972 3480561 3500768 3520355 3539119 3557233
48812 3557233 3575350 3594072 3613491 3633305 3653107 3672559 3691732 3711379 3732510 3755432 3779441
48801 3779441 3803620 3827737 3852239 3877584 3903724 3930207 3956705 3983382 4010510 4037637 4063485
48790 4063485 4086991 4108157 4127458 4144770 4159502 4171662 4182017 4191051 4198355 4203289 4205665 4205399
48778 4205399 4201887 4194215 4181864 4164813 4142981 4115962 4083528 4046260 4005352 3961688 3915447 3866907
48766 3866907 3817270 3767961 3719174 3670006 3620295 3571455 3524857 3480202 3436305 3392977 3351147
48755 3351147 3311527 3274239 3239679 3208666 3181542 3157895 3137314 3119700 3104774 3092038 3081432
48744 3081432 3073373 3068016 3065115 3064721 3067273 3072743 3080372 3089520 3100073 3111751 3123676 3135054 3145750
48731 3145750 3155799 3164872 3172614 3179044 3184327 3188567 3192103 3195452 3198624 3200979 3202108 3202357 3202150 3201373
48717 3201373 3199928 3198406 3197556 3197394 3197326 3196927 3196101 3194706 3192544 3189607 3185983 3181682 3176906 3172253 3168285
48702 3168285 3165013 3162157 3159735 3158045 3157167 3156781 3156379 3155484 3153912 3152101 3150984 3151173 3152414 3154039 3155710
48687 3155710 3157431 3159105 3160516 3161569 3162110 3161603 3159445 3155585 3150535 3144808 3138771 3133028 3128387 3125131
48673 3125131 3122558 3119521 3115326 3109930 3103464 3095942 3087510 3078610 3069532 3059861 3048758 3035783 3021003
48660 3021003 3004032 2983384 2957362 2925510 2888861 2848888 2806702 2763111 2718767 2673929 2628558
48649 2628558 2582966 2538131 2495150 2454604 2416661 2381554 2349691 2321368 2296471 2274364 2254006
48638 2254006 2234279 2214367 2193918 2173110 2152639 2133272 2115000 2096846 2077914 2058419 2039195
48627 2039195 2020456 2001714 1982808 1964172 1946001 1927944 1909937 1892632 1876587 1861577 1847092
48616 1847092 1833107 1820020 1808263 1798268 1790376 1784433 1779840 1776228 1773698 1772277 1771773 1772420 1774943 1779420
48602 1779420 1784649 1789207 1792678 1795277 1796905 1797397 1797404 1798160 1800395 1804008 1808703 1814234 1820058 1825335 1829453
48587 1829453 1832205 1833468 1833089 1830993 1827079 1821098 1813076 1803770 1794274 1785130 1776151 1767077 1758014 1749239
48573 1749239 1741055 1733926 1728368 1724447 1721640 1719395 1717724 1717200 1718509 1722048 1727745 1735040 1743080 1751107
48559 1751107 1758679 1765422 1770514 1772646 1770807 1765153 1756788 1746536 1734293 1719877 1704112 1688543 1674233
48546 1674233 1661428 1650195 1640577 1632004 1623253 1613364 1602176 1589849 1576473 1562409 1548333 1534426
48534 1534426 1520098 1505075 1490387 1477603 1467266 1458639 1450926 1444253 1439351 1436678 1436092 1437303 1440453
48521 1440453 1446012 1453947 1463137 1471771 1478055 1480269 1476670 1466321 1450199 1430828 1410568 1390694 1371996
48508 1371996 1355356 1341434 1330551 1323251 1320339 1321965 1327328 1335663 1346933 1361103 1377427 1395030
48496 1395030 1413500 1432223 1449474 1462808 1470182 1470457 1463491 1450417 1433528 1415255 1397205 1380171
48484 1380171 1364379 1349427 1334665 1320142 1306733 1294924 1284117 1273590 1263486 1254263 1245885 1238194
48472 1238194 1231485 1225986 1221315 1217106 1213609 1210991 1208653 1206001 1203348 1201331 1200036 1199460 1200120 1202223
48458 1202223 1204916 1207473 1210692 1215837 1222595 1229332 1235137 1240339 1245063 1248565 1250240 1250242 1248848 1246029 1241885
48443 1241885 1236803 1231048 1224773 1218375 1212182 1205871 1198944 1191626 1184533 1177486 1169506 1160071 1149656 1139025
48429 1139025 1128609 1118588 1108925 1099361 1089937 1081358 1074142 1067614 1060556 1052769 1045210 1038666 1033068
48416 1033068 1028068 1023434 1018734 1013389 1007325 1001121 995459 990716 986881 983447 979695 975555 971858 969221
48402 969221 967179 965032 962919 961246 959669 957665 955573 953999 952637 950792 948594 946466 943802 939561
48388 939561 933934 928040 922186 915871 909368 903723 899061 894394 889354 884781 881249 878340 875695 873562
48374 873562 871833 869711 866845 863863 861407 859438 857719 856122 854242 851534 848013 844109 839951 835643
48360 835643 831965 829657 828202 826502 824622 823532 823293 822983 822452 822573 823530 824244 823875 822643 821008 819296
48344 819296 818308 819006 821337 824443 828061 832581 837934 843825 850874 860019 870992 882955 896252 911594
48330 911594 927675 941625 951889 958790 962550 963070 961681 960723 961161 962792 966660 974633 986480 1000130
48316 1000130 1015059 1032621 1052807 1073809 1095287 1118960 1145404 1173488 1203577 1237932 1277349
48305 1277349 1321018 1370421 1429440 1499792 1580536 1673121 1782695 1913720 2069583 2257905
48295 2257905 2491200 2781470 3140497 3586504 4142979 4829852 5665417 6678270 7903168
48286 7903168 9358568 11040838 12940784 15027448 17172526 19098023 20451564 20978631
48278 20978631 20638402 19571555 17988966 16098103 14089516 12130082 10340044 8780983
48270 8780983 7468906 6392479 5522393 4820498 4252229 3791521 3416102 3105343 2844548
48261 2844548 2625836 2442569 2286654 2152088 2036498 1937442 1850657 1773259 1705167 1645887
48251 1645887 1592770 1543765 1499256 1459883 1424758 1392855 1364059 1338044 1313993 1292086 1273333
48240 1273333 1257389 1242547 1228383 1216361 1207143 1199311 1191642 1184874 1180309 1178141 1178045 1179948 1183289
48227 1183289 1186514 1187956 1186454 1180954 1170718 1156325 1139394 1121016 1101438 1081248 1061599 1043009
48215 1043009 1025151 1008016 992086 977207 962630 948374 935238 923116 910682 897155 883191
48204 883191 869550 856060 842411 828844 815473 801915 788157 774904 762561 750722 739122
48193 739122 728248 718534 709735 701569 694225 687784 681876 676347 671584 667757 664398 661123 658170 655743
48179 655743 653440 650804 648020 645637 643898 642630 641521 640366 639238 638417 637894 637176 635972 634757 634061
48164 634061 633512 632433 631090 630363 630251 629741 628280 626447 624948 623857 623093 622749 622588 621932 620506 618836
48148 618836 617619 617196 617659 618723 619392 618674 616916 615692 616007 617325 618619 619569 620323 620826 620974 620949 620864
48131 620864 620504 619822 619339 619663 620862 622471 623881 624665 624921 625369 626756 629111 631927 634890 637963 640991
48115 640991 643961 647532 652391 658069 663277 667590 671980 677532 684410 692258 700740 709392 717820 726420
48101 726420 736167 747361 759288 771395 783941 797166 810727 824451 838730 853550 867919 880959
48089 880959 892958 904706 916369 927623 938311 948335 957431 965737 974021 982722 991162 998391 1004355
48076 1004355 1009600 1014318 1018488 1022572 1027166 1032025 1036138 1038778 1040023 1040395 1040522 1041052 1042320 1044108 1046110
48061 1046110 1048587 1052131 1056770 1061617 1065434 1067429 1067620 1066594 1064786 1061886 1057140 1050264 1041742 1032202
48047 1032202 1021923 1011086 999918 988284 975658 961889 947599 933419 919231 904571 889398
48036 889398 874063 858822 843802 829142 814805 800500 786120 771941 758175 744721 731681
48025 731681 719615 708878 699083 689612 680168 670508 660239 649513 639405 630875 623692 616944 610223
48012 610223 603650 597199 590826 584999 580224 576140 571910 567502 563815 561480 560243 559628 559493 559672 559684
47997 559684 559215 558555 558274 558667 559677 561145 562985 565145 567395 569209 570088 570189 570316 571016 571956 572492 572567
47980 572567 572626 572896 573212 573357 573119 572161 570353 568134 566118 564440 562857 561355 560169 559321 558578 557788 556848
47963 556848 555483 553505 551219 549185 547709 546907 546954 547809 548928 549841 550768 552071 553417 554274 555017 556649
47947 556649 559466 562909 566745 571358 576678 581841 586397 590991 596246 601796 607092 612579 619135 626673
47933 626673 634075 640448 645882 650953 655882 660221 663103 663876 662755 660743 658700 656660 654216 651299
47919 651299 648147 644673 640367 634988 629005 623168 617755 612384 606491 599858 592696 585452 578674 572928
47905 572928 568481 564975 561722 558526 555933 554452 553885 553790 554274 555733 558018 560495 562922 565702 569212
47890 569212 573491 578609 584671 591262 597546 603274 609144 615789 622925 629852 636325 642425 647977 652712
47876 652712 656806 660754 664782 668723 672289 675144 676910 677514 677388 676968 676122 674412 671753 668423 664577
47861 664577 660122 654982 649097 642345 634877 627417 620691 614514 608004 600828 593809 588059 583821 580382
47847 580382 576903 573116 569429 566525 564712 563624 562680 561865 561687 562291 563059 563409 563667 564625 566414 568376
47831 568376 570067 571825 574048 576354 577959 578735 579386 580504 581809 582550 582445 581981 581835 582168 582564 582620 582581
47814 582581 583265 585270 588380 591991 596076 601365 608469 617257 627376 638958 652314 667137 682618
47801 682618 698422 714988 732729 751324 770006 788164 805303 820682 833439 843120 849881 854193
47789 854193 856479 856993 855905 853462 850030 845883 840932 834835 827501 819475 811723 805008 799373 794090
47775 794090 788244 781599 774955 769461 765592 762950 760904 759060 757100 754741 752109 749830 748458 748043
47761 748043 748430 749560 751113 752229 752184 751215 750152 749291 748132 746256 743873 741309 738493 735340 732267
47746 732267 729845 728126 726773 725795 725646 726485 727803 729103 730688 733405 737730 743426 750058 757420 765365
47731 765365 773576 781744 789760 797522 804828 811657 818246 824485 829499 832372 833279 833382 833451 833036 831231
47716 831231 827766 823033 817328 810539 802490 793230 782964 771963 760561 749095 737759 726635 715813
47703 715813 705493 695998 687789 681306 676673 673488 670979 668429 665653 663186 662003 662794 665422 669139
47689 669139 673309 677823 682955 689147 696853 706207 716685 727332 737460 746949 755924 764527 773027
47676 773027 781668 790081 797297 802680 806631 810016 813144 815566 816674 816182 814211 811204 807609 803427
47662 803427 798278 792043 785030 777217 767898 756673 744391 732386 720994 709588 697992 686989
47650 686989 677308 668888 661507 655457 651085 648107 645895 644243 643424 643636 644760 646625 649247 652682 656755
47635 656755 661028 665143 669282 674068 679813 686010 691973 697921 705012 714217 725548 738447 752492
47622 752492 767537 783614 801015 820132 840949 862924 885600 908939 932687 955749 976722
47611 976722 994921 1010411 1023025 1031881 1036013 1035124 1029463 1019216 1004325 984895 961589 935475
47599 935475 907548 878475 848830 819409 791082 764313 738935 714489 690779 668174 647549
47588 647549 629858 615457 603711 593367 583435 573710 564563 556486 549732 544067 538783 533278 527752
47575 527752 523015 519445 516507 513548 510695 508555 507263 506334 505452 504934 505215 506121 506896 506905 506168 505138 504031
47558 504031 502592 500649 498659 497317 496723 496348 495914 495795 496358 497298 497975 498040 497483 496488 495714 496271 498737
47541 498737 502335 505656 508119 510181 512185 513696 514110 513395 512003 510460 509172 508255 507377 506162 504857
47526 504857 504162 504316 504854 505440 506314 507449 507866 506583 504057 501921 501201 501353 501228 500492 499715 499353 499158
47509 499158 498620 497654 496618 495762 494972 494122 493389 492987 492737 492281 491711 491640 492480 493914 495252 496049 496254 495996
47491 495996 495508 495044 494580 493775 492548 491591 491934 493973 497185 500841 504658 508698 512897 516969 520700 524188
47475 524188 527780 531758 536059 540326 544290 548008 551648 555136 558212 560765 562847 564376 565172 565379 565534
47460 565534 565942 566165 565473 563770 561816 560474 559965 559951 560108 560390 560853 561499 562403 563849 566234 569953 575348
47443 575348 582544 591219 600734 610771 621688 633993 647622 662179 677841 695443 715468 737480
47431 737480 760840 785481 811494 838344 865096 891164 916235 939599 960353 978300 993888
47420 993888 1007038 1016743 1022111 1023209 1020441 1013812 1003465 990436 976061 960817 944437 927017
47408 927017 909274 891753 874565 858035 842827 829088 816094 803255 791051 780525 772079 765170
47396 765170 758958 752907 747006 741855 738444 737390 738321 740260 742590 745416 749116 753939 760094 767816
47382 767816 777142 787724 799004 810482 821836 832919 843668 853871 863060 870800 877047 881931
47370 881931 885161 885939 883702 878759 872029 864226 855389 845068 832730 818118 801548 783994 766645
47357 766645 750147 734162 717877 701028 684337 668758 654373 640369 626222 612563 600486
47346 600486 590197 580846 571738 563215 556101 550578 545997 541605 537162 532963 529583 527575 527121 527862
47332 527862 529246 531069 533538 536837 540836 545248 549862 554458 558745 562590 566233 570016 573834 577055
47318 577055 579103 580022 580329 580381 580096 579309 578118 576698 574915 572421 569087 565125 560792 556256 551795 547838
47302 547838 544598 541876 539439 537444 536245 535912 536193 536935 538276 540355 543037 546054 549346 553169 557811
47287 557811 563185 568754 573992 579001 584523 591165 598700 606294 613361 620071 627046 634721 642969 651194
47273 651194 658807 665736 672429 679206 685715 691267 695578 698851 701169 702314 702394 702192 702473 703096 703217 702306
47257 702306 700611 698662 696790 695362 695099 696700 700179 704909 710377 716472 722746 727657 729136 726174
47243 726174 719669 711552 703238 695123 687366 680693 676206 674576 675568 678370 682312 687333 693827 702087
47229 702087 711946 722928 734662 747033 760065 773821 788419 803940 820217 836745 852863 868027
47217 868027 881950 894555 905816 915568 923457 929064 932045 932135 929156 923186 914706 904450 893003
47204 893003 880576 867211 853200 839212 825864 813155 800575 788054 776542 767242 760344 755053
47192 755053 750882 748208 747272 747446 748157 749984 753995 760319 768180 777174 787552 799353 812284 826638
47178 826638 843292 862353 882637 903025 923576 944742 966214 987310 1007954 1028338 1047892
47167 1047892 1065445 1080320 1092564 1102242 1109227 1113659 1115885 1115787 1112737 1106382 1097067 1085416 1072044
47154 1072044 1057754 1043417 1029272 1014678 998891 981932 964600 947872 932403 918381 905698
47143 905698 894277 884238 875617 868166 861740 856730 853606 852039 851048 850158 849930 851119 853759 857381
47129 857381 861668 866393 870965 874583 876878 878106 878643 878463 877137 874215 869611 863737 857257 850657 844041
47114 844041 837215 829849 821611 812433 802701 793033 783798 775039 766790 759115 751724 743958 735400 726313
47100 726313 717232 708392 699796 691554 683738 676037 668025 659862 652393 646404 641924 638414 635448 633086
47086 633086 631635 631211 631587 632430 633556 634977 636791 639130 642073 645424 648648 651311 653537 655755 657888
47071 657888 659164 658977 657719 656520 656211 656760 657556 657998 657823 657133 656228 655350 654536 653712 652911 652350 652363 653234
47053 653234 655049 657681 660963 664797 668987 673103 676813 680342 684268 688803 693560 698147 702681 707495
47039 707495 712693 718231 724145 730371 736542 742343 747911 753586 759383 765035 770446 775744 780981 786103
47025 786103 791166 796252 801214 805824 810067 813894 816727 817751 816859 814951 813139 811905 811040 809981 808073
47010 808073 805003 801259 797812 795043 792359 789184 785992 783786 782775 782115 780993 779495 778309 777970 778610
46995 778610 780167 782570 785714 789350 793065 796536 799962 804045 809326 815606 822293 829140 836192 843160
46981 843160 849536 855543 862294 870515 879524 888076 895909 903840 912472 921545 930638 939780 949035 958047
46967 958047 966435 974307 981844 988594 993727 997016 999165 1000972 1002480 1003132 1002672 1001668 1001112 1001563 1002718
46952 1002718 1003850 1004569 1005049 1005620 1006376 1007320 1008714 1011064 1014737 1019598 1025007 1030309 1035473 1041169 1047937
46937 1047937 1055329 1062285 1068391 1074332 1080924 1088234 1095883 1103689 1111491 1118782 1125106 1130531 1135160 1138419
46923 1138419 1139499 1138337 1135489 1131200 1125294 1117901 1109441 1099893 1088981 1077217 1065828 1055251 1044583
46910 1044583 1033025 1021122 1010046 1000410 992466 986749 983618 982570 982961 985083 989712 996774 1005379
46897 1005379 1015118 1026468 1039820 1054838 1071005 1088133 1106178 1125070 1144924 1165807 1187078
46886 1187078 1207515 1226427 1244200 1261454 1278071 1293369 1306803 1318085 1326950 1333411 1338096 1341904
46874 1341904 1345286 1348136 1350343 1352153 1354034 1356562 1360481 1366465 1374441 1383348 1392002 1400397 1409884 1421795
46860 1421795 1435954 1450869 1465333 1479459 1493937 1508693 1522698 1535061 1545862 1555841 1565429 1574248
46848 1574248 1581451 1586533 1589806 1592052 1593700 1594446 1593701 1591254 1587486 1583151 1579030 1575436 1571895 1567629
46834 1567629 1562647 1558080 1555151 1554115 1554549 1556249 1559245 1563231 1567773 1573133 1580205 1589453 1600338 1611991
46820 1611991 1623988 1636265 1648687 1660995 1672960 1684360 1694853 1703938 1710962 1715443 1717731 1719169
46808 1719169 1721064 1723483 1725465 1726369 1726414 1725933 1724870 1723233 1721388 1719514 1717356 1714951 1713037 1712206 1712083
46793 1712083 1711906 1711564 1711532 1712063 1713122 1714977 1718193 1723003 1729176 1736520 1745054 1754603 1764704 1775110 1786046
46778 1786046 1797735 1809877 1821852 1833359 1844622 1856014 1867588 1879062 1890232 1901257 1912507
46767 1912507 1924213 1936451 1949426 1963563 1979247 1996555 2015217 2034683 2054377 2074225 2094962
46756 2094962 2117561 2142191 2167967 2193764 2218937 2243206 2266357 2288400 2309617 2330019 2348902
46745 2348902 2365314 2378866 2389864 2398788 2405880 2411074 2414085 2414738 2413391 2410846 2407663 2403813 2399240
46732 2399240 2394416 2390021 2386355 2383464 2381648 2381399 2382947 2386172 2390828 2396528 2402706 2409002 2415525 2422381
46718 2422381 2429181 2435373 2440790 2445260 2447958 2447832 2444672 2438995 2430804 2419249 2403825 2385282 2364856
46705 2364856 2343091 2319816 2294910 2268499 2240636 2211288 2180633 2149039 2116783 2084073 2051333
46694 2051333 2019154 1987857 1957266 1927030 1897120 1867960 1840066 1813594 1788307 1764010 1740922
46683 1740922 1719463 1699757 1681491 1664204 1647571 1631452 1615894 1601146 1587443 1574708 1562650
46672 1562650 1551135 1540326 1530414 1521417 1513295 1506057 1499676 1494076 1489310 1485610 1483092 1481545 1480562 1479854
46658 1479854 1479379 1479210 1479315 1479418 1479210 1478694 1478085 1477153 1474976 1470838 1465238 1459405 1453786 1447679 1440613 1433475
46642 1433475 1427736 1423991 1421882 1421162 1422086 1424816 1429218 1435541 1444711 1457414 1473113 1490432 1508453
46629 1508453 1527265 1547177 1567753 1587826 1606294 1622640 1636779 1648729 1658581 1666508 1672454 1675833
46617 1675833 1675856 1672341 1666071 1658180 1649142 1638481 1625444 1609935 1592814 1575354 1558448 1542265 1526594
46604 1526594 1511384 1496985 1483933 1472683 1463504 1456513 1451594 1448221 1445438 1442234 1438113 1433342 1428554
46591 1428554 1424189 1420400 1417316 1414941 1412777 1409955 1406083 1401631 1397131 1392339 1386709 1380570 1375164 1371370
46577 1371370 1368924 1367126 1365817 1365266 1365502 1366280 1367606 1369791 1372941 1376725 1380754 1384916 1389204 1393422 1397333
46562 1397333 1401074 1405244 1410427 1416559 1422894 1428738 1434193 1440022 1446714 1453930 1461090 1468320 1476458 1486096
46548 1486096 1496969 1508383 1519973 1531746 1543647 1555479 1567352 1579894 1593858 1609625 1627040
46537 1627040 1645553 1664434 1683239 1702361 1722952 1746059 1771843 1799825 1829609 1861061 1893939
46526 1893939 1927912 1962962 1999361 2037082 2075659 2114698 2154110 2193599 2232406 2269869 2305874
46515 2305874 2340362 2372689 2401935 2427635 2449844 2468660 2484076 2496198 2505223 2511292 2514683 2515971
46503 2515971 2515644 2513687 2509945 2504736 2498710 2492263 2485561 2478965 2472796 2466592 2459189 2449749 2438361 2425550
46489 2425550 2411579 2396340 2379536 2360823 2340043 2317329 2292643 2265337 2234662 2200744 2164513
46478 2164513 2126624 2087043 2045819 2003559 1960839 1917735 1874405 1831698 1790768 1752413 1717104
46467 1717104 1685253 1657029 1632227 1610746 1592956 1579303 1569830 1564412 1563125 1565991 1572640 1582540
46455 1582540 1595322 1610560 1627648 1646291 1666721 1688933 1711997 1734663 1756377 1777088 1796290
46444 1796290 1812969 1826508 1837084 1845147 1850971 1854661 1856069 1854662 1849970 1842262 1832409 1821068 1808405
46431 1808405 1794567 1779907 1764657 1748907 1733105 1718145 1704679 1692641 1681604 1671392 1662289
46420 1662289 1654967 1650272 1648692 1649847 1652834 1657343 1664171 1674418 1688378 1705412 1724672 1745735 1768632
46407 1768632 1793521 1820290 1848381 1876990 1905483 1933542 1960967 1987487 2012715 2036153 2057318
46396 2057318 2076095 2092954 2108505 2122759 2134951 2144044 2149232 2150097 2146744 2139854 2130222 2118112 2103293
46383 2103293 2085804 2066411 2046231 2026173 2006787 1988296 1970660 1953927 1938669 1925809 1915880
46372 1915880 1908811 1904566 1903641 1906679 1913999 1925777 1942375 1964086 1990806 2022309 2058743 2100472
$$ [...]
##END NTUPLES=NMR SPECTRUM
##END=
