##TITLE=AC1603_NICAH13333_8315939_2GmalF7wNk
##JCAMPDX= 6.0         $$ Bruker NMR JCAMP-DX V2.0
##DATA TYPE= NMR SPECTRUM
##DATA CLASS= NTUPLES
##ORIGIN= BRUKER
##OWNER= Administrator
$$ 1.72 TOPSPIN		Version 2.1
$$ 2013-11-09 19:59:45.363 -0800  Administrator@X
$$ Compression mode = diff/dup
##.OBSERVE FREQUENCY= 400.02188249412
##.OBSERVE NUCLEUS= ^1H
##.ACQUISITION MODE= SIMULTANEOUS (DQD)
##.ACQUISITION SCHEME= undefined
##.AVERAGES= 64
##.DIGITISER RES= 22
##SPECTROMETER/DATA SYSTEM= spect
##.PULSE SEQUENCE= noesygpps1d.comp
##.SOLVENT NAME= COFFEE_meoh
##.SHIFT REFERENCE= INTERNAL, COFFEE_meoh, 1, 14.96084
##AUDIT TRAIL= $$ (NUMBER, WHEN, WHO, WHERE, PROCESS, VERSION, WHAT)
$$ ##TITLE= Audit trail, TOPSPIN		Version 2.1
$$ ##JCAMPDX= 5.01
$$ ##ORIGIN= Bruker BioSpin GmbH
$$ ##OWNER= Administrator
$$ $$ E:\/data/COFFEE/nmr/AC1603_NICAH13333_8315939_2GmalF7wNk/12/pdata/1/auditp.txt
$$ ##AUDIT TRAIL=  $$ (NUMBER, WHEN, WHO, WHERE, PROCESS, VERSION, WHAT)
(   1,<2013-11-09 19:59:40.363 -0800>,<Administrator>,<X>,<go>,<TOPSPIN 2.1>,
      <created by zg
	started at 2013-11-09 19:48:10.297 -0800,
	POWCHK enabled, PULCHK disabled,
       configuration hash MD5:
       C8 4E 4E 5D D3 5C D8 9E 9F 52 82 E0 59 8A DE 15
       data hash MD5: 64K
       58 79 EE 93 55 E9 58 CB 04 36 25 A1 2B E5 F5 3D>)
(   2,<2013-11-09 19:59:43.378 -0800>,<Administrator>,<X>,<proc1d>,<TOPSPIN 2.1>,
      <Start of raw data processing
       efp LB = 0.3 FT_mod = 6 PKNL = 1 PHC0 = 0 PHC1 = 0 SI = 128K 
       data hash MD5: 128K
       2E F1 FA CE BA F0 03 BD 1C 90 8D 70 83 59 AC 15>)
(   3,<2013-11-09 19:59:44.363 -0800>,<Administrator>,<X>,<proc1d>,<TOPSPIN 2.1>,
      <pk PHC0 = -85.35828 PHC1 = 0 
       data hash MD5: 128K
       D4 BD AD 35 CA 8A 36 21 08 52 6D 15 04 C7 F3 0E>)
(   4,<2013-11-09 19:59:44.847 -0800>,<Administrator>,<X>,<proc1d>,<TOPSPIN 2.1>,
      <abs ABSG = 1 
       data hash MD5: 128K
       0F BE 87 AB 85 22 39 1A 3E ED FD 1D 88 4A 92 DF>)
(   5,<2013-11-09 19:59:44.941 -0800>,<Administrator>,<X>,<proc1d>,<TOPSPIN 2.1>,
      <abs ABSG = 2 
       data hash MD5: 128K
       6E E5 93 5E C8 30 6D 47 22 08 E5 DD 27 05 F0 52>)
(   6,<2013-11-09 19:59:45.019 -0800>,<Administrator>,<X>,<proc1d>,<TOPSPIN 2.1>,
      <abs ABSG = 3 
       data hash MD5: 128K
       18 6B 08 FB 47 ED 5F D8 FA A6 F8 FC E0 C3 3C 3A>)
(   7,<2013-11-09 19:59:45.081 -0800>,<Administrator>,<X>,<proc1d>,<TOPSPIN 2.1>,
      <abs ABSG = 4 
       data hash MD5: 128K
       68 FF FA BC 09 59 A1 E5 2F 59 CD F5 D7 C6 26 3D>)
(   8,<2013-11-09 19:59:45.175 -0800>,<Administrator>,<X>,<proc1d>,<TOPSPIN 2.1>,
      <abs ABSG = 5 
       data hash MD5: 128K
       A9 A0 76 78 B5 EF 8A 82 FB 0D 2D 4D 0E 08 6F C3>)
$$ ##END=
$$ 
$$ $$ hash MD5
$$ $$ 42 04 29 85 A2 AB 08 B0 D8 6B F6 3D F4 9F 42 F7
##$RELAX= 
##$RELAX= 
##$RELAX= 
##$RELAX= 
##$RELAX= 
##$RELAX= 
##$RELAX= 
##$RELAX= 
$$ Bruker specific parameters
$$ --------------------------
##$DU= <E:\>
##$EXPNO= 12
$$ [...]
##$TP07= 0
##$TPNAME0= <>
##$TPNAME1= <>
##$TPNAME2= <>
##$TPNAME3= <>
##$TPNAME4= <>
##$TPNAME5= <>
##$TPNAME6= <>
##$TPNAME7= <>
##$TPOAL= (0..7)
0.5 0.5 0.5 0.5 0.5 0.5 0.5 0.5
##$TPOFFS= (0..7)
0 0 0 0 0 0 0 0
##$TUNHIN= 0
##$TUNHOUT= 0
##$TUNXOUT= 0
##$USERA1= <user>
##$USERA2= <user>
##$USERA3= <user>
##$USERA4= <user>
##$USERA5= <user>
##$V9= 5
##$VALIST= <valist>
##$VCLIST= <CCCCCCCCCCCCCCC>
##$VD= 0
##$VDLIST= <DDDDDDDDDDDDDDD>
##$VPLIST= <PPPPPPPPPPPPPPP>
##$VTLIST= <TTTTTTTTTTTTTTT>
##$WBST= 1024
##$WBSW= 4
##$XGAIN= (0..3)
0 0 0 0
##$XL= 0
##$YL= 0
##$YMAX_a= 6271194
##$YMIN_a= -12139927
##$ZGOPTNS= <>
##$ZL1= 120
##$ZL2= 120
##$ZL3= 120
##$ZL4= 120
##$ABSF1= 14.96084
##$ABSF2= -5.597342
##$ABSG= 5
##$ABSL= 3
##$ALPHA= 0
##$AQORDER= 0
##$ASSFAC= 0
##$ASSFACI= 0
##$ASSFACX= 0
##$ASSWID= 0
##$AUNMP= <proc_prof1d_extract.lims>
##$AXLEFT= 0
##$AXNAME= <>
##$AXNUC= <1H>
##$AXRIGHT= 0
##$AXTYPE= 0
##$AXUNIT= <>
##$AZFE= 0.1
##$AZFW= 0.1
##$BCFW= 0
##$BC_mod= 0
##$BYTORDP= 0
##$COROFFS= 0
##$CY= 15
##$DATMOD= 1
##$DC= 0
##$DFILT= <>
##$DTYPP= 0
##$F1P= 0
##$F2P= 0
##$FCOR= 0.5
##$FTSIZE= 131072
##$FT_mod= 6
##$GAMMA= 0
##$GB= 0
##$INTBC= 1
##$INTSCL= 1
##$ISEN= 128
##$LB= 0.3
##$LEV0= 0
##$LPBIN= 0
##$MAXI= 10000
##$MC2= 0
##$MEAN= 0
##$ME_mod= 0
##$MI= 0
##$NCOEF= 0
##$NC_proc= -2
##$NLEV= 6
##$NOISF1= 0
##$NOISF2= 0
##$NSP= 0
##$NTH_PI= 0
##$NZP= 0
##$OFFSET= 14.96084
##$PC= 1
##$PHC0= -85.35828
##$PHC1= 0
##$PH_mod= 1
##$PKNL= yes
##$PPARMOD= 0
##$PPDIAG= 0
##$PPIPTYP= 0
##$PPMPNUM= 2147483647
##$PPRESOL= 1
##$PSCAL= 4
##$PSIGN= 0
##$PYNMP= <proc.py>
##$REVERSE= no
##$SF= 400.020009699476
##$SI= 131072
##$SIGF1= 0
##$SIGF2= 0
##$SINO= 400
##$SIOLD= 131072
##$SPECTYP= <>
##$SREGLST= <1H.CDCl3>
##$SSB= 0
##$STSI= 131072
##$STSR= 0
##$SW_p= 8223.68421052631
##$SYMM= 0
##$S_DEV= 0
##$TDeff= 65536
##$TDoff= 0
##$TI= <>
##$TILT= no
##$TM1= 0
##$TM2= 0
##$TOPLEV= 0
##$USERP1= <user>
##$USERP2= <user>
##$USERP3= <user>
##$USERP4= <user>
##$USERP5= <user>
##$WDW= 1
##$XDIM= 131072
##$YMAX_p= 422408667
##$YMIN_p= -11324
##$CURPLOT= <Network HP LaserJet P1505>
##$CURPRIN= <$Network HP LaserJet P1505>
##$DFORMAT= <normdp>
##$LAYOUT= <+/1D_H.xwp>
##$LFORMAT= <normlp>
##$PFORMAT= <normpl>
##$SURQMSG= 1
$$ End of Bruker specific parameters
$$ ---------------------------------
##NTUPLES= NMR SPECTRUM
##VAR_NAME=  FREQUENCY,     SPECTRUM/REAL,   SPECTRUM/IMAG
##SYMBOL=    X,             R,               I
##VAR_TYPE=  INDEPENDENT,   DEPENDENT,       DEPENDENT
##VAR_FORM=  AFFN,          ASDF,            ASDF
##VAR_DIM=   131072,        131072,          131072
##UNITS=     HZ,            ARBITRARY UNITS, ARBITRARY UNITS
##FACTOR=    0.0627417313425164, 1,          1
##FIRST=     8223.62146879497, 3251,         -60828
##LAST=      0,             5123,            -60879
##MIN=       0,             -11324,          0
##MAX=       8223.62146879497, 422408667,    0
$$ Real data points
##PAGE= N=1
##DATA TABLE= (X++(R..R)), XYDATA
$$ [...]
63933D253421K44274K25130K00132J70394J36449R8766N8728J8364k0984n9215
63923E325459r6593j32638j65999j95176k19042k36904k48523k54300k55171k52045
63913C269068k45389k35497k22951k08461j92431j75084j57173j39992j24473
63904A567617j10592r7910q6317p5906o6544n8156n1073m5465m0651l5776l1104
63893H68123k7759k5968k4535k2478k0366j9251j8907j8219j6881j5636j4791
63882F43332j3625j1649r526q038o738m478j076K314M560N801P034Q894J1122
63869F27927J3113J4621J5790J6748J7338J7335J6732J5748J4596J3409J2247
63858G95604J1049R553P531N042K390k27k847n576q361j0940j2930j4090j4680
$$ y = [4253421, 4497695, 4722825, 4922957, 5093351, 5229800, 5328566, 5387294, 5405658, 5384674, 5325459, 5228866, 5096228, 4930229, 4735053, 4516011, 4279107, 4030584, 3776284, 3521113, 3269068, 3023679, 2788182, 2565231, 2356770, 2164339, 1989255, 1832082, 1692090, 1567617, 1457025, 1359115, 1272798, 1196892, 1130348, 1072192, 1021119, 975654, 935003, 899227, 868123, 840364, 814396, 789861, 767383, 747017, 727766, 708859, 690640, 673759, 658123, 643332, 629707, 618058, 608532, 600494, 593756, 589278, 588202, 590516, 595076, 600877, 607911, 616805, 627927, 641040, 655661, 671451, 688199, 705537, 722872, 739604, 755352, 769948, 783357, 795604, 806653, 816206, 823737, 828779, 831169, 830942, 828095, 822519, 814158, 803218, 790288, 776198, 761518]
63845G61518j5399j6682j8226j9535k0682k1884k2568k1789j9863j8567j9048
63834E47275k0244k0286j8954j7706j7428j7408j6724j5612j4788j4148j2973
63823C61004j1153r458q547q209p765o974o252o057o259o295n855n194m627m017
63809B64342l065j909j087r03j150j516j830j907j545q98n41q86j623j995j560
63794B41927o47o3l18j113j704j827j949k418k782k477j849j708k070k133j600
63779B17269j098j025r20m38j10l92p02k72N58P99K72l27o25q98j216j172o37
63762B09066q1J72K94L73Q7o44j229j092m18J86M92O83Q00O31J21l78m25P4P69
63743B09481J193J253J344J852K595K987K747K273K133K463K879K910K437J828
$$ y = [761518, 746119, 729437, 711211, 691676, 670994, 649110, 626542, 604753, 584890, 566323, 547275, 527031, 506745, 487791, 470085, 452657, 435249, 418525, 402913, 388125, 373977, 361004, 349851, 340393, 331846, 323637, 315872, 308898, 302646, 296589, 290330, 284035, 278180, 272986, 268359, 264342, 261277, 259368, 258281, 257378, 256228, 254712, 252882, 250975, 249430, 248532, 247991, 247105, 245482, 243487, 241927, 241280, 241217, 240899, 239786, 238082, 236255, 234306, 231888, 229106, 226629, 224780, 223072, 221002, 218869, 217269, 216171, 215146, 214226, 213788, 213678, 213286, 212584, 212312, 212870, 213669, 213941, 213614, 212989, 212091, 210875, 209703, 209066, 208985, 209157, 209451, 209824, 209911, 209267, 208038, 206946, 206528, 206714, 207206, 207889, 208689, 209320, 209441, 209063, 208638, 208712, 209481, 210674, 211927, 213271, 215123, 217718, 220705, 223452, 225725, 227858, 230321, 233200, 236110, 238547, 240375]
63729B40375J652K134K864L197K926K374J965J878K133K643L230L785M435N204
63715B80795N608N045L678K381J614Q18o31k347l353l391l151l192l183k508j219
63700B76964q7K26k53r17j118o00L52J113J279J120J359K258L128L119K406K152
63684B92501L036M280M526L398J746M87k25o53q72p81m30k9K43L33L11L14M79
63667C08664Q62J471K155K444J821M32p76j078q98j194k132l016l428l709m173
63652B97445m607m801m913m940m477l400k297j718j475j120o96m64l03P8N99J017
63636B63928J385J829K176K316K625L408M233M480M360M646N444O051O074O010
63622C18965O441P253P935Q213Q242Q482R459J1272J3240J4538J5259J6303J8133
$$ y = [240375, 242027, 244161, 247025, 250222, 253148, 255522, 257487, 259365, 261498, 264141, 267371, 271156, 275591, 280795, 286403, 291448, 295126, 297507, 299121, 299939, 299308, 296961, 293608, 290217, 287066, 283874, 280691, 278183, 276964, 276877, 277103, 276850, 275933, 274815, 274215, 274567, 275680, 276959, 278079, 279438, 281696, 284824, 287943, 290349, 292501, 295537, 299817, 304343, 307741, 309487, 309974, 309749, 309096, 308224, 307443, 307013, 306984, 307227, 307560, 307871, 308185, 308664, 309526, 310997, 313152, 315596, 317417, 317849, 317073, 315995, 315097, 313903, 311771, 308755, 305327, 301618, 297445, 292838, 288037, 283124, 278184, 273707, 270307, 268010, 266292, 264817, 263697, 263001, 262537, 262234, 262312, 262911, 263928, 265313, 267142, 269318, 271634, 274259, 277667, 281900, 286380, 290740, 295386, 300830, 306881, 312955, 318965, 325406, 332659, 340594, 348807, 357049, 365531, 374990, 386262, 399502, 414040, 429299, 445602, 463735]
63609D63735K0207K1823K2942K3837K4493K4828K5061K5334K5193K3985K1612
63598G23050J8418J4508R745M502o8k921m125m748n642o590o881o627p074r296
63584G16251j2925j6578j9344k1247k2443k2691k1902k0537j9097j7634j6052
63573E05801j4457j2845j0952q771o742m997k919j13K635M185M557M824N540O188
63559D71934O327O450P206Q383R169R224R057R454J0811J2904J5179J7276J9348
63546F12722K1822K4868K8261L1632L4465L5879L4916L1271K5589J8823J1648
63535I11896M591j546n883q060q508q112p605p230o894o737p411r628j3401j7995
63521H07477k2541k6443k9330l1047l1807l1880l1089k9059k6161k3601k2158
$$ y = [463735, 483942, 505765, 528707, 552544, 577037, 601865, 626926, 652260, 677453, 701438, 723050, 741468, 755976, 765721, 770223, 770155, 767234, 763109, 758361, 752719, 746129, 739248, 732621, 725547, 716251, 703326, 686748, 667404, 646157, 623714, 601023, 579121, 558584, 539487, 521853, 505801, 491344, 478499, 467547, 458776, 452034, 447037, 444118, 444005, 446640, 450825, 455382, 460206, 465746, 471934, 478261, 484711, 491917, 500300, 509469, 518693, 527750, 537204, 548015, 560919, 576098, 593374, 612722, 634544, 659412, 687673, 719305, 753770, 789649, 824565, 855836, 881425, 900248, 911896, 916487, 914941, 909058, 900998, 892490, 884378, 876773, 869543, 862649, 855912, 848501, 838873, 825472, 807477, 784936, 758493, 729163, 698116, 666309, 634429, 603340, 574281, 548120, 524519, 502361]
63510E02361k1323k0062j8074j5812j3665j1688r987q670p551o394n412n017n061
63497C53645m930m333l597l047k573k004j440j070q92p62n15qP22J356J651J785
63481C33988K004K086J676J032Q75J487K488L504M382M728M066K647J311K75j065
63466C65484k782l923m008l993m781n668n443m380l718l579k904j499n26o32r07
63451C16741l53P46J619K266L029L698L906L924M198M560M700N129O668R152J1492
63436C81475J3090J4399J5978J7784J9672K1871K4363K6207K6102K3602J9416
63425F03959J4692J0375P197N752O204Q053J0493J3022J5593J8296K1159K4264
63413G59059K7635L0764L2577L2284L0138K6916K2833J7551J1263N139K37l431
$$ y = [502361, 481038, 460976, 442902, 427090, 413425, 401737, 391750, 383080, 375529, 369135, 363723, 358706, 353645, 348715, 344382, 340785, 337738, 335165, 333161, 331721, 330651, 329759, 328997, 328482, 328474, 329196, 330552, 332203, 333988, 335992, 338078, 339754, 340786, 341661, 343148, 345636, 349140, 353522, 358250, 362316, 364963, 366274, 366549, 365484, 362702, 358779, 354771, 350778, 345997, 340329, 334886, 330506, 326788, 323209, 320305, 318806, 318280, 317648, 316741, 316388, 317134, 318753, 321019, 324048, 327746, 331652, 335576, 339774, 344334, 349034, 354163, 360831, 369983, 381475, 394565, 408964, 424942, 442726, 462398, 484269, 508632, 534839, 560941, 584543, 603959, 618651, 629026, 636223, 641975, 648179, 656232, 666725, 679747, 695340, 713636, 734795, 759059, 786694, 817458, 850035, 882319, 912457, 939373, 962206, 979757, 991020, 996159, 996396, 992965]
63401I92965o352q424r132q659q199q970j1301j4776j8864k3062k6764k9420l0944
63388G88098l1712l2082l1981l1082k9278k6828k4032k0992j7826j4900j2595
63377E14790j0828r115p134n064l260j768k30J774M309O903Q919J0183J1107J2047
63363E32633J2819J3275J3996J5762J8427K0988K2896K4556K6365K8033K9267
63352G59017L0333L1342L1590L0311K7655K4192J9890J4471Q491L104j269n109
63340I74018q535j0741j1149j0402r779j0032j1256j3466j6652k0385k3819k6293
63328H01509k7789k8683k9176k9010k7800k5568k2762j9776j6681j3501j0425
63317E50338p566m967l145l197n735r871j3798j6276j7182j6845j5590j3878j2166
$$ y = [992965, 986613, 978189, 969057, 960398, 952199, 943229, 931928, 917152, 898288, 875226, 848462, 819042, 788098, 756386, 724304, 692323, 661241, 631963, 605135, 581103, 560111, 542285, 527385, 514790, 503962, 494847, 487713, 482649, 479389, 477621, 477391, 479165, 483474, 490377, 499296, 509479, 520586, 532633, 545452, 558727, 572723, 588485, 606912, 627900, 650796, 675352, 701717, 729750, 759017, 789350, 820692, 852282, 882593, 910248, 934440, 954330, 968801, 977292, 980396, 979127, 974018, 965483, 954742, 943593, 933191, 923412, 913380, 902124, 888658, 872006, 851621, 827802, 801509, 773720, 745037, 715861, 686851, 659051, 633483, 610721, 590945, 574264, 560763, 550338, 542772, 537805, 534660, 531463, 525728, 515857, 502059, 485783, 468601, 451756, 436166, 422288, 410122]
63304D10122j0489q701p096o189n824n202m002k733j837j116m38k42q52j888k807
63289C50706l558m209m488m189l630l127k509j719j368j981l049l594l384k890
63275C07011k306j487o54k55j18L43R85R41M2o55k57P57J333J263J128J245J428
63258C10744J623K050K672L081L088K997L149L496L844M209M661N038N151N208
63244C61011N687O702P774Q445Q899R676J0906J2231J3421J4717J6302J7861J8962
63231E12594J9626K0182K0630K0608J9993J9251J9073J9770K0998K1936K1889
63220G36550K0935J9976J9839K0376K0729K0395J9629J8695J7208J4560J0782
63209I39674O594K625j159n133r370j3424j6800j9388k1254k2114k1465j9476
$$ y = [410122, 399633, 390932, 383836, 377647, 371823, 366621, 362619, 359886, 358049, 356933, 356495, 356253, 355401, 353513, 350706, 347148, 342939, 338451, 334262, 330632, 327505, 324996, 323277, 321909, 319928, 316879, 313285, 309901, 307011, 304705, 303218, 302564, 302309, 302191, 302534, 303519, 304460, 304502, 303847, 303590, 304347, 305680, 306943, 308071, 309316, 310744, 312367, 314417, 317089, 320170, 323258, 326255, 329404, 332900, 336744, 340953, 345614, 350652, 355803, 361011, 366698, 373400, 381174, 389619, 398518, 408194, 419100, 431331, 444752, 459469, 475771, 493632, 512594, 532220, 552402, 573032, 593640, 613633, 632884, 651957, 671727, 692725, 714661, 736550, 757485, 777461, 797300, 817676, 838405, 858800, 878429, 897124, 914332, 928892, 939674, 946268, 948893, 947734, 942601, 933231, 919807, 903007, 883619, 862365, 840251, 818786, 799310]
63197G99310j7245j5677j4330j2016q470m695j549J229M223P313J0084J2772J5881
63184G76830J9152K1775K3625K5419K7463K9045K9533K9412K9636L0278L0571
63173A072739L0058K9147K8403K7814K6840K4889K1684J7410J2609P669K408l610
63161A298060j0361j7325k4089l0525l6295m0712m3496m5203m6423m6888m5950
63150I10793m3777m1317l9101l6672l3492k9776k6115k2671j9300j6205j3900
63139E88467j2476j1350r881q064o425n367m815m448m122l906l753l370k549j463
63125E06478m30M76J333K035K455K842L577M466M817M434M006M105M274L673K320
63110E50861J060M32K24J33K14N26Q03Q02N77K44j96o18o86k71K74N46N72O46
$$ y = [799310, 782065, 766388, 752058, 740042, 731572, 726877, 725328, 726557, 730780, 738093, 748177, 760949, 776830, 795982, 817757, 841382, 866801, 894264, 923309, 952842, 982254, 1011890, 1042168, 1072739, 1102797, 1131944, 1160347, 1188161, 1215001, 1239890, 1261574, 1278984, 1291593, 1299262, 1301670, 1298060, 1287699, 1270374, 1246285, 1215760, 1179465, 1138753, 1095257, 1050054, 1003631, 956743, 910793, 867016, 825699, 786598, 749926, 716434, 686658, 660543, 637872, 618572, 602367, 588467, 575991, 564641, 554760, 546696, 540271, 534904, 530089, 525641, 521519, 517613, 513860, 510490, 507941, 506478, 506048, 506524, 507857, 509892, 512347, 515189, 518766, 523232, 528049, 532483, 536489, 540594, 544868, 548541, 550861, 551921, 552353, 552577, 552710, 552924, 553450, 554253, 555055, 555632, 555876, 555680, 555062, 554376, 554105, 554379, 554925, 555497, 556143]
63092E56143Q06P85L87k83r37j291j267j135j321j866k163j466L16K490M193M950
63076E58341M751L993L361L484M390N441O043O355P054Q436J0044J1261J1975
63063F44929J2496J3078J3914J5398J7875K0982K3724K5540K7021K9276L2630
63052H76863L6301L9275M1248M2704M4322M6293M8171M9411N0038N0594N1339
63041A376559N1889N1897N1735N1954N2355N2184N1215M9963M8748M7174M4699
63030A930372M1145L6386L0078K2153J3153L639o315j6692k6892l6042m3704m9838
63018A897443n4276n6790n7440n6435n3708m9165m3276l6858l0274k3311j5899
63007A420011q419j146O156J3797K1612K9053L5599M1022M5496M9531N3428N6709
$$ y = [556143, 556949, 557734, 558121, 557838, 556901, 555610, 554343, 553208, 551887, 550021, 547858, 546392, 546708, 549198, 553391, 558341, 563092, 567085, 570446, 573930, 578320, 583761, 589804, 596159, 603213, 611649, 621693, 632954, 644929, 657425, 670503, 684417, 699815, 717690, 738672, 762396, 787936, 814957, 844233, 876863, 913164, 952439, 993687, 1036391, 1080713, 1127006, 1175177, 1224588, 1274626, 1325220, 1376559, 1428448, 1480345, 1532080, 1584034, 1636389, 1688573, 1739788, 1789751, 1838499, 1885673, 1930372, 1971517, 2007903, 2037981, 2060134, 2073287, 2076926, 2070611, 2053919, 2027027, 1990985, 1947281, 1897443, 1843167, 1786377, 1728937, 1672502, 1618794, 1569629, 1526353, 1489495, 1459221, 1435910, 1420011, 1411592, 1410446, 1416602, 1430399, 1452011, 1481064, 1516663, 1557685, 1603181, 1652712, 1706140, 1762849]
62995A762849N8480N8596N8056N7918N8131N7876N6778N5244N3530N1052M6870
62984B375380M0672L2913K4127J4343L318q840k1547l4229m6647n8619o9630p8968
62972B172273q6220r1337r4321r5099r3741r0588q6069q0619p4725o8820o3139
62961A247595n7844n3157m9096m5177m0910l6616l3187l0941k9263k7589k6140
62950H17675k5206k4302k2716k0593j8800j7835j7407j7069j6677j6150j5289
62939F05631j4039j2629j1368j0381r569q659p468o235n470n185m667l419k002
62926E04540j313j333j344j174j317j850k115j833j579j817k219k460k897l807
62912D77482m578m466l728l258l399l762l971l901l448k763k503l056l666l194
$$ y = [1762849, 1821329, 1879925, 1937981, 1995899, 2054030, 2111906, 2168684, 2223928, 2277458, 2328510, 2375380, 2416052, 2448965, 2473092, 2487435, 2490753, 2481913, 2460366, 2426137, 2379490, 2320871, 2251241, 2172273, 2086053, 1994716, 1900395, 1805296, 1711555, 1620967, 1534898, 1454279, 1379554, 1310734, 1247595, 1189751, 1136594, 1087498, 1042321, 1001411, 964795, 931608, 900667, 871404, 843815, 817675, 792469, 768167, 745451, 724858, 706058, 688223, 670816, 653747, 637070, 620920, 605631, 591592, 578963, 567595, 557214, 547645, 538986, 531518, 525283, 519813, 514628, 509961, 506542, 504540, 503227, 501894, 500550, 499376, 498059, 496209, 494094, 492261, 490682, 488865, 486646, 484186, 481289, 477482, 472904, 468438, 464710, 461452, 458053, 454291, 450320, 446419, 442971, 440208, 437705, 434649, 430983, 427789]
62898D27789j750p40j087k165k780k461j465j91Q83J180N53l94r38r67p87n34
62882D14146k33j14l70p10o34j11M13O30N44J14p12j535j616p75J85L64k07q40
62864D08539j193j464j638j297m09K97K43j43n9M37N99K60J06M25M89k60j081
62847D03851q31L40J046M76o43j098o31QO6n11j255j723j887k021k241k260j802
62830C88884j066n06k10J14N92J012J259J534J945K294K388K325K285K278K257
62815D07385K279K382K518K764L331M187M881N032M836M817N179N632N839N878
62801D66940O165O979Q136R258J0283J1432J2612J3235J3039J2757J3446J5230
62789E99512J7335J9316K1586K4578K8031L1494L5044L9065M3606M8390N3220
$$ y = [427789, 426039, 425299, 424212, 422047, 419267, 416806, 415341, 415150, 416033, 417213, 417766, 417372, 416434, 415467, 414680, 414146, 413913, 413799, 413429, 412719, 412085, 411974, 412387, 413017, 413561, 413675, 412963, 411428, 409812, 409037, 409222, 409586, 409379, 408539, 407346, 405882, 404244, 402947, 402538, 402835, 403078, 402935, 402876, 403313, 403912, 404172, 404278, 404703, 405192, 404932, 403851, 403020, 403360, 404406, 404882, 404239, 403141, 402510, 402518, 402584, 402073, 400818, 399095, 397208, 395187, 392946, 390686, 388884, 387818, 387312, 387102, 387216, 387808, 388820, 390079, 391613, 393558, 395852, 398240, 400565, 402850, 405128, 407385, 409664, 412046, 414564, 417328, 420659, 424846, 429727, 434759, 439595, 444412, 449591, 455223, 461062, 466940, 473105, 480084, 488220, 497478, 507761, 519193, 531805, 545040, 558079, 570836, 584282, 599512, 616847, 636163, 657749, 682327, 710358, 741852, 776896, 815961, 859567, 907957, 961177]
62778I61177N8090O2959O7678P1949P5254P7043P7153P5776P2956O8385O1779
62767A730199N3199M2844L0992J8165M995q215k1326l3679m4276n2814n9920o5962
62755A594202p0313p2323p2418p1551p0057o7707o4562o1036n7297n3221m8818
62744H84899m4354m0175l6680l4039l1591k8209k3809j9804j7353j5825j3935
62733E79125j1707j0105r176p921o008m243l210k578j906j100J20K073M197N440
62719E33001N858O666Q243R484R839J0630J3213J6838J9822K2159K5344K9877
62707G10974L4402L7703M0375M3914M8916N4759O0676O6559P2771P9494Q6345
62696A336888R2656R8008J02441J06030J08515J09332J07943J03934R7071Q7320
$$ y = [961177, 1019267, 1082226, 1149904, 1221853, 1297107, 1374150, 1451303, 1527079, 1600035, 1668420, 1730199, 1783398, 1826242, 1857234, 1875399, 1880394, 1872179, 1850853, 1817174, 1772898, 1720084, 1660164, 1594202, 1523889, 1451566, 1379148, 1307597, 1237540, 1169833, 1105271, 1044235, 986938, 933717, 884899, 840545, 800370, 763690, 729651, 698060, 669851, 646042, 626238, 608885, 593060, 579125, 567418, 557313, 548137, 540216, 534208, 529965, 526755, 524177, 522271, 521171, 521291, 523364, 527561, 533001, 538859, 545525, 553768, 563252, 573091, 583721, 596934, 613772, 633594, 655753, 681097, 710974, 745376, 783079, 823454, 867368, 916284, 971043, 1031719, 1098278, 1171049, 1250543, 1336888, 1429544, 1527552, 1629993, 1736023, 1844538, 1953870, 2061813, 2165747, 2262818, 2350138]
62686B350138P4727N9238M0944K0643j90k0248l8974n6264p1886q5426r6462j04523
62674B071717j09236j10748j09800j07183j03312r8456r2943q6936q0457p3826
62664A098820o7688o2232n6859n1120m5527m0932l7386l4215l0911k7450k3915
62653F20585k0523j7837j6324j5610j4811j3572j2315j1344j0392r266q407q327
62641D61857q773q872q028o481m908l733k858k004j104k74M45J015J112L27j157
62626D16564k434k688j992j089o29q27j506k118k021j120o5N53R89J832K993L789
62610D10231L977M089M622N528O584P729Q782R380R643J0488J2693J5757J8234
62597E27737J9277J9618K0789K3595K7476L1274L4272L6357L7463L7309L5871
$$ y = [2350138, 2424865, 2484103, 2525047, 2545690, 2545500, 2525252, 2486278, 2430014, 2358128, 2272702, 2176240, 2071717, 1962481, 1851733, 1741933, 1634750, 1531438, 1432982, 1340039, 1253103, 1172646, 1098820, 1031132, 968900, 912041, 860921, 815394, 774462, 737076, 702861, 671950, 644500, 620585, 600062, 582225, 565901, 550291, 535480, 521908, 509593, 498249, 487857, 478591, 470184, 461857, 453084, 444212, 436184, 429703, 424795, 421062, 418204, 416200, 415096, 414822, 415267, 416282, 417394, 417721, 416564, 414130, 411442, 409450, 408361, 407732, 406905, 405399, 403281, 401260, 400140, 400075, 400628, 401617, 403449, 406442, 410231, 414208, 418297, 422919, 428447, 435031, 442760, 451542, 460922, 470565, 481053, 493746, 509503, 527737, 547014, 566632, 587421, 611016, 638492, 669766, 704038, 740395, 777858, 815167, 851038]
62586H51038L3688L1258K8260K3746J7364J0074L333k405q005j4300k0710k5697
62574I27644k8584l0288l1976l3517l3946l3052l1700l0525k9238k7435k5335
62563E92048k3251k1026j8505j6145j4474j3274j1865r987q008o422n504n191
62551D38396m969m157k732j474r51p41j48P61J455J892K313K460J878R51O74J325
62535D36933K145K494K628L078L910M887N834O631P223P879R001J0618J2474J4651
62521E30386J7541K1087K4609K7666L0622L4095L8220M2627M6844N0517N3588
62510I17802N6332N8863O0663O1041N9896N7487N3512M7300L9022K9812K0376
62499A462106J0407j89j0396j9125k6440l2814l7794m0374m0401l8726l6070l2544
$$ y = [851038, 884726, 915984, 944244, 967990, 985354, 995428, 998761, 996356, 988351, 974051, 953341, 927644, 899060, 868772, 836796, 803279, 769333, 736281, 704581, 674056, 644818, 617383, 592048, 568797, 547771, 529266, 513121, 498647, 485373, 473508, 463521, 455513, 449091, 443587, 438396, 433427, 429270, 426538, 425064, 424113, 423372, 423224, 423985, 425440, 427332, 429645, 432105, 433983, 434934, 435608, 436933, 439078, 441572, 444200, 447278, 451188, 456075, 461909, 468540, 475763, 483642, 492643, 503261, 515735, 530386, 547927, 569014, 593623, 621289, 651911, 686006, 724226, 766853, 813697, 864214, 917802, 974134, 1032997, 1093660, 1154701, 1214597, 1272084, 1325596, 1372896, 1411918, 1441730, 1462106, 1472513, 1472324, 1461928, 1442803, 1416363, 1383549, 1345755, 1305381, 1264980, 1226254, 1190184, 1157640]
62487A157640k8217k3393j8140j2256n774R26P598J4195K0414K5759L0173L4103
62475A203028L7630L9997M0235L7920L3103K6036J7424Q553M11p293j5701k5199
62463A396144l4662m2549m8382n2736n6086n8213n8813n8079n6388n3771n0097
62452H26368m5581m0722l5805l0832k5884k1307j7453j4457j2245j0505q735o586
62440E56256m210k078n28L89P77R06J105J373J248M76m76j069j609k866m880o870
62424E37944q299r285r862r728q981q314q064p749o968o078n547n243m956m948
62410D33922n377n725n489m986m784m747m384l719l064k364j554j183j684k239
62396C82623j535L97K107K656K574K634K706K421K016J803J469P27J98P65K221
$$ y = [1157640, 1129423, 1106030, 1087890, 1075634, 1069860, 1070786, 1078384, 1092579, 1112993, 1138752, 1168925, 1203028, 1240658, 1280655, 1320890, 1358810, 1391913, 1417949, 1435373, 1443926, 1444337, 1437044, 1421343, 1396144, 1361482, 1318933, 1270551, 1217815, 1161729, 1103516, 1044703, 986624, 930236, 876465, 826368, 780787, 740065, 704260, 673428, 647544, 626237, 608784, 594327, 582082, 571577, 562842, 556256, 552046, 549968, 549440, 549829, 550606, 551512, 552617, 553990, 555238, 555714, 555238, 554169, 552560, 549694, 544814, 537944, 529645, 520360, 510498, 500770, 491789, 483475, 475411, 467662, 460694, 454616, 449069, 443826, 438870, 433922, 428545, 422820, 417331, 412345, 407561, 402814, 398430, 394711, 391647, 389283, 387729, 386546, 384862, 382623, 381088, 381485, 383592, 386248, 388822, 391456, 394162, 396583, 398599, 400402, 401871, 402598, 402796, 403561, 405782]
62381D05782L390L644L615M211N400O399O750O845P345Q322R190R432R238R279
62367D98842R979J1263J2958J5128J7800K0600K3023K5078K7364L0354L3749L6830
62355G62968L9399M2073M5403M8931N1438N2116N1078M8692M4783L8868L0987
62344A256736K2067J3443O070Ln549j1417j7655k3586k8703l3106l6838l9267
62332A102198l9690l8388l6550l5051l3677l1661k8676k5256k2387k0701j9910
62321G70251j9113j7772j6284j5414j5368j5731j6101j6387j6536j6479j6333
62310E88733j6302j6222j5578j4114j2134j0184q628p600o979o369n430m338l611
62297D61244l357l048k327j555j248j194p69N3N87N40O61J784L527M580M321L509
$$ y = [405782, 409172, 412816, 416431, 420642, 426042, 432441, 439191, 446036, 453381, 461703, 470893, 480325, 489563, 498842, 508821, 520084, 533042, 548170, 565970, 586570, 609593, 634671, 662035, 692389, 726138, 762968, 802367, 844440, 889843, 938774, 990212, 1042328, 1093406, 1142098, 1186881, 1225749, 1256736, 1278803, 1292246, 1298316, 1298319, 1292770, 1281353, 1263698, 1240112, 1211409, 1178303, 1141465, 1102198, 1062508, 1024120, 987570, 952519, 918842, 887181, 858505, 833249, 810862, 790161, 770251, 751138, 733366, 717082, 701668, 686300, 670569, 654468, 638081, 621545, 605066, 588733, 572431, 556209, 540631, 526517, 514383, 504199, 495571, 487971, 480992, 474623, 469193, 464855, 461244, 457887, 454839, 452512, 450957, 449709, 448515, 447746, 447799, 448386, 448926, 449587, 451371, 454898, 459478, 463799, 467308]
62281D67308L104L000K554J911J945K909M048M761N401O431P533Q219Q764R767
62267E37655J1142J2284J3098J4162J5914J8242K0874K3605K6260K8944L2350
62256G54530L7092M2663M7712N1433N4242N6830N9130O0344N9532N6043M9905
62245A329456M2034L3630K5119J6139O570k900j1540j9304k6560l3516m0247m6695
62233A272186n2288n5986n7249n6684n5356n3704n1427m8139m3816l8891l4169
62222G24477l0279k6966k3378j9435j6282j4837j4377j3351j1309r171p776o946
62210E30370o167n406m977m937m913m350k934j073K48M37N2J57J078K334L629
62195E03548N076O461P116O874O514O745P325P657P763Q101Q761R447J0037J0562
$$ y = [467308, 470412, 473412, 475966, 477877, 479822, 482731, 486779, 491540, 496941, 503372, 510905, 519124, 527888, 537655, 548797, 561081, 574179, 588341, 604255, 622497, 643371, 666976, 693236, 722180, 754530, 791622, 834285, 881997, 933430, 987672, 1044502, 1103632, 1163976, 1223508, 1279551, 1329456, 1371490, 1405120, 1430239, 1446378, 1452948, 1450048, 1438508, 1419204, 1392644, 1359128, 1318881, 1272186, 1219898, 1163912, 1106663, 1049979, 994623, 940919, 889492, 841353, 797537, 758646, 724477, 694198, 667232, 643854, 624419, 608137, 593300, 578923, 565572, 554263, 545092, 537316, 530370, 524203, 518797, 513820, 508883, 503970, 499620, 496686, 495613, 495861, 496298, 496350, 496507, 497585, 499919, 503548, 508624, 515085, 522201, 529075, 535589, 542334, 549659, 557316, 565079, 573180, 581941, 591388, 601425, 611987]
62181F11987J0825J0564R917R202Q367P209O084N721O217O849P091P344Q335J0303
62167G26015J3126J6728K0882K4926K8280L1061L3718L6189L7866L8277L7277
62156A044345L4705L0411K4745J8546J2447O576R48m274r080j3656j7972k1740
62144A106001k4940k7906l0580l2199l2145l0743k8767k6506k3794k0626j7263
62133H10532j3916j0812q317o544n063l505k190j555j248n01P20J722K263K846
62119G64432L732M501M848N127N558N587M561K629M21j727l726n203n671n186
62105G79883m410l989m211n152o768q713j0291j0795r937q065n933m129k683j359
62091F93448k23M16O82J316K895N066O802P405P222P400Q832J1155J2956J3355
$$ y = [611987, 622812, 633376, 643293, 652495, 660862, 668071, 674155, 679876, 686093, 692942, 700033, 707377, 715712, 726015, 739141, 755869, 776751, 801677, 829957, 861018, 894736, 930925, 968791, 1007068, 1044345, 1079050, 1109461, 1134206, 1152752, 1165199, 1171775, 1172723, 1168449, 1159369, 1145713, 1127741, 1106001, 1081061, 1053155, 1022575, 990376, 958231, 927488, 898721, 872215, 848421, 827795, 810532, 796616, 785804, 777487, 770943, 765880, 762375, 760185, 758630, 757382, 756881, 757601, 759323, 761586, 764432, 768164, 772665, 777513, 782640, 788198, 793785, 798346, 800975, 801396, 799669, 795943, 790740, 785069, 779883, 775473, 771484, 767273, 762121, 755353, 746640, 736349, 725554, 715617, 707552, 701619, 697490, 694807, 693448, 693225, 693641, 694323, 695639, 698534, 703600, 710402, 717807, 725029, 732429, 741261, 752416, 765372, 778727]
62077G78727J3173J3969J6080J8278J9508K0016K0519K1013K1059K0588J9868
62066I82798J9049J8358J8293J9057K0217K1401K2855K4648K5832K5294K3099
62055A220901K0198J6972J3085Q624M369O95k920o997j1359j5641j9907k4358
62043A203662k8853l2983l6317l8450l9218l9020l8553l8100l7447l6428l5073
62032H03220l3137l0249k6700k3499k1240j9468j7536j5548j4047j3136j2414
62021E76246j1514j0376r197q393q266q538q542q090p647p428o954n946m975m531
62007D65849m107l025j739j201j264p74O85K291L375M206M970N093M308L510L598
61992D85775M064L666K196N72o19j703k988m171m985n678o510p265p650p718p611
$$ y = [778727, 791900, 805869, 821949, 840227, 859735, 879751, 900270, 921283, 942342, 962930, 982798, 1001847, 1020205, 1038498, 1057555, 1077772, 1099173, 1122028, 1146676, 1172508, 1197802, 1220901, 1241099, 1258071, 1271156, 1279780, 1284149, 1284844, 1281924, 1274927, 1263568, 1247927, 1228020, 1203662, 1174809, 1141826, 1105509, 1067059, 1027841, 988821, 950268, 912168, 874721, 838293, 803220, 770083, 739834, 713134, 689635, 668395, 648927, 631391, 615843, 601796, 588660, 576246, 564732, 554356, 545159, 536766, 528500, 519962, 511420, 503330, 495683, 488255, 481301, 475355, 470380, 465849, 461742, 458717, 456978, 455777, 454513, 453739, 454424, 456715, 460090, 464296, 469266, 474359, 478667, 482177, 485775, 489839, 493505, 495701, 496273, 495654, 493951, 490963, 486792, 481807, 476129, 469619, 462354, 454704, 446986, 439375]
61977D39375p266o735o295n985n459m685m249m378m283l212j854j602k598l432
61963C77342l078k113j625j756j954j992j934j526m66Q49J617J694J779K442L475
61948C72754M345M852N130N328N568O015O828Q026R496J0980J2185J3042J3834
61935D78383J4845J5848J6188J5455J3987J2618J1981J1973J1834J0869R174P498
61923F30653O229M826K554m24l176n068o245o951o985o102m572k926j357L60K447
61908F03263M807P133R134J0671J1730J2322J2397J1917J0957R614P867N650L006
61895G20468J46k627m946o596p793r022j0315j0949j0360r071q206q165q359q355
61881F15850q477r094r869j0226j0169j0159j0421j0756j0896j0711j0133r179
$$ y = [439375, 432109, 425374, 419079, 413094, 407635, 402950, 398701, 394323, 390040, 386828, 384974, 383372, 380774, 377342, 374264, 372151, 370526, 368770, 366816, 364824, 362890, 361364, 360898, 361747, 363364, 365058, 366837, 369279, 372754, 377099, 381951, 387081, 392409, 397977, 403992, 410820, 418846, 428342, 439322, 451507, 464549, 478383, 493228, 509076, 525264, 540719, 554706, 567324, 579305, 591278, 603112, 613981, 623155, 630653, 636882, 641708, 644262, 643838, 640662, 635594, 629349, 622398, 615413, 609311, 604739, 601813, 600456, 600816, 603263, 608070, 615203, 624337, 635008, 646738, 659060, 671457, 683374, 694331, 703945, 711812, 717462, 720468, 720614, 717987, 713041, 706445, 698652, 689630, 679315, 668366, 658006, 648935, 640729, 632564, 624205, 615850, 607373, 598279, 588410, 578184, 568015, 557856, 547435, 536679, 525783, 515072, 504939, 495760]
61869D95760p970o653n362m335l775l392k473o59J537L224M054M449N148O639
61855D86192Q792J0903J2352J3362J4784J6943J9205K0998K2618K4446K5901K5973
61843G02469K4626K2791K1013J8893J5993J2538Q927N144J094k897o280q699j0020
61830H05592j0202r361p695n285k278P78L238N190P346R779J1369J1087R295P113
61816H35966M838J816k161o266r667j2477j5262j8016k0117k1127k1228k0879
61804F95420k0317j9410j7929j5993j4223j3237j2971j2735j2061j1226j0747
61793E34571j0599j0278r473q359p221o160n198m394l728l095k473j973j645j452
61779D58523j404j501j493j037k57K72K99L32Q40J394J206L63j58K22J018J559
$$ y = [495760, 487790, 481137, 475775, 471440, 467665, 464273, 461800, 461141, 462678, 465902, 469956, 474405, 479553, 486192, 494984, 505887, 518239, 531601, 546385, 563328, 582533, 603531, 626149, 650595, 676496, 702469, 727095, 749886, 770899, 789792, 805785, 818323, 827250, 832394, 833488, 830591, 824311, 815612, 805592, 795390, 786029, 778334, 773049, 770771, 771549, 774787, 779977, 787323, 797102, 808471, 819558, 828853, 835966, 840804, 842620, 840459, 834193, 824526, 812049, 796787, 778771, 758654, 737527, 716299, 695420, 675103, 655693, 637764, 621771, 607548, 594311, 581340, 568605, 556544, 545318, 534571, 523972, 513694, 504221, 495862, 488641, 482481, 477283, 472889, 469161, 466066, 463593, 461620, 459975, 458523, 457119, 455618, 454125, 453088, 452831, 453103, 453402, 453734, 454574, 455968, 457174, 457537, 457379, 457601, 458619, 460178]
61763D60178J855K222K536K492K316K534L206L918M491N108N702N792N141M070
61749E11561K924J689L83o17j125j622k685m081m950m809m038l336l129l473m070
61734D78622m322l725k491j411j015r92o84J15R95J455J384J132J161J529J773
61719D73526J488J015J080J702K006J412N55M28R98J322Q83J24m39r18j631k446
61703D81105k980l119l020k837k661k610k736k995l405l970m397m227l515l021
61689D35612l334l974l901k849j747j617k409l146l076k427j927j837j757j321
61675D00290q05p29j164j711k088k276k202j800j390j425j730j580q23k53m10
61660C79904o84k37P07J276J348J624K368L012L118K998L066L188L008K515J952
$$ y = [460178, 462033, 464255, 466791, 469283, 471599, 474133, 477339, 481257, 485748, 490856, 496558, 502350, 507491, 511561, 514485, 516174, 516557, 515940, 514815, 513193, 510508, 506427, 501477, 496668, 492630, 489294, 486165, 482692, 478622, 474300, 470575, 468084, 466673, 465658, 464666, 463982, 464097, 465092, 466547, 467931, 469063, 470224, 471753, 473526, 475014, 476029, 477109, 478811, 480817, 482229, 482784, 483212, 484210, 485532, 486415, 486539, 486100, 485182, 483551, 481105, 478125, 475006, 471986, 469149, 466488, 463878, 461142, 458147, 454742, 450772, 446375, 442148, 438633, 435612, 432278, 428304, 424403, 421554, 419807, 418190, 415781, 412635, 409559, 407132, 405205, 403368, 401611, 400290, 399485, 398756, 397592, 395881, 393793, 391517, 389315, 387515, 386125, 384700, 382970, 381390, 380567, 380314, 379904, 379220, 378983, 379690, 380966, 382314, 383938, 386306, 389318, 392436, 395434, 398500, 401688, 404696, 407211, 409163]
61645D09163J451J056Q62R64J325J809K138J989J427J078J444K085K010R49l28
61630D29422j011j008o60k64j59o62j546k093k029k011k748l974m718m386l268
61615C98885k168j827k392l253l622l456l422l762l906l531l366m167n368n637
61601C49008m640l422l010l320l612l436k929k541k640l139l471l173k491k027
61587C05157j884j654j208r45j064j149p50j36k4o98j649k090j732r89m95m19
61571B88271l98j83j7j82m20k33K94N14P2n92p71k44O81J563K142K415K559K698
61553B98169K698K276J353J82q06j209q75j16M02L23L8K10R17J651K063K313K618
61536C12207K871K831K338J352Q4q42q04M2Q08Q58M67L03N78R50R58L04r76k287
$$ y = [409163, 410614, 411670, 412532, 413496, 414821, 416630, 418768, 420757, 422184, 423262, 424706, 426791, 428801, 429750, 429422, 428411, 427403, 426743, 426479, 426320, 425658, 424112, 422019, 419990, 417979, 415231, 411257, 406539, 402153, 398885, 396717, 394890, 392498, 389245, 385623, 382167, 378745, 374983, 371077, 367546, 364180, 360013, 354645, 349008, 344368, 340946, 337936, 334616, 331004, 327568, 324639, 322098, 319458, 316319, 312848, 309675, 307184, 305157, 303273, 301619, 300411, 299466, 298402, 297253, 296503, 296367, 296343, 295645, 293996, 291906, 290174, 289185, 288690, 288271, 287873, 287690, 287673, 287491, 287071, 286838, 287132, 287646, 287718, 287126, 286355, 286111, 286792, 288355, 290497, 292912, 295471, 298169, 300867, 303143, 304496, 304678, 303872, 302663, 301788, 301672, 302074, 302397, 302435, 302645, 303562, 305213, 307276, 309589, 312207, 315078, 317909, 320247, 321599, 321683, 320841, 320037, 320079, 320887, 321745, 322212, 322515, 323093, 324043, 325001, 325305, 324329, 322042]
61518C22042k774k194j296r71j130r36n6P90P20j97j033j064m98MJ98L80P16Q82
61500C13583O24K66K67M61L33l6J5O81J332J482J450J641J741J260M81J62M74
61483C26217Q85R93Q94O98L44J4J31P50J387J687J868K234K687K913K814K364
61467C48880J423O5j115j473j066n94o27j128j678j858j449o34p3l14r93j023
61451C36343J05J554K171J944J833K201K230J246q9m65N30K124L399L901L462
61436C62489K200Q91N34J193J793J505P68N37R39J385J550J519J156K13q98j302
61420C76472p93j30J17K58O94J008N94k77p15m35l7j00n93j227j868k375k496
61403C68097k248k103k450l004l057k316j285p25q15r43l94P83J737J714Q78Q5
$$ y = [322042, 319268, 317074, 315778, 314807, 313677, 312741, 312685, 313475, 314195, 313998, 312965, 311901, 311403, 311407, 311605, 311985, 312701, 313583, 314207, 314473, 314740, 315201, 315534, 315498, 315513, 316194, 317526, 319008, 320458, 322099, 323840, 325100, 325581, 325743, 326217, 327102, 328095, 328989, 329687, 330031, 330045, 330176, 330926, 332313, 334000, 335868, 338102, 340789, 343702, 346516, 348880, 350303, 350368, 349253, 347780, 346714, 346120, 345493, 344365, 342687, 340829, 339380, 338746, 338673, 338359, 337366, 336343, 336448, 338002, 340173, 342117, 343950, 346151, 348381, 349627, 349538, 349073, 349603, 351727, 355126, 359027, 362489, 364689, 365580, 366114, 367307, 369100, 370605, 371373, 371910, 372849, 374234, 375784, 377303, 378459, 378672, 377774, 376472, 375679, 375549, 375666, 375924, 376618, 377626, 378220, 377943, 377228, 376793, 376756, 376656, 376063, 374836, 372968, 370593, 368097, 365849, 363746, 361296, 358292, 355235, 352919, 351634, 350909, 350094, 349151, 348757, 349540, 351277, 352991, 353869, 353954]
61387C53954n4L48Q27J092J139J127J281J700K188K422K353K225K195K228K347
61372C77372K639K985L100L047L165L330K817J363j25n02K87J343K015K289K280
61357D07405K144K381L351M454M611L761L035L223L900M447N009N808O280N791
61343D65600M684L749L080K347J842K236L320L988L654K869K334J958J292K96
61329E03249o82j305j388j046r08j709l315m604m647l701k657j891j138k19P06
61314D74745J577K628L972N318O315P016P770Q687R430R633R455R493J0035J0554
61300E76628J0137Q329N462K277n18k468l537m074m456m774n054n555o421p171
61286E58805p117o324n668n694n978n858n329m766m145l050j321P27K609L900
$$ y = [353954, 353900, 354248, 355075, 356167, 357306, 358433, 359714, 361414, 363602, 366024, 368377, 370602, 372797, 375025, 377372, 380011, 382996, 386096, 389143, 392308, 395638, 398455, 399818, 399693, 399191, 399478, 400821, 402836, 405125, 407405, 409549, 411930, 415281, 419735, 424346, 428107, 431142, 434365, 438265, 442712, 447721, 453529, 459809, 465600, 470284, 474033, 477113, 479460, 481302, 483538, 486858, 490846, 494500, 497369, 499703, 501661, 502953, 503249, 502567, 501262, 499874, 498828, 497920, 496211, 492896, 488292, 483645, 479944, 477287, 475396, 474258, 474039, 474745, 476322, 478950, 482922, 488240, 494555, 501571, 509341, 518028, 527458, 537091, 546546, 556039, 566074, 576628, 586765, 595094, 600556, 602833, 602315, 599847, 596310, 592236, 587780, 583006, 577952, 572397, 565976, 558805, 551688, 545364, 539696, 534002, 528024, 522166, 516837, 512071, 507926, 504876, 503555, 504282, 506891, 510791]
61272E10791M349M072L584L289L115K861K698K939L436L713L712L914M614N449
61258E62536N905N980O051O169N875M810L292K085J595J544J482J395J492J589
61244F11800J194K89m68n86m23o14j146j530j672j975k526k799k469k044k263
61229E92768l038l472k918j647l41P86J989L234L930L666K978K875L610M357M302
61214F13079L695L396L656L857L450K675K074J725J293P09L27M17Q29J386K264
61199F44832L636N147O267P139Q561J0762J2763J3452J3002J2527J2452J1960
61187G62500J0234P627N173L439K259J280L00o90j442j598j257j189k028l435
61173G81173m527n010n352n936o573p068p641q444r057q903q056p288p286q031
$$ y = [510791, 515140, 519212, 522796, 526085, 529200, 532061, 534759, 537698, 541134, 544847, 548559, 552473, 557087, 562536, 568441, 574421, 580472, 586641, 592516, 597326, 600618, 602703, 604298, 605842, 607324, 608719, 610211, 611800, 612994, 613283, 612815, 612229, 611806, 611192, 610046, 608516, 606844, 604869, 602343, 599544, 597075, 595031, 592768, 589730, 586258, 583340, 581693, 581352, 582138, 584127, 587361, 591291, 594957, 597935, 600810, 604420, 608777, 613079, 616774, 620170, 623826, 627683, 631133, 633808, 635882, 637607, 638900, 639609, 639936, 640353, 641182, 642568, 644832, 648468, 653615, 659882, 667021, 675582, 686344, 699107, 712559, 725561, 738088, 750540, 762500, 772734, 780361, 785534, 788973, 791232, 792512, 792812, 792122, 790680, 789082, 787825, 786636, 784608, 781173, 776646, 771636, 766284, 760348, 753775, 746707, 739066, 730622, 721565, 712662, 704606, 697318, 690032, 682001]
61159F82001q911r305r044q494q139q023p636o491m755l144k170j693j340j144
61145F01712j487k554m093n769p401q757r449r316q719q084p373o236m643k991
61131E14840j597m84M53J321K332L632M996O072O938Q061R603J1159J2364J3372
61117E93062J4535J5975J7622J9392K1069K2294K2917K3102K2998K2593K2004
61106H17563K1516K1093K0276J8810J7036J5288J3315J0630P262L773O87j923
61094I65326m440p421j0988j4404j6641j7558j7984j8566j9091j9278j9378j9575
61082G80002j9404j8488j7285j6365j5477j4069j2358j1027j0191r421q528p575
61070F19814o409m927l638l082k940k429j437m05N81J759K953L865M856O447Q145
$$ y = [682001, 673090, 663785, 654741, 646247, 638108, 630085, 622449, 615958, 611203, 608059, 605889, 604196, 602856, 601712, 600225, 597671, 593578, 587809, 580408, 571651, 562202, 552886, 544167, 536083, 528710, 522474, 517831, 514840, 513243, 512759, 513212, 514533, 516865, 520497, 525493, 531565, 538503, 546564, 556167, 567326, 579690, 593062, 607597, 623572, 641194, 660586, 681655, 703949, 726866, 749968, 772966, 795559, 817563, 839079, 860172, 880448, 899258, 916294, 931582, 944897, 955527, 962789, 966562, 967249, 965326, 960886, 953465, 942477, 928073, 911432, 893874, 875890, 857324, 838233, 818955, 799577, 780002, 760598, 742110, 724825, 708460, 692983, 678914, 666556, 655529, 645338, 635917, 627389, 619814, 613405, 608478, 604840, 601758, 598818, 596389, 594952, 594547, 595128, 596887, 599840, 603705, 608561, 615008, 623153]
61055F23153Q927Q829Q962R880J1056J2128J3425J5011J6361J7350J8528K0058
61043G83668K1410K2488K3948K5947K7646K8572K9437L0972L2900L4644L6124
61032A097756L7365L8274L9397M1773M5311M8383M9824N0325N1055N2145N3519
61021A605127N6028O0448O6275P2880Q1026R1930J05508J20905J38174J58455
61011B556756J83311K14922K55588L05581L62843M26561M99603N85357O84175
61002F074697P95983R24288J073448J243841J434392J643578J850733J989661
60994A7030621J960098J695399J231517O99937K42787o4653k14559k20416j04537
60985B2256194O5577J63074O3692k63023p28773j193899j555810j780380j874889
$$ y = [623153, 632080, 640909, 649871, 659751, 670807, 682935, 696360, 711371, 727732, 745082, 763610, 783668, 805078, 827566, 851514, 877461, 905107, 933679, 963116, 994088, 1026988, 1061632, 1097756, 1135121, 1173395, 1212792, 1254565, 1299876, 1348259, 1398083, 1448408, 1499463, 1551608, 1605127, 1661155, 1721603, 1787878, 1860758, 1941784, 2033714, 2139222, 2260127, 2398301, 2556756, 2740067, 2954989, 3210577, 3516158, 3879001, 4305562, 4805165, 5390522, 6074697, 6870680, 7794968, 8868416, 10112257, 11546649, 13190227, 15040960, 17030621, 18990719, 20686118, 21917635, 22617572, 22860359, 22795706, 22581147, 22360731, 22256194, 22321771, 22484845, 22548537, 22285514, 21556741, 20362842, 18807032, 17026652, 15151763]
60976A5151763j855978j744147j569510j366812j163394r74782q08741o68695
60968D999704n53853m60338l84118l22426k72977k33521k02174j77263j56972
60959B236062j39880j25489j13408j02628r2312q2597p3757o5269n6835m9569
60949A334318m4835m2287m0329l8258l6659l5747l4688l2847l0615k8684k7205
60938I42164k5978k4848k3764k2859k2427k2321k1686j9950j7834j6534j6109
60927G07854j5663j4876j4246j3842j2998j1554j0222r411q628p530o524n817
60915E76543m878l503k498k485k760k272j164m64n43q23p67m28n7K72O13J107
60899E55893J779K215J794O33k35j63J92j14r33j493j822k571l669m295m270m433
$$ y = [15151763, 13295785, 11551638, 9982128, 8615316, 7451922, 6477140, 5668399, 4999704, 4445851, 3985513, 3601395, 3278969, 3005992, 2772471, 2570297, 2393034, 2236062, 2096182, 1970693, 1857285, 1754657, 1662345, 1579748, 1505991, 1440722, 1383887, 1334318, 1289483, 1247196, 1206867, 1168609, 1131950, 1096203, 1061515, 1028668, 998053, 969369, 942164, 916186, 891338, 867574, 844715, 822288, 799967, 778281, 758331, 740497, 723963, 707854, 692191, 677315, 663069, 649227, 636229, 624675, 614453, 605042, 596414, 588884, 582360, 576543, 571665, 568162, 565664, 563179, 560419, 558147, 556983, 556519, 555976, 555153, 554386, 553958, 553901, 554173, 554786, 555893, 557672, 559887, 561681, 562314, 562079, 561916, 562108, 561994, 561061, 559568, 557746, 555175, 551506, 547211, 542941, 538508]
60883E38508n291o300o873p190p506p433o687n888n835o339o552o209n804n625
60869D48976n345m664l760k911k186j630j367j229o88N25J924K714K675K296K067
60854D37397J870J350O59N58J559L149M113L714K360J078N30O09P86O28Q5n08
60838D59937q12r13j284k148l069l449l222k776k320j738j020m20o4K43O27Q28
60822D38400M64n05j653k341k138j285o80j027j994k611k558k469k837l288l393
60807D10085l489l986m392l965l103l009l805m123k956j207n61j331k242k228
60793C69688j675j646k379l083l031k456k108k197k171j640j013q47q57k42J000
60778C45343J781J267K7n98k4J161K083K454K508K514K615K916L507M269M778
$$ y = [538508, 533217, 526917, 520044, 512854, 505348, 497915, 491228, 485340, 479505, 473166, 466614, 460405, 454601, 448976, 443631, 438967, 435207, 432296, 430110, 428480, 427113, 425884, 425196, 425721, 427645, 430359, 433034, 435330, 437397, 439267, 440617, 441276, 441834, 443393, 446542, 450655, 454369, 456729, 457807, 458337, 458946, 459732, 460360, 460445, 459937, 459125, 458212, 456928, 454780, 451711, 448262, 445040, 442264, 439944, 438206, 437186, 436766, 436702, 436945, 437572, 438400, 438864, 438359, 436706, 434365, 432227, 430942, 430262, 429235, 427241, 424630, 422072, 419603, 416766, 413478, 410085, 406596, 402610, 398218, 394253, 391150, 388141, 384336, 380213, 377257, 376050, 375489, 374158, 371916, 369688, 368013, 366367, 363988, 360905, 357874, 355418, 353310, 351113, 348942, 347302, 346289, 345442, 344585, 344343, 345343, 347124, 348391, 348418, 347820, 347796, 348957, 351040, 353494, 356002, 358516, 361131, 364047, 367554, 371823, 376601]
60763C76601M573L647K558J885J656J489J112N03l01j137j527j179o39q17j691
60748C86733k183j650p94o05r59j002m58J41K83k11j443l164m440m402l459k944
60732C59443l407m043m012l572l444l703l873l688l184k342j202k38p8p71j602
60717C20284j753j068j53K51j2m11m36j85p6j54j23R1L13O20J243J944K068J510
60699C23953J023J215J791K151K260K407K572K592K606K789K896K637K311K451
60685C55654K941L079K507J594R02O91J010J751K581L095L175K939K428J668Q58
60670C86873K16l21q47j143j042j007j727l108m261m586m364m086l791l273k542
60655C50991j686p40R7M42K62J08N09J368K246K910L273L109K276J137K99m7k39
$$ y = [376601, 381174, 384821, 387379, 389264, 390920, 392409, 393521, 394024, 393723, 392586, 391059, 389880, 389241, 388424, 386733, 384550, 382900, 382106, 381501, 380542, 379540, 379082, 379223, 379506, 379295, 377852, 374688, 370248, 365846, 362387, 359443, 356036, 351993, 347981, 344409, 340965, 337262, 333389, 329701, 326517, 324175, 322973, 322735, 322657, 321886, 320284, 318531, 317463, 317310, 317561, 317549, 317138, 316702, 316517, 316441, 316287, 316164, 316255, 316568, 317188, 318431, 320375, 322443, 323953, 324976, 326191, 327982, 330133, 332393, 334800, 337372, 339964, 342570, 345359, 348255, 350892, 353203, 355654, 358595, 361674, 364181, 365775, 366677, 367368, 368378, 370129, 372710, 375805, 378980, 381919, 384347, 386015, 386873, 387089, 386768, 385921, 384778, 383736, 382729, 381002, 377894, 373633, 369047, 364683, 360597, 356806, 353533, 350991, 349305, 348565, 348662, 349104, 349366, 349474, 349983, 351351, 353597, 356507, 359780, 362889, 365165, 366302, 366601, 366554, 366315]
60638C66315o06j152j767k485l346m160m583m394l661k610j408j65Q85J372J121
60623C39356M27j77l76k11N6Q0m17j314j994j869r81J62J116J628J466P40K15
60606C37907O17J619K163J880J423J282J037K95m59n53n0O16J431K456L170K968
60590C57802K073J271R07Q04Q88J130J133O16J64N83J510J714Q78J16K99R79J432
60573C74299J915K986M265M871M835N121O251P655Q547Q848Q957R069Q940Q168
60559D64727O480L925R82j630l403m367m928n391n647n300m112k277k35J696L411
60544D43931M822N821O456P060P991R281J0560J1449J2047J2926J4429J5970J6351
60531E79094J4935J2240R144N911K423r99l722n658p258q601r196q922q430q227
$$ y = [366315, 365709, 364557, 362790, 360305, 356959, 352799, 348216, 343822, 340161, 337551, 336143, 335978, 336863, 338235, 339356, 339783, 339606, 339230, 339019, 339075, 339155, 338738, 337424, 335430, 333561, 332580, 332742, 333858, 335486, 336952, 337692, 337907, 338524, 340143, 342306, 344186, 345609, 346891, 347928, 348223, 347764, 347211, 347161, 347777, 349208, 351664, 354834, 357802, 359875, 361146, 362053, 362857, 363745, 364875, 366008, 366624, 366788, 367371, 368881, 370595, 371473, 371589, 371888, 372867, 374299, 376214, 379200, 383465, 388336, 393171, 398292, 404543, 412198, 420745, 429593, 438550, 447619, 456559, 464727, 471207, 475132, 476114, 474484, 471081, 466714, 461786, 456395, 450748, 445448, 441336, 439059, 438824, 440520, 443931, 448753, 454574, 461030, 468090, 476081, 485362, 495922, 507371, 519418, 532344, 546773, 562743, 579094, 594029, 606269, 615413, 621324, 623747, 622748, 619026, 613368, 606110, 597509, 588313, 579391, 570961, 562734]
60517E62734p951p062n789m719l863k794j503m03M65J555L040M471N437O147P134
60502E56899Q722J1001J4010J7633K1516K5340K9101L2869L6370L9029M0418M0444
60490H73352L9201L6800L3463K9466K4836J9277J2606N111k722j0750j8987k6948
60478A014705l3655l8512m1764m3808m4550m3816m1994l9616l6618l2752k8558
60467E89062k5038k2358j9742j6818j4255j2611j1372r786p999o694o030n622
60455D30737n294n113m916m442l807l381l248l261l401l587l356k390j212o95
60441C82634r28j164q68k12M60J007J186O76l75j314j696j653j398r28m24l68
60425C74635r10j534j594r74j4Q01J002M57k41k97K52N41K90M02J552K872K893
$$ y = [562734, 554783, 547721, 541932, 537213, 533350, 530556, 529053, 528650, 529115, 530670, 533710, 538181, 543618, 549765, 556899, 565621, 576622, 590632, 608265, 629781, 655121, 684222, 717091, 753461, 792490, 832908, 873352, 912553, 949353, 982816, 1012282, 1037118, 1056395, 1069001, 1074112, 1071390, 1060640, 1041653, 1014705, 981050, 942538, 900774, 856966, 812416, 768600, 726606, 686990, 650372, 617620, 589062, 564024, 541666, 521924, 505106, 490851, 478240, 466868, 457082, 449083, 442389, 436359, 430737, 425443, 420330, 415414, 410972, 407165, 403784, 400536, 397275, 393874, 390287, 386931, 384541, 383329, 382634, 381706, 380542, 379674, 379462, 379922, 380929, 382115, 382791, 382416, 381102, 379406, 377753, 376355, 375427, 375003, 374635, 373725, 372191, 370597, 369623, 369609, 370410, 371412, 371869, 371628, 371331, 371583, 372124, 372414, 372816, 374368, 377240, 380133]
60408C80133J560K96J46P02J017Q63O78Q01J216J829K579L315L805L914L711L433
60392D09998L288L257L129K801K440K240K156K068K101K471L059L436L313K835
60378D48592K376K247K569L120L379L003K363K166K413K209J022l21m91O10J670
60363D76927J651J029R52J654K343K424K190K247K808L735M801N636N846N596
60349E19839N679O610P851Q359P709O241M308J984n05k719m527o128p388p755
60335E39558p173o531o675p283p323o415n191m350l934l667l526l641l886l859
60321D66104l268k230j227p54r20j260j069oJ656L405N037O676Q337R732J0681
60306E00894J1517J2766J4344J5483J5536J4582J3062J1159Q858O294L518J73
$$ y = [380133, 381693, 381989, 382135, 382837, 383854, 384717, 385395, 386196, 387412, 389241, 391820, 395135, 398940, 402854, 406565, 409998, 413286, 416543, 419672, 422473, 424913, 427153, 429309, 431377, 433478, 435949, 439008, 442444, 445757, 448592, 450968, 453215, 455784, 458904, 462283, 465286, 467649, 469815, 472228, 474437, 475459, 475138, 474647, 475257, 476927, 478578, 479607, 480559, 482213, 484556, 486980, 489170, 491417, 494225, 497960, 502761, 508397, 514243, 519839, 525518, 532128, 539979, 548338, 556047, 562288, 566596, 568580, 568075, 565356, 560829, 554701, 547313, 539558, 532385, 525854, 519179, 511896, 504573, 498158, 492967, 488617, 484683, 481016, 477490, 473849, 469963, 466104, 462836, 460606, 459379, 458625, 457705, 456445, 455376, 455370, 457026, 460431, 465468, 472144, 480481, 490213, 500894, 512411, 525177, 539521, 555004, 570540, 585122, 598184, 609343, 618201, 624495, 628013, 628186]
60294F28186m004q386j1778j3668j4561j4983j4790j3736j2136j0464q782p005
60282D93893n354m125l237k512k086k139k456k689k824k966k957k647k355k457
60268D53089k729k656k277k079k184k255k169k165k264k159j867j852k324k850
60254D21259k891k295j162K55J399J685J233Q00P92Q19N25K42M21Q74J115J057
60238D26128R26P85O85R33J588J972J425M26K20J191K283K409J824J601K084K548
60222D49028K420K209K734L794M291L785L265L858N275O260O356O313O667O950
60208E13205O733O570P136Q034Q361Q089Q024Q451Q710Q183P050N857M941M447
60194F13791M365M345L857K841J848J419J484J506R86j59j507k452k912l486m566
$$ y = [628186, 624182, 615796, 604018, 590350, 575789, 560806, 546016, 532280, 520144, 509680, 500898, 493893, 488539, 484414, 481177, 478665, 476579, 474440, 471984, 469295, 466471, 463505, 460548, 457901, 455546, 453089, 450360, 447704, 445427, 443348, 441164, 438909, 436740, 434575, 432311, 430152, 428285, 426433, 424109, 421259, 418368, 416073, 414911, 415166, 416565, 418250, 419483, 420283, 421075, 421894, 422419, 422661, 423082, 423956, 425071, 426128, 427054, 427839, 428524, 429457, 431045, 433017, 434442, 434868, 435088, 436279, 438562, 440971, 442795, 444396, 446480, 449028, 451448, 453657, 456391, 460185, 464476, 468261, 471526, 475384, 480659, 486919, 493275, 499588, 506255, 513205, 519938, 526508, 533644, 541678, 550039, 558128, 566152, 574603, 583313, 591496, 598546, 604403, 609344, 613791, 618156, 622501, 626358, 629199, 631047, 632466, 633950, 635456, 636442, 636283, 634776, 632324, 629412, 625926, 621360]
60179F21360n560n689n252n267n872o159n674n062m729m063k732j748k099l049
60165E58405l075k127j624k295l257l465k937k196j410o41j45P7M61J084J282
60150E38137N59n52j109q68k56L63P95P25L7o99p06M0Q50J350J853K688L682M470
60132E51359M943N117M960M623M475M625M626L949K674J433Q63J228K368L715
60118F00958M527M413L722L145L015L156L377L698M059M160L821L269K769K131
60104F50220Q97r54k833m058m489m486m447m445m240l602k636j829j617j937k330
60089F07214k454k362k222k105k049k121k249k228k081k119k411k466j873j104
60075E77370j197k573m486n737n692m624l363k661k750l367m285n530o808p136
$$ y = [621360, 615800, 610111, 604859, 599592, 593720, 587561, 581887, 576825, 572096, 568033, 565301, 563553, 561454, 558405, 555330, 553203, 551579, 549284, 546027, 542562, 539625, 537429, 536019, 535378, 535233, 535310, 535771, 536855, 538137, 538696, 538144, 537035, 536167, 535911, 536274, 537069, 537794, 537831, 537132, 536426, 536466, 537316, 538666, 540519, 543207, 546889, 551359, 556302, 561419, 566379, 571002, 575477, 580102, 584728, 588677, 591351, 592784, 593647, 594875, 597243, 600958, 605485, 609898, 613620, 616765, 619780, 622936, 626313, 630011, 634070, 638230, 642051, 645320, 648089, 650220, 651117, 650163, 647330, 643272, 638783, 634297, 629850, 625405, 621165, 617563, 614927, 613098, 611481, 609544, 607214, 604760, 602398, 600176, 598071, 596022, 593901, 591652, 589424, 587343, 585224, 582813, 580347, 578474, 577370, 576173, 573600, 569114, 563377, 557685, 553061, 549698, 547037, 544287, 540920, 536635, 531105, 524297, 517161]
60061E17161n774l477k097k618m106m939m552l603k820k314j752q30M19J510J906
60046D82114J651J382J491J790K192L154M894O624P330O987O381N922N450M982
60032E42344M768M506L446J561j44r15j227j991l287m392m823m816m920n452o273
60017E18385o940p131p006o983p157p238p072o781o348n508m353l534l478l736
60003D35120l545k823k135j902j974j917j414m97M40Q76P11M34N93J272K234L278
59987D28751M186M610M365L771L351L295L428L515L326K665J674Q99O56M75l37
59972D68630j699k838l306l418l616l874l959l822l490k855j879q11m4J96p1o39
59956D32505j125j176p66j91L12P57J152J341J276J265J676K393K828K539J718
$$ y = [517161, 511387, 507910, 505813, 503195, 499089, 494150, 489598, 485995, 483175, 480861, 479109, 478279, 478698, 480208, 482114, 483765, 485147, 486638, 488428, 490620, 493774, 498668, 505292, 512622, 519609, 525990, 531912, 537362, 542344, 547112, 551618, 555064, 556625, 556481, 555566, 554339, 552348, 549061, 544669, 539846, 535030, 530110, 524658, 518385, 511445, 504314, 497308, 490325, 483168, 475930, 468858, 462077, 455729, 450221, 445868, 442334, 438856, 435120, 431575, 428752, 426617, 424715, 422741, 420824, 419410, 418913, 419353, 420229, 420940, 421374, 421967, 423239, 425473, 428751, 432937, 437547, 441912, 445683, 449034, 452329, 455757, 459272, 462598, 465263, 466937, 467836, 468492, 468967, 468630, 466931, 464093, 460787, 457369, 453753, 449879, 445920, 442098, 438608, 435753, 433874, 433063, 433019, 433215, 433144, 432505, 431380, 430204, 429438, 429247, 429559, 430316, 431468, 432809, 434085, 435350, 437026, 439419, 442247, 444786, 446504]
59941D46504J029R84J473J899J739R63l6q43j250j263j041q36p76o85k47O28J742
59924D49984K913M146N362O251O563O457O292O110N566M482L167K076J313P32
59910E11414L82M75R08J165Q76K33l74q20j137j133n66L75J106J309J247J415
59894E16875K004K795L402L587L495L524L904M468N000N521N968N902N060M051
59880E75556L759M099M094L356K717K952L626L697K868J635M19p86k027l247m400
59865E98318n317n593n055m168l560l248k777k014j279p30jJ336L217N065O221
59850E80415O529O581P163Q347R357R504Q820P584N788L534J493K17n72j397j997
59835F51366j757j023j035k470m696o639p699p770p064o190n798n868n745n092
$$ y = [446504, 447533, 448517, 449990, 451889, 453628, 454591, 454555, 453712, 452462, 451199, 450158, 449322, 448546, 447861, 447614, 448242, 449984, 452897, 457043, 462405, 468656, 475219, 481676, 487968, 494078, 499644, 504126, 507293, 509369, 510682, 511414, 511796, 512271, 513179, 514344, 515220, 515453, 515079, 514259, 513122, 511989, 511423, 511798, 512904, 514213, 515460, 516875, 518879, 521674, 525076, 528663, 532158, 535682, 539586, 544054, 549054, 554575, 560543, 566445, 571505, 575556, 579315, 583414, 587508, 590864, 593581, 596533, 600159, 603856, 606724, 608359, 608778, 607992, 605965, 602718, 598318, 593001, 587408, 582353, 578185, 574625, 571377, 568600, 566586, 565307, 564577, 564576, 565912, 569129, 574194, 580415, 586944, 593525, 600688, 609035, 618392, 627896, 636716, 644300, 650088, 653622, 655115, 655332, 654760, 653363, 651366, 649609, 648586, 647551, 645081, 640385, 633746, 626047, 618277, 611213, 605023, 599225, 593357, 587612, 582520]
59821E82520m222l423k615j965k142l370m681m799l564k067j373j563k033k351
59807E42352k617l002l246k896j992j153o92j95O39J208P70l20r16o10p5Q8M5
59790E27388N1pj65k07k87r27j986k502k017j392j562k208k438k224k222k488
59774E04807k382j657q02k17K87R52J590J863J758J638J960K879L961M465M177
59759E25279L753L895M423M647M534M896O232P890Q692Q250P319O958P408P946
59745F12122P722O618N213M109L517L367L408L196K458J521R98Q71M61m77j202
59730F53902j046n47q09k005l116l207k412j540j162j236j435j622j918k329k473
59715F27045k026j346j141j477j613j137o01n92p58l72N31J368K048K957M037
$$ y = [582520, 578298, 574875, 572260, 570295, 568153, 564783, 560102, 555303, 551739, 549672, 548299, 546736, 544703, 542352, 539735, 536733, 533487, 530591, 528599, 527446, 526754, 526559, 527198, 528406, 529176, 528856, 527940, 527330, 527255, 527343, 527388, 527439, 527432, 527267, 527060, 526773, 525846, 523860, 521358, 519341, 517949, 516387, 514179, 511741, 509517, 507295, 504807, 502425, 500768, 499966, 499749, 500036, 500988, 502578, 504441, 506199, 507837, 509797, 512676, 516637, 521102, 525279, 529032, 532927, 537350, 541997, 546531, 551427, 557659, 565549, 574241, 582491, 589810, 596768, 604176, 612122, 619844, 626462, 631675, 635784, 639301, 642668, 646076, 649272, 651730, 653251, 654249, 655120, 655581, 655104, 653902, 652856, 652309, 651500, 649495, 646379, 643172, 640760, 639220, 638058, 636822, 635387, 633765, 631847, 629518, 627045, 625019, 623673, 622532, 621055, 619442, 618305, 617704, 617112, 616354, 615982, 616513, 617881, 619929, 622886, 626923]
59700F26923M728M905N076N433N442M722L792L424L656L853L548K816J927J023
59686F81268J52o02j160j558j933k358k674k607k137j656j656k256l164l989m580
59671F49090n109n874o884p650p551o521n161m029l130k229j377p73l20K85J080
59656E93847J777K240K728L599M814N815N955N207M353M113M148L380J444p85
59642F42635k366l478m838o475p731q305q514q545q132p140n979n133m612m090
59628E57297l442k951k987l499l993m096m104m576n414n822n355m498l919l660
59614D98981l526l690m229m476l627j906m39O4n0m7L88J036J457J392J096J129
59598D83553J557J750J300O85N16N68L18K7L11R46J085O49M25P05P75R5r55j814
$$ y = [626923, 631651, 636556, 641632, 647065, 652507, 657229, 661021, 664445, 668101, 671954, 675502, 678318, 680245, 681268, 681420, 680818, 679658, 678100, 676167, 673809, 671135, 668528, 666391, 664735, 663079, 660823, 657659, 653670, 649090, 643981, 638107, 631223, 623573, 616022, 609501, 604340, 600311, 597181, 594952, 593575, 592802, 592482, 592767, 593847, 595624, 597864, 600592, 604191, 609005, 614820, 620775, 625982, 630335, 634448, 638596, 641976, 643420, 642635, 640269, 636791, 631953, 625478, 617747, 609442, 600928, 592383, 584251, 577111, 571132, 565999, 561387, 557297, 553855, 550904, 547917, 544418, 540425, 536329, 532225, 527649, 522235, 516413, 511058, 506560, 502641, 498981, 495455, 491765, 487536, 483060, 479433, 477527, 477088, 477152, 477102, 477055, 477443, 478479, 479936, 481328, 482424, 483553, 485110, 486860, 488160, 488845, 489361, 489929, 490247, 490274, 490585, 491531, 492616, 493265, 493690, 494395, 495170, 495265, 494310, 492496]
59580D92496k436k859k851k486k365k761l102k840k299k104k205k099j702j418
59566D58969j446j515j321q93m92l14k94j81J15K86M6l86n03j94K75Q32J651K570
59548D57205L057L003K963L412M186M970N765O657P557Q480R688J1325J3256J5431
59534E56955J7739J9247J8268J3905P285P80l825o188o943o882o383n182k925
59521E95851r5J988K441J768J088P64L09p22k267m106o052p817r069r692r786
59506E54603r486q933q338p785p136o314n506m877m283l514k691k141k017k176
59492D79406k313k055j257k96K15K41M61J347K487L188L356L367L426L546L893
59477D99012M532M977M624L660L011L250M013M516M337L516K342J240O45P18J140
$$ y = [492496, 490060, 487201, 484350, 481864, 479499, 476738, 473636, 470796, 468497, 466393, 464188, 462089, 460387, 458969, 457523, 456008, 454687, 453794, 453302, 452988, 452694, 452513, 452628, 452914, 452960, 452574, 452071, 451877, 452152, 452984, 454635, 457205, 460262, 463265, 466228, 469640, 473826, 478796, 484561, 491218, 498775, 507255, 516943, 528268, 541524, 556955, 574694, 593941, 612209, 626114, 633399, 634179, 630354, 624166, 617223, 610341, 603958, 598776, 595851, 595756, 597744, 600185, 601953, 603041, 603805, 604114, 603392, 601125, 597019, 590967, 583150, 574081, 564389, 554603, 545117, 536184, 527846, 520061, 512925, 506611, 501105, 496228, 491945, 488431, 485740, 483599, 481582, 479406, 477093, 475038, 473781, 473485, 473700, 473941, 474402, 475749, 478236, 481424, 484780, 488147, 491573, 495119, 499012, 503544, 508521, 513145, 516805, 519816, 523066, 527079, 531595, 535932, 539448, 541790, 543030, 543675, 544393, 545533]
59462E45533J342J020M17J26M88J276K041K738L718N119O579P669Q280Q380P850
59447F02576O789N776N324N213M610K914K50k691n135o643p331p638p764p462
59433E88788o487n131m024l486l251k832k105j409j033o59L86K216M144N713P438
59418E78268R912J2551J4231J5082J6387J8557K0480K1449K2320K3627K3618J9814
59406G96296J2198L429m070r793j3864j5667j4664j1538p480k854K311O693P712
59393G48709L829l572j1153j6365j8935j9867j9689j8218j5578j2617j0064p747
59381E98733n059j938R39K769L270K886K483K732L584M501N173N727O227O446
59367F38473O238N765N156M376L588L218L323L402L124K846L021L545M082M611
$$ y = [545533, 546875, 547895, 548312, 548438, 548926, 550202, 552243, 554981, 558699, 563818, 570397, 578066, 586346, 594726, 602576, 609365, 615141, 620465, 625678, 630288, 633202, 633452, 630761, 625626, 618983, 611652, 604014, 596250, 588788, 582301, 577170, 573146, 569660, 566409, 563577, 561472, 560063, 559030, 558371, 558757, 560973, 565117, 570830, 578268, 588180, 600731, 614962, 630044, 646431, 664988, 685468, 706917, 729237, 752864, 776482, 796296, 808494, 811923, 807853, 798060, 784196, 768529, 753865, 742327, 734847, 731993, 734304, 740997, 748709, 752538, 748966, 737813, 721448, 702513, 682646, 662957, 644739, 629161, 616544, 606480, 598733, 593674, 591736, 592675, 595444, 598714, 601600, 604083, 606815, 610399, 614900, 620073, 625800, 632027, 638473, 644711, 650476, 655632, 660008, 663596, 666814, 670137, 673539, 676663, 679509, 682530, 686075, 690157, 694768]
59353F94768N206N690O044O755Q196R933J1251J2041J2614J2958J2813J2319J1925
59340H22513J1728J1490J1125J0552R246O700L367M36j488k930m584o411p902
59327H63842q835r404r810j0037r955r569r155q984q920q460p440o395n932o027
59313G44919o212o215o073n830n543n311n023m285l011j729q94j85J008K724M546
59298G02886O194P302O959M337k25n388j0043j3807j6473j7787j7757j6643j4552
59285F15003j1654q709o634n504m607l481k219p23J368L829N662O284O294O650
59271F01559P577Q678R719J0821J2071J3249J3858J3344J1505Q797O017L625J550
59258G22370m05k365m459o652q531r589r702r050p751o053m719m426m832m844
$$ y = [694768, 699974, 705664, 711708, 718463, 726659, 736592, 747843, 759884, 772498, 785456, 798269, 810588, 822513, 834241, 845731, 856856, 867408, 876654, 883354, 886721, 887157, 885669, 882739, 878155, 871744, 863842, 855007, 845603, 835793, 825756, 815801, 806232, 797077, 788093, 779173, 770713, 763273, 756878, 750946, 744919, 738707, 732492, 726419, 720589, 715046, 709735, 704712, 700427, 697416, 695687, 694793, 694608, 695616, 698340, 702886, 709080, 716382, 723341, 727678, 727453, 722065, 712022, 698215, 681742, 663955, 646198, 629555, 615003, 603349, 594640, 588006, 582502, 577895, 574414, 572195, 571472, 572840, 576669, 582331, 588615, 594909, 601559, 609136, 617814, 627533, 638354, 650425, 663674, 677532, 690876, 702381, 711178, 717195, 720820, 722370, 721965, 719600, 715141, 708489, 699958, 690369, 680667, 671617, 663866, 657813, 653094, 648668, 643836, 638992]
59244F38992l947k638j481m76M56J085J385J910L130M735N922O202N715M979M496
59229F70465M334M032L208K121J304P09k43j735l293m515n479o188o297n721n012
59214F47690m672m469l872k921k275k441l145l540l050k105j785k564l651m025
59200F03175l686l341l092k400j259m74m66o63l91K76R57J617K336K952L382L856
59184F02779M504N030N148N004M892M889M980N169N250M900M243L937M410N359
59170F70494O152O440O193N621N228N459O083O271N557M351L347K783K428J866
59156G38273O28j500m119o454q131r351j0270j0747j0749j0546j0318r994r584
59143F37138r172q643p937p477p651p936p458o401n899o338o792o477n642m606
$$ y = [638992, 635045, 632407, 630926, 630450, 630906, 631991, 633376, 635286, 638416, 643151, 649073, 655275, 660990, 665969, 670465, 674799, 678831, 682039, 684160, 685464, 686173, 685930, 684195, 680902, 676387, 670908, 664720, 658423, 652702, 647690, 643018, 638549, 634677, 631756, 629481, 627040, 623895, 620355, 617305, 615200, 613415, 610851, 607200, 603175, 599489, 596148, 593056, 590656, 589397, 588923, 588457, 587794, 587403, 587679, 588636, 590253, 592589, 595541, 598923, 602779, 607283, 612313, 617461, 622465, 627357, 632246, 637226, 642395, 647645, 652545, 656788, 660725, 665135, 670494, 676646, 683086, 689279, 694900, 700128, 705587, 711670, 717941, 723498, 727849, 731196, 733979, 736407, 738273, 738901, 737401, 733282, 726828, 718697, 709346, 699076, 688329, 677580, 667034, 656716, 646722, 637138, 627966, 619323, 611386, 603909, 596258, 588322, 580864, 574463, 568564, 562226, 555434, 548957, 543315, 538709]
59129E38709l093j206K0n3n46k32Q48J840K539L388M494N582O676P941R071R579
59113E85557R552R465R388R049Q500Q051P664P033O199N565N292N156M940M613
59099F86024M147L434K438J265J87m72p07j010j712k243j790o26L1k75p06o63
59083F87322p57j622k713l234l445m111n207o153o805p328p460o873n964n486
59069F20164n563n783n915n885n465m711m339m815n470n290m330l491l258l411
59055E52438l706l933l602k509j382j130j540j657j249r55j017r19m00j2l20j114
59039E26993j645j289p5J206J588R84L44L90P43Q07Q83J574K677L611M468N585
59023E48844O580O919P139Q240J0035J1378J1887J2117J2043J0862Q552O301M841
$$ y = [538709, 535616, 534410, 534430, 534377, 533831, 533599, 534447, 536287, 538826, 542214, 546708, 552290, 558966, 566907, 575978, 585557, 595109, 604574, 613962, 623011, 631511, 639562, 647226, 654259, 660458, 666023, 671315, 676471, 681411, 686024, 690171, 693605, 696043, 697308, 697495, 697023, 696316, 695306, 693594, 691351, 689561, 688935, 688966, 688691, 687985, 687322, 686565, 684943, 682230, 678996, 675551, 671440, 666233, 660080, 653275, 645947, 638487, 631614, 625650, 620164, 614601, 608818, 602903, 597018, 591553, 586842, 582503, 577688, 572218, 566928, 562598, 559107, 555849, 552438, 548732, 544799, 541197, 538688, 537306, 536176, 534636, 532979, 531730, 530775, 529758, 528839, 528439, 528427, 528107, 526993, 525348, 524059, 523984, 525190, 526778, 527762, 528106, 528496, 529239, 530046, 530929, 532503, 535180, 538791, 543259, 548844, 555424, 562343, 569482, 577722, 587757, 599135, 611022, 623139, 635182, 646044, 654596, 660897, 665738]
59010F65738L552J773k7j021j142p80j10P31J347J559J751K260K861L152L125
58995F84769L024K956K813K354J346K5q77r72q78j337k086k440k685l636m889
58980F77487m969l495j848j154q05K93K130M061N935P735Q936R241R430J0424
58966G23401J1864J2547J2062J1104J0268R434Q404P351O398N236L496J265j008
58953H21822l050n050p356r907j2124j3477j4032j4198j4108j3682j3045j2409
58941F89384j1498r785p424n390m375m032l621k972k513k620l248m001m344l989
58927F19572l196k509k097j644r43k43J38J77N0j30k90l99m94n11j56O68J500
58910F09493J806J773K132L105M112M641M927N576O871Q595J0249J1315J1654
$$ y = [665738, 669290, 671063, 671036, 670015, 668873, 668093, 667983, 668714, 670061, 671620, 673371, 675631, 678492, 681644, 684769, 687793, 690749, 693562, 695916, 697262, 697287, 696410, 695438, 694560, 693223, 691137, 688697, 686012, 682376, 677487, 672518, 669023, 667175, 666021, 665216, 665509, 667639, 671700, 677635, 685370, 694306, 703547, 712977, 723401, 735265, 747812, 759874, 770978, 781246, 790680, 799084, 806435, 812833, 818069, 821565, 822830, 821822, 818772, 813722, 806366, 796459, 784335, 770858, 756826, 742628, 728520, 714838, 701793, 689384, 677886, 668101, 660677, 655287, 650912, 646880, 643259, 640287, 637774, 635154, 631906, 627905, 623561, 619572, 616376, 613867, 611770, 610126, 609183, 608940, 609078, 609255, 609305, 609175, 608885, 608486, 607992, 607481, 607325, 607993, 609493, 611299, 613072, 615204, 618309, 622421, 627062, 631989, 637565, 644436, 653031, 663280, 674595, 686249]
58897F86249J1692J1956J2452J2738J2533J1899J1111J0640J1062J2409J3887
58886H18628J4754J5229J5887J6505J6364J5444J4364J3170J1283Q650N949L405
58874I69632M82k953o090q231r585j0600j1285j1569j1633j1389j0426q863p610
58861H59880p327p697q167q677r257r549r392r368j0127j1477j2533j2548j1382
58848G32379r587q226q107q943r674r650r046q139p062o282o362o945o971o205
58834F21180n636n819n954n235m126l454l093k479j755j364j038j83J039J885
58820E83968K073J964J946K261L087M180M702M140L123K691K996L321L193K763
58806F26408K228J522O21k81r86j395j542j697k217l069l758l963l909l940m144
$$ y = [686249, 697941, 709897, 722349, 735087, 747620, 759519, 770630, 781270, 792332, 804741, 818628, 833382, 848611, 864498, 881003, 897367, 912811, 927175, 940345, 951628, 960278, 966227, 969632, 970114, 967161, 961071, 952840, 943255, 932655, 921370, 909801, 898168, 886779, 876353, 867490, 859880, 852553, 844856, 836689, 828012, 818755, 809206, 799814, 790446, 780319, 768842, 756309, 743761, 732379, 722792, 714566, 706459, 697516, 687842, 678192, 669146, 661007, 653945, 647663, 641301, 634356, 627385, 621180, 615544, 609725, 603771, 598536, 594410, 590956, 587863, 585384, 583629, 582265, 581227, 581044, 582083, 583968, 586041, 588005, 589951, 592212, 595299, 599479, 604181, 608321, 611444, 614135, 617131, 620452, 623645, 626408, 628636, 630158, 630779, 630498, 629512, 628117, 626575, 624878, 622661, 619592, 615834, 611871, 607962, 604022, 599878]
58791E99878m553n270n989n921m614k536n76P53J451J878K667M136N618O035N386
58776E98343M889N249N731N431M524L471J937m17k813m196m787n643o892p550
58762E97277p089o146n562n483n668n948o137n879m948l537k154j285j000p84
58748E35657J2J354K478K799K536K281K352K819L670M645N298N489N414N049M198
58733E86051L324L440M773O178O497N862N122M608M126L562K882K009J268J345
58719F41047K299L287L776M205M852M960M041L171L764N544O926P013O095M526
58705G05506K381K7k053m049o460r014j0904j2061j3209j4600j5648j5888j5480
58692E88548j4592j3109j1253r719q884q389p716o823n952n225m583l943l322
$$ y = [599878, 595325, 590055, 584066, 578145, 573531, 570995, 570419, 571172, 572623, 574501, 577168, 581304, 586922, 592957, 598343, 603232, 608481, 614212, 619643, 624167, 627638, 629575, 629158, 626345, 622149, 617362, 611719, 604827, 597277, 590188, 584042, 578480, 572997, 567329, 561381, 555244, 549365, 544417, 540880, 538726, 537441, 536441, 535657, 535669, 537023, 539501, 542300, 544836, 547117, 549469, 552288, 555958, 560603, 565901, 571390, 576804, 581853, 586051, 589375, 592815, 597588, 603766, 610263, 616125, 621247, 625855, 629981, 633543, 636425, 638434, 639702, 641047, 643346, 646633, 650409, 654614, 659466, 664426, 668467, 671638, 675402, 680946, 687872, 694885, 700980, 705506, 707887, 707914, 705861, 701812, 695352, 686338, 675434, 663373, 650164, 635564, 619916, 604028, 588548, 573956, 560847, 549594, 539875, 530991, 522602, 514886, 508063, 502111, 496886, 492303, 488360, 485038]
58679D85038k823k471k037j342p30p76j341j531q52J78J005J876L193M705N974
58664D88066P114Q289R110R197Q891Q551P647N421K163j022l415m981n771n884
58650E33376n705n542n234m682m287m257m040l245k509k549k899k644j956j730
58636D82097j972j730n93P79J694K133K355K484K522K248J300j09r81o60K24O48
58620D92439N65O19R75J386J961K932L940M470M667M911M968M473L783L418L097
58605E38604K349J602J543J834J602Q65K56k11r13j507j396r94j184j718j575
58590E39157p59k40j37N18K119L919N396O808Q176Q933Q969Q931R195R433R378
58575F19796R141Q706Q042P609P844Q299Q385Q656J0097J2353J4201J5599J7644
$$ y = [485038, 482215, 479744, 477707, 476365, 475635, 474859, 473518, 471987, 471135, 471313, 472318, 474194, 477387, 482092, 488066, 495180, 503469, 512579, 521776, 530667, 539218, 546865, 552286, 554449, 553427, 550012, 545031, 539260, 533376, 527671, 522129, 516895, 512213, 507926, 503669, 499629, 496384, 493875, 491326, 488427, 485783, 483827, 482097, 480125, 478395, 477802, 478581, 480275, 482408, 484763, 487247, 489769, 492017, 493317, 493208, 492227, 491567, 491791, 492439, 493004, 493623, 494598, 495984, 497945, 500877, 504817, 509287, 513954, 518865, 523833, 528306, 532089, 535507, 538604, 540953, 542555, 544098, 545932, 547534, 548399, 548655, 548444, 547531, 546024, 544628, 543634, 542450, 540732, 539157, 538398, 538158, 538021, 538539, 540658, 544577, 549973, 556781, 564957, 573890, 582859, 591790, 600985, 610418, 619796, 628937, 637643, 645685, 653294, 661138, 669437, 677822, 686478, 696575, 708928, 723129, 738728, 756372]
58562G56372K0400K2503K3333K3871K4803K5288K4362K2325J9852J6839J2924
58551I92872Q394L905o5l036m615n154n640o592p668q462r018r454r980j1222
58537I24265j3665j6708j9231k0997k2465k3337k2640k0327j7581j5254j3179
58526G18881j1212r658q413o873n095l907l582l462l186l140l458l693l752m056
58512F45394m482m279l306k265j533r04n16p41j075n58N10P17k51j155j270j288
58496F22998j653j613p26K25O45J116K111K971L133L280M320O010P468Q373R030
58481F67688R858J1211J3083J4756J5486J5537J5653J5669J4827J3302J1916J0349
58469H29335P309K759j696m962p419r386j0294r992r159p952n752k801l93J121
$$ y = [756372, 776772, 799275, 822608, 846479, 871282, 896570, 920932, 943257, 963109, 979948, 992872, 1001266, 1005171, 1005106, 1002070, 997455, 992301, 986661, 980069, 972401, 963939, 954921, 945467, 935487, 924265, 910600, 893892, 874661, 853664, 831199, 807862, 785222, 764895, 747314, 732060, 718881, 707669, 698011, 689598, 682725, 677630, 673723, 670141, 666679, 663493, 660353, 656895, 653202, 649450, 645394, 640912, 636633, 633327, 631062, 629529, 628625, 628109, 627368, 626293, 625735, 626245, 626962, 626711, 625556, 624286, 622998, 621345, 619732, 619006, 619231, 619876, 620992, 623103, 626074, 629207, 632487, 636807, 642817, 650285, 658658, 667688, 677546, 688757, 701840, 716596, 732082, 747619, 763272, 778941, 793768, 807070, 818986, 829335, 836644, 839403, 837707, 832745, 825326, 815940, 805646, 795654, 786495, 778543, 772791, 769990, 769597, 770718]
58455G70718K854N316P516Q802R796J0742J0677R159P138N177K512j247n093q200
58441H35867j0809j2737j2841j1066r162q167p010m835k801k076j761m63J511
58428G53650L147M521O044P211P692Q427J0054J1388J0959R120P206N538L595
58415H48552J262j302m148o845q334q470q614r646j0618j0385r302q195o971n436
58401G51548m187l487k507q53M74P15O81J252K026K546L349M598N076L971K282
58386G67484J265P77K97J20L76M20L33J340L637N549O063O279P080P530P042O961
58370H22553Q233R589R872J0038J0976J1499J0670R939J0680J1670J1472J1254
58358I48445J2538J4009J3522J1675J0480R880Q513O690N698N132L709J894J132
$$ y = [770718, 773572, 778888, 786404, 795206, 805002, 815744, 826421, 835580, 842718, 847895, 850407, 849160, 844067, 835867, 825058, 812321, 799480, 788414, 779252, 771085, 764075, 759240, 756439, 754363, 752602, 752139, 753650, 756797, 761318, 767362, 774573, 782265, 790692, 800746, 812134, 823093, 832213, 839419, 844957, 848552, 849814, 848512, 844364, 837519, 829185, 820715, 812101, 802455, 791837, 781452, 772150, 763955, 756984, 751548, 747361, 743874, 741367, 740514, 740988, 741703, 742384, 743636, 745662, 748208, 751557, 756155, 761231, 765202, 767484, 768749, 769526, 769823, 769943, 770319, 770739, 771072, 772412, 776049, 781598, 787661, 793940, 801020, 808550, 815592, 822553, 830786, 840375, 850247, 860285, 871261, 882760, 893430, 903369, 914049, 925719, 937191, 948445, 960983, 974992, 988514, 1000189, 1010669, 1020549, 1029062, 1035752, 1041450, 1046582, 1050291, 1052185, 1053317]
58345A053317J289J301J443K588M084M845N559P428R697J0809J1108J2018J3430
58332A138916J4233J4533J5119J5676J5599J5476J5737J5124J2723J0020Q706
58321A291862P976O398M760M431M601L912L306M279N890O490O768Q129R648R945
58307A378395J0364J2782J5755J6591J5943J6468J8016J8185J6960J6802J8401
58296A554662J9875K0050J9453J8416J7162J7131J9254K1709K2284K1899K2827
58285A774722K4704K5625K5830K6803K7929K7685K6991K7777K9359K9892L0124
58274B077441L1924L4365L5237L5264L6792L9525M1495M3119M6178N0007N2681
58263B524028N4723N7652O0457O1620O2783O6004O9354O9965O9341P0674P2984
$$ y = [1053317, 1054606, 1055907, 1057350, 1059938, 1064022, 1068867, 1074426, 1081854, 1091551, 1102360, 1113468, 1125486, 1138916, 1153149, 1167682, 1182801, 1198477, 1214076, 1229552, 1245289, 1260413, 1273136, 1283156, 1291862, 1299838, 1306236, 1310996, 1315427, 1320028, 1323940, 1327246, 1331525, 1337415, 1343905, 1350673, 1358802, 1368450, 1378395, 1388759, 1401541, 1417296, 1433887, 1449830, 1466298, 1484314, 1502499, 1519459, 1536261, 1554662, 1574537, 1594587, 1614040, 1632456, 1649618, 1666749, 1686003, 1707712, 1729996, 1751895, 1774722, 1799426, 1825051, 1850881, 1877684, 1905613, 1933298, 1960289, 1988066, 2017425, 2047317, 2077441, 2109365, 2143730, 2178967, 2214231, 2251023, 2290548, 2332043, 2375162, 2421340, 2471347, 2524028, 2578751, 2636403, 2696860, 2758480, 2821263, 2887267, 2956621, 3026586, 3095927, 3166601, 3239585]
58252C239585P3380P3028P5111P8814Q1298Q3696Q8992R5750J00424J04158J10606
58241D204842J18743J24832J29910J38088J48867J58423J67163J78514J91660
58232E561042K03166K14361K29301K46906K63281K79905L01012L24925L47195
58223G971094L70176L99696M34368M68613N04218N47716N98395O50808P07382
58214A2652466P75947Q56543R43935J041593J159198J298112J454453J634956
58206B1817203J853959K116849K424250K791319L244997L805611M492805N346792
58198D7893785O418407P737921R318605J1189680J3398122J5979500J8952967
58191A30888987K2326906K6052025K9951258L3701403L6799939L8416215L7333147
$$ y = [3239585, 3312965, 3385993, 3461104, 3539918, 3621216, 3704912, 3793904, 3889654, 3990078, 4094236, 4204842, 4323585, 4448417, 4578327, 4716415, 4865282, 5023705, 5190868, 5369382, 5561042, 5764208, 5978569, 6207870, 6454776, 6718057, 6997962, 7298974, 7623899, 7971094, 8341270, 8740966, 9175334, 9643947, 10148165, 10695881, 11294276, 11945084, 12652466, 13428413, 14284956, 15228891, 16270484, 17429682, 18727794, 20182247, 21817203, 23671162, 25788011, 28212261, 31003580, 34248577, 38054188, 42546993, 47893785, 54312192, 62050113, 71368718, 82558398, 95956520, 111936020, 130888987, 153215893, 179267918, 209219176, 242920579, 279720518, 318136733, 355469880]
58184C55469880L2381601K3300599J1256587j624138j3353160k2808499k9637545
58177C54985325l3818197l5485907l5013163l2984696l0001472k6540825k2965955
58170A38175110j9556098j6483770j3811592j1543516r662791q126262o867700
58163E2123381n830013m978512m280613l697560l203126k789446k447304k157734
58155B2739073j907323j694532j515773j360072j221381j101984r99924r06111
58147A2031973q17006p37635o69116o05243n44061m90932m47146m06725l67716
58138F946393l35916l13939k96368k79046k63923k51686k38356k22557k08056
58129D536546j96179j83388j68856j56807j48626j40101j29195j19494j13285
$$ y = [355469880, 387851481, 411152080, 422408667, 420784529, 407431369, 384622870, 354985325, 321167128, 285681221, 250668058, 217683362, 187681890, 161141065, 138175110, 118619012, 102135242, 88323650, 76780134, 67117343, 58991081, 52123381, 46293368, 41314856, 37034243, 33336683, 30133557, 27344111, 24896807, 22739073, 20831750, 19137218, 17621445, 16261373, 15039992, 13938008, 12938084, 12031973, 11214967, 10477332, 9808216, 9202973, 8658912, 8167980, 7720834, 7314109, 6946393, 6610477, 6296538, 6000170, 5721124, 5457201, 5205515, 4967159, 4744602, 4536546, 4340367, 4156979, 3988123, 3831316, 3682690, 3542589, 3413394, 3293900, 3180615]
58120C180615j07864j01425r6147r2860q8713q2685p7730p5055p1845o6845o2740
58109B256706o0863n8829n5487n3100n2509n1160m7930m5142m3957m2461m0129
58098A705139l9390m0896m1800m0574l9151l8664l7411l4750l2688l1871l0179
58087A297765k6864k4059k2656k0898j8465j7673j9112k0216j9772j9706k0797
58076A067547k0866j9077j7862j8654j9576j9220j8850j9010j7812j4700j2234
58065H69686j1991j2138j1042r850r551q924p507p230q972j0604j0498r929j0117
58052G41333j0031r104q982j0368j1179r980q359p818p241n715m882n961p139
58039F34574o456m958m540m853m732m676n553o620p022p532q853r892r623r007
$$ y = [3180615, 3072751, 2971326, 2875179, 2782319, 2693606, 2610921, 2533191, 2458136, 2386291, 2319446, 2256706, 2195843, 2137014, 2081527, 2028427, 1975918, 1924758, 1876828, 1831686, 1787729, 1745268, 1705139, 1665749, 1624853, 1583053, 1542479, 1503328, 1464664, 1427253, 1392503, 1359815, 1327944, 1297765, 1270901, 1246842, 1224186, 1203288, 1184823, 1167150, 1148038, 1127822, 1108050, 1088344, 1067547, 1046681, 1027604, 1009742, 991088, 971512, 952292, 933442, 914432, 896620, 881920, 869686, 857695, 845557, 834515, 824665, 815114, 806190, 798683, 791453, 782481, 771877, 761379, 751450, 741333, 731302, 722198, 713216, 702848, 691669, 681689, 673330, 665512, 658271, 652556, 647674, 641713, 634574, 628118, 623160, 618620, 613767, 609035, 604359, 598806, 592186, 585164, 577632, 568779, 558887, 549264, 540257]
58025E40257r298j0045j0321j0332j0244r200p013n103m404m040l303l042l708
58012D50204m036l155k149k075k287k033j877k161k050j329j186j922k046r31
57998D20967r0l82m57N37J216P42Q24K698M553M351L085K685K665J511k43j092
57982D43570j402k465l846m212l925m385n446n785n287m941m839m219l139k392
57968C87287k042j570j040q09n19L04J191J422J181R34M22o58j678j926j737j818
57952C78944k116k316k599l059l245k983k752k556j634M3J316J718K329L807N167
57937C70064N543N655O318P058P444Q198R561J0144Q902O794N050L226O61j728
57923D52890k977l989o004q289r276r059q906r098r005q464p560n956l965l086
$$ y = [540257, 530959, 520914, 510593, 500261, 490017, 480817, 473804, 468701, 464297, 460257, 456954, 453912, 450204, 446168, 443013, 440864, 438789, 436502, 434469, 432592, 430431, 428381, 427052, 425866, 423944, 421898, 420967, 420877, 420495, 420038, 420575, 421791, 422533, 423357, 426055, 430608, 434959, 438044, 440729, 443394, 444905, 444662, 443570, 442168, 439703, 435857, 431645, 427720, 423335, 417889, 412104, 406817, 401876, 397037, 392818, 389679, 387287, 385245, 383675, 382635, 381826, 381307, 381611, 382802, 384224, 385405, 386339, 386761, 386103, 384425, 382499, 380762, 378944, 376828, 374512, 371913, 368854, 365609, 362626, 359874, 357318, 355684, 355727, 357043, 358761, 361090, 364897, 370064, 375607, 381262, 387580, 394638, 402082, 410280, 419841, 429985, 438887, 445681, 450731, 453957, 454618, 452890, 449913, 445924, 439920, 431631, 422355, 413296, 404390, 395292, 386287, 377823, 370263, 364307, 360342, 357256]
57909C57256l815m160k261O55K024J654J401J899K054J430Q52O53K97j32J47J062
57893C61016J579J330J035J277J959K878L782M092L492K548J868J227L15l69m55
57878C87574p08j880l388m338m930n588n671m640l569l763m576m401l164k026
57864C34932j204l9J163J411R37J052K081L131L841M728N762O231O099O012N913
57849C82050N111L793L019L101L255K962K446J706L92j231k406l061l776m521
57835C92840m622m021l504l520l793m165m762n245m882l590k113j182j035j567
57821C44839k164j835l46J086J123oj025j290j076p65q07j906l973n573n691n400
57805C15191o358q161q918q017o559n272l833k348j653j819j808j015Q7J042J884
$$ y = [357256, 353441, 349281, 347020, 347675, 349699, 351353, 352754, 354653, 356707, 358137, 358989, 359642, 359939, 359807, 359954, 361016, 362595, 363925, 364960, 366237, 368196, 371074, 374856, 378948, 382440, 384988, 386856, 388083, 388398, 388029, 387574, 386866, 384986, 381598, 377260, 372330, 366742, 361071, 356431, 352862, 349099, 344523, 340122, 336958, 334932, 333728, 333689, 334852, 336263, 337200, 338252, 340333, 343464, 347305, 352033, 357795, 364026, 370125, 376137, 382050, 387161, 390954, 393973, 397074, 400329, 403291, 405737, 407443, 407835, 406604, 404198, 401137, 397361, 392840, 388218, 384197, 380693, 377173, 373380, 369215, 364453, 359208, 354326, 350736, 348623, 347441, 346406, 344839, 342675, 340840, 340494, 341580, 342703, 342697, 341672, 340382, 339306, 338541, 337734, 335828, 331855, 326282, 320591, 315191, 308833, 300672, 291754, 283737, 277178, 271906, 268073, 265725, 264072, 262253, 260445, 259430, 259517, 260559, 262443]
57790B62443K406K242J850K128K907L172K899L258M632N864O037N776O118P071
57776C18803P880P976P282O143N255M972M692L648K185J297R66J24j655l519m635
57761C61414n134n390n313m732l834k925k297k288k879l355l050k243j636j235
57747C15103o57j56k96q65j131j007r62r91p95o77j086j529j149k00L98O93J486
57730C06179K705L456L575L656L634K942K000J836K190J776O26K58J104J740J251
57715C38928N58N21N07k25j228k003l025m502n493n365m993n312n762n381m525
57700B92700m156m158l669k642j941k054k557k751k289j432r63j443k351k544
57686B57750j800j049q11m50N55J626K178K758M219O459Q819J1166J3800J6731
$$ y = [262443, 264849, 267091, 268941, 271069, 273976, 277148, 280047, 283305, 287937, 293801, 299838, 305614, 311732, 318803, 326683, 334659, 341941, 348084, 353339, 358311, 363003, 366651, 368836, 370133, 371099, 371223, 369568, 366049, 361414, 356280, 350890, 345577, 340845, 337011, 334086, 331789, 329501, 326622, 323267, 320217, 317974, 316338, 315103, 314446, 314290, 313994, 313129, 311998, 310991, 310029, 309038, 308243, 307566, 306480, 304951, 303802, 303602, 304000, 304693, 306179, 308884, 312340, 315915, 319571, 323205, 326147, 328147, 329983, 332173, 333949, 334575, 334833, 335937, 337677, 338928, 339486, 340007, 340514, 340289, 339061, 337058, 334033, 329531, 324038, 318673, 313680, 308368, 302606, 297225, 292700, 288544, 284386, 280717, 278075, 276134, 274080, 271523, 268772, 266483, 265051, 264088, 262645, 260294, 257750, 255950, 254901, 254090, 253640, 254195, 255821, 257999, 260757, 264976, 271435, 280254, 291420, 305220, 321951]
57672C21951J9799K3097K6753L0698L5057M0096M5147M8068M6471L9284K6924
57661G03345J0765o919k3107l5246m2463m5401m5125m2469l8045l2460k6582k1516
57649C54777j7839j4972j1943q840o672n816n453m802l882k789j269M48J401J182
57635B73531O32N62O09J15n33m73K85Q65O62j88j238k100k585k808k918k636j631
57618B60151m98m56j709k907k896k212k089k540k456j278K44R79N71m11j106j160
57602B40227r42r41j084r89p03o25p73q44r85j666k719l364l383l336l430l148
57586B11295k368j780j735j591q88k06j73m73n68o71j199j855k074j864j600j385
57570A90865j223j279j522j617j566j794k167j839o64J51l45j412j684r66j5R11
$$ y = [321951, 341750, 364847, 391600, 422298, 457355, 497451, 542598, 590666, 637137, 676421, 703345, 714110, 707191, 684084, 648838, 606375, 560974, 515849, 473380, 435335, 402875, 376293, 354777, 336938, 321966, 310023, 301183, 294511, 288695, 283242, 278440, 274558, 271769, 270500, 270948, 272349, 273531, 274163, 274725, 275334, 275449, 274916, 274443, 274728, 275593, 276255, 276067, 274829, 272729, 270144, 267336, 264418, 261782, 260151, 259653, 259197, 257488, 254581, 251685, 249473, 247384, 244844, 242388, 241110, 241354, 242333, 242904, 242493, 241387, 240227, 239285, 238344, 237260, 236271, 235568, 234943, 234170, 233326, 232341, 230675, 227956, 224592, 221209, 217873, 214443, 211295, 208927, 207147, 205412, 203821, 202933, 202727, 202554, 202081, 201513, 200842, 199643, 197788, 195714, 193850, 192250, 190865, 189642, 188363, 186841, 185224, 183658, 181864, 179697, 177858, 177194, 177345, 177000, 175588, 173904, 172938, 172923, 173834]
57554A73834K062L206L710L465K897K217J415P73N79M70j71j220j923j904j514
57539A87896j196r82o97j77N86J269J307N12o04j320j358q76j73L53L53q2m93
57522A84318o56o78m63K51J153J473J216J371K437L538L627K860K000J196K31
57507B03874n48n34J64P57P43K82j86l22j70l59j509l200m059l377k047j406j750
57490A86353k437k843k645j786p93m91q53q35J16J132J259Q57P84Q95M55n34j387
57473A77247j837k058k055j790j614j686j459n65K53J28n59p67m69m88j016j368
57457A59897j193q50n83k89q9j89k39K89J070J142K70p46j213j145p19P0R56J351
57439A57790J076O70O52R01R25M85q6q3Q63K111K426J398Oo18m83k40K2O32J426
$$ y = [173834, 175896, 179102, 182812, 186277, 189174, 191391, 192806, 193579, 194158, 194628, 194457, 193237, 191314, 189410, 187896, 186700, 185718, 185021, 184844, 185430, 186699, 188006, 188518, 187914, 186594, 185236, 184360, 184187, 184540, 184893, 184811, 184318, 183662, 182984, 182521, 182772, 183925, 185398, 186614, 187985, 190422, 193960, 197587, 200447, 202447, 203643, 203874, 203326, 202792, 202956, 203713, 204456, 204738, 204552, 204230, 204060, 203701, 202192, 198992, 194933, 191556, 189509, 188103, 186353, 183916, 181073, 178428, 176642, 175849, 175358, 174505, 173670, 173786, 174918, 176177, 177034, 177818, 178713, 179168, 178634, 177247, 175410, 173352, 171297, 169507, 167893, 166207, 164748, 164183, 164436, 164564, 164005, 163238, 162769, 162281, 161265, 159897, 158704, 157854, 157271, 156982, 156893, 156704, 156465, 156754, 157824, 158966, 159236, 158490, 157277, 156132, 155413, 155483, 156439, 157790, 158866, 159536, 160188, 161089, 162014, 162499, 162413, 162330, 163193, 165304, 167730, 169128, 169134, 168516, 168033, 167793, 167815, 168447, 169873]
57420A69873J850J737J327O68j93p81o93l01j32R7R49K052K385J787J137J009
57404A82771J019O63M9m31n33j98L71O10J31o92j165j160j039r05n35N0O72J466
57386A81144K550L401L338K620K264K688L199L048K284J458R01N31P2n89j139
57371B07770j137p54p82j531k241k103j364p90n09j80J79L46M96Q20Q96L37k96
57354A99157j69N12Q47P20P95J221J400J085P27O40O51O25N65K40m89j086r13
57337B06528k75o9m31p33o78m91j70M09P16J21p97p58K86R50M55l59n15k25o6
57318B03898J50Q94J934K555K426J737Q26k6o32r20q14k19N56P53N9p80r24o16
57300B10857o20q89q15m25k41j45L11P20L10m83l49Q31J830K147K583L357L338
$$ y = [169873, 171723, 173460, 174787, 175455, 175262, 174481, 173788, 173487, 173355, 173452, 174401, 176453, 178838, 180625, 181762, 182771, 183790, 184453, 184502, 184071, 183538, 183340, 183711, 184321, 184452, 183760, 182595, 181435, 180396, 179491, 178956, 179006, 179678, 181144, 183694, 187095, 190433, 193053, 195317, 198005, 201204, 204252, 206536, 207994, 208895, 209426, 209498, 208909, 207770, 206633, 205879, 205097, 203566, 201325, 199222, 197858, 197068, 196559, 196379, 196558, 196904, 197400, 198220, 199116, 199453, 199157, 198988, 199500, 200347, 201067, 201862, 203083, 204483, 205568, 206295, 206935, 207586, 208211, 208776, 209016, 208527, 207441, 206528, 206253, 206184, 205753, 205020, 204342, 203851, 203681, 204090, 204806, 204927, 204130, 203372, 203658, 204608, 205063, 204704, 204189, 203964, 203898, 204048, 204942, 206876, 209431, 211857, 213594, 214420, 214394, 213762, 212842, 212028, 211809, 212365, 213118, 213177, 212397, 211473, 210857, 210237, 209348, 208533, 208108, 207867, 207722, 208033, 208753, 209063, 208580, 208231, 209062, 210892, 213039, 215622, 218979, 222317]
57283B22317J990N69L38Q49J099J293K144L218L363K452J587J677K582L596M180
57268B53254M266M207M288M240L565K400J493J199J137R86R00R49Q60O69Q31J360
57252B86604J645J430J245J437J596J381J158J274J396J148P88P50J015J363J727
57237C05957J939J711J244J175J569J621P99k91o79r5J085K358L181L202K751
57222C27527K607K974L287L233L134L153K945K512K445K844K929K261J562J599
57208C65012K091K371K488K855L422L869M197M537M779M841M842M734M312L856
57194D18206M064M940N569N398N009N176N924O953Q169R259R620R224Q887R126
57180E15524R617J0107J0952J2138J2879J2833J2737J3074J3220J2749J2545J3607
$$ y = [222317, 224307, 224876, 225214, 226063, 227162, 228455, 230599, 233817, 237180, 239632, 241219, 242896, 245478, 249074, 253254, 257520, 261727, 266015, 270255, 273820, 276220, 277713, 278912, 280049, 281035, 281935, 282884, 283744, 284413, 285244, 286604, 288249, 289679, 290924, 292361, 293957, 295338, 296496, 297770, 299166, 300314, 301102, 301852, 302867, 304230, 305957, 307896, 309607, 310851, 312026, 313595, 315216, 316015, 315724, 315045, 314950, 316035, 318393, 321574, 324776, 327527, 330134, 333108, 336395, 339628, 342762, 345915, 348860, 351372, 353817, 356661, 359590, 361851, 363413, 365012, 367103, 369474, 371962, 374817, 378239, 382108, 386305, 390842, 395621, 400462, 405304, 410038, 414350, 418206, 422270, 427210, 432779, 438177, 443186, 448362, 454286, 461239, 469408, 478667, 488287, 497511, 506398, 515524, 525141, 535248, 546200, 558338, 571217, 584050, 596787, 609861, 623081, 635830, 648375, 661982]
57168F61982J5564J7414J8961K0574K2247K3853K5630K7541K8891K9476L0224
57157I22357L1831L3624L4869L6213L8559M1408M3736M5845M8889N3018N7321
57146A387670O1255O4893O8276P1753P6457Q2972Q9809R4522R6190R5658R3835
57135B283290R1185Q8613Q7212Q6920Q6624Q5816Q5181Q5594Q7566R1429R6976
57124C256406J02913J07774J11468J15040J18982J22776J25912J28409J30374
57115D320054J32026J34047J37207J41832J48352J57764J70526J85640K02029
57106E729477K20220K41460K66101K94732L30541L78594M42903N25988O31009
57097I061025P62263R23225J115536J339301J591814J865647K150119K435050
$$ y = [661982, 677546, 694960, 713921, 734495, 756742, 780595, 806225, 833766, 862657, 892133, 922357, 954188, 987812, 1022681, 1058894, 1097453, 1138861, 1182597, 1228442, 1277331, 1330349, 1387670, 1448925, 1513818, 1582094, 1653847, 1730304, 1813276, 1903085, 1997607, 2093797, 2189455, 2283290, 2374475, 2463088, 2550300, 2637220, 2723844, 2809660, 2894841, 2980435, 3068001, 3159430, 3256406, 3359319, 3467093, 3578561, 3693601, 3812583, 3935359, 4061271, 4189680, 4320054, 4452080, 4586127, 4723334, 4865166, 5013518, 5171282, 5341808, 5527448, 5729477, 5949697, 6191157, 6457258, 6751990, 7082531, 7461125, 7904028, 8430016, 9061025, 9823288, 10746513, 11862049, 13201350, 14793164, 16658811, 18808930, 21243980]
57089B1243980K711276K968221L194410L381243L523700L617536L659242L646238
57081D7945846L565327L373230K998176K381313J530274N32557m87493j428199
57073F0411031k237401k899249l410281l769185l978866m049168l996329l841704
57065C2228848l610351l328013l017687k698179k384459k087756j815129j569966
57057A1717308j353568j166032j005931q70173p55081o57564n75205n05714m46818
57048D381222l96536l53198l15441k82333k53294k27571k04147j82467j62854
57039B003381j45715j30584j16477j02934r0125p8086o6528n5311m4593l4352
57029A138676k4123j3218j018J2352K4770L1822K8970J4925p190l1810n3787o9895
$$ y = [21243980, 23955256, 26923477, 30117887, 33499130, 37022830, 40640366, 44299608, 47945846, 51511173, 54884403, 57882579, 60263892, 61794166, 62326723, 61839230, 60411031, 58173630, 55274381, 51864100, 48094915, 44116049, 40066881, 36070552, 32228848, 28618497, 25290484, 22272797, 19574618, 17190159, 15102403, 13287274, 11717308, 10363740, 9197708, 8191777, 7321604, 6566523, 5908959, 5333754, 4828040, 4381222, 3984686, 3631488, 3316047, 3033714, 2780420, 2552849, 2348702, 2166235, 2003381, 1857666, 1727082, 1610605, 1507671, 1417546, 1339460, 1272932, 1217621, 1173028, 1138676, 1114553, 1101335, 1100317, 1112669, 1137439, 1169261, 1198231, 1213156, 1205966, 1174156, 1120369, 1050474]
57017A050474p9040q1936q0230p5400o8425o0252n2012m4558l8216l3071k9073
57006D08261k5757k2485j9214j6590j5048j4253j3666j3154j2756j2244j1359
56995B31735j0194r004p877o837o006n315m313k591k57K329N078P995J0571J1802
56981B17116J1081Q738N527J813k359o532r684j1115j1217j0931j0613r848q278
56968A63698o138l913j899j92J300L001N358Q226J0986J3353J5562J7535J8501
56955B45378J7733J5125J0779M752k290q757j3234j5553j6389j6293j5541j4349
56943A91361j2661j0173p103m324k177K10L710P905J1799J5154J8298K1226K3713
56930B56938K5626K6206K3714J7160P926j464r750j6925k2516k5571k6192k5452
$$ y = [1050474, 971434, 889498, 809268, 733868, 665443, 605191, 553179, 508621, 470405, 437334, 408261, 382504, 360019, 340805, 324215, 309167, 294914, 281248, 268094, 255338, 243094, 231735, 221541, 212537, 204660, 197823, 191817, 186502, 182189, 179598, 179341, 181670, 186748, 194743, 205314, 217116, 228197, 236935, 242462, 244275, 241916, 235384, 225700, 214585, 203368, 192437, 181824, 171976, 163698, 157560, 153647, 151748, 151556, 152856, 155857, 161215, 169441, 180427, 193780, 209342, 226877, 245378, 263111, 278236, 289015, 293767, 291477, 282720, 269486, 253933, 237544, 221251, 205710, 191361, 178700, 168527, 161424, 157100, 154923, 155133, 158843, 166748, 178547, 193701, 211999, 233225, 256938, 282564, 308770, 332484, 349644, 357570, 356106, 346356, 329431, 306915, 281344, 255152, 229700]
56918B29700k3819k1034j7656j5059j3610j2327j0664r262q465p536n974m369
56906G9925l256k295j250o36o16k64J105K719L380L079K766L084M107N871Q280
56891A05999J0754J2640J3932J5173J6807J8726K0215K0265J8309J4752J0364
56880B77936N324m58o214j0412j2243j2183j0912q569n377k154M52K667N175Q455
56866B31487J2716J7804K3039K7750L2160L6989M2026M5816M6794M3935L6381
56855E96897K3905Q248p085j9130k7056l1346l2545l1254k8256k3882j7986j1006
56843C99504m051K545R720J8054K6722L4752M2403N0378N8522O6093P2215P5034
56831H51891P1422N9095L8990J4806r426l0792m7504n8854o5116o6720o3840n7201
$$ y = [229700, 205881, 184847, 167191, 152132, 138522, 126195, 115531, 106269, 97804, 90268, 84294, 79925, 76669, 74374, 73124, 72488, 71872, 71608, 72713, 75432, 78812, 81891, 84657, 87741, 91848, 97719, 105999, 116753, 129393, 143325, 158498, 175305, 194031, 214246, 234511, 252820, 267572, 277936, 283260, 282802, 276588, 266176, 253933, 241750, 230838, 222269, 216892, 214738, 215190, 217857, 223032, 231487, 244203, 262007, 285046, 312796, 344956, 381945, 423971, 469787, 516581, 560516, 596897, 620802, 629050, 621965, 602835, 575779, 544433, 511888, 480634, 452378, 428496, 410510, 399504, 395453, 397998, 407718, 425772, 452494, 487246, 529649, 580027, 638549, 704642, 776857, 851891, 923313, 982408, 1021398, 1036204, 1026778, 995986, 948482, 889628, 824512, 757792, 693952, 636751]
56819F36751m8603l9708l0821k1615j2443l916M197J2535K0904K8495L5172M1444
56807F22392M7057N0402M9350M2351K9080J0984q812k6869m1074n0830n6145n7139
56795F10747n4334m8861m2130l5363k9096k3017j6580r945l846J478O524J1524
56783C67101J6039J9796K2980K5213K5200K1996J5855P338l211j4612k4482l1072
56771D48141l4690l6361l6084l3645l0133k7009k4263k1011j7506j4908j3308
56760A59223j1589r339p415o353n505m214k854k189k366k866l032k570j868j688
56746I5375k165k417j709n37J23J39M1q2m96r93j082p62l08L58J188J397M26r07
56728H7589j378j066r21r64m68L39M26j15Q5J430K541K268J267Q04J036J288J216
$$ y = [636751, 588148, 548440, 517619, 496004, 483561, 479645, 483842, 496377, 517281, 545776, 580948, 622392, 669449, 719851, 769201, 811552, 840632, 851616, 842804, 815935, 774861, 724031, 667886, 610747, 556413, 507552, 465422, 430059, 400963, 377946, 361366, 351421, 347575, 349053, 355577, 367101, 383140, 402936, 425916, 451129, 476329, 498325, 514180, 521518, 518307, 503695, 479213, 448141, 413451, 377090, 341006, 307361, 277228, 250219, 225956, 204945, 187439, 172531, 159223, 147634, 138295, 130880, 124527, 119022, 114808, 111954, 109765, 107399, 104533, 101501, 98931, 97063, 95375, 93210, 90793, 89084, 88547, 88670, 88809, 88850, 88768, 88272, 87279, 86197, 85435, 85127, 85485, 86673, 88070, 88496, 87589, 86211, 85145, 84224, 83260, 82792, 83131, 83557, 83442, 83527, 84957, 87498, 89766, 91033, 91837, 92873, 94161, 95377]
56711I5377R38O55O50J157J829J912J284O96O84R32R55P18K43o29j634j932j100
56694A02735K57J251J617J532J117N80L04M15N86N99O95J025J216Q87K94Q3N49
56677A15742J363J923J863J380J012R30O85k2o64n26K23P79Q52Q51R73R16N51
56660A28831R7m39j150j475n51J333K568K094P50J41O67J341J215L71m29o13k52
56643A34499J30J62l2j26q6r8j75j83r3J15O05J297J612J172M63K15L19J58k82
56624A39672m89m86p77j276j294q23o57j007j070m75n8n11j157r52m6N90N47J93
56606A29924k16p37j179j144p08m37o25q95p39j59L93N52M16L29M14M24J03l66
56588A25350n85m13l5M24J016J680K122K058J487O84J06R3N58R95J058R44J073
$$ y = [95377, 96315, 96970, 97620, 98777, 100606, 102518, 103802, 104498, 105182, 106114, 107069, 107787, 108030, 107401, 105767, 103835, 102735, 102992, 104243, 105860, 107392, 108509, 109089, 109393, 109808, 110394, 110993, 111688, 112713, 113929, 114816, 115110, 115193, 115742, 117105, 119028, 120891, 122271, 123283, 124213, 124898, 124876, 124212, 123686, 123909, 124688, 125540, 126391, 127364, 128280, 128831, 128928, 128489, 127339, 125864, 125313, 126646, 129214, 131308, 132058, 132199, 132866, 134207, 135422, 135793, 135364, 134751, 134499, 134629, 134791, 134759, 134633, 134547, 134449, 134274, 134091, 133998, 134113, 134718, 136015, 137627, 138799, 139262, 139477, 139796, 139954, 139672, 139183, 138697, 137920, 136644, 135350, 134527, 133870, 132863, 131793, 131318, 131260, 130749, 129592, 128640, 128594, 129184, 129731, 129924, 129708, 128971, 127792, 126648, 125940, 125503, 124878, 123983, 123244, 123085, 123478, 124030, 124446, 124775, 125189, 125613, 125716, 125350, 124765, 124352, 124317, 124741, 125757, 127437, 129559, 131617, 133104, 133788, 133894, 133987, 134545, 135540, 136598, 137542, 138615]
56571A38615J605K412L238L735L667L348L482M250N042N486O048P189Q487R354
56557B05958R978J0669J0750R180O060K583l53k628m200m912m898m474l651k537
56543B27525j868k254l141l496l261l142l218k962k450k265k228j574m84j29q92
56528A94161j771j908j526j056m68M3p4p62j167r53p78j069j327j176j035j210
56512A77924j307j142j289k060k753k589j703o64K62Q98R36M56j4l08p99j419
56496A64429j465p63j00m5k17j97j96l24j80K61K78l30o94k99J09j76n90m12j27
56477A58962n19j072o20Q47K165K623K626K783L169L423L121K068O16n18r86j051
56461A77637r24m87J23K89k56r70j257j072n16M11J283J378P83N49J178J783J443
$$ y = [138615, 140220, 142632, 145870, 149605, 153272, 156620, 160102, 164352, 169394, 174880, 180928, 188117, 196604, 205958, 215936, 226605, 237355, 246535, 252595, 255178, 254825, 252197, 247997, 243085, 238187, 233713, 230062, 227525, 225657, 223403, 220262, 216766, 213505, 210363, 207145, 204183, 201733, 199468, 197240, 195666, 195182, 195053, 194161, 192390, 190482, 188956, 187900, 187432, 187475, 187401, 186639, 185472, 184519, 183741, 182672, 181345, 180169, 179134, 177924, 176617, 175475, 174186, 172126, 169373, 166784, 165081, 164417, 164679, 165577, 166513, 166969, 166955, 166647, 165848, 164429, 162964, 162201, 162101, 162056, 161839, 161642, 161446, 161122, 160942, 161203, 161481, 161151, 160457, 160158, 160267, 160091, 159501, 159089, 158962, 158443, 157371, 156751, 157598, 159763, 162386, 165012, 167795, 170964, 174387, 177508, 179576, 180192, 179674, 178688, 177637, 176713, 176226, 176349, 176638, 176382, 175412, 174155, 173083, 172567, 172978, 174261, 175639, 176422, 176971, 178149, 179932, 181375]
56444A81375N33lP2M23Q44J082O46m06j135q50k1N40O95O11J88l93m20K83Q18
56425A84882N17L7K22P62R24Q64J100J360J098O62P36J059Q31J08l14k17j60m45
56407A94026p11n13L02J555K594K567J405J43l13j65LK53Q33J394J548J568J768
56390B08257J763J208N95M43L66r1l69K54J288J680J329Q97N83K53K66R68J655
56373B21345J317J89n26l13L41J047J711J864R84m20j112o09M61J418K043K133
56357B31873J532P06M74R94J600J703J353R84J021J565K110J887Q94N2n0R6j4
56340B48780J3N81J153J156J143J869K936L410L304L230L206K940K784L157L493
56325B83155L060K360K399K889K665J634Q88R41J208J272J395J597J465R52N04
$$ y = [181375, 181908, 181905, 181977, 182400, 183244, 184326, 184972, 184566, 183431, 182581, 182560, 183100, 183795, 184406, 184594, 184201, 183781, 184064, 184882, 185399, 185436, 185658, 186420, 187344, 188208, 189308, 190668, 191766, 192428, 193164, 194223, 195054, 195162, 194848, 194631, 194471, 194026, 193315, 192802, 193104, 194659, 197253, 199820, 201225, 201368, 201055, 200890, 200893, 201146, 201979, 203373, 204921, 206489, 208257, 210020, 211228, 211823, 212266, 212632, 212541, 212172, 212426, 213714, 215394, 216723, 217620, 218203, 218456, 218722, 219690, 221345, 222662, 222851, 222325, 222012, 222353, 223400, 225111, 226975, 227959, 227539, 226427, 225818, 226279, 227697, 229740, 231873, 233405, 234111, 234585, 235579, 237179, 238882, 240235, 241219, 242240, 243805, 245915, 247802, 248696, 248748, 248698, 248794, 248780, 248793, 249374, 250527, 251683, 252826, 254695, 257631, 261041, 264345, 267575, 270781, 273721, 276505, 279662, 283155, 286215, 288575, 290974, 293863, 296528, 298162, 299050, 299991, 301199, 302471, 303866, 305463, 306928, 307880, 308384]
56310C08384K28r7k87R0Q55J406J664K022K524K951L403M008M319L966L504L723
56294C42663M366M565M148L550K906K287K309L315M407M534M077M192M984N733
56280C98036O386P404Q470Q858Q837R269J0029J0279J0061J0154J0674J1195J2011
56267E21663J3739J5825J7108J7708J8824K0766K2757K4542K6718K9528L2833
56256G62011L7044M2486M8130N2750N7117O3219P1430Q0237Q8714R7173J05367
56245A505678J12186J17490J22189J26157J27916J26820J23623J18537J10548
56236B591144R9159Q5020O8425M9099K7980P230j2126l0861m9159o5524p8734
56225B691653q9181r7469j03373j06928j08888j09469j08113j05070j01504r7570
$$ y = [308384, 308612, 308515, 308228, 308318, 309173, 310579, 312243, 314265, 316789, 319740, 323143, 327151, 331470, 335436, 338940, 342663, 347029, 351594, 355742, 359292, 362198, 364485, 366794, 370109, 374516, 379050, 383127, 387319, 392303, 398036, 404422, 411826, 420296, 429154, 437991, 447260, 457289, 467568, 477629, 487783, 498457, 509652, 521663, 535402, 551227, 568335, 586043, 604867, 625633, 648390, 672932, 699650, 729178, 762011, 799055, 841541, 889671, 942421, 999538, 1062757, 1134187, 1214424, 1303138, 1400311, 1505678, 1617864, 1735354, 1857543, 1983700, 2111616, 2238436, 2362059, 2480596, 2591144, 2690303, 2775323, 2843748, 2892847, 2920827, 2928057, 2915931, 2885070, 2835911, 2770387, 2691653, 2602472, 2505003, 2401630, 2294702, 2185814, 2076345, 1968232, 1863162, 1761658, 1664088]
56215A664088r2238q5655p9641p5045p0606o5352o0159n5849n1678m7044m2915
56204I37906m0136l7841l4885l1556k8584k5759k2724j9938j7703j5421j2858
56193F50501j0966j0383j0270r590q458p379o338n383m887m584l620k115j234
56180E65294j189q26J38M18m93j225p99q5J62P38K211L543L909M109M749M860
56164E85514L927L428M552O082O506O626Q006J0104J1236J1382J1882J3105J4372
56151F96722J5760J8097K1485K5320K9446L4120L9265M4865N1539N9748O8987
56140A105354P8461Q7793R6263J02392J05083J04225R9644R0969P9336O7673N8148
56129B075341N0591M4266L9327L5349L0222K2280J2264J874q168j7283k4093k8190
$$ y = [1664088, 1571850, 1486195, 1406554, 1331509, 1260903, 1195551, 1135392, 1079543, 1027865, 980821, 937906, 897770, 859929, 825044, 793488, 764904, 739145, 716421, 696483, 678780, 663359, 650501, 639535, 629152, 618882, 609292, 600834, 593455, 587117, 581734, 576847, 572263, 568643, 566528, 565294, 564105, 563279, 563417, 563835, 563342, 562117, 561318, 561233, 561395, 562133, 564344, 567887, 571796, 575905, 580654, 585514, 589441, 592869, 597421, 603503, 610009, 616635, 624641, 634745, 645981, 657363, 669245, 682350, 696722, 712482, 730579, 752064, 777384, 806830, 840950, 880215, 925080, 976619, 1036367, 1105354, 1183815, 1271608, 1367871, 1470263, 1575346, 1679571, 1779215, 1870184, 1949520, 2017193, 2075341, 2125932, 2170198, 2209525, 2244874, 2275096, 2297376, 2309640, 2311514, 2303346, 2286063, 2261970, 2233780]
56117B233780l1621l6944m4889n5079o7297q0270r0802r6251r6921r4494q9441
56106A449771q1711p2535o3460n4569m5468l7018l0351k5135k0434j6307j3061
56095I89722j0067o884m395l295k647j423k03K19M94J434K493L074L921N583P056
56080I85082P609Q258R741J0808J0410R774J0268J1002J0731J0363J1265J2748
56068A108059J3550J4179J5507J6639J6572J6267J6754J6952J5902J5265J6794
56057A282440J9096J9769J9176J9143J9504J8941J7945J7801J7918J7131J6384
56046A485248J7295J9211K0475K1283K2534K3393K2891K2391K3483K5078K5557
56035A728839K5998K8070L0538L1379L1626L3498L6385L8311L9767M2317M4973
$$ y = [2233780, 2202159, 2165215, 2120326, 2065247, 1997950, 1917680, 1826878, 1730627, 1633706, 1539212, 1449771, 1368060, 1295525, 1232065, 1177496, 1132028, 1095010, 1064659, 1039524, 1019090, 1002783, 989722, 979655, 972771, 968376, 965081, 962434, 961011, 960808, 961027, 961521, 962955, 965448, 968522, 972443, 978026, 985082, 992691, 1000949, 1010690, 1021498, 1031908, 1041682, 1051950, 1062952, 1073683, 1084046, 1095311, 1108059, 1121609, 1135788, 1151295, 1167934, 1184506, 1200773, 1217527, 1234479, 1250381, 1265646, 1282440, 1301536, 1321305, 1340481, 1359624, 1379128, 1398069, 1416014, 1433815, 1451733, 1468864, 1485248, 1502543, 1521754, 1542229, 1563512, 1586046, 1609439, 1632330, 1654721, 1678204, 1703282, 1728839, 1754837, 1782907, 1813445, 1844824, 1876450, 1909948, 1946333, 1984644, 2024411, 2066728, 2111701]
56024B111701M5812M5718M6687M8011M8060M8182N0694N4528N7046N8696O1631
56013B676766O5334O7985P0484P4690P9294Q2051Q4380Q9021R4898R9258J03003
56002C587164J08747J15430J20372J24904J32205J41263J48754J55385J64389
55993D798613J75420J85881J96648K10249K25326K39267K54247K73874K96116
55984F855641L16795L37698L63529L93326M23154M54840M93117N36689N81608
55975A0756397O31052O91677P62644Q39111R24265J026497J147158J283513J441565
55966A9503879J632884J861497K128833K449873K849489L346065L956241M712839
55958D2441600N657459O816112Q202589R844148J1781915J4049151J6671111J9669669
$$ y = [2111701, 2157513, 2203231, 2249918, 2297929, 2345989, 2394171, 2444865, 2499393, 2556439, 2615135, 2676766, 2742100, 2810085, 2880569, 2955259, 3034553, 3116604, 3200984, 3290005, 3384903, 3484161, 3587164, 3695911, 3811341, 3931713, 4056617, 4188822, 4330085, 4478839, 4634224, 4798613, 4974033, 5159914, 5356562, 5566811, 5792137, 6031404, 6285651, 6559525, 6855641, 7172436, 7510134, 7873663, 8266989, 8690143, 9144983, 9638100, 10174789, 10756397, 11387449, 12079126, 12841770, 13680881, 14605146, 15631643, 16778801, 18062314, 19503879, 21136763, 22998260, 25127093, 27576966, 30426455, 33772520, 37728761, 42441600, 48099059, 54915171, 63117760, 72961908, 84743823, 98792974, 115464085, 135133754]
55950A35133754K3018708K6580762L0092827L3137274L4990510L4515696L0488482
55943C47958013K2391024J1051440j553342j3239748k2509422k8790722l2162954
55936B83144289l3033936l1973436k9606786k6503605k3115706j9778464j6716244
55929A02416112j4036802j1755765r848381q278080o994160n937937n063789m342813
55921C6158385l747155l246978k823303k468527k172160j918207j696989j507161
55913A6577905j344792j201262j072564r60410q63274p75615o96222o28254n70700
55904H464812n18367m70376m30188l97058l65774l35229l09186k87954k67120
55895E083560k45405k26407k11433j97406j82943j70160j59423j48360j36931
$$ y = [135133754, 158152462, 184733224, 214826051, 247963325, 282953835, 317469531, 347958013, 370349037, 381400477, 379847135, 366607387, 344097965, 315307243, 283144289, 250110353, 218136917, 188530131, 162026526, 138910820, 119132356, 102416112, 88379310, 76623545, 66775164, 58497084, 51502924, 45564987, 40501198, 36158385, 32411230, 29164252, 26340949, 23872422, 21700262, 19782055, 18085066, 16577905, 15233113, 14031851, 12959287, 11998877, 11135603, 10359988, 9663766, 9035512, 8464812, 7946445, 7476069, 7045881, 6648823, 6283049, 5947820, 5638634, 5350680, 5083560, 4838155, 4611748, 4400315, 4202909, 4019966, 3849806, 3690383, 3542023, 3405092]
55886C405092j27691j20249j11162j00185r1179q5968q2549p9977p9727q1290
55876B445115q1495p9399p7187p5523p2528o8137o4897o3535o1937n9255n6941
55865A684281n5104n2035m7852m4581m2171l8609l4353l2283l2643l2489l0899
55854A241262l0318l1728l2800l2113l1186l0893k9798k7496k5934k5866k5359
55843I17771k3362k1507k0981k0638j9616j8855j8751j8088j6574j5649j5668
55832G08082j5041j3248j1899j1702j1137r330p612p010o718o213o394p521q437
55819E85820q798r685j1120j1514j0490r720r878r452p651n901n210m546l140
55806D78715k009j785j331J28J555K156K777L935M562L949L093K856K651K047
$$ y = [3405092, 3277401, 3157152, 3045990, 2945805, 2854626, 2768658, 2686109, 2606132, 2526405, 2445115, 2363620, 2284221, 2207034, 2131511, 2058983, 1990846, 1925949, 1862414, 1800477, 1741222, 1684281, 1629177, 1577142, 1529290, 1484709, 1442538, 1403929, 1369576, 1337293, 1304650, 1272161, 1241262, 1210944, 1179216, 1146416, 1114303, 1083117, 1052224, 1022426, 994930, 968996, 943130, 917771, 894409, 872902, 851921, 831283, 811667, 792812, 774061, 755973, 739399, 723750, 708082, 693041, 679793, 667894, 656192, 645055, 635725, 628113, 621103, 614385, 608172, 601778, 594257, 585820, 577022, 567337, 556217, 544703, 534213, 524493, 514615, 505163, 497512, 491611, 486401, 481855, 478715, 476706, 474921, 473590, 473718, 475273, 477429, 480206, 484141, 488703, 492652, 495745, 498601, 501252, 503299]
55792E03299J705J614M93j880l782m194m378n468o530o412n724n533n760o272
55778D51178p749j0085j1526j0915r297p981o508l907n21K771N720P767P461M266
55764D10674j84l939o803r365j1316j1998j1565j0433q523o045l998k917k176
55751C21412j351j031j432j639j161r50j786k995l747m408n446o280o254n653
55737B77279m788l398j831j493k889m526m902m398m101m000l643l367l628m040
55723B26275m251m762n787o368n729m489l505k594j366k18O22J835L673N046N180
55708B03562M961N342N553M376K170K51r53j842k565l239m350n734o125m974l730
55693A92703l896m812m819l739k625j885j246r49j325j607p24J044K534L454M374
$$ y = [503299, 505004, 506618, 507111, 505231, 501449, 497255, 492877, 487409, 480879, 474467, 468743, 463210, 457450, 451178, 443429, 433344, 421818, 410903, 401606, 393625, 387117, 383210, 382689, 385460, 391180, 398947, 406408, 410674, 410490, 406551, 399748, 390383, 379067, 367069, 355504, 345071, 336548, 330503, 326505, 323588, 321412, 320061, 319030, 317598, 315959, 314798, 313848, 312062, 309067, 305320, 300912, 295466, 289186, 282932, 277279, 272491, 269093, 267262, 265769, 262880, 258354, 253452, 249054, 244953, 240953, 237310, 233943, 230315, 226275, 222024, 217262, 211475, 205107, 199378, 194889, 191384, 188790, 187424, 187206, 187828, 189663, 193336, 198382, 203562, 208523, 213865, 219418, 223794, 225964, 226215, 225262, 223420, 220855, 217616, 213266, 207532, 201407, 196433, 192703, 188807, 183995, 179176, 175437, 172812, 170927, 169681, 168732, 167407, 165800, 165076, 166120, 168654, 172108, 176482]
55678A76482N281N566N166M605L948K843J330j87j495k321k140j121n81j396k598
55663A93382k660j568l91N04J430K076J715O29j2L53J261K136K628K318J139p2
55647B04868m32k36m66j369k358l046l422l374k900k578k904l496l736l766m053
55632A66732m457m595m621m747m486l447k328k045k343k376k157k318k800k980
55618A21032k763k431j790o36L65M56N2m7k40j435l076l498k300q56l07m24o93
55601A01409j134j650j786j548j502j693j465o38K6J6j86K5M94P28O03L14Qk61
55583I1760n48r70j353j143j57Q69J113P53M96L98N4l19jJ009J930K340K519K549
55565A01299K107J248N75L81L03%m54r72j540j852j575j012q45j142j299j058
$$ y = [176482, 181763, 187329, 192495, 197100, 201048, 203891, 205221, 205034, 203539, 201218, 199078, 197957, 197376, 195980, 193382, 190722, 189154, 188763, 189267, 190697, 192773, 194488, 195117, 195105, 195458, 196719, 198855, 201483, 203801, 204940, 204868, 204436, 204200, 203734, 202365, 200007, 196961, 193539, 190165, 187265, 184687, 181783, 178287, 174551, 170785, 166732, 162275, 157680, 153059, 148312, 143826, 140379, 138051, 136006, 133663, 131287, 129130, 126812, 124012, 121032, 118269, 115838, 114048, 113412, 113777, 114233, 114285, 114238, 113998, 112563, 109487, 105989, 103689, 102833, 102526, 102102, 101409, 100275, 98625, 96839, 95291, 93789, 92096, 90631, 89993, 90019, 90035, 89849, 89874, 90368, 91096, 91699, 92013, 92021, 91760, 91212, 90242, 88889, 87746, 87589, 88458, 89571, 90324, 90820, 91218, 91272, 90953, 90952, 91961, 93891, 96231, 98750, 101299, 103406, 104654, 105229, 105610, 105913, 105913, 105459, 104487, 102947, 101095, 99520, 98508, 97663, 96521, 95222, 94164]
55549I4164q07p54m92L19J351J954J768R14o3m54J6Q93J497J610J410J174J223
55532A05723J742K241J844O02k60n2K61m01j478j768j423j529k163k454k284k403
55516I6198k802k600j728j257j697k220k084j677j602j717j566j124o44l41l65
55501G2774n91n23m1P3q35k015k174j316n01rQ06J794J788M87q59j168p31j89
55483F6770M66J278J757J585J048L45n87j292r18M26J503J607J305J099N85m40
55467G6537j231j291j206j544j812j450q85p30p48n10l08m95o49k91K07K98K61
55450F4153N83R64P86K12r1L9K53L15J10n43j417j677q21N36J414J549J153L06
55432F7824p72j416j298j073j385j734j246j54N19N34O44J271J835J624P01k77
$$ y = [94164, 93357, 92603, 92111, 92430, 93781, 95735, 97503, 98417, 98354, 97900, 97916, 98809, 100306, 101916, 103326, 104500, 105723, 107465, 109706, 111550, 112152, 111892, 111840, 112101, 111700, 110222, 108454, 107031, 105502, 103339, 100885, 98601, 96198, 93396, 90796, 89068, 87811, 86114, 83894, 81810, 80133, 78531, 76814, 75248, 74124, 73480, 73139, 72774, 72183, 71660, 71619, 71692, 70857, 68842, 66668, 65352, 64851, 64842, 65648, 67442, 69230, 69717, 68858, 67690, 66959, 66770, 67236, 68514, 70271, 71856, 72904, 73249, 72662, 71370, 70452, 70878, 72381, 73988, 75293, 76392, 76977, 76537, 75306, 74015, 72809, 71265, 69453, 68003, 67118, 66388, 65640, 65130, 64822, 64327, 63678, 63387, 63594, 63892, 64153, 64736, 65700, 66486, 66698, 66607, 66646, 66899, 67214, 67324, 66781, 65364, 63687, 62866, 63402, 64816, 66365, 67518, 67824, 67052, 65636, 64338, 63265, 61880, 60146, 58900, 58746, 59265, 59799, 60443, 61714, 63549, 65173, 65874, 65597]
55416F5597o71k60O11J276J325Q95K80m23j039j192q37m90n04n38k17J22J2k65
55398F3682p8N46J007J067R93R32O86K11k28m58n33n12m28m57p23j060j200j154
55380F2293j050p96j92O19J174J167P59L78L07M19L39Nj33K74Q00O39l22j336
55362F5344j671j204k10P87J020J31j066j281m23K83J15j94J98R22J091N63j69
55345F4236p60j004o52J24N87L86O7J55L75L34K65L91K83l41q53o22q1O6J7L43
55325F3316Q14Q60P39J052J436R38m24j596j949j793j439p83N7N94O70O04N20
55308F3616K21k38m58k91J1K60M45M87L55L12N30O73M12N3L4J81J52J84N91Q56
55288F8386L13n72o73N9M66j05j019j438j261p04J17Q63R83M57o1j17J05K71L19
$$ y = [65597, 64926, 64666, 65277, 66553, 67878, 68773, 69053, 68630, 67591, 66399, 65562, 65072, 64568, 64030, 63813, 63935, 63947, 63682, 63604, 64150, 65157, 66224, 67217, 68149, 68835, 69046, 68818, 68360, 67827, 67315, 66887, 66430, 65707, 64647, 63447, 62293, 61243, 60447, 60255, 60874, 62048, 63215, 63974, 64352, 64659, 65078, 65417, 65422, 65289, 65563, 66363, 67002, 66680, 65344, 63673, 62469, 62259, 63046, 64066, 64197, 63131, 61850, 61427, 61710, 61825, 61631, 61829, 62751, 63842, 64405, 64236, 63476, 62472, 61820, 61944, 62531, 62917, 62984, 63139, 63514, 63848, 64113, 64504, 64787, 64446, 63593, 62971, 62890, 62956, 62973, 63316, 64130, 64990, 65729, 66781, 68217, 69155, 68731, 67135, 65186, 63393, 61954, 61171, 61228, 61822, 62492, 63096, 63616, 63837, 63599, 63141, 62850, 62861, 63121, 63566, 64053, 64408, 64720, 65250, 65923, 66335, 66388, 66422, 66603, 66755, 66939, 67530, 68386, 68699, 68127, 67454, 67513, 67979, 67874, 66855, 65417, 64156, 63452, 63569, 64432, 65415, 65872, 65811, 65694, 65799, 66070, 66389]
55269F6389K70K00M11R93J301O17o40j251p67M9M52M95M61L83L78O62R50O77J0
55250G2040k27J29K83k03o90o02l54n45r57j070q87o45k41L81P50M26k90p25o21
55231F5952j35N35J106J198P57K37jn5r1m2j0l35r20j101n54J83N42O34O58L24
55211F8882m19p96j62Q57J148O97N10J040J603J406M81n62j158j122p26n19o91
55194G0469p47j74P17J079O01k23p93q95n39J69Q76J155J000P83O97N48K17p5
55176G4865j16K6J94L77N11L61j59o48n42K09R81J094N20j58l81j33K21L50J32
55157G7704l59q37r08m59J47N42Q20J232J566J355O56L5k98o59j099j035k07O25
55139G8821N24l42r20o34N9M89O21Q18J080Q70k31j796k700k185o96N77R53P63
$$ y = [66389, 66659, 66859, 67270, 68263, 69564, 70181, 69541, 68290, 67523, 67572, 68024, 68519, 68980, 69363, 69741, 70403, 71353, 72030, 72040, 71813, 71942, 72225, 72022, 71332, 70730, 70376, 69831, 68874, 67804, 66917, 66272, 66031, 66412, 67162, 67588, 67298, 66573, 65952, 65817, 66352, 67458, 68656, 69413, 69650, 69649, 69594, 69503, 69461, 69451, 69116, 68196, 67095, 66541, 66724, 67266, 67900, 68558, 68882, 68463, 67667, 67505, 68362, 69510, 70207, 70717, 71757, 73360, 74766, 75247, 74685, 73527, 72405, 71679, 71160, 70469, 69722, 69548, 70265, 71344, 71945, 71722, 70929, 70034, 69495, 69664, 70540, 71695, 72695, 73478, 74175, 74723, 74940, 74865, 74749, 74775, 74969, 75346, 75857, 76218, 76059, 75411, 74869, 75078, 76059, 77153, 77673, 77515, 77134, 77001, 77222, 77572, 77704, 77345, 76508, 75600, 75141, 75288, 75830, 76650, 77882, 79448, 80803, 81459, 81494, 81196, 80537, 79438, 78403, 78196, 78821, 79345, 79003, 78083, 77449, 77508, 77997, 78618, 79436, 80516, 81386, 81155, 79359, 76659, 74474, 73778, 74355, 75308, 76071]
55121G6071N92N21K57k77q38j138j007m68K00O82R97J365J718J735J444J298J370
55104H4522J064O8q93q73N4R28J115P87K89k88q36j071q97o16n17n18l40M5L23
55085H2346J99j48j21N91J485J691J067M12M21Q19R01N38J42j28n16j035j246
55068H7418q67k74q8m50q86q98n62l64m62l63L41J167J208M66k7L09O81R5j071
55049H5373j488o52N19R38N13o9k79k05l41r83j744j758o76P81J557J414Q83L47
55031H4130j85m75m0J012J747J381J68r58j285o79N01J494J520N33n61p70r5O11
55013H8049P04L52N4r8l77q20r73m56M20R73J049J129J378J179J41r36r07O0O45
54994I1566K35l26j97J53j56q84r73q3J046J705J870J724J254N63l3m51r03j275
$$ y = [76071, 76663, 77184, 77441, 77164, 76326, 75188, 74181, 73713, 73913, 74595, 75592, 76957, 78675, 80410, 81854, 83152, 84522, 85586, 85654, 84761, 83888, 83942, 84870, 85985, 86772, 87061, 86773, 85937, 84866, 83969, 83353, 82836, 82318, 81978, 82023, 82346, 82545, 82397, 82276, 82867, 84352, 86043, 87110, 87522, 87943, 88762, 89663, 90201, 90343, 90215, 89699, 88664, 87418, 86551, 86277, 86189, 85739, 84853, 83955, 83393, 83029, 82567, 82204, 82545, 83712, 84920, 85386, 85359, 85668, 86349, 86444, 85373, 83885, 83233, 83752, 84690, 85203, 85134, 84855, 84650, 84309, 83326, 81582, 79824, 79148, 79929, 81486, 82900, 83783, 84130, 83945, 83470, 83430, 84442, 86189, 87570, 87738, 86780, 85495, 84816, 85317, 86811, 88331, 88864, 88303, 87533, 87438, 88049, 88753, 89105, 89159, 89061, 88684, 87864, 86891, 86435, 86855, 87828, 88877, 90006, 91384, 92563, 92704, 91768, 90861, 90921, 91566, 91801, 91475, 91278, 91431, 91275, 90391, 89418, 89335, 90381, 92086, 93956, 95680, 96934, 97497, 97464, 97013, 96110, 94835]
54976I4835r82J51J356J698J151M39M0j49k74k42j9J96K56J73n1m19o69m55J06
54957I7141M06J29k39k9O87J177R36K27k78j90K67N21K73j54k29K7L9m52r17p76
54937I8566k33N7q3l05m27o07q07p15k66K03M94Q09J354J990K487K775K783K449
54919A10524K092K323L263M181M380M153M357N063N190L776J312o59j341j602
54905A47012k716m492n422m788l686l437l735l399k416j936k344k643k035r91
54891A02972k09L71Q99R23K47l33j09L85K53k07OR13J526J456J440K098L139M040
54873A19810M733N266N466N252M771L977K613R30k86p48j205k428m026m841m414
54858A34870l472k969l057l212l073k824k776k852k706k259j792j508j266r03
$$ y = [94835, 93853, 94004, 95360, 97058, 98209, 98648, 98688, 98539, 98265, 98023, 98004, 98200, 98456, 98629, 98578, 98159, 97490, 97035, 97141, 97547, 97676, 97437, 97408, 98095, 99272, 100208, 100435, 100157, 99967, 100234, 100755, 101028, 100874, 100645, 100672, 100711, 100259, 99342, 98566, 98333, 98390, 98307, 98002, 97575, 96968, 96161, 95446, 95180, 95383, 95877, 96686, 98040, 100030, 102517, 105292, 108075, 110524, 112616, 114939, 118202, 122383, 126763, 130916, 135273, 140336, 145526, 149302, 150614, 149955, 148614, 147012, 144296, 139804, 134382, 129594, 125908, 122471, 118736, 115337, 112921, 110985, 108641, 105998, 103963, 102972, 102763, 103134, 104033, 104956, 105203, 104870, 104761, 105146, 105399, 105192, 105198, 106111, 107637, 109093, 110533, 112631, 115770, 119810, 124543, 129809, 135275, 140527, 145298, 149275, 151888, 152818, 152532, 151784, 150579, 148151, 144125, 139284, 134870, 131398, 128429, 125372, 122160, 119087, 116263, 113487, 110635, 107929, 105670, 103878, 102370, 101104, 100201]
54844A00201n46m12n12p74j143j414j264p15k65k29l01j06J84K59K74M55M76l3
54826I4135o37n57J08N05L88L71P21Q11K19m20k97L92P70M32k22n79l16M78J315
54807I7617J613J305R14P79N76j09r40j074k14R35J369P84j57n68l00m7l85r35
54789A01163r08k91J24n7k09L33J263J706J341O13N9j63j35N4L74Q48J431J800
54771A09346J549P73K53O98J949L164L740L865M134M838N630N891N407M608L991
54756A59836L450K501J079l48j483k542l714m752n314n337m893m042l146k781
54742A28514l016l137k547j571r45q56r55j047j155j159q98n09j96J70P63J279
54726A12735J355J255J519K052K268K139K297K973L596L735L735M010M355M318
$$ y = [100201, 99655, 99243, 98731, 97957, 96814, 95400, 94136, 93421, 93156, 92927, 92626, 92520, 92704, 92963, 93237, 93692, 94168, 94135, 93498, 92941, 93049, 93554, 93942, 94313, 95034, 95845, 96064, 95644, 95347, 95739, 96509, 96941, 96719, 96140, 95824, 96302, 97617, 99230, 100535, 101449, 102228, 102804, 102695, 101755, 100681, 100467, 101402, 102771, 103555, 103398, 102830, 102530, 102483, 102098, 101163, 100255, 99964, 100088, 100031, 99822, 100155, 101418, 103124, 104465, 105078, 105137, 104974, 104839, 104893, 105267, 106115, 107546, 109346, 110895, 111668, 111921, 112619, 114568, 117732, 121472, 125337, 129471, 134309, 139939, 145830, 151237, 155845, 159836, 163286, 165787, 166866, 166518, 165035, 162493, 158779, 154027, 148713, 143376, 138483, 134441, 131295, 128514, 125498, 122361, 119814, 118243, 117298, 116442, 115487, 114440, 113285, 112126, 111228, 110719, 110523, 110693, 111456, 112735, 114090, 115345, 116864, 118916, 121184, 123323, 125620, 128593, 132189, 135924, 139659, 143669, 148024, 152342]
54712A52342L776K656P68j579l331l808l663l909m349l968k766k012k372k816
54698A24969k161q40k92r66j880k075j625j072o21k79j40j93k00j25l29r43j404
54681A09824j120l72J4j95m49l58k30m04n67j92N73R78O01j58o06n34k93k57l89
54662A05866m48l81l75n17o42n72l30m2J74J38k94r05j109o26J24N57O48O92O57
54643A02615L54O8K91Q10Q32K25j28M07J233J390Q26K16j27l94n91m91k38l53
54625A06945r28j397j247o15Q1N77O97K45n54q36P1J655K557K067Q60J9k56m68
54607A09473o96m53L03P57L02o18j217j413j523j382o89J00J93k16j38N85R67
54590A04335N13M4K69N55J17n85o91m92q36j365q46P35J800J280Kn87j64N72J089
$$ y = [152342, 156118, 158774, 159542, 157963, 154632, 150824, 147161, 143252, 138903, 134935, 132169, 130157, 127785, 124969, 122808, 121968, 121676, 120710, 118830, 116755, 115130, 114058, 113437, 113158, 113018, 112825, 112625, 112500, 112171, 111228, 109824, 108704, 108332, 108346, 108151, 107702, 107344, 107114, 106710, 106143, 105951, 106524, 107502, 108103, 107945, 107339, 106805, 106512, 106255, 105866, 105418, 105037, 104662, 104145, 103503, 102931, 102601, 102559, 102733, 102871, 102577, 101672, 100563, 99937, 100061, 100618, 101266, 101958, 102615, 102969, 103037, 103328, 104138, 104970, 105195, 105067, 105474, 106707, 108097, 108923, 109139, 109012, 108618, 108027, 107536, 107298, 106945, 106017, 104620, 103373, 102758, 102839, 103416, 104113, 104358, 103804, 102968, 103039, 104694, 107251, 109318, 110178, 110197, 109941, 109473, 108777, 108324, 108627, 109384, 109686, 109068, 107851, 106438, 104915, 103533, 102844, 102944, 103137, 102921, 102783, 103368, 104335, 104848, 104892, 105161, 105716, 105833, 105248, 104557, 104065, 103229, 101864, 101018, 101753, 103553, 104833, 104835, 104248, 104084, 104656, 105745]
54571A05745J343J374J176P95K42n27j207j164j56J176J953J963J539R17J14o65
54555A14618j017p70j23O98J542K106J936R61j78o51l55n1m06j104j187l36O74
54538A16357J024Q59Q41R66O57r8m68PO57N68j82p60o93k50J28K06j14p21j182
54519A17802j109p07n06n94n27j19K64L12K55M04O17O33N72O74P36L30m78j088
54501A17471j070n61M8L91J48o96j490j387m14L98L45l1J28O35N91j12n52j12
54483A13730P14J152J088Q43N35K05J48N82J205J532J499J307R09J80n08m98L01
54466A24924J143J302R14O83J001J558J768J422Q08K99o2m09o78o21k07L29Q36
54449A35010J345J630J213J06r25j258j205j349j514j171n55n26j198j718j555
$$ y = [105745, 107088, 108462, 109638, 110433, 110675, 110148, 108941, 107777, 107621, 108797, 110750, 112713, 114252, 115169, 115283, 114618, 113601, 112831, 112708, 113406, 114948, 117054, 118990, 119951, 119773, 119122, 118767, 118716, 118310, 117206, 116019, 115683, 116357, 117381, 118240, 119081, 120047, 120704, 120606, 120138, 120145, 120802, 121370, 121188, 120428, 119735, 119485, 119613, 119819, 119705, 118984, 117802, 116693, 115986, 115480, 114886, 114359, 114240, 114504, 114816, 115071, 115475, 116092, 116725, 117297, 117971, 118707, 119037, 118559, 117471, 116401, 115840, 115888, 116279, 116427, 115731, 114241, 112854, 112440, 112838, 113183, 113152, 113280, 113915, 114506, 114394, 113842, 113730, 114444, 115596, 116684, 117527, 118062, 118267, 118415, 118997, 120202, 121734, 123233, 124540, 125449, 125629, 125121, 124623, 124924, 126067, 127369, 128283, 128966, 129967, 131525, 133293, 134715, 135523, 135822, 135760, 135351, 134673, 134052, 133845, 134174, 135010, 136355, 137985, 139198, 139304, 138379, 137121, 135916, 134567, 133053, 131882, 131327, 130801, 129603, 127885, 126330]
54434A26330j167r47l88Q84K023J825M95m82k66M27N81K88L50R78J559J544J009
54417A35043L36k51o36p08n09l28l71n06m64j75K35O62R39P85J62m26m21%R3l52
54397A33108o10K9J291K261K398J823R86L76L67Q09J018N36k53p37r44j246j421
54380A39791q93J31O41J81n51p78o35n50l70K65J060J375J169J036J295J654J763
54363A46584J604J317J100J316K221L411L932L225J785O11K58N11Q10O45k14j533
54347A67583k599k790k274j884k131k603k608k175j913j976j753q68R1K95j63
54332A42232m72l38k87o82j059q50k75Lj24j54J70M65K91k56p82j104j233j084
54314A34461n82r0j81p97j020j21J304J865J045k19q24q04q23r70p60j79J53r1
$$ y = [126330, 125163, 124216, 123828, 124712, 126735, 128560, 129055, 128573, 128307, 128734, 129315, 129603, 129953, 130931, 132490, 134034, 135043, 135379, 135128, 134492, 133784, 133275, 132947, 132576, 132070, 131606, 131431, 131666, 132328, 133267, 134052, 134214, 133788, 133367, 133367, 133460, 133108, 132498, 132527, 133818, 136079, 138477, 140300, 141286, 141662, 142029, 142838, 143856, 144392, 144139, 143402, 142458, 141212, 139791, 138898, 139029, 139670, 139851, 139300, 138522, 137887, 137337, 136967, 137232, 138292, 139667, 140836, 141872, 143167, 144821, 146584, 148188, 149505, 150605, 151921, 154142, 157553, 161485, 164710, 166495, 167106, 167364, 167875, 168685, 169330, 169116, 167583, 164984, 162194, 159920, 158036, 155905, 153302, 150694, 148519, 146606, 144630, 142877, 142009, 142100, 142395, 142232, 141760, 141422, 141135, 140453, 139394, 138544, 138269, 138272, 138148, 137994, 138164, 138629, 138920, 138664, 137882, 136778, 135545, 134461, 133879, 133789, 133608, 132811, 131791, 131670, 132974, 134839, 135884, 135665, 134841, 134037, 133214, 132244, 131484, 131305, 131458, 131367]
54296A31367m49l88N3N40Q86R40N15j31k28N65J495J525O87l3j9M32R01J449K032
54277A42139J985Q00q53j740j603j363j578j499l46J110J306Q3r71o78K71O00
54261A37663L20L13O73O82K56K44J030J896K166K107K144J968J107j27r49j025
54245A50468n58K09R66J111K95r23j571j401j027r71j139j286j427j566j476r73
54229A38731j76O46J281J574J436J001N41K17J9o5m2o7k62m54l76j13Nm4OJ16
54209A43974j96j026j648j350m52J15L6j39j7k9o40j429j513p82j43l28r59j106
54191A32368n28K19P00J121J670J940J438M49j78j18J25O5k7L39R62J144P25L77
54173A42791O86J320J527J126O27M07K81m2m72p52q53r27r89r76r48r74r68q22
$$ y = [131367, 130918, 130530, 130583, 131123, 132009, 132949, 133464, 133333, 133105, 133670, 135165, 136690, 137377, 137344, 137325, 137757, 138658, 140107, 142139, 144124, 144924, 144071, 142331, 140728, 139365, 137787, 136288, 135942, 137052, 138358, 138441, 137470, 136792, 137063, 137663, 137983, 138296, 138969, 139651, 139907, 140151, 141181, 143077, 145243, 147350, 149494, 151462, 152569, 152442, 151493, 150468, 149910, 150119, 151085, 152196, 152491, 151568, 149997, 148596, 147569, 146598, 145459, 144173, 142746, 141180, 139704, 138731, 138555, 139201, 140482, 142056, 143492, 144493, 145034, 145251, 145270, 145205, 145163, 145096, 144834, 144380, 144004, 143891, 143896, 143852, 143858, 143974, 143778, 142752, 141104, 139754, 139302, 139417, 139453, 139314, 139297, 139268, 138628, 137199, 135686, 134904, 134761, 134433, 133474, 132368, 131840, 132059, 132759, 133880, 135550, 137490, 138928, 139377, 139199, 139081, 139206, 139271, 139244, 139583, 140545, 141689, 142414, 142791, 143477, 144797, 146324, 147450, 148077, 148484, 148765, 148723, 148251, 147499, 146646, 145719, 144730, 143754, 142806, 141832, 140864, 140042]
54155A40042o63o65p44o51l54m9J48K79L62L48K65J88J41J41K92N32N51K27r0
54136A40300o9Rk88p32p46m02l08n48n16k5L36K39K23P05J198J123P35N56M92
54117A42282K65J97P01J365J442J012P39O97L83j92m07j03J59N8o8k8j34m75n35
54098A47358m8M84N88N96J099K057K953L461L512L049K229J670J936K902L891
54083A77737M353M078L035J483N4p33j040j416j946k170j876j549j802k546l027
54068A72635k549j121N87J740J804P84p80j991k050q70P51J781J829J294P27L64
54052A74935L18P35J570K409K913L246L737M293M505M314M227M676N456N986N978
54037B29298N736N761O189O612O480N640M497L606L204L141L147L020K664K094
$$ y = [140042, 139379, 138714, 137970, 137319, 136965, 136916, 137064, 137343, 137705, 138053, 138318, 138506, 138647, 138788, 139080, 139612, 140163, 140390, 140300, 140231, 140240, 139952, 139220, 138474, 138072, 137764, 137216, 136700, 136675, 137011, 137250, 137473, 138178, 139376, 140499, 141234, 141790, 142282, 142547, 142744, 143445, 144810, 146252, 147264, 148003, 148700, 149083, 148891, 148484, 148381, 148540, 148598, 148530, 148502, 148368, 147893, 147358, 147310, 147794, 148382, 148978, 150077, 152134, 155087, 158548, 162060, 165109, 167338, 169008, 170944, 173846, 177737, 182090, 186168, 189203, 190686, 190740, 190007, 188967, 187551, 185605, 183435, 181559, 180010, 178208, 175662, 172635, 170086, 168965, 169552, 171292, 173096, 173880, 173100, 171109, 169059, 168189, 168940, 170721, 172550, 173844, 174571, 174935, 175253, 175988, 177558, 179967, 182880, 186126, 189863, 194156, 198661, 202975, 207202, 211878, 217334, 223320, 229298, 235034, 240795, 246984, 253596, 260076, 265716, 270213, 273819, 277023, 280164, 283311, 286331, 288995, 291089]
54023B91089J449Q88M31K7k51k28K6Q0m62j419k224k688l283m427n726o349o099
54006B60834n609n395n231m829m617n132n917n761m276k498j627j642j698j447
53992B05155j311j577j879j814j547j486j605j531j175r71j304j906k051j286
53978A83712L1J047J197O42nl23l37k65k38k70l93n55n61k82J54N67J073J867
53960A87061K612K544J498N14Q12K325L700L877L170K675K993L910N025O264P750
53945B36730R360J0538J0589R298P168M828K373l16k679l593k702j070j4K80N12
53930B81302R71J290J261J183J278J407J544K039L030M052M560M651M912N679
53916C19159O681P415P701P763P901Q117Q183P981P575O898N672L884K016N36
$$ y = [291089, 292538, 293426, 293857, 293884, 293633, 293405, 293431, 293511, 293049, 291630, 289406, 286718, 283435, 279008, 273282, 266933, 260834, 255225, 249830, 244599, 239770, 235153, 230021, 224104, 218343, 214067, 211569, 209942, 208300, 206602, 205155, 203844, 202267, 200388, 198574, 197027, 195541, 193936, 192405, 191230, 190259, 188955, 187049, 184998, 183712, 183743, 184790, 185987, 186629, 186624, 186301, 185964, 185699, 185461, 185191, 184798, 184243, 183682, 183400, 183554, 184121, 185194, 187061, 189673, 192217, 193715, 194229, 195041, 197366, 201066, 204943, 208113, 210788, 213781, 217691, 222716, 228980, 236730, 246090, 256628, 267217, 276515, 283683, 288511, 290884, 290568, 287889, 284296, 281594, 280524, 280510, 280790, 281302, 282273, 283563, 284824, 286007, 287285, 288692, 290236, 292275, 295305, 299357, 303917, 308568, 313480, 319159, 325840, 333255, 340956, 348719, 356620, 364737, 372920, 380901, 388476, 395374, 401046, 404930, 406946, 407482]
53902D07482o53j882k965l330k931k518k832l838m945n708o149o489o857p205
53888C49180p495p850q419r017r126q480p451o603o021n418m761m331m197m068
53874B55943l764l491l521l793l930l574k736j981j979k720l369l269k747k536
53860B12533k685k626k129j500r45m09m5j23m78o81p28q45p31Q3J039Q41p50k339
53842A97482k600j683n22L23N84K1j007j487j122q96j469j890j009O20J523J437
53826A88305J243J180O78j01j46P50J515J457J186J373J677J570J339J529K012
53811B05567K340K468K639K883L197L689M183M115L420K958L522M777N821O356
53797B57935O657O682O061M910L926L561L566L421K837J760M19n55m89N84J727
$$ y = [407482, 406829, 404947, 401982, 398652, 395721, 393203, 390371, 386533, 381588, 375880, 369731, 363242, 356385, 349180, 341685, 333835, 325416, 316399, 307273, 298793, 291342, 284739, 278718, 273300, 268539, 264208, 260011, 255943, 252179, 248688, 245167, 241374, 237444, 233870, 231134, 229153, 227174, 224454, 221085, 217816, 215069, 212533, 209848, 207222, 205093, 203593, 202648, 202239, 202194, 202071, 201593, 200912, 200184, 199339, 198608, 198691, 199730, 200571, 199821, 197482, 194882, 193199, 192677, 193000, 193584, 193605, 192598, 191111, 189989, 189093, 187624, 185734, 184725, 185345, 186868, 188305, 189548, 190728, 191406, 191305, 191159, 191909, 193424, 194881, 196067, 197440, 199117, 200687, 202026, 203555, 205567, 207907, 210375, 213014, 215897, 219094, 222783, 226966, 231081, 234501, 237459, 240981, 245758, 251579, 257935, 264592, 271274, 277335, 282245, 286171, 289732, 293298, 296719, 299556, 301316, 301735, 301180, 300691, 301275, 303002]
53782C03002J887P97r82k655l750m255m468m734n214n806o239o294o022n718n571
53767B43978n412m979m337l742l123k181j093o19j136j964k207j864j603j616
53753B08102j439r36p52j412k463k880k133o65N20O22l18j312j291k11R34J276
53737A95642R46N25J84j86m35l63k65n27p92k82R07J623J156K63J75J042J972
53720B01585K277K006J443P91M00O32J264J572J262R22J224K019K581K562K289
53705B24829K208K381K551K523K374K375K644K880K611J867J386J861L059M037
53691B59586M210L821L301K568J341q1q89o35K12Q09P57K69k73o33o94m53j56
53674B73060j63n63j075j450j751k064k136j641p48k7K37L58P00J118J196R14
$$ y = [303002, 304889, 305686, 304704, 302049, 298299, 294044, 289576, 284842, 279628, 273822, 267583, 261289, 255267, 249549, 243978, 238566, 233587, 229250, 225508, 222385, 220204, 219111, 218492, 217356, 215392, 213185, 211321, 209718, 208102, 206663, 205727, 204975, 203563, 201100, 198220, 196087, 195422, 195942, 196564, 196246, 194934, 193643, 193432, 194366, 195642, 196588, 197113, 197297, 197111, 196676, 196313, 196048, 195521, 194729, 194447, 195354, 196977, 198133, 198396, 198571, 199613, 201585, 203862, 205868, 207311, 208102, 208502, 209134, 210398, 211970, 213232, 214154, 215378, 217397, 219978, 222540, 224829, 227037, 229418, 231969, 234492, 236866, 239241, 241885, 244765, 247376, 249243, 250629, 252490, 255549, 259586, 263796, 267617, 270918, 273486, 274827, 274746, 273857, 273222, 273434, 274243, 275000, 275269, 274996, 274363, 273669, 273216, 273060, 272897, 272334, 271259, 269809, 268058, 265994, 263858, 262217, 261469, 261442, 261679, 262037, 262737, 263855, 265051, 265965]
53658B65965O42N07J41o73j384j202k13N40L54k27j87N29J066R85Q13J086J524
53641B70266J569J274J062J057J066J060J107J049P47M81O37J166J739K271K759
53626B89310K885K414J835J905K583L128L224L282L537L704L677L816M170M249
53612C33719L860L492L481L507L401L642M419M875M082K394J029O43R66J539K056
53597C77105K179J714J037P42R27J200J264J077O62J68q9j13m49j418k427k668
53581C80911k239j887j855j771j619j831k324k310j440m33j75o50j182j349j254
53566C58592j152j144j167j077q13n31m63o05o90n06j16J90J01m10q58o35K31
53549C48947R79J127J101J418J713J377P97J006K151L255L674L869M366M775M512
$$ y = [265965, 266607, 267114, 267255, 266582, 265198, 263996, 263783, 264323, 264677, 264450, 264263, 264792, 265858, 266843, 267656, 268742, 270266, 271835, 273109, 274171, 275228, 276294, 277354, 278461, 279510, 280257, 280738, 281375, 282541, 284280, 286551, 289310, 292195, 294609, 296444, 298349, 300932, 304060, 307284, 310566, 314103, 317807, 321484, 325300, 329470, 333719, 337579, 341071, 344552, 348059, 351460, 355102, 359521, 364396, 368478, 370872, 371901, 372544, 373510, 375049, 377105, 379284, 380998, 382035, 382777, 383704, 384904, 386168, 387245, 387907, 388075, 387986, 387873, 387424, 386006, 383579, 380911, 378672, 376785, 374930, 373159, 371540, 369709, 367385, 365075, 363635, 363202, 363027, 362377, 361195, 359846, 358592, 357440, 356296, 355129, 354052, 353239, 352708, 352245, 351640, 350950, 350444, 350328, 350518, 350619, 350209, 349351, 348716, 348947, 349926, 351053, 352154, 353572, 355285, 356662, 357459, 358465, 360616, 363871, 367545, 371414, 375780, 380555, 385067]
53534C85067L944M144N635P792R448R918R533R305R845J0729J1155J1077J1219
53521D98811J1968J2876J3370J3453J3501J3861J4804J6372J8038J9095J9546
53510F65695K0133K1202K2194K2611K2804K3285K3850K4015K3872K3818K3702
53499I17181K2999K1762K0700K0252K0087J9689J9015J8408J8072J7879J7607
53488A133651J7295J7273J7695J8187J8234J7843J7478J7276J6886J6206J5697
53477A323721J5597J5295J4066J2057R959Q007N892L479J021j327l660n990q202
53464A389915j0331j2384j3898j4284j3737j3344j3904j5013j5676j5617j5590
53453A236137j6422j8076j9721k0602k0608k0125j9513j8967j8643j8578j8415
$$ y = [385067, 389011, 393155, 398790, 406582, 416030, 425948, 435481, 444786, 454631, 465360, 476515, 487592, 498811, 510779, 523655, 537025, 550478, 563979, 577840, 592644, 609016, 627054, 646149, 665695, 685828, 707030, 729224, 751835, 774639, 797924, 821774, 845789, 869661, 893479, 917181, 940180, 961942, 982642, 1002894, 1022981, 1042670, 1061685, 1080093, 1098165, 1116044, 1133651, 1150946, 1168219, 1185914, 1204101, 1222335, 1240178, 1257656, 1274932, 1291818, 1308024, 1323721, 1339318, 1354613, 1368679, 1380736, 1390695, 1398702, 1404594, 1408073, 1409094, 1407767, 1404107, 1398117, 1389915, 1379584, 1367200, 1353302, 1339018, 1325281, 1311937, 1298033, 1283020, 1267344, 1251727, 1236137, 1219715, 1201639, 1181918, 1161316, 1140708, 1120583, 1101070, 1082103, 1063460, 1044882, 1026467]
53442A026467j7534j5718j3526j1765j0614r506p872n811l971k849k269j594m20
53429I23018R42J871K204K469L290M828O777Q767J0559J2092J3455J4725J5828
53416A020825J6667J7457J8687K0605K2919K5107K6883K8296K9571L0931L2449
53405A290397L4001L5480L7031L8864M0872M2696M4170M5409M6501M7470M8605
53394A751496N0313N2422N4088N4678N4411N3848N3122N2009N0559M9178M8166
53383B324290M7355M6246M4429M1961L9296L6632L3469K9227K4221J9422J5236
53372B701784J1201O972K826j235n991j1928j8350k4283k9775l5387m0823m5045
53360B509966m7631m9163n0222n0742n0451m9405m7939m6478m5408m4671m3680
$$ y = [1026467, 1008933, 993215, 979689, 967924, 957310, 947804, 939932, 934121, 930150, 927301, 925032, 923438, 923018, 923960, 925831, 928035, 930504, 933794, 938622, 945399, 954166, 964725, 976817, 990272, 1004997, 1020825, 1037492, 1054949, 1073636, 1094241, 1117160, 1142267, 1169150, 1197446, 1227017, 1257948, 1290397, 1324398, 1359878, 1396909, 1435773, 1476645, 1519341, 1563511, 1608920, 1655421, 1702891, 1751496, 1801809, 1854231, 1908319, 1962997, 2017408, 2071256, 2124378, 2176387, 2226946, 2276124, 2324290, 2371645, 2417891, 2462320, 2504281, 2543577, 2580209, 2613678, 2642905, 2667126, 2686548, 2701784, 2712985, 2719957, 2722783, 2721548, 2715557, 2703629, 2685279, 2660996, 2631221, 2595834, 2555011, 2509966, 2462335, 2413172, 2362950, 2312208, 2261757, 2212352, 2164413, 2117935, 2072527, 2027856, 1984176]
53349A984176m2057m0282l9115l8632l8449l8581l9240l9918l9669l8366l6760
53338A553107l5242l3465l1410k9683k8336k6497k3869k1553k0485j9901j8525
53327A264141j6611j5587j5875j6373j6171j5566j5065j4469j3497j2529j1990
53316A100408j1558j0609r059p221n172k919r45J44N00R40J951L346M916O733
53302A071455Q680J0359J1779J3466J5490J7055J7714J8312J9923K2183K3761
53291A250177K4262K4646K5602K6573K6715K5962K4707K3084K1199J9409J7835
53280A510171J5979J3443J0589P952N416K529o29l599o253q742j0958j2735j4402
53267A508761j6472j8809k0768k2208k3581k4910k5431k4682k3447k3098k4145
$$ y = [1984176, 1942119, 1901837, 1862722, 1824090, 1785641, 1747060, 1707820, 1667902, 1628233, 1589867, 1553107, 1517865, 1484400, 1452990, 1423307, 1394971, 1368474, 1344605, 1323052, 1302567, 1282666, 1264141, 1247530, 1231943, 1216068, 1199695, 1183524, 1167958, 1152893, 1138424, 1124927, 1112398, 1100408, 1088850, 1078241, 1069182, 1061961, 1056789, 1053870, 1052925, 1053069, 1053569, 1054509, 1056460, 1059806, 1064722, 1071455, 1080135, 1090494, 1102273, 1115739, 1131229, 1148284, 1165998, 1184310, 1204233, 1226416, 1250177, 1274439, 1299085, 1324687, 1351260, 1377975, 1403937, 1428644, 1451728, 1472927, 1492336, 1510171, 1526150, 1539593, 1550182, 1558134, 1563550, 1566079, 1565450, 1561851, 1555598, 1546856, 1535898, 1523163, 1508761, 1492289, 1473480, 1452712, 1430504, 1406923, 1382013, 1356582, 1331900, 1308453, 1285355, 1261210]
53256A261210k5793k6816k6668k5786k5041k4945k5289k5457k4993k3929k2761
53245I83732k2195k2633k3749k4689k4854k4358k3635k2926k2298k1791k1228
53234G29376k0156j8366j6252j4338j2738j1379j0461j0131r997r501q706q221
53222E79130q415r124j0115j1339j2687j3866j4580j4639j3988j2910j1948j1355
53210D34164j0819j0025r121q299p376o363n943o591p532p500o412n419n288n699
53196C31777o161o641p016o809n891m791l964l381l038l171l560l376k278j118
53182B70582r56j752k575k811k637k521k658k853k745k204j633j610k111k474
53168B39042k191j456p53k97j6J76K94K29j91p99r54k89N15M72k96o53j24M83
$$ y = [1261210, 1235417, 1208601, 1181933, 1156147, 1131106, 1106161, 1080872, 1055415, 1030422, 1006493, 983732, 961537, 938904, 915155, 890466, 865612, 841254, 817619, 794693, 772395, 750604, 729376, 709220, 690854, 674602, 660264, 647526, 636147, 625686, 615555, 605558, 596057, 587351, 579130, 570715, 561591, 551476, 540137, 527450, 513584, 499004, 484365, 470377, 457467, 445519, 434164, 423345, 413320, 404199, 395900, 388524, 382161, 376218, 369627, 362095, 354595, 348183, 342764, 337476, 331777, 325616, 318975, 311959, 305150, 299259, 294468, 290504, 287123, 284085, 280914, 277354, 273978, 271700, 270582, 269626, 267874, 265299, 262488, 259851, 257330, 254672, 251819, 249074, 246870, 245237, 243627, 241516, 239042, 236851, 235395, 234642, 234345, 234329, 234505, 234799, 235028, 234837, 234038, 233084, 232795, 233310, 233782, 233486, 232833, 232709, 233192]
53150B33192M21O7P6K83J71j79l31k85l13m08m32n65r45j163p19J68Q09R20Q05
53131B31572P76Q34Q36N87n6q81j246o73O09J944K829L050K602J837J315J201
53115B47136J083P01M01M84N57J21o13j082j220j362j535j563j635k125k858l190
53099B33300k775j840p82PJ06n85j434j582q92M1O76Q96O94J38l32k22L12N65
53081B26291K22k86n27n80o31n01j1N38O09J01n11p26m96k12j88l19k90q8o9m49
53061B21877r63j219j107p11q1O06R12N44j61m60J10J299K269K157R35k12Q7J683
53043B27565K815K160M31p47r43j025j488j837j656j290j146j066q08n23l47N
53027B20100P73J529J512N30o85j117n05L30L64l88q66l66N61J034J105J344J618
$$ y = [233192, 233613, 233680, 233756, 234039, 234210, 234031, 233700, 233415, 233102, 232694, 232262, 231697, 230752, 229589, 228870, 229038, 229847, 230767, 231572, 232348, 233182, 234018, 234605, 234549, 233668, 232422, 231749, 232358, 234302, 237131, 240181, 242783, 244620, 245935, 247136, 248219, 248920, 249321, 249805, 250362, 250483, 249870, 248788, 247568, 246206, 244671, 243108, 241473, 239348, 236490, 233300, 230525, 228685, 227903, 227910, 228016, 227431, 225997, 224415, 223523, 223564, 224240, 225136, 225830, 225968, 225636, 225414, 225726, 226291, 226513, 226227, 225700, 225120, 224489, 223988, 223977, 224515, 225124, 225225, 224714, 223988, 223492, 223280, 223092, 222773, 222483, 222395, 222326, 221877, 220914, 219695, 218588, 217877, 217796, 218402, 219314, 219858, 219697, 219237, 219347, 220646, 222915, 225072, 226007, 225795, 225882, 227565, 230380, 232540, 232971, 232224, 231281, 230256, 228768, 226931, 225275, 223985, 222839, 221773, 220965, 220442, 220095, 220100, 220873, 222402, 223914, 224444, 223759, 222642, 222137, 222467, 222831, 222443, 221577, 221211, 221772, 222806, 223911, 225255, 226873]
53010B26873J278M15r5L8R3l94q41n74J35N77O10N43M74L17J81J60L7l16n27j67
52990B28817N33R20Q04N97O34P74O99L25j82m68j22Q98J950K191J584J017J194
52973B42165J744J883J690J974K815L071J891J16o63j40N42N92M36N53N47R6j56
52956B59156M04J118R19l5p42j077j824l022l582k984k137j970k134j796j021
52941B39273m96l65k20L5qn68j321j723j413m13P61J322Q95q1q53j101j012q27
52923B31885o13l59n1K66L61o4r36j644j564o82M73J320J507R84O5o63q04n02
52905B28979k32k90n95q59p85k72M05O65J60p96j401j060R8J262J557P96k80o90
52887B26662j78N96Q85O59N25R73J808K271J762N60k83%J009J603J215L77p9m
$$ y = [226873, 228151, 228566, 228471, 228509, 228602, 228208, 227367, 226793, 226928, 227505, 228115, 228658, 229132, 229449, 229630, 229790, 229827, 229511, 228984, 228817, 229350, 230270, 231074, 231671, 232305, 233079, 233778, 234103, 233921, 233453, 233331, 234229, 236179, 238370, 239954, 240971, 242165, 243909, 245792, 247482, 249456, 252271, 255342, 257233, 257349, 256686, 256546, 257088, 257680, 258116, 258669, 259216, 259312, 259156, 259560, 260678, 261597, 261562, 260820, 259743, 257919, 254897, 251315, 248331, 246194, 244224, 242090, 240294, 239273, 238777, 238412, 238192, 238227, 238219, 237651, 236330, 234607, 233194, 232781, 233542, 234864, 235759, 235678, 234825, 233724, 232712, 231885, 231272, 230913, 230862, 231128, 231489, 231425, 230489, 228845, 227281, 226599, 227072, 228392, 229899, 230883, 230948, 230285, 229481, 228979, 228747, 228457, 227862, 227003, 226218, 225946, 226351, 227016, 227176, 226380, 224979, 223919, 224017, 225279, 226836, 227632, 227352, 226662, 226484, 227080, 227965, 228624, 229149, 230122, 231930, 234201, 235963, 236523, 236240, 236240, 237249, 238852, 240067, 240444, 240365, 240361]
52869B40361J35M9RM42J235J676J211K80j0P61J725J797J040L84L07N01O48P05
52851B53256L66q55k709m137m491m203l897l538k943k495k600k840k435j359m17
52836B14703k29o49j145j325j102o60l22k54k81r6L84J000J489J579J155M06l17
52819B14336q41j139j058n08Q4O8m93p60k32N76R21P64N29L92L74O95J466K201
52801B17375K199J323P5r72j497j482j304j485k023k185j395m0R59J162Q19L43
52785B11872L7J28N98J093J293J255J119P73R6p13j329j549j142j6J199J379K49
52768B16342j038j293p26l12l44m58o65j210j665j259p5R42J208R61N71K47L49
52751B11575J026J616J308M64K77R85J545J288Q12P96J012J115J423K203K936
$$ y = [240361, 240496, 240545, 240554, 240996, 242231, 243907, 245118, 245398, 245388, 246149, 247874, 249671, 250711, 251095, 251402, 251903, 252551, 253256, 253622, 252767, 250058, 245921, 241430, 237227, 233330, 229792, 226849, 224354, 221754, 218914, 216479, 215120, 214703, 214474, 213825, 212680, 211355, 210253, 209593, 209271, 209017, 208736, 208640, 209024, 210024, 211513, 213092, 214247, 214653, 214336, 213495, 212356, 211298, 210790, 210874, 210942, 210449, 209689, 209457, 210033, 210954, 211718, 212247, 212639, 213013, 213708, 215174, 217375, 219574, 220897, 220972, 220000, 218503, 217021, 215717, 214232, 212209, 210024, 208629, 208589, 209548, 210710, 211529, 211872, 211909, 212037, 212635, 213728, 215021, 216276, 217395, 218168, 218264, 217551, 216222, 214673, 213531, 213515, 214714, 216093, 216342, 215304, 214011, 213285, 212973, 212629, 212171, 211506, 210296, 208631, 207372, 207297, 208239, 209447, 210408, 210979, 211226, 211575, 212601, 214217, 215525, 215989, 216266, 217251, 218796, 220084, 220896, 221692, 222704, 223819, 225242, 227445, 230381]
52736B30381L083K919K898K717J889P36R4J92N05N83M72M07M60M91K23l81q04
52719B46865m69K76K93q30k145k620k429k269k056j289k60J22l07p49o35l22l66
52702B30810p28q71l34Q57J996K076Q61n79r39k23M00J80m81r15j021r45o55k38
52684B29251n3j70j13M36J018R42J59q40j649k065j871j097l26j59l99k56N47
52667B23355J369J475Q72J27k46m7O39J363J502Q95K12K60R88J557J442J028R92
52650B37783J472K086K457K372J699N63n48j232j592j916k038j562o86j65l39
52635B38354p08p24n01l53j72K47O35N95L50N32J260K041K509K690K500J629J72
52618B51056j171j883k168k375k373j907j260r40q64m78L43J042J186R92Q94R20
$$ y = [230381, 233464, 236383, 239281, 241998, 243887, 244623, 244717, 244909, 245414, 245997, 246469, 246876, 247336, 247827, 248050, 247669, 246865, 246396, 246672, 246965, 246135, 243990, 241370, 238941, 236672, 234616, 233327, 233067, 233189, 232882, 232133, 231498, 231176, 230810, 230082, 229211, 228877, 229734, 231730, 233806, 234667, 234088, 233149, 232926, 233326, 233506, 233025, 232110, 231089, 230144, 229489, 229251, 229198, 229028, 228915, 229351, 230369, 231311, 231470, 230630, 228981, 226916, 225045, 223948, 223622, 223463, 223064, 222808, 223355, 224724, 226199, 227071, 227198, 226952, 226905, 227544, 228907, 230409, 231304, 231516, 231776, 232764, 234321, 235763, 236791, 237783, 239255, 241341, 243798, 246170, 247869, 248432, 247884, 246652, 245060, 243144, 241106, 239544, 238858, 238693, 238354, 237646, 236922, 236421, 236068, 235896, 236143, 236778, 237373, 237723, 238255, 239515, 241556, 244065, 246755, 249255, 250884, 251056, 249885, 248002, 245834, 243459, 241086, 239179, 237919, 236979, 236115, 235637, 235980, 237022, 238208, 239200, 240094, 241014]
52602B41014Q25N78L42J70N4J44N41R05O87q2o16k84N64J004P09K54K68O47R10
52583B48634R86J208J602J693J148L16k27l68l82k99J51Q88J279Q62J1n55p15
52566B56232r63j531j957j727j053o93j069j787k096j697j025o93p22n41J70R09
52550B39757R54L24k32k33P9L63O70J035J112O94K01J24K54P9k82k60J12J62k75
52531B44638l87M53J654K089J467M89j55l65l12o3K53L56J77Q2M66J144J418R01
52513B54305R6l1R08K290L194L374L239L092K711J833O99q3j58K18L96j55j383
52496B74545k685l496l797l920l910l502k670j819j220o55Q5P51J004R30Q49P66
52480B51256M98J89K27N94Q10O01K75K49N51R55J359J781K114K118J680R88M61
$$ y = [241014, 241839, 242417, 242759, 242929, 242983, 243127, 243668, 244573, 245260, 245178, 244562, 244278, 244842, 245846, 246555, 246809, 247077, 247724, 248634, 249620, 250828, 252430, 254123, 255271, 255587, 255360, 254992, 254610, 254311, 254462, 255350, 256629, 257491, 257502, 256947, 256232, 255269, 253738, 251781, 250054, 249001, 248308, 247239, 245452, 243356, 241659, 240634, 239941, 239219, 238678, 238848, 239757, 240711, 241035, 240803, 240570, 240649, 241012, 241682, 242717, 243829, 244523, 244724, 244848, 245102, 245181, 244899, 244639, 244751, 244913, 244638, 244251, 244704, 246358, 248447, 249914, 250403, 250248, 249883, 249571, 249508, 249761, 250117, 250294, 250376, 250842, 251986, 253404, 254305, 254401, 254370, 255278, 257568, 260762, 264136, 267375, 270467, 273178, 275011, 275710, 275627, 275469, 275687, 276083, 275928, 274545, 271860, 268364, 264567, 260647, 256737, 253235, 250565, 248746, 247526, 246871, 246956, 247707, 248711, 249641, 250490, 251256, 251754, 251943, 252170, 252764, 253574, 254175, 254450, 254699, 255250, 256205, 257564, 259345, 261459, 263577, 265257, 266245, 266706]
52463B66706M81J077J896K519K759K588J988J154O43Q08J084L63j575l496m012
52448B74983l162k191j949k073j882j453j401j880k301k032j120j94J76l7l90
52433B53094m00L7O26R79R21N50J08k05l38m10n40o04l22K75O84M78j1K2P61J425
52413B57130J311Q59J155K500M024M854N084N335N867O550P349Q227Q700Q083
52399C27028O296L986J722n00k782m774n919o054n492m704m061l652l164k208
52385B95722j012m47r75j855j957j131j57N20J224K111K649K503K269K722L716
52370C05902M480M737M854N041N079M822M382L687K479R22k86o64m87k78k20k34
52354C44216k82k36K02J013J624J544J082R34J277J678J861K010K306K704L243
$$ y = [266706, 267187, 268264, 270160, 272679, 275438, 278026, 280014, 281168, 281811, 282619, 283703, 284066, 282491, 278995, 274983, 271821, 269630, 267681, 265608, 263726, 262273, 260872, 258992, 256691, 254659, 253539, 253345, 253521, 253484, 253094, 252694, 252731, 253357, 254336, 255257, 255807, 255915, 255710, 255372, 254962, 254422, 253818, 253496, 253771, 254455, 254933, 254922, 254944, 255705, 257130, 258441, 259300, 260455, 262955, 266979, 271833, 276917, 282252, 288119, 294669, 302018, 310245, 318945, 327028, 333324, 337310, 339032, 338532, 335750, 330976, 325057, 319003, 313511, 308807, 304746, 301094, 297930, 295722, 294710, 294263, 293288, 291433, 289476, 288345, 288188, 288708, 289932, 292043, 294692, 297195, 299464, 302186, 305902, 310382, 315119, 319973, 325014, 330093, 334915, 339297, 342984, 345463, 346385, 346099, 345435, 344948, 344670, 344450, 344216, 343934, 343698, 343900, 344913, 346537, 348081, 349163, 350097, 351374, 353052, 354913, 356923, 359229, 361933, 365176]
52339C65176M089N029N470N300N369O584Q752J0769J1915J2413J2742J2978J3124
52326D79710J3594J4833J6631J8308J9553K0655K1799K2558K2394K1374K0094
52315F91503J9039J8321J7927J7832J7793J7425J6652J5824J5202J4550J3522
52304H75590J2305J1493J1236J0937J0015Q769Q015P835P229N349K726O65m51
52291I71713j547l358n352o617p227p895q564q340o908n169m157l895l672k856
52277H96156j126J588M817P569R195J0056J0919J2005J3018J3866J4718J5420
52265A008201J5533J5044J4536J4434J4431J3939J2851J1655J0888J0666J0711
52254A152889J0715J0576J0304R755Q743P349N963M752L411J621m05k166l500
$$ y = [365176, 369265, 374294, 379764, 385064, 390433, 397017, 405769, 416538, 428453, 440866, 453608, 466586, 479710, 493304, 508137, 524768, 543076, 562629, 583284, 605083, 627641, 650035, 671409, 691503, 710542, 728863, 746790, 764622, 782415, 799840, 816492, 832316, 847518, 862068, 875590, 887895, 899388, 910624, 921561, 931576, 940345, 948360, 956195, 963424, 968773, 971499, 972164, 971713, 970166, 966808, 961456, 954839, 947612, 939717, 931153, 922813, 915905, 910736, 906579, 902684, 899012, 896156, 895030, 896618, 901435, 909004, 918199, 928255, 939174, 951179, 964197, 978063, 992781, 1008201, 1023734, 1038778, 1053314, 1067748, 1082179, 1096118, 1108969, 1120624, 1131512, 1142178, 1152889, 1163604, 1174180, 1184484, 1194239, 1202982, 1210331, 1216294, 1221046, 1224457, 1226078, 1225673, 1223507, 1220007]
52241A220007m673n865o931p705q243q637q773q433p603o570n650m910m247l684
52227A128083l428l391l014j864l44P66J408K232L423M241M127L647L807M848
52213A144541O245P472Q238Q357Q011P854Q273Q768Q684Q192P907P818P390O587
52199A254337N891N427M900M474M778N826O727O812O370N976N629N043M260L568
52185A330018L105K776K260J050j137l835o120p546q440r242r977j0493j0725
52172A271694j0598j0134r641r306q639p009m796l193k701k526j822p09L46J301
52158A202267K170K566K279J762J452J117M17l59p51q73j027j011n29N2P8m25
52142A209185p91o65l46k47m89r55j382j476j178o26K81J932M253O504Q212R886
$$ y = [1220007, 1215334, 1209469, 1202538, 1194833, 1186590, 1177953, 1169180, 1160747, 1153144, 1146574, 1140924, 1136014, 1131767, 1128083, 1124655, 1121264, 1118250, 1116386, 1116042, 1116808, 1118216, 1120448, 1123871, 1128112, 1132239, 1135886, 1139693, 1144541, 1150786, 1158258, 1166496, 1174853, 1182864, 1190718, 1198991, 1207759, 1216443, 1224635, 1232542, 1240360, 1247750, 1254337, 1260228, 1265655, 1270555, 1275029, 1279807, 1285633, 1292360, 1299172, 1305542, 1311518, 1317147, 1322190, 1326450, 1330018, 1333123, 1335899, 1338159, 1339209, 1338072, 1334237, 1328117, 1320571, 1312131, 1302889, 1292912, 1282419, 1271694, 1261096, 1250962, 1241321, 1232015, 1223376, 1216367, 1211571, 1208378, 1205677, 1203151, 1201329, 1200620, 1200966, 1202267, 1204437, 1207003, 1209282, 1211044, 1212496, 1213613, 1214030, 1213671, 1212920, 1212047, 1211020, 1210009, 1209480, 1209532, 1209610, 1209185, 1208394, 1207729, 1207383, 1207136, 1206647, 1205692, 1204310, 1202834, 1201656, 1201030, 1201311, 1203243, 1207496, 1214000, 1222212, 1232098]
52126A232098J2201J4938J7367J9333K1208K3090K4778K6305K7814K8993K9332
52115A477457K8838K7836K6207K3636K0583J8171J6876J5997J4568J2302R500
52104A691971O616M151K463J442O77k0o90j644l191m820n466m951m589n776q330
52089A667843j0795j2188j2864j3610j4425j4611j3836j2560j1209r391o486k888
52077A532980Q0J715K749M242O270Q235R955J1696J3425J4833J5898J6753J7132
52064A655963J6635J5537J4570J3875J2876J1283R529Q007O499M659K558M75j453
52051A771013l124m477n763p433r572j1796j3812j5746j7734j9625k1242k2605
52039A618084k3692k4283k4187k3411k2159k0809j9778j8970j7599j5156j2427
$$ y = [1232098, 1244299, 1259237, 1276604, 1295937, 1317145, 1340235, 1365013, 1391318, 1419132, 1448125, 1477457, 1506295, 1534131, 1560338, 1583974, 1604557, 1622728, 1639604, 1655601, 1670169, 1682471, 1691971, 1698587, 1702738, 1705201, 1706643, 1707320, 1707300, 1706610, 1704966, 1701775, 1696955, 1691489, 1686538, 1681949, 1676173, 1667843, 1657048, 1644860, 1631996, 1618386, 1603961, 1589350, 1575514, 1562954, 1551745, 1542354, 1535868, 1532980, 1533060, 1534775, 1537524, 1541766, 1548036, 1556271, 1566226, 1577922, 1591347, 1606180, 1622078, 1638831, 1655963, 1672598, 1688135, 1702705, 1716580, 1729456, 1740739, 1750268, 1758275, 1764774, 1769433, 1771991, 1772466, 1771013, 1767889, 1763412, 1757649, 1750216, 1740644, 1728848, 1715036, 1699290, 1681556, 1661931, 1640689, 1618084, 1594392, 1570109, 1545922, 1522511, 1500352, 1479543, 1459765, 1440795, 1423196, 1408040, 1395613]
52028A395613j0725j0109r265p432n515m796n324o290p315q521r730j0497j0869
52015A289225j1334j1999j2389j2273j2088j2364j3090j3884j4618j5576j7075
$$ y = [1395613, 1384888, 1374779, 1365514, 1358082, 1352567, 1347771, 1342447, 1336157, 1328842, 1320321, 1310591, 1300094, 1289225, 1277891, 1265892, 1253503, 1241230, 1229142, 1216778, 1203688, 1189804, 1175186, 1159610, 1142535]
$$ [...]
##END NTUPLES=NMR SPECTRUM
##END=
