##TITLE=AC1605_TANAH13335_8316771_wnv8Eb7zom
##JCAMPDX= 6.0         $$ Bruker NMR JCAMP-DX V2.0
##DATA TYPE= NMR SPECTRUM
##DATA CLASS= NTUPLES
##ORIGIN= BRUKER
##OWNER= Administrator
$$ 1.72 TOPSPIN		Version 2.1
$$ 2013-11-13 22:37:43.318 -0800  Administrator@X
$$ Compression mode = diff/dup
##.OBSERVE FREQUENCY= 400.02188249412
##.OBSERVE NUCLEUS= ^1H
##.ACQUISITION MODE= SIMULTANEOUS (DQD)
##.ACQUISITION SCHEME= undefined
##.AVERAGES= 64
##.DIGITISER RES= 22
##SPECTROMETER/DATA SYSTEM= spect
##.PULSE SEQUENCE= noesygpps1d.comp
##.SOLVENT NAME= COFFEE_meoh
##.SHIFT REFERENCE= INTERNAL, COFFEE_meoh, 1, 14.96079
##AUDIT TRAIL= $$ (NUMBER, WHEN, WHO, WHERE, PROCESS, VERSION, WHAT)
$$ ##TITLE= Audit trail, TOPSPIN		Version 2.1
$$ ##JCAMPDX= 5.01
$$ ##ORIGIN= Bruker BioSpin GmbH
$$ ##OWNER= Administrator
$$ $$ E:\/data/COFFEE/nmr/AC1605_TANAH13335_8316771_wnv8Eb7zom/12/pdata/1/auditp.txt
$$ ##AUDIT TRAIL=  $$ (NUMBER, WHEN, WHO, WHERE, PROCESS, VERSION, WHAT)
(   1,<2013-11-13 22:37:37.897 -0800>,<Administrator>,<X>,<go>,<TOPSPIN 2.1>,
      <created by zg
	started at 2013-11-13 22:26:07.506 -0800,
	POWCHK enabled, PULCHK disabled,
       configuration hash MD5:
       C8 4E 4E 5D D3 5C D8 9E 9F 52 82 E0 59 8A DE 15
       data hash MD5: 64K
       0C 57 20 65 A0 C5 F2 EA 3D 33 03 FE 9D 2D EF 93>)
(   2,<2013-11-13 22:37:40.943 -0800>,<Administrator>,<X>,<proc1d>,<TOPSPIN 2.1>,
      <Start of raw data processing
       efp LB = 0.3 FT_mod = 6 PKNL = 1 PHC0 = 0 PHC1 = 0 SI = 128K 
       data hash MD5: 128K
       14 6A DB 79 2A 9C 37 48 C9 F4 CC E7 60 BB 43 55>)
(   3,<2013-11-13 22:37:42.147 -0800>,<Administrator>,<X>,<proc1d>,<TOPSPIN 2.1>,
      <pk PHC0 = -84.74304 PHC1 = 0 
       data hash MD5: 128K
       CA D4 5E 02 EC 4F 71 8C 35 7B D6 A5 A9 B7 CA F8>)
(   4,<2013-11-13 22:37:42.678 -0800>,<Administrator>,<X>,<proc1d>,<TOPSPIN 2.1>,
      <abs ABSG = 1 
       data hash MD5: 128K
       BF D6 16 30 8F 98 C2 98 35 5D C5 D2 12 04 08 9A>)
(   5,<2013-11-13 22:37:42.787 -0800>,<Administrator>,<X>,<proc1d>,<TOPSPIN 2.1>,
      <abs ABSG = 2 
       data hash MD5: 128K
       4D C4 AA 23 35 BD 6B 5F 9A 9E 8D 1F 06 FB A0 FD>)
(   6,<2013-11-13 22:37:42.897 -0800>,<Administrator>,<X>,<proc1d>,<TOPSPIN 2.1>,
      <abs ABSG = 3 
       data hash MD5: 128K
       E3 0B 8C AA 50 2C 42 19 62 AC CC BF AA 96 07 D6>)
(   7,<2013-11-13 22:37:42.975 -0800>,<Administrator>,<X>,<proc1d>,<TOPSPIN 2.1>,
      <abs ABSG = 4 
       data hash MD5: 128K
       A6 49 4C 42 0E 8D 88 7A EA E0 0C 42 85 43 9C 5C>)
(   8,<2013-11-13 22:37:43.068 -0800>,<Administrator>,<X>,<proc1d>,<TOPSPIN 2.1>,
      <abs ABSG = 5 
       data hash MD5: 128K
       BE 33 D6 29 EA 5F 6A 34 FF 07 FB C0 49 C5 58 58>)
$$ ##END=
$$ 
$$ $$ hash MD5
$$ $$ EE EA EC 0F AE 87 18 71 C8 BE 9C BD C1 6A F6 A0
##$RELAX= 
##$RELAX= 
##$RELAX= 
##$RELAX= 
##$RELAX= 
##$RELAX= 
##$RELAX= 
##$RELAX= 
$$ Bruker specific parameters
$$ --------------------------
##$DU= <E:\>
##$EXPNO= 12
$$ [...]
##$TP07= 0
##$TPNAME0= <>
##$TPNAME1= <>
##$TPNAME2= <>
##$TPNAME3= <>
##$TPNAME4= <>
##$TPNAME5= <>
##$TPNAME6= <>
##$TPNAME7= <>
##$TPOAL= (0..7)
0.5 0.5 0.5 0.5 0.5 0.5 0.5 0.5
##$TPOFFS= (0..7)
0 0 0 0 0 0 0 0
##$TUNHIN= 0
##$TUNHOUT= 0
##$TUNXOUT= 0
##$USERA1= <user>
##$USERA2= <user>
##$USERA3= <user>
##$USERA4= <user>
##$USERA5= <user>
##$V9= 5
##$VALIST= <valist>
##$VCLIST= <CCCCCCCCCCCCCCC>
##$VD= 0
##$VDLIST= <DDDDDDDDDDDDDDD>
##$VPLIST= <PPPPPPPPPPPPPPP>
##$VTLIST= <TTTTTTTTTTTTTTT>
##$WBST= 1024
##$WBSW= 4
##$XGAIN= (0..3)
0 0 0 0
##$XL= 0
##$YL= 0
##$YMAX_a= 5846359
##$YMIN_a= -12079034
##$ZGOPTNS= <>
##$ZL1= 120
##$ZL2= 120
##$ZL3= 120
##$ZL4= 120
##$ABSF1= 14.96079
##$ABSF2= -5.597392
##$ABSG= 5
##$ABSL= 3
##$ALPHA= 0
##$AQORDER= 0
##$ASSFAC= 0
##$ASSFACI= 0
##$ASSFACX= 0
##$ASSWID= 0
##$AUNMP= <proc_prof1d_extract.lims>
##$AXLEFT= 0
##$AXNAME= <>
##$AXNUC= <1H>
##$AXRIGHT= 0
##$AXTYPE= 0
##$AXUNIT= <>
##$AZFE= 0.1
##$AZFW= 0.1
##$BCFW= 0
##$BC_mod= 0
##$BYTORDP= 0
##$COROFFS= 0
##$CY= 15
##$DATMOD= 1
##$DC= 0
##$DFILT= <>
##$DTYPP= 0
##$F1P= 0
##$F2P= 0
##$FCOR= 0.5
##$FTSIZE= 131072
##$FT_mod= 6
##$GAMMA= 0
##$GB= 0
##$INTBC= 1
##$INTSCL= 1
##$ISEN= 128
##$LB= 0.3
##$LEV0= 0
##$LPBIN= 0
##$MAXI= 10000
##$MC2= 0
##$MEAN= 0
##$ME_mod= 0
##$MI= 0
##$NCOEF= 0
##$NC_proc= -2
##$NLEV= 6
##$NOISF1= 0
##$NOISF2= 0
##$NSP= 0
##$NTH_PI= 0
##$NZP= 0
##$OFFSET= 14.96079
##$PC= 1
##$PHC0= -84.74304
##$PHC1= 0
##$PH_mod= 1
##$PKNL= yes
##$PPARMOD= 0
##$PPDIAG= 0
##$PPIPTYP= 0
##$PPMPNUM= 2147483647
##$PPRESOL= 1
##$PSCAL= 4
##$PSIGN= 0
##$PYNMP= <proc.py>
##$REVERSE= no
##$SF= 400.020009720553
##$SI= 131072
##$SIGF1= 0
##$SIGF2= 0
##$SINO= 400
##$SIOLD= 131072
##$SPECTYP= <>
##$SREGLST= <1H.CDCl3>
##$SSB= 0
##$STSI= 131072
##$STSR= 0
##$SW_p= 8223.68421052631
##$SYMM= 0
##$S_DEV= 0
##$TDeff= 65536
##$TDoff= 0
##$TI= <>
##$TILT= no
##$TM1= 0
##$TM2= 0
##$TOPLEV= 0
##$USERP1= <user>
##$USERP2= <user>
##$USERP3= <user>
##$USERP4= <user>
##$USERP5= <user>
##$WDW= 1
##$XDIM= 131072
##$YMAX_p= 407728637
##$YMIN_p= -11858
##$CURPLOT= <Network HP LaserJet P1505>
##$CURPRIN= <$Network HP LaserJet P1505>
##$DFORMAT= <normdp>
##$LAYOUT= <+/1D_H.xwp>
##$LFORMAT= <normlp>
##$PFORMAT= <normpl>
##$SURQMSG= 1
$$ End of Bruker specific parameters
$$ ---------------------------------
##NTUPLES= NMR SPECTRUM
##VAR_NAME=  FREQUENCY,     SPECTRUM/REAL,   SPECTRUM/IMAG
##SYMBOL=    X,             R,               I
##VAR_TYPE=  INDEPENDENT,   DEPENDENT,       DEPENDENT
##VAR_FORM=  AFFN,          ASDF,            ASDF
##VAR_DIM=   131072,        131072,          131072
##UNITS=     HZ,            ARBITRARY UNITS, ARBITRARY UNITS
##FACTOR=    0.0627417313425164, 1,          1
##FIRST=     8223.62146879497, 1812,         -60013
##LAST=      0,             3620,            -59491
##MIN=       0,             -11858,          0
##MAX=       8223.62146879497, 407728637,    0
$$ Real data points
##PAGE= N=1
##DATA TABLE= (X++(R..R)), XYDATA
$$ [...]
$$ plain form
63945 1456621 1599652 1760943 1940173 2136800 2349255 2574772 2810568 3054515 3304129
63936 3304129 3555533 3803979 4044708 4272466 4480883 4663677 4816734 4938252 5026823 5080260
63926 5080260 5096469 5074624 5014908 4917886 4785007 4619636 4426993 4213060 3983739 3744718
63916 3744718 3501305 3257957 3018176 2784991 2561366 2350037 2153196 1972461 1808850
63907 1808850 1662472 1532420 1417318 1316023 1227596 1150740 1083707 1024944 973513 928726
63897 928726 889619 855058 824194 796572 771863 749647 729356 710245 691601 673186 655354
63886 655354 638536 622738 607785 593839 581327 570523 561569 554789 550501 548501 548199 549370 552304
63873 552304 557135 563493 571104 580294 591472 604312 617851 631320 644672 658332 672603 687198
$$ packed form
63945A456621J43031J61291J79230J96627K12455K25517K35796K43947K49614
63936C304129K51404K48446K40729K27758K08417J82794J53057J21518Q8571N3437
63926E080260J6209k1845n9716r7022j32879j65371j92643k13933k29321k39021
63916C744718k43413k43348k39781k33185k23625k11329j96841j80735j63611
63907A808850j46378j30052j15102j01295q8427p6856o7033n8763n1431m4787
63897I28726l9107l4561l0864k7622k4709k2216k0291j9111j8644j8415j7832
63886F55354j6818j5798j4953j3946j2512j0804q954o780m288k000l02J171K934
63873E52304M831O358P611R190J1178J2840J3539J3469J3352J3660J4271J4595
$$ plain form
63861 687198 701231 713783 724590 734045 742438 749450 754585 757812 759436 759420 757194 752232 744621 734987
63847 734987 723884 711334 696987 680799 663406 645570 627345 608186 588012 567737 548405
63836 548405 530086 512016 493628 475054 456710 438923 422062 406578 392599 379714 367396
63825 367396 355572 344593 334632 325338 316182 307052 298333 290357 283044 276274 270448 266243 263729 262024
63811 262024 260001 257070 253249 248900 244675 241347 239257 238076 237440 237529 238534 239806 240193 239309 237911
63796 237911 236900 236424 236181 236042 235945 235527 234379 232598 230756 229315 228283 227346 226111 224298 221982 219684
63780 219684 218076 217494 217762 218370 218738 218487 217713 216946 216614 216552 216217 215400 214446 213757 213345 213043 212869 212890 212864
63761 212864 212383 211453 210600 210262 210279 210249 210220 210691 211832 213077 213705 213636 213394 213362 213438 213415 213345 213357 213407 213499 213971 215184
$$ packed form
63861F87198J4033J2552J0807R455Q393P012N135L227J624j6k226m962p611r634
63847G34987j1103j2550j4347j6188j7393j7836j8225j9159k0174k0275j9332
63836E48405j8319j8070j8388j8574j8344j7787j6861j5484j3979j2885j2318
63825C67396j1824j0979r961r294r156r130q719p976p313o770n826m205k514j705
63811B62024k023k931l821m349m225l328k090j181o36Q9J005J272L87q84j398
63796B37911j011m76k43j39r7m18j148j781j842j441j032r37j235j813k316k298
63780B19684j608n82K68O08L68k51p74p67l32o2l35q17r54o89m12l02j74K1k6
63761B12864m81r30q53l38J7l0k9M71J141J245O28o9k42l2P6k3p0J2N0R2M72J213
$$ plain form
63739 215184 216982 218777 220190 221345 222492 223711 225172 227327 230481 234238 237669 240045 241368 242359
63725 242359 244086 247347 252028 257065 261357 264793 268195 272369 277499 283326 289385 294846 298695 300482
63711 300482 300681 299999 298586 296245 293227 290295 287982 286110 284082 281449 278231 275018 272790 272289 273358
63696 273358 275036 276374 277146 277797 278973 281086 284130 287766 291680 295828 300199 304449 308092 311036 313560
63681 313560 315684 316940 317061 316554 316228 316308 316378 316092 315571 315060 314614 314314 314519 315628 317629 320092 322554
63664 322554 324756 326538 327755 328440 328816 328901 328171 325931 322133 317556 312974 308377 303244 297425 291406
63649 291406 285755 280719 276432 273113 270787 269061 267446 265849 264547 263812 263788 264589 266162 268103 269925
63634 269925 271636 273767 276665 280059 283579 287466 292307 298080 303915 309004 313453 317996 323095 328679
$$ packed form
63739B15184J798J795J413J155J147J219J461K155L154L757L431K376J323R91
63725B42359J727L261M681N037M292L436L402M174N130N827O059N461L849J787
63711C00482J99o82j413k341l018k932k313j872k028k633l218l213k228n01J069
63696B73358J678J338P72O51J176K113L044L636L914M148M371M250L643K944K524
63681C13560K124J256J21n07l26Q0P0k86n21n11m46l00K05J109K001K463K462
63664C22554K202J782J217O85L76Q5p30k240l798m577m582m597n133n819o019
63649B91406n651n036m287l319k326j726j615j597j302p35k4Q01J573J941J822
63634B69925J711K131K898L394L520L887M841N773N835N089M449M543N099N584
$$ plain form
63620 328679 334603 340993 348121 356250 365637 376417 388437 401481 415685 431464 448992 468089
63608 468089 488767 511500 536710 564201 593263 623060 652682 681031 706915 729130 746446
63597 746446 757991 763922 765360 763408 758652 751913 744838 738965 734374 729827 723972 715846 704657 690148
63583 690148 673189 655129 636255 615713 593257 570376 549169 530527 513820 498032 482914
63572 482914 469317 458636 451658 447817 445812 444949 445419 447367 450430 454417 459657 466236 473532 480967
63558 480967 488651 496710 504587 511702 518460 525940 534815 545225 557454 572080 589543 610111 634217
63545 634217 662354 694691 731056 770819 812143 851571 885201 910503 926711 933949 932937 925632
63533 925632 915101 904065 893796 884571 876559 869797 863661 856943 848496 837563 823557 805807 783742
$$ packed form
63620C28679N924O390P128Q129R387J0780J2020J3044J4204J5779J7528J9097
63608D68089K0678K2733K5210K7491K9062K9797K9622K8349K5884K2215J7316
63597G46446J1545N931J438j952m756o739p075n873m591m547n855q126j1189j4509
63583F90148j6959j8060j8874k0542k2456k2881k1207j8642j6707j5788j5118
63572D82914j3597j0681o978l841k005q63M70J948L063L987N240O579P296P435
63558D80967P684Q059P877P115O758P480Q875J0410J2229J4626J7463K0568K4106
63545F34217K8137L2337L6365L9763M1324L9428L3630K5302J6208P238j012p305
63533I25632j0531j1036j0269r225q012o762o136o718q447j0933j4006j7750k2065
$$ plain form
63520 783742 757438 727993 697127 666198 635622 605380 575804 547577 521156 496716 474644
63509 474644 455563 439640 426196 414191 402973 392555 383442 376192 370814 366466 361997 356905 351613
63496 351613 346888 343256 340927 339789 339329 338953 338593 338649 339156 339426 338866 337867 337439 338125 339624 341382 343172
63479 343172 345068 347215 349819 353180 357498 362569 367688 371909 374560 375650 375731 375269 374172 372006 368600
63464 368600 364316 359707 355079 350460 345826 341208 336631 332194 328228 325152 323048 321583 320494 319975
63450 319975 320340 321504 323149 325277 328216 332053 336522 341506 347220 353731 360769 368246 376582 386196
63436 386196 397087 409294 423488 440698 461628 486441 514680 544807 574096 599717 620147
63425 620147 635335 645783 652027 654961 656169 657747 661842 670043 682804 699673 720483 745986 776693
$$ packed form
63520G83742k6304k9445l0866l0929l0576l0242k9576k8227k6421k4440k2072
63509D74644j9081j5923j3444j2005j1218j0418r113p250n378m348m469n092n292
63496C51613m725l632k329j138m60l76l60N6N07K70n60r99m28O86J499J758J790
63479C43172J896K147K604L361M318N071N119M221K651J090Q1m62j097k166l406
63464C68600m284m609m628m619m634m618m577m437l966l076k104j465j089n19
63450C19975L65J164J645K128K939L837M469M984N714O511P038P477Q336R614
63436C86196J0891J2207J4194J7210K0930K4813K8239L0127K9289K5621K0430
63425F20147J5188J0448O244K934J208J578M095Q201J2761J6869K0810K5503L0707
$$ plain form
63412 776693 811358 847390 882644 915897 945585 969288 985182 993397 995400 992594 986095 977311
63400 977311 967753 958126 948084 936921 924176 909526 892518 872666 849712 823753 795219 764849
63388 764849 733652 702737 672958 644628 617700 592340 569156 548729 531111 515998 503191
63377 503191 492609 484021 477120 471782 467998 465754 465343 467488 472604 480043 488584 497569 507098 517336
63363 517336 528386 540784 555280 571981 590431 610715 633646 659573 687790 717562 749026
63352 749026 782509 817523 852875 887194 918780 945518 965686 978704 984772 984340 978499 969328
63340 969328 958983 948542 938182 928035 918091 907509 894860 879127 860017 837519 811901 784114
63328 784114 755454 726694 698020 669836 643056 618558 596836 578353 563698 553210 546730 543729
$$ packed form
63412G76693L4665L6032L5254L3253K9688K3703J5894Q215K003k806o499q784
63400I77311r558r627j0042j1163j2745j4650j7008j9852k2954k5959k8534l0370
63388G64849l1197l0915k9779k8330k6928k5360k3184k0427j7618j5113j2807
63377E03191j0582q588o901n338l784k244m11K145N116P439Q541Q985R529J0238
63363E17336J1050J2398J4496J6701J8450K0284K2931K5927K8217K9772L1464
63352G49026L3483L5014L5352L4319L1586K6738K0168J3018O068m32n841r171
63340I69328j0345j0441j0360j0147r944j0582j2649j5733j9110k2498k5618k7787
63328G84114k8660k8760k8674k8184k6780k4498k1722j8483j4655j0488o480l001
$$ plain form
63316 543729 543202 543339 541815 536788 527597 514616 498844 481639 464283 447489 431505 416720 403835
63303 403835 393306 384918 378069 372230 367104 362698 359406 357647 357119 356636 355028 352095 348520 344981
63289 344981 341583 338111 334509 330959 327575 324212 320706 317232 314220 311836 309775 307774 306136 305432
63275 305432 305687 306181 306189 305706 305330 305508 306012 306145 305467 304306 303474 303481 304123 304937 305794 306910 308495 310628 313352
63256 313352 316564 319914 323089 326215 329714 333786 338289 343078 348187 353632 359332 365416 372380 380753
63242 380753 390572 401261 412095 422860 434106 446665 460905 476539 493143 510605 529001 548339
63230 548339 568617 589805 611519 632939 653399 672894 691783 710295 728691 747592 767579
63219 767579 788526 809792 831056 852451 873897 894775 914329 931924 946697 957415 962972 962975
$$ packed form
63316E43729n27J37j524n027r191j2981j5772j7205j7356j6794j5984j4785j2885
63303D03835j0529q388o849n839n126m406l292j759n28m83j608k933l575l539
63289C44981l398l472l602l550l384l363l506l474l012k384k061k001j638p04
63275C05432K55M94Qm83l76J78N04J33o78j161q32PO42Q14Q57J116J585K133K724
63256C13352L212L350L175L126L499M072M503M789N109N445N700O084O964Q373
63242C80753R819J0689J0834J0765J1246J2559J4240J5634J6604J7462J8396J9338
63230E48339K0278K1188K1714K1420K0460J9495J8889J8512J8396J8901J9987
63219G67579K0947K1266K1264K1395K1446K0878J9554J7595J4773J0718N557L
$$ plain form
63207 962975 957771 948070 934473 917130 895885 871054 843994 816559 790042 764969 741768 721067
63195 721067 703220 688079 675477 665607 658746 654983 654337 656783 661991 669344 678385 688918 700656
63182 700656 713209 726584 741183 757089 773819 791064 809130 828185 847562 866385 884600
63171 884600 902774 920964 938328 953813 966786 977013 984445 989057 990474 987645 979319 965107
63159 965107 945914 923156 897672 869514 838669 805818 772404 739999 709652 681714 656101
63148 656101 632614 611137 591786 574849 560368 547851 536691 526880 518897 512788 507849 503431
63136 503431 499601 496559 493774 490367 486243 482294 479433 477802 476992 476616 476562 477040 478478 481107 484559
63121 484559 488209 492034 496731 502747 509424 515466 520106 523530 526288 528646 530606 532278 534003 536181
$$ packed form
63207I62975n204r701j3597j7343k1245k4831k7060k7435k6517k5073k3201k0701
63195G21067j7847j5141j2602r870o861l763o46K446N208P353R041J0533J1738
63182G00656J2553J3375J4599J5906J6730J7245J8066J9055J9377J8823J8215
63171H84600J8174J8190J7364J5485J2973J0227P432M612J417k829q326j4212
63159I65107j9193k2758k5484k8158l0845l2851l3414l2405l0347k7938k5613
63148F56101k3487k1477j9351j6937j4481j2517j1160r811p983o109m939m418
63136E03431l830l042k785l407m124l949k861j631q10l76n4M78J438K629L452
63121D84559L650L825M697O016O677O042M640L424K758K358J960J672J725K178
$$ plain form
63107 536181 539063 542682 546815 550924 554209 555960 556075 555293 554761 555235 556589 558044 558808 558558 557496 556103
63091 556103 554825 553891 553309 553001 552907 553020 553376 554030 554934 555818 556340 556490 556778 557810 559717 562186 565105
63074 565105 568901 574066 580505 587577 594681 601657 608769 616627 626006 637341 650327 664310 679133
63061 679133 695277 713123 732480 753088 775271 799797 827338 858346 893180 931920 974139
63050 974139 1019096 1066106 1114626 1164237 1214863 1266720 1319721 1373086 1425858 1477572 1528133
63039 1528133 1577431 1625736 1674181 1724082 1775611 1827621 1878701 1927828 1974018 2016052 2052645
63028 2052645 2082313 2103024 2112768 2110703 2097102 2072076 2035385 1987986 1932736 1872697 1809406 1743610
63016 1743610 1677031 1612137 1550482 1492463 1438768 1390923 1350055 1316036 1288366 1267285 1253460
$$ packed form
63107E36181K882L619M133M109L285J751J15p82n32M74J354J455P64k50j062j393
63091E56103j278r34n82l08r4J13L56O54R04Q84N22J50K88J032J907K469K919
63074E65105L796N165O439P072P104O976P112P858R379J1335J2986J3983J4823
63061F79133J6144J7846J9357K0608K2183K4526K7541L1008L4834L8740M2219
63050I74139M4957M7010M8520M9611N0626N1857N3001N3365N2772N1714N0561
63039A528133M9298M8305M8445M9901N1529N2010N1080M9127M6190M2034L6593
63028B052645K9668K0711R744k065j3601k5026l6691m7399n5250o0039o3291o5796
63016A743610o6579o4894o1655n8019n3695m7845m0868l4019k7670k1081j3825
$$ plain form
63005 1253460 1247008 1247381 1253975 1266366 1283995 1305992 1331367 1359201 1388640 1418939 1449649 1480759
62993 1480759 1512519 1545074 1578279 1611940 1646015 1680215 1713430 1744022 1770889 1793806 1812444
62982 1812444 1825499 1831332 1829122 1818804 1800082 1772288 1735348 1690349 1638992 1582850 1523245 1461382
62970 1461382 1398431 1335730 1274911 1217365 1163589 1113479 1067291 1025664 988564 954935 923798
62959 923798 895165 869382 846057 824198 803128 782713 762951 743893 725819 708957 693021
62948 693021 677466 662110 647103 632383 617717 603295 589765 577478 566164 555487 545560 536651
62936 536651 528695 521365 514454 507984 502142 497255 493585 490912 488555 486053 483689 482028 481082 480298 479337
62921 479337 478446 477921 477478 476483 474660 472338 469918 467314 464072 460052 455837 452348 450055 448615 447255
$$ packed form
63005A253460o452L73O594J2391J7629K1997K5375K7834K9439L0299L0710L1110
62993A480759L1760L2555L3205L3661L4075L4200L3215L0592K6867K2917J8638
62982A812444J3055N833k210j0318j8722k7794l6940m4999n1357n6142n9605o1863
62970A461382o2951o2701o0819n7546n3776n0110m6188m1627l7100l3629l1137
62959I23798k8633k5783k3325k1859k1070k0415j9762j9058j8074j6862j5936
62948F93021j5555j5356j5007j4720j4666j4422j3530j2287j1314j0677r927q909
62936E36651p956p330o911o470n842m887l670k673k357k502k364j661r46p84r61
62921D79337q91n25m43r95j823k322k420k604l242m020m215l489k293j440j360
$$ plain form
62906 447255 445411 442954 439968 436491 432544 428330 424335 421167 419197 418270 417845 417450 417062 416982 417376 417942
62890 417942 418009 417052 415236 413520 412987 413919 415582 417032 418009 418846 419694 420222 420105 419463 418643 417798 416873 415867
62872 415867 414892 414030 413284 412657 412192 411963 412038 412330 412478 412011 410781 409145 407660 406675 406222 406097 406010 405856
62854 405856 405990 406974 408891 411098 412839 413930 414661 415334 416157 417299 418648 419630 419760 419323 419121 419549 420287
62837 420287 420841 420947 420427 419111 417111 414857 412777 411141 410233 410230 410857 411596 412401 413765 415834 417886 419047
62820 419047 419242 419174 419662 421234 423994 427460 430748 433388 435896 439198 443571 448434 453115 457494 461919
62805 461919 466796 472323 478473 485134 492296 500093 508629 517895 527884 538611 550042 562206 575362
62792 575362 589700 604907 620591 637310 656596 679566 705986 735205 767520 803980 845257
$$ packed form
62906D47255j844k457k986l477l947m214l995l168j970r27m25l95l88q0L94N66
62890D17942O7r57j816j716n33R32J663J450R77Q37Q48N28j17o42q20q45r25j006
62872D15867r75q62p46o27m65k29P5K92J48m67j230j636j485r85m53j25q7j54
62854D05856J34R84J917K207J741J091P31O73Q23J142J349R82J30m37k02M28P38
62837D20287N54J06n20j316k000k254k080j636r08lO27P39Q05J364K069K052J161
62820D19047J95o8M88J572K760L466L288K640K508L302M373M863M681M379M425
62805D61919M877N527O150O661P162P797Q536R266R989J0727J1431J2164J3156
62792E75362J4338J5207J5684J6719J9286K2970K6420K9219L2315L6460M1277
$$ plain form
62781 845257 891425 942653 999315 1061432 1128693 1201013 1278342 1359774 1443377 1527032 1608866
62770 1608866 1686877 1758880 1823150 1878437 1923049 1954541 1970879 1971649 1957819 1930754 1891811 1842421
62758 1842421 1783965 1717769 1645649 1570158 1493751 1417739 1342463 1268383 1196563 1128117 1063638
62747 1063638 1003280 947118 895283 847897 804926 766081 730917 699106 670525 644994 622173
62736 622173 601856 584106 568845 555525 543601 533198 524863 518604 513549 508691 503817 499589 496851
62723 496851 495905 496327 497429 498925 501099 504315 508583 513783 520127 528033 537523 548066 559212 571277
62709 571277 585315 602429 623064 646865 673216 701986 733697 769028 808373 852000 900281
62698 900281 953410 1011084 1072818 1138433 1207780 1280070 1353904 1427983 1501181 1571756 1637026
$$ packed form
62781H45257M6168N1228N6662O2117O7261P2320P7329Q1432Q3603Q3655Q1834
62770A608866P8011P2003O4270N5287M4612L1492J6338P70j3830k7065l8943m9390
62758A842421n8456o6196p2120p5491p6407p6012p5276p4080p1820o8446o4479
62747A063638o0358n6162n1835m7386m2971l8845l5164l1811k8581k5531k2821
62736F22173k0317j7750j5261j3320j1924j0403q335o259n055m858m874m228k738
62723D96851r46M22J102J496K174L216M268N200O344P906R490J0543J1146J2065
62709E71277J4038J7114K0635K3801K6351K8770L1711L5331L9345M3627M8281
62698I00281N3129N7674O1734O5615O9347P2290P3834P4079P3198P0575O5270
$$ plain form
62687 1637026 1694295 1741794 1778455 1803154 1814722 1812560 1796817 1768035 1727072 1675419 1615204
62676 1615204 1548637 1477637 1403973 1329443 1255671 1183861 1114923 1049754 989149 933434 882383
62665 882383 835606 792924 754239 719113 686838 657061 630112 606389 585532 566611 549097
62654 549097 533251 519455 507547 497027 487457 478378 469263 460021 451303 443807 437436 431613 426209
62641 426209 421560 417728 414418 411654 409802 408776 407951 407183 407225 408668 410979 413041 414209 414357 413419 411555
62625 411555 409453 407833 406725 405796 405094 404886 404939 404750 404448 404779 406138 408267 410983 414485 418713 423178
62609 423178 427804 433282 440118 447844 455796 464252 474104 485573 498039 511224 525969 543501 564253
62596 564253 587729 613426 641534 672624 706854 743776 782840 823680 865630 907224 946575
$$ packed form
62687A637026N7269M7499L6661K4699J1568k162j5743k8782m0963n1653o0215
62676A615204o6567p1000p3664p4530p3772p1810o8938o5169o0605n5715n1051
62665H82383m6777m2682l8685l5126l2275k9777k6949k3723k0857j8921j7514
62654E49097j5846j3796j1908j0520r570r079r115r242q718p496o371n823n404
62641D26209m649l832l310k764j852j026q25p68M2J443K311K062J168J48r38j864
62625D11555k102j620j108r29p02k08N3j89l02L31J359K129K716L502M228M465
62609D23178M626N478O836P726P952Q456R852J1469J2466J3185J4745J7532K0752
62596E64253K3476K5697K8108L1090L4230L6922L9064M0840M1950M1594L9351
$$ plain form
62585 946575 982131 1012730 1037146 1054216 1063497 1065315 1060076 1048002 1029602 1005782 977204 944177
62573 944177 907573 869338 831473 794807 759230 724807 692075 661455 632986 606634 582426
62562 582426 560268 540030 521828 505928 492379 480936 471233 462876 455548 449279 444388 440823 437841
62549 437841 434704 431479 428718 426534 424512 422388 420340 418675 417743 418053 419879 422695 425480 427719 429640
62534 429640 431446 432880 433730 434334 435258 436769 438886 441724 445623 451017 458223 467146 477219 487956
62520 487956 499634 513275 529951 550259 574300 601716 631796 664014 698582 736142 776806
62509 776806 819766 863795 907742 950557 991280 1029133 1063276 1092435 1115229 1130975 1139759 1141730
62497 1141730 1136875 1125661 1109350 1089395 1067021 1043622 1021003 1000825 984087 971417 963375 960079
$$ packed form
62585I46575L5556L0599K4416J7070R281J818n239j2074j8400k3820k8578l3027
62573I44177l6604l8235l7865l6666l5577l4423l2732l0620k8469k6352k4208
62562E82426k2158k0238j8202j5900j3549j1443r703q357p328o269m891l565k982
62549D37841l137l225k761k184k022k124k048j665r32L10J826K816K785K239J921
62534D29640J806J434Q50O04R24J511K117K838L899N394P206Q923J0073J0737
62520D87956J1678J3641J6676K0308K4041K7416L0080L2218L4568L7560M0664
62509G76806M2960M4029M3947M2815M0723L7853L4143K9159K2794J5746Q784J971
62497A141730m855j1214j6311j9955k2374k3399k2619k0178j6738j2670q042l296
$$ plain form
62485 960079 961054 966009 975602 990975 1012732 1040687 1074341 1113151 1156456 1203505 1253371 1304498
62473 1304498 1354380 1400093 1439236 1470410 1493093 1507355 1513366 1510767 1498501 1475511 1441624 1397761
62461 1397761 1345626 1287340 1225048 1160478 1095041 1030414 968559 910746 856990 806931 761059
62450 761059 720492 685747 656288 631278 610276 593147 579665 569332 561341 554808 549278 544958
62438 544958 542233 541108 541377 542953 545513 548075 549595 549984 549875 549295 547268 542978 536770 529631 522101
62423 522101 514111 505521 496396 486896 477339 468276 460168 452997 446420 440303 434799 429872 425051 419908
62409 419908 414723 410352 407330 405240 403153 400602 397876 395450 393498 392074 391355 391331 391493 391298 390956 391406
62393 391406 393381 396665 400324 403493 405887 407764 409553 411542 413805 416296 418905 421572 424581 428636
$$ packed form
62485I60079R75M955R593J5373K1757K7955L3654L8810M3305M7049M9866N1127
62473A304498M9882M5713L9143L1174K2683J4262O011k599j2266k2990l3887m3863
62461A397761n2135n8286o2292o4570o5437o4627o1855n7813n3756n0059m5872
62450G61059m0567l4745k9459k5010k1002j7129j3482j0333p991o533n530m320
62438E44958k725j125K69J576K560K562J520L89j09n80k027m290o208p139p530
62423E22101p990q590r125r500r557r063q108p171o577o117n504m927m821n143
62409D19908n185m371l022k090k087k551k726k426j952j424p19k4J62j95l42M50
62393C91406J975L284L659L169K394J877J789J989K263K491K609K667L009M055
$$ plain form
62379 428636 434243 440919 447484 453393 459404 466612 475164 484317 493406 502262 511006 520117 530556 543141
62365 543141 557635 573013 588742 605439 624265 646181 671809 701414 734768 771499 811870
62354 811870 856798 906776 960957 1017333 1073439 1126779 1175167 1217165 1252015 1279020 1297422
62343 1297422 1307166 1309320 1305171 1295142 1279063 1257229 1230568 1199832 1165280 1127436 1087775 1048278
62331 1048278 1010415 974722 941302 910527 883131 859617 839639 822118 805948 790528 775601
62320 775601 760882 745967 730474 714100 696649 678162 658958 639442 619980 601027 583156
62309 583156 566772 551876 538271 525867 514611 504322 494872 486477 479530 474131 469964 466561 463514
62296 463514 460463 457247 454156 451838 450783 450983 452059 453623 455480 457703 460520 464015 467888 471762
$$ packed form
62379D28636N607O676O565N909O011P208Q552R153R089Q856Q744R111J0439J2585
62365E43141J4494J5378J5729J6697J8826K1916K5628K9605L3354L6731M0371
62354H11870M4928M9978N4181N6376N6106N3340M8388M1998L4850K7005J8402
62343A297422R744K154m149j0029j6079k1834k6661l0736l4552l7844l9661l9497
62331A048278l7863l5693l3420l0775k7396k3514j9978j7521j6170j5420j4927
62320G75601j4719j4915j5493j6374j7451j8487j9204j9516j9462j8953j7871
62309E83156j6384j4896j3605j2404j1256j0289r450q395o947n399m167l403l047
62296D63514l051l216l091k318j055K00J076J564J857K223K817L495L873L874
$$ plain form
62282 471762 475725 480267 485482 490666 495107 499136 503950 510361 518042 526076 533892 541501 549208 557493
62268 557493 567036 578440 591838 606937 623467 641448 661195 683306 708548 737385 769605 804811
62256 804811 843319 886195 934220 987111 1043837 1103182 1163583 1222788 1278203 1327583 1369214
62245 1369214 1401816 1424820 1438622 1443973 1441046 1429442 1409098 1380761 1345473 1304037 1257147 1205760
62233 1205760 1151189 1095046 1039106 984845 932985 883775 837793 796071 759299 727315 699529
62222 699529 675430 654451 635884 619412 605305 593561 583117 572614 561842 551811 543396 536527
62210 536527 530791 526131 522458 519098 515237 510851 506788 503910 502504 502547 504148 507412 512035 517324 522745
62195 522745 528282 534207 540634 547487 554806 562775 571367 580233 589151 598383 608345 619082 630382 642209
$$ packed form
62282D71762L963M542N215N184M441M029M814O411P681Q034P816P609P707Q285
62268E57493R543J1404J3398J5099J6530J7981J9747K2111K5242K8837L2220L5206
62256H04811L8508M2876M8025N2891N6726N9345O0401N9205N5415M9380M1631
62245A369214L2602K3004J3802N351k927j1604k0344k8337l5288m1436m6890n1387
62233A205760n4571n6143n5940n4261n1860m9210m5982m1722l6772l1984k7786
62222F99529k4099k0979j8567j6472j4107j1744j0444j0503j0772j0031q415o869
62210E36527n736m660l673l360l861m386m063k878j406M3J601L264M623N289N421
62195E22745N537N925O427O853P319P969Q592Q866Q918R232R962J0737J1300J1827
$$ plain form
62181 642209 654573 666907 678136 687646 695844 703414 710285 715785 719693 722753 726176 731058 738317
62168 738317 748685 762517 779872 801014 826570 856879 891340 928686 967803 1007937 1048071
62157 1048071 1086379 1120525 1148595 1169813 1184447 1193060 1195974 1193562 1186698 1176255 1162039 1142893
62145 1142893 1118349 1089732 1059073 1027379 994782 962092 931125 903279 878669 856965 838315
62134 838315 822915 810361 800067 791898 785805 781165 777116 773298 769787 766616 763921 762305 762400 764175
62120 764175 767203 771404 776834 782843 788198 792193 794989 796712 796902 795215 792142 788647 785384 782534
62106 782534 779916 776844 772206 765265 756364 746552 736605 726681 716877 707705 699892 693927 689932 687773
62092 687773 687043 687033 687129 687473 688959 692216 696789 701774 707128 713649 721562 729946 738054 746471 756289 767712
$$ packed form
62181F42209J2364J2334J1229R510Q198P570O871N500L908L060L423M882P259
62168G38317J0368J3832J7355K1142K5556L0309L4461L7346L9117M0134M0134
62157A048071L8308L4146K8070K1218J4634Q613K914k412o864j0443j4216j9146
62145A142893k4544k8617l0659l1694l2597l2690l0967k7846k4610k1704j8650
62134H38315j5400j2554j0294q169o093m640m049l818l511l171k695j616R5J775
62120G64175L028M201N430O009N355L995K796J723J90j687l073l495l263k850
62106G82534k618l072m638o941q901r812r947r924r804r172p813n965l995k159
62092F87773p30j0R6L44J486L257M573M985N354O521P913Q384Q108Q417R818J1423
$$ plain form
62076 767712 780354 794466 810787 829252 848829 868662 888442 907629 925489 942320 959722
62065 959722 979047 1000257 1022817 1046939 1073221 1101538 1130973 1160416 1188589 1213821 1234604
62054 1234604 1250324 1261100 1267120 1268546 1265710 1258755 1247257 1230737 1209460 1184242 1155572 1123442
62042 1123442 1088037 1050158 1010942 971431 932294 893738 855820 819172 785051 754276 726365
62031 726365 700251 675628 652973 632507 613984 597536 583842 573081 564262 555967 547430 538700
62019 538700 530194 522379 515420 508782 501469 493045 484161 475806 468316 461514 455537 450966 448155 446907
62005 446907 446941 448291 451050 455007 459803 465259 471251 477410 483269 488750 494143 499515 504396 508293 511225
61990 511225 513455 514845 514849 513049 509369 503839 496589 488073 478852 469081 458679 448112 438467 430457
$$ packed form
62076G67712J2642J4112J6321J8465J9577J9833J9780J9187J7860J6831J7402
62065I59722J9325K1210K2560K4122K6282K8317K9435K9443K8173K5232K0783
62054A234604J5720J0776O020J426k836o955j1498j6520k1277k5218k8670l2130
62042A123442l5405l7879l9216l9511l9137l8556l7918l6648l4121l0775k7911
62031G26365k6114k4623k2655k0466j8523j6448j3694j0761q819q295q537q730
62019E38700q506p815o959o638p313q424q884q355p490o802n977m571k811j248
62005D46907L4J350K759L957M796N456N992O159N859N481N393N372M881L897K932
61990E11225K230J390Mj800l680n530p250q516r221r771j0402j0567r645q010
$$ plain form
61976 430457 423753 417653 411903 406535 401373 396298 391684 387939 384815 381774 378874 376734 375639 375321
61962 375321 375593 376568 378125 379694 380853 381707 382513 383346 384342 385869 388155 390967 393981 397229 401013 405522
61946 405522 410766 416812 423868 432179 441862 452816 464855 478043 492761 509193 526867 545011
61934 545011 563250 581472 599142 615419 630256 644701 659601 674331 687323 697591 705237 710620
61922 710620 713731 714489 713137 710015 705188 698599 690519 681705 673159 665793 660207 656707 655515 656952
61908 656952 661287 668394 677763 688939 701760 715936 730541 744225 756009 765584 772754 776934 777514
61895 777514 774526 768594 760263 749706 737115 723028 708138 693059 678387 664711 652343 641222
61883 641222 631212 622261 614055 605818 596759 586630 575634 564000 552006 540226 529321 519488
$$ packed form
61976D30457o704o100n750n368n162n075m614l745l124l041k900k140j095l18
61962C75321K72R75J557J569J159Q54Q06Q33R96J527K286K812L014L248L784M509
61946D05522N244O046P056Q311R683J0954J2039J3188J4718J6432J7674J8144
61934E45011J8239J8222J7670J6277J4837J4445J4900J4730J2992J0268P646N383
61922G10620L111P58j352l122m827o589q080q814q546p366n586l500j192J437
61908F56952M335P107R369J1176J2821J4176J4605J3684J1784R575P170M180N80
61895G77514k988n932q331j0557j2591j4087j4890j5079j4672j3676j2368j1121
61883F41222j0010q951q206q237r059j0129j0996j1634j1994j1780j0905r833
$$ plain form
61871 519488 510420 501842 493862 486762 480653 475487 471259 468198 466751 467308 469807 473736 478702 484906
61857 484906 492900 502995 515110 529055 544688 561848 580447 600670 622892 647394 674246 703237
61845 703237 733625 764030 792974 819619 843786 865298 883582 897924 907845 913153 913835 910055
61833 910055 902222 891154 878214 865041 852923 842581 834673 830128 829606 832937 839586 849405 862295
61820 862295 877260 892477 906291 917568 925126 927722 924862 916954 904340 886832 864649 839162
61808 839162 812120 784529 756787 729518 703604 679582 657527 637455 619374 603042 588121
61797 588121 574537 562335 551261 540820 530738 521098 512062 503766 496373 489891 483934 478026 472180
61784 472180 466896 462566 459079 455994 452892 449591 446309 443625 442007 441317 441002 440775 440810 441242 441843 442378
$$ packed form
61871E19488r068q578p980p100o109n166m228l061j447N57K499L929M966O204
61857D84906P994J0095J2115J3945J5633J7160J8599K0223K2222K4502K6852K8991
61845G03237L0388L0405K8944K6645K4167K1512J8284J4342R921N308O82l780
61833I10055p833j1068j2940j3173j2118j0342p908m545n22L331O649R819J2890
61820H62295J4965J5217J3814J1277P558K596k860p908j2614j7508k2183k5487
61808H39162k7042k7591k7742k7269k5914k4022k2055k0072j8081j6332j4921
61797E88121j3584j2202j1074j0441j0082r640r036q296p393o482n957n908n846
61784D72180n284m330l487l085l102l301l282k684j618o90l15k27L5M32O01N35
$$ plain form
61768 442378 442978 443844 444750 445214 445145 445024 445400 446423 448002 450101 452662 455405 458090 460987 464780 469788
61752 469788 475443 480660 484633 487194 488618 489275 489332 488635 486907 484093 480345 475696 470162 464322 459287
61737 459287 455696 453079 450746 448872 448034 448003 447932 447707 448102 449404 450825 451688 452308 453093 453639 453531 453458 454514
61719 454514 456704 459039 461031 463215 466115 469468 472682 475448 477663 479255 480357 481229 481772 481435 479810
61704 479810 477025 473394 469094 464416 460016 456502 453897 451792 449914 448272 446786 445015 442367 438532
61690 438532 433790 428923 424725 421420 418540 415430 411902 408361 405320 402853 400510 397785 394654 391603
61676 391603 389041 386796 384376 381716 379423 378092 377533 376914 375645 373911 372236 370770 369264 367643 366301
61661 366301 365699 365913 366805 368450 371075 374568 378311 381652 384440 387008 389707 392549 395284 397771 400202
$$ packed form
61768D42378O00Q66R06M64o9j21L76J023J579K099K561K743K685K897L793N008
61752D69788N655N217L973K561J424O57N7o97j728k814l748m649n534n840n035
61737D59287l591k617k333j874q38l1p1k25L95J302J421Q63O20P85N46j08p3J056
61719D54514K190K335J992K184K900L353L214K766K215J592J102Q72N43l37j625
61704D79810k785l631m300m678m400l514k605k105j878j642j486j771k648l835
61690D38532m742m867m198l305k880l110l528l541l041k467k343k725l131l051
61676C91603k562k245k420k660k293j331n59o19j269j734j675j466j506j621j342
61661C66301o02K14Q92J645K625L493L743L341K788K568K699K842K735K487K431
$$ plain form
61646 400202 402892 405888 408955 411971 415083 418290 421207 423525 425425 427115 428196 428082 427028 426086 425917
61631 425917 426199 426374 426373 426296 425938 425177 424385 423884 423214 421552 418747 415494 412503 409940 407621 405389 403223
61614 403223 401243 399608 398244 396726 394615 391745 388080 383565 378480 373523 369006 364237 358388 351883
61600 351883 346194 342105 338886 335425 331532 327674 323988 320213 316376 312881 309918 307259 304738 302513
61586 302513 300666 298868 296805 294779 293559 293534 294217 294682 294379 293399 292171 291179 290848 291228 291687 291307 289863
61569 289863 288068 286631 285443 284176 283296 283743 285565 287589 288770 289314 290061 291183 292076 292371 292482 293061
61553 293061 294386 296472 299362 302883 306272 308527 309296 309174 308989 309001 309014 309034 309460 310626 312466 314661 316860
61536 316860 318725 320064 321063 322161 323478 324583 324957 324531 323656 322766 322173 321928 321662 320819 319269 317530
$$ packed form
61646D00202K690K996L067L016L112L207K917K318J900J690J081j14j054r42j69
61631D25917K82J75jp7l58p61p92n01o70j662k805l253k991k563k319k232k166
61614D03223j980j635j364j518k111k870l665m515n085m957m517m769n849o505
61600C51883n689m089l219l461l893l858l686l775l837l495k963k659k521k225
61586C02513j847j798k063k026j220k5O83M65l03r80j228r92l31L80M59l80j444
61569B89863j795j437j188j267q80M47J822K024J181N44P47J122Q93K95J11N79
61553B93061J325K086K890L521L389K255P69j22j85J2J3K0M26J166J840K195K199
61536C16860J865J339R99J098J317J105L74m26q75q90n93k45k66q43j550j739
$$ plain form
61520 317530 316202 315399 314913 314586 314233 313548 312506 311612 311242 310969 310050 308511 307195 306661 306601 306479 306330 306704
61502 306704 308014 310048 311897 312450 311330 309411 308070 307857 308228 308526 308785 309387 310387 311439 312165 312428
61486 312428 312496 312997 314358 316214 317731 318660 319558 320778 321859 322447 323283 325487 328963 332291 334335 335388
61470 335388 336491 338084 339719 340825 341324 341544 341814 342200 342427 342032 340722 338745 336811 335561 335117 335190
61454 335190 335483 335839 336145 336429 337045 338455 340621 342866 344585 345886 347227 348597 349453 349478 349079 349036 349867
61437 349867 351564 353794 356274 359066 362388 366014 369024 370534 370603 370100 369667 369180 368270 366942 365477 364076
61421 364076 362876 362086 361879 362267 363200 364606 366226 367640 368663 369542 370606 371844 372967 373715 373992 373839
61405 373839 373363 372557 371127 368769 365685 362568 359953 357814 355916 354190 352557 350785 348913 347543 347296
$$ packed form
61520C17530j328q03m86l27l53o85j042q94l70k73r19j539j316n34o0j22j49L74
61502C06704J310K034J849N53j120j919j341k13L71K98K59O02J000J052P26K63
61486C12428O8N01J361J856J517R29Q98J220J081N88Q36K204L476L328K044J053
61470C35388J103J593J635J106M99K20K70L86K27l95j310j977j934j250m44P3
61454C35190K93L56L06K84O16J410K166K245J719J301J341J370Q56K5l99m3Q31
61437C49867J697K230K480K792L322L626L010J510O9n03m33m87r10j328j465j401
61421C64076j200p90k07L88R33J406J620J414J023Q79J064J238J123P48K77j53
61405C73839m76q06j430k358l084l117k615k139j898j726j633j772j872j370k47
$$ plain form
61390 347296 348150 349630 351454 353570 355727 357561 359095 360647 362192 363221 363414 363137 363126 363977 365993 369115
61374 369115 372745 375932 378017 378990 379187 379011 379134 380465 383342 386958 390060 392178 393760 395264 396716
61359 396716 398215 400130 402494 404751 406629 408892 412687 418350 425362 433251 441888 450946 459737 467780
61345 467780 475030 481339 486184 489225 490793 491587 492241 493347 495412 498393 501682 504869 508101 511298 513560
61330 513560 514071 513229 512108 510952 509035 505976 502371 498904 495593 492230 488982 486153 483787 481848 480454
61315 480454 479593 479000 478699 479393 481909 486390 492270 498895 505982 513760 522898 534021 546887 560198
61301 560198 572492 583080 591825 598315 601808 602049 599757 596119 591976 587525 582581 576953 570671 564013
61287 564013 557406 551296 545961 541311 536864 532133 527114 522369 518564 516022 514636 514038 513903 514319 515847
$$ packed form
61390C47296Q54J480J824K116K157J834J534J552J545J029J93k77j1Q51K016L122
61374C69115L630L187K085R73J97j76J23J331K877L616L102K118J582J504J452
61359C96716J499J915K364K257J878K263L795N663P012P889Q637R058Q791Q043
61345D67780P250O309M845L041J568P94O54J106K065K981L289L187L232L197K262
61330E13560N11q42j121j156j917l059l605l467l311l363l248k829k366j939j394
61315D80454q61n93l01O94K516M481N880O625P087P778R138J1123J2866J3311
61301E60198J2294J0588Q745O490L493K41k292l638m143m451m944n628o282o658
61287E64013o607o110n335m650m447m731n019m745l805k542j386n98j35M16J528
$$ plain form
61272 515847 518932 523204 527672 531676 535261 538552 541255 543167 544787 546966 550052 553771 557846 562389
61258 562389 567727 574129 581626 589770 597526 603763 608027 610763 612722 614285 615407 616141 617040 618871 621768
61243 621768 624748 626313 625688 623342 620286 617102 613772 610111 606067 601726 597269 592901 588659 584435
61229 584435 580355 576949 574757 573934 574427 576312 579512 583298 586572 588832 590644 592974 596223 600001 603687
61214 603687 607018 610202 613561 617141 620639 623671 626107 628158 630200 632446 634722 636642 638137 639794
61200 639794 642404 646210 650905 656432 663400 672476 683668 696548 710872 726463 742464 757259 769390
61187 769390 778428 784863 789372 792418 794358 795530 796058 795744 794451 792539 790614 788763 786297 782537 777640
61172 777640 772304 766769 760582 753402 745705 738506 732530 727628 722739 716492 708229 698541 688491 678347
$$ packed form
61272E15847L085M272M468M004L585L291K703J912J620K179L086L719M075M543
61258E62389N338O402P497Q144P756O237M264K736J959J563J122P34Q99J831K897
61243F21768K980J565o25k346l056l184l330l661m044m341m457m368m242m224
61229E84435m080l406k192q23M93J885L200L786L274K260J812K330L249L778L686
61214F03687L331L184L359L580L498L032K436K051K042K246K276J920J495J657
61200F39794K610L806M695N527O968R076J1192J2880J4324J5591J6001J4795J2131
61187G69390R038O435M509L046J940J172N28l14j293j912j925j851k466l760m897
61172G77640n336n535o187p180p697p199n976m902m889o247q263r688j0050j0144
$$ plain form
61158 678347 667580 656134 645030 635318 627022 619603 613102 608211 605352 604195 604043 604287 604432 603998
61144 603998 602534 599731 595545 590153 583559 575402 565597 555219 546055 538962 533234 528004 523644 521085
61130 521085 520323 520474 521108 522652 525483 529456 534489 540905 548895 558186 568564 580260 593542 608216
61116 608216 623819 640131 657300 675702 695748 717577 740742 764306 787405 809656 831060
61105 831060 851713 871650 890773 908835 925501 940349 952697 961581 966173 966260 962250 954861 944900
61092 944900 933095 919811 905041 888865 871709 853946 835552 816562 797636 779638 762771
61081 762771 746567 730700 715350 700832 687339 675039 663970 653774 644016 634872 627120 621322
61069 621322 617341 614697 613001 612005 611622 612131 614046 617661 622855 629319 636655 644303 651833 659437 667769
$$ packed form
61158F78347j0767j1446j1104r712q296p419o501m891k859j157j52K44J45m34
61144F03998j464k803m186n392o594q157r805j0378r164p093n728n230m360k559
61130E21085p62J51O34J544K831L973N033O416P990R291J0378J1696J3282J4674
61116F08216J5603J6312J7169J8402K0046K1829K3165K3564K3099K2251K1404
61105H31060K0653J9937J9123J8062J6666J4848J2348Q884M592Q7m010p389r961
61092I44900j1805j3284j4770j6176j7156j7763j8394j8990j8926j7998j6867
61081G62771j6204j5867j5350j4518j3493j2300j1069j0196r758r144p752n798
61069F21322l981k644j696r96l83N09J915L615N194O464P336P648P530P604Q332
$$ plain form
61054 667769 677179 687421 698265 710024 723310 738469 755388 773650 792796 812648 833459 855631
61042 855631 879392 904922 932566 962425 993805 1025593 1057378 1089904 1124357 1161510 1201595
61031 1201595 1244575 1290296 1338531 1388947 1440976 1493910 1547435 1601929 1658068 1716417 1777867
61020 1777867 1844189 1917610 1999881 2092026 2194516 2307126 2429220 2561297 2706304 2868810
61010 2868810 3053518 3265832 3513542 3806537 4155309 4572328 5076128 5692859 6453725
61001 6453725 7393347 8550507 9961929 11639936 13540933 15546354 17474191 19121830
60993 19121830 20325584 21015328 21242202 21164197 20991111 20910143 21022410 21312580 21657162
60984 21657162 21864850 21737689 21137325 20033110 18508666 16722225 14844800 13012533
$$ packed form
61054F67769R410J0242J0844J1759J3286J5159J6919J8262J9146J9852K0811K2172
61042H55631K3761K5530K7644K9859L1380L1788L1785L2526L4453L7153M0085
61031A201595M2980M5721M8235N0416N2029N2934N3525N4494N6139N8349O1450
61020A777867O6322P3421Q2271R2145J02490J12610J22094J32077J45007J62506
61010B868810J84708K12314K47710K92995L48772M17019N03800O16731P60866
61001F453725R39622J157160J411422J678007J900997K005421J927837J647639
60993A9121830J203754O89744K26874p8005j73086q0968J12267K90170L44582
60984B1657162K07688j27161o00364j104215j524444j786441j877425j832267
$$ plain form
60976 13012533 11311961 9788637 8459577 7321500 6358243 5548929 4873175 4311783 3846357
60967 3846357 3460223 3139095 2870348 2642544 2446282 2274804 2123298 1988126 1866826
60958 1866826 1757930 1660207 1572525 1494452 1426024 1366471 1313977 1267064 1225267 1187882 1153007
60947 1153007 1118794 1085048 1052693 1022093 992902 965201 939590 915983 893270 870552 848082
60936 848082 826544 805908 785567 765404 746134 728396 711842 695450 678711 662203 646852
60925 646852 632949 620215 608622 598616 590466 583836 578170 573156 568626 564440 560751 558046 556507
60912 556507 555526 554185 552164 549902 548010 546812 546339 546473 547058 548093 549749 552038 554604 557039 559244
60897 559244 561223 562687 563239 562927 562234 561454 560417 558923 557079 554946 552107 547942 542296 535611 528356
$$ packed form
60976A3012533j700572j523324j329060j138077r63257q09314o75754n61392m65426
60967C846357l86134l21128k68747k27804j96262j71478j51506j35172j21300
60958A866826j08896r7723q7682p8073o8428n9553n2494m6913m1797l7385l4875
60947A153007l4213l3746l2355l0600k9191k7701k5611k3607k2713k2718k2470
60936H48082k1538k0636k0341k0163j9270j7738j6554j6392j6739j6508j5351
60925F46852j3903j2734j1593j0006q150o630n666n014m530m186l689k705j539
60912E56507r81j341k021k262j892j198m73J34N85J035J656K289K566K435K205
60897E59244J979J464N52l12o93p80j037j494j844k133k839m165n646o685p255
$$ plain form
60882 528356 520510 511738 501991 491841 482139 473373 465342 457546 449849 442656 436358 430770 425329 419845
60868 419845 414768 410612 407400 404926 403362 403137 404238 406059 408135 410625 413759 417190 420322 423051
60854 423051 425638 427943 429471 430358 431722 434552 438527 442376 445255 447385 449421 451625 453755 455397
60840 455397 456228 456162 455480 454704 454111 453401 452002 449700 446868 444053 441523 439291 437444 436211 435662 435500
60824 435500 435300 434914 434500 434137 433517 432183 430042 427507 425060 422743 420201 417192 413860 410447 406885
60809 406885 402886 398381 393710 389264 385049 380649 375687 370317 365234 361053 357659 354301 350432 346277
60795 346277 342445 339217 336482 334195 332502 331405 330691 330243 330111 330187 330121 329685 328964 328169 327570 327634 328755
60778 328755 330665 332566 334068 335554 337347 339079 340406 341886 344484 348354 352761 357068 361242 365433
$$ packed form
60882E28356p846q772r747j0150r702q766q031p796p697p193o298n588n441n484
60868D19845n077m156l212k474j564k25J101J821K076K490L134L431L132K729
60854D23051K587K305J528Q87J364K830L975L849K879K130K036K204K130J642
60840D55397Q31o6o82p76n93p10j399k302k832k815k530k232j847j233n49j62
60824D35500k00l86m14l63o20j334k141k535k447k317k542l009l332l413l562
60809D06885l999m505m671m446m215m400m962n370n083m181l394l358l869m155
60795C46277l832l228k735k287j693j097p14m48j32P6o6m36p21p95n99O4J121
60778C28755J910J901J502J486J793J732J327J480K598L870M407M307M174M191
$$ plain form
60764 365433 369682 374074 378574 382604 385335 386629 387230 387848 388445 388617 388213 387267 385693 383386 380480 377230
60748 377230 373894 370890 368793 367842 367674 367777 368012 368349 368302 367069 364270 360266 355722 351096 346590 342294
60732 342294 338209 334259 330477 327211 324950 323788 323121 322093 320461 318799 317670 316810 315531 313834 312575
60717 312575 312331 312546 312186 310984 309636 308838 308592 308538 308621 309166 310421 312302 314595 317229 320185 323308 326433
60700 326433 329652 333131 336594 339447 341677 344258 348094 352824 357293 361114 364926 368927 372018 373029
60686 373029 372274 371208 370845 371184 371969 373204 374787 376275 377358 378249 379342 380734 382202 383383 383883 383495
60670 383495 382535 381659 381124 380397 378764 376170 373188 370223 367100 363445 359211 354747 350569 347260 345389
60655 345389 345186 346246 347737 348985 349849 350568 351410 352537 353994 355673 357409 359248 361420 363810 365595
$$ packed form
60764C65433M249M392M500M030K731J294O01O18N97J72m04r46j574k307k906l250
60748C77230l336l004k097r51j68J03K35L37m7j233k799m004m544m626m506m296
60732C42294m085l950l782l266k261j162o67j028j632j662j129q60j279j697j259
60717C12575k44K15l60j202j348p98k46n4Q3N45J255J881K293K634K956L123L125
60700C26433L219L479L463K853K230K581L836M730M469L821L812M001L091J011
60686C73029p55j066l63L39P85J235J583J488J083Q91J093J392J468J181N00l88
60670C83495r60q76n35p27j633k594k982k965l123l655m234m464m178l309j871
60655C45389k03J060J491J248Q64P19Q42J127J457J679J736J839K172K390J785
$$ plain form
60640 365595 365847 364481 362259 359790 357019 353886 350922 348691 346966 345069 342907 341100 340091 339696 339678
60625 339678 340139 341023 341769 341878 341563 341404 341594 341920 342313 342906 343663 344425 345345 346754 348481 349787 350223 350157
60607 350157 350205 350485 350803 351201 351878 352702 353302 353654 354148 355045 356174 357228 358061 358626 358967 359360 360102 360973
60589 360973 361296 360833 360296 360526 361342 361689 360942 359584 358430 357663 357000 356518 356783 358121 360234 362766 365885
60572 365885 369945 374776 379801 384915 390784 398079 406763 416405 426830 438012 449480 460313 469631
60559 469631 476725 480800 481178 477950 472136 465099 458066 452082 447740 444699 442006 439266 437180 436659 437834
60544 437834 440286 443846 448637 454672 461961 470827 481582 494011 507669 522509 538582 555148 570655
60531 570655 583755 593931 601122 605274 606472 605076 601491 596048 589210 581584 573680 565921 558866 552960
$$ packed form
60640C65595K52j366k222k469k771l133k964k231j725j897k162j807j009l95j8
60625C39678M61Q84P46J09l15j59J90L26L93N93P57P62R20J409J727J306M36o6
60607C50157M8K80L18L98O77Q24O00L52M94Q97J129J054Q33N65L41L93P42Q71
60589C60973L23m63n37K30Q16L47p47j358j154p67o63m82K65J338K113K532L119
60572C65885M060M831N025N114N869P295Q684R642J0425J1182J1468J0833R318
60559D69631P094M075L78l228n814p037p033n984m342l041k693k740k086n21J175
60544D37834K452L560M791O035P289Q866J0755J2429J3658J4840J6073J6566J5507
60531E70655J3100J0176P191M152J198j396l585n443o838p626p904p759p055n906
$$ plain form
60517 552960 547967 543161 538264 533773 530189 527435 525394 524511 525297 527515 530418 533708 537810 543279 550421
60502 550421 559569 571350 586443 605225 627701 653641 682776 715020 750444 788804 829019 869407
60490 869407 908573 945946 981208 1013304 1040270 1060113 1071712 1074768 1069167 1054792 1032007 1001983
60478 1001983 966328 926625 884463 841585 799568 759437 721872 687525 656658 628626 602391
60467 602391 577709 555319 535791 518737 503473 489920 478386 468753 460418 452867 445872 439286
60455 439286 433108 427684 423401 420143 417343 414580 411842 409221 406728 404442 402514 400866 399172 397320
60441 397320 395691 394829 394959 395808 396685 396633 394916 391755 388473 386534 386303 386884 387194 386976 386632 386364 385866
60424 385866 384942 384077 384019 384815 385617 385596 384895 384447 384940 386201 387610 388840 390028 391368 392801 394122 395204
$$ packed form
60517E52960m993m806m897m491l584k754k041q83P86K218K903L290M102N469P142
60502E50421R148J1781J5093J8782K2476K5940K9135L2244L5424L8360M0215M0388
60490H69407L9166L7373L5262L2096K6966J9843J1599L056n601j4375k2785l0024
60478A001983l5655l9703m2162m2878m2017m0131l7565l4347l0867k8032k6235
60467F02391k4682k2390j9528j7054j5264j3553j1534r633q335p551o995o586
60455D39286o178n424m283l258k800k763k738k621k493k286j928j648j694j852
60441C97320j629q62J30Q49Q77n2j717l161l282j939k31N81L10k18l44k68m98
60424C85866r24q65n8P96Q02k1p01m48M93J261J409J230J188J340J433J321J082
$$ plain form
60407 395204 396062 396875 398056 400101 403070 406257 408697 410116 411219 412885 415221 417558 419274 420417 421602
60392 421602 423531 426531 430393 434520 438322 441544 444286 446789 449241 451652 453925 456159 458803 462133
60378 462133 465530 467841 468833 469837 472330 476201 480119 483455 486877 490890 494721 497244 498447 499282 500470
60363 500470 502094 504112 506514 508973 511034 512868 515384 519333 524693 531205 539159 549161 561248 574686
60349 574686 588693 602904 616917 629702 639929 646828 650321 650374 646719 639464 629552 618194 606058
60336 606058 593427 580929 569589 560030 552006 544859 538307 532719 528692 526260 524368 521471 517008
60323 517008 512062 508066 505100 502084 498563 495421 493645 493158 493355 494199 496258 500068 505977 514312 525162
60308 525162 538172 552961 569542 587906 607343 626575 644483 660404 673846 684222 690803 692734
$$ packed form
60407C95204Q58Q13J181K045K969L187K440J419J103J666K336K337J716J143J185
60392D21602J929L000L862M127L802L222K742K503K452K411K273K234K644L330
60378D62133L397K311R92J004K493L871L918L336L422M013L831K523J203Q35J188
60363E00470J624K018K402K459K061J834K516L949N360O512P954J0002J2087J3438
60349E74686J4007J4211J4013J2785J0227O899L493N3l655p255r912j1358j2136
60336F06058j2631j2498j1340r559q024p147o552n588m027k432j892k897m463
60323E17008m946l996k966l016l521l142j776m87J97Q44K059L810N909Q335J0850
60308E25162J3010J4789J6581J8364J9437J9232J7908J5921J3442J0376O581J931
$$ plain form
60296 692734 689316 680563 667364 650882 632048 611837 591592 572584 555464 540562 528358 519052
60284 519052 511912 505843 500610 496831 494669 493335 492101 491089 490570 490055 488704 486350 483509 480557 477490
60269 477490 474446 471792 469450 466679 462931 458620 454625 451235 448120 445196 442877 441280 439842 438158
60255 438158 436745 436348 436796 437194 437120 436948 437012 437165 437312 437725 438565 439767 441569 444495 448371 452024 454498
60238 454498 456019 457222 458021 457998 457397 456898 456654 456375 456196 456597 457570 458741 460330 463023 466654 469888 471633
60221 471633 472173 472534 473378 474972 477665 481684 486659 491867 496843 501493 505875 510330 515675 522727 531499
60206 531499 541069 550264 558420 565633 572565 579916 587820 595743 603161 610265 617691 625532 632974 639152
60192 639152 644100 648561 652880 656454 658337 658133 656182 653076 649235 644820 639842 634425 629080 624455
$$ packed form
60296F92734l418q753j3199j6482j8834k0211k0245j9008j7120j4902j2204r306
60284E19052p140o069n233l779k162j334j234j012n19n15j351k354k841k952l067
60269D77490l044k654k342k771l748m311l995l390l115k924k319j597j438j684
60255D38158j413l97M48L98p4j72O4J53J47M13Q40J202J802K926L876L653K474
60238D54498J521J203P99k3o01m99k44k79j79M01R73J171J589K693L631L234J745
60221D71633N40L61Q44J594K693M019M975N208M976M650M382M455N345P052Q772
60206E31499R570R195Q156P213O932P351P904P923P418P104P426P841P442O178
60192F39152M948M461M319L574J883k04j951l106l841m415m978n417n345m625
$$ plain form
60178 624455 620535 616317 610805 604257 597968 592788 588426 584250 580161 576401 572994 569756 566530 563124
60164 563124 559386 555561 552160 549262 546452 543698 541637 540548 539745 538603 537550 537233 537279 536807 535796
60149 535796 534934 534378 533776 533393 534049 535788 537667 539162 540839 543306 546455 550227 555260 562039 570001
60134 570001 578116 585950 593595 601050 608254 615468 622975 630512 637423 643266 647955 651503 653964 655522
60120 655522 656369 656589 656387 656272 656827 658388 660968 664247 667533 670163 672152 674120 676352 678297 679287 679426
60104 679426 679365 679446 679442 678957 677748 675758 673125 670130 666903 663281 659215 655221 652176 650625 650360 650655 650823
60087 650823 650645 650364 650276 650425 650796 651605 653081 655029 656961 658623 660035 661089 661556 661520 661224 660346 658010
60070 658010 653709 647693 640293 631490 621526 611268 601288 591117 580121 568848 558788 550907 544984
$$ packed form
60178F24455l920m218n512o548o289n180m362m176m089l760l407l238l226l406
60164E63124l738l825l401k898k810k754k061j089q03j142j053l17M6m72j011
60149E35796q62n56o02l83O56J739J879J495J677K467L149L772N033O779P962
60134E70001Q115P834P645P455P204P214P507P537O911N843M689L548K461J558
60120F55522Q47K20k02j15N55J561K580L279L286K630J989J968K232J945R90J39
60104F79426o1Q1mm85j209j990k633k995l227l622m066l994l045j551k65K95J68
60087F50823j78k81q8J49L71Q09J476J948J932J662J412J054M67l6k96q78k336
60070F58010m301o016p400q803r964j0258r980j0171j0996j1273j0060p881n923
$$ plain form
60057 544984 540287 536232 532332 528119 523489 518874 514952 512244 510891 510566 510689 511025 512015 514222 517578
60042 517578 521542 525950 531220 537525 544139 549975 554613 558525 562293 565896 568899 571128 572839 574216
60028 574216 575004 574858 573840 572269 570223 567523 564061 559795 554507 548030 540684 532994 525041 516637 508163
60013 508163 500478 493769 487228 480307 473620 467974 463114 458240 453405 449557 447301 446308 445949 445804 445456
59998 445456 444408 442538 440314 438375 437126 436806 437626 439618 442471 445638 448607 451157 453480 456054 459327
59983 459327 463553 468839 474992 481238 486515 490347 493120 495216 496290 495860 494270 492442 490785 488973
59969 488973 486803 484724 483312 482628 482358 482373 482963 484522 487029 489868 492363 494598 497447 501554 506498
59954 506498 511208 514916 517404 518669 518827 518216 517117 515434 512987 509936 506547 502809 498832 495358 493148
$$ packed form
60057E44984m697m055l900m213m630m615l922k708j353l25J23L36R90K207L356
60042E17578L964M408N270O305O614N836M638L912L768L603L003K229J711J377
60028E74216P88j46j018j571k046k700l462m266n288o477p346p690p953q404q474
60013E08163p685o709o541o921o687n646m860m874m835l848k256r93l59j45l48
59998D45456j048j870k224j939j249l20Q20J992K853L167K969K550K323K574L273
59983D59327M226N286O153O246N277L832K773K096J074m30j590j828j657j812
59969D88973k170k079j412o84k70J5N90J559K507K839K495K235K849M107M944
59954E06498M710L708K488J265J58o11j099j683k447l051l389l738l977l474k210
$$ plain form
59939 493148 491906 490525 488483 486335 484667 483245 481538 479537 477708 476478 476080 476525 477515 478737 480480
59924 480480 483514 488144 493807 499931 506617 514002 521389 527665 532367 535731 537854 538582 538277 538012 538625
59909 538625 540069 542006 544611 548270 552747 557237 561275 565057 568731 571867 574040 575577 577186 578924
59895 578924 580069 580114 579404 578636 578155 578122 578994 581325 585154 589985 595400 601318 607602 613755 619262 624162
59879 624162 629089 634653 640798 646819 652043 656386 660098 663183 665458 667116 668685 670199 670847 669813
59865 669813 667132 663419 659105 654426 649858 645993 643045 640802 638940 636980 634243 630513 626713 624425
59851 624425 624616 627186 631626 637573 644595 651933 658623 663666 666236 666173 664309 661837 659396 657134 655480
59836 655480 655008 655409 655286 653353 649374 643788 637077 629853 623005 617191 612404 608304 604630 601106 597500
$$ packed form
59939D93148j242j381k042k148j668j422j707k001j829j230l98M45R90J222J743
59924D80480L034M630N663O124O686P385P387O276M702L364K123P28l05k65O13
59909E38625J444J937K605L659M477M490M038L782L674L136K173J537J609J738
59895E78924J145M5p10p68m81l3Q72K331L829M831N415N918O284O153N507M900
59879F24162M927N564O145O021N224M343L712L085K275J658J569J514O48j034
59865F69813k681l713m314m679m568l865k948k243j862j960k737l730l800k288
59851F24425J91K570M440N947P022P338O690N043K570o3j864k472k441k262j654
59836F55480m72M01j23j933l979n586o711p224o848n814m787m100l674l524l606
$$ plain form
59821 597500 594128 591726 590365 588988 586545 583095 579217 574906 569903 564777 560626 557697 555134 552111
59807 552111 548421 543944 538585 533112 529079 527163 526223 524785 522991 522233 523143 524817 526045 526431 526099
59792 526099 525104 523668 522501 522282 522931 523790 524405 524799 525087 525292 525544 526108 527006 527786 527841 526920 525318 523676
59774 523676 522584 522252 522554 523416 525047 527601 530733 533804 536529 539111 541702 544073 546034 547909 550301
59759 550301 553535 557516 562022 566874 571884 576910 582066 587777 594571 602759 612237 622603 633526 644949
59745 644949 656822 668771 680337 691512 702641 713680 723864 732323 738733 743234 746046 747441
59733 747441 747803 747383 746158 744120 741490 738412 734789 730714 726763 723393 720246 716489 711698 706072 699926
59718 699926 693516 687250 681539 676260 670787 664719 658329 652191 646629 641714 637599 634656 633192 633023
$$ packed form
59821E97500l372k402j361j377k443l450l878m311n003n126m151k929k563l023
59807E52111l690m477n359n473m033j916r40j438j794p58R10J674J228L86l32
59792E26099r95j436j167k19O49Q59O15L94K88K05K52N64Q98P80N5r21j602j642
59774E23676j092l32L02Q62J631K554L132L071K725K582K591K371J961J875K392
59759E50301L234L981M506M852N010N026N156N711O794Q188R478J0366J0923J1423
59745F44949J1873J1949J1566J1175J1129J1039J0184Q459O410M501K812J395
59733G47441L62m20j225k038k630l078l623m075l951l370l147l757m791n626o146
59718F99926o410o266n711n279n473o068o390o138n562m915m115k943j464j69
$$ plain form
59704 633023 633418 633627 633526 633529 633905 634531 635417 636947 639308 642110 645013 648339 652511 657129 661203 664169
59688 664169 666138 667254 667349 666259 664013 660746 656818 652995 650027 648023 646497 644881 642606 638907 633296
59673 633296 626282 619163 612970 607917 603714 599909 595940 591464 586795 582637 579392 577038 575490 574578
59659 574578 573816 572847 572065 572180 573210 574621 576400 579227 583454 588698 594574 600990 607420 612700 616006
59644 616006 617457 617448 616051 613398 609936 605778 600454 593819 586680 579994 573968 568446 563603 559623 556121
59629 556121 552629 549352 546795 544828 542716 539959 536658 533176 529853 526847 523866 520223 515578 510480
59615 510480 505841 502045 498875 496059 493548 491465 490089 489573 489401 488567 486816 485315 485436 487068 488797
59600 488797 489659 490042 490819 492229 493852 495244 496333 497393 498806 500691 502750 504644 506416 508340 510363
$$ packed form
59704F33023L95K09j01LL76O26Q86J530K361K802K903L326M172M618M074K966
59688F64169J969J116R5j090k246l267l928l823k968k004j526j616k275l699n611
59673F33296p014p119o193n053m203l805l969m476m669m158l245k354j548r12
59659E74578p62r69p82J15J030J411J779K827M227N244N876O416O430N280L306
59644F16006J451rj397k653l462m158n324o635p139o686o026n522m843l980l502
59629E56121l492l277k557j967k112k757l301l482l323l006k981l643m645n098
59615E10480m639l796l170k816k511k083j376n16j72q34j751j501J21J632J729
59600D88797Q62L83P77J410J623J392J089J060J413J885K059J894J772J924K023
$$ plain form
59585 510363 511973 512647 512273 511127 509647 508256 507194 506398 505523 504133 502036 499553 497308 495544 493766
59570 493766 491433 488870 486979 485986 485084 483518 481477 479607 478168 477071 476277 475690 475001 474111 473393 473132
59554 473132 473051 472902 473102 474151 475712 476964 477804 478933 480765 482888 484858 487031 490309 495324 502075
59539 502075 510245 519855 531683 546859 565615 586323 605946 621529 631366 635195 633832 628729 621535
59526 621535 613853 607195 602759 600841 600590 600710 600541 600409 601028 602698 604869 606288 605690 602647 597703 591602
59510 591602 584608 576658 567892 558747 549711 541278 533960 528020 523226 519032 514947 510731 506474 502605
59496 502605 499476 496857 494207 491579 489729 489013 488718 488007 487119 487040 488253 490366 492765 495085 497202 499304
59480 499304 501898 505330 509320 513383 517595 522559 528736 536138 544464 553028 560689 566350 569664 571060
$$ packed form
59585E10363J610O74l74j146j480j391j062p96q75j390k097k483k245j764j778
59570D93766k333k563j891r93r02j566k041j870j439j097p94n87o89q90p18k61
59554D73132q1j49K00J049J561J252Q40J129J832K123J970K173L278N015O751
59539E02075Q170R610J1828J5176J8756K0708J9623J5583R837L829j363n103p194
59526F21535p682o658m436j918k51J20j69j32O19J670K171J419n98l043m944o101
59510E91602o994p950q766r145r036q433p318n940m794m194m085m216m257l869
59496E02605l129k619k650k628j850p16k95p11q88p9J213K113K399K320K117K102
59480D99304K594L432L990M063M212M964O177P402Q326Q564P661N661L314J396
$$ plain form
59466 571060 571241 570889 570584 570481 570167 569236 567979 567224 567629 569387 572359 576143 580273 584735 590069 596623
59450 596623 604027 611782 619928 628589 637210 644926 651402 656638 660156 661146 659322 655069 648923 641617
59436 641617 634399 628412 623658 619254 614720 610345 606328 602358 598210 594053 590044 586276 583323 582224
59422 582224 583682 587671 593817 601683 610738 620762 632297 646134 662402 680899 702188 727189
59410 727189 755290 783682 808895 828272 839840 842188 835606 822849 807794 793476 781833 774639
59398 774639 773533 778850 788833 800080 808686 811438 806767 795009 777852 757558 736470 716563 698948
59385 698948 683823 671026 660528 652432 646840 643791 642964 643414 644086 644818 646444 649713 654462 659987
59371 659987 665692 671122 675872 679880 683488 686843 689596 691506 693028 694812 696900 698826 700398 702013
$$ packed form
59466E71060J81l52l05j03l14r31j257p55M05J758K972L784M130M462N334O554
59450E96623P404P755Q146Q661Q621P716O476N236L518R90j824m253o146p306
59436F41617p218n987m754m404m534m375m017l970m148m157m009l768k953j099
59422E82224J458L989O146P866R055J0024J1535J3837J6268J8497K1289K5001
59410G27189K8101K8392K5213J9377J1568K348o582j2757j5055j4318j1643p194
59398G74639j106N317R983J1247Q606K752m671j1758j7157k0294k1088j9907j7615
59385F98948j5125j2797j0498q096n592l049q27M50O72P32J626L269M749N525
59371F59987N705N430M750M008L608L355K753J910J522J784K088J926J572J615
$$ plain form
59357 702013 704218 707247 710956 715056 719395 724074 729250 734925 741186 748556 757692 768629 780645 792998
59343 792998 805488 818261 831360 844556 857257 868608 878097 886070 893079 898729 901805 901745 899262
59330 899262 895183 889377 881376 871484 860628 849476 838268 827251 816724 806827 797707 789651 782649
59317 782649 776115 769530 763143 757561 752789 748172 743170 737729 731980 726071 720337 715262 711248 708705
59303 708705 708309 710805 716490 725073 735827 747420 757595 763577 763341 756641 744840 729827 713049
59290 713049 695338 677393 660156 644580 631128 619742 610323 603002 597907 594890 593555 593416 594015
59277 594015 595154 597073 600191 604657 610514 618175 628165 640154 652840 665260 677877 691874 707464
59264 707464 723296 737436 748632 756688 762023 765026 765766 764150 760224 754218 746430 737289 727499 717845
$$ packed form
59357G02013K205L029L709M100M339M679N176N675O261P370R136J0937J2016J2353
59343G92998J2490J2773J3099J3196J2701J1351R489P973P009N650L076o0k483
59330H99262m079n806q001r892j0856j1152j1208j1017j0527r897r120q056p002
59317G82649o534o585o387n582m772m617n002n441n749n909n734n075m014k543
59303G08705l96K496N685Q583J0754J1593J0175N982k36o700j1801j5013j6778
59290G13049j7711j7945j7237j5576j3452j1386r419p321n095l017j335j39N99
59277E94015J139J919L118M466N857P661R990J1989J2686J2420J2617J3997J5590
59264G07464J5832J4140J1196Q056N335L003P40j616l926o006p788r141r790r654
$$ plain form
59250 717845 708882 701000 694618 689959 686735 684558 683564 684042 685482 686736 687357 688110 689862 692637 696095
59235 696095 700187 704782 709208 712873 715955 718886 721490 723229 723996 724072 723571 722496 721064 719366 716891
59220 716891 713046 707997 702431 696674 690734 685044 680285 676323 672121 666992 661369 655995 650922 645731
59206 645731 640296 634872 629681 624883 620799 617698 615345 613161 610922 609005 607764 606963 606162 605500 605657
59191 605657 606930 608785 610573 612280 614211 616261 618179 620393 623877 629023 635209 641632 648085 654704
59177 654704 661565 668791 676512 684261 690953 696043 700329 705042 710454 715957 721245 726683 732517 738416
59163 738416 743924 748878 753117 756171 757541 757139 755230 751995 747284 740855 732804 723635 713792 703323
59149 703323 692261 681184 670880 661396 651952 642092 632396 623682 615893 608365 600926 594096 588233
$$ packed form
59250G17845q963p882o382m659l224k177r94M78J440J254O21P53J752K775L458
59235F96095M092M595M426L665L082K931K604J739P67P6n01j075j432j698k475
59220G16891l845n049n566n757n940n690m759l962m202n129n623n374n073n191
59206F45731n435n424n191m798m084l101k353k184k239j917j241q01q01o62J57
59191F05657J273J855J788J707J931K050J918K214L484N146O186O423O453O619
59177F54704O861P226P721P749O692N090M286M713N412N503N288N438N834N899
59163G38416N508M954M239L054J370m02j909l235m711o429q051r169r843j0469
59149G03323j1062j1077j0304r484r444r860r696q714p789p528p439o830n863
$$ plain form
59136 588233 582984 577786 572571 567791 563889 560839 558238 555866 554157 553955 555707 559022 563039 567072
59122 567072 570945 575041 580127 586814 595012 604110 613689 623727 634093 644343 654239 663987 673682
59109 673682 682972 691584 699672 707278 713854 718915 722828 726434 730064 733413 736180 738275 739480 739422 738017
59094 738017 735673 733028 730674 728985 727965 727273 726593 725937 725487 725276 725159 724854 723872 721609 717774 712637
59078 712637 706710 700318 693470 686003 677824 669239 660906 653166 645599 637772 630223 623969 619039 614372
59064 614372 609311 604298 599800 595533 591214 587184 583626 579986 575860 571763 568290 565224 562217 559661
59050 559661 557970 556619 554876 552943 551444 550285 549029 547975 547729 548089 548442 548998 550421 552430 553974
59035 553974 554832 555853 557560 559616 561878 564856 568804 573347 578454 584870 593161 603096 614406 627401
$$ packed form
59136E88233n249n198n215m780l902l050k601k372j709k02J752L315M017M033
59122E67072L873M096N086O687Q198R098R579J0038J0366J0250R896R748R695
59109F73682R290Q612Q088P606O576N061L913L606L630L349K767K095J205n8j405
59094G38017k344k645k354j689j020o92o80o56m50k11j17l05r82k263l835n137
59078G12637n927o392o848p467q179q585q333p740p567p827p549o254m930m667
59064F14372n061n013m498m267m319m030l558l640m126m097l473l066l007k556
59050E59661j691j351j743j933j499j159j256j054k46L60L53N56J423K009J544
59035E53974Q58J021J707K056K262K978L948M543N107O416Q291R935J1310J2995
$$ plain form
59021 627401 642313 658650 675748 693443 711638 729593 746111 760238 771426 779290 783558 784174
59009 784174 781292 775304 766985 757392 747512 738086 729739 723060 718484 716167 715847 716775 718063 719363 720937
58994 720937 722853 724487 725193 725038 724362 723037 720738 717647 714194 710370 705947 701144 696408 691738 687008
58979 687008 682798 680155 679508 680446 682462 685320 688814 692941 698218 705102 713115 721262 729277 737823 747539
58964 747539 758581 770847 783731 795733 805315 812369 818033 823002 826780 828611 828205 825347 819716
58951 819716 811465 801299 789737 776887 763043 748780 734422 720157 706773 695357 686082 678108
58939 678108 670881 664702 659875 656234 653725 652494 652095 651610 650945 651021 652198 653508 654074 654316 654982 655798
58923 655798 656011 655668 655393 655181 654210 651761 647935 643589 639864 637357 635491 633138 630087 627430 626224
$$ packed form
59021F27401J4912J6337J7098J7695J8195J7955J6518J4127J1188P864M268O16
59009G84174k882n988q319r593r880r426q347o679m576k317l20R28J288J300J574
58994G20937J916J634P06j55o76j325k299l091l453l824m423m803m736m670m730
58979F87008m210k643o47R38K016K858L494M127N277O884Q013Q147Q015Q546R716
58964G47539J1042J2266J2884J2002R582P054N664M969L778J831m06k858n631
58951H19716q251j0166j1562j2850j3844j4263j4358j4265j3384j1416r275p974
58939F78108p227o179m827l641k509j231l99m85o65P6J177J310N66K42O66Q16
58923F55798K13l43k75k12r71k449l826m346l725k507j866k353l051k657j206
$$ plain form
58908 626224 626392 627276 628691 630965 634496 639711 646949 655978 666050 676799 688515 701231 714176
58895 714176 726599 738458 749810 760212 769464 778421 788259 799285 811124 823792 837767 853019
58883 853019 868517 882795 894806 904422 912357 919412 925595 930177 932616 932948 931185 926984 920343 912108
58869 912108 903339 894572 886027 878065 870993 864777 859340 854722 850596 846095 840570 834202 827510 820659
58855 820659 813588 806333 798712 790172 780520 770518 761246 753097 745842 739408 733984 729446 725118 720195
58841 720195 714256 707413 700036 692220 683592 673862 663422 652983 642757 632573 622743 614067 606841
58828 606841 600586 594888 589846 585541 581848 579030 577658 577564 577758 577840 578672 581031 584388 587737 590994 594722
58812 594722 598900 602794 605820 607949 609445 610677 611989 613393 614546 615236 615564 615503 614774 613313 611346
$$ packed form
58908F26224J68Q84J415K274L531N215P238R029J0072J0749J1716J2716J2945
58895G14176J2423J1859J1352J0402R252Q957R838J1026J1839J2668J3975J5252
58883H53019J5498J4278J2011R616P935P055O183M582K439L32j763m201o641q235
58869I12108q769q767q545p962p072o216n437m618m126m501n525o368o692o851
58855H20659p071p255p621q540r652j0002r272q149p255o434n424m538m328m923
58841G20195n939o843p377p816q628r730j0440j0439j0226j0184r830q676p226
58828F06841o255n698n042m305l693k818j372r4J94Q2Q32K359L357L349L257L728
58812E94722M178L894L026K129J496J232J312J404J153O90L28o1p29j461j967
$$ plain form
58797 611346 608837 605544 601792 598377 595283 591362 585845 579572 574136 570354 568025 566585 565524 564669
58783 564669 564477 565544 567641 569903 572192 575340 579739 584734 589841 595407 601403 606686 610269 612280
58769 612280 612877 611420 607766 603248 599034 594469 588443 581556 575373 570166 565034 559971 556236 554721
58755 554721 555221 557183 559997 562689 564623 566454 569244 572667 575286 576554 577306 578208 579046 579883 581622
58740 581622 584811 588786 592660 596497 600997 606479 612682 619234 625880 632324 638153 643063 647271 651574
58726 651574 656599 661930 666519 670111 673574 677472 681168 683973 686453 689740 694140 699314 705324 712554
58712 712554 720864 729620 738328 746563 753640 759030 762681 764320 763031 758338 751056 742199 731643 718858
58698 718858 704258 688592 671602 652745 632896 613847 596239 579386 563240 549078 537929
$$ packed form
58797F11346k509l293l752l415l094l921n517o273n436l782k329j440j061q55
58783E64669j92J067K097K262K289L148M399M995N107N566N996N283L583K011
58769F12280N97j457l654m518m214m565o026o887o183n207n132n063l735j515
58755E54721N00J962K814K692J934J831K790L423K619J268P52R02Q38Q37J739
58740E81622L189L975L874L837M500N482O203O552O646O444N829M910M208M303
58726F51574N025N331M589L592L463L898L696K805K480L287M400N174O010P230
58712G12554Q310Q756Q708Q235P077N390L651J639j289m693p282q857j0556j2785
58698G18858j4600j5666j6990j8857j9849j9049j7608j6853j6146j4162j1149
$$ plain form
58687 537929 529386 522260 515596 508915 502355 496711 492598 489566 486687 483807 481399 479496 477781 476472
58673 476472 476007 475980 475603 475111 475528 477100 479222 482017 486615 493566 502100 511312 520993 530876 540009 547331
58657 547331 552218 554328 553662 550885 546818 541599 535169 528440 522782 518310 513854 508836 504028 500212
58643 500212 497271 494929 493179 491515 488937 485366 482063 480061 479106 478806 479800 482822 487233 491387 494194
58628 494194 495718 496492 496809 496608 495774 494582 493770 493845 494441 494833 494944 495308 496185 497431 499122 501480 504173
58611 504173 506498 508397 510583 513614 517496 522112 527230 532145 536243 539917 543974 548089 550884 551724
58597 551724 551411 550864 550108 548931 547590 546403 545427 544943 545568 547530 550488 554343 559587 566623 575341 585500
58581 585500 596807 608487 619538 629618 639039 647890 655976 663657 671707 680081 687760 694174 700022
$$ packed form
58687E37929q543p126o664o681o560n644m113l032k879k880k408j903j715j309
58673D76472m65k7l77m92M17J572K122K795M598O951Q534R212R681R883R133P322
58657E47331M887K110o66k777m067n219o430o729n658m472m456n018m808l816
58643E00212k941k342j750j664k578l571l303k002r55l00R94L022M411M154K807
58628D94194J524P74L17k01q34j192q12P5N96L92J11L64Q77J246J691K358K693
58611E04173K325J899K186L031L882M616N118M915M098L674M057M115K795Q40
58597E51724l13n47p56j177j341j187r76m84O25J962K958L855N244P036Q718J0159
58581E85500J1307J1680J1051J0080R421Q851Q086P681Q050Q374P679O414N848
$$ plain form
58568 700022 706470 714329 724304 737170 753272 772402 794356 818972 845558 873072 901015 929368
58556 929368 957491 983846 1006918 1025664 1039110 1046551 1048438 1046296 1041514 1034843 1026989 1018786 1010633
58543 1010633 1002515 994510 986421 977082 965087 950170 932862 913043 890229 865290 840381 816884
58531 816884 794651 773509 754120 736923 721550 707787 696050 686479 678577 671990 666592 661688
58519 661688 656451 651382 647870 645946 643915 640696 637079 634083 631503 628878 626542 624846 623377 621748
58505 621748 620203 618889 617524 616311 616036 616663 616967 616178 614947 614174 613993 614475 616112 618897 621977 624754
58489 624754 627395 629963 632300 635167 640048 647227 655410 663817 673258 684519 697287 711444 727821
58476 727821 746640 766466 785702 803846 820436 834105 843719 849300 851036 848691 842835 835205 826805
$$ packed form
58568G00022O448P859R975J2866J6102J9130K1954K4616K6586K7514K7943K8353
58556I29368K8123K6355K3072J8746J3446P441J887k142m782o671p854q203q153
58543A010633q118q005q089r339j1995j4917j7308j9819k2814k4939k4909k3497
58531H16884k2233k1142j9389j7197j5373j3763j1737r571p902o587n398m904
58519F61688n237n069l512j924k031l219l617k996k580k625k336j696j469j629
58505F21748j545j314j365j213k75O27L04p89j231p73j81M82J637K785L080K777
58489F24754K641K568K337K867M881P179Q183Q407R441J1261J2768J4157J6377
58476G27821J8819J9826J9236J8144J6590J3669R614N581J736k345n856p630q400
$$ plain form
58463 826805 817052 805821 794917 786320 780315 776542 775539 777816 782548 788658 796334 806297 818403
58450 818403 831860 845764 858526 868015 873363 875473 874873 870555 862082 851235 840037 828497 815869
58437 815869 802968 791562 782407 775357 770486 767664 765993 765068 765925 769387 774477 779799 785476 792303
58423 792303 800067 808226 817216 827422 837700 846458 853369 858477 860549 858158 851841 843593 834647 825140
58409 825140 815388 805974 796927 788115 780086 773476 767984 762873 757954 753394 749367 746573 745983 747318
58395 747318 749013 750567 753398 758361 764101 769194 774141 779546 784064 786271 787231 789011 791715 794080
58381 794080 796099 798869 802489 806152 809880 814394 819673 825180 830915 836856 842152 846346 850572 856093
58367 856093 862508 868867 875537 883377 892115 901173 911126 922725 935425 948478 962345 977330 991906
$$ packed form
58463H26805r753j1231j0904q597o005l773j003K277M732O110P676R963J2106
58450H18403J3457J3904J2762R489N348K110o00m318q473j0847j1198j1540j2628
58437H15869j2901j1406r155p050m871k822j671r25Q57L462N090N322N677O827
58423G92303P764Q159Q990J0206J0278Q758O911N108K072k391o317q248q946r507
58409H25140r752r414r047q812q029o610n492n111m919m560m027k794n90J335
58395G47318J695J554K831M963N740N093M947N405M518K207R60J780K704K365
58381G94080K019K770L620L663L728M514N279N507N735N941N296M194M226N521
58367H56093O415O359O670P840Q738R058R953J1599J2700J3053J3867J4985J4576
$$ plain form
58354 991906 1004153 1013841 1021579 1027200 1030741 1033582 1036590 1038460 1037911 1036326 1036091 1037639 1040286 1044657
58340 1044657 1051782 1060898 1070586 1081190 1093808 1107835 1121832 1135925 1151098 1167055 1182956 1199261
58328 1199261 1216598 1233862 1249648 1264390 1278832 1291707 1301411 1308710 1315247 1320706 1324136 1326780
58316 1326780 1330654 1335464 1339806 1344277 1350433 1357717 1364478 1371164 1379574 1389854 1401009 1413345 1427510
58303 1427510 1442321 1456541 1471608 1489524 1509296 1528669 1547924 1568518 1589364 1608262 1625880
58292 1625880 1644555 1664267 1683627 1703639 1726279 1750322 1772970 1794910 1819471 1847223 1875709
58281 1875709 1904077 1933685 1964324 1994109 2023098 2053119 2084231 2115200 2147047 2182208 2220603
58270 2220603 2260422 2302115 2347497 2395695 2444344 2494128 2547744 2605160 2664374 2725993 2792189
$$ packed form
58354I91906J2247R688P738N621L541K841L008J870n49j585k35J548K647M371
58340A044657P125R116R688J0604J2618J4027J3997J4093J5173J5957J5901J6305
58328A199261J7337J7264J5786J4742J4442J2875R704P299O537N459L430K644
58316A326780L874M810M342M471O156P284O761O686Q410J0280J1155J2336J4165
58303A427510J4811J4220J5067J7916J9772J9373J9255K0594K0846J8898J7618
58292A625880J8675J9712J9360K0012K2640K4043K2648K1940K4561K7752K8486
58281A875709K8368K9608L0639K9785K8989L0021L1112L0969L1847L5161L8395
58270B220603L9819M1693M5382M8198M8649M9784N3616N7416N9214O1619O6196
$$ plain form
58259 2792189 2861919 2932131 3002973 3076792 3152823 3228159 3303185 3380683 3460335 3539817 3620543
58248 3620543 3706458 3797800 3892022 3990067 4095467 4207982 4324695 4446737 4578200 4719074
58238 4719074 4866271 5020936 5187329 5365127 5550650 5745289 5954685 6179874 6417617
58229 6417617 6669182 6940159 7231799 7541633 7872552 8231931 8621839 9039802 9489017
58220 9489017 9977473 10507415 11077016 11692568 12367277 13107980 13915619 14799009 15774711
58211 15774711 16853114 18039498 19350001 20811676 22446348 24271293 26317136 28627859
58203 28627859 31243587 34205312 37580571 41466198 45969271 51215981 57388009 64731797
58195 64731797 73544655 84202702 97222514 113271245 133119496 157595275 187436588
$$ packed form
58259B792189O9730P0212P0842P3819P6031P5336P5026P7498P9652P9482Q0726
58248C620543Q5915R1342R4222R8045J05400J12515J16713J22042J31463J40874
58238D719074J47197J54665J66393J77798J85523J94639K09396K25189K37743
58229F417617K51565K70977K91640L09834L30919L59379L89908M17963M49215
58220I489017M88456N29942N69601O15552O74709P40703Q07639Q83390R75702
58211A5774711J078403J186384J310503J461675J634672J824945K045843K310723
58203B8627859K615728K961725L375259L885627M503073N246710O172028P343788
58195F4731797Q812858J0658047J3019812J6048731J9848251K4475779K9841313
$$ plain form
58188 187436588 222817320 262631495 304098590 343177890 375597769 397843912 407728637
58181 407728637 404648720 389646897 365133581 334217432 299965038 264961990 231190229
58174 231190229 200003419 172125369 147757757 126786794 108949613 93901089 81254040
58167 81254040 70637076 61726012 54231318 47891936 42495903 37885952 33934313 30526734
58159 30526734 27572649 25007901 22776177 20820031 19093403 17566520 16211854 14997993
58151 14997993 13901741 12912966 12022114 11214101 10478291 9812616 9212925 8668284 8170636
58142 8170636 7719061 7310536 6935841 6588183 6266867 5969069 5686989 5416785 5161982
58133 5161982 4924526 4700385 4487152 4287930 4104054 3931484 3767838 3615839 3476340
$$ packed form
58188A87436588L5380732L9814175M1467095L9079300L2419879K2246143R884725
58181D07728637l079917j5001823k4513316l0916149l4252394l5003048l3771761
58174B31190229l1186810k7878050k4367612k0970963j7837181j5048524j2647049
58167H1254040j0616964q911064p494694o339382n396033m609951l951639l407579
58159C0526734k954085k564748k231724j956146j726628j526883j354666j213861
58151A4997993j096252r88775q90852q08013p35810o65675n99691n44641m97648
58142H170636m51575m08525l74695l47658l21316k97798k82080k70204k54803
58133E161982k37456k24141k13233j99222j83876j72570j63646j51999j39499
$$ plain form
58124 3476340 3344901 3218821 3101014 2993446 2892915 2796736 2706591 2623327 2543701 2465684
58114 2465684 2391656 2323098 2257308 2192467 2130922 2074336 2020361 1967095 1916202 1868711 1822282
58103 1822282 1775521 1730582 1688675 1647295 1604761 1563274 1524624 1486849 1448140 1410274 1375336
58092 1375336 1342475 1310640 1281155 1255017 1230809 1207619 1186862 1169008 1151730 1133520 1115945
58081 1115945 1100186 1084501 1067293 1049682 1032944 1016324 999294 982947 967335 950543 932207
58070 932207 914803 899589 884551 868330 852774 839423 826779 813462 801001 790941 781983 772475
58058 772475 763105 754830 746691 737937 729722 722492 714277 703850 693082 683933 675583 666786 658477 651657
58044 651657 645156 637985 631618 627411 623927 619340 614415 610584 607048 602361 597178 592848 588756 583424
$$ packed form
58124C476340j31439j26080j17807j07568j00531r6179r0145q3264p9626p8017
58114B465684p4028o8558o5790o4841o1545n6586n3975n3266n0893m7491m6429
58103A822282m6761m4939m1907m1380m2534m1487l8650l7775l8709l7866l4938
58092A375336l2861l1835k9485k6138k4208k3190k0757j7854j7278j8210j7575
58081A115945j5759j5685j7208j7611j6738j6620j7030j6347j5612j6792j8336
58070I32207j7404j5214j5038j6221j5556j3351j2644j3317j2461j0060q958r508
58058G72475r370q275q139q754q215p230q215j0427j0768r149q350q797q309o820
58044F51657o501p171o367m207l484m587m925l831l536m687n183m330m092n332
$$ plain form
58030 583424 576856 569697 561523 552012 542348 533486 524475 514384 504350 495798 488207 480594 473626 468239
58016 468239 463644 458695 453891 450075 446546 442379 438282 435263 432775 429972 427497 426177 425228 423565
58002 423565 421660 420434 419642 418935 419022 420053 420428 419072 417414 417118 417361 416399 414471 412921 411681 409858
57986 409858 407839 406644 405992 404931 403589 402511 401168 398882 396280 394085 391543 387851 384032 381435
57972 381435 379508 377107 374947 374454 375015 374734 373367 372278 371860 371188 370030 369202 369018 369181 370060 372314
57956 372314 375259 377162 377140 375536 372765 369177 365760 363446 361903 360264 358752 358237 358560 358761 358804 359660
57940 359660 361771 364638 367890 371771 376617 382717 390400 399488 409022 418243 427231 435813 442688 446656
57926 446656 448028 447705 445650 441365 435164 427791 419431 410226 401045 392523 384113 375277 366904 360230
$$ packed form
58030E83424o568p159q174r511r664q862r011j0091j0034q552p591p613o968n387
58016D68239m595m949m804l816l529m167m097l019k488k803k475j320r49j663
58002D23565j905j226p92p07Q7J031L75j356j658k96K43r62j928j550j240j823
57986D09858k019j195o52j061j342j078j343k286k602k195k542l692l819k597
57972C81435j927k401k160m93N61k81j367j089m18o72j158q28j84J63Q79K254
57956C72314K945J903k2j604k771l588l417k314j543j639j512n15L23K01M3Q56
57940C59660K111K867L252L881M846O100P683R088R534R221Q988Q582O875L968
57926D46656J372l23k055m285o201p373q360r205r181q522q410q836q373o674
$$ plain form
57912 360230 355044 350309 345889 342319 339510 337078 335414 335025 335290 335248 335117 335741 337003 338143 339178 340679
57896 340679 342552 344318 346215 348738 351514 353848 356017 358849 362432 366337 370572 375163 379342 382371
57882 382371 384622 386686 388103 388180 387355 386357 384736 381678 377590 373383 368811 363183 357140 352027 347913
57867 347913 343918 340063 337111 334913 332665 330659 330074 331154 333126 335749 339362 343588 347675 351999
57853 351999 357590 364208 370494 376031 381572 387188 391897 395316 398064 400289 401331 401169 400667 400089 398808
57838 398808 396848 395247 394388 393306 391205 388511 385874 383174 380037 376478 372685 368930 365882 364179
57824 364179 363546 363124 362678 362584 362773 362765 362765 363596 365368 367171 368130 367848 365862 361771 355960 349261 341903 333735
57806 333735 325218 317028 308896 300190 291600 284851 280637 278076 276312 275278 274705 273746 272032 270061 268288
$$ packed form
57912C60230n186m735m420l570k809k432j664l89K65m2j31O24J262J140J035J501
57896C40679J873J766J897K523K776K334K169K832L583L905M235M591M179L029
57882C82371K251K064J417P7q25r98j621l058m088m207m572n628o043n113m114
57867C47913l995l855k952k198k248k006n85J080J972K623L613M226M087M324
57853C51999N591O618O286N537N541N616M709L419K748K225J042j62n02n78j281
57838C98808j960j601q59j082k101k694k637k700l137l559l793l755l048j703
57824C64179o33m22m46r4J89q%Q31J772J803R59k82j986m091n811o699p358q168
57806C33735q517q190q132q706q590o749m214k561j764j034n73r59j714j971j773
$$ plain form
57791 268288 266825 266093 266677 268370 270386 272537 275116 277822 280129 282710 286934 292814 298913 304567 310733
57776 310733 318244 326647 335166 343446 350886 356631 360788 364405 367667 369405 368966 367297 365531 363656
57762 363656 361278 358620 356008 353288 350419 347774 345370 342712 339862 337638 336304 335057 333336 331625
57748 331625 330420 329463 328595 328263 328595 328904 328788 328717 328928 328690 327374 325384 323398 321512 319769 318640 318358
57731 318358 318563 319095 320264 321774 322468 321861 321045 321339 322849 324961 327390 329982 332325 334295 336330 338570
57715 338570 340486 341861 343210 344677 345505 345317 344861 344671 344018 342109 339364 336445 333014 328668 324320
57700 324320 321277 319459 317831 316219 315404 315592 315937 315644 314605 312948 310758 308310 305942 303673 301373
57685 301373 299201 297396 295867 294494 293662 294040 295994 299546 304714 311552 320209 331288 345937 365377
$$ packed form
57791B68288j463p32N84J693K016K151K579K706K307K581M224N880O099N654O166
57776C10733P511Q403Q519Q280P440N745M157L617L262J738m39j669j766j875
57762C63656k378k658k612k720k869k645k404k658k850k224j334j247j721j711
57748C31625j205r57q68l32L32L09j16p1K11k38j316j990j986j886j743j129k82
57731C18358K05N32J169J510O94o07q16K94J510K112K429K592K343J970K035K240
57715C38570J916J375J349J467Q28j88m56j90o53j909k745k919l431m346m348
57700C24320l043j818j628j612q15J88L45k93j039j657k190k448k368k269k300
57685C01373k172j805j529j373q32L78J954L552N168O838Q657J1079J4649J9440
$$ plain form
57671 365377 390727 423454 465335 517355 578666 646388 715555 779035 828774 858440 865258 849788
57659 849788 815062 766296 710040 652090 596064 544031 497574 457567 423756 395504 372559
57648 372559 354524 340284 328751 319577 312429 306318 300597 295953 293287 292023 290726 289088 288120 288361
57634 288361 288975 288824 287645 285964 284470 283621 283351 283040 282118 280672 279167 277795 276462 275156 273821 272098
57618 272098 269767 267300 265488 264566 264114 263607 262713 261270 259461 257883 256996 256625 256330 256062 256050 256231 256192
57601 256192 255568 254285 252599 251071 250156 249559 248394 246238 243582 240960 238210 235058 231857 229116 226761
57586 226761 224495 222542 221328 220665 219961 219143 218747 219078 219791 220319 220386 220094 219788 219795 220074 220204 219762 218556
57568 218556 216556 214004 211612 210109 209395 208678 207615 206733 206442 206295 205649 204565 203635 203347 203923 205313
$$ packed form
57671C65377K5350L2727M1881N2020O1311O7722O9167O3480M9739K9666O818j5470
57659H49788l4726m8766n6256n7950n6026n2033m6457m0007l3811k8252k2945
57648C72559j8035j4240j1533r174p148o111n721m644k666j264j297j638r68K41
57634B88361O14j51j179j681j494q49k70l11r22j446j505j372j333j306j335j723
57618B72098k331k467j812r22m52n07q94j443j809j578q87l71k95k68j2J81l9
57601B56192o24j283j686j528r15n97j165k156k656k622k750l152l201k741k355
57586B26761k266j953j214o63p04q18l96L31P13N28O7k92l06PK79J30m42j206
57568B18556k000k552k392j503p14p17j063q82k91j47o46j084r30k88N76J390
$$ plain form
57552 205313 207077 208715 210260 212011 213640 214398 214307 214140 214044 213358 212223 212030 213505 215592 217152 218576
57536 218576 220572 222520 223442 223747 224472 225431 225605 224949 224365 224194 224094 224138 224644 225055 224403 222878 221749 221672
57518 221672 222286 223401 225296 227724 229847 231454 233176 235295 237384 239338 241632 244228 246225 247011 246902
57503 246902 246332 245301 243977 242900 242100 240812 238611 236154 234246 232814 231372 229953 228967 228414 227823
57488 227823 226859 225632 224525 223946 224159 225175 226751 228407 229460 229432 228725 228562 229742 231682 233126 233507
57472 233507 233082 232051 230391 228452 226868 225716 224373 222343 219752 216998 214484 212712 212112 212629 213870
57457 213870 215644 217930 220445 222757 224733 226423 227646 228258 228626 229204 229769 229753 229214 228749 228572 228438 228422
57440 228422 228901 229768 230511 231166 232319 233981 235380 236202 237181 238973 241142 242785 243675 244224 244720 245114 245421
$$ packed form
57552B05313J764J638J545J751J629P58r1j67r6o86j135j93J475K087J560J424
57536B18576J996J948R22L05P25R59J74o56n84j71j00M4N06M11o52j525j129p7
57518B21672O14J115J895K428K123J607J722K119K089J954K294K596J997P86j09
57503B46902n70j031j324j077q00j288k201k457j908j432j442j419r86n53n91
57488B27823r64j227j107n79K13J016J576J656J053k8p07j63J180J940J444L81
57472B33507m25j031j660j939j584j152j343k030k591k754k514j772o00N17J241
57457B13870J774K286K515K312J976J690J223O12L68N78N65j6n39m65j77j34j6
57440B28422M79Q67P43O55J153J662J399Q22R79J792K169J643Q90N49M96L94L07
$$ plain form
57423 245421 245911 246864 248283 249796 250963 251785 252768 254277 256036 257520 258516 258929 258504 257290 256101 255815
57407 255815 256489 257709 259430 261655 263697 264714 264879 265095 265699 266362 267105 268275 269493 269845 269351 269191
57391 269191 270179 271964 274040 276480 279271 281913 284239 286798 289864 292812 295016 296680 298322 300079
57377 300079 302008 304342 306886 308737 309151 308247 306497 304179 301778 300212 300034 300822 301856 302898 303864
57362 303864 304331 304096 303856 304691 306986 310257 313809 317198 320345 323532 327114 331088 335185 339415 344021
57347 344021 348778 352961 356216 358856 361027 362295 362525 362536 363249 364567 365653 366019 365901 365856 366365 367598
57331 367598 369243 370772 372005 373099 373940 374150 373917 374169 375504 377455 379184 380477 381683 383157 385262
57316 385262 388497 393190 399205 406122 413360 420052 425401 429480 433199 437230 441540 446170 451713 458567
$$ packed form
57423B45421M90R53J419J513J167Q22R83J509J759J484R96M13m25j214j189k86
57407B55815O74J220J721K225K042J017J65K16O04O63P43J170J218L52m94j60
57391B69191R88J785K076K440K791K642K326K559L066K948K204J664J642J757
57377C00079J929K334K544J851M14r04j750k318k401j566j78P88J034J042R66
57362C03864M67k35k40Q35K295L271L552L389L147L187L582L974M097M230M606
57347C44021M757M183L255K640K171J268K30J1P13J318J086L66j18m5N09J233
57331C67598J645J529J233J094Q41K10k33K52J335J951J729J293J206J474K105
57316C85262L235M693O015O917P238O692N349M079L719M031M310M630N543O854
$$ plain form
57302 458567 466379 474705 483607 493019 502176 510376 517847 525221 532630 539933 547419 555505 564023 572494
57288 572494 580957 589932 599737 610343 621709 633733 645990 657972 669521 680703 691519 702103
57276 702103 712921 724426 736686 749651 763468 778236 793802 810153 827645 846468 866211
57265 866211 886341 906751 927522 948556 969828 991546 1013570 1035170 1055881 1076146 1096448
57254 1096448 1116154 1133961 1149306 1162725 1175007 1186629 1197959 1209386 1221180 1233642 1247388
57243 1247388 1263141 1281267 1301750 1324503 1349401 1376195 1404613 1434405 1465063 1495760 1525815
57232 1525815 1555005 1583240 1610241 1635781 1659950 1682953 1704953 1726235 1747053 1767088 1785599
57221 1785599 1802435 1818463 1834774 1852027 1870799 1891778 1915058 1939906 1965878 1993632 2024024
$$ packed form
57302D58567P812Q326Q902R412R157Q200P471P374P409P303P486Q086Q518Q471
57288E72494Q463Q975R805J0606J1366J2024J2257J1982J1549J1182J0816J0584
57276G02103J0818J1505J2260J2965J3817J4768J5566J6351J7492J8823J9743
57265H66211K0130K0410K0771K1034K1272K1718K2024K1600K0711K0265K0302
57254A096448J9706J7807J5345J3419J2282J1622J1330J1427J1794J2462J3746
57243A247388J5753J8126K0483K2753K4898K6794K8418K9792L0658L0697L0055
57232A525815K9190K8235K7001K5540K4169K3003K2000K1282K0818K0035J8511
57221A785599J6836J6028J6311J7253J8772K0979K3280K4848K5972K7754L0392
$$ plain form
57210 2024024 2056922 2091517 2127259 2163764 2200306 2236221 2271477 2306123 2339483 2370661 2399621
57199 2399621 2427131 2454000 2481087 2509696 2541068 2575533 2612813 2653038 2696848 2744632 2796245
57188 2796245 2851196 2908534 2966832 3025000 3082996 3141144 3198984 3255409 3309634 3361337 3410082
57177 3410082 3455425 3497541 3537130 3574728 3610610 3645129 3678514 3710556 3741082 3770478 3799116
57166 3799116 3826546 3852008 3875605 3898305 3920994 3944047 3967498 3990967 4013783 4035936 4058457
57155 4058457 4081912 4104940 4125284 4142006 4155529 4165755 4171568 4172416 4169252 4163505 4156048 4147420 4138197
57142 4138197 4128762 4119464 4111255 4105541 4103216 4104411 4109263 4118082 4130625 4146029 4163801 4184203 4207430
57129 4207430 4233105 4260936 4291417 4325673 4364942 4410170 4461585 4518613 4580677 4647955 4720985
$$ packed form
57210B024024L2898L4595L5742L6505L6542L5915L5256L4646L3360L1178K8960
57199B399621K7510K6869K7087K8609L1372L4465L7280M0225M3810M7784N1613
57188B796245N4951N7338N8298N8168N7996N8148N7840N6425N4225N1703M8745
57177C410082M5343M2116L9589L7598L5882L4519L3385L2042L0526K9396K8638
57166C799116K7430K5462K3597K2700K2689K3053K3451K3469K2816K2153K2521
57155D058457K3455K3028K0344J6722J3523J0226N813Q48l164n747p457q628r223
57142D138197r435r298q209n714k325J195M852Q819J2543J5404J7772K0402K3227
57129D207430K5675K7831L0481L4256L9269M5228N1415N7028O2064O7278P3030
$$ plain form
57118 4720985 4800016 4885528 4978986 5082084 5195600 5320143 5457740 5611395 5783154 5974021
57108 5974021 6185912 6422431 6687779 6986555 7325126 7711813 8155539 8666184 9257466
57099 9257466 9948656 10763538 11729897 12881596 14260188 15913727 17894825 20259376 23063061
57090 23063061 26354114 30165814 34511192 39377623 44720872 50463646 56500114 62700249
57082 62700249 68912888 74977870 80748186 86095867 90875988 94871778 97786490 99318333
57074 99318333 99273673 97633116 94532070 90193745 84874588 78842317 72366680 65704157
57066 65704157 59079941 52677846 46638807 41061915 36005980 31493881 27519947 24057713
57058 24057713 21066403 18496667 16295789 14411795 12796377 11406988 10207799 9169187
$$ packed form
57118D720985P9031Q5512R3458J03098J13516J24543J37597J53655J71759J90867
57108E974021K11891K36519K65348K98776L38571L86687M43726N10645N91282
57099I257466O91190Q14882R66359J151699J378592J653539J981098K364551K803685
57090B3063061L291053L811700M345378M866431N343249N742774O036468O200135
57082F2700249O212639O064982N770316N347681M780121L995790K914712J531843
57074I9318333m4660j640557l101046m338325n319157o032271o475637o662523
57066F5704157o624216o402095o039039n576892n055935m512099l973934l462234
57058B4057713k991310k569736k200878j883994j615418j389389j199189j038612
$$ plain form
57050 9169187 8266558 7479601 6791767 6189246 5659963 5193462 4781250 4416399 4092669
57041 4092669 3804380 3547074 3317684 3113763 2932688 2771634 2628138 2500739 2389237
57032 2389237 2294146 2215802 2154451 2111397 2088933 2087501 2102310 2123034 2136778 2131407 2097850 2032258
57020 2032258 1937635 1822740 1698135 1572619 1452416 1341770 1242911 1155822 1079089 1011244
57010 1011244 951216 898007 850596 808169 770158 736064 705374 677452 651446 626545 602409
56999 602409 579087 556522 534497 513066 492597 473320 455311 438913 424617 412418 401884
56988 401884 393079 386888 384250 385595 391080 400548 412781 425406 436012 443018 445366 442295 434023
56975 434023 422071 408171 393221 377743 362836 349939 339833 332425 327324 324173 322686 322849 325077
$$ packed form
57050I169187r02629p86957o87834o02521n29283m66501m12212l64851l23730
57041D092669k88289k57306k29390k03921j81075j61054j43496j27399j11502
57032B389237r5091p8344o1351m3054k2464j432J4809K0724J3744n371l3557o5592
57020B032258r4623j14895j24605j25516j20203j10646r8859q7089p6733o7845
57010A011244o0028n3209m7411m2427l8011l4094l0690k7922k6006k4901k4136
56999F02409k3322k2565k2025k1431k0469j9277j8009j6398j4296j2199j0534
56988D01884q805o191k638J345N485R468J2233J2625J0606P006K348l071q272
56975D34023j1952j3900j4950j5478j4907j2897j0106p408n101l151j487J63K228
$$ plain form
56962 325077 329933 337922 349693 365920 386447 409753 433446 454972 471665 480991 481598 474053 460091
56949 460091 441401 419565 396593 374546 354535 336674 321109 308612 299971 295172 293460 294195
56937 294195 297553 304392 315484 331087 351340 376532 406237 438149 468370 493011 509182 514873
56925 514873 509166 493078 469400 441071 410127 378355 347878 320255 295634 273551 254064 237397
56913 237397 223060 210261 198952 189660 182452 176715 171767 167110 162362 157616 153732 151638 151391 152382
56899 152382 154209 156808 159981 163432 167231 171744 177197 183785 192021 202552 215681 231402 249578
56886 249578 269676 290516 310568 328197 341452 348421 348504 342913 333339 320624 305436 289584 275607
56873 275607 265186 258691 255913 256405 259489 265007 274018 287896 306960 330959 360697 397912 443259
$$ packed form
56962C25077M856P989J1771J6227K0527K3306K3693K1526J6693R326O07p545j3962
56949D60091j8690k1836k2972k2047k0011j7861j5565j2497q641m799j712P35
56937B94195L358O839J1092J5603K0253K5192K9705L1912L0221K4641J6171N691
56925E14873n707j6088k3678k8329l0944l1772l0477k7623k4621k2083j9487j6667
56913B37397j4337j2799j1309r292p208n737m948m657m748m746l884k094k47R91
56899A52382J827K599L173L451L799M513N453O588Q236J0531J3129J5721J8176
56886B49578K0098K0840K0052J7629J3255O969Q3n591r574j2715j5188j5852j3977
56873B75607j0421o495k778M92L084N518R011J3878J9064K3999K9738L7215M5347
$$ plain form
56860 443259 495131 550344 604783 653231 690051 711179 715442 704056 679757 646621 609522 572621
56848 572621 538343 507899 482250 462297 448740 442241 443431 452545 469482 494506 528605 573058
56836 573058 629028 697357 777567 866048 955274 1035261 1096237 1130973 1136327 1113862 1068889 1008209
56824 1008209 938259 864666 792387 725361 666044 615516 573954 541035 516403 500188 492987
56813 492987 495310 507351 529404 562102 605866 660052 722144 786994 846799 892932 919054 922914
56801 922914 905554 869656 819098 759274 696394 635700 580242 531103 488371 451889 421586
56790 421586 397514 379714 368091 362478 362795 369108 381576 400327 425165 455022 487433 518471
56778 518471 543504 558553 561434 552009 531652 502748 468377 431711 395193 360287 327999 299094
$$ packed form
56860D43259N1872N5213N4439M8448L6820K1128M263j1386k4299l3136l7099l6901
56848E72621l4278l0444k5649j9953j3557o499J190R114J6937K5024L4099M4453
56836E73058N5970O8329Q0210Q8481Q9226P9987O0976L4736N354k2465m4973o0680
56824A008209o9950p3593p2279o7026n9317n0528m1562l2919k4632j6215p201
56813D92987K323J2041K2053L2698M3764N4186O2092O4850N9805M6133K6122L860
56801I22914j7360l5898n0558n9824o2880o0694n5458m9139m2732l6482l0303
56790D21586k4072j7800j1623n613L17O313J2468J8751K4838K9857L2411L1038
56778E18471K5033J5049K881r425k0357k8904l4371l6666l6518l4906l2288k8905
$$ plain form
56766 299094 273539 250335 228589 208638 191582 177835 166573 156592 147308 138952 132148 127234
56754 127234 123712 120423 116554 112326 108451 105246 102696 100938 100028 99416 98410 97122 96294 96202 96357 96298
56738 96298 96007 95451 94415 93054 92039 91842 92269 92898 93553 94198 94772 95371 96239 97402 98547 99397 100014
56721 100014 100674 101695 103316 105411 107337 108437 108709 108722 108938 109423 110072 110736 111258 111758 112667 114098 115493
56704 115493 116423 117319 118679 119913 119943 118851 117869 117661 117648 117304 117098 117686 118891 120010 120612 120702 120585 120818
56686 120818 121756 122990 123782 124206 125114 126868 128937 131028 133633 136912 139907 141593 142102 142220 142196 141770
56670 141770 140955 140105 139417 138910 138669 138700 138745 138625 138506 138554 138638 138628 138652 138817 139139 139959 141881 144896 148040 150321
56650 150321 151596 152206 152288 151858 151093 150081 148739 147325 146461 146227 145837 144811 143823 143684 144017 143817 142941
$$ packed form
56766B99094k5555k3204k1746j9951j7056j3747j1262r981r284q356o804m914
56754A27234l522l289l869m228l875l205k550j758r10o12j006j288q28r2J55n9
56738I6298k91n56j036j361j015j97M27O29O55O45N74N99Q68J163J145Q50O17
56721A00014O60J021J621K095J926J100K72J3K16M85O49O64N22N00R09J431J395
56704A15493R30Q96J360J234L0j092r82k08j3l44k06N88J205J119O02R0j17K33
56686A20818R38J234P92M24R08J754K069K091K605L279K995J686N09J18k4m26
56670A41770q15q50o88n07k41L1M5j20j19M8Q4j0K4J65L22Q20J922L015L144K281
56650A50321J275O10Q2m30p65j012j342j414q64k34l90j026r88j39L33k00q76
$$ plain form
56633 142941 142128 141767 141526 141200 141096 141473 142197 143045 143879 144445 144437 143801 142679 141157 139437 138103 137657 137823
56615 137823 137792 137170 136295 135615 135222 135049 135070 135098 134767 134009 133304 133202 133663 134030 133693 132686 131616 131012 130901
56596 130901 131085 131673 133048 135289 137893 140143 141579 142095 141888 141472 141490 142280 143626 144935 145678 145795 145830
56579 145830 146512 148003 149771 151423 153308 155870 158726 161031 162541 163705 164897 166348 168662 172480
56565 172480 177524 182879 188411 195126 203901 214696 227282 241848 258329 275679 292182 306077
56553 306077 315967 321511 323945 325094 325582 324859 323075 321614 321235 320972 319695 317698 315716 313400 309935
56538 309935 305532 301091 296795 292075 286679 280819 274552 267818 260875 253976 246934 239702 232996 227599
56524 227599 223362 219575 215920 212441 209001 205562 202554 200216 197990 195312 192510 190080 187637 184605
$$ packed form
56633A42941q13l61k41l26j04L77P24Q48Q34N66qo36j122j522j720j334m46J66
56615A37823l1o22q75o80l93j73K1K8l31p58p05j02M61L67l37j007j070o04j11
56596A30901J84N88J375K241K604K250J436N16k07m16J8P90J346J309P43J17L5
56579A45830O82J491J768J652J885K562K856K305J510J164J192J451K314L818
56565A72480N044N355N532O715Q775J0795J2586J4566J6481J7350J6503J3895
56553C06077R890N544K434J149M88p23j784j461l79k63j277j997j982k316l465
56538C09935m403m441m296m720n396n860o267o734o943o899p042p232o706n397
56524B27599m237l787l655l479l440l439l008k338k226k678k802k430k443l032
$$ plain form
56510 184605 181489 179367 178332 177526 176530 175665 175050 174454 174049 174252 174730 174533 173431 172263 171790 171932 172269
56493 172269 172562 172553 171919 170694 169314 168096 167050 166168 165459 164779 164063 163619 163745 164193 164419 164159 163415 162247
56475 162247 161086 160735 161379 162032 161767 161095 161263 162496 163849 164599 164822 164723 164337 163921 163877 164274 165054 166466
56457 166466 168524 170362 171065 170928 170965 171343 171363 170882 170656 171173 172165 173391 174975 176818 178548 180165 181915
56440 181915 183510 184319 184401 184413 184418 183748 182217 180532 179331 178630 178338 178379 178161 176937 174991 173555 173245 173459
56422 173459 173573 173788 174350 174772 174425 173378 172284 171892 172784 174927 177356 178954 179704 180497 181691 182673 182914
56405 182914 182567 181843 180803 180040 180597 182706 185348 187441 188754 189403 189296 188516 187555 186697 185803 185006 184928
56388 184928 185893 187524 189429 191567 193708 195289 196208 197084 198388 199910 201346 202717 203916 204553 204556 204340
$$ packed form
56510A84605l116k122j035q06r96q65o15n96m05K03M78j97j102j168m73J42L37
56493A72269K93ro34j225j380j218j046q82p09o80p16m44J26M48K26k60p44j168
56475A62247j161l51O44O53k65o72J68J233J353P50K23r9l86m16m4L97P80J412
56457A66466K058J838P03j37L7L78K0m81k26N17R92J226J584J843J730J617J750
56440A81915J595Q09Q2J2No70j531j685j201p01k92M1k18j224j946j436l10K14
56422A73459J14K15N62M22l47j047j094l92Q92K143K429J598P50P93J194R82K41
56405A82914l47p24j040p63N57K109K642K093J313O49j07p80r61q58q94p97p8
56388A84928R65J631J905K138K141J581R19Q76J304J522J436J371J199O37Lk16
$$ plain form
56372 204340 204157 203980 204149 205274 207219 209025 210131 210911 211702 212271 212564 213081 213990 214772 215217 215967 217515
56355 217515 219448 221206 222795 224219 225042 225203 225463 226336 227233 227441 227313 227633 228265 228335 227602 226936 227390 229214
56337 229214 231790 234360 236793 239523 242607 245255 246889 248266 250642 254021 257250 259847 262526 265805
56323 265805 269269 272552 275806 278746 280368 280285 279346 278359 277191 275789 275006 275554 276907 278078 278865 279708
56307 279708 280957 282865 285656 289058 292404 295690 299810 305289 311556 317910 324305 330669 336373 341045
56293 341045 345133 349096 352816 356271 359843 363493 366663 369552 373374 378659 384428 389828 395393 401774
56279 401774 408457 414819 421392 428859 436731 444280 452022 461035 471497 483008 495654 509573 524197
56266 524197 539123 555129 573111 592637 612746 633606 656187 680881 707763 737658 771564
$$ packed form
56372B04340j83j77J69J125J945J806J106P80P91N69K93N17R09P82M45P50J548
56355B17515J933J758J589J424Q23J61K60Q73Q97K08j28L20O32P0p33o66M54J824
56337B29214K576K570K433K730L084K648J634J377K376L379L229K597K679L279
56323B65805L464L283L254K940J622q3r39r87j168j402p83N48J353J171P87Q43
56307B79708J249J908K791L402L346L286M120N479O267O354O395O364N704M672
56293C41045M088L963L720L455L572L650L170K889L822N285N769N400N565O381
56279D01774O683O362O573P467P872P549P742R013J0462J1511J2646J3919J4624
56266E24197J4926J6006J7982J9526K0109K0860K2581K4694K6882K9895L3906
$$ plain form
56255 771564 809381 850601 896030 947564 1006394 1072623 1146415 1228318 1318471 1416617 1522799
56244 1522799 1636870 1757200 1880901 2005541 2129878 2252780 2372016 2484109 2584811
56235 2584811 2669953 2736596 2783474 2810164 2816263 2801904 2768492 2718211 2653166 2575646 2488592
56224 2488592 2394815 2295996 2193207 2088156 1983242 1880649 1781842 1687479 1597222 1510232
56214 1510232 1426530 1347420 1274042 1206203 1143229 1085040 1031501 981607 934497 890725 851428
56203 851428 816663 785442 756838 730128 704538 680032 657842 639117 623454 609714 597667
56192 597667 587694 579421 571932 565067 559344 554809 550947 547560 544801 542582 540691 539151 537808 536109
56178 536109 534061 532697 532720 533389 533717 533986 535006 536642 538323 540334 543326 547103 551144 555822 561807
$$ packed form
56255G71564L7817M1220M5429N1534N8830O6229P3792Q1903R0153R8146J06182
56244A522799J14071J20330J23701J24640J24337J22902J19236J12093J00702
56235B584811Q5142O6643M6878K6690O099j4359l3412n0281o5045p7520q7054
56224B488592r3777r8819j02789j05051j04914j02593r8807r4363r0257q6990
56214A510232q3702p9110p3378o7839o2974n8189n3539m9894m7110m3772l9297
56203H51428l4765l1221k8604k6710k5590k4506k2190j8725j5663j3740j2047
56192E97667r973q273p489o865n723m535l862l387k759k219j891j540j343j699
56178E36109k048j364K3O69L28K69J020J636J681K011K992L777M041M678N985
$$ plain form
56163 561807 568733 575674 582551 589941 597978 606594 616317 627633 640015 652731 666192 681457 698970
56150 698970 718759 741219 766673 795030 827067 865204 911819 967714 1033444 1110889 1201688
56139 1201688 1304864 1417420 1536218 1657477 1775570 1884691 1981629 2065654 2136859 2196591
56129 2196591 2248492 2296394 2341140 2380992 2414370 2440127 2456125 2460414 2453970 2440116 2421162 2397215
56117 2397215 2367532 2330500 2282434 2219095 2139197 2045096 1940433 1829070 1715956 1606440
56107 1606440 1504056 1410364 1326674 1254081 1192010 1138862 1094089 1057859 1028952 1005062 985058
56096 985058 969051 956538 946483 938911 934272 931546 929135 927265 927216 928618 929979 931468 934550 939146
56082 939146 943907 949119 956418 965600 974617 982945 992101 1002553 1013031 1023285 1034666 1047433 1060158
$$ packed form
56163E61807O926O941O877P390Q037Q616R723J1316J2382J2716J3461J5265J7513
56150F98970J9789K2460K5454K8357L2037L8137M6615N5895O5730P7445R0799
56139A201688J03176J12556J18798J21259J18093J09121R6938Q4025P1205N9732
56129B196591N1901M7902M4746L9852L3378K5757J5998M289o444j3854j8954k3947
56117B397215k9683l7032m8066o3339p9898r4101j04663j11363j13114j09516
56107A606440j02384r3692q3690p2593o2071n3148m4773l6230k8907k3890k0004
56096I85058j6007j2513j0055p572m639k726k411j870m9J402J361J489L082M596
56082I39146M761N212P299R182R017Q328R156J0452J0478J0254J1381J2767J2725
$$ plain form
56069 1060158 1072410 1085454 1099816 1114693 1130130 1147131 1165194 1182414 1198527 1215283 1233467
56058 1233467 1252204 1271491 1292488 1314834 1336516 1356895 1377188 1397624 1416962 1435094 1453214
56047 1453214 1471189 1487968 1504781 1524526 1547604 1571674 1595837 1621399 1648183 1674114 1699236
56036 1699236 1726181 1755773 1786087 1816768 1850102 1886642 1924082 1961922 2002924 2048127 2094506
56025 2094506 2139642 2184925 2232166 2280740 2330135 2381772 2436257 2492194 2549461 2610226 2675194
56014 2675194 2742464 2811642 2885195 2964048 3045769 3128918 3215408 3306917 3402825 3503174 3609595
56003 3609595 3721917 3838097 3958818 4087616 4225256 4368920 4518166 4676314 4844650
55994 4844650 5021134 5206392 5404794 5617713 5842253 6078787 6333012 6608148 6902204
$$ packed form
56069A060158J2252J3044J4362J4877J5437J7001J8063J7220J6113J6756J8184
56058A233467J8737J9287K0997K2346K1682K0379K0293K0436J9338J8132J8120
56047A453214J7975J6779J6813J9745K3078K4070K4163K5562K6784K5931K5122
56036A699236K6945K9592L0314L0681L3334L6540L7440L7840M1002M5203M6379
56025B094506M5136M5283M7241M8574M9395N1637N4485N5937N7267O0765O4968
56014B675194O7270O9178P3553P8853Q1721Q3149Q6490R1509R5908J00349J06421
56003C609595J12322J16180J20721J28798J37640J43664J49246J58148J68336
55994D844650J76484J85258J98402K12919K24540K36534K54225K75136K94056
$$ plain form
55985 6902204 7215605 7554172 7921541 8316257 8739599 9198494 9697404 10235706 10816731
55976 10816731 11450761 12145352 12902067 13726946 14634366 15636346 16738989 17954770 19307217
55967 19307217 20818577 22505828 24395575 26530400 28955284 31714245 34869704 38511507
55959 38511507 42742617 47679678 53483657 60378272 68641625 78622240 90793745 105779572
55951 105779572 124317553 147211793 175213757 208621090 246582146 286575249 324637631
55944 324637631 356352028 377988419 387252258 383585069 368167464 343592251 313155471
55937 313155471 280027461 246723288 214999876 185958190 160145619 137667705 118355638
55930 118355638 101922289 88035019 76340231 66497409 58208463 51213754 45280806
$$ packed form
55985F902204L13401L38567L67369L94716M23342M58895M98910N38302N81025
55976A0816731O34030O94591P56715Q24879R07420J001980J102643J215781J352447
55967A9307217J511360J687251J889747K134825K424884K758961L155459L641803
55959C8511507M231110M937061N803979O894615Q263353R980615J2171505J4985827
55951A05779572J8537981K2894240K8001964L3407333L7961056L9993103L8062382
55944C24637631L1714397K1636391R263839l667189j5417605k4575213l0436780
55937C13155471l3128010l3304173l1723412k9041686k5812571k2477914j9312067
55930A18355638j6433349j3887270j1694788r842822q288946o994709n932948
$$ plain form
55923 45280806 40214922 35869111 32128585 28892441 26077161 23623196 21483259 19609598
55915 19609598 17959532 16503351 15216885 14073246 13049178 12131712 11310618 10570732
55907 10570732 9898180 9287101 8733264 8227087 7759250 7327263 6930329 6563129 6220347
55898 6220347 5901980 5608517 5335771 5079645 4841142 4621598 4417609 4225574 4046742
55889 4046742 3882931 3731554 3589592 3458384 3339821 3231555 3130184 3035324 2946293 2858757
55879 2858757 2769226 2679634 2593355 2510006 2428039 2348914 2274441 2203057 2132757 2064839 2000922
55868 2000922 1939248 1877803 1818326 1763357 1711937 1662053 1614753 1571998 1532632 1494206 1456775
55857 1456775 1421397 1386928 1351771 1317051 1284779 1254491 1224586 1195207 1166907 1138387 1108529
$$ packed form
55923D5280806n065884m345811l740526l236144k815280k453965k139937j873661
55915A9609598j650066j456181j286466j143639j024068r17466q21094p39886
55907A0570732o72552o11079n53837n06177m67837m31987l96934l67200l42782
55898F220347l18367k93463k72746k56126k38503k19544k03989j92035j78832
55889D046742j63811j51377j41962j31208j18563j08266j01371r4860q9031q7536
55879B858757q9531q9592q6279q3349q1967p9125p4473p1384p0300o7918o3917
55868B000922o1674o1445n9477n4969n1420m9884m7300m2755l9366l8426l7431
55857A456775l5378l4469l5157l4720l2272l0288k9905k9379k8300k8520k9858
$$ plain form
55846 1108529 1078969 1051863 1026713 1001970 977990 955744 934451 913166 892957 874894 857655
55835 857655 839748 822394 807570 794791 782393 770380 759553 749389 739324 730469 723614 717064
55823 717064 708886 699678 690785 681453 670267 657802 645385 632765 619485 606946 596589 587575
55811 587575 578681 570906 565574 561520 556935 552564 550328 550080 550474 551734 554822 559071 563406 568715 576145
55796 576145 584142 590119 594156 598140 602069 604190 604238 603572 602403 599633 595383 591177 587649 584112 580135
55781 580135 575483 568920 559170 546822 533569 520252 507565 497733 493131 493769 498288 506710 519726
55768 519726 535744 551052 562712 569183 568782 560276 545071 526524 506897 486825 467436 450574
55756 450574 436769 424970 414451 405200 396563 387491 378219 369945 362816 355943 349249 343481 338479
$$ packed form
55846A108529k9560k7106k5150k4743k3980k2246k1293k1285k0209j8063j7239
55835H57655j7907j7354j4824j2779j2398j2013j0827j0164j0065q855o855o550
55823G17064q178r208q893r332j1186j2465j2417j2620j3280j2539j0357r014
55811E87575q894p775n332m054m585m371k236k48L94J260L088M249M335N309P430
55796E76145P997N977M037L984L929K121M8o66j169k770m250m206l528l537l977
55781E80135m652o563r750j2348j3253j3317j2687r832m602O38M519Q422J3016
55768E19726J6018J5308J1660O471m01q506j5205j8547j9627k0072j9389j6862
55756D50574j3805j1799j0519r251q637r072r272q274p129o873o694n768n002
$$ plain form
55743 338479 333251 327820 323242 319861 317183 315359 314989 315413 314928 312834 309778 306167 301837 297142 292740
55728 292740 288369 283356 278191 273966 270486 266578 262035 257549 253083 248242 244038 242133 242297 242678 242812
55713 242812 244351 248413 254163 260450 267061 273747 279605 284105 287387 289126 288436 285245 280489 274691
55699 274691 267648 259715 251976 244845 237831 230909 224822 219810 215361 211377 208286 205810 203014 199823
55685 199823 197201 195659 194824 194557 195175 196523 198194 200634 204490 208903 212088 213759 215201 216802 217396
55670 217396 216522 215447 215174 215106 214546 214039 214306 215091 215909 216856 217935 218626 218756 218905 219467 220294 221576 223888
55652 223888 226960 229596 231330 232992 235159 237246 238656 239634 240404 240634 240301 239969 239583 238129 235106 231210
55636 231210 226911 221478 214246 205916 197809 190565 184195 178639 173707 169200 165531 163421 162642 161991 160856
$$ packed form
55743C38479n228n431m578l381k678j824l70M24m85k094l056l611m330m695m402
55728B92740m371n013n165m225l480l908m543m486m466m841m204j905J64L81J34
55713B42812J539M062N750O287O611O686N858M500L282J739o90l191m756n798
55699B74691p043p933p739p131p014o922o087n012m449l984l091k476k796l191
55685A99823k622j542q35k67O18J348J671K440L856M413L185J671J442J601N94
55670B17396q74j075k73o8n60n07K67P85Q18R47J079O91J30J49N62Q27J282K312
55652B23888L072K636J734J662K167K087J410R78P70K30l33l32l86j454l023l896
55636B31210m299n433p232q330q107p244o370n556m932m507l669k110p79o51j135
$$ plain form
55621 160856 159845 159480 159418 159415 159870 160698 160734 159033 155939 152294 148538 145174 143060 142382 142122 141297 140000
55604 140000 138617 136904 134592 132133 130025 128043 125845 123771 122353 121543 121022 120741 120694 120719 120917 121637
55588 121637 122624 122920 122127 121074 120749 121155 121677 121983 122100 122168 122468 123199 124059 124730 125798 128269 132027 135878
55570 135878 139334 143115 147485 151460 154385 156995 159957 162478 163465 163102 162191 160693 158101 154668 151130
55555 151130 147558 143489 138933 134451 130461 127133 124687 123154 122088 121022 119916 118815 117587 116417
55541 116417 115974 116544 117536 118387 119362 120914 122772 124362 125683 127076 128515 129659 130357 130628 130461 129964
55525 129964 129365 128666 127702 126584 125447 123700 120528 116423 113127 111503 110449 108587 106072 103968 102708
55510 102708 102056 101841 101781 101242 100003 98776 98184 97852 97243 96701 96770 97117 97099 96903 97086 97434 97239 96430 95509
$$ packed form
55621A60856j011l65o2lM55Q28L6j701l094l645l756l364k114o78k60q25j297
55604A40000j383j713k312k459k108j982k198k074j418q10n21k81m7K5J98P20
55588A21637R87K96p93j053l25M06N22L06J17O8L00P31Q60O71J068K471L758L851
55570A35878L456L781M370L975K925K610K962K521R87l63r11j498k592l433l538
55555A51130l572m069m556m482l990l328k446j533j066j066j106j101j228j170
55541A16417m43N70R92Q51R75J552J858J590J321J393J439J144O98K71j67m97
55525A29964n99o99r64j118j137j747l172m105l296j624j054j862k515k104j260
55510A02708o52k15o0n39j239j227n92l32o09n42O9L47j8j96J83L48j95q09r21
$$ plain form
55491 95509 94661 93786 93125 93006 93111 92767 91857 90798 89885 89258 89247 90066 91366 92609 93575 94091 93829 93059
55473 93059 93017 94604 97094 98986 99839 100376 101048 101443 101114 100145 98840 97445 96226 95303 94472 93553 92694
55456 92694 91949 90949 89540 88353 88073 88407 88463 87936 87302 87029 87168 87507 87611 87000 85799 84910 84977 85562
55438 85562 85972 86376 87280 88280 88405 87619 87020 87387 88277 88786 88603 88080 87645 87403 87180 86917 86941 87562 88421
55419 88421 88762 88508 88386 88697 88815 88441 88488 89844 91926 93406 93898 93933 93700 92892 91598 90304 89084 87660
55401 87660 86187 85183 84729 84468 84323 84481 84824 85105 85561 86575 87808 88514 88646 88823 89209 89261 88743 88221
55383 88221 88303 88939 89646 90008 89897 89569 89504 89814 89973 89482 88539 87618 86814 86157 86130 87073 88372 89048 88904 88345
55363 88345 87370 85711 83775 82474 82087 82117 82234 82494 82642 82091 80734 79102 77743 77100 77729 79654 81614
$$ packed form
55491I5509q48q75o61j19J05l44r10j059r13o27j1Q19J300J243R66N16k62p70
55473I3059m2J587K490J892Q53N37O72L95l29r69j305j395j219r23q31r19q59
55456I2694p45j000j409j187k80L34N6n27o34k73J39L39J04o11j201q89O7N85
55438H5562M10M04R04J000J25p86n99L67Q90N09j83n23m35k42k23k63K4O21Q59
55419H8421L41k54j22L11J18l74M7J356K082J480M92L5k33q08j294j294j220j424
55401H7660j473j004m54k61j45J58L43K81M56J014J233P06J32J77L86N2n18n22
55383H8221Q2O36P07L62j11l28o5L10J59m91r43r21q04o57k7R43J299O76j44n59
55363H8345r75j659j936j301l87L0J17K60J48n51j357j632j359o43O29J925J960
$$ plain form
55346 81614 82054 80984 79852 79492 79294 78654 78048 78139 78773 79509 80351 81350 82075 82167 81960 82044 82593 83495 84681
55327 84681 85921 86642 86453 85662 84980 84892 85382 86011 86145 85439 84195 82999 82088 81377 80931 80860 80848 80468 79997
55308 79997 80238 81428 82882 83851 84158 83893 83169 82368 81998 82040 81979 81687 81712 82420 83412 84063 84181 83879 83277
55289 83277 82582 82092 81887 81867 82118 82764 83420 83425 82846 82612 83335 84458 84899 84191 82775 81537 81239 82017 83214
55270 83214 84004 84227 84291 84381 84318 84187 84413 85060 85614 85622 85100 84326 83781 84158 85634 87187 87595 87179 87514 89191
55250 89191 91045 91949 92161 92208 91690 90243 88689 88019 87847 87145 86009 85449 85677 85882 85698 85722 86372 87225
55232 87225 87836 88336 88767 88597 87452 85884 84753 84127 83278 81729 79913 78735 78692 79480 80278 80404 79806
55215 79806 79057 78848 79388 80219 80670 80517 80182 80248 80893 81836 82670 83084 82916 82264 81555 81302 81809 83103 84955
$$ packed form
55346H1614M40j070j132l60j98o40o06R1O34P36Q42R99P25R2k07Q4N49R02J186
55327H4681J240P21j89p91o82q8M90O29J34p06j244j196r11p11m46p1j2l80m71
55308G9997K41J190J454R69L07k65p24q01l70M2o1k92K5P08R92O51J18l02o02
55289H3277o95m90k05k0K51O46O56Nn79k34P23J123M41p08j416j238k98P78J197
55270H3214P90K23O4R0o3j31K26O47N54Qn22p74n45L77J476J553M08m16L35J677
55250H9191J854R04K12M7n18j447j554o70j72p02j136n60K28K05j84K4O50Q53
55232H7225O11N00M31j70j145j568j131o26q49j549j816j178m3P88P98J26n98
55215G9806p49k09N40Q31M51j53l35O6O45R43Q34M14j68o52p09k53N07J294J852
$$ plain form
55196 84955 86833 88121 88651 88833 88997 88901 88219 87150 86077 84988 83865 83338 84087 85666 86778 86816 86352
55179 86352 85991 85693 85543 86279 88313 90744 92086 91763 90496 89389 89010 89168 89238 88776 87957 87319 87131 87294
55161 87294 87779 88676 89768 90621 91181 91748 92236 92108 91273 90397 89956 89638 89100 88747 89161 90211 91292 92099
55143 92099 92637 92753 92203 91013 89411 87636 86124 85511 86009 87019 87782 88182 88539 88993 89584 90563 91936
55126 91936 92929 92655 91391 90515 90968 92268 93291 93627 93806 94378 95130 95286 94336 92556 90748 89588 89210
55109 89210 89296 89370 89109 88623 88427 88925 89951 90988 91725 92169 92344 92243 92027 91849 91560 91006 90580 90967 92272
55090 92272 93886 95249 96257 96834 96754 96164 95725 96006 97069 98777 100898 102700 103183 102166 100663 99728
55074 99728 99339 98870 98203 97835 98148 98981 99753 99721 98466 96477 94926 94513 94792 94986 95112 95885 97641 99774
$$ packed form
55196H4955J878J288N30J82J64r6o82j069j073j089j123n27P49J579J112L8m64
55179H6352l61k98j50P36K034K431J342l23j267j107l79J58P0m62q19o38j88J63
55161H7294M85Q97J092Q53N60N67M88j28q35q76m41l18n38l53M14J050J081Q07
55143I2099N38J16n50j190j602j775j512o13M98J010P63M00L57M54N91R79J373
55126I1936R93k74j264q76M53J300J023L36J79N72P52J56r50j780j808j160l78
55109H9210Q6P4k61m86j96M98J026J037P37M44J75j01k16j78k89n54m26L87J305
55090I2272J614J363J008N77q0n90m39K81J063J708K121J802M83j017j503r35
55074I9728l89m69o67l68L13Q33P72l2j255j989j551m13K79J94J26P73J756K133
$$ plain form
55056 99774 101205 101265 100251 99199 98865 98943 98586 97634 96760 96394 96284 96300 96879 98200 99538 99967 99225 97532
55038 97532 95176 92803 91463 91669 92777 93873 94816 95910 97053 97911 98510 98981 99046 98491 97844 97896 98663
55021 98663 99423 99591 99100 98194 97319 96985 97208 97368 97062 96684 96696 96857 96817 96886 97350 97516 96491 94671 93437
55002 93437 93457 94208 95124 96197 97358 98287 99111 100431 102308 103931 104666 104803 104932 105109 105053 104722 104348 104195
54984 104195 104481 105247 106115 106495 106182 105549 105061 104884 105020 105477 106163 106882 107565 108349 109359 110513 111534 112053
54966 112053 111888 111348 111063 111277 111590 111607 111469 111402 111158 110396 109296 108299 107499 106841 106570 106837 107167 107046 106800
54947 106800 107104 107749 107786 106880 105702 104856 104233 103660 103403 103637 103980 103958 103658 103673 104597 106532 108786 110235
54929 110235 110445 110285 110888 112277 113715 115172 117413 120620 123953 126816 129627 132978 136886 141352 146836
$$ packed form
55056I9774J431O0j014j052l34P8l57r52q74l66j10J6N79J321J338M29p42j693
55038I7532k356k373j340K06J108J096R43J094J143Q58N99M71O5n55o47N2P67
55021I8663P60J68m91r06q75l34K23J60l06l78J2J61m0O9M64J66j025j820j234
55002I3437K0P51R16J073J161R29Q24J320J877J623P35J37J29J77n6l31l74j53
54984A04195K86P66Q68L80l13o33m88j77J36M57O86P19O83P84J010J154J021N19
54966A12053j65n40k85K14L13J7j38o7k44p62j100r97q00o58k71K67L30j21k46
54947A06800L04O45L7r06j178q46o23n73k57K34L43k2l00J5R24J935K254J449
54929A10235K10j60O03J389J438J457K241L207L333K863K811L351L908M466N484
$$ plain form
54914 146836 153576 160979 168237 174951 180679 184493 185699 184587 181881 177851 172590 166785 161430 156866
54900 156866 152631 148236 143650 139081 134756 130891 127619 124945 122962 121897 121683 121709 121306 120373 119259
54885 119259 118282 117690 117855 119034 120976 123123 125220 127388 129688 131965 134268 137176 141516 147819 155934
54870 155934 164974 173626 180724 185747 188761 189962 189370 186979 183043 178043 172404 166400 160373 154847
54856 154847 150139 145983 141849 137668 133835 130418 126930 123299 120504 119482 119570 118885 116426 113139 110613
54841 110613 109283 108387 107252 105973 104967 104370 104078 104053 104316 104723 104907 104578 103824 103048 102648 102789 103435 104362
54823 104362 105134 105328 104949 104396 103955 103550 103138 102956 103175 103589 103971 104463 105227 106011 106439 106563 106764 107235 107901
54804 107901 108622 109197 109451 109603 110164 111092 111559 111062 110240 109905 109835 109427 109023 109398 110192 110224 109413 109047 109853
$$ packed form
54914A46836O740P403P258O714N728L814J206j112k706m030n261n805n355m564
54900A56866m235m395m586m569m325l865l272k674j983j065k14K6m03r33j114
54885A19259r77n92J65J179J942K147K097K168K300K277K303K908M340O303Q115
54870A55934R040Q652P098N023L014J201n92k391l936n000n639o004o027n526
54856A54847m708m156m134m181l833l417l488l631k795j022Q8o85k459l287k526
54841A10613j330q96j135j279j006n97k92k5K63M07J84l29p54p76m00J41O46R27
54823A04362P72J94l79n53m41m05m12j82K19M14L82M92P64P84M28J24K01M71O66
54804A07901P21N75K54J52N61R28M67m97q22l35p0m08m04L75P94L2q11l66Q06
$$ plain form
54785 109853 111064 111905 112816 114437 116347 117684 118311 118585 118597 118468 118843 120218 122104 123607 124608 125680
54769 125680 127177 129107 131633 134972 138896 143039 147568 152903 158884 164926 171007 177719 185080 191942
54755 191942 196901 199383 199535 197576 193778 188784 183293 177379 170642 163206 156155 150503 146010 141573
54741 141573 136778 132484 129561 127619 125562 123103 121071 120244 120487 121174 121980 122966 124175 125413 126430
54726 126430 127278 128522 130882 134498 138675 142641 146319 150109 154288 159067 164840 171608 178264 183246
54712 183246 185949 186947 186887 185853 183768 180550 175799 169284 162020 155906 151812 148705 145185 141181 137583
54697 137583 134862 132767 130898 128945 126710 124519 123348 123888 125576 127030 127287 126285 124403 122047 119681
54682 119681 117794 116640 116078 115650 114934 114039 113627 114135 115040 115374 114874 114060 113259 112300 111273 110704 110643 110389
$$ packed form
54785A09853J211Q41R11J621J910J337O27K74J2j29L75J375J886J503J001J072
54769A25680J497J930K526L339L924M143M529N335N981O042O081O712P361O862
54755A91942M959K482J52j959l798m994n491n914o737p436p051n652m493m437
54741A41573m795m294k923j942k057k459k032q27K43O87Q06R86J209J238J017
54726A26430Q48J244K360L616M177L966L678L790M179M779N773O768O656M982
54712A83246K703R98o0j034k085l218m751o515p264o114m094l107l520m004l598
54697A37583k721k095j869j953k235k191j171N40J688J454K57j002j882k356k366
54682A19681j887j154n62m28p16q95m12N08R05L34n00q14q01r59j027n69o1k54
$$ plain form
54664 110389 109529 108512 107741 106910 105859 105318 105983 107339 108230 108242 107863 107605 107625 107972 108595 109274 109953 110879
54646 110879 112074 113113 113848 114843 116527 118444 119860 120637 120905 120518 119569 118880 119049 119444 119093 118167 117590
54629 117590 117493 117160 116360 115568 114877 113798 112350 111318 111121 111292 111421 111742 112375 112728 112213 111071 109990
54612 109990 109272 108776 108345 107943 107606 107528 107940 108745 109510 110031 110625 111585 112597 113009 112659 112211 112541 113810
54594 113810 115241 115923 115736 115338 115331 115796 116598 117592 118428 118673 118424 118253 118215 117598 116105 114684 114436 115212 116010
54575 116010 116310 116172 115503 114293 113396 113923 115751 117552 118504 119112 120097 121286 122022 122091 121884 121989 122816 124164
54557 124164 125093 124736 123392 122342 122417 123250 124053 124577 125110 125972 127269 128823 130157 130882 131157 131438 131833
54540 131833 132165 132639 133762 135442 136839 137409 137583 138001 138461 138117 136555 134393 132782 132405 132843 133000 132286
$$ packed form
54664A10389q60j017p71q31j051n41O65J356Q91J2l79k58K0L47O23O79O79R26
54646A10879J195J039P35R95J684J917J416P77K68l87r49o89J69L95l51r26n77
54629A17590r7l33q00p92o91j079j448j032j97J71J29L21O33L53n15j142j081
54612A09990p18m96m31m02l37p8M12Q05P65N21N94R60J012M12l50m48L30J269
54594A13810J431O82j87l98pM65Q02R94Q36K45k49j71l8o17j493j421k48P76P98
54575A16010L00j38o69j210q97N27J828J801R52O08R85J189P36O9k07J05Q27J348
54557A24164R29l57j344j050P5Q33Q03N24N33Q62J297J554J334P25K75K81L95
54540A31833L32M74J123J680J397N70J74M18M60l44j562k162j611l77M38J57p14
$$ plain form
54523 132286 131256 130840 131198 131709 131857 131581 130933 130033 129312 129139 129114 128398 126861 125311 124385 123855 123293 122855
54505 122855 122973 123683 124630 125489 126094 126383 126413 126260 125862 125191 124508 124147 124075 124070 124250 124942 126023 126959 127595 128429
54485 128429 129978 132250 134817 136975 137914 137402 136348 136069 136886 138010 138775 139239 139496 139353 138972 139012 139652
54468 139652 140212 140193 140013 140183 140468 140464 140446 140902 141654 142129 142218 142299 142669 143441 144684 146101 146857 146420 145379 144868
54448 144868 145225 145724 145622 144924 144080 143357 142698 141963 141148 140410 139897 139555 139208 138826 138488 138094 137400 136442 135599
54429 135599 135164 135140 135522 136393 137558 138481 138870 139045 139558 140684 142394 144418 146187 147067 146948 146308 145597
54412 145597 144952 144573 144873 145902 147067 147731 147795 147519 147215 147257 147899 148766 149082 148726 148506 149041 149960 150719 151580
54393 151580 153066 154867 156091 156389 156110 155508 154487 153146 151940 151156 150625 150054 149373 148736 148386 148462 148775
$$ packed form
54523A32286j030m16L58N11J48k76o48r00p21j73k5p16j537j550r26n30n62m38
54505A22855J18P10R47Q59O05K89L0j53l98o71o83l61p2nJ80O92J081R36O36Q34
54485A28429J549K272K567K158R39n12j054k79Q17J124P65M64K57j43l81M0O40
54468A39652N60j9j80J70K85mj8M56P52M75Q9Q1L70P72J243J417P56m37j041n11
54448A44868L57M99j02o98q44p23o59p35q15p38n13l42l47l82l38l94o94r58q43
54429A35599m35k4L82Q71J165R23L89J75N13J126J710K024J769Q80j19o40p11
54412A45597o45l79L00J029J165O64O4k76l04M2O42Q67L16l56k20N35R19P59Q61
54393A51580J486J801J224K98k79o02j021j341j206p84n31n71o81o37l50P6L13
$$ plain form
54376 148775 148943 148922 149187 150113 151423 152557 153426 154527 156386 159112 162284 165165 167232 168674 170099 171648
54360 171648 172841 173414 173779 174311 174753 174772 174619 174613 174363 173185 171086 168789 166890 165432 164124 162549 160328
54343 160328 157500 154620 152169 150147 148527 147659 147686 147979 147750 146986 146189 145548 145014 144896 145509 146338 146385 145394
54325 145394 144037 142923 142083 141502 141424 141872 142473 142999 143623 144460 145288 145918 146429 146865 147106 147155 147161 146973 146118
54306 146118 144482 142715 141708 141834 142742 143698 144076 143806 143420 143456 143802 143867 143390 142748 142425 142483 142691 142958 143464
54287 143464 144419 145691 146688 146782 146074 145454 145630 146251 146360 145610 144648 144357 145040 146266 147180 147051 145832 144225
54269 144225 143022 142525 142801 144036 146137 148264 149477 149809 150059 150550 150758 150332 149813 149968 150805 151606 151778
54252 151778 151522 151745 153292 156013 158655 159979 159918 159333 158808 158229 157423 156534 155608 154382 152759 151048 149495
$$ packed form
54376A48775J68k1K65R26J310J134Q69J101J859K726L172K881K067J442J425J549
54360A71648J193N73L65N32M42J9j53ok50j178k099k297j899j458j308j575k221
54343A60328k828k880k451k022j620q68K7K93k29p64p97o41n34j18O13Q29M7r91
54325A45394j357j114q40n81p8M48O01N26O24Q37Q28O30N11M36K41M9Oj88q55
54306A46118j636j767j007J26R08R56L78k70l86L6L46O5m77o42l23N8K08K67N06
54287A43464R55J272R97R4p08o20J76O21J09p50r62k91O83J226R14j29j219j607
54269A44225j203m97K76J235K101K127J213L32K50M91K08m26n19J55Q37Q01J72
54252A51778k56K23J547K721K642J324o1n85n25n79q06q89r26j226j623j711j553
$$ plain form
54235 149495 148007 146600 145711 145692 146259 146759 146866 146798 146990 147722 148939 150301 151469 152365 153041 153389 153222 152626
54217 152626 151921 151286 150678 150125 149694 149110 147799 145587 143129 141450 141076 141633 142129 141722 140446 139234 139023
54200 139023 139868 141110 142251 143376 144731 146256 147552 148080 147513 146183 145082 145015 145753 146391 146446 146229 146254
54183 146254 146750 147661 148611 148894 148101 146828 146164 146425 146994 147464 148152 149210 150032 150155 150118 150763 152068 153286
54165 153286 153982 154247 154043 153080 151436 149762 148598 147789 146808 145440 143956 142719 141890 141593 142143 143807
54149 143807 146296 148662 149914 149702 148419 146835 145692 145410 145896 146705 147508 148174 148347 147482 145666 143984
54133 143984 143428 143757 144001 143898 144103 145068 146456 147736 148680 149165 149138 148943 149132 149758 150356 150766 151452 152856
54115 152856 154919 157349 159828 161869 163081 163746 164572 165797 167112 168429 169872 170879 170344 168143 165639
$$ packed form
54235A49495j488j407q89j9N67N00J07o8J92P32J217J362J168Q96O76L48j67n96
54217A52626p05o35o08n53m31n84j311k212k458j679l74N57M96m07j276j212k11
54200A39023Q45J242J141J125J355J525J296N28n67j330j101o7P38O38N5k17K5
54183A46254M96R11R50K83p93j273o64K61N69M70O88J058Q22J23l7O45J305J218
54165A53286O96K65k04r63j644j674j164q09r81j368j484j237q29k97N50J664
54149A43807K489K366J252k12j283j584j143k82M86Q09Q03O66J73q65j816j682
54133A43984n56L29K44j03K05R65J388J280R44M85k7j95J89O26N98M10O86J404
54115A52856K063K430K479K041J212O65Q26J225J315J317J443J007n35k201k504
$$ plain form
54100 165639 164123 163499 163131 163139 164055 165807 167988 170661 174028 177614 180690 183302 186072 189043 191448 192570
54084 192570 192231 190518 187697 184423 181402 178720 175901 172715 169539 166917 165131 164197 163978 164244 164855
54069 164855 165831 167118 168475 169821 171443 173566 175963 178215 180090 181399 181920 181864 181971 182659 183475 183967
54053 183967 184682 186592 189811 193613 197517 201487 205209 208147 210463 213021 216173 219255 221598 223447
54039 223447 225485 228012 230998 234501 238493 242555 246244 249654 253290 257424 261790 265908 269541 272853
54025 272853 276169 279580 282799 285457 287435 288779 289463 289492 289142 288785 288453 287796 286441 284176 280895 276668
54009 276668 271860 266912 261958 256910 251902 247388 243801 241252 239490 237924 235778 232582 228550 224346
53995 224346 220575 217649 215800 214754 213558 211313 208130 204976 202545 200702 199074 197679 196756 196336 196216
$$ packed form
54100A65639j516o24l68QR16J752K181K673L367L586L076K612K770K971K405J122
54084A92570l39j713k821l274l021k682k819l186l176k622j786r34k19K66O11
54069A64855R76J287J357J346J622K123K397K252J875J309N21n6J07O88Q16M92
54053A83967P15J910L219L802L904L970L722K938K316K558L152L082K343J849
54039B23447K038K527K986L503L992M062L689L410L636M134M366M118L633L312
54025B72853L316L411L219K658J978J344O84K9l50l57l32o57j355k265l281m227
54009B76668m808m948m954n048n008m514l587k549j762j566k146l196m032m204
53995B24346l771k926j849j046j196k245l183l154k431j843j628j395r23m20j20
$$ plain form
53980 196216 196137 195849 195263 194585 194140 193996 193966 193877 193619 193002 192029 191278 191553 192957 194624 195585 195704 195731 196618
53961 196618 198737 201484 203729 204988 206095 208294 211836 215963 220261 225321 231941 240271 249940 260370
53947 260370 270605 279328 285577 289210 290546 290009 288351 286616 285430 284679 284303 284939 287255 290930 294828
53932 294828 298039 300355 301999 303294 304489 305540 306220 306681 307622 309576 312358 315560 319181 323324 327752
53917 327752 332368 337726 344303 351487 358168 364248 370693 378028 385613 392534 398340 402689 405104 405620
53903 405620 405000 403785 401691 398461 394762 391574 389020 386390 383076 378951 374070 368598 362891 357107
53889 357107 350801 343435 335179 326731 318444 310225 302259 295127 289036 283507 278124 273137 269023 265816
53875 265816 263173 260770 258344 255633 252586 249457 246456 243507 240519 237595 234741 231708 228478 225583
$$ packed form
53980A96216p9k88n86o78m45j44l0q9k58o17r73p51K75J404J667R61J19K7Q87
53961A96618K119K747K245J259J107K199L542M127M298N060O620Q330R669J0430
53947B60370J0235Q723O249L633J336n37j658j735j186p51l76O36K316L675L898
53932B94828L211K316J644J295J195J051O80M61R41J954K782L202L621M143M428
53917C27752M616N358O577P184O681O080O445P335P585O921N806M349K415N16
53903D05620o20j215k094l230l699l188k554k630l314m125m881n472n707n784
53889C57107o306p366q256q448q287q219p966p132o091n529n383m987m114l207
53875B65816k643k403k426k711l047l129l001k949k988k924k854l033l230k895
$$ plain form
53861 225583 223504 221964 220255 218085 215657 213080 210354 207909 206489 206227 206309 205787 204409 202527 200624
53846 200624 199180 198558 198596 198578 197965 196970 196121 195516 194923 194400 194338 194912 195960 197421 199420 201722 203520 204148
53828 204148 203813 203323 203178 203191 203037 202880 203215 204173 205228 205713 205539 205287 205580 206528 207812 209216 210891 213080
53810 213080 215664 218155 220212 222075 224335 227326 230936 235005 239567 244529 249445 253945 258241 262836
53796 262836 267858 273055 278309 283654 288758 292975 296115 298741 301416 304042 306181 307685 308644 309023 308712
53781 308712 307713 305956 303123 299088 294364 289737 285486 281265 276711 271875 267085 262636 258608 254824
53767 254824 250985 246931 242676 238194 233497 229090 225902 224304 223438 221986 219536 216813 214738 213667
53753 213667 213421 213513 213354 212709 212062 212078 212644 212798 211733 209603 207266 205590 204964 205101 205193 204637 203683 203073
$$ packed form
53861B25583k079j540j709k170k428k577k726k445j420k62Q2n22j378j882j903
53846B00624j444o22L8j8o13r95q49o05n93n23o2N74J048J461J999K302J798O28
53828B04148l35m90j45J3j54j57L35R58J055M85j74k52K93R48J284J404J675K189
53810B13080K584K491K057J863K260K991L610M069M562M962M916M500M296M595
53796B62836N022N197N254N345N104M217L140K626K675K626K139J504R59L79l11
53781C08712r99j757k833m035m724m627m251m221m554m836m790m449m028l784
53767B54824l839m054m255m482m697m407l188j598q66j452k450k723k075j071
53753B13667k46R2j59o45o47J6N66J54j065k130k337j676o26J37R2n56r54o10
$$ plain form
53735 203073 203030 203046 202767 202553 202951 204006 205359 206612 207367 207313 206677 206261 206650 207644 208791 210161 212072 214333
53717 214333 216350 217983 219714 221822 223840 225129 225707 226229 227268 228888 230891 233260 236169 239532 242753
53702 242753 245173 246799 248396 250691 253661 256848 260182 264067 268541 272776 275750 277361 278556 280317
53688 280317 282719 285040 286542 286945 286314 284909 283289 282201 282075 282663 283373 283895 284300 284560 284349 283425 282038
53671 282038 280737 279866 279377 279055 278750 278371 277835 277096 276193 275207 274235 273459 273190 273637 274606 275568 276181 276571
53653 276571 276920 276957 276230 274832 273457 272610 272128 271683 271377 271530 272190 273183 274448 275981 277664 279487 281704
53636 281704 284337 286734 288216 289147 290715 293527 296900 299758 301820 303637 305866 308826 312536 316790
53622 316790 321258 325760 330431 335459 340715 345713 349905 352991 355058 356470 357615 358754 360134 362037
$$ packed form
53735B03073m3J6k79k14L98J055J353J253P55n4o36m16L89R94J147J370J911K261
53717B14333K017J633J731K108K018J289N78N22J039J620K003K369K909L363L221
53702B42753K420J626J597K295K970L187L334L885M474M235K974J611J195J761
53688B80317K402K321J502M03o31j405j620j088j26N88P10N22M05K60k11r24j387
53671B82038j301q71m89l22l05l79n36p39r03r86r72p76k69M47R69R62O13L90
53653B76571L49L7p27j398j375q47m82m45l06J53O60R93J265J533J683J823K217
53636B81704K633K397J482R31J568K812L373K858K062J817K229K960L710M254
53622C16790M468M502M671N028N256M998M192L086K067J412J145J139J380J903
$$ plain form
53608 362037 364472 366996 369202 371351 374128 377773 381833 385875 389912 393880 397156 399078 399719 399735 399548
53593 399548 399117 398495 398210 398828 400255 401612 401863 400607 398347 396032 394323 393289 392674 392231 391730 390838
53577 390838 389240 386944 384383 382073 380136 378203 375943 373606 371796 370637 369469 367627 365305 363330
53563 363330 362236 361823 361513 360816 359531 357945 356826 356880 358114 359939 361816 363476 364642 365057 364923 364917 365605
53546 365605 367043 368964 371041 373013 374929 377301 380590 384563 388603 392623 397125 402284 407719 413392
53532 413392 420014 428050 436814 445122 452592 459931 468201 478099 489654 502254 515111 527938 540925
53519 540925 554071 567109 580303 594663 610854 628460 646817 666092 686868 709097 732180
53508 732180 755794 779935 804389 828878 853581 878785 904093 928694 952380 975641 998690
$$ packed form
53608C62037K435K524K206K149K777L645M060M042M037L968L276J922O41J6j87
53593C99548m31o22k85O18J427J357K51j256k260k315j709j034o15m43n01q92
53577C90838j598k296k561k310j937j933k260k337j810j159j168j842k322j975
53563C63330j094m13l10o97j285j586j119N4J234J825J877J660J166M15j34oO88
53546C65605J438J921K077J972J916K372L289L973M040M020M502N159N435N673
53532D13392O622Q036Q764Q308P470P339Q270R898J1555J2600J2857J2827J2987
53519E40925J3146J3038J3194J4360J6191J7606J8357J9275K0776K2229K3083
53508G32180K3614K4141K4454K4489K4703K5204K5308K4601K3686K3261K3049
$$ plain form
53497 998690 1021077 1042398 1062769 1082472 1101650 1120469 1139103 1157394 1174970 1191808 1208241
53486 1208241 1224455 1240515 1256943 1274547 1293368 1312339 1330325 1347027 1362607 1376944 1389669
53475 1389669 1400532 1409368 1416018 1420631 1423683 1425368 1425251 1422838 1418084 1410999 1401232 1388739 1374549
53462 1374549 1360207 1346427 1332829 1318864 1304333 1288922 1271955 1253061 1232720 1211795 1190741
53451 1190741 1169603 1148559 1128037 1108283 1089101 1070099 1051048 1032035 1013499 996214 980948
53440 980948 967914 956565 946202 936827 929179 923815 920382 918050 916502 916126 917206 919363 922151 925899
53426 925899 931441 938965 947618 956559 966092 977340 990875 1006161 1022425 1039611 1058069 1077654
53414 1077654 1097742 1118222 1140007 1164280 1191499 1221298 1253078 1286347 1320655 1355719 1391811
$$ packed form
53497I98690K2387K1321K0371J9703J9178J8819J8634J8291J7576J6838J6433
53486A208241J6214J6060J6428J7604J8821J8971J7986J6702J5580J4337J2725
53475A389669J0863Q836O650M613L052J685j17k413m754p085r767j2493j4190
53462A374549j4342j3780j3598j3965j4531j5411j6967j8894k0341k0925k1054
53451A190741k1138k1044k0522j9754j9182j9002j9051j9013j8536j7285j5266
53440I80948j3034j1349j0363r375p648n364l433k332j548l76J080K157K788L748
53426I25899N542P524Q653Q941R533J1248J3535J5286J6264J7186J8458J9585
53414A077654K0088K0480K1785K4273K7219K9799L1780L3269L4308L5064L6092
$$ plain form
53403 1391811 1429789 1470505 1514125 1559999 1607118 1654704 1702539 1750912 1800316 1851173 1903670
53392 1903670 1957690 2012774 2068269 2123590 2178347 2232197 2284732 2335624 2384783 2432173 2477514
53381 2477514 2520331 2560322 2597524 2632000 2663513 2691678 2716384 2737826 2755983 2770176 2779266
53370 2779266 2782269 2778605 2767892 2749854 2724613 2692861 2655495 2613231 2566711 2516793 2464470 2410636
53358 2410636 2356176 2302074 2248996 2196833 2145088 2093770 2043608 1995405 1949512 1905802 1863651
53347 1863651 1821942 1779715 1737065 1694947 1653971 1613933 1574716 1536963 1501391 1467983 1436446
53336 1436446 1407032 1380251 1356040 1333909 1313756 1295961 1280635 1267305 1255269 1243818 1232094
53325 1232094 1219302 1205319 1190816 1176661 1163345 1150901 1139172 1128137 1118071 1109241 1101341 1093631
$$ packed form
53403A391811L7978M0716M3620M5874M7119M7586M7835M8373M9404N0857N2497
53392A903670N4020N5084N5495N5321N4757N3850N2535N0892M9159M7390M5341
53381B477514M2817L9991L7202L4476L1513K8165K4706K1442J8157J4193R090
53370B779266L003l664j0713j8038k5241l1752l7366m2264m6520m9918n2323n3834
53358B410636n4460n4102n3078n2163n1745n1318n0162m8203m5893m3710m2151
53347A863651m1709m2227m2650m2118m0976m0038l9217l7753l5572l3408l1537
53336A436446k9414k6781k4211k2131k0153j7795j5326j3330j2036j1451j1724
53325A232094j2792j3983j4503j4155j3316j2444j1729j1035j0066q830p900p710
$$ plain form
53313 1093631 1086041 1079775 1076264 1075653 1076854 1078903 1081606 1084978 1088917 1093761 1100465 1109678 1120992 1133525
53299 1133525 1146989 1161779 1178193 1196035 1215095 1235677 1258346 1283140 1309277 1335741 1362073
53288 1362073 1388312 1414346 1439719 1464106 1487427 1509264 1528798 1545797 1561135 1575654 1588771
53277 1588771 1598910 1605035 1607052 1605011 1598973 1589854 1579373 1568514 1556452 1541403 1522346 1499773
53265 1499773 1475175 1449959 1424531 1398228 1370393 1341436 1312443 1283816 1255065 1225985 1197285
53254 1197285 1169609 1142583 1115395 1087900 1060675 1034219 1008599 983612 958947 934299 909652
53243 909652 885325 861527 838084 814799 791824 769486 748014 727636 708735 691654 676515
53232 676515 663287 651681 641018 630715 621084 613061 606766 600828 593541 584315 573646 562223 550627
$$ packed form
53313A093631p590o266l511o11J201K049K703L372L939M844O704R213J1314J2533
53299A133525J3464J4790J6414J7842J9060K0582K2669K4794K6137K6464K6332
53288A362073K6239K6034K5373K4387K3321K1837J9534J6999J5338J4519J3117
53277A588771J0139O125K017k041o038r119j0481j0859j2062j5049j9057k2573
53265A499773k4598k5216k5428k6303k7835k8957k8993k8627k8751k9080k8700
53254A197285k7676k7026k7188k7495k7225k6456k5620k4987k4665k4648k4647
53243I09652k4327k3798k3443k3285k2975k2338k1472k0378j8901j7081j5139
53232F76515j3228j1606j0663j0303r631q023o295n938p287r226j0669j1423j1596
$$ plain form
53219 550627 539342 528312 516734 504051 490973 478814 467885 457286 446311 435316 425045
53208 425045 415765 407442 400238 394273 389086 383783 377791 371276 364774 358474 351958 344747 337045 329731
53194 329731 323494 318220 313377 308778 304667 301215 298260 295527 292787 289840 286567 283060 279531 276132
53180 276132 272938 269951 266980 263731 260312 257435 255755 255036 254330 252954 251026 249111 247697 247050 247195
53165 247195 247836 248495 248842 248886 248847 248994 249503 250223 250603 250096 248705 246945 245252 243576 241639 239432 237390
53148 237390 236068 235621 235533 235023 233805 232371 231393 231020 230984 231182 231791 232803 233833 234511 234894 235342 236082 236987
53130 236987 237728 238075 238061 237869 237695 237819 238619 240182 241933 243107 243715 244569 246158 247984 249372 250391 251398
53113 251398 252195 252450 252691 253811 255534 256325 255191 252777 250319 248241 246421 245089 244559 244323 243425 241803
$$ packed form
53219E50627j1285j1030j1578j2683j3078j2159j0929j0599j0975j0995j0271
53208D25045r280q323p204n965n187n303n992o515o502o300o516p211p702p314
53194C29731o237n274m843m599m111l452k955k733k740k947l273l507l529l399
53180B76132l194k987k971l249l419k877j680p19p06j376j928j915j414o47J45
53165B47195O41O59L47M4l9J47N09P20L80n07j391j760j693j676j937k207k042
53148B37390j322m47q8n10j218j434r78l73l6J98O09J012J030O78L83M48P40R05
53130B36987P41L47j4j92j74J24Q00J563J751J174O08Q54J589J826J388J019J007
53113B51398P97K55K41J120J723P91j134k414k458k078j820j332n30k36q98j622
$$ plain form
53097 241803 240508 240272 240475 239990 238636 237276 236606 236417 236155 235765 235584 235681 235694 235400 235084 235157 235610 236062 236274
53078 236274 236434 236918 237840 238832 239238 238667 237398 236171 235543 235515 235743 235798 235198 233645 231512 229737 228842 228264
53060 228264 227141 225565 224485 224428 224871 225022 224678 224056 223262 222388 221874 222271 223565 225018 225840 225959 226060
53043 226060 226846 228291 229747 230784 231666 232739 233590 233278 231503 229170 227570 227225 227621 227855 227365 226244
53027 226244 225090 224496 224574 224942 225203 225319 225520 226003 226716 227249 227026 225858 224358 223483 223562 224095 224608 225276
53009 225276 226419 227759 228664 228957 229033 229190 229278 229078 228691 228347 227988 227186 225529 223146 220902 219925 220672 222504
52991 222504 224352 225746 226994 228457 230029 231376 232361 233052 233578 234175 235210 236862 238844 240602 241822
52976 241822 242655 243533 244860 246815 249236 251705 253796 255259 255983 255983 255546 255240 255491 256207 256974 257602 258223
$$ packed form
53097B41803j295k36K03m85j354j360o70j89k62l90j81R7J3k94l16P3M53M52K12
53078B36274J60M84R22R92M06n71j269j227o28k8K28N5o00j553k133j775q95n78
53060B28264j123j576j080n7M43J51l44o22p94q74n14L97J294J453Q22J19J01
53043B26060P86J445J456J037Q82J073Q51l12j775k333j600l45L96K34m90j121
53027B26244j154n94P8L68K61J16K01M83P13N33k23j168j500q75P9N33N13O68
53009B25276J143J340R05K93P6J57Q8k00l87l44l59q02j657k383k244r77P47J832
52991B22504J848J394J248J463J572J347R85O91N26N97J035J652J982J758J220
52976B41822Q33Q78J327J955K421K469K091J463P24%m37l06K51P16P67O28O21
$$ plain form
52959 258223 258968 259801 260649 261287 261082 259328 256127 252570 249724 247670 245806 243795 241766 239839 237994
52944 237994 236382 235221 234329 233207 231802 230759 230684 231373 232012 231944 231137 230078 229387 229382 229896 230546 231126 231569
52926 231569 231631 231016 229849 228644 227702 226868 226059 225584 225735 226335 226932 227186 226912 226112 225218 224944 225521 226387
52908 226387 226898 227075 227260 227425 227320 227071 227053 227237 227182 226692 226082 225689 225476 225185 224692 224182 224118 224894 226378
52889 226378 227997 229493 231212 233318 235067 235537 234834 233928 233378 232902 232275 231814 231735 231738 231684 232142 233720 236157
52871 236157 238603 240587 242277 243864 245181 246015 246489 246969 247720 248782 250104 251663 253351 254815 255615
52856 255615 255683 255436 255283 255140 254626 253575 252088 250145 247508 244007 239713 234902 230096 226004 223044 220951
52840 220951 219211 217824 217174 217172 217053 216243 214988 213923 213388 213425 214061 215189 216365 217085 217274 217311 217581 218055
$$ packed form
52959B58223P45Q33Q48O38k05j754l201l557k846k054j864k011k029j927j845
52944B37994j612j161q92j122j405j043p5O89O39o8q07j059o91nN14O50N80M43
52926B31569O2o15j167j205r42q34q09m75J51O00N97K54k74q00q94k74N77Q66
52908B26387N11J77J85J65j05k49j8J84n5m90o10l93k13k91m93n10o4P76J484
52889B26378J619J496J719K106J749M70p03r06n50m76o27m61p9Ln4M58J578K437
52871B36157K446J984J690J587J317Q34M74M80P51J062J322J559J688J464Q00
52856B55615O8k47j53j43n14j051j487j943k637l501m294m811m806m092k960k093
52840B20951j740j387o50kj19q10j255j065n35L7O36J128J176P20J89L7K70M74
$$ plain form
52822 218055 218233 217540 215930 214067 212688 211804 210912 209931 209463 209930 210923 211741 212294 213087 214506 216395 218214
52805 218214 219340 219390 218542 217485 216885 216920 217385 218023 218576 218696 218116 216927 215574 214574 214244 214512 214938 215118
52787 215118 215136 215459 216290 217289 218090 218838 219901 221202 222159 222351 221992 221629 221448 221018 219857 218195 216972
52770 216972 216888 217635 218289 218271 217575 216288 214467 212612 211640 211999 213112 214040 214449 214671 215032 215504 215934 216335
52752 216335 216871 217662 218603 219405 219954 220572 221668 223140 224432 225266 225991 227074 228534 230057 231492 232999
52736 232999 234838 237041 239263 241029 242313 243657 245373 246928 247715 248208 249472 251411 252500 251666 249633
52721 249633 247819 246625 245497 244118 242642 241096 239369 237685 236397 235338 234044 232543 231394 230894
52707 230894 230761 230622 230396 230152 229933 229758 229547 229122 228481 227942 227761 227804 227919 228333 229305 230644 231988 233255
$$ packed form
52822B18055J78o93j610j863j379q84q92r81m68M67R93Q18N53P93J419J889J819
52805B18214J126N0q48j057o00L5M65O38N53J20n80j189j353j000l30K68M26J80
52787B15118J8L23Q31R99Q01P48J063J301R57J92l59l63j81m30j161j662j223
52770B16972q4P47O54j8o96j287j821j855r72L59J113R28M09K22L61M72M30M01
52752B16335N36P91R41Q02N49O18J096J472J292Q34P25J083J460J523J435J507
52736B32999J839K203K222J766J284J344J716J555P87M93J264J939J089q34k033
52721B49633j814j194j128j379j476j546j727j684j288j059j294j501j149n00
52707B30894j33j39k26k44k19j75k11m25o41n39j81M3J15M14R72J339J344J267
$$ plain form
52689 233255 234332 234672 233921 232780 232446 233190 234134 234536 234614 234940 235585 236144 236180 235424 233898 231944 229884 227649
52671 227649 225119 222793 221583 221861 223157 224887 226826 228749 230168 230765 230712 230358 229984 230015 231015 233151
52655 233151 235981 239027 242162 245273 248018 250342 252773 255617 258114 259033 258129 256511 255469 255264 255210
52640 255210 254581 253148 251046 248546 246105 244334 243583 243587 243787 244064 244880 246648 249350 252988 257965 264589
52624 264589 272378 280208 286954 291629 293247 291273 286259 279587 272531 265868 260173 255876 252973 251155
52610 251155 250184 249728 249088 247858 246750 246882 248099 248926 248464 247447 246969 247054 247139 247211 247567 247944 247825 247314
52592 247314 246913 246573 245745 244345 242970 242112 241740 241713 242068 242809 243860 245261 247008 248693 249795 250436 251341
52575 251341 252847 254388 255229 255353 255279 255256 255002 254218 252969 251493 249853 248039 246401 245653 246207 247614 248891
$$ packed form
52689B33255J077L40p51j141l34P44R44M02P8L26O45N59L6p56j526j954k060k235
52671B27649k530k326j210K78J296J730J939J923J419N97n3l54l74L1J000K136
52655B33151K830L046L135L111K745K324K431K844K497R19r04j618j042k05n4
52640B55210o29j433k102k500k441j771p51MK00K77Q16J768K702L638M977O624
52624B64589P789P830O746M675J618j974n014o672p056o663n695m297k903j818
52610B51155r71m56o40j230j108J32J217Q27m62j017m78Q5Q5P2L56L77j19n11
52592B47314m01l40q28j400j375q58l72k7L55P41J051J401J747J685J102O41R05
52575B51341J506J541Q41J24p4k3k54p84j249j476j640j814j638p48N54J407J277
$$ plain form
52558 248891 249432 249384 249181 249056 249070 249205 249239 248865 248163 247640 247542 247498 247169 246816 246724 246458 245387 243794 242759 242915
52538 242915 243950 245369 247000 248501 249122 248547 247589 247448 248392 249610 250321 250627 251183 252297 253556 254311
52522 254311 254396 254264 254375 254643 254679 254451 254381 254776 255501 256367 257524 259230 261447 263909 266518 269427 272760
52505 272760 276387 279919 282815 284596 285099 284506 283035 280752 277776 274559 271668 269301 267148 264777 262077
52490 262077 259353 257054 255413 254241 253144 252019 251217 251078 251435 251862 252297 253106 254463 256005 257265 258152
52474 258152 258787 259165 259284 259473 260164 261402 262932 264733 267061 269886 272731 275318 278017 281330 285175
52459 285175 289039 292594 295698 297935 298737 298037 296343 294002 290832 286766 282429 278629 275519 272718 270103
52444 270103 267937 266213 264445 262399 260564 259558 259321 259325 259365 259615 259926 259672 258546 257081 256021 255486 255123
$$ packed form
52558B48891N41m8k03j25J4J35L4l74p02n23r8m4l29l53r2k66j071j593j035J56
52538B42915J035J419J631J501O21n75r58j41R44J218P11L06N56J114J259P55
52522B54311Q5j32J11K68L6k28p0L95P25Q66J157J706K217K462K609K909L333
52505B72760L627L532K896J781N03n93j471k283k976l217k891k367k153k371k700
52490B62077k724k299j641j172j097j125q02j39L57M27M35Q09J357J542J260Q87
52474B58152O35L78J19J89O91J238J530J801K328K825K845K587K699L313L845
52459B85175L864L555L104K237Q02p00j694k341l170m066m337l800l110k801k615
52444B70103k166j724j768k046j835j006k37MM0K50L11k54j126j465j060n35l63
$$ plain form
52427 255123 254828 254747 254729 254405 253950 254147 255369 256970 258130 258958 260261 262392 264856 267024 268811 270553
52411 270553 272562 274966 277794 281170 285554 291628 299738 309481 320069 330914 341436 350459 356424
52398 356424 358431 356701 351967 344962 336744 328910 322776 318374 314645 310618 306227 302088 298806 296558
52384 296558 295153 294420 294472 295462 297150 299000 300778 302745 305037 307223 308836 310182 312173 315369 319471
52369 319471 323759 327832 331878 336359 341390 346378 350419 353136 354919 356094 356231 354773 352222 350112
52355 350112 349580 350353 351316 351723 351615 351333 351091 350990 351146 351659 352553 353881 355844 358698 362426 366460 369958
52338 369958 372570 374967 378449 383946 391443 400326 410021 420224 430812 441867 453730 466715 480661
52325 480661 495070 509820 525535 542917 561909 581847 602348 623438 644656 664665 682349
$$ packed form
52427B55123k95q1j8l24m55J97J222J601J160Q28J303K131K464K168J787J742
52411B70553K009K404K828L376M384O074Q110R743J0588J0845J0522R023N965
52398C56424K007j730m734p005q218p834o134m402l729m027m391m139l282k248
52384B96558j405p33N2R90J688J850J778J967K292K186J613J346J991L196M102
52369C19471M288M073M046M481N031M988M041K717J783J175J37j458k551k110
52355C50112n32P73R63M07j08k82k42j01J56N13Q94J328J963K854L728M034L498
52338C69958K612K397L482N497P497Q883R695J0203J0588J1055J1863J2985J3946
52325D80661J4409J4750J5715J7382J8992J9938K0501K1090K1218K0009J7684
$$ plain form
52314 682349 698072 713301 729111 745511 762075 778489 794322 808952 822159 834423 846269
52303 846269 857677 868490 878959 889323 899074 907223 913310 917755 921236 924042 925993 926584 925128
52290 925128 921109 914536 905880 895747 884808 873865 863604 854296 846074 839440 835075 833164 833316
52277 833316 835228 838923 844205 850421 857146 864704 873592 883711 894624 906366 919392 933692 948452
52264 948452 962732 976117 988533 999834 1009966 1019405 1029034 1039463 1050565 1061646 1071935 1080991
52252 1080991 1088905 1096190 1103302 1110066 1115650 1119143 1120044 1118231 1113746 1106916 1098421 1088839 1078097 1065786
52238 1065786 1052095 1038030 1024514 1011632 999046 986874 975703 965824 956887 948431 940516 933668
52226 933668 928288 924161 920554 916884 913376 910899 909975 910097 910299 910287 910661 912014 914271 917121 920707 925386
$$ packed form
52314F82349J5723J5229J5810J6400J6564J6414J5833J4630J3207J2264J1846
52303H46269J1408J0813J0469J0364R751Q149O087M445L481K806J951N91j456
52290I25128m019o573q656j0133j0939j0943j0261r308q222o634m365j911J52
52277H33316J912L695N282O216O725P558Q888J0119J0913J1742J3026J4300J4760
52264I48452J4280J3385J2416J1301J0132R439R629J0429J1102J1081J0289R056
52252A080991P914P285P112O764N584L493R01j813m485o830q495r582j0742j2311
52238A065786j3691j4065j3516j2882j2586j2172j1171r879q937q456p915o848
52226I33668n380m127l607l670l508k477r24J22K02j2L74J353K257K850L586M679
$$ plain form
52210 925386 930944 936541 941634 946588 952052 957903 963229 967474 971202 975479 980658 986078 990845 994619
52196 994619 997685 1000603 1003910 1007879 1012389 1017132 1021883 1026393 1030179 1032939 1035212 1038024 1041594 1044860
52182 1044860 1046667 1046935 1046088 1043779 1038961 1031233 1021446 1010945 1000740 991454 983343 976052 968832 961486
52168 961486 954819 949850 946708 944689 943282 942757 943747 946469 950496 955089 959616 963671 967017 969638 971818
52153 971818 973916 975938 977504 978357 978700 978818 978655 978144 977831 978591 980611 983028 984782 985574 985846 986144 986800
52136 986800 988034 990001 992695 996021 1000019 1004941 1011136 1018927 1028699 1041004 1056427 1075162 1096733
52123 1096733 1120256 1145076 1171052 1198230 1226443 1255356 1284679 1314108 1343191 1371342 1397829
52112 1397829 1421685 1442080 1459130 1473914 1487136 1497973 1504885 1507441 1506730 1504038 1499964 1494928 1489613
$$ packed form
52210I25386N558N597N093M954N464N851N326M245L728M277N179N420M767L774
52196I94619L066K918L307L969M510M743M751M510L786K760K273K812L570L266
52182A044860J807K68q47k309m818p728r787j0501j0205r286q111p291p220p346
52168I61486o667m969l142k019j407n25R90K722M027M593M527M055L346K621K180
52153I71818K098K022J566Q53L43J18j63n11l13P60K020K417J754P92K72K98O56
52136I86800J234J967K694L326L998M922O195P791R772J2305J5423J8735K1571
52123A096733K3523K4820K5976K7178K8213K8913K9323K9429K9083K8151K6487
52112A397829K3856K0395J7050J4784J3222J0837O912K556p11k692m074n036n315
$$ plain form
52099 1489613 1484334 1478650 1472279 1465945 1460543 1455661 1449718 1441613 1431668 1420774 1409161 1396317 1381816
52086 1381816 1365817 1348903 1331799 1315332 1300448 1287953 1278105 1270556 1264852 1261003 1259483 1260647
52074 1260647 1264294 1269856 1276969 1285752 1296504 1309159 1323102 1337608 1352425 1367727 1383467 1399091
52062 1399091 1414043 1428224 1441646 1453959 1464758 1474095 1482098 1488242 1491810 1493121 1493544 1493906 1493533
$$ packed form
52099A489613n279n684o371o334n402m882n943q105r945j0894j1613j2844j4501
52086A381816j5999j6914j7104j6467j4884j2495r848p549n704l849j520J164
52074A260647L647N562P113Q783J0752J2655J3943J4506J4817J5302J5740J5624
52062A399091J4952J4181J3422J2313J0799R337Q003O144L568J311M23L62l73
$$ [...]
##END NTUPLES=NMR SPECTRUM
##END=
