##TITLE=AC1606_TANAH13336_8316815_klo7cDLdu6
##JCAMPDX= 6.0         $$ Bruker NMR JCAMP-DX V2.0
##DATA TYPE= NMR SPECTRUM
##DATA CLASS= NTUPLES
##ORIGIN= BRUKER
##OWNER= Administrator
$$ 1.72 TOPSPIN		Version 2.1
$$ 2013-11-09 22:14:28.411 -0800  Administrator@X
$$ Compression mode = diff/dup
##.OBSERVE FREQUENCY= 400.02188249412
##.OBSERVE NUCLEUS= ^1H
##.ACQUISITION MODE= SIMULTANEOUS (DQD)
##.ACQUISITION SCHEME= undefined
##.AVERAGES= 8
##.DIGITISER RES= 22
##SPECTROMETER/DATA SYSTEM= spect
##.PULSE SEQUENCE= zg30
##.SOLVENT NAME= COFFEE_meoh
##.SHIFT REFERENCE= INTERNAL, COFFEE_meoh, 1, 14.98509
##AUDIT TRAIL= $$ (NUMBER, WHEN, WHO, WHERE, PROCESS, VERSION, WHAT)
$$ ##TITLE= Audit trail, TOPSPIN		Version 2.1
$$ ##JCAMPDX= 5.01
$$ ##ORIGIN= Bruker BioSpin GmbH
$$ ##OWNER= Administrator
$$ $$ E:\/data/COFFEE/nmr/AC1606_TANAH13336_8316815_klo7cDLdu6/10/pdata/1/auditp.txt
$$ ##AUDIT TRAIL=  $$ (NUMBER, WHEN, WHO, WHERE, PROCESS, VERSION, WHAT)
(   1,<2013-11-09 22:14:21.286 -0800>,<Administrator>,<X>,<go>,<TOPSPIN 2.1>,
      <created by zg
	started at 2013-11-09 22:13:14.724 -0800,
	POWCHK enabled, PULCHK disabled,
       configuration hash MD5:
       C8 4E 4E 5D D3 5C D8 9E 9F 52 82 E0 59 8A DE 15
       data hash MD5: 64K
       1A CF D2 A0 59 C2 30 E2 A8 BB 36 D4 53 8E F4 B9>)
(   2,<2013-11-09 22:14:24.224 -0800>,<Administrator>,<X>,<proc1d>,<TOPSPIN 2.1>,
      <Start of raw data processing
       efp LB = 0 FT_mod = 6 PKNL = 1 PHC0 = 0 PHC1 = 0 SI = 32K 
       data hash MD5: 32K
       37 36 0C 88 3D 32 75 F2 5A D0 61 B1 0A 33 86 B0>)
(   3,<2013-11-09 22:14:24.536 -0800>,<Administrator>,<X>,<proc1d>,<TOPSPIN 2.1>,
      <pk PHC0 = 89.56604 PHC1 = 0 
       data hash MD5: 32K
       CC A8 9D 3A AB EC E3 52 AD B2 15 5D E1 2E D2 9A>)
(   4,<2013-11-09 22:14:24.677 -0800>,<Administrator>,<X>,<proc1d>,<TOPSPIN 2.1>,
      <abs ABSG = 1 
       data hash MD5: 32K
       76 37 67 5F E5 C8 C2 65 09 4E 07 6C F5 4D 7F D5>)
(   5,<2013-11-09 22:14:24.739 -0800>,<Administrator>,<X>,<proc1d>,<TOPSPIN 2.1>,
      <abs ABSG = 2 
       data hash MD5: 32K
       51 30 AF B5 2B BE 3C FA 60 93 F3 DC 05 F8 AF C3>)
(   6,<2013-11-09 22:14:24.849 -0800>,<Administrator>,<X>,<proc1d>,<TOPSPIN 2.1>,
      <abs ABSG = 3 
       data hash MD5: 32K
       43 00 72 A9 50 47 58 4E 47 B3 81 C9 44 03 22 10>)
(   7,<2013-11-09 22:14:24.942 -0800>,<Administrator>,<X>,<proc1d>,<TOPSPIN 2.1>,
      <abs ABSG = 4 
       data hash MD5: 32K
       AA 0F E2 10 A4 6F 95 38 47 58 23 80 23 B1 7D 2B>)
(   8,<2013-11-09 22:14:25.005 -0800>,<Administrator>,<X>,<proc1d>,<TOPSPIN 2.1>,
      <abs ABSG = 5 
       data hash MD5: 32K
       3E 66 41 C1 42 5E A7 E5 D5 80 8C D4 2F 01 05 76>)
$$ ##END=
$$ 
$$ $$ hash MD5
$$ $$ D3 51 5A 68 D1 20 71 65 F5 78 02 A5 91 01 FD CD
##$RELAX= 
##$RELAX= 
##$RELAX= 
##$RELAX= 
##$RELAX= 
##$RELAX= 
##$RELAX= 
$$ Bruker specific parameters
$$ --------------------------
##$DU= <E:\>
##$EXPNO= 10
##$NAME= <AC1606_TANAH13336_8316815_klo7cDLdu6>
$$ [...]
150 150 150 150 150 150 150 150
##$TP07= 0
##$TPNAME0= <>
##$TPNAME1= <>
##$TPNAME2= <>
##$TPNAME3= <>
##$TPNAME4= <>
##$TPNAME5= <>
##$TPNAME6= <>
##$TPNAME7= <>
##$TPOAL= (0..7)
0.5 0.5 0.5 0.5 0.5 0.5 0.5 0.5
##$TPOFFS= (0..7)
0 0 0 0 0 0 0 0
##$TUNHIN= 0
##$TUNHOUT= 0
##$TUNXOUT= 0
##$USERA1= <user>
##$USERA2= <user>
##$USERA3= <user>
##$USERA4= <user>
##$USERA5= <user>
##$V9= 5
##$VALIST= <valist>
##$VCLIST= <CCCCCCCCCCCCCCC>
##$VD= 0
##$VDLIST= <DDDDDDDDDDDDDDD>
##$VPLIST= <PPPPPPPPPPPPPPP>
##$VTLIST= <TTTTTTTTTTTTTTT>
##$WBST= 1024
##$WBSW= 4
##$XGAIN= (0..3)
0 0 0 0
##$XL= 0
##$YL= 0
##$YMAX_a= 633591
##$YMIN_a= -549123
##$ZGOPTNS= <>
##$ZL1= 120
##$ZL2= 120
##$ZL3= 120
##$ZL4= 120
##$ABSF1= 14.98509
##$ABSF2= -5.573092
##$ABSG= 5
##$ABSL= 3
##$ALPHA= 0
##$AQORDER= 0
##$ASSFAC= 0
##$ASSFACI= 0
##$ASSFACX= 0
##$ASSWID= 0
##$AUNMP= <proc_prof1d_extract_pilot.lims>
##$AXLEFT= 0
##$AXNAME= <>
##$AXNUC= <1H>
##$AXRIGHT= 0
##$AXTYPE= 0
##$AXUNIT= <>
##$AZFE= 0.1
##$AZFW= 0.1
##$BCFW= 0
##$BC_mod= 0
##$BYTORDP= 0
##$COROFFS= 0
##$CY= 15
##$DATMOD= 1
##$DC= 0
##$DFILT= <>
##$DTYPP= 0
##$F1P= 0
##$F2P= 0
##$FCOR= 0.5
##$FTSIZE= 32768
##$FT_mod= 6
##$GAMMA= 0
##$GB= 0
##$INTBC= 1
##$INTSCL= 1
##$ISEN= 128
##$LB= 0
##$LEV0= 0
##$LPBIN= 0
##$MAXI= 10000
##$MC2= 0
##$MEAN= 0
##$ME_mod= 0
##$MI= 0
##$NCOEF= 0
##$NC_proc= -8
##$NLEV= 6
##$NOISF1= 0
##$NOISF2= 0
##$NSP= 0
##$NTH_PI= 0
##$NZP= 0
##$OFFSET= 14.98509
##$PC= 1
##$PHC0= 89.56604
##$PHC1= 0
##$PH_mod= 1
##$PKNL= yes
##$PPARMOD= 0
##$PPDIAG= 0
##$PPIPTYP= 0
##$PPMPNUM= 2147483647
##$PPRESOL= 1
##$PSCAL= 4
##$PSIGN= 0
##$PYNMP= <proc.py>
##$REVERSE= no
##$SF= 400.02
##$SI= 32768
##$SIGF1= 0
##$SIGF2= 0
##$SINO= 400
##$SIOLD= 32768
##$SPECTYP= <>
##$SREGLST= <1H.CDCl3>
##$SSB= 0
##$STSI= 32768
##$STSR= 0
##$SW_p= 8223.68421052631
##$SYMM= 0
##$S_DEV= 0
##$TDeff= 65536
##$TDoff= 0
##$TI= <>
##$TILT= no
##$TM1= 0
##$TM2= 0
##$TOPLEV= 0
##$USERP1= <user>
##$USERP2= <user>
##$USERP3= <user>
##$USERP4= <user>
##$USERP5= <user>
##$WDW= 1
##$XDIM= 32768
##$YMAX_p= 471553050
##$YMIN_p= -902209
##$CURPLOT= <Network HP LaserJet P1505>
##$CURPRIN= <$Network HP LaserJet P1505>
##$DFORMAT= <normdp>
##$LAYOUT= <+/1D_H.xwp>
##$LFORMAT= <normlp>
##$PFORMAT= <normpl>
##$SURQMSG= 1
$$ End of Bruker specific parameters
$$ ---------------------------------
##NTUPLES= NMR SPECTRUM
##VAR_NAME=  FREQUENCY,     SPECTRUM/REAL,   SPECTRUM/IMAG
##SYMBOL=    X,             R,               I
##VAR_TYPE=  INDEPENDENT,   DEPENDENT,       DEPENDENT
##VAR_FORM=  AFFN,          ASDF,            ASDF
##VAR_DIM=   32768,         32768,           32768
##UNITS=     HZ,            ARBITRARY UNITS, ARBITRARY UNITS
##FACTOR=    0.250966925370066, 1,           1
##FIRST=     8223.43324360094, -166518,      -160619
##LAST=      0,             19709,           -31021
##MIN=       0,             -902209,         0
##MAX=       8223.43324360094, 471553050,    0
$$ Real data points
##PAGE= N=1
##DATA TABLE= (X++(R..R)), XYDATA
$$ [...]
19549A09718c46775J18941P105B0010L0066c5978k08857f7554m5378A1866a52888
19537e1557n36728f9276A24120b03480a7633o0817k70523A18042a29309p4076
19527b03385A6331d6463j16951A08389a7445p9459C7250b28586k51997b30990
19516a23830m4336j0953B33083a36197l5144c3649p9315k0144f1351C35011E1604
19504b12431b5536A757a10477d8855B05385a6766j32261G0228L7541b44401i3634
19492a02817b5625j39904g5997A91746d36991B4113g7831A47889a98276A97820
19481a10946c0875j32770j24120G3293b57118K219G7300l7812q30M512c97209
19469d1612m3648m9623j81106A44646K09448c15601A70855a74700K3690b9538
$$ plain form
19549 109718 -346775 -227834 -220729 20010 50076 -35978 -244835 -67554 -112932 11866 -152888
19537 -51557 -588285 -69276 124120 -203480 -17633 -78450 -348973 118042 -129309 -203385
19527 -203385 16331 -46463 -163414 108389 -17445 -96904 37250 -228586 -480583 -230990
19516 -123830 -168166 -179119 233083 -136197 -171341 -33649 -112964 -133108 -61351 335011 51604
19504 -212431 -25536 1757 -110477 -48855 205385 -16766 -149027 70228 107769 -244401 -93634
19492 -102817 -25625 -165529 -75997 191746 -436991 24113 -77831 147889 -198276 197820
19481 -110946 -30875 -163645 -287765 73293 -257118 -254899 77300 39488 38658 43170 -397209
19469 -41612 -85260 -134883 -315989 144646 354094 -315601 170855 -174700 -151010 -29538
19458D4518b67087h4194j78442i2605A81218G0109c8613A94702a80190k0402L7878
19447a62714K5046B90216a12228o3663l233e2588E0365J01103d393k8257H5928
19435b860A74805P619b41397J1330m4234F8656b64092e7567j92469L7345C887
19423f0442o6453j3681F8562J74328b22607A27363a94340h25j20006B60373b72679
19411F3572a67547g4546l9947k16689I0563i6751n8528L4482A88487c68386A29103
19399I2633C3402b47287k15350b9330l3251j39371e4227j32125k5708C13118a59269
19387A5320L6893k0987a58314J0828g180n7888j34750G0561c1550o6537a0980
19375a86336K3612A69596C7972a29748c2891A852b16771g6594D6339c2189j12357
$$ plain form
19458 44518 -267087 -84194 -262636 -92605 181218 70109 -38613 194702 -180190 -200592 -162714
19447 -162714 -137668 290216 -112228 -175891 -179124 -52588 50365 151468 -4393 -32650 85928
19435 -2860 174805 182424 -241397 -230067 -274301 68656 -264092 -57567 -250036 -212691 3887
19423 -60442 -126895 -140576 68562 242890 -222607 127363 -194340 -825 -120831 260373 -272679
19411 63572 -167547 -74546 -114493 -331182 90563 -96751 -155279 -120797 188487 -368386 129103
19399 92633 33402 -247287 -462637 -29330 -62581 -201952 -54227 -186352 -212060 313118 -159269
19387 15320 52213 31226 -158314 -147486 -7180 -65068 -199818 70561 -31550 -98087 -10980
19375 -186336 -162724 169596 37972 -129748 -32891 1852 -216771 -76594 46339 -32189 -144546
19364a44546O9494A6224c90233B26716Q325c50794C30044i2035L6429I4501a05373
19352h7627C1771b72693a30199J7329H6780b56507a4137G576b10403J0680m7939
19341b47662m9322i5819E0815J08979a30932M0496E7074E674a09134K0078Q500
19330h0556j38900M2756h0481H7631k1649b65409F3830a66341p894J4851H6182
19318d2108J3344D5559D690O4092a49105N0534I713J67665b71007d1584l22198
19307c63782J37245d8526B75487a85946B213f3068G6134b37139p8318M1361J02421
19296a71675j67878c669k42065b2180k36712f881l573j93128B36J46089a55326
19284c19944a0900l78749J78106B1965c12434h9076n9963B7479a53920p4377n6276
$$ plain form
19364 -144546 -75052 16224 -390233 226716 235041 -350794 330044 -92035 -55606 94501 -105373
19352 -87627 31771 -272693 -130199 -112870 86780 -256507 -14137 7576 -210403 -199723 -247662
19341 -247662 -296984 -95819 50815 159794 -130932 -90436 57074 5674 -109134 -89056 -80556
19330 -80556 -219456 -176700 -80481 87631 65982 -265409 63830 -166341 -174235 -159384 86182
19318 -42108 -28764 45559 4690 68782 -149105 -98571 9713 177378 -271007 -41584 -363782
19307 -363782 -226537 -48526 275487 -185946 2213 -63068 76134 -237139 -315457 -274096 -171675
19296 -171675 -339553 -3669 -245734 -22180 -258892 -6881 -10454 -203582 236 146325 -155326
19284 -319944 -10900 -389649 -211543 21965 -312434 -89076 -149039 27479 -153920 -228297 -284573
19273b84573a11157o066E4796k5074H912K22226H6915e1402a8570B27403a16399
19261d0337A77616n9864g3275n4497N5546I9498b30247g4384J5214q4100b8494
19249a64107A26570B9784a6235F4984b29020M6113A92948q8427b85813a02449
19238i019q8559N474K9319a9177j15603e178k40604f0428l6493I0291A0996c00228
19225a4151j47831j65738d0104p508k67500C830i0407B77795i6535H8250a42470
19213b38738D3811J52880f3730m5820n2092H5352c8845n5088A90117a34090I5617
19201b3522m036A63641K34055b49194j73855a68922e2178j8649H416b53471G3362
19189c8913j24937h895l14295J52825p9461f5757D2651J42018C2668H320j844
$$ plain form
19273 -284573 -111157 -117223 54796 29722 8912 231138 86915 -51402 -18570 227403 -116399
19261 -40337 177616 117752 -73275 -127772 -72226 99498 -230247 -74384 -59170 -143270 -28494
19249 -164107 126570 29784 -16235 64984 -229020 -182907 192948 104521 -285813 -102449
19238 -9019 -97578 -92104 -62785 -19177 -134780 -5178 -245782 -60428 -96921 90291 10996 -300228
19225 -14151 -161982 -327720 -40104 -47612 -315112 3830 -90407 277795 -96535 88250 -142470
19213 -238738 43811 196691 -63730 -109550 -161642 85352 -38845 -93933 190117 -134090 95617
19201 -23522 -27558 163641 397696 -249194 -423049 -168922 -52178 -70827 8416 -253471 73362
19189 -38913 -163850 -8895 -323190 -170365 -249826 -65757 42651 184669 32668 8320 6476
19178F476Q2697M9592N5900a40158B96870i2475A17511C5339i6807n5296c5017
19166b90346a38472d1348a3826j57057C5889M05048j26458G1073P6496a16864
19155C719P7491a11940M053k296G9111a7033j70420c8183j68238j76961P8828
19144c04554A69985a63385F1176p245e3781r5928f851o6577F6367J1396a26058
19132a84252o5879P0121Q5466H0983a33274f0988j69581m4411D8130a91761c6648
19120a59012j0712g8168J0396j55922K3136h4292b4241A04583J58476a82839a8762
19108b00753A59474E8987a39341p0407b195B17253F5752d9343D1367M7939L0372
19097A19678a42350l80255a22103E6156c5347j69525A92197a22258N5171n4923
$$ plain form
19178 6476 89173 138765 194665 -140158 296870 -92475 117511 35339 -96807 -152103 -35017
19166 -290346 -138472 -41348 -13826 -170883 35889 440937 314479 71073 147569 -116864
19155 3719 81210 -111940 -107887 -110183 79111 -17033 -187453 -38183 -206421 -383382 -304554
19144 -304554 169985 -163385 61176 53931 -53781 -149709 -6851 -73428 66367 77763 -126058
19132 -184252 -250131 -180010 -94544 80983 -133274 -60988 -230569 -274980 48130 -191761 -36648
19120 -159012 -169724 -78168 -67772 -223694 -200558 -84292 -24241 104583 263059 -182839 -18762
19108 -200753 159474 58987 -139341 -209748 -2195 217253 65752 -49343 41367 89306 119678
19097 119678 -142350 -522605 -122103 56156 -35347 -204872 192197 -122258 -67087 -122010
19087a22010d92D8618K7811K3495J29551a24815E5315c01134B1639a91466k77393
19076d68859b3126C5151j1574N3168b43185a6815b371j87659F1345J96874c7775
19064E800f9332A65053b05155K9313n0045G0469c31928Q6521A1027M20300A51436
19052B55589a59441e6905B04251b17954Q2874b8748A47562a6107B58580E6549
19041I8217a19433b7826l11067A38557d2566B08209f5845B6333a87548M9667B25073
19029f210j28885A1187M0231f5736G499M9365O1952P2574l4300c37900E2286g2851
19016B44164a97415H9194b73671f3552A01521f8735m4521P003A16226f5687l92115
19005d57802a79184F753a02777k42613a07876G9595L5215n2705c9508k84360a31881
$$ plain form
19087 -122010 -492 48618 76429 99924 229475 -124815 55315 -301134 21639 -191466 -468859
19076 -468859 -23126 35151 23577 76745 -243185 -16815 -2371 -190030 61345 258219 -37775
19064 5800 -69332 165053 -205155 -175842 -225887 70469 -331928 -245407 11027 431327 151436
19052 255589 -159441 -56905 204251 -217954 -135080 -28748 147562 -16107 258580 56549
19041 98217 -119433 -27826 -338893 138557 -42566 208209 -65845 26333 -187548 -137881 225073
19029 -6210 -135095 11187 51418 -65736 7499 56864 118816 191390 157090 -337900 52286 -72851
19016 244164 -197415 89194 -273671 -63552 101521 -68735 -113256 -106253 116226 -65687 -457802
19005 -457802 -179184 6753 -102777 -345390 -107876 79595 114810 62105 -39508 -323868 -131881
18993e6922k95052A75612J00967b763C2232a39785B31814b4505j4884k9925r4892
18982a64206A65672b57329m9084a13535K3553K1152j05185a244n9727j12169B91068
18970a98951Q754K6005O470l5789a350k05522R6101c3364k88773A4016C817O14843
18958F18660a4198C09352B9447R2385b00032p7165A91490a52139A22138b37430
18947I7019d22032a59152o1292G2921a85949B64891B638J97289b89660a18438
18936G9922e25765J39770D1320L55178d19166f9488n9123A94667h8369b9206j76469
18925b05675j33192B39145B5960b58827I2626R2209H0847I672b3251F2493g049
18913B8207J5140i8014n0659A71187J90129A53524a21613j35773J16950j05200
$$ plain form
18993 -56922 -351974 175612 276579 -2763 32232 -139785 231814 -24505 -39389 -69314 -164206
18982 -164206 165672 -257329 -306413 -113535 -89982 -68830 -174015 -1244 -60971 -173140 291068
18970 -198951 -190197 -164192 -157722 -193511 -1350 -206872 -110771 -33364 -322137 14016 3817 618660
18958 618660 -14198 309352 29447 121832 -200032 -277197 191490 -152139 122138 -237430
18947 97019 -422032 -159152 -220444 72921 -185949 264891 2638 199927 -289660 -118438
18936 79922 -525765 -385995 41320 396498 -419166 -69488 -128611 194667 -88369 -29206 -205675
18925 -205675 -338867 239145 25960 -258827 92626 184835 80847 9672 -23251 62493 -7049
18913 28207 43347 -98014 -148673 171187 361316 153524 -121613 -257386 -140436 -245636
18903b45636A17256J07223b52128D9125R8931J00261b41307l3918D7028N6066
18893A03094c96324f1763A5942K13515e9565k83648i7936p0242O8621r775A11334
18881a70445L3263F4695J6862I960O9642b59385i9618l76332A6901J3366P1597
18870A01864a20022c634p4037o1283D1823A2212J32283a96825A92699b38946J2501
18859b26445o0934H1295a78723B00792b32049d0240G7663b24960B43790j9050
18849B24740N507b31607I1058i3057j10854j9025A77894A5961a29643R643d9647
18837e33138A87890I3119C201d4580I9526b37591B58417i5709F8000J5232Q8463
18826A71695c22620J45388r6937J07053C2516b17127B56242a04118k48212I5776
$$ plain form
18903 -245636 117256 224479 -252128 49125 148056 248317 -241307 -275225 47028 103094
18893 103094 -396324 -61763 15942 229457 -59565 -343213 -97936 -168178 -99557 -109332 111334
18881 -170445 -137182 64695 81557 9960 79602 -259385 -99618 -475950 16901 30267 101864
18870 101864 -120022 -3634 -77671 -138954 41823 12212 144495 -196825 192699 -238946 -226445
18859 -226445 -287379 81295 -178723 200792 -232049 -40240 77663 -224960 243790 224740
18849 224740 230247 -231607 91058 -93057 -203911 -222936 177894 15961 -129643 -120000 -49647
18837 -533138 187890 93119 3201 -44580 99526 -237591 258417 -95709 68000 83232 171695
18826 171695 -322620 -177232 -274169 -167116 32516 -217127 256242 -104118 -352330 95776
18815C92913a66395A20375Q5380C8432e4300E2447O3053J03306o3668F7157e4069
18803b14532L3453c911I705a5863l332l1246B0764c2878o7058J6113l71693e4782
18790c21591Q0983A39176a66341F6193c67637D2201L4612J97788c06565a11358
18779B13578d18279c4817q3606A56425f8648E7476p641a46157e2538C0375d3086
18767A27026a64988g6602c6555l3400H7533a54004j96212H0502e884n0118D7566
18755b99268a053j75332f5759L647F2418a04995B0279e7283m01927J42986A03427
18743f1519q9272A90001h7303b7165j92736B07273D7500a267j37003C89520H8835
18731b8183k37953a00962F6602G06a88666A48405j9552h560l28789d201k32n3204
$$ plain form
18815 392913 -166395 120375 205755 38432 -54300 52447 115500 218806 155138 67157 -54069
18803 -214532 -181079 -3911 9705 -15863 -19195 -50441 20764 -32878 -99936 -83823 -455516 -54782
18790 -321591 -240608 139176 -166341 66193 -367637 42201 76813 274601 -306565 -111358
18779 213578 -418279 -34817 -118423 156425 -68648 57476 49835 -146157 -52538 30375 -43086
18767 127026 -164988 -76602 -36555 -69955 87533 -154004 -350216 80502 -5884 -56002 47566
18755 -299268 -1053 -176385 -65759 -62112 62418 -104995 20279 -57283 -459210 -316224 103427
18743 -61519 -150791 190001 -87303 -27165 -219901 207273 47500 -1267 -138270 389520 88835
18731 -28183 -266136 -100962 66602 706 -188666 148405 128853 -8560 -337349 -4201 -4433 -57637
18719e7637j59013B89739b73395A93461H3453l1429a79496E5815J94902B8429
18708g7971j20429O0998N452G5536c83707a89330A24897b3298k817j52410E5945
18696A57294c26467A02563a26240H5051f9042j19916l5117f5859k42566M468B5787
18684e8686j84122I41h6441B87436B0044J60385f4682j30203C654O3773b76540
18672B79673a61675M3914m5123P1191D5680b1324p0671M2997j59053A85113q3130
18661A01983C9549b50953D00145b26894j38481b9671j67251F3384K8463i2075
18650g7066j80758J05014g1379A56770a64352i252F507M0795c65301c4661q9177
18639a23838D01142h5445j7506A31640b21899e6999k3986J0528K9291k28332g6182
$$ plain form
18719 -57637 -216650 289739 -273395 193461 83453 52024 -179496 55815 250717 28429
18708 -77971 -198400 -137402 -131950 75536 -383707 -189330 124897 -23298 -26115 -178525 55945
18696 157294 -326467 102563 -126240 85051 -69042 -188958 -224075 -65859 -308425 -303957 25787
18684 -58686 -242808 941 -86441 287436 20044 180429 -64682 -194885 3654 67427 -276540
18672 279673 -161675 -117761 -162884 -91693 45680 -21324 -91995 -48998 -208051 185113 101983
18661 101983 39549 -250953 400145 -226894 -365375 -29671 -196922 63384 91847 -92075
18650 -77066 -257824 -152810 -71379 156770 -164352 -9252 6507 47302 -365301 -34661 -123838
18639 -123838 401142 -85445 -102951 131640 -221899 -56999 -80985 -70457 -41166 -269498 -76182
18627A07540C1618L04850c18267A37732c2065n2182k63735e8506H6434b7384j90601
18616b17985g2980k8571J8152j5431A16330b29002I0048b53713q3612Q7602f0560
18604a19508j91551J38241a796j8557A32969b41687D49048c48455a26459h891
18593F9153f798B00076e4419l1696q183j33008O1270k61072a7577j43133j09363
18582b70073A9764J79389A7308b15736H6287i3496B1953M5156n224c15815J30592
18571a85223L96N2987k14624c991j80044b1682j53519g0034c0750k4139D8814
18559F3974K12412k4422H6101a72530B04884c27734R7734C4797P0375a31416L0363
18548a01053j41059J13648B69333h2356l0899k09163a07365O912D0920J97427
$$ plain form
18627 107540 31618 336468 -318267 137732 -32065 -84247 -347982 -58506 86434 -27384 -217985
18616 -217985 -72980 -101551 -83399 -98830 116330 -229002 90048 -253713 -337325 -249723 -60560
18604 -119508 -311059 -172818 -1796 -20353 132969 -241687 449048 -348455 -126459 -8891
18593 69153 -6798 200076 -54419 -86115 -94298 -227306 -166036 -427108 -17577 -160710 -270073
18582 -270073 19764 199153 17308 -215736 86287 -93496 21953 67109 61885 -315815 -185223
18571 -185223 -184827 -131840 -346464 -3991 -184035 -21682 -175201 -70034 -30750 -54889 48814
18559 63974 276386 251964 86101 -172530 204884 -327734 -230000 34797 105172 -131416 -101053
18548 -101053 -242112 -128464 269333 -82356 -113255 -322418 -107365 -100453 40920 238347
18538B38347A11920a66542C4360a37739M5010B96602J93859a54518O4970C42112
18527b66000d7475m84524b01386i3056j5356d7728P703l0408A82280b86438F89
18515e0718j88382H2017J25231c44558h9986j75686J23392H2665k4107g7438F0167
18503g5772l8388F7140a10414q249O784O768A24903h2839A19682a57587H2210
18491a26257F6635B9750R0894J6246O0166l5230c84893f4588l59098A00341a91832
18479A7593R1640J6074c1041k48285A96077n4163d2873j21815O0074o4881g8765
18467a73594B0917a30209C2784g5821A13638M2536h0111m3420N8046J1755l44940
18456c98670a07625a6077B18709h4684H5692d0848r2948n7903P2284N5447j37437
$$ plain form
18538 238347 111920 -166542 34360 -137739 -92729 296602 490461 -154518 -89548 342112
18527 -266000 -47475 -531999 -201386 -93056 -108412 -47728 -40025 -70433 182280 -286438 689
18515 -50718 -239100 82017 207248 -344558 -89986 -265672 -142280 82665 58558 -77438 60167
18503 -75772 -114160 67140 -110414 -118663 -111879 -105111 124903 -82839 119682 -157587 82210
18491 -126257 66635 29750 120644 136890 197056 161826 -384893 -64588 -423686 100341 -191832
18479 17593 109233 125307 -31041 -279326 196077 141914 -42873 -164688 -104614 -169495 -78765
18467 -173594 20917 -130209 32784 -75821 113638 156174 -80111 -123531 -65485 -53730 -398670
18456 -398670 -107625 -16077 218709 -84684 85692 -40848 -133796 -191699 -119415 -63968 -201405
18445b01405p9385a3025o9995B49674b37360b6938E1427b61806C9089i5713L6825
18434e8888A1198a92534k3054E5768K93110H8673a48820O9390A87485k933P291
18423A91843J17361A7536c6287m57254a92335b8583j67611A90833c45821n4269
18413d00090J36983e1562j28831A48809c1075C5804J6939J10520k5675R0252o6055
18402A61785g7543B84632b11632j5401A15017Q5316j278a12809c1286D1554d5107
18390A07023h8967L6112A55388F606i594E0765g9384m5068b8146k0695l04253
18379c53094A31459C5226i0658k39642B15928a37234k85120I6579K301i4317B53639
18367a50554K6209I6684i8660A73176m9327a37902Q622k34648F2939J74928b45876
$$ plain form
18445 -201405 -280790 -13025 -83020 249674 -237360 -26938 51427 -261806 39089 -95713 -58888
18434 -58888 11198 -192534 -215588 55768 348878 88673 -148820 -79430 187485 184552 191843
18423 191843 309204 17536 -36287 -493541 -192335 -28583 -196194 190833 -345821 -400090
18413 -400090 -263107 -51562 -180393 148809 -31075 35804 52743 163263 137588 227840 161785
18402 161785 -77543 284632 -211632 -227033 115017 200333 199055 -112809 -31286 41554 -45107
18390 107023 -88967 -52855 155388 6606 -9594 50765 -79384 -124452 -28146 -48841 -353094
18379 -353094 131459 35226 -90658 -330300 215928 -137234 -422354 96579 98880 -94317 253639
18367 -150554 -124345 96684 -98660 173176 123849 -137902 -129280 -363928 62939 237867 -245876
18355D0600R5852e2886n4015C51424e0060n6272c0346k12389k5980H3760d795
18343i5586H2838e61409f1743A47111M8853b86313P9747A47160f0581H3681l1222
18332E2459N1150n835d11610C87789b16924B63102b32486G8c33016J54536d7498
18320B64721j14081b0245A2304J43942c74690K2709c2960k32412k57R5539P1977
18309i8113A4878J557g5586J8791M953k8701p6975e3877j83449j08362e9726B1825
18296B67588J02870c27831l3035E8283b47700B27584f2888I9833P321g1248C00389
18284B93779f4341m65896b51231o406a24322J1934A01645a99664o3670A29617
18273G1430K04103c64384A8310J07817P2780c77179A00411b07621L5644j98899
$$ plain form
18355 40600 136452 -52886 -106901 351424 -50060 -106332 -30346 -242735 -268715 83760 -4795
18343 -95586 82838 -561409 -61743 147111 195964 -286313 -206566 147160 -60581 83681 52459
18332 52459 103609 97774 -411610 387789 -216924 263102 -232486 78 -333016 -178480 -47498
18320 264721 150640 -20245 12304 156246 -374690 -351981 -32960 -265372 -265629 -170090 -98113
18309 -98113 14878 16435 -75586 -56795 -51842 -80543 -157518 -53877 -237326 -345688 -59726 21825
18296 267588 370458 -327831 -360866 58283 -247700 227584 -62888 99833 107154 -71248 300389
18284 293779 -64341 -530237 -251231 -257637 -124322 -112388 101645 -199664 -263334 129617
18273 71430 275533 -364384 18310 126127 198907 -377179 100411 -207621 -171977 -370876
18263c70876i677j59354o707M6532B39668I446a9771j07956l7014A1169O6203
18252G7372a68369A36443a18314j42057A39197c4449D39886c1007p0406k73996
18242c75409a17751j06687E55605A48205d0054k30751G537a29383E3618a32802
18231b76057g8771I9405c1948N079k27356F5889a20380A61460b82498J30728b1863
18219a02234I179j942a78335f7430A17610j3374g1617j068A52450b06051M6823
18208a59228E1642k0548L31396d5597o915G8766b44434A87509l7900F4811J05810
18197A70621a78369A27911J35124d36165i7043c724p3499A5802a07678n6172P4839
18186h9011K8973l8481p3719k11906e9216m4106l84932A6902a59907j38623P7388
$$ plain form
18263 -370876 -9677 -169031 -175738 -129206 239668 9446 -19771 -127727 -164741 11169 77372
18252 77372 -168369 136443 -118314 -260371 139197 -34449 439886 -31007 -101413 -375409
18242 -375409 -117751 -224438 555605 148205 -40054 -270805 7537 -129383 53618 -132802
18231 -276057 -78771 99405 -31948 -26869 -254225 65889 -120380 161460 -282498 -151770 -21863
18219 -102234 9179 7237 -178335 -67430 117610 104236 -71617 -72685 152450 -206051 -159228
18208 -159228 51642 31094 362490 -45597 -52512 78766 -244434 187509 149609 64811 170621
18197 170621 -178369 127911 263035 -436165 -97043 -3724 -77223 15802 -107678 -163850 -89011
18186 -89011 -60038 -98519 -172238 -384144 -59216 -103322 -488254 16902 -159907 -298530 -221142
18175b21142C88643d57254B18435a55371A583N4843M03471a45308j1167I0346
18164e2139J0679k2183a5775m09184f0996D1906J36308c6142A02680C2749J79487
18153B12236b12927j760N8280l2059h7174B22416R2987j25011A8126a43544q5947
18142b29491O0493B40652c38630k03876a01888j44764C33210b18934e2706l0234
18132h2940l03275a5564B07159m6681d3335A57512g56B09794b61388O3844o3623
18121b61167A79483G3721B0258b7476A5713K49645B7425f8443m18297a62887j48062
18110c10949F7078c6304q472k1499C5974b10512A0008b11912a8965C9855c60040
18098a79853A66758c08486L3504A04809A7429Q9053g6531E4142B957M0475d80666
$$ plain form
18175 -221142 388643 -457254 218435 -155371 1583 56426 459897 -145308 -156475 90346
18164 -52139 -41460 -63643 -15775 -424959 -60996 41906 178214 -36142 102680 32749 212236
18153 212236 -212927 -214687 -156407 -188466 -87174 222416 315403 190392 18126 -143544 -229491
18142 -229491 -168998 240652 -338630 -542506 -101888 -246652 333210 -218934 -52706 -82940
18132 -82940 -386215 -15564 207159 160478 -43335 157512 -756 209794 -261388 -197544 -261167
18121 -261167 179483 73721 20258 -27476 15713 265358 27425 -68443 -486740 -162887 -310949
18110 -310949 67078 -36304 -44776 -66275 35974 -210512 10008 -211912 -18965 39855 -360040
18098 -179853 166758 -308486 -274982 104809 17429 106482 -76531 54142 2957 43432 -480666
18086b3317A5146b97457c2437H357a10351o2634K339A10938Q7556m0554b1626
18074a2168j31239E3310K43350a24885L038A44837b33399j56468b2138H4149d1338
18062d61785H9648h9887F9536g5453j3529A00449L2219a4523D6372a89409F1787
18050g665m70650a3106l90105J71555e7758p9490F6750a22517j17200c3400j01951
18039a35351A22669J38808H2989P9633b50288M3320K0601B29304h207j93019E1307
18027b5501c414G4825a24512D3867h1173j1245m2714l4155D5974L9519a91789
18015a91839b3552o6916m7690j72469a21080B59596i2118p6205B00666l9607g0763
18003B61888j20449n680c50087a65926A23868r824N8600c71874A64984o7883J10601
$$ plain form
18086 -23317 15146 -297457 -32437 8357 -110351 -172985 -170646 110938 198494 157940 -21626
18074 -12168 -143407 53310 296660 -124885 -121847 144837 -233399 -389867 -22138 84149 -41338
18062 -461785 89648 -89887 69536 -75453 -88982 100449 132668 -14523 46372 -189409 61787
18050 -7665 -478315 -13106 -403211 -231656 -57758 -137248 66750 -122517 -239717 -33400 -135351
18039 -135351 122669 261477 82989 162622 -250288 -206968 -186367 229304 -8207 -201226 51307
18027 -25501 -3414 74825 -124512 43867 -81173 -92418 -135132 -169287 45974 85493 -191789
18015 -191839 -23552 -90468 -138158 -310627 -121080 259596 -92118 -168323 200666 161059 -70763
18003 261888 141439 135759 -350087 -165926 123868 114044 172644 -371874 164984 97101 207702
17992B07702a23907L4052D2576a34262j6342J7518m2902b1968j05383M6384a9409
17980a28292c3432k22104E6002j94c19816A66390C7268b2203k99304g8677A69799
17968d6472o9098B55614c40129A44284N0219E8194a85245g7197A34139J94625
17958C28764H0968a69374C19567p7010b31954Q8665A74394h2883h452l09135J31194
17947a86393H0941i255b627A43088C3428K5646P4716a07618B97612b06356A89957
17935a50797A283a07669K1480A927i266L482k26503A49164k6309K4503L4551R739
17923A91648H6065e9842j40578e1706A00030A1936C581J2608a13704E1056F33
17911B26282c30774B20288a20109N6084A65005o3160a78577A08698P7754a16591
$$ plain form
17992 207702 -123907 -89855 42576 -134262 -150604 -133086 -175988 -21968 -127351 -80967 -19409
17980 -128292 -33432 -255536 56002 55808 -319816 166390 37268 -22203 -321507 -78677 169799
17968 -46472 -115570 255614 -340129 144284 194503 58194 -185245 -77197 134139 328764
17958 328764 80968 -169374 319567 242557 -231954 -143289 174394 -82883 -8452 -317587 -186393
17947 -186393 80941 -9255 -2627 143088 33428 59074 133790 -107618 297612 -206356 189957
17935 -150797 1283 -107669 -86189 1927 -9266 -5784 -232287 149164 122855 147358 181909 191648
17923 191648 86065 -59842 -200420 -51706 100030 11936 3581 16189 -113704 51056 633
17911 226282 -330774 220288 -120109 -64025 165005 101845 -178577 108698 186452 -116591
17900a52652a4152j66446o8117a06892j93844D3305e2401n8886j9075j66652A89583
17888a02858I8565K66394b63206A57615C6786L9712N6631b11495f885B02843G0144
17876E9570a71236J6050c8344b405m6392j18260B07662b08699c3024A55647L0170
17865A85817g1075A5392K09115O1753B1871a40708c1013G5392H998a82938f0041
17853G8891a99248B28172a51854L4815A7624a0412A21662b04037G2748a84003
17842A41027c64360C71690A1135O6062A0115f6431A31414c68137i3485M1697C67496
17830H821L53224k9809I217b08535E2542k4376k723K1144Q3239n6071a26179H9183
17817c256B94355a00096E5558a38509B38347h4295k08591B18343D0096J86619
$$ plain form
17900 -152652 -14152 -180598 -248715 -106892 -300736 43305 -52401 -111287 -130362 -297014 189583
17888 -102858 98565 364959 -263206 157615 36786 76498 133129 -211495 -6885 202843 70144
17876 59570 -171236 -155186 -38344 -2405 -48797 -167057 207662 -208699 -33024 155647 185817
17865 185817 -71075 15392 224507 286260 21871 -140708 -31013 75392 8998 -182938 -60041
17853 78891 -199248 228172 -151854 -117039 17624 -10412 121662 -204037 72748 -184003
17842 141027 -364360 371690 11135 77197 10115 -66431 131414 -368137 -93485 -51788 367496
17830 8821 362045 332236 9217 -208535 52542 28166 25443 46587 129826 73755 -126179 89183
17817 -3256 294355 -100096 55558 -138509 238347 -84295 -292886 218343 40096 226715
17807B26715b10089O7879k74774i82D7102c58604E6771N3342a73513l24081c4693
17795d26560a06502B5630b09306O6562A5585i1851A22212a26736C34544A40196
17784A32397b49275N6803A46845a1158B1376b3424C34094i5718A63652a30534
17773D7298Q5672m6515K2407J14580a41443B9663C623f2801H5947N9917i9796
17761a64963I5864K10709A30420f3514j00552L9192L2818m4898n5825B15862l8451
17750A77411e20060g484m3779j20345K160F7181e9106A44979J03900h6070C88530
17738c32635G8186O1997c19656a25505i13k22451a8931A84820a13228B4468a12595
17726F37685A79261K14385I0667K994e3B38276a78609M7282M8405D22405A45758
$$ plain form
17807 226715 -210089 -142210 -416984 -982 47102 -358604 56771 110113 -173513 -497594 -34693
17795 -426560 -106502 25630 -209306 -142744 15585 -91851 122212 -126736 334544 140196
17784 132397 -249275 -192472 146845 -11158 21376 -23424 334094 -95718 163652 -130534
17773 47298 132970 86455 108862 223442 -141443 29663 3623 -62801 85947 145864 -99796
17761 -164963 95864 306573 130420 -63514 -164066 -124874 -92056 -136954 -192779 215862 177411
17750 177411 -520060 -7484 -51263 -171608 -169448 67181 -59106 144979 248879 -86070 388530
17738 -332635 78186 140183 -319656 -125505 -913 -223364 -18931 184820 -113228 24468 -112595
17726 637685 179261 393646 90667 93661 -53 238276 -178609 -131327 -82922 422405 145758
17714a0491r1623l2710j353B0747f2163H9712d6221B61386c24892J06668C38649
17702H8718P0649b1462G4074J17980L9997a07103k47690J31620C0112R0709m1133
17691G9688j0939c7596o6409k53624A40201h0847E20252a63619d5027I2360R3601
17680A85961a50962B18280m4688E3814f6617G7837G313L21167d01220a05210q69
17669a06079A6855c8682k3766D2189b43887J5057B76619J18547A00590d97049
17658B1615b22818D49147g1146j94914J08515G3291L3197N3616a36647d2431j67111
17647b09542C670J68838p5180c18694i4513C0369Q8061K85299F4050h7661A82953
17635b05343i0821j71379C4212J24249F5403e7569i573A47338g4698B38757h6632
$$ plain form
17714 -10491 -102114 -134824 -136177 20747 -62163 89712 -46221 261386 -324892 -218224 338649
17702 88718 159367 -21462 74074 192054 232051 -107103 -354793 -223173 30112 120821 79688
17691 79688 68749 -37596 -104005 -357629 140201 -80847 520252 -163619 -45027 92360 185961
17680 185961 -150962 218280 173592 53814 -66617 77837 7313 328480 -401220 -105210 -106079
17669 -106079 16855 -38682 -62448 42189 -243887 -228830 276619 395166 100590 -497049
17658 21615 -222818 449147 -71146 -266060 -157545 73291 106488 160104 -136647 -42431 -209542
17647 -209542 3670 172508 97328 -318694 -94513 30369 118430 403729 64050 -87661 182953
17635 -205343 -90821 -262200 34212 158461 65403 -57569 -9573 147338 -74698 238757 -86632
17623A12149d6459B64034a76506A83903B3899J19779F0208a83305j68349B27028
17612A87362p0215B5104N8820m0583f773C4219K81376G9062a63332A89470p7834
17601A11636f3712D78911b30086A07089l7542K7403a87784A33137K75005A95599
17590B10836a25506C09547R0765j08844k8996C2389h3558k6804B62249g5183A38057
17578G3610c35473A79581e4535j16651H8881b51040k859B56771A00902J889e9679
17566a48300B2839K60910L8608c22299n2535J77838C06818j19120D2610e8925
17555F5389J2600e8628j85130C165K54727a93198C4354K55713m5009b3166B75397
17543C00835f5157B27728C6365L9460d9116C38892A17720a89482b8479A47490
$$ plain form
17623 112149 -46459 264034 -176506 183903 23899 143678 60208 -183305 -351654 227028
17612 187362 117147 25104 83924 43341 -6773 34219 315595 79062 -163332 189470 111636
17601 111636 -63712 478911 -230086 107089 69547 96950 -187784 133137 408142 195599
17590 210836 -125506 309547 400312 291468 262472 32389 -83558 -110362 262249 -75183 138057
17578 73610 -335473 179581 -54535 -171186 88881 -251040 -253899 256771 100902 102791 -59679
17566 -148300 22839 283749 322357 -322299 -374834 -196996 306818 187698 42610 -58925
17555 65389 77989 -58628 -243758 3165 257892 -193198 34354 290067 245058 -23166 275397
17543 300835 -65157 227728 36365 75825 -49116 338892 117720 -189482 -28479 147490
17532A63625d1769A6472P8786B324a0364A11317J95602d2532A08868N4138A7787
17520E3998Q7821a49997C07057g2524B45555a3134C5185A7149L95926I2638K855
17509I5493J27372a9714C34088D7251h3297I3797J11810L6578a07973D394a15797
17497E1516L7945k5430d6428C50407A34087a02796C21001J7573A38808J78505
17487C17313b2550B75491a15693A3389R2512b6091d658A24073l4022a15420i748
17475A11372J36247K2099I1037J5864J06759G8380P9052c7464A5061K0328P9579
17464A14968O2625r358a6086B21383I8470B7969L12987b4930j47926B85646J15065
17453D00711A06949K2505K52909C3889f1163q4514C06688j09751j164J52716A29666
$$ plain form
17532 163625 -41769 16472 95258 2324 -10364 111317 306919 -42532 108868 163006 17787
17520 53998 141819 -149997 307057 -72524 245555 -13134 35185 17149 413075 92638 95493
17509 95493 222865 -19714 334088 47251 -83297 93797 205607 242185 -107973 4394 -115797
17497 51516 89461 64031 -46428 350407 134087 -102796 321001 338574 138808 317313
17487 317313 -22550 275491 -115693 13389 105901 -26091 -4658 124073 90051 -115420 -9748
17475 111372 247619 269718 91037 106901 213660 78380 157432 -37464 15061 35389 114968
17464 114968 177593 168235 -16086 221383 98470 27969 340956 -24930 -172856 285646 400711
17453 400711 106949 129454 382363 33889 -61163 -145677 306688 196937 195773 348489 129666
17441D10897i692c497B71335L4930A6051a35513F9129K55927d4438D19882I7156
17429I8123M04191a88268C08914a5574F08094k67654R25l7761n7284q2194e8076
17417E79342k19896A10300J47781A6262K69570J08828j34004M4843I6572J6097
17407A12669Q4539J80063m9614m3784n9033Q130o2090K5828N3575H5873J80728
17396B66601C8876J60525N1814r7529j0350m8955B0760L28596B9114L0739K57292
17385C17145R8119A62742f9127j02637c0468I4119h2686m147B73350b14914B70376
17373e4289B58964d8624A56992c1511C53329e2226A42216Q4135J26541j52242
17363B00650Q0337O7798j36307J1039q4280a3079B44098M2241G9652h4087B92093
$$ plain form
17441 410897 -9692 -3497 271335 306265 16051 -135513 69129 325056 -44438 419882 97156
17429 98123 502314 -188268 308914 -15574 608094 340440 341365 303604 246320 164126 -58076
17417 579342 359446 110300 258081 16262 285832 394660 260656 305499 96572 112669
17407 112669 197208 377271 327657 283873 224840 232970 170880 196708 250283 85873 266601
17396 266601 38876 199401 251215 153686 143336 94381 20760 349356 29114 59853 317145
17385 317145 415264 162742 -69127 -171764 -30468 94119 -82686 -86833 273350 -214914 270376
17373 -54289 258964 -48624 156992 -31511 353329 -52226 142216 226351 352892 200650
17363 200650 280987 348785 212478 223517 139237 -13079 244098 286339 79652 -84087 292093
17351A57856K52775j22723m1533B2375K07823A153J27201L46534k25444a01606
17340c136n6876B80427c15187f9891B68376i2906K5053b1481A66700M8242h0918
17328H1486f2555A56511B277J68580j2271J12246J03704d1000F4849K26941j8506
17317B73284A17946J89910j14479o3458c65482A38005M4009b9153D21602e6844
17306C2643K05590C7695L6172i8808r1529C44317A50290L82624A97594J35574
17296C33168A26017A9311J76291J3568P0674A14206A0854O06194j04746A55534
17285D62651b2328A47965K2925n9748g2272A37559L49612I6166a43211A6022J94465
17274B10487o6725J109R6374a48987H1739O3020J06598b00494D6536b2904j37515
$$ plain form
17351 157856 410631 287908 246375 22375 230198 1153 128354 474888 249444 -101606
17340 -3136 -60012 280427 -315187 -69891 268376 -92906 -67853 -21481 166700 214942 -80918
17328 81486 -62555 156511 2277 170857 158586 270832 374536 -41000 64849 291790 273284
17317 273284 117946 307856 193377 129919 -365482 138005 182014 -29153 421602 -56844
17306 32643 238233 37695 73867 -98808 -190337 344317 150290 532914 197594 333168
17296 333168 126017 19311 195602 209170 279844 114206 10854 617048 512302 155534
17285 462651 -22328 147965 170890 111142 -72272 137559 487171 96166 -143211 16022 210487
17274 210487 143762 144871 241245 -148987 81739 144759 251357 -200494 46536 -22904 -160419
17263a60419A09015K21539I8996K79054J63741I3705b7056l090A21481J74036
17253B95517J5576c8862D69790K1374A37689I849L7197J39444k655J68396c041
17241D30623A38181J1457J93633N0153A92794L08350B10420j04950j220P2857
17231A77107Q861p6843L14172j00770L3544A24839J80122o4889K9540K33152j39118
17220C63646H3146Q3923J56575h4059B28846l4979J09456A6761K93944J43272
17210D53977A22300K26778a226B92579J10786j33534m0077P1580I8907A9306J70286
17199A89592q3388L79211k23160L977J77179h9339C32360j38636L7099C5296Q3282
17188A18578J03693K00611B01697G4053N2485K22670m779A16207M13808B25191
$$ plain form
17263 -160419 109015 330554 98996 378050 541791 93705 -27056 -30146 121481 295517
17253 295517 311093 -38862 469790 491164 137689 9849 47046 186490 183835 352231 -3041
17241 430623 138181 149638 343271 393424 192794 501144 210420 105470 104250 177107
17231 177107 185968 109125 423297 322527 356071 124839 304961 240072 269612 502764 363646
17220 363646 83146 167069 323644 -84059 228846 193867 303323 16761 310705 453977
17210 453977 122300 349078 -1226 292579 403365 269831 229754 301334 98907 19306 189592
17199 189592 106204 485415 262255 266232 443411 -89339 332360 193724 230823 35296 118578
17188 118578 222271 422882 201697 74053 126538 349208 344429 116207 530015 225191
17177B97358I8091K09362l4724f8797o212E27303i2160B1386L11602k0398J2573
17166C25163j51559K57034A50429C4873L31234L5893p2213q3432P8611P469K69648
17155F02083h1522D64669l0835j57603F2310M56510k54173p1333H0026K80698
17145C60724m8233K88410k63395j52425K8462Q4205J35044J0119k12196K13836
17135D44551c7220B61927j06812J08088N7266P6818J60323l7305K7371k69493
17125B78183K2557K37820j73590p2927n1816J15611A55638P6374p3348L15582
17115D74246j88032P0557K9882r8992m3375O2384A40014o3447M71062A05237L5946
17104A41183K89821j654k006m1455A62158K41616Q1314j13655k4459j48565R947
$$ plain form
17177 297358 98091 307453 272729 -68797 -75009 527303 -92160 21386 332988 312590 325163
17166 325163 173604 430638 150429 34873 366107 402000 329787 246355 324966 332435 602083
17155 602083 -81522 464669 433834 276231 62310 518820 264647 193314 80026 360724
17145 360724 312491 600901 337506 185081 213543 297748 432792 442911 230715 444551
17135 444551 -37220 261927 155115 263203 320469 397287 557610 520305 547676 278183
17125 278183 300740 538560 364970 292043 240227 355838 155638 232012 158664 474246
17115 474246 286214 356771 386653 287661 244286 306670 140014 76567 547629 105237 141183
17104 141183 431004 429350 427344 385889 162158 403774 485088 371433 346974 198409 208356
17093B08356p0351N29178B47606Q9056m9254R4380N3477A14262O70593C69715
17082B93081J40998P5719j12865K71334j95620N7432B26183l3226K56386A09046
17071B16405K11083A73351K39307j74284J28378m3127P9710K41088k23172j22713
17061B98538o4824K78199p5808J85076A99413J18510J36326L89241l29299M240
17051E18431K13769C24044J80993k4942j42801K56506J86852l10861A57842J25578
17041B83420J79828j85486K12300K401r1193J93469k68668L20509R4805m8843
17031F92542B78425M98189j08123k7727K01938j53953L9575B35332N98184k33004
17021F00512B93847N58552j32427j94817A66206O82384k61949l9665K33750l04735
$$ plain form
17093 208356 138005 667183 247606 336662 287408 381788 435265 114262 784855 369715
17082 293081 434079 509798 396933 668267 472647 530079 226183 192957 449343 109046
17071 216405 427488 173351 412658 238374 366752 323625 403335 644423 421251 298538
17061 298538 233714 511913 436105 621181 199413 317923 454249 843490 514191 518431
17051 518431 732200 324044 505037 480095 337294 593800 780652 469791 157842 283420
17041 283420 463248 277762 490062 492463 401270 594739 326071 646580 741385 692542
17031 692542 278425 776614 668491 640764 842702 688749 728324 235332 833516 600512
17021 600512 293847 852399 719972 525155 166206 848590 586641 546976 780726 475991
17011D75991K0758L7722q368L79996r7438q5833R2053k32888J96725P0205D04114
16999G54023R8570m08590K04542j027j3694J31267l49071L77590k66134L57896
16989H85372D25681j00304L15495J53065k18587K27329L9852k16515K36615j46272
16979G16359M61933j88719J06589k31499m1485K98762l92452O0308J41091J54613
16969A085500M0479n279o2171k57727m4832L41612K75k99332j70306M45913l84804
16958F89328Q6503L60008n8825k35960M9564J5935L61143m66271K70431k58857
16948H12999K25987p6461M47233n12299K76634p5878l01893K66567P7784J98560
16938A339233m06161M6120K58437j24974J54634o7262j34092L58421o50786Q5622
$$ plain form
17011 475991 496749 534471 526103 906099 808661 722828 814881 581993 778718 848923 404114
16999 754023 852593 444003 648545 647518 633824 765091 416020 793610 527476 885372
16989 885372 425681 325377 640872 793937 575350 802679 842531 626016 862631 716359
16979 716359 1178292 989573 1096162 864663 823178 1121940 729488 789796 930887 1085500
16969 1085500 1125979 1120700 1058529 800802 755970 1097582 1097857 798525 628219 1074132 689328
16958 689328 775831 1135839 1077014 841054 890618 906553 1267696 801425 1071856 812999
16948 812999 1038986 962525 1409758 897459 1174093 1098215 796322 1062889 1140673 1339233
16938 1339233 933072 979192 1237629 1112655 1267289 1200027 1065935 1424356 773570 859192
16928H59192M11762l86793K56577K01034j81316K59148k31378K7688K21927L04492
16918A742333l42603N01241l88362j93092N7802O2029L8118m5856J04509J74284
16908A710403m13425K48681N2093J11184l30565M55925j20570j45957j35887J21931
16898A553813P7227K64058m90913m9576q417o0030K45625J71874m853J7510K84250
16887B000568m32565K92169L67531j61195j33787Q8118P6252M7805j65850M20113
16877B399159j01204k97919L39288M8600l66172K24409q4631N29494k80257K1234
16867B432001m08242M35695l52931L25234j02248N35308m62426J22877J39637
16858B664905K76093l07011K48932l19897N45286k42117J05069k72890L16576
$$ plain form
16928 859192 1270954 884161 1140738 1341772 1160456 1419604 1188226 1215914 1437841 1742333
16918 1742333 1399730 1900971 1512609 1319517 1377319 1439348 1477466 1431610 1536119 1710403
16908 1710403 1296978 1545659 1597752 1708936 1378371 1834296 1713726 1567769 1431882 1553813
16898 1553813 1631040 1895098 1404185 1354609 1346192 1286162 1531787 1703661 1698808 1716318 2000568
16887 2000568 1568003 1860172 2227703 2066508 1932721 2020839 2097091 2144896 1979046 2399159
16877 2399159 2297955 2000036 2339324 2387924 2021752 2246161 2161530 2691024 2410767 2432001
16867 2432001 2023759 2459454 2106523 2431757 2329509 2864817 2402391 2525268 2664905
16858 2664905 2940998 2633987 2882919 2563022 3108308 2866191 2971260 2698370 3014946
16849C014946J36782p3745k64604M36153O3143l12032L50605j2554J98196J10020
16839C646910j9906J0369j337M52264n78813K55652q0503N27729m88437L33651
16829D057579L91587j51585k21329N37007q9100n0411J08121K93440r5412k78626
16819D501271M1715P95183k12871K46088n7215j4056o4013O60456n2628J13698
16809E957628J60964j36307K50972J6154K40259l6298L1491P19508o0759j41241
16799G002371L27364M6779K52076K58114L66736K34502q6732L46381K53527K10346
16789I211464N5232K97605K18656K29976J31931O18036J96094K08726K08935L77039
16779A1753694M63786M18100K92289K35699M07675L24368P10766P31149k5708
$$ plain form
16849 3014946 3151728 3077983 2813379 3249532 3312675 3000643 3351248 3338694 3536890 3646910
16839 3646910 3627004 3637373 3636036 4088300 3509487 3765139 3684636 4212365 3723928 4057579
16829 4057579 4449166 4297581 4076252 4613259 4524159 4473748 4581869 4875309 4779897 4501271
16819 4501271 4542986 5338169 5125298 5371386 5314171 5300115 5236102 5896558 5843930 5957628
16809 5957628 6118592 5982285 6233257 6249411 6489670 6453372 6484863 7204371 7143612 7002371
16799 7002371 7329735 7376514 7628590 7886704 8253440 8487942 8401210 8747591 9001118 9211464
16789 9211464 9266696 9564301 9782957 10012933 10144864 10762900 10958994 11167720 11376655 11753694
16779 11753694 12217480 12635580 12927869 13163568 13571243 13895611 14606377 15337526 15311818
16770A5311818M92681N45238J126809N0299Q50205O19803R90935M03354R32260
16761B1323402O89129R36053Q08027J056768J104060N60601J603641R40895J201207
16752C0223783J391406J509521J384430J723663K077428J611821K263535J803740
16744D3989327K303657K199187K734266K720959L019662L392728L243097L678734
16736F7281617M166819M234173M414015N218735N383247N379661O264450O214249
16728A08556966P076086O948005P320692Q296698P830715P873948Q527965P210291
16720A69641366Q170681O965980O062042M624410M079586K764712Q39552m81408
16712B02666921j653696k944301m444203n635125o181721p632870p558137p986247
$$ plain form
16770 15311818 15804499 16349737 17476546 17526845 18377050 18996853 19987788 20391142 21323402
16761 21323402 22012531 22948584 23756611 24813379 25917439 26478040 28081681 29022576 30223783
16752 30223783 31615189 33124710 34509140 36232803 38310231 39922052 42185587 43989327
16744 43989327 46292984 48492171 51226437 53947396 56967058 60359786 63602883 67281617
16736 67281617 71448436 75682609 80096624 85315359 90698606 96078267 102342717 108556966
16728 108556966 115633052 122581057 129901749 138198447 146029162 153903110 162431075 169641366
16720 169641366 177812047 184778027 190840069 195464479 199544065 202308777 203148329 202666921
16712 202666921 201013225 198068924 193624721 187989596 181807875 174175005 166616868 158630621
16704A58630621q258168q091799q333389p899324p532033p332991o531034o748743
16696I7903140n566674n966340n360346m787232m545814m297148l866653l682865
16688E9830068l102938l529497k643823k844391k521919k265510k116037k105609
16680C8700344j999118j581279j748035j660060j389253j499876j067878j307354
16672B6447491j137708r54575q52933j320406n88271j059550n69775j030851q91313
16663A8042109n53882m72330l84912j022721l21575p06395j53667n83722p04839
16654A3138066l70397n15991r4040l79403l01401l58583k29663m19121m16277
16645A0053190k66608l3501n37218j45596l24588p70814J05324k80117k20286
$$ plain form
16704 158630621 150372453 142280654 133947265 126047941 118515908 111182917 104651883 97903140
16696 97903140 92336466 86370126 81009780 76222548 71676734 67379586 63512933 59830068
16688 59830068 56727130 53197633 50553810 47709419 45187500 42921990 40805953 38700344
16680 38700344 36701226 35119947 33371912 31711852 30322599 28822723 27754845 26447491
16672 26447491 25309783 24355208 23502275 22181869 21593598 20534048 19964273 18933422 18042109
16663 18042109 17488227 17015897 16630985 15608264 15286689 14580294 14426627 13842905 13138066
16654 13138066 12767669 12251678 12157638 11778235 11476834 11118251 10888588 10469467 10053190
16645 10053190 9786582 9753081 9215863 9070267 8745679 7974865 8080189 7800072 7579786
16636G579786M22550o35133j89600K88029k52142o40255n0114j27282j55423P0498
16626F310914j68622n97867J05441j23525K4007l22448m5238o8865q4014J92628
16616E222411l38640m50050R2030r8035k17415L48261n56270m6615L18922n18954
16606C755645L29983k64294q7095r0487M1781r3306k99672l8087K41208j34715
16596C360961n9846l66711M13776n14053O9489j59293J16432K07555l2299o03617
16586B432394O93246p87871K70854r8125l9902o7857q8300J02912K05406l34017
16576B288740j48902l06730L99396j56310L19580k70065P2268P6207m03613J8272
16566A888843N7134J61047l49656M25045n19775K62591j25106J34468j81034j90998
$$ plain form
16636 7579786 8002336 7367203 7177603 7465632 7213490 6573235 6523121 6395839 6240416 6310914
16626 6310914 6142292 5544425 5649866 5526341 5550348 5227900 5182662 5113797 5029783 5222411
16616 5222411 4883771 4433721 4525751 4427716 4210301 4558562 4002292 3955677 4274599 3755645
16606 3755645 4085628 3821334 3734239 3643752 3685533 3592227 3292555 3254468 3495676 3360961
16596 3360961 3301115 2934404 3348180 2834127 2903616 2744323 2860755 3068310 3036011 2432394
16586 2432394 3125640 2337769 2608623 2510498 2470596 2402739 2314439 2417351 2622757 2288740
16576 2288740 2139838 1833108 2232504 2076194 2395774 2125709 2197977 2274184 1870571 1888843
16566 1888843 1945977 2107024 1757368 2182413 1662638 1925229 1800123 1934591 1753557 1562559
16556A562559K8693K39335k5336j84661M6531j15366n2930J23739J82287l97577
16546A407274L3419L1070K22865p10628L91049j44177k70491M53797q9288J68034
16536A492924l19157M13054k97775j89216M95080j23220l81929k8818P9491k12354
16526I28080N8392K61806k05602J47071o4021j34881O4067P9435J14262j32159
16516A116450l77019k7861L10286j42367o4604P1415L48837l80205j08094J20219
16506H67057l61077K51690K38133n7544k03786R2285l03866N15814k7331k99276
16496G12099K6548j40563J55930C39586M99674k4030k15843R202n4323J35862
16486F90128L38453l32464K13562D13698J30426l8787q7873L67237n1986j03684
$$ plain form
16556 1562559 1591252 1830587 1805251 1620590 1667121 1551755 1498825 1622564 1804851 1407274
16546 1407274 1440693 1471763 1694628 984000 1375049 1230872 960381 1414178 1324890 1492924
16536 1492924 1173767 1586821 1289046 1099830 1594910 1471690 1089761 1060943 1140434 928080
16526 928080 986472 1248278 1042676 1189747 1125726 990845 1054912 1134347 1248609 1116450
16516 1116450 739431 711570 1021856 879489 814885 886300 1235137 854932 746838 867057
16506 867057 505980 757670 995803 938259 734473 826758 522892 1038706 1011375 712099
16496 712099 738647 598084 754014 339586 839260 815230 599387 608589 554266 690128
16486 690128 1028581 696117 909679 413698 544124 505337 417464 784701 732715 629031
16476F29031K11132C51913N72247l06423P1651J62944m04228K02956O3080j46460
16466E67680N13285D29023M3067M4551J49528q7141k03987N55264j89322n1009
16456F89974q3513P0500k45884j37472J41189j7717J21450j29986J62539K81833
16446H52913l35249K34702A40731K68258j04571J44189p3597J80637n4484B37990
16435A22717L30875K43006C47321N9208A83063J14420K51450j66388L3321j69364
16425B46502K20159n3525K61821k67530J83839k48393M9479M03965j91134j01543
16415E03640j80588Q9834l4120n5168Q5696A28101C6219K60858k5072K23391k6265
16404D69131j98941K11657q2896L62698C7559L11506L11430B53217J51631j42252
$$ plain form
16476 629031 840163 351913 924160 617737 689388 852332 448104 651060 714140 567680
16466 567680 1080965 429023 472090 516641 666169 579028 375041 930305 740983 689974
16456 689974 606461 676961 431077 293605 434794 417077 538527 408541 571080 852913
16446 852913 517664 752366 140731 408989 304418 448607 375010 555647 501163 237990
16435 122717 453592 696598 347321 406529 183063 297483 548933 382545 415866 246502
16425 246502 466661 413136 674957 407427 591266 342873 392352 796317 605183 503640
16415 503640 323052 412886 378766 323598 409294 128101 36219 297077 272005 495396 469131
16404 469131 270190 481847 398951 761649 37559 349065 660495 253217 404848 262596
16394B62596J85275q4371M19564B67386L47715B48283J71924j35061q7463J22783
16384C20466E4607J12509L66689J64362k53331m5091A02154K31596p7812Q6135
16374C42073q0205L3916A0092a68158B83178q6873J6229H8340j3555i5732D0903
16362F91575l21636N8274A15378m2181M6048J34721B0670o938k376Q7199J28724
16351B27279J76453j86006p2218J295J89703j23426d2510B96921A41945h4942
16340i0677B60566o0467b50891D05784A3903K23986b5773A58402J60782h3224
16329C16881a1151A76818C9335l69K03110K77858l1642A32932E3746J68364J13238
16318C35348D4946J81499H4135C6797a09124A23138J28245j9503a52970A45823
$$ plain form
16394 262596 447871 363500 783064 267386 615101 248283 420207 285146 197683 320466
16384 320466 54607 167116 533805 698167 444836 399745 102154 333750 255938 342073
16374 342073 261868 295784 10092 -168158 283178 196305 212534 88340 74785 -95732 40903
16362 691575 369939 428213 115378 73197 119245 253966 20670 13732 11356 98555 227279
16351 227279 403732 217726 145508 146803 336506 213080 -42510 296921 141945 -84942
16340 -90677 260566 200099 -250891 405784 13903 237889 -25773 158402 319184 -83224
16329 316881 -11151 176818 39335 38966 242076 519934 488292 132932 53746 222110 335348
16318 335348 44946 226445 84135 36797 -109124 123138 251383 231880 -152970 145823
16307c6708C27791j01629r4961D0276A0560J14678J50716A06548J30187A06262
16296c5606B86579j17618a71718O0352j03494B85917A0863J50342D3768K44306
16286B88074p5430I7882K91675j46080a46461b6662D4599h6560c7986F267M4578
16275E0845a26686l7143G170M962g536A51119M1815O2196o2662K47701a8741A33116
16262I4509R4878i2282k2877B36208a66259A48989p3363a9114B36348b42509P6293
16251a66216B72828a4047C64544j57744C895L11078a40278l5689g9347r2546J8340
16240a53553d6431j02617A23521l2149Q4371e6382r0446d4866L025B54270a27130
16228g6478G6655C3359a26586J590A62369J01071I8793M8645D4699a7285l4080
$$ plain form
16307 -36708 327791 226162 131201 40276 10560 125238 275954 106548 236735 106262
16296 -35606 286579 168961 -171718 -111366 -214860 285917 10863 161205 43768 288074
16286 288074 212644 97882 389557 243477 -146461 -26662 44599 -86560 -37986 6267 50845
16275 50845 -126686 -163829 7170 12132 -7536 151119 192934 255130 192468 440169 -18741 133116
16262 94509 189387 -92282 -115159 236208 -166259 148989 75626 -19114 236348 -242509 -166216
16251 -166216 272828 -14047 364544 206800 3895 314973 -140278 -175967 -79347 -171893 -153553
16240 -153553 -46431 -149048 123521 91372 175743 -56382 -146828 -44866 -41841 254270 -127130
16228 -76478 76655 33359 -126586 -124996 162369 263440 98793 147438 44699 -17285 -51365
16217e1365H5128M3752J68615a5631C14191d496q1658L9059p108B12478F6774
16205D9419K9822b87418A99190r9592O411g9620A09050a09653F0177i0206I9795
16193D8458Q1273e40745c9514C4788g4124B03191a56648A41191Q3221J62358c0520
16181d62161h0919I2212M15903b1893H6326i6576A0655P6957a62214B61779a36362
16169D01680d4105q586A8995e741a929j40900I9418c3430k2248A89684a73045
16157i1792j54000b5842k25500a17553A21809a55609B96927B6980K64318j23054
16147A68244a55119C2238b64707B00310j5271p0243E0527c37158h340A96236c185
16135B0302Q864a50634L2472F0512Q1950e2048j54958A68053c11393h3838A20241
$$ plain form
16217 -51365 85128 128880 297495 -15631 314191 -4496 -86154 -47095 -54203 212478 66774
16205 49419 79241 -287418 199190 99598 106009 -79620 109050 -109653 60177 -90206 99795
16193 48458 129731 -540745 -39514 34788 -74124 203191 -156648 141191 224412 386770 -30520
16181 -462161 -80919 92212 508115 -21893 86326 -96576 10655 87612 -162214 261779 -136362
16169 401680 -44105 -52691 18995 -5741 -1929 -142829 99418 -33430 -55678 189684 -173045
16157 -91792 -245792 -25842 -251342 -117553 121809 -155609 296927 26980 291298 168244
16147 168244 -155119 32238 -264707 200310 185039 114796 50527 -337158 -8340 196236 -3185
16135 20302 29166 -150634 -118162 60512 142462 -52048 -207006 168053 -311393 -83838 120241
16123E6157a41536B20836r986F3695B4447J94421N7282j04219J99981A00845m0642
16112F0203b42151h7081G2424B1082e7556D3117Q117e7417r169D4579a30371p9669
16100b10040C2937P8025p269a11248A4636P8541a42359c0994B71224b86818A46294
16088b05595a00547j37928g1719j16279A19770Q1692K12651j07890A26575F1809
16077a14267f45A69153a74336c6465B33027e1675j99971B348a21702A41557a86
16065D5696b30961B3176Q0447J05349c53133J5556c81r175m7419F5527b20580
16053D1705j6311b19851a692l87759h1383C82544A39467N1635H6601a73742D3818
16041A08910h9327d854G5787p252c04915A06166j8789a84281j82105A40016a5115
$$ plain form
16123 56157 -141536 220836 210850 63695 24447 218868 276150 171931 371912 100845 60203
16112 60203 -242151 -87081 72424 21082 -57556 43117 51234 -57417 -66586 44579 -130371 -210040
16100 -210040 32937 110962 103693 -111248 14636 93177 -142359 -30994 271224 -286818 146294
16088 -205595 -100547 -238475 -71719 -187998 119770 201462 414113 306223 126575 61809
16077 -114267 -645 169153 -174336 -36465 233027 -51675 -251646 2348 -121702 141557 -186
16065 45696 -230961 23176 103623 208972 -353133 -337577 -381 -9556 -56975 65527 -220580
16053 41705 25394 -219851 -1692 -389451 -81383 382544 139467 191102 86601 -173742 43818
16041 108910 -89327 -4854 75787 68535 -304915 106166 87377 -184281 -366386 140016 -15115
16029g7361C691b74273p9916b1886l57763a38038B80728b00697h1322K9552k2739
16018g4509B07102E5414c62172a68550Q628A06518b79020n5746a45013N5146D4471
16006A92436m3522F8988a84200j28671a43508A5232g0049j22164A19929a75641
15995b71671g0280j07026l5740b9917k58842h7636K6548A3349f5243G7917i0033
15983G4045a21876C51076A28985K54679j50910J65018a7293G6965M6688d9874
15972h0836D3930R534M3053J49455b95473F5434a70j73813a0958A66030d91289
15960b40363a02946B00552c28942D2508J24844a70953M7115j81443a30084F3980
15949i9291j84555B9346J73697l0554d8559j49550j32054L0610C5079J33041a63182
$$ plain form
16029 -77361 3691 -274273 -354189 -21886 -379649 -138038 280728 -200697 -81322 -51770 -74509
16018 -74509 207102 55414 -362172 -168550 -159922 106518 -279020 -334766 -145013 -89867 44471
16006 192436 148914 68988 -184200 -312871 -143508 15232 -70049 -192213 119929 -175641
15995 -271671 -70280 -177306 -213046 -29917 -288759 -87636 -61088 13349 -65243 77917 -90033
15983 74045 -121876 351076 128985 383664 232754 397772 -17293 76965 123653 -49874
15972 -80836 43930 53464 96517 245972 -295473 65434 -170 -173983 -10958 166030 -491289
15960 -240363 -102946 200552 -328942 42508 167352 -170953 -123838 -305281 -130084 63980
15949 -99291 -283846 29346 203043 172489 -48559 -198109 -330163 -299553 35079 168120 -163182
15937d9765h470l01912a26934A9340a35280Q149l29130J71640j30719a11162M9509
15926f1653E0263a18168k63864B06406a242k22602H2659b28083P5060j36778c2870
15914b92047J42306i373m54648A4519J29371n0990K8209l5284B5477b83848l45161
15903f29009I3085b92404f1879B94810d37683A50386d0529m17107I9468B390a27106
15891b01956A26541a31370e1083J0433G8400i0658A05564P8828C3847J62920a68710
15879A40263C1147L8765O0923K11950A42586L5347a37260B33566k9169b55136
15868I2460d15988C5356a32771A9878A487c96076E5148a7479B3531Q8271A9528
15856a09223G9005i6073j29379B43791d5052C09740a07927B43011a8201l23016
$$ plain form
15937 -49765 -8470 -310382 -126934 19340 -135280 -127131 -456261 -284621 -415340 -111162 -61653
15926 -61653 50263 -118168 -382032 206406 -1242 -223844 82659 -228083 -153023 -289801 -32870
15914 -292047 -149741 -9373 -464021 14519 143890 92900 121109 85825 25477 -283848 -629009
15903 -629009 93085 -292404 -61879 294810 -437683 150386 -40529 -457636 99468 2390 -127106
15891 -201956 126541 -131370 -51083 -40650 78400 -90658 105564 184392 33847 196767 -168710
15879 140263 31147 69912 130835 342785 142586 177933 -137260 233566 204397 -255136
15868 92460 -415988 35356 -132771 19878 1487 -396076 55148 -17479 23531 111802 19528
15856 -109223 79005 -96073 -225452 243791 -45052 309740 -107927 243011 -18201 -341217
15846c41217J27305I4219p673b47547e6693A37966J61259a08846H5502a4085j07214
15835a21299B33788c5139B278h6181E5023b6334k33908C42425c33100C9385f1553
15823g7908b2720C9055J21513P7025e7301m32215b3982F4371d21989K05989d0453
15811h4116l0032r6808j2539B48385c65538g9610l3645B04302p1545d0778k53795
15800b94573H1463d7148B29769E1097a51579p3155B55615F6205d4662B15933h9459
15788a77599D0458b64936C07164D1062J64690I1704a20249B1145P7093a68236
15777a64525N0017k32288a49905J6001C4813a5979E34928A34996a97634k58922
15767d56556D8942e6618A64772a05111k63219R8246l8388A77014A773M0892m019
$$ plain form
15846 -341217 -213912 94219 86546 -247547 -56693 137966 299225 -108846 85502 -14085 -121299
15835 -121299 233788 -35139 2278 -86181 55023 -26334 -260242 342425 -333100 39385 -61553
15823 -77908 -22720 39055 160568 237593 -57301 -489516 -23982 64371 -421989 -216000 -40453
15811 -84116 -114148 -210956 -223495 248385 -365538 -79610 -113255 204302 132757 -40778 -294573
15800 -294573 81463 -47148 229769 51097 -151579 -224734 255615 66205 -44662 215933 -89459
15788 -177599 40458 -264936 307164 41062 205752 91704 -120249 21145 98238 -168236
15777 -164525 -114508 -346796 -149905 -133904 34813 -15979 534928 134996 -197634 -456556
15767 -456556 48942 -56618 164772 -105111 -368330 -270084 -308472 177014 1773 42665 38646
15756C8646Q2669b055A44701h1631G8956b7412B40143o3060a71055A86201B3326
15744A3900K50154D3256O7725b86944R5652k6752a00103j41587b9656o1643n515
15733i6814c5065B56888b08682P1334j1246b1781l8848j51208K3794C1141d7251
15721i9062C0793a96191Q2470o0178j13159f1271E4017a6533k08992I0973J8666
15710A09639n2546J05328A8255K45140e9867n2936j4152j59853J6446a22863F2819
15698A74532a20688I7442P0977E0870b50347G6494A9207J31316d154D8134b59347
15686b83201A83738f5968n6154J2602F9713K1775a11785c2137A06902e4462k01732
15675b56194A213P1274J5973c94405c1486A3115a21936A87065F7135b35543Q932
$$ plain form
15756 38646 121315 -2055 144701 -81631 78956 -27412 240143 177083 -171055 186201 23326
15744 13900 264054 43256 110981 -286944 -191292 -218044 -100103 -241690 -29656 -91299 -96814
15733 -96814 -35065 256888 -208682 -137348 -148594 -21781 -60629 -211837 -188043 31141 -47251
15721 -99062 30793 -196191 -113721 -173899 -287058 -61271 54017 -16533 -225525 90973 109639
15710 109639 57093 162421 18255 263395 -59867 -112803 -126955 -286808 -270362 -122863 62819
15698 174532 -120688 97442 168419 50870 -250347 76494 19207 150523 -4154 48134 -259347
15686 -283201 183738 -65968 -122122 -109520 69713 91488 -111785 -32137 106902 -54462 -256194
15675 -256194 1213 72487 88460 -394405 -31486 13115 -121936 187065 67135 -235543 -226611
15664b26611E3961a57933j97224J73103K6220p5367A97056c60702A25276K05616
15654C30892c40809a48033f1510k46754C39080a55094j6368B3354c32093C58982
15643i7913I2888b06880i2795p776k10716P9822f5283n640l2989B53924m100i5611
15630a60604k57111J54306f1573A94184E6275r484K03703K25031A46500C2415
15619C6544O0920a5244k15226A35133K8464A6006a0636k68149A46562b96392J616
15608b94776B49995e3000D6054c36633C47510i7517n6204B8423L0695a42967A24386
15596d09837A46400d8947m8392p6566b3364F2115b29687A15023c37071B06942
15585G0134b8085C3640K69660I3400L57765b6721C7544b99444C25021a56209a63
$$ plain form
15664 -226611 53961 -157933 -355157 -182054 -155834 -231201 197056 -360702 125276 330892
15654 330892 -340809 -148033 -61510 -308264 339080 -155094 -171462 23354 -332093 358982
15643 -97913 92888 -206880 -92795 -100571 -311287 -231465 -65283 -70923 -103912 253924 249824 -95611
15630 -160604 -417715 -263409 -61573 194184 56275 46791 250494 475525 146500 32415
15619 36544 97464 -15244 -230470 135133 163597 16006 -10636 -278785 146562 -296392 -294776
15608 -294776 249995 -53000 46054 -336633 347510 -97517 -153721 28423 59118 -142967 124386
15596 -409837 146400 -48947 -97339 -173905 -23364 62115 -229687 115023 -337071 206942
15585 70134 -28085 33640 303300 93400 451165 -26721 37544 -299444 325021 -156209 -163
15573D08805A49820a46722L4517o0781d7824j24857J2495A67718a08456C70064
15562g5766D033O482J98642D5023a89706C74387B1696D430i3306A47324p2794
15551G4530c36897P1298B50998A09087a36283j84768A22964J80178a00224j14288
15541b14512j6837c7486j4376G561a989A84699a73869B40566C4918J31073c38435
15529B07439q7815e7626J0137n7338A76678b15891c5990A03106b14885R0708l14355
15518d38532A28153C6979a98644F1260A030a12660k3272j7212E2818E607b40738
15506a13835A54444b13803B71836b55503Q3304f4047D425J00502J24557b19599
15495A81654c32074B14078a72165A0569K6490b14169b6697r9359o3506b1423k7196
$$ plain form
15573 408805 149820 -146722 -112205 -172986 -47824 -172681 -160186 167718 -108456 370064
15562 -75766 4033 10515 209157 45023 -189706 374387 21696 4430 -93306 147324 74530
15551 74530 -336897 -265599 250998 109087 -136283 -321051 122964 303142 -100224 -214512
15541 -214512 -231349 -37486 -51862 7561 -1989 184699 -173869 240566 34918 165991 -338435
15529 207439 119624 -57626 -47489 -104827 176678 -215891 -35990 103106 -214885 -124177 -438532
15518 -438532 128153 36979 -198644 61260 1030 -112660 -135932 -153144 52818 5607 -240738
15506 -113835 154444 -213803 271836 -255503 -172199 -64047 4425 104927 229484 -219599
15495 181654 -332074 214078 -172165 10569 37059 -214169 -26697 -126056 -189562 -21423 -48619
15484d8619p7808q9098A79480k3506j1624a20527F9817a6499E7410n738a29369
15472c07135j4508H114N8617J49244l317K9960f4312a3995j20993A66509g3499
15460a82682A53333a13225q876E8400g5759k48513A09947b7229A58486J09520
15450B68006a3783n1765C5504g8998A05215b64949J18142j20207C89173b69747
15439B50140n9490k7024a62806l0503A59191p7398J69962a38064A67486R1534
15429B59020b03116A8958b20701Q1319m1866D1296j8195a1209A59493a32520A65038
15417H3056a21910q7553B9888a37332B17410a8048B05985a87507d9680G834b22848
15405b15997j16469N5226I3684b49913b0282A56468o0203d1934A93528o6362k4548
$$ plain form
15484 -48619 -126427 -215525 179480 155974 144350 -120527 69817 -16499 57410 51672 -129369
15472 -307135 -321643 8114 66731 215975 212658 242618 -64312 -13995 -134988 166509 -73499
15460 -182682 153333 -113225 -122101 58400 -75759 -324272 109947 -27229 158486 268006
15450 268006 -13783 -65548 35504 -78998 105215 -264949 -146807 -267014 389173 -269747
15439 250140 190650 163626 -162806 -193309 159191 81793 251755 -138064 167486 259020
15429 259020 -203116 18958 -220701 -139382 -181248 41296 23101 -11209 159493 -132520 165038
15417 83056 -121910 -209463 29888 -137332 217410 -18048 205985 -187507 -49680 7834 -222848
15405 -215997 -332466 -277240 93684 -249913 -20282 156468 96265 -41934 193528 127166 102618
15394A02618a21695C8344a541F5779b06422b3531a1349p5214C06587A07611L51646
15383D59257h4617k3058A13571K6655a2610A21934e1059C60016a45327I9612H786
15371A23861c49434h2061j08775o8675J27954a7773l6870H2102c4362B92534E5208
15359A53845c30741J2737A51618C0373J734J42854K09470J46570c2133j29016
15349a61149P4749B01148H2750J88147d6259L212a8946p5596A29427e996m1035
15338d7031j40687A43901g6264A2952P4883M6737A028d7819k19962h4975j36211
15327b21186A33768a4308A15792a53848A28572B1589d6732q8831m4470l7715N4309
15316a63439f8281J739e609B65939a33697e9881k34198F3321J67468g001D8446
$$ plain form
15394 102618 -121695 38344 -1541 65779 -206422 -23531 -11349 -86563 306587 107611 459257
15383 459257 -84617 -107675 113571 140226 -12610 121934 -51059 360016 -145327 99612 8786
15371 123861 -349434 -82061 -190836 -259511 -131557 -17773 -54643 82102 -34362 292534 55208
15359 153845 -330741 -318004 151618 30373 32107 174961 384431 531001 -32133 -161149
15349 -161149 -86400 201148 82750 270897 -46259 -43047 -18946 -94542 129427 -5996 -47031
15338 -47031 -187718 143901 -76264 12952 87835 134572 1028 -47819 -267781 -84975 -221186
15327 -221186 133768 -14308 115792 -153848 128572 21589 -46732 -135563 -180033 -217748 -163439
15316 -163439 -68281 -66542 -5609 265939 -133697 -59881 -294079 63321 230789 -7001 48446
15304h5081E7295b52411c649A30021J01577b49927f0014A11882g9261E2171j929
15293E0242J90862j18100h3875c0524H0608g9968B45943a77089F2002M6803H890
15281A0503J29830c82348A02794j1324K9066J1387m0358r247d0019A58610b87869
15269A51890l39M4864b07737e6052e166E5581b8047B54269a14453C983a12127
15257B38375k8225J54056a64942A13985m9927K64551A3721L36999A21223M42205
15247E63428Q16085L04981m35522M73432H53139m08424k7844a91973R4741a3910
15236A17133n669i8695k44239G9931N50155c2890B99982a73416B76635f3175B8032
15224C3977J08026b9201C0366a28604A43523E444J10233K8008j9031h51B09999
$$ plain form
15304 -85081 57295 -252411 -3649 130021 231598 -249927 -60014 111882 -79261 52171 50242
15293 50242 241104 123004 -83875 -30524 80608 -79968 245943 -177089 62002 108805 8890
15281 10503 140333 -382348 102794 91470 120536 131923 91565 82318 -40019 158610 -287869
15269 151890 151551 196415 -207737 -56052 -5166 55581 -28047 254269 -114453 3983 -112127
15257 238375 210150 364206 -164942 113985 64058 328609 13721 350720 121223 563428
15247 563428 1379513 1684494 1248972 1722404 853139 444715 416871 -191973 -97232 -13910
15236 117133 111464 -98695 -342934 79931 630086 -32890 299982 -173416 276635 -63175 28032
15224 33977 142003 -29201 30366 -128604 143523 5444 115677 143685 124654 -851 209999
15212c51708a42896N7786B71544a79371B6867K13863J0805b433k50435A37506
15201D0199K20734p0085g6892D2437a95373A06198j3159a06615L7462A9384K11817
15190B31201a36298A1650a82924B97269J83699A61520b65449H0719K21393J722
15180C03834j41033J34850O9557k7288c0884n35733A18759C8098K83374A9464
15169A31963K65788E4945a39113A36387k9119J59881G3216G150J35840j0066J34745
15158B67669r1581d1878D5027g7478C123K82262j05171A4952a86755C69607B3142
15146A30064N6471b75184A77008r341O8142f2463b9305A39390c68115A6557a53856
15134C02533f0848j32268b3720j64059N9746C1984L90327B680b85903B13595O8361
$$ plain form
15212 -351708 -142896 -85110 271544 -179371 26867 240730 251535 -2433 -252868 137506
15201 40199 260933 190848 -76892 42437 -195373 106198 93039 -106615 -69153 19384 231201
15190 231201 -136298 11650 -182924 297269 480968 161520 -265449 80719 302112 303834
15180 303834 162801 297651 367208 339920 -30884 -566617 118759 38098 321472 19464
15169 131963 397751 54945 -139113 136387 107268 267149 73216 7150 142990 132924 267669
15158 267669 176088 -41878 45027 -77478 3123 285385 180214 14952 -186755 369607 23142
15146 130064 186535 -275184 177008 167667 235809 -62463 -29305 139390 -368115 16557 -153856
15134 302533 -60848 -193116 -23720 -187779 -128033 31984 422311 2680 -285903 213595 281956
15123B81956h836C5621a62997A66715e4192C40520b87491d6945C00850E22K40079
15112B40601p5875O6358a04902h944A49266O5459n9085B6839M646b036l14030
15101c16066G2707J54142Q6279j51247J45855L9581a04612j52191B10615J71834
15091C82449B8299A0921d7329B79827j29283J60906C7799L46808J4180j77510
15081B21277o0921o3765k1391a8280j40985C22876C196K30167m0552a33991B43123
15069C2726b19380A32573O1235q2081n2883K77031m6014M9270e332A35884K9720
15058A65604J9850Q4995j29666K15028J4822A57760J35673q5334b04141C00674
15047B53305G4449L79256A05938J24534J80543j64533A03589J13532L03216B51452
$$ plain form
15123 281956 -8836 35621 -162997 166715 -54192 340520 -287491 -46945 300850 522 240601
15112 240601 164726 231084 -104902 -8944 149266 214725 155640 26839 31485 -2036 -316066
15101 -316066 72707 226849 313128 161881 307736 347317 -104612 -256803 210615 382449
15091 382449 28299 10921 -47329 279827 150544 311450 37799 384607 398787 221277
15081 221277 160356 96591 75200 -18280 -159265 322876 3196 233363 192811 -133991 243123
15069 32726 -219380 132573 193808 111727 58844 335875 289861 339131 -5332 135884 165604
15058 165604 185454 270449 140783 355811 370633 157760 293433 208099 -204141 300674
15047 253305 74449 453705 105938 230472 411015 246482 103589 217121 520337 251452
15036E8477J59484o2320J87366I5708O216K92006m9193E3100c6333D5379M20106
15025D65485k4698A44785l1946h0141B51928m2860n5050p1615d1984C29503n6488
15014B73015K90761D5803L40150D3962J63262k767J10409m6294A27738K61036
15004C88774j46305J12292J03706r0200j77755R6103P2417j67101f6376B44080
14993B99704n776j35656K16605e4736J1579C22233J04173Q2675k30345J21005
14983C99741A20687K1013K86403c2555A86326J70732A66919J59138J7872A67122
14972a1859D33039A42840M65298A26194J84022N8343j28688J3683d6948D08750
14961D31982I9252J96816J48939i0394A23473J2377N55753C20316j53666L76133
$$ plain form
15036 58477 217961 155641 343007 95708 101924 393930 344737 53100 -36333 45379 465485
15025 465485 440787 144785 112839 -80141 251928 209068 154018 82403 -41984 329503 273015
15014 273015 563776 45803 385953 43962 207224 204457 314866 268572 127738 388774
15004 388774 242469 354761 458467 368267 190512 286615 359032 191931 -66376 244080
14993 299704 293928 158272 374877 -54736 -43157 322233 426406 509081 278736 399741
14983 399741 120687 141700 428103 -32555 186326 357058 166919 326057 343929 167122
14972 -11859 433039 142840 608138 126194 310216 368559 239871 253554 -46948 408750
14961 431982 99252 296068 445007 -90394 123473 135850 691603 320316 166650 542783
14951E42783G1462o180K43243j10751K5392J38712C5083J46179D2552J42994P043
14940A92589J0285m746L00641B45839J71796K7449A43287K91766J41996B07916
14929E99885H9047J95086A9481J28466J03235O696A25314L91063A47383P4421
14919B21804R9600B2929K1775J02817a26101C22244P5602m6330k6998J08777O4998
14908D98293j94727Q4038I3311K03344N6957A62269C7259Q8975K30935o7217j26014
14897A63938L1085M51544l00859p0235J05004J03818p8458j8719j72629e4226
14886B35629K6839K59713a12963B59051L46922A23985J21973j926K64790m6196
14876D62626A81538L83199j21491J09674k51960k0929J62561J49090l5086j29872
$$ plain form
14951 542783 71462 65282 308525 197774 223166 361878 35083 181262 42552 185546 192589
14940 192589 202874 198128 498769 245839 417635 445084 143287 435053 577049 207916
14929 599885 89047 284133 19481 147947 251182 257878 125314 516377 147383 221804
14919 221804 321404 22929 44704 147521 -126101 322244 397846 351516 324518 433295 498293
14908 498293 303566 387604 93311 296655 353612 162269 37259 126234 357169 289952 163938
14897 163938 195023 646567 345708 275473 380477 484295 405837 387118 214489 -54226
14886 235629 262468 522181 -112963 259051 605973 123985 245958 244032 508822 462626
14876 462626 181538 564737 443246 552920 300960 280031 442592 591682 556596 426724
14866D26724A19647L77609J83476c8764E90324A7022M95068K02239l9694B58186
14855B62533M18394r9993A99668L53127j88633p279A54630K36854O6163L7245
14845D94892K46080B90841K27820K65290k73387J32784B00789l573N28111l46504
14835C78823n0535J7656K6435A41577K14624J47940L09634j62958J90017k66072
14825E74762j36064J42709j28972O3285A82745J66116o8000J57409K0631J7460
14815D76361r8582q3881K37313B11063M02056K36313j64035k28379L43608k56896
14805E43730K24463C67155J1335P9122J36772j65944n2751K70591k22137o9765
14795C54378q4162J16800K97307J24678k43838j60630Q8088K46831j85473J31587
$$ plain form
14866 426724 119647 497256 680732 -38764 590324 17022 512090 714329 674635 258186
14855 262533 680927 580934 199668 552795 364162 356883 154630 391484 457647 494892
14845 494892 740972 290841 518661 783951 510564 643348 200789 197216 725327 378823
14835 378823 328288 345944 372379 141577 356201 504141 813775 650817 840834 574762
14825 574762 438698 581407 452435 515720 182745 348861 280861 438270 458901 476361
14815 476361 377779 293898 531211 211063 613119 849432 685397 457018 800626 543730
14805 543730 768193 367155 378490 457612 594384 428440 375689 646280 424143 354378
14795 354378 270216 387016 684323 809001 565163 404533 492621 739452 553979 685566
14785F85566A92662J45493K15875O193k39698J97339Q5136k6025p370j6033O4127
14774F17699L37233j38484k84057B11032J41928N74381C94287q6210L21858l07917
14764C22018L79528l4490Q2245r0447N2787j16244J78576J01445D08919K44759
14754F53678L01690C51062q1018L40586P8327J8368Q1299k6615j61210k42487
14744C58312K59365M8275k30708M51025J17871D69011N2011J80191O5964r4250
14734F72927L81835k52345m4041j51506j44281O04061l9870k14871k15808k67144
14724C28957L02602L57019k52680L13372l37310q967J8600j28625L57300l95748
14714E54520M73004l25791J98814l09400K44631r9412o7172J33690L67420k13572
$$ plain form
14785 685566 192662 338155 554030 560223 320525 517864 603000 576975 569605 553572 617699
14774 617699 954932 816448 532391 211032 352960 927341 394287 308077 629935 322018
14764 322018 701546 667056 749301 658854 711641 595397 773973 875418 408919 653678
14754 653678 955368 351062 270044 610630 688957 707325 788624 762009 600799 358312
14744 358312 617677 665952 435244 886269 1004140 469011 521022 701213 767177 672927
14734 672927 1054762 802417 758376 606870 462589 1066650 1026780 811909 596101 328957
14724 328957 631559 988578 735898 1049270 711960 702993 721593 592968 950268 554520
14714 554520 1027524 701733 900547 591147 835778 736366 669194 802884 1170304 956732
14704I56732l86356L54001j14019l65209O81410j05098k13180L65467m76486K11040
14694I08302j69043P0505l009j6102L78754l44091j79473m1058L76324r1222l22730
14683E67157M64873k6859J16898q3822J40196k95247L77083n26191M94740n05595
14673G23233J97865J07922Q1484l78367K28158K40948l31656M46185o6392j22143
14663A127237o8227J3912j70863j15105K62598K58732j29017j29550K61633k06772
14653A104578K13996j10578Q7800j0177k23570R3301L38016j44790j21137k5256
14643A202183k2732P2944M8209m4456j88395J74258m7009K48877j50735j20339
14633A172805K15357l54728K41936k1387j37929J65152j43977K27209J81893J21362
$$ plain form
14704 956732 570376 924377 810358 445149 1126559 1021461 808281 1173748 697262 908302
14694 908302 739259 809764 806755 790653 1169407 825316 645843 604785 981109 889887 567157
14683 567157 1032030 1005171 1122069 1038247 1178443 883196 1260279 734088 1228828 723233
14673 723233 921098 1029020 1110504 732137 960295 1201243 869587 1315772 1249380 1127237
14663 1127237 1059010 1072922 902059 786954 1049552 1308284 1179267 1049717 1311350 1104578
14653 1104578 1318574 1207996 1295796 1285619 1062049 1155350 1493366 1348576 1227439 1202183
14643 1202183 1179451 1252395 1300604 1256148 1067753 1242011 1195002 1443879 1293144 1172805
14633 1172805 1388162 1033434 1275370 1253983 1116054 1281206 1137229 1364438 1546331 1667693
14623A667693k93787J85273k52205M28882j30l81371R4671j87528Q2273N59148
14613A902919n72311P2472J52462N2022q0606N5360Q3453k59315p3548J19554
14603A452462L61878m41269M14226K6495j42510p082o6537J18150j17481k3807
14593A574525K10044j4135k11497J05517O354K73119j03400P0526m54249L33773
14583A790577K22466Q1664l13330K73135R554k36973M54555j72398J5890p1991
14573B053149N9675K4177Q9789j29994l2187L06217j29033k45313M68897l0065
14563B435312L1552O9022l51455L77107M05002J2481M236M17064k79047J26228
14553C247502N69130K35323M14279J157611J402692L463284R995458K2766050
$$ plain form
14623 1667693 1373906 1559179 1306974 1735856 1735726 1354355 1449026 1261498 1343771 1902919
14613 1902919 1330608 1403080 1555542 1607564 1526958 1582318 1665771 1406456 1332908 1452462
14603 1452462 1814340 1373071 1787297 1813792 1671282 1664200 1597663 1715813 1598332 1574525
14593 1574525 1784569 1770434 1558937 1664454 1670808 1943927 1840527 1911053 1456804 1790577
14583 1790577 2013043 2094707 1781377 2054512 2064066 1827093 2281648 2109250 2125140 2053149
14573 2053149 2112824 2137001 2226790 2096796 2064609 2370826 2241793 1996480 2465377 2435312
14563 2435312 2466864 2535886 2184431 2561538 2966540 2979021 2983257 3400321 3121274 3247502
14553 3247502 3816632 4051955 4466234 5623845 7026537 10489821 20485279 43251329
14545D3251329K236986B0592181q982580n432541k750821p59439j93847n81101
14537A891852M8073Q1807M6343n7398L16988j62753J7080P7500k51054J37755
14527B146193K39647k05100J11615J14414n9990n5490p1797N72382L095m42333
14517B352636L43069n0097k7432M7578J67421j41022J1122k07242M72813l02137
14507B666709L83636l38636p580N63337k92962Q364J0673J33486n7971J86120
14497C255176j44196K67544K7971l1788q2263p1626K64916K30777k25889L6601
14487C527223J47042j14307J17543P717L0248P6540O1033K09389l98969L53885
14477D017344N7315k2956K35845k38902J98859j07018K11633o8663m6204J91369
$$ plain form
14545 43251329 45488315 20592181 11609601 6177060 3426239 2666800 2472953 1891852
14537 1891852 1939925 2021732 2068075 2010677 2327665 2164912 2181992 2259492 2008438 2146193
14527 2146193 2385840 2180740 2292355 2406769 2346779 2291289 2219492 2791874 2794969 2352636
14517 2352636 2695705 2645608 2618176 2665754 2833175 2692153 2703275 2496033 2968846 2666709
14507 2666709 3050345 2711709 2704129 3267466 2974504 2982868 2993541 3127027 3069056 3255176
14497 3255176 3110980 3378524 3406495 3374707 3292444 3220818 3485734 3716511 3490622 3527223
14487 3527223 3674265 3559958 3677501 3685218 3715466 3792006 3853039 4062428 3663459 4017344
14477 4017344 4074659 4051703 4287548 4048646 4247505 4140487 4352120 4283457 4237253 4428622
14467D428622K11937q2368J59478k8796j77334n5935L10520j9902M95627j86585
14457E055264j0729O410l8180N86853m4563k79532P9293r7044K96902P1272Q7454
14446E713400j91409L97486Q1896q8375J23552l4527L20291J15475k26593J86094
14436F397290K13282k52550K20722L00857j35684J97927O7942K69446j42067J19718
14426G256883k8738K24630Q2164J29841M01219k03646o0402Q2800M41744j64431
14416H162064K34651K90828P4820L63303k51613K69968K73530k09155K59938J22981
14406I591315J80787k50566N53308o541K51848P3169K03896p7495N78981j3556
14396A1085146M89764M0867K63968q8992L98465P5632J17286J01589M41248J92945
$$ plain form
14467 4428622 4640559 4558191 4717669 4688873 4511539 4455604 4766124 4746222 5241849 5055264
14457 5055264 5044535 5050945 5012765 5599618 5555055 5275523 5354816 5257772 5554674 5625946 5713400
14446 5713400 5521991 5919477 6001373 5912998 6036550 6002023 6322314 6437789 6211196 6397290
14436 6397290 6610572 6358022 6578744 6879601 6743917 6941844 7009786 7279232 7137165 7256883
14426 7256883 7228145 7452775 7534939 7664780 8065999 7862353 7801951 7884751 8326495 8162064
14416 8162064 8396715 8687543 8762363 9125666 8874053 9144021 9417551 9208396 9468334 9591315
14406 9591315 9772102 9521536 10074844 10068303 10320151 10393320 10597216 10519721 11098702 11085146
14396 11085146 11574910 11615777 11879745 11790753 12189218 12264850 12382136 12483725 12924973 13117918
14386A3117918K79896Q3418K80252K65890L64522N62259J07887J8044Q32727o7864
14376A5844949R2489M62660K47369O17365K32534M37450L42252L74519K97898
14367A8949485K18176J73500Q16404L65479J56059J085892J4832Q28766M77288
14358B3085881P15990N8715N85688N73990R58525l3611J000934O02465P23792
14349B8272369M78317J032941O34078R21599R84093Q21761P08937Q70590R13152
14340C5637837R09913R28549Q96404J757983R89907J140143R21004J543519J271858
14331D5997117J372081J728120J314067J768838J650303J874807J728833K267077
14323E9701243J641255K138661K557340K219015K726256K460935K694866L196287
$$ plain form
14386 13117918 13397814 13481232 13761484 14027374 14391896 14954155 15062042 15080086 15912813 15844949
14376 15844949 15937438 16400098 16647467 17264832 17497366 17934816 18277068 18651587 18949485
14367 18949485 19167661 19341161 20157565 20523044 20679103 21764995 21779827 22608593 23085881
14358 23085881 23801871 23860586 24446274 25020264 25978789 25945178 26946112 27548577 28272369
14349 28272369 28750686 29783627 30417705 31339304 32323397 33145158 33854095 34724685 35637837
14340 35637837 36547750 37476299 38372703 40130686 41120593 42260736 43181740 44725259 45997117
14331 45997117 47369198 49097318 50411385 52180223 53830526 55705333 57434166 59701243
14323 59701243 61342498 63481159 66038499 68257514 70983770 73444705 76139571 79335858
14315G9335858K761242L560555L234434L705761M020044L924363M087719M715830
14307A09345806M743313N019993N568022N460039O041453O110827O598371P393039
14299A56280863P756808P880097Q627001R255352R711864R735749J0840081J1234686
14291B31322501J1896296J2484236J2785621J3898978J3627149J4746159J5032174
14284C25793114J5171901J5511047J5585366J4899420J4875917J4452845J3369537
14277D29659147J2146252R930033Q724793O528028L965433N99364l800098l861750
14269D63891202n024810o350408o161307q179329j0738088j2000666j2902509
14262D02534085j4153635j5268392j5612410j6004387j5671192j5516191j5154743
$$ plain form
14315 79335858 82097100 85657655 88892089 92597850 96617894 100542257 104629976 109345806
14307 109345806 114089119 119109112 124677134 130137173 136178626 142289453 148887824 156280863
14299 156280863 164037671 171917768 180544769 189800121 199511985 209247734 220087815 231322501
14291 231322501 243218797 255703033 268488654 282387632 296014781 310760940 325793114
14284 325793114 340965015 356476062 372061428 386960848 401836765 416289610 429659147
14277 429659147 441805399 451735432 460460225 466988253 470953686 471553050 467752952 463891202
14269 463891202 458866392 452515984 446354677 438175348 427437260 415436594 402534085
14262 402534085 388380450 373112058 357499648 341495261 325824069 310307878 295153135
14255B95153135j4691852j3360447j2647867j2577272j2192174j1606363j0651420
14248B07425740j0518093r493470r205976q293804p967805p250378p710554o592193
14240A40393467o397898o208529m898971n358641n225197m997622m064786m023512
14232I9218311m442665l172343l644452l277805l447694l199123l059223k804321
14224G2170685k288331k357896k568618k058941k202423k095936j817656k263805
14216E4517079j797538j084499j647438j151210j731360j294063j492149j275658
14208D3043164j187040n42228j365874j053133j510663j036063o25477q16766
14200C4905920o73057j233403j043587p31669r22142m53488l89591r53246q77293
$$ plain form
14255 295153135 280461283 267100836 254452969 241875697 229683523 218077160 207425740
14248 207425740 196907647 187414177 178208201 169914397 161946592 154696214 146985660 140393467
14240 140393467 133995569 127787040 122888069 117529428 112304231 107306609 103241823 99218311
14232 99218311 94775646 91603303 87958851 84681046 81233352 78034229 74975006 72170685
14224 72170685 69882354 67524458 64955840 62896899 60694476 58598540 56780884 54517079
14216 54517079 52719541 51635042 49987604 48836394 47105034 45810971 44318822 43043164
14208 43043164 41856124 41313896 39948022 38894889 37384226 36348163 35722686 34905920
14200 34905920 34232863 32999460 31955873 31224204 30302062 29848574 29458983 28505737 27628444
14191B7628444q52036l98038o46409n20412p24786p80086m86564j00635p30171
14182B2389307m14952n07454n27091l65296k06951p23932m76298l56710n31864
14173A8278759j19866l30068m46500k94525k18137j20268n56738k38663r3496
14164A5860498l62788j88728p19059l23193O4970k69071l04907k1504j26099o11786
14154A2998333M5469j1482l26828k78248k39513k04008k41255m00254L5457m30391
14144A0947280j46632M04244n51315j49951O3987k31742l52397j17087l57091
14135I509296O532l32168K46839m93971K59974k11401k20030J44014k38513l14012
14125H356560j06875L18845m97346k24666O0866k94508J43642k76932K51212m81374
$$ plain form
14191 27628444 26776408 26378370 25731961 25211549 24486763 23706677 23220113 23119478 22389307
14182 22389307 21974355 21466901 20939810 20574514 20367563 19643631 19167333 18810623 18278759
14173 18278759 18158893 17828825 17382325 17087800 16869663 16749395 16192657 15953994 15860498
14164 15860498 15497710 15308982 14589923 14266730 14331700 14062629 13757722 13736218 13610119 12998333
14154 12998333 13043802 13032320 12705492 12427244 12187731 11983723 11742468 11342214 11377671 10947280
14144 10947280 10800648 11204892 10653577 10503626 10567613 10335871 9983474 9866387 9509296
14135 9509296 9515828 9183660 9430499 8936528 9196502 8985101 8765071 8909085 8670572 8356560
14125 8356560 8249685 8568530 8071184 7846518 7907384 7612876 7756518 7479586 7730798 7249424
14115G249424J95611j37667J53834l52037j24653m2193k49407n0302k25698J35852
14105F552764l13914L49042k02228k19604k17237M11772k12438l08145J37987
14096E977999K45653l51239J4455m64682J37052n7856l12410q478j83702j9752
14086D977040O4486J53641m2793l50129M13935k01285j04570L7311j25994k23156
14076D598486L87478j01535q20629N36093k45416J23041m23398J34824L82360
14067D571304k94685L5130J9366j65279l60210K21564J15935J91531o21809N8454
14057C771301J50434j68994J42326j53286j29141j45386L02343o17167J079532
14048D231962p20038l7992O2361k6596m8323k85480M2318O958k3569L01844j52944
$$ plain form
14115 7249424 7445035 7307368 7461202 7109165 6984512 6942319 6692912 6642610 6416912 6552764
14105 6552764 6238850 6587892 6385664 6166060 5948823 6360595 6148157 5840012 5977999
14096 5977999 6223652 5872413 5886868 5422186 5559238 5501382 5188972 5180494 4996792 4977040
14086 4977040 5041526 5195167 5152374 4802245 5216180 5014895 4910325 4947636 4821642 4598486
14076 4598486 4985964 4884429 4063800 4599893 4354477 4477518 4054120 4188944 4571304
14067 4571304 4276619 4311749 4331115 4165836 3805626 4027190 4143125 4334656 3712847 3771301
14057 3771301 3921735 3752741 3895067 3741781 3612640 3467254 3769597 3152430 4231962
14048 4231962 3511924 3473932 3536293 3509697 3461374 3175894 3218212 3225170 3201601 3503445 3350501
14037C350501n8274j07392r0914Q4804J28293k39521j5467j31385K14266j62994
14027B971917m369O1236j73258K32756k87302l45164P0284J88490L8671K15482
14017B968743n00031P012P730K08778o63j27295k03385R2251Q9281k79674j8640
14006B244107K53249p0481j1237m67557K94552N2143j23274K41314p43710M15948
13996B085054K6615k52823N15227k14055m04237N01322J07103N83002K112612
13987E059820P607442K1789805J3787010k2492308j2195501n360535k077386j230051
13979D888296r00663l24015j20279k77742k13976n56620K85106J30735m10894
13970B499948K05056o8006k61239M7356J8985j41165J55689j27374j50331J43662
$$ plain form
14037 3350501 3292227 3184835 3093921 3178725 3307018 3067497 3052030 2920645 3134911 2971917
14027 2971917 2967548 3028784 2855526 3088282 2800980 2455816 2526100 2714590 2753261 2968743
14017 2968743 2468712 2475724 2483454 2692232 2691569 2564274 2360889 2453140 2542421 2262747 2244107
14006 2244107 2497356 2426875 2415638 1948081 2242633 2294776 2171502 2412816 1669106 2085054
13996 2085054 2111669 1858846 2374073 2160018 1755781 2257103 2364206 2947208 5059820
13987 5059820 12667262 34457067 48244077 25751769 13556268 8195733 6118347 4888296
13979 4888296 3987633 3663618 3543339 3265597 3051621 2495001 2780107 2910842 2499948
13970 2499948 2705004 2636998 2375759 2423115 2442100 2300935 2456624 2329250 2178919 2322581
13960B322581j27942r3854N40585O986n44338O9476o0302p9523j41956N8775m691
13949A945797j21031N2297k00957M07891l58377K19650J00294k53977K2315k2830
13939A791072k2147j5690J9435l62013J90947J72369p3782q6516K4294J52662
13929A790631o283k97802K10732j68000N3635J74646k47076j64846P8281M36327
13919A860245k79533m1503j11879n0291J73117J44447J1583k33644J30493j81885
13909A421150j66605L23918j20684p1083k0960O3435N2648r4389J05246k87281
13899A205395K70086J36668k66657J75321k20372j83199J98779r3612J95550k68773
13889A149186J54711j81827J62297K27872k33960j4852k56663J58570K08586j19039
$$ plain form
13960 2322581 2194639 2100785 2641370 2648356 2104018 2173494 2113192 2033669 1891713 1950488 1945797
13949 1945797 1824766 1877063 1676106 2083997 1725620 1945270 2045564 1791587 1813902 1791072
13939 1791072 1768925 1753235 1772670 1410657 1601604 1773973 1700191 1613675 1637969 1790631
13929 1790631 1784348 1486546 1697278 1529278 1582913 1757559 1510483 1345637 1423918 1860245
13919 1860245 1580712 1539209 1427330 1377039 1550156 1694603 1706186 1472542 1603035 1421150
13909 1421150 1254545 1578463 1457779 1386696 1365736 1429171 1481819 1387430 1492676 1205395
13899 1205395 1475481 1612149 1345492 1520813 1300441 1117242 1316021 1222409 1417959 1149186
13889 1149186 1303897 1122070 1284367 1512239 1278279 1263427 1006764 1165334 1373920 1254881
13879A254881j48274l4101n3277r2836L12273k03243l585J59477M6594l29231
13869I08678N53424l09081j76746L9105L67357j91829l52433P9869L66696o23040
13859F62000K58872J94870R2215k41288K72670k65288j60160l0179M85733J73483
13849A442928n36035j56495M53344J2479j79521R0824l72855K69277O8983l18543
13839G74386L53055k38121J90744o415j10994K83199m04406J83395k21637K39579
13829A042785l27032L85437r0359l93702N20581m12803K10115J71873j13772k89494
13819G03629M6470R887J35004K64549k06009P7585l19773L6623K54521k12958
13809G89528K4825j90292L16654m6421R0622j52990p4476k07406j1340M74777
$$ plain form
13879 1254881 1106607 1072506 1019229 926393 1238666 1035423 1031838 1191315 1237909 908678
13869 908678 1462102 1153021 976275 1015380 1382737 1190908 838475 918344 1285040 662000
13859 662000 920872 1115742 1207957 966669 1239339 974051 813891 783712 1269445 1442928
13849 1442928 906893 750398 1203742 1216221 1036700 1127524 754669 1023946 1092929 774386
13839 774386 1127441 889320 1080064 1073649 962655 1245854 841448 1024843 803206 1042785
13829 1042785 715753 1101190 1010831 617129 1137710 724907 935022 1106895 993123 703629
13819 703629 750099 759986 894990 1159539 953530 1031115 711342 747965 1002486 789528
13809 789528 814353 624061 940715 894294 984916 831926 757450 550044 538704 1013481
13799A013481m63099K83835l7503J88311N4642k44187J92887m14635L61625j67663
13789G67694k79641J81006k118k03728O5517l3077J89124J71844J801j92296J98459
13778H64585k49693L23239k40852k9350K4182M09002l97917j88788J58606K65906
13768I38920C68982L99249j22462P0896P607J15426p2329k09702K25445l5667
13758G47445O687l2562J41460j37206l22266L65681m1520P5715L3597B93711L48367
13747F42078J80408D01466K87439k13720L78270j8110j4257r7747N0868k9152
13737G45057j48094M4013k9683R6185j65331J35777j4536P3808C57889J58643
13727E16532l8143j51984K6432K30453E37P07472j4929o8848k86075M87487j0627
$$ plain form
13799 1013481 550382 834217 796714 985025 1039667 795480 988367 573732 935357 767694
13789 767694 488053 669059 666941 463213 528730 495653 684777 856621 858422 666126 864585
13778 864585 614892 938131 697279 667929 692111 1101113 703196 514408 673014 938920
13768 938920 368982 768231 645769 716665 724272 839698 767369 557667 783112 747445
13758 747445 754132 721570 863030 725824 403558 769239 727719 803434 837031 293711 642078
13747 642078 822486 401466 688905 475185 853455 835345 821088 723341 774209 745057
13737 745057 596963 640976 611293 707478 542147 677924 663388 737196 357889 516532
13727 516532 478389 326405 352837 583290 537 708009 693080 624232 338157 825644 815017
13716H15017C84721M91182B11736N01334k37747L2874J08982O472O1316C30840
13705F97461k17422M01530R3839C63077n4169L44010j84291J02106J69533K23082
13695I63348B80685P6966J75107N9277R1285j53965P3819j6986K5781j40400j30349
13684C41220J71842r2701j59840L78934j78081j16690L35645j02470N8226n9862
13674E76223k53254R0254J35272j49681l2743L8884K99642j01796P1163N4989
13664G28953j90012J41000j42274j69924J95426j27916K64402p2377B29823L40536
13654E70359j03843k03433R9348K18412p655D2972M30557B15096L78683j94658
13644C99121R299m3056K05059k38168p4943O3420j2517M8784K11921p4287A66355
$$ plain form
13716 815017 384721 875903 211736 713070 475323 508197 617179 623651 684967 330840
13705 697461 480039 881569 975408 363077 308908 652918 468627 570733 740266 963348
13695 963348 280685 357651 532758 592035 683320 529355 603174 586188 611969 471569 341220
13684 341220 513062 420361 260521 639455 461374 344684 680329 577859 636085 576223
13674 576223 322969 413223 548495 398814 366071 404955 704597 602801 673964 728953
13664 728953 538941 679941 537667 367743 563169 435253 699655 627278 229823 570359
13654 570359 466516 263083 362431 580843 573188 42972 473529 215096 593779 399121
13644 399121 408420 365364 570423 332255 257312 320732 308215 356999 568920 494633 166355
13632E15886D3547K57063K28099L5672k025k39328A10515J49914m547K31223J98095
13621F85200k87443A51710M74732B74638J63171k11118J59860j62234J86961j83443
13611B27835P7511o1855J4372J77511K58903C0593J11307K57133Q453p5529N2150
13600C84107J892A68842L74450r8947B20093R0845K73489A35172N0265L0246J05377
13589C21060l2468j06538J81825J76024B16802M71873l01017O7866m9043o8400
13579C38081O6427n7031J47016L0866q6740j70359l5347m9422M16870j9802B78556
13567F23209j60287L4797b1759D20439j77295A02448J23974K14315Q9059M1480
13557E71276p4961B17496N56457C70914A52850M4197J95141J94080j66849j45699
$$ plain form
13632 515886 43547 300610 528709 564381 562356 323028 110515 260429 255882 487105 685200
13621 685200 397757 151710 626442 274638 437809 226691 386551 224317 411278 227835
13611 227835 305346 243491 257863 435374 694277 30593 141900 399033 407486 331957 384107
13600 384107 385999 168842 543292 444345 220093 310938 584427 135172 185437 215683 321060
13589 321060 288592 182054 363879 539903 216802 688675 387658 455524 406481 338081
13579 338081 404508 347477 494493 525359 438619 268260 232913 183491 600361 580559 278556
13567 623209 462922 497719 -21759 420439 243144 102448 226422 440737 529796 571276
13557 571276 496315 217496 773953 370914 152850 197047 392188 586268 419419 273720
13547B73720j4413P1934Q9539j76246C612K91281K72061k50459Q3542Q9145A39253
13535B05998n9596R5701J20778q2720G7383M24075j72026K9762L71451B46065
13524E71179B27281K31855j38322J30198k15986d495D77468q7528G9699J28046
13514B07745J75748j75584K93500A04390P6308K48411E2044A6626c1962C85493
13503C25195k3123J80350B8258N9787N9848J93944j34056a7331j6262C03542N0283
13492C53825j62751Q366N2188L1041j40959m7805M17266B17612n1820E7102J76385
13481B33487A10457L04877j9194p1146M5804H3260M20316p2692j8800c9806B07190
13469D19609A94005r597R5179Q1809K86747l19267A37505J89183I3176J98563
$$ plain form
13547 273720 259307 331241 420780 244534 3612 294893 566954 316495 400037 489182 139253
13535 205998 146402 242103 362881 280161 77383 501458 329432 359194 730645 246065
13524 571179 227281 459136 320814 451012 235026 -4495 477468 389940 79699 207745
13514 207745 383493 207909 501409 104390 180698 429109 52044 16626 -31962 385493
13503 325195 302072 482422 28258 88045 147893 341837 207781 -17331 -33593 303542 353825
13492 353825 191074 199440 251628 282669 141710 93905 511171 217612 165792 57102 233487
13481 233487 110457 415334 396140 324994 370798 83260 503576 430884 412084 -39806 207190
13469 419609 194005 184408 279587 361396 648143 328876 137505 326688 93176 291739
13459B91739E9609M2888L26169j94940J15911j71307i6135C29000a52909B39545
13448A89503K88013a7592B61857n8926J17767K62349j59121A46924K51877j3189
13438C85612O5493j86485p0454Q9199j03925J19529K7437R4863E593K10768q3095
13427A33266J6748K5691A1022L18179k9528E1739K14324K60259I2183l7334a0746
13415C56973j626j71327D2692N66274k66316r2559J06875j18706j06884F2552
13404A03515P0084H6083e8750B67965E1230P4757K02841j32285G8887J5792a78679
13392C94953f0227Q800B63886J69566k09677r4360K756K35943j78877q9498L4681
13381A34420C3684m025M01336L08342G7696Q9259J34346R0744E2291L03248r092
$$ plain form
13459 291739 59609 102497 428666 233726 349637 178330 -96135 329000 -152909 239545
13448 189503 477516 -17592 261857 202931 320698 583047 423926 146924 398801 385612
13438 385612 451105 264620 194166 283365 179440 298969 326406 421269 5593 216361 133266
13427 133266 150014 175705 11022 329201 299673 51739 266063 526322 92183 54849 -10746
13415 356973 355347 184020 42692 608966 342650 250091 356966 238260 131376 62552
13404 103515 173599 86083 -58750 267965 51230 125987 328828 196543 78887 94679 -178679
13392 394953 -60227 -51427 263886 433452 223775 129415 132171 368114 189237 99739 134420
13381 134420 33684 29659 430995 739337 77696 166955 301301 392045 52291 355539 346447
13370C46447P7830i7236B0715b501C14766D8643j9395J7274P2216L00327j71240
13359B47825p6795P1720q4966m9043K22735G1512Q5692l1592J32935j27081R7129
13348B28595K95646L8990j36188A16411Q7757M8257L0140r6750J29781H3372J40329
13337B23701J18602h7831B48541k5642O4287l7096J34915r7659a3300A88891J29904
13326C18795I1245f4271B06285L06250A10856K47302B9942J71460I2535J31870
13316B24405B1214D636J09533B4586K30375M4094A10881L66308j86796K47425
13306E37818B31704r0449m7912K08930j33362E071J80452H9006l8645J15119p5499
13295H9981L36905I4190K25854j42902b0565j1698r091n7244b4061B40664K02251
$$ plain form
13370 346447 424277 -97236 20715 -2501 314766 48643 29248 46522 118738 419065 247825
13359 247825 171030 242750 157784 108741 331476 71512 157204 125612 258547 131466 228595
13348 228595 524241 563231 427043 116411 204168 252425 282565 185815 315596 83372 223701
13337 223701 342303 -87831 248541 222899 287186 250090 385005 287346 -13300 188891 318795
13326 318795 91245 -64271 206285 512535 110856 358158 29942 201402 92535 224405
13316 224405 21214 4636 114169 24586 254961 299055 110881 477189 290393 537818
13306 537818 231704 141255 93343 302273 168911 5071 185523 89006 50361 165480 89981
13295 89981 426886 94190 320044 177142 -20565 -32263 -41354 -98598 -24061 240664 442915
13284D42915j41635j5375A14593D462R090K42865O8628A41394K52198a13016B03008
13272C77731a87006B64467a22911M9654D1086O6411l0790O0889n8088J5003g3103
13260b0292l2783B61913E7121a68143C45740r6458K3693L5889j51177b6405C52577
13248B65305N5585j2664I8527J84134Q033A37969k2567L42190j61194j07267L4700
13237B23831G7413J06515d8383A33978j7468Q552M7660C9781J52227Q9457H3150
13225A47667M4046J04633f9855B48892I4529L73251B03526c3187D18821A52480
13214b21567A99632r1992B3408J78435o3279Q5248N6533a16336A53284k2500Q0409
13203B11193a00402A40837b34091A27024J99335j26138b87050F8499e7722B54623
$$ plain form
13284 442915 301280 285905 114593 4462 13552 256417 325045 141394 393592 -113016 203008
13272 377731 -187006 264467 -122911 -73257 41086 107497 76707 137596 79508 94511 -73103
13260 -20292 -53075 261913 57121 -168143 345740 249282 272975 308864 157687 -26405 352577
13248 265305 320890 308226 98527 282661 290694 137969 115402 457592 296398 189131 223831
13237 223831 77413 183928 -48383 133978 116510 125062 172722 39781 192008 281465 83150
13225 147667 191713 296346 -69855 248892 94529 467780 203526 -33187 418821 152480
13214 -221567 199632 107640 23408 201843 138564 223812 280345 -116336 153284 130784 211193
13203 211193 -100402 140837 -234091 127024 326359 200221 -287050 68499 -57722 254623
13192h5354C06396O4385A77884m0171l067J5010b16668B51111K4780A08347R7884
13181B06231a36366A19106A5083J42242h2105A19298C8379f5365A58199D721K09834
13170B14555f3609j08j49156A35194B5350J20929K3921c32334A05618j3373J09526
13159B01771e0001D98568J9776A60729D9571K67179A37249l8549c49450A76638
13148A2575a94789D08895n3356a65825Q1542A31936F2244R0631a0604r27A6631
13136F2965J467N7392e4087C7894R1544n0043J45958A2370a30726c0098A17672
13124i2270A34172K09068f8674D4203J52492b2707A15509h020j14995C6156O9811
13113A05967J88802N7313a8538j147k50556B56966H1052a64515O1046k9370A5450
$$ plain form
13192 -85354 306396 370781 177884 137713 134646 149656 -216668 251111 275891 108347 206231
13181 206231 -136366 119106 15083 157325 -82105 119298 38379 -65365 158199 4721 214555
13170 214555 -63609 -63717 -212873 135194 25350 146279 170200 -332334 105618 92245 201771
13159 201771 -50001 498568 518344 160729 49571 316750 137249 98700 -349450 176638
13148 12575 -194789 408895 355539 -165825 -84283 131936 62244 152875 -10604 -11531 16631
13136 62965 64432 121824 -54087 37894 129438 79395 225353 12370 -130726 -30098 117672
13124 -92270 134172 343240 -68674 44203 196695 -22707 115509 -8020 -123015 36156 105967
13113 105967 294769 352082 -18538 -19685 -270241 256966 81052 -164515 -103469 -132839 15450
13101b24438A84237C4581K58877j37862L91187b5619B51194I9360J15816J48315
13091C63491g8051C1141L00403d8926o5184e6648B85939l8199K30612k01249a01353
13079D32438I2065K5117P3689a08348A28533E2076L02611j3355E0685J81674I3375
13067A59260F6852P6106b06610B2083M94060A18668J23023M57751h9135C2735
13056B94938A38369J14767J10863B0153e3802k69341C55515d1269A56624d5128
13045b78470c5530C59559c286A90905B3428N7390C6646a50403F3322d287B3333
13033D33631C3555a93670D65144a02235F2727R3541M4170J03612a088A37927K8672
13022A66599I19K26057E8442L55786j45718m4926m1125p0552K91597A90997o3873
$$ plain form
13101 -224438 184237 34581 293458 155596 546783 -25619 251194 99360 215176 363491
13091 363491 -78051 31141 331544 -48926 -114110 -56648 285939 247740 478352 277103 -101353
13079 432438 92065 117182 190871 -108348 128533 52076 354687 341332 50685 232359 93375
13067 159260 66852 142958 -206610 22083 516143 118668 241691 699442 -89135 32735
13056 294938 138369 253136 363999 20153 -53802 -323143 355515 -41269 156624 -45128
13045 -278470 -35530 359559 -3286 190905 23428 80818 36646 -150403 63322 -4287 23333
13033 433631 33555 -193670 465144 -102235 62727 156268 200438 304050 -1088 137927 166599
13022 166599 919 226976 58442 414228 268510 223584 182459 111907 403504 190997 127124
13011A27124A5758N1630K71899b41991i9791E8237L22842a73741c04B94209A00840
12999A14263a05716A59144P6539b077B39108k0961r8553b02171D88014A05318
12988B13893M2399a25664n370G0563B9960K40910r2637R6042B435a46912e2242
12976D5133P743d0080J2697D5664i090A20374k0688K13343H4437L31034A83359
12964d1053h801F0902O5537j1083a43959A3041R3967K4998E9032P310a97273A54605
12951g1844B28324j13880f6685b8452D5265Q3387a51819O9994E6364b4133j59688
12940a83821A65850G3160k2963a04336b9241D1190j8572a4182A42113a49129B1937
12928d6285r3811c4614k85345B89678a07948A1913c1870D1091J13931a90542A32902
$$ plain form
13011 127124 15758 67388 339287 -241991 -99791 58237 381079 -173741 -304 294209 100840
12999 114263 -105716 159144 235683 -2077 239108 218147 119594 -202171 488014 105318
12988 213893 256292 -125664 -131034 70563 29960 270870 178233 274275 2435 -146912 -52242
12976 45133 52876 -40080 -27383 45664 -9090 120374 99686 313029 84437 415471 183359
12964 -41053 -8801 60902 126439 115356 -143959 13041 107008 132006 59032 66342 -197273 154605
12951 -71844 228324 114444 -66685 -28452 45265 128652 -151819 -81825 56364 -24133 -183821
12940 -183821 165850 73160 50197 -104336 -29241 41190 22618 -14182 142113 -149129 21937
12928 -46285 -140096 -34614 -319959 289678 -107948 11913 -31870 41091 155022 -190542 132902
12916F3986K7008A2120f6171B30678O5948p0675g7219A50021P0585P1596A38428
12904B69561j28541e6944A58888m9656a90726B24110Q863A15162K277i7166D944
12892A9319a24014K6904c8977l73066H3423K28586A27384K3979B9393b5185A74839
12880C38539A32306n9649J75792A4836J49763a69259c0029A11244g0335A21043
12869I8810b37862A76045a85043h932H7664L19550A90312a85094k79704a83392
12858a21525C01733b0835B4693d7913F6782O1675J31367g8524A71584N0763a52805
12846f0001A27441a18292j23137B03135g7977B30439m8308b944A65359k267h9830
12834e96B10549n9093h6861E3771f6916l3874l0010L2502j06533B98951J23215
$$ plain form
12916 63986 90994 12120 -66171 230678 296626 225951 -77219 150021 220606 292202 138428
12904 269561 141020 -56944 158888 109232 -190726 224110 232973 115162 117439 -97166 4944
12892 19319 -124014 -97110 -38977 -412043 83423 312009 127384 151363 29393 -25185 174839
12880 338539 132306 72657 248449 14836 164599 -169259 -30029 111244 -70335 121043
12869 98810 -237862 176045 -185043 -8932 87664 407214 190312 -185094 -464798 -183392
12858 -121525 301733 -20835 24693 -47913 66782 128457 259824 -78524 171584 222347 -152805
12846 -60001 127441 -118292 -241429 203135 -77977 230439 182131 -2944 165359 163092 -89830
12834 -596 210549 151456 -86861 53771 -66916 -100790 -130800 -98298 -204831 298951 422166
12823D22166B10037o49C629a85668H4507K12541n0514A07305J7744e5845o5611
12812a21456A88420i5273q438j49719P2749C81L28405m6444G904K23522q5356
12801A46070f6741l5794E3779K24090d1301R30A32650e5206A99316E0635b1685
12789B3054a53355I0110e7608K4320B88976j02248I043c95302d4314F2976A5165
12777C4888b42812A41652b74954A13393b24875A3811K13281g5561A85062a39487
12766A11392l7169c6557j90822A55464D7577i6166A20066L26661E6383j5955h0407
12754a46863C37426h187B05409q6410G833O8095h6745a0275B9363P1070a49574
12742g1966l18031A04681O7195a65384E6944i1010F4957J44624g9940D46190A46594
$$ plain form
12823 422166 210037 209388 3629 -185668 84507 297048 246534 107305 125049 -55845 -121456
12812 -121456 188420 -95273 -103711 -253430 -180681 381 328786 282342 7904 231426 146070
12801 146070 -66741 -102535 53779 277869 -41301 -40371 132650 -55206 199316 50635 -21685
12789 23054 -153355 90110 -57608 -33288 288976 186728 9043 -395302 -44314 62976 15165
12777 34888 -242812 141652 -274954 113393 -224875 13811 227092 -75561 185062 -139487
12766 111392 74223 -36557 -227379 155464 47577 -96166 120066 446727 56383 40428 -80407
12754 -146863 337426 -8187 205409 118999 7833 75928 -86745 -10275 29363 100433 -149574
12742 -71966 -389997 104681 171876 -165384 56944 -91010 64957 209581 -79940 446190 146594
12730B17425L4129e7753G8542J40827K1013C4529N7576L7384n2105A5183B468
12718e1334B86037A8196M3843B0626L38053b23839A67602J48824J00247j97713
12708B18960A4880e061E03664B13088q9321q238J50667A15141L12984I9039a62364
12696H9301a69677A52998a28727B72978i7381j96034A82506J37045h7544A60558
12685i8633B48161P4198c1655j92331A19158c8660C121b6574B63387c425A74245
12673a52B51596r3022J32520a38817j83471a0568E7428J37406r5652K0046c02640
12661B7113K51071F7526f1270I2114K48364G8942e3402C4731J49116O9943I867
12649A36940L13455F5777c2181A49595j5031P5927p1558m8304j1970A1066M32858
$$ plain form
12730 217425 251554 -57753 78542 219369 240382 34529 92105 129489 77384 15183 2468
12718 -51334 286037 18196 62039 20626 358679 -223839 167602 316426 416673 218960
12708 218960 14880 -5061 503664 213088 123767 115529 266196 115141 428125 99039 -162364
12696 89301 -169677 152998 -128727 272978 -97381 -293415 182506 319551 -87544 160558
12685 -98633 248161 322359 -31655 -223986 119158 -38660 3121 -26574 263387 -3425 174245
12673 -152 251596 158574 291094 -138817 -322288 -10568 57428 194834 99182 119228 -302640
12661 27113 278184 67526 -61270 92114 340478 78942 -53402 34731 183847 253790 9867
12649 136940 450395 65777 -32181 149595 134564 210491 138933 90629 78659 11066 443924
12638D43924A82368j4404d7866A99529G0768A5126J12649r86a77763A24492K75014
12627C99506A36057R3382J87381a17435I8956r384J60019A09177b17419D5781
12616f6148A18708C0508b65752h0793C25762A41212g1289B42356A864L43695f064
12604b02621G7510B4672F862b9744B18784k2735o1102P6098m5756p6177J704n122
12592H5694Q7800b46038A23955k5060K2965k8347a67322a3168m3522n9976N0622
12581f6044C28031A05794J86542A18963l260a7360A78652a44471A30032b32994
12570c908j69667C78539a36846d3728j2859C00023C1901b76200J16376C85849
12559B54931m2986a58478B66156a91268a4590j03615j94371e7030A33287i1973
$$ plain form
12638 443924 182368 167964 -47866 199529 70768 15126 127775 126789 -177763 124492 399506
12627 399506 136057 229439 416820 -117435 98956 89572 249591 109177 -217419 45781
12616 -66148 118708 30508 -265752 -80793 325762 141212 -71289 242356 1864 345559 -6064
12604 -202621 77510 24672 6862 -29744 218784 196049 134947 211045 165289 89112 90816 85694
12592 85694 173494 -246038 123955 98895 121860 93513 -167322 -13168 -56690 -116666 -66044
12581 -66044 328031 105794 292336 118963 115703 -17360 178652 -144471 130032 -232994
12570 -3908 -173575 378539 -136846 -43728 -56587 300023 31901 -276200 -159824 385849
12559 254931 211945 -158478 266156 -191268 -14590 -118205 -312576 -57030 133287 -91973
12548E2094i4987H4484b01713e3274A34235J56668j22364a00477J6479E4881J01047
12537A55928o0382f3089B77704a6780j52921B1097i5380A65529J09260A15521
12526C09810E4332K37700m4615a69473j92060A64104a22807A1832a8674B03954
12515G4167a32193E5242d9429E72566a12096p4006K9101A63674a76539c7433G1258
12503b38404e3251A08000k9760f1645F541J23289e4782b6450C50704g7230r5653
12492a72883A95269P7959F762a79977j3045C91473a07386d4345D4657K5268P7576
12481A47501J29749k9130a5639G0659a57487A65226B3572d6421A04580a34331
12470e6713A52234g8082A33274a85752A23845a27840A1675g3435B04231a985A66359
$$ plain form
12548 52094 -94987 84484 -201713 -53274 134235 290903 168539 -100477 -83998 54881 155928
12537 155928 95546 -63089 277704 -16780 -169701 21097 -95380 165529 274789 115521
12526 309810 54332 292032 247417 -169473 -361533 164104 -122807 11832 -18674 203954
12515 74167 -132193 55242 -49429 572566 -112096 -186102 -157001 163674 -176539 -37433 71258
12503 -238404 -53251 108000 78240 -61645 6541 129830 -54782 -26450 350704 -77230 -172883
12492 -172883 195269 273228 6762 -179977 -193022 391473 -107386 -44345 44657 69925 147501
12481 147501 277250 248120 -15639 70659 -157487 165226 23572 -46421 104580 -134331
12470 -56713 152234 -78082 133274 -185752 123845 -127840 11675 -73435 204231 -1985 166359
12458e87q2049q8945A52768a29790C4865J18733f7357l6184b3914m3300A0133
12446A71002L7556C1963a85834L7495B62798q9007b5593C428J24554c9106B434
12434b16414f9831m022n9965N0363C0491f8223k2684A17002A0549b37014d0255
12422b27335Q5732C04408g6101C81608a63870M9555B96743j25406i8359H4686
12411A4348f8419J0394j4798E4977A828c10147C38709i0854E9987g9250j92025
12400b71275c7874A11109g3809l4704E5376g5789L1307l9826k42934a21187M9687
12389g1500l4703L7462j17539k9291A45591C2567c12061a13862N6584j12842K5079
12378a45041b4473A53894a63287A18190Q3630D4993J69205r6982e6792C28038
$$ plain form
12458 -587 -82636 -171581 152768 -129790 34865 153598 -67357 -103541 -23914 -67214 10133
12446 171002 208558 31963 -185834 -148339 262798 173791 -25593 3428 127982 -39106 2434
12434 -216414 -69831 -73853 -133818 -83455 30491 -68223 -90907 117002 10549 -237014 -40255
12422 -227335 -141603 304408 -76101 381608 -163870 -114315 296743 171337 -98359 84686
12411 14348 -68419 -58025 -72823 54977 1828 -310147 338709 -90854 59987 -79250 -271275
12400 -271275 -37874 111109 -73809 -108513 55376 -75789 -44482 -84308 -327242 -121187 -71500
12389 -71500 -106203 -68741 -186280 -215571 145591 32567 -312061 -113862 -57278 -170120 -145041
12378 -145041 -24473 153894 -163287 118190 201820 44993 214198 117216 -56792 328038
12367E3314K06680C736b5694C4561f0201C5729M63209j93085A11250B5873f0772
12355C43137d5325j5094A6954a35597e5444f278A01460a63565B37707M784h1682
12343F4157c3959j94191f634C5934b01597j9769A55892c4033D6523R7592D7396
12331A16476O9685K2510G8085R0711A0033J3867E513d43149a76822l84B32258
12319B71555m8745b86372C58022q0088b10270A72285N8208n9359a54364q0920
12309b35284f7076j54031k26238a7529k1250j2534k32671E8373a84570A58993
12298h8836l66582a05030B55733D879M15291C4508L59505G1618J87115E6130a33743
12286a33674f0749B45029h9083A41855H38b68295L6076o7937C96816a3200A34570
$$ plain form
12367 53314 259994 3736 -25694 34561 -60201 35729 498938 305853 111250 25873 -60772
12355 343137 -45325 -60419 16954 -135597 -55444 -6278 101460 -163565 237707 242491 -81682
12343 64157 -33959 -228150 -6634 35934 -201597 -221366 155892 -34033 46523 144115 47396
12331 116476 186161 208671 78085 168796 10033 23900 5513 -443149 -176822 -177206 232258
12319 271555 222810 -286372 358022 277934 -210270 172285 230493 171134 -154364 -235284
12309 -235284 -67076 -221107 -447345 -17529 -38779 -51313 -283984 58373 -184570 158993
12298 -88836 -455418 -105030 255733 4879 420170 34508 394013 71618 258733 56130 -133743
12286 -133674 -60749 245029 -89083 141855 838 -268295 -232219 -300156 396816 -13200 134570
12274C40781L231A68149K03859N0736i826I7333J87390a9084i85B52702l9145
12263B13557i5576B82250H3907B4468J38806c3048j14606e3526l9948k08278I1236
12251H4852c2723A75656j0340L22861F1090O6543M6137Q0818l051d157F140M2279
12239D8419N94589G3280f0329A47410O5211a31286A26532a18613j17152a9626
12228E32741q1611j52201i8160D05731A5848L36481j57503E0312d8113h813D86657
12216C26366n9987A16122J87344p6360B9947J97045n7174b6679m3541j02002A20650
12204C22703A38199m0153j5578L1981j6088d5565D405e5060B18925L75p5469K40907
12192C84738k6411b4067C83236j53871a23093A04266a43334E056K06991a08618
$$ plain form
12274 340781 344012 168149 372008 422744 -9826 97333 284723 -19084 -985 252702 213557
12263 213557 -95576 282250 83907 24468 163274 -33048 -147654 -53526 -93474 -301752 91236
12251 84852 -32723 175656 165316 488177 61090 127633 173770 254588 251537 -4157 6140 48419
12239 48419 643008 73280 -60329 147410 212621 -131286 126532 -118613 -235765 -19626
12228 532741 451130 298929 -98160 405731 15848 352329 194826 50312 -48113 -8813 486657
12216 326366 266379 116122 303466 227106 29947 226992 169818 -26679 -70220 -172222 120650
12204 322703 138199 98046 82468 114449 98361 -45565 4405 -55060 218925 219300 143831 384738
12192 384738 358327 -24067 383236 229365 -123093 104266 -143334 5056 212047 -108618
12181C68905h6689F9331j601G50L71674e3489H2280Q9318G3897M4312d3895o7249
12169a11144D2680J83392n0964m0642n9479F736M48837A98252r3774L56186B24164
12157A90052c8962A31231c5260B25813a17302M6331A25555g8726B4083J1042J35647
12146A70772b87405E98678a42560B78939o2216p2076J49076A36487m8249j8660
12136F9578L51361B6616g9149H0745K5438i8128k23648j13238A96929I5407E052
12124I364K10274Q9354b28517D8979d2772A28465m3649C3391P9026a10324G4537
12112A51629L3945D8992K63937A0364d5262B03989H1958a23230K4731k1880k0731
12101a41110A65568A8678a21231L4389A23271A5821M6306k6533f7310p5215B91649
$$ plain form
12181 368905 -86689 69331 67730 750 372424 -53489 82280 171598 73897 118209 -43895 -111144
12169 -111144 42680 226072 175108 134466 74987 6736 455573 198252 104478 460664 224164
12157 190052 -38962 131231 -35260 225813 -117302 -70971 125555 -78726 24083 35125 170772
12146 170772 -287405 598678 -142560 278939 216723 144647 293723 136487 88238 69578
12136 69578 420939 26616 -79149 80745 106183 -98128 -321776 -435014 196929 95407 5052
12124 9364 219638 308992 -228517 48979 -42772 128465 84816 33391 112417 -110324 74537
12112 151629 185574 48992 312929 10364 -45262 203989 81958 -123230 -98499 -120379 -141110
12101 -141110 165568 18678 -121231 -86842 123271 15821 62127 35594 -67310 -142525 291649
12089a68281B9055A1113h1777i271F9617c8429I6139l3768j6256K65830a5793
12077D6946N9915b73527A39654M87926J549157r55698B46660L27429a0505o623
12067a7128A88326a749A09707b9931j00570H5491R2754E8603P1601f5481b0855
12055E869J19650c547A50659G3009f6672l0778A11307h1114j07289f5163A7276
12043G2640a48885q775p4107o4016A03737i8045k90838L607B36072a57804j92862
12032c50666E9027M2855l7130c88221J02465e789j69869D7887j9626b98481J38469
12021a60012B01646a79929A64305c0495C9577h732n2242A56869b099B5191c26363
12009A88419K55082A5868K17122e707l70273A70451b83217A13720B678J72287
$$ plain form
12089 -168281 29055 11113 -81777 -9271 69617 -38429 96139 62371 46115 311945 -15793
12077 46946 106861 -273527 139654 627580 2176737 1221039 246660 574089 -10505 -17128
12067 -17128 188326 -1749 109707 -29931 -130501 85491 178245 58603 130204 -65481 -20855
12055 5869 125519 -3547 150659 73009 -66672 -97450 111307 -81114 -188403 -65163 17276
12043 72640 -148885 -157660 -231767 -295783 103737 -98045 -388883 -385276 236072 -157804 -350666
12032 -350666 59027 101882 64752 -388221 -285756 -5789 -175658 47887 28261 -298481 -160012
12021 -160012 201646 -179929 164305 -30495 39577 -8732 -60974 156869 -2099 25191 -326363
12009 188419 443501 15868 232990 -5707 -375980 170451 -283217 113720 2678 174965
11999A74965a42674A52421C4720a68974e3911A62580a68452r1797H4911c18968
11988e9584m2742j0382j55383A86108a14827r7954f1186b6710K021D2941a87355
11976C28659C8209a47952L9918e3928A77939n4431b33239a05148j34347a14412
11965A04621b06851K9550A77710i6187b8325B3984a37516A25499a27321A6917
11954d9463M602l17373B0652P0009b85913A78725j1770g9143H1974J17241Q6394
11943B85609r1706a58580a2758A81714f0682A51473a45086L9355A6764F575J8867
11932B5442K59472a52073k33491A66520a39472A4153J88718a35945A39178C2854
11921g0985L2751B33875g8275A71549b82070J17128B07554a3517l8515j34865
$$ plain form
11999 174965 -142674 152421 34720 -168974 -53911 162580 -168452 -260249 84911 -318968
11988 -59584 -102326 -112708 -268091 186108 -114827 -212781 -61186 -26710 -24689 42941 -187355
11976 328659 38209 -147952 -108034 -53928 177939 123508 -233239 -105148 -239495 -114412
11965 104621 -206851 -177301 177710 -96187 -28325 23984 -137516 125499 -127321 16917
11954 -49463 -44861 -362234 20652 90661 -285913 178725 166955 -79143 81974 199215 285609
11943 285609 193903 -158580 -12758 181714 -60682 151473 -145086 -105731 16764 6575 25442
11932 25442 284914 -152073 -385564 166520 -139472 14153 202871 -135945 139178 32854
11921 -70985 -38234 233875 -78275 171549 -282070 -164942 207554 -13517 -52032 -186897
11911a86897C09361a59629K6849e7785j21843a4733q1077F260J61455b11931F3762
11899A91783d06271J40025B01031a20605j73961A76312E9403c31270q9320B53812
11888b6384k60737H5951h5126G0145b1693k75944c5110m186A1454K45370a59750
11876A35352h5726B01526a23987b2194B5446L35750a83806A78876c4382A14235
11865G1792J70314B8152J77594b36093c5012A45535m7249K12023I6411a59810
11854A40357b7374I6354b65837L8645B11647C8760a43808m97361E8542B6832J18250
11843A45082h1163A40472a19642c6078B36383o5775b89205Q5897d2028B65033
11832a82909c7513H330b85059D8886L49395j34199I6928a58084p462a3541j12664
$$ plain form
11911 -186897 309361 -159629 -132780 -57785 -179628 -14733 -95810 6260 167715 -211931 63762
11899 191783 -406271 -266246 201031 -120605 -294566 176312 59403 -331270 -420590 253812
11888 -26384 -287121 85951 -85126 70145 -21693 -297637 -35110 -39296 11454 256824 -159750
11876 135352 -85726 201526 -123987 -22194 25446 361196 -183806 178876 -34382 114235
11865 71792 242106 28152 205746 -236093 -35012 145535 98286 310309 96411 -159810
11854 140357 -27374 96354 -265837 -227192 211647 38760 -143808 -641169 58542 26832 145082
11843 145082 -81163 140472 -119642 -36078 236383 170608 -289205 -203308 -42028 265033
11832 -182909 -37513 8330 -285059 48886 398281 264082 96928 -158084 -165546 -13541 -126205
11821a26205j3862l890K4050F517J83853j4186b07715A20187b838l42019F6461
11809a73863O0064A74863g0738A978K87006f7289k28145L554A7741d33366a67138
11797a10612A02409L4958a98504A48545n0965A4860L4371c7601j40792A65142
11786A25866a28501O1084j55706g930A38133J0294D0400a5095A21427H145L1987
11775D0132L25434j25021j2838n506G2721a64250N1344m9433d92l5670B7676c9713
11762b42675h7231k33791a07448A11832K5263b80912A47859e9349I1780d13548
11751C35551c54874a3505e530H1992b7900A92831M5356a98662C649b65829Q5542
11740a80287F2736C913L4612K56727j24034G8827i1423A69013f5130A06235j5844
$$ plain form
11821 -126205 -140067 -143957 -119907 6517 190370 176184 -207715 120187 -2838 -344857 66461
11809 -173863 -113799 174863 -70738 1978 288984 -67289 -295434 -291880 17741 -433366 -167138
11797 -110612 102409 137367 -198504 148545 97580 14860 49231 -37601 -178393 165142
11786 125866 -128501 -67417 -223123 -7930 138133 148427 40400 -15095 121427 8145 40132
11775 40132 365566 240545 227707 222201 72721 -164250 -112906 -162339 -492 -36162 27676 -39713
11762 -242675 -87231 -321022 -107448 111832 137095 -280912 147859 -59349 91780 -413548
11751 335551 -354874 -13505 -5530 81992 -27900 192831 238187 -198662 3649 -265829 -180287
11740 -180287 62736 3913 38525 295252 171218 78827 -91423 169013 -65130 106235 90391
11729I0391a1165A8904g8259l4571j24789b3213B8555J12672a06295M3312f555
11717A42483d4431B41098j17583a8210C8372c56080c5964A91610q9011K56201
11707C58800A33943a82723A61757a01225j67820B78304a61855I3246J09893b78342
11696c5937B35307o5732n0789d8005J9885j14165B27368h1165A00544c00675p0881
11685c71556c7965j11750N5313A88250D4807J63988m1613a04713b3600H4711L1702
11674A16413a28269j89260P8827B14182n6050G2446k5217K35494C6518K5751K80601
11663C42870a0114B56928o2299c9490D953K0837O9643k5044L33607G5673d7050
11651B33655A5083L22214H5485b33588B74626a30626d236I9982J62068j05219
$$ plain form
11729 90391 -11165 18904 -78259 -112830 -237619 -23213 28555 141227 -106295 -62983 -6555
11717 142483 -44431 241098 123515 -18210 38372 -356080 -35964 191610 102599 358800
11707 358800 133943 -182723 161757 -101225 -269045 278304 -161855 93246 203139 -278342
11696 -35937 235307 169575 118786 -48005 -28120 -142285 227368 -81165 100544 -300675 -371556
11685 -371556 -37965 -149715 -94402 188250 44807 208795 167182 -104713 -23600 84711 116413
11674 116413 -128269 -317529 -238702 214182 158132 72446 47229 282723 36518 62269 342870
11663 342870 -10114 256928 194629 -39490 4953 25790 95433 70389 403996 75673 -47050
11651 233655 15083 337297 85485 -233588 274626 -130626 -4236 99982 262050 156831
11641A56831K12031j64665a51793a6157j53025A28757K4875b07807j14148a21654
11630C36720h5643C88073b81818e0552j93840A50390N0714M9190G2573j6549L39402
11619C95426A58829a1041q3690A0900P9564A6619a83856A19448n3917b7610B8276
11607h4326j54370b3993n2971A61197G6812K2377b96620F3161b9616B45590B6970
11595B8239K21112F3860i953A08915K7597k9790r702K01958a9535B9653J94748
11584B24401M7748m0075F5889K7803l7848f0968B46026m7644M052E6145P6502
11573A32647o6289h4A82748G6398B5964J80266D7065J31624d74670B16562H5678
11561H102M9642f4568n900C45320b25022r0527B44727h9910i708A12243L4330
$$ plain form
11641 156831 368862 204197 -151793 -16157 -169182 128757 153632 -207807 -321955 -121654
11630 336720 -85643 388073 -281818 -50552 -244392 150390 201104 250294 72573 56024 395426
11619 395426 158829 -11041 -94731 10900 90464 16619 -183856 119448 65531 -27610 28276
11607 -84326 -238696 -23993 -76964 161197 76812 99189 -296620 63161 -29616 245590 26970
11595 28239 249351 63860 -9953 108915 136512 106722 97020 298978 -19535 29653 224401
11584 224401 272149 232074 65889 93692 55844 -60968 246026 198382 202434 56145 132647
11573 132647 66358 -84 182748 76398 25964 206230 47065 178689 -474670 216562 85678
11561 8102 57744 -64568 -70468 345320 -225022 -315549 244727 -89910 -9708 112243 146573
11550A46573J07782F2111F840J12811a07283j39851A66672k4532K27082g0246
11539C4748J83523H4507A7593b31604C51564A74251b18138A26847B8982L22485
11529C51467E9053k1943J46289g1096A30236l4202b98860A71734p0231J5688A4246
11517i937E0402M12445B28277k7276M9148j18559J42742m77j15977c22301A55696
11505C29205g9784D38074F8932R0417e6602I4263K1403b30021P8274F1691L84826
11494D46517j66419J0435E5463Q2133g2186C23971b23208D6988K11214A05219
11483D16772B1628K31805A15954k2479J95108J70989I9631E866M8767L36264E7863
11471c9912B95404g4517b1148N243g647o9115H7554M2447F3006K69944a43591
$$ plain form
11550 146573 254355 62111 6840 119651 -107283 -247134 166672 142140 369222 -70246
11539 34748 218271 84507 17593 -231604 351564 174251 -218138 126847 28982 351467
11529 351467 59053 37110 183399 -71096 130236 96034 -298860 171734 101503 117191 14246
11517 -9937 50402 462847 228277 201001 250149 131590 274332 273855 157878 -322301 155696
11505 329205 -79784 438074 68932 159349 -56602 94263 115666 -230021 -151747 61691 446517
11494 446517 280098 290533 55463 137596 -72186 323971 -223208 46988 258202 105219
11483 416772 21628 253433 115954 93475 288583 459572 99631 5866 54633 390897 57863
11471 -39912 295404 -74517 -21148 -15905 -7647 -76762 87554 130001 63006 332950 -143591
11459E06365c64522c5961D85449b5928B34166I4785k6571c20083A24980K40130
11449C65110A21139g2841B59388F4202K55430f9756G362N6819L6641b01222D23311
11437E3531K99658a38126C81064K2305A03013q756J4379b46281B60352a62017
11426C4431J30812b11878h4751B90833g8797F0980J9418a8783C51033b01237C1173
11414e6211B82663G7298a83007O1526I9524a20463p586j18230H7864h7172A04182
11402b22199A84638f6041J2869A63620m9843a0959C26925b5296C11821c8182A30022
11390D5184a82087H9904a30748A57731a24635l974A7384a34853A90718n8688e6843
11378d7909B463a19646R800J8720j87924C1800K0725e59j22565d2191R407A04806
$$ plain form
11459 506365 -364522 -35961 485449 -25928 234166 94785 68214 -320083 124980 365110
11449 365110 121139 -72841 259388 64202 319632 -69756 7362 64181 100822 -201222 423311
11437 53531 353189 -138126 381064 403369 103013 94257 108636 -246281 260352 -162017
11426 34431 165243 -211878 -84751 290833 -78797 60980 80398 -18783 351033 -201237 31173
11414 -56211 282663 77298 -183007 -121481 99524 -120463 -128049 -246279 87864 -87172 104182
11402 -222199 184638 -66041 -53172 163620 113777 -10959 326925 -25296 311821 -38182 130022
11390 45184 -182087 89904 -130748 157731 -124635 -128609 17384 -134853 190718 132030 -56843
11378 -47909 2463 -119646 -109846 -91126 -279050 31800 52525 -559 -123124 -42191 -32784 104806
11365A92793L0370q1612b20980F8795B2286c83301B5575a82p9230A16474n4605
11354F1869b1059m4488j0231a7747B35003A5855J07417J34064a5898B74746G7167
11342A07885c9144C52438C0576f8117A4253e4272C11808h3190j41810l1484D51400
11330a66900A77101D4809O1457D4679J18558J88893b4768I0680h8505A41592K616
11319A44208D6631G593g7056l61210a66565j01544K0997A03556n1652J27524C3453
11307b67892d7784p6073b991A124a83376g283j18934A51809f8834I04b99968H8883
11294b45010A62363C5149K24579b75200j25651D3276J15060D1339b52013n8356
11284c10369J41657B9783h2743f939B8172a23601C15650o2351G1035b03705i9380
$$ plain form
11365 192793 223163 141551 -220980 68795 22286 -383301 25575 -182 -79412 116474 61869
11354 61869 -21059 -65547 -75778 -17747 235003 15855 123272 257336 -15898 274746 77167
11342 107885 -39144 352438 30576 -68117 14253 -54272 311808 -83190 -225000 -256484 451400
11330 -166900 177101 44809 106266 44679 163237 352130 -24768 90680 -88505 141592 144208
11319 144208 46631 7593 -77056 -438266 -166565 -268109 -247112 103556 51904 179428 33453
11307 -267892 -47784 -123857 -2991 1124 -183376 -7283 -126217 151809 -68834 904 -299968 88883
11294 -245010 162363 35149 259728 -275200 -400851 43276 158336 41339 -252013 -310369
11284 -310369 -168712 29783 -82743 -6939 28172 -123601 315650 253299 71035 -203705 -99380
11272a38082N9971p6677c7197H5766b65593A09196b46637Q4604n1837l5669I5606
11260A35815e9049A07178J1021b6398a290j30451A34004J97056B0412J21174b021
11248F8425d02707E7064a21307e9572B14601b21311f1396C1462K04621j2306b84610
11236b1534j9655H3363g7529c1085r3195A2264h9104F4276f2755p4286p5727L28
11224b12440A27025M1272a8692M424C6751b5917j71021d0433l26966E1584Q5906
11213A37490D2897a70540A17478C6617a69848l0273D2397a02371A09812b05444
11202H9754b04327G8998a56405j37430E9944D124c13157D0456a69319d1983l35276
11191c77259D20878j81124q0110d1938F8274a3073p5832I0866m4558a1790k87275
$$ plain form
11272 -138082 -78111 -154788 -37197 85766 -265593 109196 -246637 -162033 -213870 -249539 95606
11260 135815 -59049 107178 118199 -26398 -1290 -131741 134004 331060 20412 141586 -2021
11248 68425 -402707 57064 -121307 -59572 214601 -221311 -61396 31462 236083 223777 -284610
11236 -21534 -41189 83363 -77529 -31085 -124280 12264 -89104 64276 -62755 -137041 -212768 -212440
11224 -212440 127025 168297 -18692 -14268 36751 -25917 -196938 -40433 -367399 51584 137490
11213 137490 42897 -170540 117478 36617 -169848 -200121 42397 -102371 109812 -205444
11202 89754 -204327 78998 -156405 -293835 59944 4124 -313157 40456 -169319 -41983 -377259
11191 -377259 420878 239754 159644 -41938 68274 -13073 -88905 90866 46308 -11790 -299065
11180b99065J42284p8618a9659C13044a43850C8665a13489n25157b32691b3560
11169e8418m087l75970a46233A882K23119j00597I669c18981a13390o2438A41816
11157d643B18195q5693l3178b71400A09118a95766B38548a46773A5498O8717a64403
11145E715K29981J00471g8797E921c07984A63369J21193h8262C0169c72392B49300
11133C31672H0588J94157c91785D698b01024A09553e1951j93093B80661a02469
11122D18552k06765E6383J6276h9601n8900L5348a4165D9705P3576J30329a08987
11110B90373G1023N108J28785b0965B5795f9839B43928G5301O3528a21289J2768
11099a08521q3339B46409J46656R400a16428A41021g1418A91163K68340A84674
$$ plain form
11180 -299065 -156781 -235399 -19659 313044 -143850 38665 -113489 -638646 -232691 -23560
11169 -58418 -62505 -438475 -146233 1882 225001 124404 9669 -318981 -113390 -175828 141816
11157 -4643 218195 132502 99324 -271400 109118 -195766 238548 -146773 15498 84215 -164403
11145 5715 235696 336167 -78797 5921 -307984 163369 284562 -88262 30169 -372392 249300
11133 331672 80588 274745 -391785 4698 -201024 109553 -51951 -245044 280661 -102469
11122 418552 211787 56383 72659 -89601 -148501 -113153 -14165 49705 123281 253610 -108987
11110 290373 71023 76131 204916 -20965 25795 -69839 243928 75301 138829 -121289 -108521
11099 -108521 -191860 246409 393065 402465 -116428 141021 -71418 191163 459503 184674
11088C19847J9503j24629a27376C08650o3977k9136J92046J18203A02512J11128
11078B13640l7282J32670J8689a4077l6636b2492B47604l5933m6479G0505J51793
11067B22298M04934A97981Q9297M050O112K21252d7982C81234N4998L49415k03795
11056E81852J01302A30180L47722P737A99514M91092j85283L04576j16022k50051
11046D43826J3203o8951K32228m263j57843K22151J04462k60032L86402k94795
11036F16388p5807m7695L19037L2603C08042N68599K05741j14014j6552l97518
11026E54298K61038J86905J3638l81766J23788K0480m1474K1273L7243J17089
11016I12512k20797j27897P1332K95607l03871j31097L9780j23627L35641j03009
$$ plain form
11088 319847 339350 214721 -127376 308650 244673 215537 407583 525786 102512 213640
11078 213640 176358 309028 327717 -14077 -50713 -22492 247604 211671 165192 70505 222298
11067 222298 627232 197981 287278 291328 297440 518692 -47982 381234 436232 785647 581852
11056 581852 683154 130180 477902 485639 199514 690606 505323 809899 693877 443826
11046 443826 457029 388078 620306 616043 458200 680351 784813 524781 911183 616388
11036 616388 540581 492886 811923 844526 308042 876641 1082382 968368 951816 554298
11026 554298 815336 1002241 1015879 634113 757901 778381 736907 758180 795423 912512
11016 912512 691715 563818 635150 930757 626886 495789 535569 411942 747583 644574
11006F44574j48340J4135R3600p264j39319J90584K57615k17464q6282J55477
10996G57316K99856m29627J20439P2971M8164D32384J93486L16311L88634k22471
10986A108344k17022O9323J19874l4938K48437j4682m6237L00055l32864J80832
10976A381122K40757K75565L46832M15879j22122M19644N6068k55832j63749k0353
10966B573811k32411j38446k12057j36891P7893j24363K03747J7980M11373o87674
10956A752962J91752j97899J5969j27872j05722p28250Q7738k75627K71676q1553
10946H03174l34436J12012l346G5951L65198C706J74307a068C22108k3799Q0704
10935C79013r9934o4362C8968K02801c09680D57734E5302i3161j65413H6364J83476
$$ plain form
11006 644574 496234 510369 603969 596705 457386 647970 905585 688121 601839 757316
10996 757316 1057172 627545 747984 820955 869119 432384 625870 942181 1330815 1108344
10986 1108344 891322 960645 1080519 1045581 1294018 1279336 1233099 1533154 1200290 1381122
10976 1381122 1621879 1897444 2244276 2660155 2538033 2957677 3013745 2757913 2594164 2573811
10966 2573811 2341400 2202954 1990897 1854006 1931899 1807536 2011283 2029263 2440636 1752962
10956 1752962 1944714 1746815 1762784 1634912 1529190 800940 888678 613051 884727 803174
10946 803174 468738 580750 577404 75951 441149 3706 178013 -1068 322108 298309 379013
10935 379013 279079 214717 38968 241769 -309680 457734 55302 -93161 -258574 86364 269840
10924B69840q8065h3183b6793j54328B47885i1830b8319L524B196O7832d6980
10912A35521L8333B1653f0031A09234c2951H5913j9559K0364l995c5255l8873
10901g4128F6999K04604C043J25287a72907A22059J13871H4733a31216D7975a37737
10889a05070j45963j40471C3671g4234k72083A9516J4116Q5686i7739j66947J23271
10878a41415q6004N6078j3989K9182f7765k442J1061k29611R5923Q5192d6427
10866C2663a16819A97898a56536A12215J52152r9547k5447a47072j03176I0820
10855c268p5641H9425K48760a49924P0743A64211A9443e6277d222j26559A80784
10843a92646f4189F3222J15381F5695J77008A18387K1346b84222D5835a28866
$$ plain form
10924 269840 181775 -83183 -26793 -181121 247885 -91830 -28319 -24795 2196 70028 -46980
10912 135521 173854 21653 -60031 109234 -32951 85913 66354 86718 82723 -35255 -74128
10901 -74128 66999 271603 3043 128330 -172907 122059 235930 84733 -131216 47975 -137737
10889 -105070 -251033 -391504 33671 -74234 -346317 19516 33632 119318 -97739 -264686 -141415
10878 -141415 -227419 -171341 -185330 -156148 -67765 -70207 -59146 -288757 -192834 -107642 -46427
10866 32663 -116819 197898 -156536 112215 264367 164820 139373 -147072 -250248 90820
10855 -3268 -78909 89425 338185 -149924 -79181 164211 19443 -56277 -4222 -130781 180784
10843 -192646 -64189 63222 178603 65695 242703 118387 139733 -284222 45835 -128866
10832f9636A73937a18657a4658C99331a77110O5264j32770F9454E260a75119B42130
10820A06820a38029E4743P0093b55671l8852f0893k44645f5536k07087A57043
10809A426J28376M5038d634I5928a61675E7555J13496a67760j40732P1624k07269
10798d44137a28773j14559G8077N2265e02299B04202b99889L6662a26077H0192
10787b57399c7035a2463n5153E6983L2749j8159j4370J26183d9403A52738L5720
10776A88458A6631a06950A8970J89157f0320G7438B7250e9191I3463b9307j7171
10765d6478k9045m5630j85490c1182m32981K23090b7088A26404a76220m2520H8598
10753b51164E102d4041B70896a9249j14096M6885A1850c16996B2377O814a72024
$$ plain form
10832 -69636 173937 -118657 -14658 399331 -177110 -111846 -244616 69454 5260 -175119 242130
10820 106820 -138029 54743 124836 -255671 -294523 -60893 -305538 -65536 -272623 157043
10809 1426 129802 174840 -4634 95928 -161675 57555 171051 -167760 -308492 -236868 -444137
10798 -444137 -128773 -243332 78077 130342 -502299 204202 -299889 -263227 -126077 80192
10787 -257399 -37035 -12463 -67616 56983 89732 71573 57203 183386 -49403 152738 188458
10776 188458 16631 -106950 18970 208127 -60320 77438 27250 -59191 93463 -29307 -46478
10765 -46478 -75523 -121153 -306643 -31182 -464163 -241073 -27088 126404 -176220 -218740 88598
10753 -251164 5102 -44041 270896 -19249 -133345 -86460 11850 -316996 22377 29191 -172024
10741f3704H1476C190a89366f5404b2578k16705n8193i7774A86809g0693B48161
10729F858b94924A2716O0341a04459l4170j20556f6908P703k15505i2634l2769
10718a25403C7568b1527j18515E7155L28557H3754l437d45816I5553b15176R4198
10707a20978j4639A00077K1928C9327c89470I5703J03363a69306E1440b68534
10696a39118n4075A31980l5809J9702J96934b44228C6930I150J30654c80937A61843
10684a03672a8612j21176B1955R322A4720J83133o3621a03181M8616J8116r2914
10673a29363E635f8367j03922j6942R4445d3523i598A39235g6902B85784j04752
10662A81032P5684p9860c9414j04293J401B5248b03424Q9245j02621H4611L6798
$$ plain form
10741 -63704 81476 3190 -189366 -65404 -22578 -239283 -297476 -97774 186809 -70693 248161
10729 6858 -294924 12716 73057 -104459 -138629 -259185 -66908 -59205 -274710 -92634 -125403
10718 -125403 37568 -21527 -140042 57155 385712 83754 80317 -445816 95553 -215176 -120978
10707 -120978 -135617 100077 122005 39327 -389470 95703 199066 -169306 51440 -268534
10696 -139118 -193193 131980 96171 115873 312807 -244228 36930 9150 139804 -380937 161843
10684 -103672 -18612 -139788 21955 31277 14720 197853 134232 -103181 -54565 -36449 -129363
10673 -129363 5635 -68367 -172289 -189231 -94786 -43523 -9598 139235 -76902 285784 181032
10662 181032 256716 176856 -39414 -143707 -142306 25248 -203424 -114179 -216800 84611 121409
10651A21409J6111a60478J9684B95386b50795j6127F6651c44468a67606e0022
10640B5665f9119j01322f2743I7125e4781j13560n8582P6119P2111r2457k17019
10629c88169a03481j74324f5035A59721E8383a3258B41159b3387k9256I7497D4487
10617e9347l3118A70197f1739k31458I9302a11476f607n7611B05594K5782a74988
10605b36475p546A87681a5874j1545p056C1500a6350F8183B2872a04003A73821
10593a85921A81594d0705B80964g7456l1280k16490E5447J53318b30583B46527
10582a8677J725P374F6636R6145d62476d0107I6081b19487Q5690l8835A4262a41793
10569E332d44724a84884n2358A64284a58719j24984A41362a83177l7830A3117
$$ plain form
10651 121409 137520 -160478 -140794 295386 -250795 -266922 66651 -344468 -167606 -50022
10640 25665 -69119 -170441 -62743 97125 -54781 -168341 -226923 -150804 -78693 -171150 -388169
10629 -388169 -103481 -277805 -65035 159721 58383 -13258 241159 -23387 -52643 97497 44487
10617 -59347 -92465 170197 -61739 -293197 99302 -111476 -6607 -64218 205594 231376 -174988
10605 -236475 -244021 187681 -15874 -27419 -34475 31500 -16350 68183 22872 -104003 173821
10593 -185921 181594 -40705 280964 -77456 -108736 -325226 55447 208765 -230583 246527
10582 -18677 -16952 -9578 66636 162781 -462476 -40107 96081 -219487 -133797 -172632 14262 -141793
10569 5332 -444724 -184884 -237242 164284 -158719 -283703 141362 -183177 -221007 13117
10558a40894C1808b9569o8551C01526b06011A41044j2298R7327B7449M0869d3222
10546A82197f0996A2128g7324j5973M3851A19837O5422a35217F4886J11882a5784
10534e3571a9799j25697j7000G0644h8412I3394i6286J2076A52958A7858g1794
10522a63163E7524J5035K06203c4752O200m3045k7604A27774a38444L7430A81135
10510A70432C9674a61786F5466b58011c9246j44744B57777a76208l60093F374
10499a15194B11888n1781b19801A44989g9729j08652A06057i4623E4202a77187
10488e7980E33370A8041b5762j43157j94862d3715D48909j45985P4720j51612
10478B26032J12081J10195k05516b18535a3590k4493C82845a39005J1377d8981
$$ plain form
10558 -140894 31808 -29569 -98120 301526 -206011 141044 128746 226073 27449 68318 -43222
10546 182197 -60996 12128 -77324 -93297 -49446 119837 185259 -135217 64886 176768 -15784
10534 -53571 -19799 -145496 -162496 70644 -88412 93394 -96286 -84210 152958 17858 -71794
10522 -163163 57524 72559 278762 -34752 -28552 -71597 -99201 127774 -138444 -101014 181135
10510 170432 39674 -161786 65466 -258011 -39246 -183990 257777 -176208 -536301 6374
10499 -115194 211888 160107 -219801 144989 -79729 -188381 106057 -94623 54202 -177187
10488 -57980 533370 18041 -25762 -168919 -363781 -43715 448909 302924 377644 226032
10478 226032 338113 448308 242792 -218535 -13590 -38083 382845 -139005 -127628 -48981
10467b32416a12460A94722O235q5053J04481a29320l8634R437j48698B3806J49010
10456A72816d6488B29709i6707d5135q9563A67934c42978C56157j13292i0721
10445C3462d16796A1819J45589O6578r3971f691A68508a4728E9574a2908A33422
10433a04549j65479g4024B65240B9828M7889g9213K5260m4043A8804b74065A23524
10421G3048c41719H9342C7817b45313B7233b83394C10326E2385J70736a6627l8767
10410e5394A79754a4563j91592H1714i2978o939A13556D8194a52085c1232q9649
10399a20881L1071m6512B1376Q7947J58585n2920q125c39360B42127b9995F8346
10387B8633a78085C37319A5901L9712K1165b53088J6721a7146B62756G3862J25096
$$ plain form
10467 -232416 -112460 194722 200957 115904 220385 -129320 -167954 -158517 -307215 23806 172816
10456 172816 -46488 229709 -96707 -45135 -134698 167934 -342978 356157 242865 -90721
10445 33462 -416796 11819 157408 223986 130015 -6691 168508 -14728 59574 -12908 133422
10433 -104549 -270028 -74024 265240 29828 77717 -79213 -53953 -97996 18804 -274065 123524
10421 73048 -341719 89342 37817 -245313 27233 -283394 310326 52385 223121 -16627 -55394
10410 -55394 179754 -14563 -206155 81714 -92978 -99917 113556 48194 -152085 -31232 -120881
10399 -120881 -89810 -136322 21376 109323 267908 214988 206863 -339360 242127 -29995 68346
10387 28633 -178085 337319 15901 55613 76778 -253088 -236367 -17146 262756 73862 198958
10376A98958q0771K31307A41172a3707B9459N21881j96212j41598M1181J2589
10366B67300L1752O8454m4021r9554J39557A37540g0647B50210Q8596c8569H7868
10354D71554B7897i6716A68277K48833O1241K19321k52066e1663I1448K30971
10344C22419L12168B68796j11444K60652j57175L8228A12417l8220K34046a51866
10333C72804b1618D0486f0837A53200D7040J33172N1343n337r4528J91226A07769
10321E5651Q901K31097f1543A14112P3749J55801b8704A98612e2502B97031J08688
10310D05719I7464K08986e8721j95913A4414L6894J35448n7991b2968B70876m2077
10299B28799p0696a16354A55171b89146H5788a19648A12037d67593a67787B06057
$$ plain form
10376 198958 118187 349494 141172 -13707 29459 551340 355128 213530 254711 267300
10366 267300 299052 367506 323485 223931 363488 137540 -70647 250210 338806 -38569 87868
10354 471554 27897 -96716 168277 417110 478351 697672 445606 -51663 91448 322419
10344 322419 634587 268796 157352 418004 260829 299057 112417 74197 308243 -151866
10333 372804 -21618 40486 -60837 153200 47040 180212 231555 226218 131690 322916 107769
10321 55651 64552 295649 -61543 114112 187861 343662 -28704 198612 -52502 297031 405719
10310 405719 97464 306450 -58721 -254634 14414 51308 186756 128765 -22968 270876 228799
10299 228799 158103 -116354 155171 -289146 85788 -119648 112037 -467593 -167787 206057
10288b0097A05075i4092o7927A42354b11859g6401A91786C3598K2074c74425D7190
10276B90199f3355j09073C3847M2565h4553B3151M0725a74890L3271b9212B07879
10264F1004Q2252D4026e0415B77693A23468J49353J11511K1689k7599A62867J24735
10253B87602G3818K99197A54967h2309C4725b12881B09920b9716j45450j628B21476
10241B6695f4519n2854A00429l6184K83680j23851a09502J91j85941A16597a89333
10229h8393I9914a86188A58856g0365j94478k3658R1866l4874F8076Q996r316
10218F7756c09029J47623P1913K7057B95375n0132H4126i3997j55183J11918j877
10207a39139C08077g1647K9499q1386B06160a72658q431q0819b2131o9777p1965
$$ plain form
10288 -20097 105075 -94092 -162019 142354 -211859 -76401 191786 33598 55672 -374425 47190
10276 290199 -63355 -172428 33847 76412 -84553 23151 63876 -174890 -141619 -29212 207879
10264 61004 143256 44026 -50415 277693 123468 272821 384332 406021 378422 162867 287602
10253 287602 73818 373015 154967 -82309 34725 -212881 209920 -29716 -175166 -176794 221476
10241 26695 -64519 -117373 100429 64245 347925 224074 -109502 -109311 -295252 116597 -189333
10229 -88393 99914 -186188 158856 -70365 -264843 -288501 -196635 -231509 68076 77072 67756
10218 67756 -309029 -161406 -89493 -62436 295375 245243 84126 -93997 -249180 -137262 -139139
10207 -139139 308077 -71647 -42148 -123534 206160 -172658 -181089 -261908 -22131 -91908 -163873
10196a63873C3108a26767j739B08706b88441d3596j31253E2056b51169H1260c9527
10184a64006j75318L6922k0621a7801C27781b51625B3838J18025h99n1100C1982
10172A0388e9383A61555c26056B57043b60853A92614J70884g7167D6775a63702
10161a45717o710q1122A80199a9214p8532C9857K6047f3632f362k99193p768a49400
10148a76968j90159c1599B59539D4631b86000A22817E8402a25767k31499A52958
10137c6896A8307b61586P92A9659J00812h9679j43397A13247a82316k50835A80851
10125A12238b06826B51990a3802k9130q244C74780B6145a938B07869b74980e8969
10113b47707Q1643A06653i2985l02538J57767B61831j11657b62009q71h7689K4497
$$ plain form
10196 -163873 33108 -126767 -128506 208706 -288441 -43596 -174849 52056 -251169 81260 -39527
10184 -164006 -339324 -302402 -323023 -17801 327781 -251625 23838 141863 -899 -51999 31982
10172 10388 -59383 161555 -326056 257043 -260853 192614 363498 -77167 46775 -163702
10161 -145717 -152427 -233549 180199 -19214 -97746 39857 65904 -63632 -6362 -305555 -313323 -149400
10148 -176968 -367127 -31599 259539 44631 -286000 122817 58402 -125767 -357266 152958
10137 -36896 18307 -261586 -260794 19659 120471 -89679 -233076 113247 -182316 -433151 180851
10125 112238 -206826 251990 -13802 -42932 -51176 374780 26145 -1938 207869 -274980 -58969
10113 -247707 -166064 106653 -92985 -395523 -237756 261831 150174 -262009 -262880 -87689 -63192
10102f3192k71841a43437j0430P5887m2966m81B50484n523c81702F7259q305a04531
10089a79816K9957k65498e209j95730O2950L2714j23266g3169A59384a32773A95386
10077e9800j5718r9542k9216H9081J73289A30157b6502o6552H4321D212i3690
10065a24236j88767H5383c7923j13729a7347k29994J05821A85924d3385A05065
10054D9774K7200L0156a02452b4702A4465O9513b53915j07928J4712G4678b03784
10042g2086E3464K3782K73695j08483a47623j39384B98443A05841c96624b5502
10031A18414J34398E449a2892A13027h7455k00972P7013e2142A34087j8488c5148
10019D1669b15874M7985A60527O3350b281A48028a3270A07732c39744a25883E3310
$$ plain form
10102 -63192 -335033 -143437 -153867 -77980 -120946 -121427 250484 244961 -381702 67259 58954 -104531
10089 -179816 -149859 -415357 -5209 -200939 -137989 -105275 -228541 -73169 159384 -132773 195386
10077 -59800 -75518 -175060 -204276 89081 262370 130157 -26502 -93054 84321 4212 -93690
10065 -124236 -313003 85383 -37923 -151652 -17347 -247341 -141520 185924 -43385 105065
10054 49774 76974 107130 -102452 -24702 14465 83978 -253915 -361843 -347131 74678 -203784
10042 -72086 53464 77246 350941 242458 -147623 -287007 298443 105841 -396624 -25502
10031 118414 252812 5449 -12892 113027 -87455 -288427 -211414 -52142 134087 115599 -35148
10019 41669 -215874 -167889 160527 223877 -2281 148028 -13270 107732 -339744 -125883 53310
10007d67850a46575N1683b3592F2888J09277b23595d5346j41093L7248k12036
9997c61227f1893a2695G3311M2689a95451A91655a55324A66218a5141l7930A37035
9985b86868a37070M9180k49730a18053j12709j6456P8198L7665F3437g8727A8058
9973d2652B26149b6754J3189A18519P1859m0768a16933N5882m28796F0581k1437
9962C9144f0582A18683d8168A30672g9059E9950b56190D4334a20769M306A12992
9950b6164A20475G493J44700G0467a30824j69533J5002M3937g9774j88796f2889
9938a69751B46802d3478L479j50228d7910C246J33347i0909k56668c8338j09038
9927a47376q8151k3854J29190j9135A25142m9244l1717b66623e7738n0110j08755
$$ plain form
10007 -467850 -146575 -94892 -23592 62888 172165 -223595 -45346 -186439 -149191 -361227
9997 -361227 -61893 -12695 73311 116000 -195451 191655 -155324 166218 -15141 -53071 137035
9985 -286868 -137070 -87890 -337620 -118053 -230762 -247218 -169020 -131355 63437 -78727 18058
9973 -42652 226149 -26754 -13565 118519 190378 149610 -116933 -61051 -489847 60581 39144
9962 39144 -60582 118683 -48168 130672 -79059 59950 -256190 44334 -120769 -116463 112992
9950 -26164 120475 7493 152193 70467 -130824 -300357 -285355 -241418 -79774 -268570 -62889
9938 -169751 246802 -43478 -39999 -190227 -47910 3246 136593 -90909 -347577 -38338 -147376
9927 -147376 -235527 -259381 -130191 -149326 125142 75898 44181 -266623 -57738 -107848 -216603
9916b16603A23801A6640f1829k5941C390i2402G5542b27619j7950J18872r5839
9905b22536O551I5876b18601n2839p5000F0299a40102A57578d1547l53439A51076
9893C0275d678j70934B9427J1990j7180c62539J08162A93826a34429j40482H3352
9881g7459L3410j29594B36885I4140d7996F667d8603k92749M7327g6098c6312
9869C00680D6107c72673J49305A57440l2917b25613A63602N7707f5417j75034
9859b40451H3447c7326k6983C731a40859a0264A5609c9996j25447C09315e1409
9847e9318I9948b51127F9204A7116a22789m8548f7091j52594A63029b70456B8406
9835a06572l5717N6509j68889N0839i6730C8662h5865A31954a40259E13739a85283
$$ plain form
9916 -216603 123801 16640 -61829 -87770 3390 -92402 75542 -227619 -245569 -126697 -222536
9905 -222536 -215985 95876 -218601 -271440 -346440 60299 -140102 157578 -41547 -394986 151076
9893 30275 -4678 -175612 29427 41417 24237 -362539 -254377 193826 -134429 -274911 83352
9881 -77459 -44049 -173643 236885 94140 -47996 6667 -48603 -341352 -294025 -76098 -36312
9869 300680 46107 -372673 -223368 157440 124523 -225613 163602 221309 -65417 -240451
9859 -240451 83447 -37326 -64309 3731 -140859 -10264 15609 -39996 -165443 309315 -51409
9847 -59318 99948 -251127 69204 17116 -122789 -171337 -67091 -219685 163029 -270456 28406
9835 -106572 -142289 -85780 -254669 -203830 -96730 38662 -85865 131954 -140259 513739 -185283
9823B3251J12938c41979f6521A0606O9547e9512K4485E5460b97168A04134J53837
9812B57971a58249j48397G8655K6964a4128E40R0237P9293l7434d20610j0893
9801d31503a54202k40990c3880j46720L4047O9738C8224b17178g0502l1024d0067
9789a92990e3590J4374k57377G8206g8423K9586B71000A30704d5741j56483e2486
9777c44200a44119f5236C14811a2747j88644B68664h0705k18763R1466k0518C06239
9765c7563l6241H050O9087d52749d1881J34j92532A65404a21741B1278b39677
9753D35538b09303A5636b13357j04273D3047g2145A21529J19859c8379j56810
9743a95189Q3294n8423d6510k31313a06255j00751N3594k6637B99994c01682I3452
$$ plain form
9823 23251 136189 -341979 -66521 10606 80153 -59512 -35027 55460 -297168 104134 257971
9812 257971 -158249 -306646 78655 105619 -14128 540 90777 170070 132636 -420610 -431503
9801 -431503 -154202 -395192 -33880 -180600 -146553 -76815 38224 -217178 -70502 -101526 -40067
9789 -192990 -53590 -39216 -296593 78206 -78423 -48837 271000 130704 -45741 -202224 -52486
9777 -344200 -144119 -65236 314811 -12747 -201391 268664 -80705 -299468 -208002 -228520 306239
9765 -37563 -73804 8050 77137 -452749 -41881 -41747 -234279 165404 -121741 21278 -239677
9753 435538 -209303 15636 -213357 -317630 43047 -72145 121529 241388 -38379 -195189
9743 -195189 -111895 -170318 -46510 -277823 -106255 -207006 -153412 -180049 299994 -301682 93452
9731d3074B43145H617e8142J6286n0133E3319j2672J5128a54738j41827R967A22320
9718b29047e0933j18618N7105F3605a10503A51203F4232K0212k9429a18281k19690
9707c37971a03507N1672H1965k0768J72979F2665c34306R9079d6669A51082c1505
9695b37846J09533C03997A28497b90838m8905a52243A30328r529a8771k3364O696
9684c5439d768A60090b43936A3708n861F65b13315e5941H9686b17891N0820B25608
9671G7729O0644H91b66772M7640J1106Q465k48480f840j3342k20905N4511D9269
9658b06005i8862m20296A44921h532l3493B13638a10687A66558l4635c4031A14513
9646a79131j20071G5657N2159a16027e6964k9241d0592j91007J3448M6731h2924
$$ plain form
9731 -43074 243145 8617 -58142 -41856 -91989 53319 40647 55775 -154738 -296565 -286598 122320
9718 -229047 -50933 -169551 -112446 63605 -110503 151203 64232 84444 55015 -118281 -337971
9707 -337971 -103507 -51835 81965 61197 234176 62665 -334306 -235227 -46669 151082 -31505
9695 -237846 -128313 303997 128497 -290838 -339743 -152243 130328 120799 -18771 -42135 -35439
9684 -35439 -4768 160090 -243936 13708 7847 665 -213315 -55941 89686 -217891 -167071 225608
9671 77729 138373 891 -266772 -219132 -208026 -199561 -448041 -6840 -20182 -241087 -186576 49269
9658 -206005 -98862 -519158 144921 -8532 -42025 213638 -110687 166558 131923 -34031 114513
9646 -179131 -299202 75657 127816 -116027 -56964 -86205 -40592 -231599 -218151 -171420 -82924
9634A44685b2843B82722a9379B08493d9103j11587E529c14378R4669e3526k23674
9623b77200a05479M7082L091k51555F1618D512J37274G699L5879a71047f2680
9611c15662e3104j77673i4258j76000M5840j46929J05471j21633B37212b6346
9600a17931p1435A84182a30381l03934a89459M4551A53541b20145j23723f5166
9589b89439F7969L66425e0140C87003A07832b58031G6157B0375c73585B74376
9578A44052a60340c153m6941l15665h4119B2060J32460a1152k29706d5355O051
9567c9304A9856d67044f0789p6384r8004A51806b7780J1182B17840P7356d859
9555h3525A09361b1212H0455B5937a57130A80018h3164A89866i862l17056A77727
$$ plain form
9634 144685 -22843 282722 -19379 208493 -49103 -160690 5529 -314378 -219709 -53526 -277200
9623 -277200 -105479 -58397 -55306 -306861 61618 4512 141786 7699 43578 -171047 -62680
9611 -315662 -53104 -230777 -94258 -270258 -224418 -371347 -265876 -387509 237212 -26346
9600 -117931 -189366 184182 -130381 -434315 -189459 -144908 153541 -220145 -343868 -65166
9589 -289439 67969 434394 -50140 387003 107832 -258031 76157 20375 -373585 274376
9578 144052 -160340 -3153 -50094 -365759 -84119 22060 154520 -11152 -240858 -45355 -39304
9567 -39304 19856 -467044 -60789 -137173 -235177 151806 -27780 -16598 217840 295196 -4859
9555 -83525 109361 -21212 80455 25937 -157130 180018 -83164 189866 -9862 -326918 177727
9543c31942J29716C9583L0688a00198c5591l79596P5401J10317O2056L8371G7246
9531C825N2055a29608j79173J37488B48404b37853Q4932m6715C53220a38805r3689
9520b32494a9118m3675k94467D4051L0187J4063a551j34188B72892c11432A77268
9508b00881C89589A74829a15491a408n6576E202c19004A28598a68511n9795R1294
9497a37012A49407n7240c19363e806H7813P4959f8737n0427A64311c9337A09395
9485a26191j94287h8566p1105j26232j01760J33070B37643g9882j50492m1915
9475b72289A36781B4325a33680b2835o1179Fb61944a28198q9001a5863C857P6604
9463H0461M59b59369C53892o2727a92214F5154C881a47753B7470a51350h6I854
$$ plain form
9543 -331942 -202226 39583 70271 -100198 -35591 -415187 -339786 -229469 -167413 -129042 77246
9531 3825 55880 -129608 -308781 -171293 248404 -237853 -152921 -199636 353220 -138805 -232494
9520 -232494 -19118 -62793 -357260 44051 74238 88301 -1551 -135739 272892 -311432 177268
9508 -200881 389589 174829 -115491 -1408 -57984 5202 -319004 128598 -168511 -228306 -137012
9497 -137012 149407 92167 -319363 -5806 87813 162772 -68737 -119164 164311 -39337 109395
9485 -126191 -320478 -88566 -159671 -285903 -387663 -254593 237643 -79882 -230374 -272289
9475 -272289 136781 24325 -133680 -22835 -84014 6 -261944 -128198 -217199 -15863 3857 80461
9463 80461 80920 -259369 353892 291165 -192214 65154 3881 -147753 27470 -151350 -86 9854
9450c61372a19992K1460M2483K5923A9808J83086b03744h346j06352m3457F7947
9438d8211j64879h6239o3908q193G0236a49906d2038J7499i612A89060d47218
9426B1874P2093a26837A43518c57642B53695b21265A49969b9242j92268B1611
9415A76615a07598a5024D5759J28807c13902A73305b00022A57673b34794p2122
9405c06916J39072j08264i6902B7538c13904C6081h1284l08466B778J38099d27633
9393a04888B9863f8401j02996M8744G008b39633J12266j09800b4675k28383a24123
9381a4672l1379q6452j0786q6042b5960B65157b89730a3692j95681m8200k9367
9370b86940A46790a39287o2133b9142B21006a1494j05801M553E837L03664c6589
$$ plain form
9450 -361372 -119992 -98532 -56049 -30126 19808 202894 -203744 -8346 -114698 -158155 67947
9438 -48211 -213090 -86239 -150147 -158340 70236 -149906 -42038 -24539 -9612 189060 -447218
9426 21874 93967 -126837 143518 -357642 253695 -221265 149969 -29242 -221510 21611
9415 176615 -107598 -15024 45759 174566 -313902 173305 -200022 157673 -234794 -306916
9405 -306916 -167844 -276108 -96902 27538 -313904 36081 -81284 -389750 2778 140877 -427633
9393 -104888 29863 -68401 -171397 -122653 7008 -239633 -127367 -237167 -24675 -253058 -124123
9381 -14672 -46051 -132503 -143289 -229331 -25960 265157 -289730 -13692 -209373 -257573 -286940
9370 -286940 146790 -139287 -201420 -29142 221006 -11494 -117295 -112742 5837 309501 -36589
9358A80485k0477e21919A9816P2290f8993D8552a82160d0432I1847j3084b46486
9346b95095J25123O8525i764k6983j05298k66423Q8950J05719H6604a87521L362
9335a84159j60018g4247k56485e0299k59477c8981k28525a33096F692J41472a12337
9323a51076B0928f9149N700j8003k1870c530j07513k4154N0054A53378a89721
9311E3559J8360a01117I4046a04090B0648P2907L7077a72370K2127k6531n0774
9300b27548A94723a31216k3452C01322B0091M2041c08146A36209b2757q5474F7617
9288e3708q2979D7462J42315J0195l8657c18721J23083C4708a73134G7073a34434
9276h1757j15542A52890a6303A44891c28433C22163D1628b58232I3446k9419k8502
$$ plain form
9358 180485 160008 -521919 19816 92106 -68993 48552 -182160 -40432 91847 78763 -246486
9346 -295095 -169972 -101447 -9764 -36747 -142045 -408468 -319518 -213799 86604 -187521 -184159
9335 -184159 -344177 -74247 -330732 -50299 -309776 -38981 -267506 -133096 6692 148164 -112337
9323 -151076 20928 -69149 -63449 -81452 -103322 -3530 -111043 -135197 -85143 153378 -189721
9311 53559 71919 -101117 94046 -104090 20648 93555 130632 -172370 -150243 -176774 -227548
9300 -227548 194723 -131216 -154668 301322 20091 62132 -308146 136209 -22757 -108231 67617
9288 -53708 -136687 47462 189777 199972 161315 -318721 -195638 34708 -173134 77073 -134434
9276 -81757 -197299 152890 -16303 144891 -328433 322163 41628 -258232 93446 64027 35525
9265C5525b78174O4996r6038a48065L3210j99343h2091l70389A11676i8368j54356
9254b52724E8642a0079j53785P1029A5326N3505b1495j12943I5139g1010p6568
9243a47578f1332j46044I7243a12685G6785J44899A3330b37815B6922b29143d004
9231A77303q0188O1425H882K46189K5980C8245h4295m4411C54258e0802m6138
9220i6940A16691e776l81479c1852j38496B00923m3553J94200d69270a12361e5060
9208a55042N7376j91458a37161N1366c7997k33815J17033n5424P7596r0643e7071
9196G9454l1820e9947F1707e63439b56447a8653G0950h8040B2829a11848C6299
9184a7014B3615a28913e1834E4048K7619N5507N2139a53165c3928j33263A04384
$$ plain form
9265 35525 -278174 -213178 -309216 -148065 -114855 -314198 -82091 -452480 111676 -98368 -252724
9254 -252724 58642 -10079 -163864 -92835 15326 68831 -21495 -134438 95139 -71010 -147578
9243 -147578 -61332 -207376 97243 -112685 76785 221684 13330 -237815 26922 -229143 -4004
9231 177303 97115 158540 8882 255071 281051 38245 -84295 -128706 354258 -50802 -96940
9220 -96940 116691 -5776 -387255 -31852 -170348 200923 157370 351570 -469270 -112361 -55060
9208 -155042 -97666 -289124 -137161 -85795 -37997 -271812 -154779 -210203 -132607 -223250 -57071
9196 79454 47634 -59947 61707 -563439 -256447 -18653 70950 -88040 22829 -111848 36299
9184 -17014 23615 -128913 -51834 54048 81667 137174 189313 -153165 -33928 -167191 104384
9172f1596o0869L2332D1153A9631a0636j85000L7685B3382b87622G4534d00872
9160b77148B32816D9976c57263B64493b62221p1578a21294M1712B46540a80606
9149a6927j89759g8619n4229I8494a48298A01921B1857a92717F6394b6033j32413
9138a58446A01529b18270G380K01739E9828J84981b09634j27592A75739A3092
9127h0771c5017q332B56416j6475a02726A68079A7884L0182b85612j66483A89847
9115C54185A192a67781D6577b45940h5193m6492A27273a74799j19149Q9172e4696
9103g3175p810G3604h4648k25229L6644a31957A28287c48085j3034c9617B35802
9091a21044M4971A85712b9411J0612k54510o3947f3817j7118B00496a33181c3287
$$ plain form
9172 -61596 -122465 -90133 41153 19631 -10636 -195636 -157951 23382 -287622 74534 -400872
9160 -277148 232816 49976 -357263 264493 -262221 -333799 -121294 -79582 246540 -180606
9149 -16927 -206686 -78619 -132848 98494 -148298 101921 21857 -192717 66394 -26033 -158446
9138 -158446 101529 -218270 7380 209119 59828 244809 -209634 -337226 175739 13092
9127 -80771 -35017 -43349 256416 239941 -102726 168079 17884 48066 -285612 -452095 189847
9115 354185 1192 -167781 46577 -245940 -85193 -131685 127273 -174799 -293948 -204776 -54696
9103 -73175 -80985 73604 -84648 -309877 -273233 -131957 128287 -348085 -361119 -39617 235802
9091 -121044 -76073 185712 -29411 -18799 -273309 -337256 -63817 -80935 200496 -133181 -33287
9079C2712M5097a21739n2175C8274b73825i1657C64553q7521A09947a25073m0122
9068a65195j72064a6480j54629O7463n454d4231k96356J33010A22184M4872a83767
9056d20132K08058B98252F4783O9229c2490l11699a63374I189d9891E8586L41637
9045D00223b5687I8845L2015L4540Q1426f743K167k107j90633A418L2541a47835
9032F3607J83703b83256A94206b99266c0934l8779E5381b70751l4888h8633K6079
9021f2554b1842j04100j29463I3230a64188l2803r2361k2295A33136a60407J3406
9010a47001C27997a70543k41163R4221J19111L8548a8031A10907a04969O655K411
8999i5903k16363j21201a0109j63125I0047J03232c46799J70552o587h8659F9450
$$ plain form
9079 32712 77809 -121739 -173914 38274 -273825 -91657 364553 277032 109947 -125073 -165195
9068 -165195 -337259 -16480 -171109 -103646 -109100 -44231 -340587 -207577 122184 167056 -183767
9056 -420132 -212074 298252 64783 134012 -32490 -344189 -163374 9189 -49891 58586 400223
9045 400223 -25687 98845 130860 165400 246826 -6743 -4576 -6683 -197316 1418 33959 -147835
9032 63607 247310 -283256 194206 -299266 -30934 -69713 55381 -270751 -305639 -88633 -62554
9021 -62554 -21842 -125942 -255405 93230 -164188 -196991 -289352 -311647 133136 -160407 -147001
9010 -147001 327997 -170543 -411706 -317485 -198374 -159826 -18031 110907 -104969 -98314 -95903
8999 -95903 -312266 -433467 -10109 -173234 90047 193279 -346799 -176247 -182834 -88659 69450
8987b5842A63370c2034C13465b4954r990l28698G2456h0374j85631n4086C01866
8975F7804J15582a36253C8404a62361B8976e6416D7695c82928J39239C4166b6755
8963b04877M9391k9718H2668K23799A37292a27254E170f1598C3096i5665C05134
8951B83271j34980b15351N2747A08214a24094N8246n561r6092d1966k27264k39659
8940e08889a88153A47892b69918a20387f527F1685K31009A3324L24784a89578
8929c1337c770B56906b13867G6972J29007K31737K047367O702617L648106C926738
8918A684509q26398D11132j96216M7621a79521a7986A6293i1743F4466J82185
8908B46651o8994g3H054M0260b64713D9053J83972a03883D4017J6923k5125b30646
$$ plain form
8987 -25842 163370 -32034 313465 -24954 -34944 -363642 72456 -80374 -266005 -320091 301866
8975 67804 183386 -136253 38404 -162361 28976 -56416 47695 -382928 -243689 34166 -26755
8963 -204877 -155486 -185204 82668 306467 137292 -127254 5170 -61598 33096 -95665 305134
8951 283271 148291 -215351 -162604 108214 -124094 -65848 -71409 -167501 -41966 -269230 -508889
8940 -508889 -188153 147892 -269918 -120387 -6527 61685 292694 13324 338108 -189578
8929 -31337 -3770 256906 -213867 76972 205979 437716 2485083 9187700 12835806 3926738
8918 1684509 858111 411132 214916 262537 -179521 -17986 16293 -91743 64466 246651
8908 246651 177657 -73 8054 48314 -264713 49053 233025 -103883 44017 60940 35815 -230646
8895a02155H3197b02533A780J81218h1008b5017C46858c03931f7821o0354I8433
8883G4731b21186G5258b43503c118A27213c21714D3006j6397a3629k92361A10569
8871a20503I669g2993B08678g2863q192B3814e7002A53595c4170A78976a32250
8859a08281N3883C13532D0263b0426A51852o4640K56521M7963a2841j38073K7720
8848a23194A46133e24295a68377k48611I4702e4889p3921k47824F2008l089K0293
$$ plain form
8895 -102155 83197 -202533 1780 182998 -81008 -25017 346858 -303931 -67821 -128175 98433
8883 74731 -221186 75258 -243503 -3118 127213 -321714 43006 26609 -13629 -305990 110569
8871 -120503 9669 -72993 208678 -72863 -81055 23814 -57002 153595 -34170 178976 -132250
8859 -108281 -54398 313532 40263 -20426 151852 87212 343733 391696 -12841 -150914 -123194
8848 -123194 146133 -524295 -168377 -416988 94702 -54889 -128810 -376634 62008 58919 79212
$$ [...]
##END NTUPLES=NMR SPECTRUM
##END=
