##TITLE=AC1608_CTIAH13338_8316869_ZVBYigi5S5
##JCAMPDX= 6.0         $$ Bruker NMR JCAMP-DX V2.0
##DATA TYPE= NMR SPECTRUM
##DATA CLASS= NTUPLES
##ORIGIN= BRUKER
##OWNER= Administrator
$$ 1.72 TOPSPIN		Version 2.1
$$ 2013-11-09 23:33:01.989 -0800  Administrator@X
$$ Compression mode = diff/dup
##.OBSERVE FREQUENCY= 400.02188249412
##.OBSERVE NUCLEUS= ^1H
##.ACQUISITION MODE= SIMULTANEOUS (DQD)
##.ACQUISITION SCHEME= undefined
##.AVERAGES= 8
##.DIGITISER RES= 22
##SPECTROMETER/DATA SYSTEM= spect
##.PULSE SEQUENCE= zg30
##.SOLVENT NAME= COFFEE_meoh
##.SHIFT REFERENCE= INTERNAL, COFFEE_meoh, 1, 14.98509
##AUDIT TRAIL= $$ (NUMBER, WHEN, WHO, WHERE, PROCESS, VERSION, WHAT)
$$ ##TITLE= Audit trail, TOPSPIN		Version 2.1
$$ ##JCAMPDX= 5.01
$$ ##ORIGIN= Bruker BioSpin GmbH
$$ ##OWNER= Administrator
$$ $$ E:\/data/COFFEE/nmr/AC1608_CTIAH13338_8316869_ZVBYigi5S5/10/pdata/1/auditp.txt
$$ ##AUDIT TRAIL=  $$ (NUMBER, WHEN, WHO, WHERE, PROCESS, VERSION, WHAT)
(   1,<2013-11-09 23:32:55.161 -0800>,<Administrator>,<X>,<go>,<TOPSPIN 2.1>,
      <created by zg
	started at 2013-11-09 23:31:49.885 -0800,
	POWCHK enabled, PULCHK disabled,
       configuration hash MD5:
       C8 4E 4E 5D D3 5C D8 9E 9F 52 82 E0 59 8A DE 15
       data hash MD5: 64K
       04 75 37 09 EC 69 35 57 67 BF 17 B4 4F A6 EC A6>)
(   2,<2013-11-09 23:32:58.130 -0800>,<Administrator>,<X>,<proc1d>,<TOPSPIN 2.1>,
      <Start of raw data processing
       efp LB = 0 FT_mod = 6 PKNL = 1 PHC0 = 0 PHC1 = 0 SI = 32K 
       data hash MD5: 32K
       FB BB 87 75 8F 51 63 59 E6 C6 F8 EF 04 28 7E C6>)
(   3,<2013-11-09 23:32:58.442 -0800>,<Administrator>,<X>,<proc1d>,<TOPSPIN 2.1>,
      <pk PHC0 = 92.36755 PHC1 = 0 
       data hash MD5: 32K
       5E DE 12 5C 65 63 02 E3 A8 4B 2D F7 95 83 DB 55>)
(   4,<2013-11-09 23:32:58.567 -0800>,<Administrator>,<X>,<proc1d>,<TOPSPIN 2.1>,
      <abs ABSG = 1 
       data hash MD5: 32K
       6C 98 6F A0 59 A6 DF C4 7A 27 1C A9 A9 B5 CA 49>)
(   5,<2013-11-09 23:32:58.645 -0800>,<Administrator>,<X>,<proc1d>,<TOPSPIN 2.1>,
      <abs ABSG = 2 
       data hash MD5: 32K
       51 C3 17 15 01 13 E9 C1 06 9A 87 60 D4 B0 88 54>)
(   6,<2013-11-09 23:32:58.708 -0800>,<Administrator>,<X>,<proc1d>,<TOPSPIN 2.1>,
      <abs ABSG = 3 
       data hash MD5: 32K
       F8 AC 01 26 42 28 E1 D5 6F 73 52 18 E9 63 2A 2F>)
(   7,<2013-11-09 23:32:58.770 -0800>,<Administrator>,<X>,<proc1d>,<TOPSPIN 2.1>,
      <abs ABSG = 4 
       data hash MD5: 32K
       85 EA 90 0C E6 78 AA 9C 17 C3 5B A5 1D E4 16 49>)
(   8,<2013-11-09 23:32:58.817 -0800>,<Administrator>,<X>,<proc1d>,<TOPSPIN 2.1>,
      <abs ABSG = 5 
       data hash MD5: 32K
       55 82 0F 18 AE 29 E6 F8 15 87 83 27 5D A8 63 D6>)
$$ ##END=
$$ 
$$ $$ hash MD5
$$ $$ 32 72 C0 09 A0 18 45 0C 57 5E D5 E8 A8 DC 85 20
##$RELAX= 
##$RELAX= 
##$RELAX= 
##$RELAX= 
##$RELAX= 
##$RELAX= 
##$RELAX= 
$$ Bruker specific parameters
$$ --------------------------
##$DU= <E:\>
##$EXPNO= 10
##$NAME= <AC1608_CTIAH13338_8316869_ZVBYigi5S5>
$$ [...]
150 150 150 150 150 150 150 150
##$TP07= 0
##$TPNAME0= <>
##$TPNAME1= <>
##$TPNAME2= <>
##$TPNAME3= <>
##$TPNAME4= <>
##$TPNAME5= <>
##$TPNAME6= <>
##$TPNAME7= <>
##$TPOAL= (0..7)
0.5 0.5 0.5 0.5 0.5 0.5 0.5 0.5
##$TPOFFS= (0..7)
0 0 0 0 0 0 0 0
##$TUNHIN= 0
##$TUNHOUT= 0
##$TUNXOUT= 0
##$USERA1= <user>
##$USERA2= <user>
##$USERA3= <user>
##$USERA4= <user>
##$USERA5= <user>
##$V9= 5
##$VALIST= <valist>
##$VCLIST= <CCCCCCCCCCCCCCC>
##$VD= 0
##$VDLIST= <DDDDDDDDDDDDDDD>
##$VPLIST= <PPPPPPPPPPPPPPP>
##$VTLIST= <TTTTTTTTTTTTTTT>
##$WBST= 1024
##$WBSW= 4
##$XGAIN= (0..3)
0 0 0 0
##$XL= 0
##$YL= 0
##$YMAX_a= 634721
##$YMIN_a= -541954
##$ZGOPTNS= <>
##$ZL1= 120
##$ZL2= 120
##$ZL3= 120
##$ZL4= 120
##$ABSF1= 14.98509
##$ABSF2= -5.573092
##$ABSG= 5
##$ABSL= 3
##$ALPHA= 0
##$AQORDER= 0
##$ASSFAC= 0
##$ASSFACI= 0
##$ASSFACX= 0
##$ASSWID= 0
##$AUNMP= <proc_prof1d_extract_pilot.lims>
##$AXLEFT= 0
##$AXNAME= <>
##$AXNUC= <1H>
##$AXRIGHT= 0
##$AXTYPE= 0
##$AXUNIT= <>
##$AZFE= 0.1
##$AZFW= 0.1
##$BCFW= 0
##$BC_mod= 0
##$BYTORDP= 0
##$COROFFS= 0
##$CY= 15
##$DATMOD= 1
##$DC= 0
##$DFILT= <>
##$DTYPP= 0
##$F1P= 0
##$F2P= 0
##$FCOR= 0.5
##$FTSIZE= 32768
##$FT_mod= 6
##$GAMMA= 0
##$GB= 0
##$INTBC= 1
##$INTSCL= 1
##$ISEN= 128
##$LB= 0
##$LEV0= 0
##$LPBIN= 0
##$MAXI= 10000
##$MC2= 0
##$MEAN= 0
##$ME_mod= 0
##$MI= 0
##$NCOEF= 0
##$NC_proc= -8
##$NLEV= 6
##$NOISF1= 0
##$NOISF2= 0
##$NSP= 0
##$NTH_PI= 0
##$NZP= 0
##$OFFSET= 14.98509
##$PC= 1
##$PHC0= 92.36755
##$PHC1= 0
##$PH_mod= 1
##$PKNL= yes
##$PPARMOD= 0
##$PPDIAG= 0
##$PPIPTYP= 0
##$PPMPNUM= 2147483647
##$PPRESOL= 1
##$PSCAL= 4
##$PSIGN= 0
##$PYNMP= <proc.py>
##$REVERSE= no
##$SF= 400.02
##$SI= 32768
##$SIGF1= 0
##$SIGF2= 0
##$SINO= 400
##$SIOLD= 32768
##$SPECTYP= <>
##$SREGLST= <1H.CDCl3>
##$SSB= 0
##$STSI= 32768
##$STSR= 0
##$SW_p= 8223.68421052631
##$SYMM= 0
##$S_DEV= 0
##$TDeff= 65536
##$TDoff= 0
##$TI= <>
##$TILT= no
##$TM1= 0
##$TM2= 0
##$TOPLEV= 0
##$USERP1= <user>
##$USERP2= <user>
##$USERP3= <user>
##$USERP4= <user>
##$USERP5= <user>
##$WDW= 1
##$XDIM= 32768
##$YMAX_p= 465127340
##$YMIN_p= -715543
##$CURPLOT= <Network HP LaserJet P1505>
##$CURPRIN= <$Network HP LaserJet P1505>
##$DFORMAT= <normdp>
##$LAYOUT= <+/1D_H.xwp>
##$LFORMAT= <normlp>
##$PFORMAT= <normpl>
##$SURQMSG= 1
$$ End of Bruker specific parameters
$$ ---------------------------------
##NTUPLES= NMR SPECTRUM
##VAR_NAME=  FREQUENCY,     SPECTRUM/REAL,   SPECTRUM/IMAG
##SYMBOL=    X,             R,               I
##VAR_TYPE=  INDEPENDENT,   DEPENDENT,       DEPENDENT
##VAR_FORM=  AFFN,          ASDF,            ASDF
##VAR_DIM=   32768,         32768,           32768
##UNITS=     HZ,            ARBITRARY UNITS, ARBITRARY UNITS
##FACTOR=    0.250966925370066, 1,           1
##FIRST=     8223.43324360094, 32484,        -75195
##LAST=      0,             -249501,         -141947
##MIN=       0,             -715543,         0
##MAX=       8223.43324360094, 465127340,    0
$$ Real data points
##PAGE= N=1
##DATA TABLE= (X++(R..R)), XYDATA
$$ [...]
19571c17686F5035A2241J86497g0408B1869a77967M8579c4961A3063P7471a3229
$$ -317686 65035 12241 198738 -70408 21869 -177967 -129388 -34961 13063 90534 -13229
19559B15871G9046j2343N4959d02983e3218m59283G422a79388h0043l35412c3606
$$ 215871 79046 66703 121662 -402983 -53218 -512501 7422 -179388 -80043 -415455 -33606
19547a00021I3936c19460B42645n681h5664G4817d62537d8477j76690a04247C80882
$$ -100021 93936 -319460 242645 236964 -85664 74817 -462537 -48477 -225167 -104247 380882
19535B5918h807m01290B32750k5481c10020R5117N7308A10793d054k86358f4754
$$ 25918 -8807 -410097 232750 207269 -310020 -214903 -157595 110793 -4054 -290412 -64754
19523g9268l40795C8085b75748E9356b08466O7881H1481i2837j09125B2070J90848
$$ -79268 -420063 38085 -275748 59356 -208466 -140585 81481 -92837 -201962 22070 212918
19512B12918r5957c30435A48661a72522N3417A42940o1388a16272B5642b04536
$$ 212918 116961 -330435 148661 -172522 -119105 142940 81552 -116272 25642 -204536
19501a76261L6225C90965i3099P232l7606a4474n8227L2084A43388M5812D8168
$$ -176261 -140036 390965 -93099 -85867 -123473 -14474 -72701 -40617 143388 189200 48168
19489c8517l75044A34278d97811K29788C1531c1515j47222k20063b6286A13616
$$ -38517 -413561 134278 -497811 -268023 31531 -31515 -178737 -398800 -26286 113616
19478b19728O8931A18921j4743n0597K53200a18564n2859L4804D1015h1125j56819
$$ -219728 -150797 118921 104178 53581 306781 -118564 -171423 -136619 41015 -81125 -237944
19467b37944F3345J27409Q7041p8687b5280G2187b7855j4981m5266A99362C4862
$$ -237944 63345 190754 277795 199108 -25280 72187 -27855 -42836 -88102 199362 34862
19455A75606d59624A33134a85601J9194D6916B2081b77763Q3583e122C6631P6397
$$ 175606 -459624 133134 -185601 -166407 46916 22081 -277763 -194180 -5122 36631 113028
19444A13028g1802k2841l15657O6404B87605I552J26190C5891J54406d19196F4543
$$ 113028 -71802 -94643 -410300 -343896 287605 9552 135742 35891 190297 -419196 64543
19432d45489A29055a20559A14767b62986p9202d7090j19410B5621p362a90003
$$ -445489 129055 -120559 114767 -262986 -342188 -47090 -166500 25621 18259 -190003
19421h0032C786J31608n7522a81412o3276E6661h8843a7592H902f4838l3711H7005
$$ -80032 3786 135394 77872 -181412 -244688 56661 -88843 -17592 8902 -64838 -98549 87005
19408a50495d7195J5433m99100f6308l42516f4839N06A16234L425D0547c8272
$$ -150495 -47195 -31762 -530862 -66308 -408824 -64839 -64333 116234 119659 40547 -38272
19396G3271a46501P0018j19889K166c7677H8177K46663a61114f1843B14834d8544
$$ 73271 -146501 -76483 -196372 -194206 -37677 88177 334840 -161114 -61843 214834 -48544
19384a29874p3200j00241J47199d6868A30647m1137a28589n4057I5042a23500
$$ -129874 -203074 -303315 -156116 -46868 130647 89510 -128589 -182646 95042 -123500
19373D66993c86029g51A17540a55877k33195a38663l213A7673b5837I2078i7232
$$ 466993 -386029 -751 117540 -155877 -389072 -138663 -141876 17673 -25837 92078 -97232
19361c70535d7701B06043h7323c891j29786k6617L5768b3481j23819k7213j50539
$$ -370535 -47701 206043 -87323 -3891 -133677 -160294 -124526 -23481 -147300 -174513 -325052
19350c25052J59157j48264A54442B0475b22329B03649c02894O9521J1146A49844
$$ -325052 -165895 -314159 154442 20475 -222329 203649 -302894 -233373 -222227 149844
19339f760A54183B921L3667J3621d57005D8606M1348d17721c4220j05223H4289
$$ -6760 154183 2921 36588 50209 -457005 48606 89954 -417721 -34220 -139443 84289
19327A47409N5776p2625g4989A96450b59610I3028P418a6357l2137k05162B54473
$$ 147409 203185 130560 -74989 196450 -259610 93028 100446 -16357 -48494 -253656 254473
19315b26366a5140C1837d52602A08909a5990C7103b35599D2481b40015I428b15384
$$ -226366 -15140 31837 -452602 108909 -15990 37103 -235599 42481 -240015 9428 -215384
19303A88320b7141m0978b6373j13047b0332q869r1569k3123D6543j0467R5183
$$ 188320 -27141 -68119 -26373 -139420 -20332 -29201 -120770 -143893 46543 36076 131259
19292A31259b07709j36942D6433o210g2505k88167B35217e08475B39353m5790
$$ 131259 -207709 -344651 46433 40223 -72505 -360672 235217 -508475 239353 193563
19282A93563h1928A53462g2989a3481k17943C40008a33426m2056A39123o1930
$$ 193563 -81928 153462 -72989 -13481 -231424 340008 -133426 -175482 139123 77193
19272G7193i6645p263l0247A6728K0909c6383j11142a010j73024A36528e8896
$$ 77193 -96645 -103908 -134155 16728 37637 -36383 -147525 -1010 -174034 136528 -58896
19260b60309j02424A62668E1538P7070B9131J74084e8412A41941a3244B15694
$$ -260309 -362733 162668 51538 128608 29131 203215 -58412 141941 -13244 215694
19249a2596o2549k88537a29341e4240n5734m9293M9294l9530q016A24985P7597
$$ -12596 -75145 -363682 -129341 -54240 -109974 -159267 -109973 -149503 -157519 124985 202582
19238B02582a74643p1952e5850G7456J9357J2226M1208C9737e2495I1491f0003
$$ 202582 -174643 -246595 -55850 77456 96813 109039 150247 39737 -52495 91491 -60003
19226B35884b22075L2618A30960f0067q5519A95949a70090D71J23903g8762j46859
$$ 235884 -222075 -189457 130960 -60067 -145586 195949 -170090 471 124374 -78762 -225621
19215b25621g9173c421n03234B60924a72486M9789B0237b18225i4686A6373O6503
$$ -225621 -79173 -3421 -506655 260924 -172486 -122697 20237 -218225 -94686 16373 82876
19204H2876a12884A49462b94165d2591j01035J2906d4285j97530k8377A59924
$$ 82876 -112884 149462 -294165 -42591 -143626 -130720 -44285 -241815 -270192 159924
19193b70123B06412a89736A08460K3178e5661b6825j17289b7104B49019h1680
$$ -270123 206412 -189736 108460 131638 -55661 -26825 -144114 -27104 249019 -81680
19182d0572j78755B58639j17168F1255J85577a30648j321O2817B93200b19502
$$ -40572 -219327 258639 141471 61255 246832 -130648 -131969 -69152 293200 -219502
19171g9573A55681p0881b2355D7001a49393m5806l9566g9406l6873j27228G5690
$$ -79573 155681 84800 -22355 47001 -149393 -195199 -234765 -79406 -116279 -243507 75690
19159H3073a45501j90759D13501e6185G775c25418K2295A21331K0982l7251B8894
$$ 83073 -145501 -336260 413501 -56185 7775 -325418 -303123 121331 142313 105062 28894
19147C29308A553a98235f1502k1751j81903J365l2561Q6488j1019e6424j78033
$$ 329308 1553 -198235 -61502 -83253 -265156 -263791 -296352 -209864 -220883 -56424 -234457
19136b34457c3110q5577K6780n109K6430B6114K4995J02510f9049b3289I4464
$$ -234457 -33110 -118687 -91907 -97016 -70586 26114 51109 153619 -69049 -23289 94464
19124E4082b10374B2956a21136l71544A70277E1964d13066A88781h884B13454
$$ 54082 -210374 22956 -121136 -492680 170277 51964 -413066 188781 -8884 213454
19113d23660c4982k33488A26767B2029d24101a0102D035M769b93731b0589B20082
$$ -423660 -34982 -268470 126767 22029 -424101 -10102 4035 8804 -293731 -20589 220082
19101c12294a03382r3344e1210b11o5095n3468B7921a17167C9067a9728F3205
$$ -312294 -103382 -196726 -51210 -211 -65306 -118774 27921 -117167 39067 -19728 63205
19089e6402l58392a07539N0920J3381m5965L5299k41084O5145A9008a00027B0212
$$ -56402 -414794 -107539 -56619 -43238 -89203 -53904 -294988 -229843 19008 -100027 20212
19077A4602b18121h9886B05947a62720a5060o4681I1074f4554J6630j66872g1741
$$ 14602 -218121 -89886 205947 -162720 -15060 -79741 91074 -64554 -47924 -214796 -71741
19065B19884F2798Q5103a95623J0605i0183j55292l2983r3656A34472J0429F6696
$$ 219884 62798 147901 -195623 -185018 -90183 -245475 -278458 -372114 134472 144901 66696
19053E0342f6142D0457E103K39556j1408J4253a75777B56903b4809I7692b11160
$$ 50342 -66142 40457 5103 244659 233251 247504 -175777 256903 -24809 97692 -211160
19041a11373j43596J13942l75162J43454i0106l9517M9177a9155C6967c6055B01214
$$ -111373 -254969 -141027 -516189 -372735 -90106 -129623 -80446 -19155 36967 -36055 201214
19029b449D8201a1515B63895j3856a19634E9200J19070R9077j06653J87384b13794
$$ -2449 48201 -11515 263895 250039 -119634 59200 178270 277347 170694 358078 -213794
19017a6051B37426B9450P3221b87729J32858b1020j8922C88869a73902M27C63079
$$ -16051 237426 29450 102671 -287729 -154871 -21020 -39942 388869 -173902 -173475 363079
19005B41579b4173I2991g0763A96503H2243a71346K7068m1535B55117h3871L5911
$$ 241579 -24173 92991 -70763 196503 82243 -171346 -144278 -185813 255117 -83871 -47960
18994d7960J6591j56417c7444j9882G0657J80557f9095G5460J6078N3164g5135
$$ -47960 -31369 -187786 -37444 -57326 70657 251214 -69095 75460 91538 144702 -75135
18982a04869I4096c2377m14971C3843Q9087e5489G3439O5634b9769j42091k61812
$$ -104869 94096 -32377 -447348 33843 122930 -55489 73439 139073 -29769 -171860 -433672
18971d33672B59725a9249H3788a12950j18514a13533B24127l6069C1293J99189
$$ -433672 259725 -19249 83788 -112950 -231464 -113533 224127 188058 31293 230482
18961B30482b39811a08925A32064a33286C11727b16009a839k7229b915j82113
$$ 230482 -239811 -108925 132064 -133286 311727 -216009 -1839 -29068 -2915 -185028
18951a85028o071A4659O9541a08173j4254j00621j6982J06710k21295J61680F4779
$$ -185028 -191099 14659 84200 -108173 -122427 -223048 -240030 -133320 -354615 -192935 64779
18939f7529r7341E2471a45995k08116A18121E0994J43507J88305a59788A75834
$$ -67529 -164870 52471 -145995 -354111 118121 50994 194501 382806 -159788 175834
18928A70909B1652a52361B75021b03466g0926L2328C06577a66349J1250Q220A55182
$$ 170909 21652 -152361 275021 -203466 -70926 -38598 306577 -166349 -155099 -146879 155182
18916c69365a71989k83061a23120L1366A94160A4758a38850A6080A450a80130
$$ -369365 -171989 -455050 -123120 -91754 194160 14758 -138850 16080 1450 -180130
18905A7368c656A02618b56295J4550A33716f28512b96256F4854e1308k16311e4359
$$ 17368 -3656 102618 -256295 -241745 133716 -628512 -296256 64854 -51308 -267619 -54359
18893f5949l1877D91320B33766f7254j95937j41673J23562e2206c827A74877c3448
$$ -65949 -97826 491320 233766 -67254 -263191 -404864 -281302 -52206 -3827 174877 -33448
18881a72094M5656H026a11790D76659a712E6808i3604a8366A56062b8544l20639
$$ -172094 -126438 8026 -111790 476659 -1712 56808 -93604 -18366 156062 -28544 -349183
18870c49183B63553b75570J16848L4465b6529C8904j8211q095a07629J2437J898
$$ -349183 263553 -275570 -158722 -124257 -26529 38904 20693 12598 -107629 -95192 -93294
18859i3294L1215A07686n1247g6626B942K96040b65233h7643j48402G5570a61442
$$ -93294 -62079 107686 56439 -76626 2942 298982 -265233 -87643 -236045 75570 -161442
18847C1323A0841e1945H031R8226a21172d3046I2214a75823k01460J21609b7274
$$ 31323 10841 -51945 8031 106257 -121172 -43046 92214 -175823 -377283 -255674 -27274
18835B08023i6074k23824a45653b955F2275J15575b48069B67977b25530Q2519
$$ 208023 -96074 -319898 -145653 -2955 62275 177850 -248069 267977 -225530 -143011
18825a43011j07739R3865B70490D6325b2125A76750a32398M2995A06693C8586
$$ -143011 -250750 -156885 270490 46325 -22125 176750 -132398 -89403 106693 38586
18814B3091Q328D461N6161M4349a18780e0063H7313Q7143o8432g0754q4472b4123
$$ 23091 31419 4461 60622 104971 -118780 -50063 87313 174456 106024 -70754 -155226 -24123
18801A07768J1989g9319o435H3965P4610e2946A48586A4508i8987d5700A77863
$$ 107768 119757 -79319 -85754 83965 158575 -52946 148586 14508 -98987 -45700 177863
18789g4512k50520J13126A36257C764a53336c2929q5115N7584A05974a60203O2787
$$ -74512 -325032 -211906 136257 3764 -153336 -32929 -118044 -60460 105974 -160203 -97416
18778i7416k44152A38390b16674c0512A77365p9851k9892a99011k6061I4506a7263
$$ -97416 -341568 138390 -216674 -30512 177365 97514 67622 -199011 -225072 94506 -17263
18766B7628a84482L1764O9962A14505a91670j50236E5093C049a10895A05448J8226
$$ 27628 -184482 -152718 -82756 114505 -191670 -341906 55093 3049 -110895 105448 123674
18755A23674D672K66253I356c40403j4834I8078L66007a0602B20973a74931a456
$$ 123674 4672 270925 9356 -340403 -355237 98078 464085 -10602 220973 -174931 -1456
18743c08087C10197c20762d8831A29378c8448A71316J56668e6735b2142o4291
$$ -308087 310197 -320762 -48831 129378 -38448 171316 327984 -56735 -22142 -86433
18733h6433A35849d6282C6442J43007f37m5579k32924d4912B0697e2058D4910
$$ -86433 135849 -46282 36442 179449 -637 -46216 -279140 -44912 20697 -52058 44910
18721a88084A48271o1901Q8187p1656Q7558c43976A2456c7856m7840D8707a61702
$$ -188084 148271 86370 174557 102901 190459 -343976 12456 -37856 -85696 48707 -161702
18709C9960b57653F4731a45233j46137i9801d3181A04623c39854h6788k85431
$$ 39960 -257653 64731 -145233 -291370 -99801 -43181 104623 -339854 -86788 -372219
18699c72219B99557A25995B7006a71135K5134E7784J05176J8512c09565f8417
$$ -372219 299557 125995 27006 -171135 -146001 57784 162960 181472 -309565 -68417
18688A51072a91403K1197C53607a0674j11789A21696a64252j67290A40372Q336
$$ 151072 -191403 -170206 353607 -10674 -122463 121696 -164252 -331542 140372 148708
18678A48708a10976n4563g4952k66649A98343F6352K65972A47481C0388b11579
$$ 148708 -110976 -165539 -74952 -341601 198343 66352 332324 147481 30388 -211579
18667A85447F0159J91351a2366k62724e2581j80533J03593b211l02454A10706
$$ 185447 60159 251510 -12366 -275090 -52581 -233114 -129521 -2211 -304665 110706
18656e1087l25393c29j55118M2881B28381a23047j59300d0163A10834b34685G4764
$$ -51087 -376480 -329 -155447 -112566 228381 -123047 -282347 -40163 110834 -234685 74764
18644a49418j17142i1912A89226n7275g9574j41914G0544i6766A26886c94948
$$ -149418 -266560 -91912 189226 131951 -79574 -221488 70544 -96766 126886 -394948
18633a51929O8258F1057L57390b149k98601g3854A10300i4510M0579A2533N6762
$$ -151929 -83671 61057 418447 -2149 -300750 -73854 110300 -94510 -53931 12533 69295
18622F9295Q7510B88g4385B09682a94582n0353P8072A20820J4176a82936A90824
$$ 69295 156805 288 -74385 209682 -194582 -244935 -166863 120820 134996 -182936 190824
18610b7798A2064g5565k43726A20674M1550J05197j20720h8003q0487g7420p0520
$$ -27798 12064 -75565 -319291 120674 162224 267421 146701 -88003 -168490 -77420 -147940
18599a47940A36036c64893i4227r0306C9672a02610j92380f9998B44940A688i9395
$$ -147940 136036 -364893 -94227 -184533 39672 -102610 -294990 -69998 244940 1688 -99395
18587a86609B07919m7918p3284a7500l61951M9275g6371j14307A39100a51298
$$ -186609 207919 160001 86717 -17500 -379451 -330176 -76371 -190678 139100 -151298
18576A81039b78736d2436k85958J07231A42303d9808k354b12k63333N9922D8371
$$ 181039 -278736 -42436 -328394 -221163 142303 -49808 -52162 -212 -263545 -203623 48371
18564a41926p689l2322A10391c3701j66739M4839M1709q3116a9204j09637B074
$$ -141926 -149615 -181937 110391 -33701 -200440 -155601 -113892 -197008 -19204 -128841 2074
18552b59392j49992a14934d3920l7104q0596B04530b54844B3046P1443a34866
$$ -259392 -409384 -114934 -43920 -81024 -161620 204530 -254844 23046 94489 -134866
18541D9327k0393c7398a4544A26943A629a97933B4203b02968k70723A68223l0951
$$ 49327 28934 -37398 -14544 126943 1629 -197933 24203 -202968 -473691 168223 137272
18530A37272n1618B2498g7468l08577n4896J11652a18170o4366E13477b57909
$$ 137272 85654 22498 -77468 -386045 -440941 -329289 -118170 -182536 513477 -257909
18519B59018e1223n9221D2245K28755a86892I5482i9085e96A132c2245k10192
$$ 259018 -51223 -110444 42245 271000 -186892 95482 -99085 -596 1132 -32245 -242437
18508b42437E647N9736b38498q0382J02948F3331b8546j50929m9570C45005g2914
$$ -242437 5647 65383 -238498 -318880 -215932 63331 -28546 -179475 -229045 345005 -72914
18496C63743f5818K6649j28255o8170J17736q3198B30241f8968l63780a6584k66277
$$ 363743 -65818 -39169 -167424 -235594 -117858 -201056 230241 -68968 -432748 -16584 -282861
18485b82861B1815a81958d3714A09790m508b3390m9741m2574r5784A92008a00070
$$ -282861 21815 -181958 -43714 109790 105282 -23390 -73131 -115705 -211489 192008 -100070
18473b82406C762a66248K4013B27267m3758b21144B13208b45762B18471b15625
$$ -282406 3762 -166248 -142235 227267 183509 -221144 213208 -245762 218471 -215625
18462f6080A47024a52613G1637b4171A81482I414d7347B20726f7228c3124J2114
$$ -66080 147024 -152613 71637 -24171 181482 9414 -47347 220726 -67228 -33124 -21010
18451b1010A87128n962b19206A14922b63940I1119a8451k3364j82313q6249J10298
$$ -21010 187128 181166 -219206 114922 -263940 91119 -18451 -41815 -224128 -310377 -200079
18440b00079g0746j65807B53138b20155P9719r3078F1430e78B23657n1300q503
$$ -200079 -70746 -236553 253138 -220155 -140436 -233514 61430 -578 223657 172357 163854
18429A63854Q2645j14173b52635q4592A79125a51401N7418A72366b02806G3962
$$ 163854 246499 132326 -252635 -337227 179125 -151401 -93983 172366 -202806 73962
18418C5319Q5315e6915C06290J55946E6350a8053A42279a42659D4489L65476A6977
$$ 35319 120634 -56915 306290 462236 56350 -18053 142279 -142659 44489 409965 16977
18406c7937A64244N1445A6062a96970G2987b2466E8087c3204o0728j2368B2197
$$ -37937 164244 215689 16062 -196970 72987 -22466 58087 -33204 -93932 -106300 22197
18394B96393b17522O3408f0458D9026e5046D6948a288j54147D5510j6929K28143
$$ 296393 -217522 -154114 -60458 49026 -55046 46948 -1288 -155435 45510 28581 256724
18383B56724F2749b18633A5155e3080j63714d1488j27455A54618K7616b4419o1944
$$ 256724 62749 -218633 15155 -53080 -216794 -41488 -168943 154618 182234 -24419 -86363
18372h6363L7579B06091L0597P6483b24922a4679A56939b95321d6265n3709A92017
$$ -86363 -48784 206091 236688 313171 -224922 -14679 156939 -295321 -46265 -99974 192017
18360B32239d00061J86231B67882a70952a8836A43943a92043A6429b21003O8287
$$ 232239 -400061 -213830 267882 -170952 -18836 143943 -192043 16429 -221003 -152716
18350a52716e795j05063j25003g2860j65203B372a30576C174c2079j58433h3887
$$ -152716 -5795 -110858 -235861 -72860 -238063 2372 -130576 3174 -32079 -190512 -83887
18338a45594k4132o2435J11370l53596B15990a82396B73707j26800a19486G2382
$$ -145594 -169726 -232161 -120791 -474387 215990 -182396 273707 146907 -119486 72382
18327D8211c7309l39172a27733C20282A33423c88640E7328a6525k36397b850C76602
$$ 48211 -37309 -376481 -127733 320282 133423 -388640 57328 -16525 -252922 -2850 376602
18315A13112a30811j57499c0764j34679k24812A40213J46800a34829a5322j27321
$$ 113112 -130811 -288310 -30764 -165443 -390255 140213 287013 -134829 -15322 -142643
18305a42643B06443g0090G2246R557c81439J75870B56907c16168b4256j7793k19338
$$ -142643 206443 -70090 72246 81803 -381439 -205569 256907 -316168 -24256 -42049 -261387
18294b61387i1420A5899i3767r7463G899c86867a89378C8320a97884r1754i8380
$$ -261387 -91420 15899 -93767 -191230 7899 -386867 -189378 38320 -197884 -289638 -98380
18282a5994E4010P1585E4944j7165b14610k79700B31832q6058a13330A38536a44569
$$ -15994 54010 125595 54944 37779 -214610 -494310 231832 145774 -113330 138536 -144569
18270A62685J21084h8176K590n3890e0878j8383G3779J38957l0929a47316B849
$$ 162685 283769 -88176 -85586 -139476 -50878 -69261 73779 212736 181807 -147316 2849
18258A54453a07450A09364p231a48767D0189b4119j57454A76367d35623a93887
$$ 154453 -107450 109364 102133 -148767 40189 -24119 -181573 176367 -435623 -193887
18247h9876Q907l4777b4891B7507d1541k4864M722j00789G148b49552j0453A18286
$$ -89876 -80969 -115746 -24891 27507 -41541 -66405 -61683 -162472 7148 -249552 -260005 118286
18234a10133j65168J03117c3139r8787B03963j01593b15443L6348f6903l55321
$$ -110133 -275301 -172184 -33139 -131926 203963 102370 -215443 -179095 -66903 -422224
18224d22224O2799J67983C961e3322q0323E9395b42322A73538C8801a41747d7476
$$ -422224 -359425 -191442 3961 -53322 -133645 59395 -242322 173538 38801 -141747 -47476
18212A16446Q8404a77343f3198A75642J18301a33872A58807o8756a58051F462
$$ 116446 204850 -177343 -63198 175642 293943 -133872 158807 90051 -158051 6462
18201C0746J0705i8064k41112J56014B20943F1503i1089J4108A26526b133m9683
$$ 30746 41451 -98064 -339176 -183162 220943 61503 -91089 -76981 126526 -2133 -51816
18190e1816n4484j07769j77724i7569c5952D9320c3717B327b39899F8854A8118
$$ -51816 -106300 -214069 -391793 -97569 -35952 49320 -33717 2327 -239899 68854 18118
18178H4739K1279Q2865q0520q68b46240a3973A55258a14174M628k7920o7760B79989
$$ 84739 106018 188883 108363 107495 -246240 -13973 155258 -114174 -109546 -137466 -205226 279989
18165b14865A12546D4522e0280J4109A24981D81a7682k08437E1707f7414k6640
$$ -214865 112546 44522 -50280 -36171 124981 481 -17682 -226119 51707 -67414 -94054
18154i4054p6149l2781O7501B7794b51417A59604o6599k8800d2263B0100a90730
$$ -94054 -170203 -202984 -135483 27794 -251417 159604 93005 64205 -42263 20100 -190730
18142A91488a02472j7661R666C3246c3598j74500C7047F069b10449O8641C78021
$$ 191488 -102472 -120133 -110467 33246 -33598 -208098 37047 6069 -210449 -141808 378021
18130c01926a7470C09382d25856e5185B37752c53153f8765j11562M9390D0895
$$ -301926 -17470 309382 -425856 -55185 237752 -353153 -68765 -180327 -130937 40895
18119H8632l7190K06278A5222b0035n1590m3623A30286K0268b87634I0471B5455
$$ 88632 51442 257720 15222 -20035 -71625 -115248 130286 150554 -287634 90471 25455
18107c75540A74290i4715A8135b79343D7452a25979N4898J4214j1344K3636k01819
$$ -375540 174290 -94715 18135 -279343 47452 -125979 -71081 -56867 -68211 -44575 -246394
18096b46394B33571a49540A59784a7380l67921c1897j2568B30001b96075J43828
$$ -246394 233571 -149540 159784 -17380 -385301 -31897 -44465 230001 -296075 -152247
18086a52247C04597A49757E2163c95692D28296a08862c4787o609l78027a77284
$$ -152247 304597 149757 52163 -395692 428296 -108862 -34787 -41396 -419423 -177284
18075h4520l8823C7992P096c90515B585O4099b10760A55714b93250A29654J71125
$$ -84520 -123343 37992 45088 -390515 2585 66684 -210760 155714 -293250 129654 300779
18064C00779j18294d06905M0181B09518c21711A5992J26326a36219M3452j5131
$$ 300779 182485 -406905 -366724 209518 -321711 15992 142318 -136219 -92767 -107898
18054a07898j68997j56996a15565m8375m244H7557J68014h7440D8438l627e1954
$$ -107898 -276895 -433891 -115565 -163940 -168184 87557 255571 -87440 48438 44811 -51954
18042C6684h3069k0853k49855J63959C7796Q3525m7511l4547N857K00043a31198
$$ 36684 -83069 -103922 -353777 -189818 37796 121321 73810 39263 45120 245163 -131198
18030b69481a01470C65761b62254P9550f3900A23926a4903H208h1967A20760f4518
$$ -269481 -101470 365761 -262254 -182704 -63900 123926 -14903 8208 -81967 120760 -64518
18018F888a095E2055N8889b79652F2825a16205A80796n8295A1903g3200J1352
$$ 6888 -1095 52055 110944 -279652 62825 -116205 180796 122501 11903 -73200 -61848
18007f1848A36361d33627e2868E455O5005k1468a32160A41594m1892j0205c70272
$$ -61848 136361 -433627 -52868 5455 70460 48992 -132160 141594 99702 89497 -370272
17995B05347a27451A25750j1862c8773k34284H0034j2108P0197c33513a47037
$$ 205347 -127451 125750 113888 -38773 -273057 80034 67926 138123 -333513 -147037
17984A74231h2280J8428G6417J15460a65137e7102A8048g3945c3100j74479K3367
$$ 174231 -82280 -63852 76417 191877 -165137 -57102 18048 -73945 -33100 -207579 -184212
17973a84212k3984Q3213n7674f2827D3509c7684g160G9835O8475a11605C7620
$$ -184212 -208196 -124983 -182657 -62827 43509 -37684 -7160 79835 148310 -111605 37620
17961A23116e5117G6273P9982c17447e0058j36743A63327b39675b1855A23408
$$ 123116 -55117 76273 156255 -317447 -50058 -186801 163327 -239675 -21855 123408
17950a22944N8558H3149K32666g8882C0712b0335q3083j08761h0259A61087c5644
$$ -122944 -64386 83149 315815 -78882 30712 -20335 -103418 -212179 -80259 161087 -35644
17938B20537b79508E7304a96564j5117B59652A13905O1962b92085C54489n5727
$$ 220537 -279508 57304 -196564 -211681 259652 113905 175867 -292085 354489 298762
17928B98762f8645A1100J24499M5402l3913e9571m0617g162I4975J71441F9162
$$ 298762 -68645 11100 135599 181001 147088 -59571 -100188 -7162 94975 266416 69162
17916B13509f3952C41485a30907k7011A12629i8277B02121C5993j7116a27347
$$ 213509 -63952 341485 -130907 -157918 112629 -98277 202121 35993 18877 -127347
17905b3016j9616A18978c34944A69743e9978D4008a98625E6749K76980d7044a5287
$$ -23016 -42632 118978 -334944 169743 -59978 44008 -198625 56749 333729 -47044 -15287
17893a20288C4568b53617r0270j8704b2019j80891e9262G3049J58473a05614a6264
$$ -120288 34568 -253617 -343887 -362591 -22019 -202910 -59262 73049 231522 -105614 -16264
17881A99026b51170i0248j32880B48187n225l7013C0453J19238n5150O2143a93533
$$ 199026 -251170 -90248 -223128 248187 242962 205949 30453 149691 94541 156684 -193533
17869b49513R0609a9480O213C25243h0593n9612B873P885J35835a90089j16864
$$ -249513 -158904 -19480 -13267 325243 -80593 -140205 2873 10758 146593 -190089 -306953
17858c06953H644b13493R5224c4758o7910F3449a48507O8684A79752J95253e820
$$ -306953 8644 -213493 -118269 -34758 -102668 63449 -148507 -79823 179752 375005 -5820
17846B30690r8164R5102a81789M3931A08158P5978f801B97415b60549p6850k89086
$$ 230690 132526 227628 -181789 -137858 108158 184136 -6801 297415 -260549 -337399 -626485
17835f26485D7607b682A44401m1545c6661C7857N5322h6025I4387J58441C6900
$$ -626485 47607 -2682 144401 102856 -36661 37857 93179 -86025 94387 252828 36900
17823d24323e1523j09582M5916J376G3321A4422e3995a2087B72294b54942e8998
$$ -424323 -51523 -161105 -115189 -113813 73321 14422 -53995 -12087 272294 -254942 -58998
17811e0827k04399I562Q4144f3169l0611n29964A97765D0389b35611h7382l2851
$$ -50827 -255226 9562 93706 -63169 -93780 -623744 197765 40389 -235611 -87382 -120233
17800a20233H8459N4707a3213j79771B6537R6254c8663M193f16j68579C18258
$$ -120233 88459 143166 -13213 -192984 26537 122791 -38663 -34470 -616 -169195 318258
17788a40362k93506a66748C6560a09408p3624A331P0846h7960B83205a44392j51998
$$ -140362 -433868 -166748 36560 -109408 -183032 1331 72177 -87960 283205 -144392 -296390
17777b96390n4893A39801J67502j05983a0134B61885j10236a76183E238c6906
$$ -296390 -351283 139801 307303 201320 -10134 261885 151649 -176183 5238 -36906
17766B24461A6793b32768d5807j28355d1333B43439i9439B08554b25530Q8916
$$ 224461 16793 -232768 -45807 -174162 -41333 243439 -99439 208554 -225530 -136614
17756a36614A34621D2819L4306O0510a9025l5108B08986c8523l5929B8349p535
$$ -136614 134621 42819 77125 137635 -19025 -54133 208986 -38523 -74452 28349 20814
17745B0814N3264J30171b92681B04449c39277B79587b12988B9379K09764E4286
$$ 20814 74078 204249 -292681 204449 -339277 279587 -212988 29379 239143 54286
17734A31546K37129C622d7538q229j73818B07860l2501I710M12868B3192g6244
$$ 131546 368675 3622 -47538 -55767 -229585 207860 175359 9710 422578 23192 -76244
17722I0846a8721B15563I6168J4632c6195A93067c17441c2595A58589K8003a55006
$$ 90846 -18721 215563 96168 110800 -36195 193067 -317441 -32595 158589 186592 -155006
17710E0728Q3258b44536H1584a43003B05011I5971a71460M780j02558J9561A88055
$$ 50728 133986 -244536 81584 -143003 205011 95971 -171460 -166680 -269238 -249677 188055
17698c1766B85975H263J30205c1900A38269a2792B50151b1066A35192a30364A03886
$$ -31766 285975 8263 138468 -31900 138269 -12792 250151 -21066 135192 -130364 103886
17686a8443a490j74156l50865a00607M9203A03384a28339r456A18834c62120G3605
$$ -18443 -1490 -175646 -526511 -100607 -51404 103384 -128339 -137795 118834 -362120 73605
17674A21885b81959i6208K0989B83756a5598l1135A14572L4365b20023l1285h4894
$$ 121885 -281959 -96208 -75219 283756 -15598 -46733 114572 148937 -220023 -251308 -84894
17662A2574b16821b3143k17602A21773b9834k57468B19885B4739d51063a60000
$$ 12574 -216821 -23143 -240745 121773 -29834 -287302 219885 24739 -451063 -160000
17651A8612a2403H9997b3851C83003h2681b8176j09498r91F9975A9216N3545K58339
$$ 18612 -12403 89997 -23851 383003 -82681 -28176 -137674 -138665 69975 19216 72761 331100
17639C31100b27906B13482C5112c38145B29660f5702C55302a43173k87191a21812
$$ 331100 -227906 213482 35112 -338145 229660 -65702 355302 -143173 -430364 -121812
17628I2500L11388e8014j84776h5229G7724B5653b00544N3398B34439J88095A1196
$$ 92500 403888 -58014 -242790 -85229 77724 25653 -200544 -147146 234439 422534 11196
17616D78597a71687A6150h5683j21161i7198D9750o979A2058a47731B43595g84
$$ 478597 -171687 16150 -85683 -206844 -97198 49750 42771 12058 -147731 243595 -784
17604f1349F0959b2270j26854j55472a49086j73233A56264e1451K4275m7154J3085
$$ -61349 60959 -22270 -149124 -304596 -149086 -322319 156264 -51451 -27176 -74330 -61245
17593f1245j14483I4059e9412q4038C02006B2847a02504I5093J03643b9130H4740
$$ -61245 -175728 94059 -59412 -143450 302006 22847 -102504 95093 198736 -29130 84740
17581b30742A34246J79851b19436d3272A7055c02189Q2759J03294A28359a27410
$$ -230742 134246 314097 -219436 -43272 17055 -302189 -219430 -116136 128359 -127410
17570F0792i9523A55361J50704a61522B39354D1459a66062b2183C60229K9717
$$ 60792 -99523 155361 306065 -161522 239354 41459 -166062 -22183 360229 389946
17560C89946m9141Q9126A22314P8524D0130c0362A56755a47584I4816D5763Q8523
$$ 389946 340805 429931 122314 200838 40130 -30362 156755 -147584 94816 45763 134286
17549A34286m9941k2855f4998k53861B02680c0047j6144k6657A7451J52590F4451
$$ 134286 84345 61490 -64998 -318859 202680 -30047 -46191 -72848 17451 170041 64451
17537c1156J1732A45725a2401A90727b77632B86726b81943D7402f5054c0099l3886
$$ -31156 -19424 145725 -12401 190727 -277632 286726 -281943 47402 -65054 -30099 -63985
17526f3985l0477A48426J45717a68748P2291B30041a3839B52814d2438B87592
$$ -63985 -94462 148426 294143 -168748 -96457 230041 -13839 252814 -42438 287592
17515d9493b4525n5872C44528I3066b29740h4905B09926l7075k7697a16934B55793
$$ -49493 -24525 -80397 344528 93066 -229740 -84905 209926 172851 145154 -116934 255793
17503H0196f9761B39433p5675o136J70402a09949B78713F2134M74216d7863B72051
$$ 80196 -69761 239433 163758 157622 328024 -109949 278713 62134 536350 -47863 272051
17491H7752b13106B07660K51460a77622a3395B49315B2949J74373L91205B80406
$$ 87752 -213106 207660 459120 -177622 -13395 249315 22949 197322 588527 280406
17480h5031E9993d0449B94836h3398B90698n6539J0937O9924A8266L70825q5235
$$ -85031 59993 -40449 294836 -83398 290698 234159 245096 315020 18266 389091 303856
17469C03856j04065b56803A91435D2336A4321e8719K8240D34799G2610K59154
$$ 303856 199791 -256803 191435 42336 14321 -58719 -30479 434799 72610 331764
17459C31764g1596B6536K75008L09163a18044E16815I4571J65100f913B35804
$$ 331764 -71596 26536 301544 610707 -118044 516815 94571 259671 -6913 235804
17448A31638K76911j07759j21680J01661a067A24243N6370j8095P0656m9719d7650
$$ 131638 408549 300790 179110 280771 -1067 124243 180613 162518 233174 183455 -47650
17436A79820A7733e0999A88540a78368A83713M9062j2091P2211G7266j1061P3578
$$ 179820 17733 -50999 188540 -178368 183713 232775 220684 292895 77266 66205 139783
17425A39783j6747K45201l5412A45885o9070L50883A72614e9999F1774M63361
$$ 139783 123036 368237 332825 145885 76815 427698 172614 -59999 61774 525135
17415E25135j73796L08827g3180B89460j824A31434M39334F7113c372A11248m9651
$$ 525135 351339 660166 -73180 289460 287636 131434 570768 67113 -3372 111248 61597
17404F1597K31989a09354A5060a10716D06708A77777B467J56863J00747E687R4595
$$ 61597 293586 -109354 15060 -110716 406708 177777 2467 159330 260077 5687 100282
17393A00282A7163J29901k6289K99870a01376A8555L78468G116J46686J5790k5360
$$ 100282 17163 147064 120775 420645 -101376 18555 397023 7116 153802 169592 144232
17382A44232L45585b659r4934c2333D63874A39492O8338J65727b03113B15440
$$ 144232 489817 -2659 -97593 -32333 463874 139492 207830 373557 -203113 215440
17371E74950B8735M6275L15463a24093H4282K84234A35936K40670a39111A01967
$$ 574950 28735 75010 390473 -124093 84282 368516 135936 376606 -139111 101967
17360G0004h0684C301J03582J25953G4220f95E0915J49264E29L63358J6072E2758
$$ 70004 -80684 3301 106883 232836 74220 -695 50915 200179 529 363887 379959 52758
17347B14643o4618o0043p414J50822J21964a16403A98793E9322K59273G9301p437
$$ 214643 150025 89982 82568 233390 355354 -116403 198793 59322 318595 79301 71864
17336G1864P9102P2040P3290o0718J27815A58139F9232J81745g5329M098i841
$$ 71864 150966 223006 296296 235578 363393 158139 69232 250977 -75329 -71231 -9841
17324F4224R5987i7914A84774J85797j14657c7691A50085J54740h0304A58419
$$ 64224 160211 -97914 184774 370571 255914 -37691 150085 304825 -80304 158419
17313B49550r2881J3015a12583C20710K9309o2786A14449K09754A44526K05997
$$ 249550 156669 169684 -112583 320710 350019 287233 114449 324203 144526 350523
17303C50523A01987L6659D2872M25741r4313d4580C3400J00483K35746A54941
$$ 350523 101987 138646 42872 468613 374300 -44580 33400 133883 369629 154941
17292e8759m2373j60825D69674k15276J33310b38643C74732g8804B3781O8696
$$ -58759 -101132 -261957 469674 254398 387708 -238643 374732 -78804 23781 92477
17282I2477K19286A37096a21614A22385e4775B06346Q237J13732j49798J55218
$$ 92477 311763 137096 -121614 122385 -54775 206346 214583 328315 178517 333735
17272C33735a29915A26777L21112B14181J61855e7577G5949Q2528R6203A18982
$$ 333735 -129915 126777 447889 214181 376036 -57577 75949 158477 254680 118982
17261D49267B17604K41101A78061P7127m3020H7930C8202b3826B93226j8183e3890
$$ 449267 217604 458705 178061 255188 212168 87930 38202 -23826 293226 275043 -53890
17249C3380K96366g2104A01065M34302F5298L36794j61363o5796g1515B59842
$$ 33380 329746 -72104 101065 535367 65298 402092 240729 174933 -71515 259842
17238B91937J0346I4483f6035B44983b8211j7126C8393J78253J06223K01667a4163
$$ 291937 302283 94483 -66035 244983 -28211 -45337 38393 216646 322869 524536 -14163
17226A21296a51678D54715E4757M7808J60492j02803m5455N43678j60166A5126
$$ 121296 -151678 454715 54757 102565 263057 160254 114799 658477 498311 15126
17215C23119A50832N0444K37727C8419L37733j72933p0726J59377I2393L7916
$$ 323119 150832 201276 439003 38419 376152 203219 132493 291870 92393 130309
17205A30309J21485l3595q1280K4139B6621M3109d0955b0381f317G7735l6826
$$ 130309 251794 218199 136919 161058 26621 69730 -40955 -20381 -6317 77735 40909
17194D0909J37893N05338l35948A35846J60458n6402J89570a14213k192B82121
$$ 40909 178802 684140 348192 135846 296304 239902 429472 -114213 -116405 282121
17183F71770A28270L21797q1052p5067p9148A00303L5531Q1332n9764J37029A45481
$$ 671770 128270 450067 369015 293948 214800 100303 135834 217166 157402 294431 145481
17171C54371P3801n5026o4494F3877J47736J46421P9984j75760k7001M5545J28905
$$ 354371 428172 373146 308652 63877 211613 358034 438018 262258 235257 280802 409707
17160D09707n0830A29238M85099j23693n5697j723A63916K74392A60752K48164
$$ 409707 358877 129238 614337 490644 434947 433224 163916 438308 160752 408916
17150D08916f4892D10892j89415K09268p5279a13116F6440O42406j25050A93666
$$ 408916 -64892 410892 221477 430745 355466 -113116 66440 708846 583796 193666
17139B83695J12183H8847K46935j52009m6885L20625n3551m0705A64838K03021
$$ 283695 395878 88847 335782 183773 136888 457513 403962 363257 164838 367859
17129C67859d5345E81790A22418Q4955O6706A35323J67784A28349J43952j19209
$$ 367859 -45345 581790 122418 207373 274079 135323 303107 128349 272301 153092
17119A53092k2561J47665n8575n8424J74644J01163K05048k38572p9180E4129
$$ 153092 130531 278196 219621 161197 335841 437004 642052 403480 324300 54129
17108C31797K32505n7340A14327M24954Q3843k51899j71261M57227k61381L17911
$$ 331797 564302 506962 114327 539281 623124 371225 199964 657191 395810 713721
17098G13721k06811k42720K55400j66771j17805K67797J34112k48461j87430K35394
$$ 713721 506910 264190 519590 352819 235014 502811 636923 388462 201032 436426
17088D36426O6234J8060K72173p9667k40063r0837J08944M3621k08185K08966
$$ 436426 502660 520720 792893 713226 473163 382326 491270 534891 326706 535672
17078E35672j66684j36599K60984j81145L70112o9264J1326j39603m5145k8021
$$ 535672 368988 232389 493373 312228 682340 613076 624402 484799 439654 411633
17068D11633A50435M2008L26967j69310K97925k10181j75477K93248m1512q8667
$$ 411633 150435 192443 519410 350100 648025 437844 262367 555615 514103 425436
17058D25436L38726o9684j85113j60513o1023q1728J64423l1322J16601J02616
$$ 425436 764162 694478 509365 348852 287829 206101 370524 339202 455803 558419
17048E58419j3820j93041K51212A58879J81513L44892C12734P25323m83569j64632
$$ 558419 544599 351558 602770 158879 340392 685284 312734 1038057 554488 389856
17038C89856J16412M6113J5958j72214m1463J23871J92915r6969j33919J96345
$$ 389856 506268 552381 568339 396125 354662 478533 671448 574479 440560 636905
17028F36905k64705K63444j78127L99915M0452l03147r5268L46006K45126D78560
$$ 636905 372200 635644 457517 857432 897884 594737 499469 845475 1090601 478560
17017F09897k10956J35781J48578J08292k47943J50090p6343P4743j49396r7196
$$ 609897 398941 534722 683300 791592 543649 693739 617396 692139 542743 445547
17007D45547J29602Q8383N2059J08863C59038J20672O9466L97770o3698k16295
$$ 445547 575149 663532 715591 824454 359038 479710 549176 946946 883248 666953
16997F66953p4763l8256J72659l17891J15722O3848J02644m3545J34227k41647
$$ 666953 592190 553934 726593 408702 524424 588272 690916 647371 781598 539951
16987E39951K55420J29374j90237J18816N3254C56736K85822K53062k08703J92370
$$ 539951 795371 924745 734508 853324 906578 356736 642558 895620 686917 879287
16977H79287k85016K10735K69803l95509J69891L4117J32161j27213J10708n0978
$$ 879287 594271 805006 1074809 679300 849191 883308 1015469 888256 998964 947986
16967I47986k0867J16628k79407l83Q4334j00690j30844M25972j83119L868K7453
$$ 947986 927119 1043747 764340 763957 848291 747601 616757 1042729 859610 863478 890931
16956H90931k60890N70127j59543j17575N7232r1210K27077J00407M7224l94759
$$ 890931 630041 1200168 1040625 923050 980282 889072 1116149 1216556 1263780 869021
16946H69021J89065j72276O0089J45870j61015M43632j73051k47390J24435k28394
$$ 869021 1058086 885810 945899 1091769 930754 1374386 1201335 953945 1078380 849986
16936H49986K24483j1176J82046j19357j00921N00048l16879j45529m7418K82020
$$ 849986 1074469 1063293 1245339 1125982 1025061 1525109 1208230 1062701 1015283 1297303
16926A297303l8774M512k8953O6728J94452m44276J54647o8967K28699K15518
$$ 1297303 1258529 1263041 1234088 1300816 1495268 1050992 1205639 1136672 1365371 1580889
16916A580889j44978M2360j15218K25252j33672k59436L53053k75228J05593K9798
$$ 1580889 1435911 1478271 1363053 1588305 1454633 1195197 1548250 1273022 1378615 1408413
16906A408413j96957K54475J33088j2361K6578j99246L06392q9797J41512k84029
$$ 1408413 1211456 1465931 1599019 1586658 1613236 1413990 1720382 1630585 1772097 1488068
16896A488068J5553L77585k8801j75774k66446J68221M68249m42120J64447J37200
$$ 1488068 1503621 1881206 1852405 1676631 1410185 1578406 2046655 1604535 1768982 1906182
16886A906182L2485L0230j80355L84076q5806K72478l98285n1784J80413m3035
$$ 1906182 1938667 1968897 1788542 2172618 2086812 2359290 1961005 1909221 2089634 2046599
16876B046599p7913L15747j28816j17362k5590J85146l5378K40281m24401O80661
$$ 2046599 1968686 2284433 2155617 2038255 2012665 2197811 2162433 2402714 1978313 2658974
16866B658974m62519K60744M027O8900M5167m66555M66576p850J97268m7205j74615
$$ 2658974 2196455 2457199 2461226 2530126 2575293 2108738 2575314 2567464 2764732 2717527 2542912
16855B542912L64199J24064j38854p0305K74279k88570M24663n43810L42079J68912
$$ 2542912 2907111 3031175 2892321 2822016 3096295 2807725 3232388 2688578 3030657 3199569
16845C199569j65331p3625L72582J75006o42846O31824P3610q0833K74575j65639
$$ 3199569 3034238 2960613 3333195 3508201 2865355 3497179 3570789 3489956 3764531 3598892
16835C598892J05058j74385J77351L42570m5464j21645P5763K14773K30640O0801
$$ 3598892 3703950 3529565 3706916 4049486 4004022 3882377 3958140 4172913 4403553 4464354
16825D464354l7580J54212J63835K51908k92100M249J71338j2585j6399M07926
$$ 4464354 4426774 4580986 4744821 4996729 4704629 4708878 4880216 4867631 4851232 5259158
16815E259158M05035k88292J82853K10013j7759J15209K17799j52596J6853N63190
$$ 5259158 5664193 5375901 5558754 5768767 5751008 5866217 6084016 5931420 5948273 6511463
16805F511463L8943J22359J84080o1450J63133K04966M66117l49655L12020J64756
$$ 6511463 6550406 6672765 6856845 6795395 6958528 7163494 7629611 7279956 7591976 7756732
16795G756732K98764M6731Q4428L41275K25159J46734Q2088M18674K27459L47795
$$ 7756732 8055496 8102227 8186655 8527930 8753089 8899823 8981911 9400585 9628044 9975839
16785I975839J14141P02855P9862M58162j79598P66633K46934J27338L75835L37102
$$ 9975839 10089980 10792835 10872697 11330859 11151261 11917894 12164828 12292166 12668001 13005103
16775A3005103P57283J22003K72652P15282k92201J092018M91874P13248J66570
$$ 13005103 13762386 13884389 14157041 14872323 14580122 15672140 16164014 16877262 17043832
16766A7043832J006156N90200O84655N18723Q51170M43948Q44302P33154R94460
$$ 17043832 18049988 18640188 19324843 19843566 20694736 21138684 21982986 22716140 23710600
16757B3710600J109160P91563J081159J107789J239804J153348J136774J489664
$$ 23710600 24819760 25611323 26692482 27800271 29040075 30193423 31330197 32819861
16749C2819861J545372J521531J884252J647827J938160J907417K473647K280768
$$ 32819861 34365233 35886764 37771016 39418843 41357003 43264420 45738067 48018835
16741D8018835K588984K924071K757735K601964L089117L557054M234328L790252
$$ 48018835 50607819 53531890 56289625 58891589 61980706 65537760 69772088 73562340
16733G3562340M568546M332617N362099N030112N406682N708793O420595O672716
$$ 73562340 78130886 82463503 87825602 92855714 98262396 103971189 110391784 117064500
16725A17064500O676445P303382O921741P245009P360345P304099P130801O102211
$$ 117064500 123740945 131044327 137966068 145211077 152571422 159875521 167006322 173108533
16717A73108533N642880N023795L918378L088511J745910O64217o86703k094410
$$ 173108533 178751413 183775208 187693586 190782097 192528007 193192224 192505521 190411111
16709A90411111l121550m180519n055356o269065o568731o742537p574911p279746
$$ 190411111 187289561 183109042 178053686 171784621 165215890 158473353 150898442 143618696
16701A43618696p547773p523077p385279o824438o392646o310165n760863n936044
$$ 143618696 136070923 128547846 121162567 114338129 107945483 101635318 95874455 89938411
16693H9938411n464397m953474m185095m450495m235149l783754l453356l156808
$$ 89938411 84474014 79520540 75335445 70884950 66649801 62866047 59412691 56255883
16685E6255883k952249k946417k460065k416771k442104k414851j702066k194989
$$ 56255883 53303634 50357217 47897152 45480381 43038277 40623426 38921360 36726371
16677C6726371j495080j225840k028716j397057j192041j525427j298382p92405
$$ 36726371 35231291 34005451 31976735 30579678 29387637 27862210 26563828 25771423
16669B5771423j021107j176528r35120p01982j055374j225771k91126p83262p28132
$$ 25771423 24750316 23573788 22638668 21936686 20881312 19655541 19364415 18581153 17853021
16660A7853021o50277o41156n90744o55224l80352m45021n62571l50625l46708
$$ 17853021 17202744 16561588 15970844 15315620 14935268 14490247 13927676 13577051 13230343
16651A3230343k44754l12839o83225m81018m67599q4920j90350m45463k86572
$$ 13230343 12985589 12672750 11989525 11508507 11040908 10955988 10765638 10320175 10033603
16642A0033603m17663m00060P9368j40846j97956n62338l81476R9492l75762j98375
$$ 10033603 9615940 9215880 9295248 9154402 8956446 8394108 8012632 8112124 7736362 7537987
16632G537987l63469M69829m65545l80863q821k46577k84155J08854r8402k29078
$$ 7537987 7174518 7644347 7178802 6797939 6789118 6542541 6258386 6367240 6268838 6039760
16622F039760l06912L43737n59088P1659k59676l65503K07718k95994L35879o37799
$$ 6039760 5732848 6076585 5517497 5589156 5329480 4963977 5171695 4875701 5211580 4573781
16612D573781J80068j11979k46905M70413o63456l723J11348m49697J02283J79185
$$ 4573781 4753849 4641870 4394965 4865378 4201922 4198199 4309547 3859850 3962133 4141318
16602D141318k48218O7733L1146l29782p0291q5169J31205n22291J20951M51803
$$ 4141318 3893100 3960833 3991979 3662197 3591906 3506737 3637942 3115651 3236602 3688405
16592C688405o32625L41655o1913l29034J82687m89665P4931J70528J14077j15493
$$ 3688405 3055780 3397435 3335522 3006488 3189175 2699510 2774441 2944969 3059046 2943553
16582B943553m67669L78340j15138m8710l06057J41340J79667j93372k20822j94759
$$ 2943553 2475884 2854224 2739086 2690376 2384319 2525659 2705326 2511954 2291132 2096373
16572B096373R4316L69127j98021k10094n7414p4286J91105j36883p6257O720
$$ 2096373 2190689 2559816 2361795 2151701 2094287 2020001 2211106 2074223 1997966 2004686
16562B004686n6449k07084O21605p71860M18103j85611Q997R9355j38931j25429
$$ 2004686 1948237 1741153 2362758 1590898 2009001 1823390 1832387 1931742 1792811 1667382
16552A667382p6925L7178K21428N2647k23742j98516O0269J08668j66376n5569
$$ 1667382 1590457 1627635 1849063 1901710 1677968 1479452 1539721 1648389 1482013 1426444
16542A426444j50536J02381N42914n13813J88387j42352L7772j60678r3518J30249
$$ 1426444 1275908 1378289 1921203 1407390 1595777 1453425 1491197 1330519 1237001 1367250
16532A367250j25826j62085R1383J23702k07161J03187J89384J3042j54480N01903
$$ 1367250 1241424 1079339 1170722 1294424 1087263 1190450 1379834 1392876 1238396 1740299
16522A740299l10766k89368k34845N18K93451N9879k54871K23434j6559m40458
$$ 1740299 1429533 1140165 905320 905838 1199289 1259168 1004297 1227731 1211172 770714
16512G70714M73279j56764j57368k2678J29271J59944m24540J89417L5581j51323
$$ 770714 1243993 1087229 929861 907183 1036454 1196398 771858 961275 996856 845533
16502H45533O2789J8517L5495R9393l41143K3816K92041r7948r3476n7602Q736
$$ 845533 908322 926839 962334 1061727 720584 744400 1036441 938493 845017 787415 796151
16491G96151m5371L99057m85361M39004l44679j01282L20047k86996J72974j83912
$$ 796151 750780 1149837 664476 1103480 758801 657519 977566 690570 863544 679632
16481F79632R0964J11743J17049l37834J70901J56520j87974l36461J65613J77816
$$ 679632 770596 882339 999388 661554 832455 988975 801001 464540 630153 807969
16471H07969k54403J06552J52839j44690L6724k16054L1793L12023k48436l3261
$$ 807969 553566 660118 812957 668267 704991 488937 520730 832753 584317 551056
16461E51056K89677k47513L73916m52650K55206L331C73848J60593K38059l59092
$$ 551056 840733 593220 967136 514486 769692 773023 373848 534441 772500 413408
16451D13408r3999K81418L6553m2673B35871J04140K67668p7299P208B01119J86655
$$ 413408 319409 600827 637380 594707 235871 340011 607679 530380 537588 201119 387774
16440C87774M045P174L08710l26363C1325L27119j69713N51225j45137k04353
$$ 387774 391819 398993 707703 381340 31325 358444 188731 739956 594819 390466
16430C90466J03472r8272K51838B61664J85707N3722j19325n6496N13812m12871
$$ 390466 493938 395666 647504 261664 447371 501093 381768 325272 839084 426213
16420D26213I6001L41515R2253l1128k22383R1524J52327j60611j7977m6755k2848
$$ 426213 96001 437516 529769 498641 276258 367782 520109 359498 341521 294766 271918
16409B71918M7127J3879K8530P2394j01660J29858L32734B88039q9784L18632
$$ 271918 319045 332924 361454 433848 332188 462046 794780 288039 198255 516887
16399E16887A78691m056l9100Q2194M0303p2962K08509L0671J6467r1660l2911
$$ 516887 178691 174635 135535 217729 258032 185070 393579 424250 440717 349057 316146
16388C16146j39426p8888J78360O8746P9388n8879I85J56789J51120l013D0969
$$ 316146 176720 97832 276192 344938 424326 365447 985 157774 308894 305881 40969
16376B98013B0048d3293C62672j61826L73101A06625M18391H0639k0010K39673
$$ 298013 20048 -43293 362672 200846 573947 106625 525016 80639 60629 300302
16366C00302m2598Q105J56757j05998K43727B53749j08767k9071R8818B3066J71953
$$ 300302 257704 265809 422566 316568 560295 253749 144982 115911 214729 23066 195019
16355A95019J04459l3199J8503r3725J18562c4515A37579D1707J76661k6722o4250
$$ 195019 299478 266279 284782 191057 309619 -34515 137579 41707 218368 191646 127396
16344A27396K65743A20953J86924J21413A77780f0188C28690Q8422D8489J81933
$$ 127396 393139 120953 307877 429290 177780 -60188 328690 417112 48489 230422
16334B30422b2983B75609b3424C33440I5719m5637J49614n7642F7059K52194a39182
$$ 230422 -22983 275609 -23424 333440 95719 50082 199696 142054 67059 319253 -139182
16322H4952O3381J40398j36761D1074c834A99387a10046B53520r1008M17094k70893
$$ 84952 148333 288731 151970 41074 -3834 199387 -110046 253520 162512 579606 308713
16311C08713J25985d4905C14825j23836P0966A27309C7658L63298B197N0703P6971
$$ 308713 434698 -44905 314825 190989 261955 127309 37658 400956 2197 52900 129871
16300A29871g0767B44307a15151A48505a40331B20763o5646a26783E0842M18361
$$ 129871 -70767 244307 -115151 148505 -140331 220763 155117 -126783 50842 469203
16290D69203r8148C6669J43252J62805a18631A79487L14161j0330B15092K2653
$$ 469203 371055 36669 179921 342726 -118631 179487 493648 483318 215092 237745
16280B37745F5011K41961k2896I3409J67437e0628C84005j87832g5392C09990
$$ 237745 65011 306972 284076 93409 260846 -50628 384005 196173 -75392 309990
16269G1314a03879H4017a53923A78280E1514K32296j35357f954B54181A12350
$$ 71314 -103879 84017 -153923 178280 51514 283810 148453 -6954 254181 112350
16258C51563F7771C1243h4594C54234g38B34317H9453r840J93620b176A73138
$$ 351563 67771 31243 -84594 354234 -738 234317 89453 79613 273233 -2176 173138
16246A51953e1071A68166D0286K44773n094J1263G8911g1727o9112C9144J76123
$$ 151953 -51071 168166 40286 285059 279965 291228 78911 -71727 -140839 39144 215267
16235B15267A01067a30089A1032c2733k1195A17827r321J42483d67830A02495
$$ 215267 101067 -130089 11032 -32733 -53928 117827 108506 250989 -467830 102495
16224A03069J16415F2502J86300d7258A31137K22575j60726e7315D4735h4428
$$ 103069 219484 62502 248802 -47258 131137 353712 192986 -57315 44735 -84428
16213H6238f623j02908c6466B12432a4583q7500j78832d4802D05038r9551a00761
$$ 86238 -6623 -109531 -36466 212432 -14583 -102083 -280915 -44802 405038 305487 -100761
16201A01503a14626d7025p5634C46543b64061I5249B3035A1368N8707F938e3171
$$ 101503 -114626 -47025 -122659 346543 -264061 95249 23035 11368 70075 6938 -53171
16189a26279A6355R1735a14121m6092g7816C09399N0630h6862d775l67110A74340
$$ -126279 16355 108090 -114121 -160213 -77816 309399 360029 -86862 -4775 -371885 174340
16177D7577K23852a67339D882Q9990m7158i9830A33169g1711B23688a78673H927
$$ 47577 271429 -167339 4882 94872 47714 -99830 133169 -71711 223688 -178673 8927
16165D02301j42377c6847r5012B63453l5545a22729d1867B1798a11004C18704
$$ 402301 259924 -36847 -131859 263453 227908 -122729 -41867 21798 -111004 318704
16154d1810A40207g4171k0442E005a18781M5398B84164o3816g2865G2067J29444
$$ -41810 140207 -74171 -94613 5005 -118781 -73383 284164 220348 -72865 72067 201511
16143B01511o6766e2698A63353o6826J29708b04691D6806A8920a5674k0438j2852
$$ 201511 134745 -52698 163353 96527 226235 -204691 46806 18920 -15674 -36112 -48964
16132d8964j43113b1268G7402J9095b33121A9680J57910R0850j17938a04391A89389
$$ -48964 -192077 -21268 77402 96497 -233121 19680 177590 268440 150502 -104391 189389
16120b1020j55205L7539k8759A44219o0540A1856a61369f2193k18390e2369A82453
$$ -21020 -176225 -138686 -167445 144219 83679 11856 -161369 -62193 -280583 -52369 182453
16108c11820G5003a602I5892D4320a40161G3667M3901K0713o7691B6046O9427
$$ -311820 75003 -1602 95892 44320 -140161 73667 117568 138281 70590 26046 95473
16097I5473a08704B3811P3594c26179A53506d7600j33005c8549l00873J01753
$$ 95473 -108704 23811 97405 -326179 153506 -47600 -180605 -38549 -339422 -237669
16087b37669j19521E2163J85409G0217c82365a15844B84466a38864J3139a1497
$$ -237669 -357190 52163 237572 70217 -382365 -115844 284466 -138864 -125725 -11497
16076A17400C5026K50983Q854a51169M7972d4335j00845a2215o3992c4312g047
$$ 117400 35026 286009 294863 -151169 -103197 -44335 -145180 -12215 -76207 -34312 -7047
16064a03439l06989f4541B06562c03514a19237A113h0375j37845P1625f8078A67845
$$ -103439 -410428 -64541 206562 -303514 -119237 1113 -80375 -218220 -146595 -68078 167845
16052g3797B24987H3294b96202A1794a24913e9500B21541a30161j90017G2060
$$ -73797 224987 83294 -296202 11794 -124913 -59500 221541 -130161 -320178 72060
16041a7198j6394o7366l9458C30163e5756o3047G5529a15123D0908a78268B04493
$$ -17198 -33592 -100958 -140416 330163 -55756 -118803 75529 -115123 40908 -178268 204493
16029a35318b7882B90049E4008J13672c04302A31331N3926b5374I432a55096A39811
$$ -135318 -27882 290049 54008 167680 -304302 131331 185257 -25374 9432 -155096 139811
16017A2531a24151r530k470A06083J55749a07692q4439C04401c2255r9663A04380
$$ 12531 -124151 -133681 -136151 106083 261832 -107692 -192131 304401 -32255 -131918 104380
16005A64964c72613C41311J34918a1453j30247P0617n198A53376D3967e8381B30182
$$ 164964 -372613 341311 476229 -11453 -141700 -71083 -76281 153376 43967 -58381 230182
15993D3491J7584P1348a41047O6212C09875a46864F8586C1277e0018C58033q204
$$ 43491 61075 132423 -141047 -74835 309875 -146864 68586 31277 -50018 358033 349829
15982C49829E3624L15534o1960A34790J0416n5309P2166K387a37990N6078A6369
$$ 349829 53624 369158 307198 134790 145206 89897 162063 164450 -137990 -81912 16369
15970D3288h1965B5235M2877P621e3719l84777A10176a96377B2523J08590D8730
$$ 43288 -81965 25235 68112 75733 -53719 -438496 110176 -196377 22523 131113 48730
15958A36526l7553a01755j44547j2536G0135d3258A20032l8614K21366a29150
$$ 136526 98973 -101755 -246302 -258838 70135 -43258 120032 81418 302784 -129150
15947F0213N0412m6519a43775B29372b7939o6070d631n2785j40518g8576d685
$$ 60213 110625 64106 -143775 229372 -27939 -94009 -4631 -57416 -197934 -78576 -4685
15935c2474p83J2830C5538c8140k8003j32789L853A91688F4348k2024b05727j06960
$$ -32474 -33257 -20427 35538 -38140 -66143 -198932 -195079 191688 64348 42324 -205727 -312687
15923c12687J46363k2075B04071a17066Q71e2418o592K5309A52433a45135k43278
$$ -312687 -166324 -188399 204071 -117066 -116195 -52418 -59010 -33701 152433 -145135 -388413
15912c88413J55189m9656a34768K6358A31483D9431b11149A7115f3762D6590K44378
$$ -388413 -233224 -282880 -134768 -108410 131483 49431 -211149 17115 -63762 46590 290968
15901B90968c26652J22948A72948b29420m984E4436i3550A23136A2495b83833
$$ 290968 -326652 -203704 172948 -229420 -234404 54436 -93550 123136 12495 -283833
15890B084J41554L5841A0339O9086C9499P9863l0198a18766j72681E5061k2317
$$ 2084 143638 179479 10339 79425 39499 119362 89164 -118766 -291447 55061 32744
15879C2744g1295p0525D2933a60776L6722H2636a26057n7076f4386e756A19193
$$ 32744 -71295 -141820 42933 -160776 -124054 82636 -126057 -183133 -64386 -5756 119193
15867A93839m2664e14116E0018b50924E2793c03437Q3197f3616j43305i7093C0224
$$ 193839 151175 -514116 50018 -250924 52793 -303437 -220240 -63616 -206921 -97093 30224
15855a98900O3219K5043n6201j0078l316J5930B07155c89532H3685d1989k46635
$$ -198900 -135681 -110638 -166839 -176917 -180233 -164303 207155 -389532 83685 -41989 -288624
15844b88624J1110j21224i1296C7411F229J80569d2270C1298J86473R8111b40969
$$ -288624 -277514 -398738 -91296 37411 6229 186798 -42270 31298 217771 315882 -240969
15832a83400A2020N5527C0777J8301a9663B8602f7939A52397f2713D8346a27403
$$ -183400 12020 67547 30777 49078 -19663 28602 -67939 152397 -62713 48346 -127403
15820C06170m5774d515H9021J35044a41397J0035E7611f3699A13273a19547A09702
$$ 306170 260396 -4515 89021 224065 -141397 -131362 57611 -63699 113273 -119547 109702
15808B26764b17900J06749A75311o7657a098j14631a7591A90034l1117B2150J22937
$$ 226764 -217900 -111151 175311 107654 -1098 -115729 -17591 190034 158917 22150 145087
15797A45087a83062l3793i6069c5291F2579a65550G4828J01727b4146j97353J08391
$$ 145087 -183062 -216855 -96069 -35291 62579 -165550 74828 176555 -24146 -221499 -113108
15786a13108A18641b44135A43324b87298A90436a60892e7695G6380a66627f7679
$$ -113108 118641 -244135 143324 -287298 190436 -160892 -57695 76380 -166627 -67679
15775C0352c1212j23929c9890I7394M5860b54712Q0788k476L4738b6478C20458
$$ 30352 -31212 -155141 -39890 97394 143254 -254712 -173924 -176400 -141662 -26478 320458
15763b3830j2133I2447a43534r70A93564d8451j14531O6736C1953K73493m1275
$$ -23830 -35963 92447 -143534 -144504 193564 -48451 -162982 -96246 31953 305446 264171
15752B64171E4039A9589J16490O8927p1178c0590F311J50811J46311F3601d02329
$$ 264171 54039 19589 136079 205006 133828 -30590 6311 157122 303433 63601 -402329
15740c21154J23897R5345j645A36632n9193c1026n52795A89560c13536o055c8160
$$ -321154 -197257 -101912 -103557 136632 77439 -31026 -583821 189560 -313536 -319591 -38160
15728A19296k8080d9597C6814e8100M613k62667B0858b85468I5883i6105k3631
$$ 119296 91216 -49597 36814 -58100 -53487 -316154 20858 -285468 95883 -96105 -119736
15717a19736C95832A6316R8374a91411l9156j29654J21157g949m5803k24098B23595
$$ -119736 395832 16316 114690 -191411 -230567 -360221 -239064 -7949 -53752 -277850 223595
15705A44732b5942j24953B11485d3457E4364a23452A49847g8165j6946B777M0882
$$ 144732 -25942 -150895 211485 -43457 54364 -123452 149847 -78165 -95111 2777 43659
15694D3659a46389N4734b534j75657A44811J06006p0215J55210a4510j49475B06494
$$ 43659 -146389 -91655 -2534 -178191 144811 250817 180602 335812 -14510 -163985 206494
15682e4345f579j16685l0448j04854a08634e479k46258c549j02452d2097A09513
$$ -54345 -6579 -123264 -153712 -258566 -108634 -5479 -251737 -3549 -106001 -42097 109513
15670A95563L0818b26694Q7055p3244A16585J12290c4442D6420J80614c22855
$$ 195563 226381 -226694 -139639 -212883 116585 228875 -34442 46420 227034 -322855
15659A82599b80134H3622b46594H8844M8250n1834C6636b53237k32958A84224
$$ 182599 -280134 83622 -246594 88844 137094 85260 36636 -253237 -486195 184224
15648b91079e3006A55594a66995A85859G4652K2585a38731I3514c37037B1634
$$ -291079 -53006 155594 -166995 185859 74652 97237 -138731 93514 -337037 21634
15637B50998a78665P1204A77212G7011B8902g2707a7673D133a73246A02037J01450
$$ 250998 -178665 -107461 177212 77011 28902 -72707 -17673 4133 -173246 102037 203487
15626B03487L271J7469j09279a35535A56765b69337C5331b12463A0855b62412
$$ 203487 206758 224227 114948 -135535 156765 -269337 35331 -212463 10855 -262412
15615G16647g1465E8553j9913a6456n3855k19279I9876e8697B56482D1236a03147
$$ 716647 -71465 58553 38640 -16456 -70311 -289590 99876 -58697 256482 41236 -103147
15603c8280j5550j43845q3803a8415E4353L9824c1971A45421b41968D3721c0365
$$ -38280 -53830 -197675 -281478 -18415 54353 94177 -31971 145421 -241968 43721 -30365
15591B02690b04308j51034A49654D9338b03375A75655F6954M1806j229J0913Q2021
$$ 202690 -204308 -355342 149654 49338 -203375 175655 66954 108760 107531 118444 200465
15580B00465p1541b97550F0859c86097D1094i5088g544B51326b28365R2881q2859
$$ 200465 128924 -297550 60859 -386097 41094 -95088 -7544 251326 -228365 -135484 -218343
15569b18343C2864g829o9690E4113L1428b54078a3936A06195K50816c50783A5999
$$ -218343 32864 -7829 -77519 54113 85541 -254078 -13936 106195 357011 -350783 15999
15557B02635f5228A35974b9459l7231i608k91099d0216r3165C1270c73660g8276
$$ 202635 -65228 135974 -29459 -66690 -9608 -300707 -40216 -133381 31270 -373660 -78276
15545A7777c63809a23472M7946F6939J79814a02338A04307h1025H8731g3111A20011
$$ 17777 -363809 -123472 -75526 66939 246753 -102338 104307 -81025 88731 -73111 120011
15533A12177a02151j67818G7596a64870n8128A38651a78556O2472D0512a91682
$$ 112177 -102151 -269969 77596 -164870 -222998 138651 -178556 -116084 40512 -191682
15522a39989A03890d34499D3164J35338N8446i01A0544f0879q4393B2403K15901
$$ -139989 103890 -434499 43164 178502 236948 -901 10544 -60879 -145272 22403 238304
15511B38304j09783a50207O8775A9806b41263p8243J24829A34757i0245F725h1264
$$ 238304 128521 -150207 -81432 19806 -241263 -319506 -194677 134757 -90245 6725 -81264
15499b0229j03575k3185A82521p6483a25493A90089J0890d4681D27795b80901
$$ -20229 -123804 -146989 182521 106038 -125493 190089 200979 -44681 427795 -280901
15488C8508a86415G8370k7450a11094B5469d9008A93437a403j12743p3170A07330
$$ 38508 -186415 78370 50920 -111094 25469 -49008 193437 -1403 -114146 -187316 107330
15476E1520B5634a02175m2135p9626i8244L6173j5938k55279E4863P7525L7110
$$ 51520 25634 -102175 -144310 -223936 -98244 -62071 -78009 -333288 54863 132388 169498
15465A69498a23269A40281f786j9634F3796J53468a18940a7191k3876n9370C87
$$ 169498 -123269 140281 -6786 -26420 63796 217264 -118940 -17191 -41067 -100437 387
15453b04018A22444c8117A54340h7247o9882A55604a18785L9047A7283Q9606j3787
$$ -204018 122444 -38117 154340 -87247 -157129 155604 -118785 -79738 17283 106889 93102
15442I3102a59076a793A2221O3197a56376I6446L0051J40120a49265H6633b4771
$$ 93102 -159076 -1793 12221 75418 -156376 96446 126497 266617 -149265 86633 -24771
15430e2336h214j97126B16116p6178e7260j3187F853J56311N9575c01758A43076
$$ -52336 -8214 -205340 216116 139938 -57260 -70447 6853 163164 222739 -301758 143076
15418G249c7964I8860J18195A01038i2143G1143i9742j72553Q4813C51987H4013
$$ 7249 -37964 98860 217055 101038 -92143 71143 -99742 -272295 -187482 351987 84013
15406B1424K0454c43117i0771o9435M7715B16130F0702N0023a72650l530A16353
$$ 21424 41878 -343117 -90771 -160206 -112491 216130 60702 110725 -172650 -176180 116353
15394b66965G0126h090l52734C3981m637K45950F0461j6489d30256B51116C9653
$$ -266965 70126 -8090 -360824 33981 29344 275294 60461 43972 -430256 251116 39653
15382a38209A4114f5969C7423J12110j8257B9244a2431j04362m2392n1075b3955
$$ -138209 14114 -65969 37423 149533 131276 29244 -12431 -116793 -159185 -210260 -23955
15370A36215O4117b93420A91531k5376a73918e9518D5001M94439a32706m3906
$$ 136215 200332 -293420 191531 166155 -173918 -59518 45001 539440 -132706 -176612
15360a76612A09036i9359O892B33676c966l01543e45n7986A48963d41191R7736
$$ -176612 109036 -99359 -92467 233676 -3966 -305509 -545 -58531 148963 -441191 -343455
15349c43455H0382R3656N1237d35932A98281B7775d3962J5897A02334D5909a46029
$$ -343455 80382 174038 225275 -435932 198281 27775 -43962 -28065 102334 45909 -146029
15337A90547K07282B0947J98806p8436C1495e6194G669c54013C14445p8767n7684
$$ 190547 397829 20947 219753 141317 31495 -56194 7669 -354013 314445 235678 177994
15326A77994G8492a70597e9291B56561I9354b1722j34677k6017O7705F7197a07786
$$ 177994 78492 -170597 -59291 256561 99354 -21722 -156399 -182416 -114711 67197 -107786
15314D4029P171P812K09330j06411J23362a65270O0931E0815K01323o0186h8647
$$ 44029 51200 59012 268342 161931 285293 -165270 -104339 50815 252138 191952 -88647
15302d9362B4938f9863B56006e7505B57622R8302a9912q0272E0535J20802o7798
$$ -49362 24938 -69863 256006 -57505 257622 355924 -19912 -100184 50535 171337 103539
15291A03539P5143b04370A47706b41841E050M8780B767J25882j8234Q3373B7951
$$ 103539 178682 -204370 147706 -241841 5050 53830 2767 128649 110415 193788 27951
15279H9319J77480C5826J11245f4428B48474a25906A46875J65a0077B81551A30305
$$ 89319 266799 35826 147071 -64428 248474 -125906 146875 147040 -10077 281551 130305
15267a36456B80307n5268C1156R4093J29382j09861n3476L01536a43511B32471
$$ -136456 280307 225039 31156 125249 254631 144770 91294 392830 -143511 232471
15256A50887a23379P819c1081B74882K08617j88960o8678Q47857K39830k27016
$$ 150887 -123379 -115560 -31081 274882 483499 294539 225861 1073718 1313548 1086532
15246A086532L85411l74145B47018r6317r559K5492d06862A79357B8718g6231
$$ 1086532 1471943 1097798 247018 150701 141142 166634 -406862 179357 28718 -76231
15235G4341f8427l3917k2117k50397i7207C22397n7886i6462j95577A69269A7805
$$ 74341 -68427 -102344 -124461 -374858 -97207 322397 264511 -96462 -292039 169269 17805
15223f6369c1940C4128a21935A8151J71233g0146f726H6778M6482a8685G49227
$$ -66369 -31940 34128 -121935 18151 189384 -70146 -6726 86778 133260 -18685 749227
15211G8570R3246J08444q3717a25933A06470h916j81k04312R212c489A27980J80478
$$ 78570 171816 280260 196543 -125933 106470 -8916 -9097 -213409 -204197 -3489 127980 308458
15199C08458a56580A17612J07792e1584C8450J70184J35587a15297N2497B41373
$$ 308458 -156580 117612 225404 -51584 38450 208634 344221 -115297 -62800 241373
15188C03474B4504J04584K31204J0335A69658n9537J3022d1897B59354B5599N7598
$$ 303474 24504 129088 360292 370627 169658 110121 123143 -41897 259354 25599 83197
15177H3197J33546K3355o2019b52477i2969A66023O1371r1243J39406b2178B69569
$$ 83197 216743 240098 178079 -252477 -92969 166023 227394 136151 275557 -22178 269569
15165A02871J83798a59170F950Q1865a05090o292J9274B34721D4048L41046b2161
$$ 102871 286669 -159170 6950 88815 -105090 -111382 -92108 234721 44048 385094 -22161
15153d2124A74528L25556F5946A5207Q7179N9582n6593b28308m7061B1090a4111
$$ -42124 174528 500084 65946 15207 102386 161968 105375 -228308 -275369 21090 -14111
15141e9938i237C80306a7224m3456B34223A8571a98461C10774o4284F1542j7242
$$ -59938 -9237 380306 -17224 -60680 234223 18571 -198461 310774 246490 61542 44300
15130D4300c23328A41470o5139c8125j16419J1174A722a03159I2133Q4947l0591
$$ 44300 -323328 141470 76331 -38125 -154544 -143370 1722 -103159 92133 177080 146489
15119A46489K50998b13383B5192i7032A7585K31453b42719C44953a6850B45757
$$ 146489 397487 -213383 25192 -97032 17585 249038 -242719 344953 -16850 245757
15108h7116G2487P2974F4253O276a12429D91226A67260l1823O2343H7204J51176
$$ -87116 72487 145461 64253 70529 -112429 491226 167260 135437 197780 87204 238380
15097B38380d3188F0529d9450D81216A70873a34942b8311a1839j53085C00831
$$ 238380 -43188 60529 -49450 481216 170873 -134942 -28311 -11839 -164924 300831
15086b7175C83514j53144a60222A51881O6030a02429B01613O2056D7950N0965
$$ -27175 383514 230370 -160222 151881 217911 -102429 201613 263669 47950 98915
15076I8915i6228f5A61815l1357R1540j04306L97547A45452i458E2229a08389
$$ 98915 -96228 -65 161815 130458 221998 117692 515239 145452 -9458 52229 -108389
15064C80095B7591K85943b36379A80081i8761c0422l30774B13697J03274j10602
$$ 380095 27591 313534 -236379 180081 -98761 -30422 -361196 213697 316971 206369
15054B06369l7846A9114J06722j1526R0083a22281B05075j3390b8395C07441D1808
$$ 206369 168523 19114 125836 114310 204393 -122281 205075 191685 -28395 307441 41808
15042A91172J82797A17322f464D11889k5793a70926A33633J2760K2736J42620
$$ 191172 373969 117322 -6464 411889 386096 -170926 133633 146393 169129 311749
15032C11749A2002M00084K78491B62089H7465i1426C5753L68943j77861J9537
$$ 311749 12002 412086 690577 262089 87465 -91426 35753 404696 226835 246372
15022B46372l8776O9410P3476j26867c287A46774J0317J05643o3420G5281a28146
$$ 246372 207596 277006 350482 223615 -3287 146774 157091 262734 199314 75281 -128146
15010b42825H2732K22240a571C99181j51866C8772K65072J5922j20839j8187Q1947
$$ -242825 82732 304972 -1571 399181 247315 38772 303844 319766 198927 180740 262687
14999B62687m1204j06489L25018A40952e7644A32678l3188L00694d9713B49936
$$ 262687 221483 114994 440012 140952 -57644 132678 99490 400184 -49713 249936
14988B03292e8053b4540C26144A27651J14054J9361p8283F6912J46110l422J18935
$$ 203292 -58053 -24540 326144 127651 241705 261066 182783 66912 213022 209600 328535
14977C28535a187B40694J1122r1954K79595A35439R8956k3859c8448A69858o6033
$$ 328535 -1187 240694 251816 159862 439457 135439 234395 210536 -38448 169858 103825
14966A03825L33258O0949k30754J39100A96406L4924L3471r9671a09244A98151
$$ 103825 437083 498032 267278 406378 196406 231330 264801 165130 -109244 198151
14955D60347j82912I3674K62033B5387K90926B0773M28261k14608J99015q8693
$$ 460347 277435 93674 355707 25387 316313 20773 449034 234426 433441 344748
14945C44748j6599l0667i2539B29114H1744J59748O0494k1452j9247n3803M4328
$$ 344748 328149 297482 -92539 229114 81744 241492 301986 280534 261287 207484 251812
14934B51812L0383Q3155q5936l591A29937O6776q9007J47702j672P1613b8248
$$ 251812 282195 365350 279414 275823 129937 196713 107706 255408 253736 325349 -28248
14922G25690B01388J48098c4657C49111R227A50944L9579E3284J0289K85149r7465
$$ 725690 201388 349486 -34657 349111 358338 150944 190523 53284 63573 348722 251257
14911B51257k4536l5132L21804j69973j34136J79877m5519R5349b4543C61162
$$ 251257 226721 191589 513393 343420 209284 389161 343642 438991 -24543 361162
14900E01705j24610J0847J55669B58099O5639m2292m502D0294b8278E18384k50188
$$ 501705 377095 387942 543611 258099 323738 281446 276944 40294 -28278 518384 268196
14889B68196J94185K61820B37197H1298K87004I9302K14201j24031M18386a15511
$$ 268196 462381 724201 237197 81298 368302 99302 313503 189472 607858 -115511
14878B29328M44992B44163K27678A12679Q5541K95775j50602J23651m5957J98628
$$ 229328 674320 244163 471841 112679 198220 493995 343393 467044 421087 619715
14868F19715M1013C23141j0260J69808k24415R3365J42940j68987q2044M21396
$$ 619715 660728 323141 312881 482689 258274 351639 494579 325592 243548 664944
14858F64944A52453J60066n8706N2500L89043l20686r1633P7579j45589M96542
$$ 664944 152453 312519 253813 306313 695356 374670 283037 360616 215027 711569
14848G11569A22523K87271I0852M58197j23771A51361J60197J69289j52655M34625
$$ 711569 122523 409794 90852 549049 425278 151361 311558 480847 328192 762817
14838G62817C45471J56474B43089J59685J68531A40001M02877k46928K23959Q9161
$$ 762817 345471 501945 243089 402774 571305 140001 542878 295950 519909 609070
14828F09070j50511j01617k6327J57709j45502J49116r1725A57387K88336B02440
$$ 609070 458559 356942 330615 488324 342822 491938 400213 157387 445723 202440
14817E02537k17741J96099I1619N49581I0012L60656K19625J36646l65722L9269
$$ 502537 284796 480895 91619 641200 90012 450668 670293 806939 441217 480486
14807D80486l8802j07470L87636o8113j81734j01755L00210j77297r0868K80988
$$ 480486 441684 334214 721850 653737 472003 370248 670458 493161 402293 683281
14797F83281j74414q9874J32417r1733o3273o7462L80641k85027J28508J76493
$$ 683281 508867 418993 551410 459677 396404 328942 709583 424556 553064 729557
14787G29557B23241K41794J31114j61786l2480P93q3049Q6934j16047L04044j17385
$$ 729557 223241 465035 596149 434363 401883 402676 319627 406561 290514 594558 477173
14776D77173k05305J35298n9212K93511j52739m5451L22987l44966J653J68469
$$ 477173 271868 407166 347954 641465 488726 443275 766262 421296 422949 591418
14766E91418L1768J69704l43580J37698J15339B85779L48865j09033O0815L0601
$$ 591418 623186 792890 449310 587008 702347 285779 634644 525611 586426 617027
14756F17027q3840n645j35522j19325M23438J12725j05576m182K64658m71306
$$ 617027 533187 527542 392020 272695 696133 808858 703282 699100 963758 492452
14746D92452Q8694j11839J36221M3655J53718j52781q9666Q5916J84197k21022
$$ 492452 581146 469307 605528 649183 802901 650120 560454 646370 830567 609545
14736F09545k1458L90630j05382j15702k64672K65442n2165R5935j29985k19796
$$ 609545 588087 978717 873335 757633 492961 758403 706238 802173 672188 452392
14726D52392K15146K91426l53317r5104J98818K56567M5725l02511K77438j99148
$$ 452392 667538 958964 605647 510543 709361 965928 1011653 709142 986580 787432
14716G87432J73343j51323k18368J10098J42756k02704P1851k8126J98189k23452
$$ 787432 960775 809452 591084 701182 843938 641234 713085 684959 883148 659696
14706F59696J55400j39394J80109D13394O8656L357Q5951J89494j51450L15061
$$ 659696 815096 675702 855811 413394 482050 485407 571358 760852 609402 924463
14696I24463j24882l5732J0555J93242k1772J518j93973J24955K80336k58568
$$ 924463 799581 763849 774404 967646 945874 947392 753419 878374 1158710 900142
14686I00142l25870L85988J13223m11885L20914j21992L74540k07061k02397K8550
$$ 900142 574272 960260 1073483 661598 982512 860520 1235060 1027999 825602 854152
14676H54152m729K6478M32552j48300r0379m68100L34023k50733L66208J57467
$$ 854152 849423 875901 1308453 1160153 1069774 601674 935697 684964 1051172 1208639
14666A208639l58491J51995J49872J82140l41092M790l34348P17690l46825K37468
$$ 1208639 850148 1002143 1152015 1334155 993063 997853 663505 1381195 1034370 1271838
14656A271838K03262l59948L4700P9972j27488k4387Q0836o6018J48533J17545
$$ 1271838 1475100 1115152 1149852 1229824 1102336 1077949 1158785 1092767 1241300 1358845
14646A358845n50670J08154J45373J35405J48508q521J63544k76956j7879n5357
$$ 1358845 808175 916329 1061702 1197107 1345615 1337094 1500638 1223682 1205803 1150446
14636A150446J54222O4329j70621J41498r9822k211R5005J24102k21953J34065
$$ 1150446 1304668 1368997 1198376 1339874 1240052 1237841 1332846 1456948 1234995 1369060
14626A369060j26560L3830K77421q661J63522l64720M8549p0116J18277l16337
$$ 1369060 1242500 1276330 1553751 1545090 1708612 1343892 1392441 1322325 1440602 1124265
14616A124265J00667m8970J0376N85330k69738k27493J67945p3944K9788K22903
$$ 1124265 1224932 1175962 1186338 1771668 1501930 1274437 1442382 1368438 1398226 1621129
14606A621129j18761L13378n1561q9290k45337K91449j63179P0561j32914M29512
$$ 1621129 1502368 1815746 1764185 1674895 1429558 1721007 1557828 1628389 1495475 1924987
14596A924987k49303L58393q07558M92114l36734Q5353L75998k22442L55725l00714
$$ 1924987 1675684 2034077 1226519 1718633 1381899 1467252 1843250 1620808 1976533 1675819
14586A675819J6696l51011M79530J74152Q122m81860N09574m9484j40840L10099
$$ 1675819 1692515 1341504 1821034 1995186 2003308 1521448 2031022 1981538 1840698 2150797
14576B150797k30511J67060P0365j99614j60792J35984m4329L76672j25225M19723
$$ 2150797 1920286 2087346 2157711 1958097 1797305 1933289 1888960 2265632 2140407 2560130
14566B560130m01991M2287K36556l29039M19423L7162p5752j49457N28202N2197
$$ 2560130 2158139 2200426 2436982 2107943 2527366 2564528 2488776 2339319 2867521 2919718
14556B919718q5528N73177p2547M23302P05682M92421R54493J793923N072928
$$ 2919718 2834190 3407367 3334820 3758122 4463804 4956225 5910718 7704641 12777569
14547A2777569J1684690J6318898K907144A8529334G272295k998655j531572l12661
$$ 12777569 24462259 40781157 43688301 18529334 7272295 4273640 2742068 2429407
14539B429407j88291l74605J52737r2176L20825j71607j43666R9175Q3803j37676
$$ 2429407 2241116 1866511 2019248 1927072 2247897 2076290 1932624 2031799 2115602 1977926
14529A977926J57439L68538k62223N1207K9361J5229J27130l3539J19008j26297
$$ 1977926 2135365 2503903 2241680 2292887 2322248 2337477 2464607 2431068 2550076 2423779
14519B423779o0863n6015R6132J91706M35496o45314J28407J93598l0545p8351
$$ 2423779 2362916 2306901 2403033 2594739 3030235 2384921 2513328 2706926 2676381 2598030
14509B598030L31944J28043L1445k61561J5846P0275K07498l01390L28834p1825
$$ 2598030 2929974 3058017 3089462 2827901 2843747 2914022 3121520 2820130 3148964 3077139
14499C077139p5506J76791l76335K74621p8402J83788k37117J11487K98062P4023
$$ 3077139 3001633 3178424 2802089 3076710 2998308 3182096 2944979 3056466 3354528 3428551
14489C428551K08569j090m74948L71523K83300j26692j19834M38297l16896K5336
$$ 3428551 3637120 3636030 3161082 3532605 3815905 3689213 3569379 4007676 3690780 3716116
14479C716116R8985J28909n2251k31797M64321J46900k34817k18519L47299K52490
$$ 3716116 3815101 3944010 3891759 3659962 4124283 4271183 4036366 3817847 4165146 4417636
14469D417636J05312j78894j10252j57817K34149J49838O5026j58414N36027K7578
$$ 4417636 4522948 4344054 4233802 4075985 4310134 4459972 4524998 4366584 4902611 4930189
14459D930189p69495O19234K04803k66823J99729N95643n86447L38255l78841
$$ 4930189 4160694 4779928 4984731 4717908 4917637 5513280 4926833 5265088 4886247
14450D886247L69212L43640j98620k17385N08504J52545k64676P0369L49407p1147
$$ 4886247 5255459 5599099 5400479 5183094 5691598 5844143 5579467 5649836 5999243 5928096
14440E928096J93824J1351k6391r696J77757K68972J04583j8225k439J17511J42015
$$ 5928096 6121920 6133271 6106880 6097184 6274941 6543913 6648496 6630271 6627832 6745343 6887358
14429F887358k4568O8546J25597l0991O36084l44151k16516N95883K2565o9415
$$ 6887358 6862790 6931336 7056933 7025942 7662026 7317875 7101359 7697242 7719807 7650392
14419G650392K17283M55555k50149n4740L82927j35071M00158j3489P9137P7877
$$ 7650392 7867675 8323230 8073081 8018341 8401268 8266197 8666355 8652866 8732003 8809880
14409H809880J51104M66945J56110k8361j51439M36833J14350J67525L23142P1439
$$ 8809880 8960984 9427929 9584039 9555678 9404239 9841072 9955422 10122947 10446089 10517528
14399A0517528K55146M1484K54780L82882r4884n3178O79715M0080J89802L40773
$$ 10517528 10772674 10814158 11068938 11451820 11356936 11303758 11983473 12023553 12213355 12554128
14389A2554128J7780L66289P177K80599K53162L57161L26900k3563K80585J94197
$$ 12554128 12571908 12938197 12945374 13225973 13479135 13836296 14163196 14139633 14420218 14614415
14379A4614415M42299O03004k73706M89745K23977K89575M70499K28129K76645
$$ 14614415 15056714 15659718 15386012 15875757 16099734 16389309 16859808 17087937 17364582
14370A7364582M68600L93934J69158O17700J66578Q22544N002N90872M38950O54462
$$ 17364582 17833182 18227116 18396274 19013974 19180552 20003096 20008098 20598970 21037920 21692382
14360B1692382J61041N06025M88164L34675R53262L54864L20374O18440R50744
$$ 21692382 21853423 22359448 22847612 23182287 24135549 24490413 24810787 25429227 26379971
14351B6379971N51056O81496Q66975Q31303M82573O74853R33953O59672Q78688
$$ 26379971 26931027 27612523 28479498 29310801 29793374 30468227 31402180 32061852 32940540
14342C2940540R89295R26782O65312J100884J181934R95455J022809J172632J392390
$$ 32940540 33929835 34856617 35521929 36622813 37804747 38800202 39823011 40995643 42388033
14333D2388033J130955J415576J280976J779590J305424J542278J803568J720336
$$ 42388033 43518988 44934564 46215540 47995130 49300554 50842832 52646400 54366736
14325E4366736J901456J719641J959851K181285K321218K363976K102922K814580
$$ 54366736 56268192 57987833 59947684 62128969 64450187 66814163 68917085 71731665
14317G1731665K701012K984603K798080L623930K904541L986775L763613L469107
$$ 71731665 74432677 77417280 80215360 83839290 86743831 90730606 94494219 97963326
14309I7963326M537000M382603M631754M954023N651453N492157N848200O128118
$$ 97963326 102500326 106882929 111514683 116468706 122120159 127612316 133460516 139588634
14301A39588634O343704O972031P734658Q048351Q217401Q968230R349802J0091176
$$ 139588634 145932338 152904369 160639027 168687378 176904779 185873009 195222811 205313987
14293B05313987J0586935J1044677J1629688J2252587J3099446J3027304J4240567
$$ 205313987 215900922 226945599 238575287 250827874 263927320 276954624 291195191
14286B91195191J4695478J4588349J5213748J5275328J5118197J5345793J4723214
$$ 291195191 305890669 320479018 335692766 350968094 366086291 381432084 396155298
14279C96155298J3390159J3249721J1758694J0431447Q775064O594585M057133
$$ 396155298 409545457 422795178 434553872 444985319 453760383 460354968 464412101
14272D64412101P15239l327195k590043o817n047534o527637r048819r932748
$$ 464412101 465127340 461800145 459210102 459203285 454155751 447628114 438579295 428646547
14264D28646547j1703229j3446311j4450446j5018830j5408711j5863132j6021854
$$ 428646547 416943318 403497007 389046561 374027731 358619020 342755888 326734034
14257C26734034j5395959j4740829j3885930j4174326j3413396j2679690j2332501
$$ 326734034 311338075 296597246 282711316 268536990 255123594 242443904 230111403
14250B30111403j1401970j1197743j0276291r643106r054094q503979p899697
$$ 230111403 218709433 207511690 197235399 187592293 178538199 170034220 162134523
14243A62134523p531162p266199p107757o401119n812901n158436n451876n405007
$$ 162134523 154603361 147337162 140229405 133828286 128015385 122856949 117405073 112000066
14235A12000066m839468m472601m296421l620194l529723l488743l710702l066139
$$ 112000066 107160598 102687997 98391576 94771382 91241659 87752916 84042214 80976075
14227H0976075l471263k996669k455770k387935k681659k310159k532081j736450
$$ 80976075 77504812 74508143 72052373 69664438 66982779 64672620 62140539 60404089
14219F0404089j743295k583935j653758j858357j494959j295143j659896j439380
$$ 60404089 58660794 56076859 54423101 52564744 51069785 49774642 48114746 46675366
14211D6675366j559289j528124j036431q06969q85213j325273r57591j726432
$$ 46675366 45116077 43587953 42551522 41744553 40859340 39534067 38576476 36850044
14203C6850044n41007j048718p58597l30399j187227j043041p81322j205298n92139
$$ 36850044 36309037 35260319 34501722 34171323 32984096 31941055 31159733 29954435 29362296
14194B9362296n46987o16945p70879l86392q45351q17527m23863p19304q12302
$$ 29362296 28815309 28198364 27427485 27041093 26195742 25378215 24954352 24235048 23422746
14185B3422746j11418q42928l09715p67608m78134l50537m0901m05879p03431
$$ 23422746 23311328 22468400 22158685 21391077 20912943 20562406 20521505 20115626 19412195
14176A9412195J63745r64164k17288l72836l78844j55226l85199m40399j20231
$$ 19412195 19575940 18611776 18394488 18021652 17642808 17487582 17102383 16661984 16541753
14167A6541753p50050K58155n56412n53028k9787k44371J59902n29830l48744
$$ 16541753 15791703 16049858 15493446 14940418 14910631 14666260 14826162 14296332 13947588
14158A3947588o11809J87620o09695j11708N833l56547k52295K09617l04041m74727
$$ 13947588 13335779 13523399 12913704 12801996 12807829 12451282 12198987 12408604 12104563 11629836
14148A1629836j34619k65732j15030j52473K38595l60472l59605k9086k93427
$$ 11629836 11495217 11229485 11114455 10961982 11200577 10840105 10480500 10451414 10157987
14139A0157987q4446l53366Q8264l238k86618r1204k23195J26227j98322l23043
$$ 10157987 10073541 9720175 9808439 9805201 9518583 9427379 9204184 9330411 9132089 8809046
14129H809046n3967k14352K1601q3720q0821J16288j66905l43403k95195J78098
$$ 8809046 8755079 8540727 8562328 8478608 8397787 8514075 8347170 8003767 7708572 7886670
14119G886670m51005L43502o32715J12473J11699l96597N3353J47651l36509j1006
$$ 7886670 7435665 7779167 7146452 7258925 7370624 6974027 7027380 7175031 6838522 6827516
14109F827516j69411o883j09839k8576M5849n52987M04972Q3566m06311M4602
$$ 6827516 6658105 6651222 6541383 6512807 6558656 6005669 6410641 6494207 6087896 6132498
14099F132498l77335K69220j48142k11225M7129J15503m15845Q5013k92985O076
$$ 6132498 5755163 6024383 5876241 5665016 5712145 5827648 5411803 5496816 5203831 5209907
14089E209907J94342j04649o6323o839j5323Q6244j27725J56703n23904J27393
$$ 5209907 5404249 5299600 5233277 5226438 5211115 5297359 5169634 5326337 4802433 4929826
14079D929826n0266R8907o4371p4142k81730l67770M86926k30400Q2459k79022
$$ 4929826 4879560 4978467 4914096 4839954 4558224 4190454 4677380 4446980 4529439 4250417
14069D250417L32292r9759m5701j99929J43533j39386r8995J4220R6893o0742
$$ 4250417 4582709 4482950 4437249 4237320 4380853 4241467 4142472 4156692 4253585 4192843
14059D192843K0752m5340k38859J63555l55055Q3935N1810P3829m96864M2086
$$ 4192843 4213595 4168255 3929396 4092951 3737896 3821831 3873641 3947470 3450606 3492692
14049C492692l29224L46506L73490l42363k1003j25322j14760L61140m75690J57760
$$ 3492692 3163468 3509974 3883464 3541101 3520098 3394776 3280016 3641156 3165466 3323226
14039C323226k57557K49999j70548P0390j14261J50338L0742k12027P0458k33230
$$ 3323226 3065669 3315668 3145120 3215510 3101249 3251587 3282329 3070302 3140760 2907530
14029B907530p9470J47257P1050m8251j5756K9759n41745J91129J61848q8009
$$ 2907530 2828060 2975317 3046367 2998116 2982360 3012119 2470374 2661503 2823351 2735342
14019B735342r4844j78856k32382J80473R8295K84197j82243o9243j10098J34160
$$ 2735342 2640498 2461642 2229260 2409733 2508028 2792225 2609982 2540739 2430641 2564801
14009B564801p8529l7288K33632o71883n1322M02884J05087n78163J88185n4445
$$ 2564801 2486272 2448984 2682616 2010733 1959411 2362295 2467382 1889219 2077404 2022959
13999B022959n4778O69915m63221J67590j80545K4013J41652l31133O89797M16531
$$ 2022959 1968181 2638096 2174875 2342465 2161920 2185933 2327585 1996452 2686249 3102780
13989C102780L97773L863567R591956J6664421J1286197k1292995j1491405m560460
$$ 3102780 3500553 7364120 16956076 33620497 44906694 23613699 12122294 7561834
13981G561834j590647j657547J2406o55297l99410J01379q994p71371K52615j15526
$$ 7561834 5971187 4313640 4326046 3670749 3271339 3372718 3363724 2592353 2844968 2729442
13971B729442n6633N9516k80232J06036j88762J42796j12931k26214K46044k20563
$$ 2729442 2672809 2732325 2452093 2558129 2369367 2512163 2399232 2173018 2419062 2198499
13961B198499J43277k18846r0969O4302r2171J55191j40786J01361k09844m4066
$$ 2198499 2341776 2122930 2031961 2096263 2004092 2159283 2018497 2119858 1910014 1865948
13951A865948r7092K25494j95062P4249j95887O13921l15375l73070L93602l61938
$$ 1865948 1768856 1994350 1799288 1873537 1677650 2291571 1976196 1603126 1996728 1634790
13941A634790M16977J0170m87622R7560J6976j65366N83764o61542L64509m57334
$$ 1634790 2051767 2061937 1574315 1671875 1688851 1523485 2107249 1445707 1810216 1352882
13931A352882M11698L20j11521M6595k06043J14671Q7882l97618M60146N0249
$$ 1352882 1764580 1764900 1653379 1699974 1493931 1608602 1696484 1298866 1759012 1809261
13921A809261j95737r9952N8171j86805J01718K5699k55364N90218m34417J68831
$$ 1809261 1613524 1513572 1571743 1384938 1486656 1512355 1256991 1847209 1412792 1581623
13911A581623j74366l4537J17626j40481k02J92836p0383Q0821p2348p6450J05084
$$ 1581623 1407257 1372720 1490346 1349865 1349663 1542499 1472116 1552937 1480589 1404139 1509223
13900A509223k52621K49279j10572L4749J29905j01702k63465j23421M4368L27462
$$ 1509223 1256602 1505881 1395309 1430058 1559963 1458261 1194796 1071375 1115743 1443205
13890A443205M382k57080L2006Jm1910L61635q1469m62021K6275N35889j91133
$$ 1443205 1447587 1190507 1222513 1222514 1180604 1542239 1460770 998749 1025024 1560913 1369780
13879A369780l31010j46452K76449M03660n58794L26652J82363m37232L7420O0516
$$ 1369780 1038770 892318 1168767 1572427 1013633 1340285 1522648 1085416 1122836 1183352
13869A183352P4751j71536L68109l66270J56990m1014m4972q0207J53806j00429
$$ 1183352 1258103 1086567 1454676 1088406 1245396 1204382 1159410 1079203 1233009 1132580
13859A132580j62491J49495j18897K5536j95204r1455L97347l73082K02898K84118
$$ 1132580 970089 1119584 1000687 1026223 831019 739564 1136911 763829 966727 1250845
13849A250845n52673K06756N789J6805k678o3822J18520k22158L79431j2391j12371
$$ 1250845 698172 904928 910717 927522 924844 861022 979542 757384 1136815 1124424 1012053
13838A012053j03179q2514K84068o0829J2534k09736l01849K58128M3870J72164
$$ 1012053 908874 826360 1110428 1049599 1062133 852397 550548 808676 852546 1024710
13828A024710k19966L07649m90273L71454M8394r5771N8054o8506p3541p438K21515
$$ 1024710 804744 1112393 622120 993574 1041968 946197 1004251 935745 862204 854766 1076281
13817A076281j78268j1671K62845m06636k4316r0755p4605M39267k49133K36462
$$ 1076281 898013 886342 1149187 742551 718235 627480 552875 992142 743009 979471
13807I79471M0491m35651K81834r2570O0604J76088m38032L21890J09274k11590
$$ 979471 1019962 584311 866145 773575 834179 1010267 572235 894125 1003399 791809
13797G91809N7336Q315k30571J42911N9726J27036j07133j8954j91872K80079
$$ 791809 849145 857460 626889 769800 829526 956562 849429 830475 638603 918682
13787I18682l84043P9248L14093l18248J58124l55188L65074J58598J6213q7121
$$ 918682 534639 613887 927980 609732 767856 412668 777742 936340 952553 865432
13777H65432J7519l5942j45146J43917J36029k94489j34151J28001J61482k2842
$$ 865432 882951 847009 701863 845780 981809 687320 553169 681170 842652 819810
13767H19810k06028R2527n8065K25195j95848k06303K57394L09990l67853J33775
$$ 819810 613782 706309 648244 873439 677591 471288 728682 1038672 670819 804594
13757H04594J2180J53080k71545j08227J16717N855r8295R169l120l5281l2398
$$ 804594 816774 969854 698309 590082 706799 712654 614359 623528 620408 585127 552729
13746E52729J87267k81240j98470L52618j88683K81258l8945L9087n870k79114
$$ 552729 739996 458756 260286 612904 424221 705479 666534 705621 699751 420637
13736D20637K23137J83130j71046k0101j12075O050j3727J13760p5485K99637
$$ 420637 643774 826904 655858 635757 523682 529732 516005 629765 554280 853917
13726H53917k31567Q3032A27513K68539L8014J09208o77j53729O0542J41390J55608
$$ 853917 622350 705382 127513 396052 434066 543274 542597 388868 449410 590800 746408
13715G46408l61990K88578j1243k36301j46872L19053L7583l06149J10248K47389
$$ 746408 384418 672996 661753 425452 278580 597633 635216 329067 439315 686704
13705F86704k94384l1535J73365J78038j65626K38270C67766l2404M25045j24640
$$ 686704 392320 360785 534150 712188 546562 784832 367766 335362 760407 635767
13695F35767l4654j97287j48997L56179j81730J09493B26386J41241K83959j43864
$$ 635767 601113 403826 254829 611008 429278 538771 226386 367627 651586 507722
13685E07722j89112K00528r4975o5129K36057M32189D71605o165j36245L49323
$$ 507722 318610 519138 424163 359034 595091 1027280 471605 465440 329195 678518
13675F78518o1452J11248J05654k37077j03563J53085q3643j21860q2621A11385
$$ 678518 617066 728314 833968 596891 493328 646413 562770 440910 358289 111385
13664C67095L4384J65181r6909r6869K11790B77913L49219j22632J7634j42036
$$ 367095 401479 566660 469751 372882 584672 277913 627132 504500 522134 380098
13654C80098J89083j51435J74034J44910B36547K95448l1882N9955k77226K70820
$$ 380098 569181 417746 591780 736690 236547 531995 500113 560068 282842 553662
13644E53662k25127L4578j12452k3069N89029A60298J45529J92585A74193K86515
$$ 553662 328535 363113 250661 227592 816621 160298 305827 498412 174193 460708
13634D60708j46244J5005J48134J07797M6269j96423J7568L52780C34215J45819
$$ 460708 314464 329469 477603 585400 631669 435246 452814 805594 334215 480034
13624D80034e1431C98077q1781J24087J834J28088k78140A15735M24352F3138
$$ 480034 -51431 398077 316296 440383 442217 570305 292165 115735 540087 63138
13613G70686k26460j09684O3316P029J7518k25804j2696K14940j36615A42500
$$ 770686 544226 434542 497858 504887 522405 296601 283905 498845 362230 142500
13602D73303r4220k3679A37920K98423h3736C92392J54971j69242M05092l49723
$$ 473303 379083 355404 137920 436343 -83736 392392 547363 378121 783213 433490
13592D33490m1432a25684E34175r2403K05144A79096J40163j22622J91411O7003
$$ 433490 392058 -125684 534175 441772 646916 179096 319259 196637 388048 455051
13582D55051j03268A07601L47037A94550M46145j34374j5225j0483k26496n7448
$$ 455051 351783 107601 454638 194550 640695 506321 491096 480613 254117 196669
13572A96669J0780J16038F4927N43098k82730M8724j02645J12361A76160L59882
$$ 196669 207449 323487 64927 608025 325295 374019 271374 383735 176160 536042
13562E36042B17157m5477M1615B8541K29672K24567B22273L10346k21484A9024
$$ 536042 217157 171680 213295 28541 258213 482780 222273 532619 311135 19024
13551A36083J79252J20287J07135B39216M52009B31442L246K21309k03068J52276
$$ 136083 315335 435622 542757 239216 691225 231442 234688 455997 252929 405205
13541D05205K74370p1710A24574M06619F3502a7320F12834m6656k10776j55196
$$ 405205 679575 607865 124574 531193 63502 -17320 612834 566178 355402 200206
13531B00206L62846k59670k2532n989O7878M5067j05942Q9941q7205K3022J2667
$$ 200206 563052 303382 280850 274861 342739 387806 281864 371805 284600 307622 320289
13520C20289J30560n2167A62679J57577R5666A53951F6436J89359P5042p6575
$$ 320289 450849 398682 162679 320256 415922 153951 66436 255795 330837 254262
13510B54262J57163A70172m4068J38490M2852C8488L63869I9817M32902k40533
$$ 254262 411425 170172 126104 264594 307446 38488 402357 99817 532719 292186
13500B92186k0069k5355K5175J19856k6288K60462E0511Q5457J61449o0554b7283
$$ 292186 272117 246762 271937 391793 365505 625967 50511 135968 297417 236863 -27283
13488A1326L89854i329D60805J7349r0340Q5551l6822j14382j6994j26445m164
$$ 11326 401180 -9329 460805 478154 387814 473365 436543 322161 305167 178722 174558
13477A74558n9683p258M88948k82779j33046P9335J72253m7048Q1907A6264L67335
$$ 174558 114875 107617 596565 313786 180740 260075 432328 385280 467187 16264 383599
13466C83599j86375q5988K4969L5676h7276G10574k54354D5526L2611K21319N1922
$$ 383599 197224 111236 136205 171881 -87276 710574 456220 45526 78137 299456 351378
13455C51378O2918B05258L38024D1123c53400D0280J22746O5736a79650C11893
$$ 351378 414296 205258 543282 41123 -353400 40280 163026 228762 -179650 311893
13444B95574I5385K77579j81945K10394A51059i626C71315H7138C7866L67302
$$ 295574 95385 372964 191019 401413 151059 -9626 371315 87138 37866 405168
13434D05168G0013N029M339a89188B93782A14128K21278J3936A59610L03906F834
$$ 405168 70013 75042 79381 -189188 293782 114128 335406 349342 159610 463516 6834
13422H80J55814k8816K30458j5796j63727a89988d4068C92951A96081J74939E4476
$$ 880 156694 127878 358336 342540 178813 -189988 -44068 392951 196081 371020 54476
13410B07612K17536D8714L59096K389j35087I1101K74149A40818J88375M3943
$$ 207612 425148 48714 407810 410199 275112 91101 365250 140818 329193 373136
13400C73136P3806j75186J32333D2787f3996B83660K75795a04283D43735D5151
$$ 373136 446942 271756 404089 42787 -63996 283660 559455 -104283 443735 45151
13389A08868J74593L95619l29796l4096j23953N4456C7604L4005J68357K61164
$$ 108868 283461 679080 349284 315188 191235 245691 37604 71609 239966 501130
13379E01130A85271b24321A91667J09905H7158L00417r6680m6138k2901J28316
$$ 501130 185271 -224321 191667 301572 87158 387575 290895 244757 221856 350172
13369C50172n1610q6698I9229k4983K00381p4927m746H4267K43239r0066J7782
$$ 350172 298562 211864 99229 74246 274627 199700 194954 84267 327506 237440 255222
13358B55222j05111K60271b3135C95807A11537N1714J90132H2385J23815N8946
$$ 255222 150111 410382 -23135 395807 111537 163251 353383 82385 206200 265146
13348B65146l98n2037m6179J61937K19964k57331J88453j87236A38252P3308K03743
$$ 265146 264748 212711 166532 328469 548433 291102 479555 292319 138252 211560 415303
13337D15303A98283q4288b72943A55978b7152B32729K38080i1992C33655k094
$$ 415303 198283 113995 -272943 155978 -27152 232729 470809 -91992 333655 331561
13327C31561n7010G7190g6679A73832n0396L46130k17797K85482A85477i1140
$$ 331561 274551 77190 -76679 173832 123436 469566 251769 537251 185477 -91140
13316I3665a7140D59035n9443i386B48832F3297c0101n0281A12891Q3072b38837
$$ 93665 -17140 459035 399592 -9386 248832 63297 -30101 -80382 112891 195963 -238837
13304C19140j24779J05906J09460A77490R9312a6280B78871a7212A32418O2838
$$ 319140 194361 300267 409727 177490 276802 -16280 278871 -17212 132418 195256
13294A95256Q0649c433H9061J6814k3142L03963A72034j0328K30829A83469a08035
$$ 195256 275905 -3433 89061 105875 82733 386696 172034 161706 392535 183469 -108035
13282a22760B12837j05005k1916h808A83704K99465B32989q3278o7563K25287
$$ -122760 212837 107832 85916 -8808 183704 483169 232989 149711 82148 307435
13272C07435H3035J31695G8228L1633b26112A944a10283k2835j4089b3970A04528
$$ 307435 83035 214730 78228 109861 -226112 1944 -110283 -133118 -147207 -23970 104528
13260I312a02116I077J22298l2167K12301F8762a78620Q3097B16311I7711C3067
$$ 9312 -102116 9077 131375 99208 311509 68762 -178620 -95523 216311 97711 33067
13248F9094c4786h614A51141P5504J85080B9001J82921J03357C6983L0797a81893
$$ 69094 -34786 -8614 151141 226645 411725 29001 211922 315279 36983 67780 -181893
13236H2009a93852A42059J07825H4262j8198J10662L2918M0732J69619a23599
$$ 82009 -193852 142059 249884 84262 66064 176726 209644 250376 419995 -123599
13225I0897a83669D63872E1087J94865c21449A81227j2837M87516a2367p5153
$$ 90897 -183669 463872 51087 245952 -321449 181227 168390 655906 -12367 -87520
13215h7520C7139K32456C3442J36898C3038h6486l98757d9247j75996D59620j08569
$$ -87520 37139 269595 33442 170340 33038 -86486 -485243 -49247 -225243 459620 351051
13204C51051A25448g043q9372E4398j7279L63260A27564J57062j00006K73497
$$ 351051 125448 -7043 -96415 54398 37119 400379 127564 284626 184620 458117
13194D58117B02022G9640b6538A23497O3640b5239B21940J24521e2193n5892H0330
$$ 458117 202022 79640 -26538 123497 187137 -25239 221940 346461 -52193 -108085 80330
13182d05932I0507I730J15708L87509A57873a92427d3959A50556A6035K55247
$$ -405932 90507 9730 125438 512947 157873 -192427 -43959 150556 16035 271282
13172B71282K31786f6336C9547M90632d1962B42269A8423D836b45699A65253a67008
$$ 271282 503068 -66336 39547 530179 -41962 242269 18423 4836 -245699 165253 -167008
13160G4723A8477J60441L768K4025a25511B68817n0747D8839L4832K3239b16524
$$ 74723 18477 178918 182686 206711 -125511 268817 218070 48839 83671 106910 -216524
13148A11528C4950c01959A92500P0091C2531J31109O5874E3222K6026K92721p074
$$ 111528 34950 -301959 192500 262591 32531 163640 229514 53222 79248 371969 364895
13137C64895r7747J22705j49201o621a0471A27887i5897C45177f3737b0362A10692
$$ 364895 267148 389853 240652 234031 -10471 127887 -95897 345177 -63737 -20362 110692
13125a42473D50232A15820h8337c1001j72443j7899d8482B07934h316C5799J6388
$$ -142473 450232 115820 -88337 -31001 -203444 -221343 -48482 207934 -8316 35799 52187
13114E2187b7144l5163o4660e4175C9261a30843B83868d0919a2640j5607r0543
$$ 52187 -27144 -62307 -126967 -54175 39261 -130843 283868 -40919 -12640 -28247 -118790
13103a18790F3614a29923B9219a29254J7676C91588E5446B2109M43583g553I649
$$ -118790 63614 -129923 29219 -129254 -111578 391588 55446 22109 465692 -7553 9649
13091C40503a6983A3171i8004G4770R626B0299i3634G1813Q770K2788a84900A1471
$$ 340503 -16983 13171 -98004 74770 84396 20299 -93634 71813 80583 103371 -184900 11471
13078e3376A18292J21773L7489g671n0263j20956A1085O1298N4146o1748a69993
$$ -53376 118292 240065 277554 -7671 -57934 -178890 11085 72383 126529 64781 -169993
13066F5485R4567d8480N581B24643c29836B10956m5072q1535b9954D6350K49882
$$ 65485 160052 -48480 -42899 224643 -329836 210956 165884 84349 -29954 46350 296232
13055B96232n7645J9745b4192A97905l8935b99456O4804B42617a29173A31646
$$ 296232 238587 258332 -24192 197905 158970 -299456 -234652 242617 -129173 131646
13044E6649K1388i6376A76516a08562B22761a99637b8962J0377D7221a41012B45771
$$ 56649 78037 -96376 176516 -108562 222761 -199637 -28962 -18585 47221 -141012 245771
13032I7774h5200j88765F99603A5293L03361p2207A4673K83015r2126J54732I1102
$$ 97774 -85200 -273965 699603 15293 318654 246447 14673 297688 205562 360294 91102
13020D65373E4440K21872b43164C96891G2369K64067p693g4427D4992a00600M1943
$$ 465373 54440 276312 -243164 396891 72369 336436 328743 -74427 44992 -100600 -58657
13009e8657B80917A14603K30780D8394R3312A1102J04058E1546A3329L23888e6836
$$ -58657 280917 114603 345383 48394 141706 11102 115160 51546 13329 337217 -56836
12997f9538j09974E01887A59708D9251b51461b9706B08620N9155d7452A56092
$$ -69538 -179512 501887 159708 49251 -251461 -29706 208620 267775 -47452 156092
12986A66932K09311I4338P81k0895L9022R4638r8066c1118A04925J34890k9637
$$ 166932 376243 94338 95119 74224 113246 207884 109818 -31118 104925 239815 210178
12975B10178H5303N6901a72610b1836j31413m9538D6460J07401n36M2527N3410
$$ 210178 85303 142204 -172610 -21836 -153249 -202787 46460 153861 153325 195852 249262
12964B49262H6345C322d00238I2564D2997J7096J50431D0790f0089A6372J19999
$$ 249262 86345 3322 -400238 92564 42997 60093 210524 40790 -60089 16372 136371
12953A36371a91435A64371f0204m1882j36574H2045l145a00491B9086a17270C3106
$$ 136371 -191435 164371 -60204 -102086 -238660 82045 78900 -100491 29086 -117270 33106
12941b55617d7476r76E215a51712A31998h4234A45219K3667g5412A64049J07385
$$ -255617 -47476 -48452 5215 -151712 131998 -84234 145219 168886 -75412 164049 271434
12930B71434r4305k0824K05040A53876h5516C63636a8021o2242A22086E6977K31960
$$ 271434 177129 156305 361345 153876 -85516 363636 -18021 -80263 122086 56977 288937
12919B88937c9231A45947Q9469a10740B8857J14918o6112J6219J96940a06994
$$ 288937 -39231 145947 235416 -110740 28857 143775 77663 93882 290822 -106994
12908b55064j51734A33476K04465a48292N5606C51411E8283R8988a46669A98793
$$ -255064 -406798 133476 337941 -148292 -92686 351411 58283 157271 -146669 198793
12897a0155m7582n1976j432B13433J6074b28095B35741A07649K8941F5378c7941
$$ -10155 -57737 -109713 -111145 213433 229507 -228095 235741 107649 136590 65378 -37941
12885b0554H7661L7386f1703k76837B14715c1249k6853B95804b5177k18243j87057
$$ -20554 87661 125047 -61703 -338540 214715 -31249 -58102 295804 -25177 -243420 -430477
12874d30477D46223A97746a65762H3784e2982B08021f6602B82033m3568C9175
$$ -430477 446223 197746 -165762 83784 -52982 208021 -66602 282033 238465 39175
12863E3368d0093C48084b14128f5793B30319b93129Q3607k9840K3478f991j1986
$$ 53368 -40093 348084 -214128 -65793 230319 -293129 -209522 -239362 -215884 -6991 -18977
12852a8977j07210j5438e3255B41528P080e454k3792F3215J38238a43926o4271
$$ -18977 -126187 -141625 -53255 241528 248608 -5454 -29246 63215 201453 -143926 -208197
12841b08197E7909M4713a12231A33955a68150g5415j29325h1943k86459E4867
$$ -208197 57909 102622 -112231 133955 -168150 -75415 -204740 -81943 -368402 54867
12830A48183a1485E3762b5210B1587L15902A3644e0461A75928A1571d6703A41251
$$ 148183 -11485 53762 -25210 21587 337489 13644 -50461 175928 11571 -46703 141251
12818A99261b1225p2763J3849r2223P7334A6481a39604C3393J22789L49733A62646
$$ 199261 -21225 -93988 -80139 -172362 -95028 16481 -139604 33393 156182 505915 162646
12806a65302m5836A2552K50636h8785B76289F9178C2554a13073C38817a31905
$$ -165302 -211138 12552 263188 -88785 276289 69178 32554 -113073 338817 -131905
12795A1213b51594L1633H1925a37927E1852e5790n6133m553J4045M3152H8707
$$ 11213 -251594 -219961 81925 -137927 51852 -55790 -111923 -116476 -102431 -59279 88707
12783b6824C21930A33407f1090B82253a880B00191G7128c09974a19080C63777
$$ -26824 321930 133407 -61090 282253 -1880 200191 77128 -309974 -119080 363777
12772A83017D0385K78095a52551q5205i3522H7762a4340A61569a27876b7724P887
$$ 183017 40385 318480 -152551 -237756 -93522 87762 -14340 161569 -127876 -27724 -19837
12761a9837j35134C0633e2996A35771b42252A61381B7973K05368B2057J41095
$$ -19837 -154971 30633 -52996 135771 -242252 161381 27973 233341 22057 163152
12751A63152a20758B154J28168i5801A70553a39045A43042K05004e380b269B31043
$$ 163152 -120758 2154 130322 -95801 170553 -139045 143042 348046 -5380 -2269 231043
12739A18747K20529b6863j44640f2869D08189A57359j4373a57556L2822C6103
$$ 118747 339276 -26863 -171503 -62869 408189 157359 142986 -157556 -124734 36103
12728A96217a82932r8861J30784g863A75434m8233J80193j04655c41749C77428
$$ 196217 -182932 -281793 -151009 -7863 175434 127201 307394 202739 -341749 377428
12717A98978A6586J06791M753a70708C7385N67261i0759L19H4727K61823o8777
$$ 198978 16586 123377 128130 -170708 37385 604646 -90759 -90440 84727 346550 277773
12706B77773J74903B11166J88071j20763c3036A3269L19021A10556A00L7408J23540
$$ 277773 452676 211166 399237 278474 -33036 13269 332290 110556 100 37508 161048
12695A61048h8577o1249k7804C6678c34169B99989A46034h4965C58228A28198
$$ 161048 -88577 -149826 -177630 36678 -334169 299989 146034 -84965 358228 128198
12684B8264R4706a1064j78637B42620N855j11932a29551A32556L0683L4385A9959
$$ 28264 122970 -11064 -189701 242620 248475 136543 -129551 132556 163239 197624 19959
12672C70579b8424A61341m2247B8134J96937G0532a90190B01440E2697J92312
$$ 370579 -28424 161341 119094 28134 225071 70532 -190190 201440 52697 245009
12662B45009c3061B92242a8213k2498j55031a214C32290a63900F8700J36373c129
$$ 245009 -33061 292242 -18213 -40711 -195742 -1214 332290 -163900 68700 205073 -3129
12650A64943J76425q8656P7092j16189E0195K14147r9664K00024E4428P3961J75581
$$ 164943 341368 252712 329804 213615 50195 264342 164678 364702 54428 128389 303970
12639C03970i9940j00693B83521e2703A2891f2428K8090G7197a14073D1202J17827
$$ 303970 -99940 -200633 283521 -52703 12891 -62428 -34338 77197 -114073 41202 159029
12628A59029L19105d2400D1847b3711A99221i6807D13503A57799E5704J49365
$$ 159029 478134 -42400 41847 -23711 199221 -96807 413503 157799 55704 205069
12618B05069c8802n8082C72923a4039A37340B0814L15401D3561a20598j6367A17256
$$ 205069 -38802 -96884 372923 -14039 137340 20814 336215 43561 -120598 -136965 117256
12606B8180K51337k7657c4196A40394l8419K37971f0523B20078f5213B77600A16596
$$ 28180 279517 251860 -34196 140394 101975 339946 -60523 220078 -65213 277600 116596
12594G7336e1899B41310D8051M7067f428F7155j0248h2014B65953a23183b6563
$$ 77336 -51899 241310 48051 95118 -6428 67155 56907 -82014 265953 -123183 -26563
12582H113g6991m1151H8615L18785D129L18028A41767a17000A85118b24842A44853
$$ 8113 -76991 -118142 88615 407400 4129 322157 141767 -117000 185118 -224842 144853
12570A17784a10350c7193k0937j0509k99197i2333G6808a09523A03032R8732h3638
$$ 117784 -110350 -37193 -58130 -68639 -367836 -92333 76808 -109523 103032 201764 -83638
12558f2601H3460a24762d9545C382J61475J18105f5228C14570h0931L4451k51987
$$ -62601 83460 -124762 -49545 3382 164857 282962 -65228 314570 -80931 -46480 -298467
12547b98467f4242B30622a38226C5638h8005j67988G9485a33506M6000H4603J93458
$$ -298467 -64242 230622 -138226 35638 -88005 -255993 79485 -133506 -87506 84603 278061
12536B78061a67503J62L2080D97556a65402A01985b58253a10767f787r9783B63648
$$ 278061 -167503 -167341 -135261 497556 -165402 101985 -258253 -110767 -6787 -106570 263648
12524H6456L7163c58309a73982K2451A32706o2278C0746d9560I6925b4092B97240
$$ 86456 123619 -358309 -173982 -151531 132706 70428 30746 -49560 96925 -24092 297240
12512c7578n8386C05267h1699m5227L0754G9818J11706b3081C1099a5075k14824
$$ -37578 -95964 305267 -81699 -126926 -96172 79818 191524 -23081 31099 -15075 -229899
12501b29899H3264j416A7099K48921F6839J64049d2443B83054D9522a750A0005
$$ -229899 83264 81848 17099 266020 66839 230888 -42443 283054 49522 -1750 10005
12489a42824B46560B2127e4711o2107A23183a09513N564r0392j74562A33196A4355
$$ -142824 246560 22127 -54711 -116818 123183 -109513 -103949 -194341 -368903 133196 14355
12477b44999D1482g8969D2505g3042q564R970c1548H965O0971a06021C15592a73470
$$ -244999 41482 -78969 42505 -73042 -81606 -71636 -31548 8965 69936 -106021 315592 -173470
12464a94195A38151a74291A83093c0672F5805a92729e9465H7191e5987A78792
$$ -194195 138151 -174291 183093 -30672 65805 -192729 -59465 87191 -55987 178792
12453A22062L7852n1506a04913C4692b2896A24147c23989P9811A21520c69273
$$ 122062 159914 108408 -104913 34692 -22896 124147 -323989 -244178 121520 -369273
12442b4371j3801r6505A3154L98627a94706H0138J29159E2141a78031A0835J1003
$$ -24371 -38172 -134677 13154 411781 -194706 80138 209297 52141 -178031 10835 21838
12431B1838b108D1899O2920L09605G3496B6855L05486E8666K13233A13898L7583
$$ 21838 -2108 41899 104819 414424 73496 26855 332341 58666 271899 113898 151481
12420A51481n5572d68199a70102N8175j0388j34908A51872c52714A0111J81004
$$ 151481 95909 -468199 -170102 -111927 -122315 -257223 151872 -352714 10111 191115
12410A91115c40554B2467h6898B7741a30363h914A50318L6480h6886B8521b35668
$$ 191115 -340554 22467 -86898 27741 -130363 -8914 150318 186798 -86886 28521 -235668
12398b3374j83624j38237i9949H0059P3896J27639c13202M649C1144K43817b17413
$$ -23374 -206998 -345235 -99949 80059 153955 281594 -313202 -308553 31144 274961 -217413
12386a52634G8655L8735g2523r5054A09198n3042M7364h7541A54898M512C2018
$$ -152634 78655 117390 -72523 -167577 109198 56156 103520 -87541 154898 159410 32018
12374a2043l81559E6399c8295k66352A43574a5554B10578q5572d62059C17354
$$ -12043 -393602 56399 -38295 -304647 143574 -15554 210578 125006 -462059 317354
12363B3946O5288a13978G0962c7843C6109K53333F8790a38831B91513E3602L03918
$$ 23946 89234 -113978 70962 -37843 36109 289442 68790 -138831 291513 53602 357520
12352C57520H376K91790a11677K9942L2082D4954f7534C527a01417L8515A96704
$$ 357520 8376 300166 -111677 -81735 -49653 44954 -67534 3527 -101417 -62902 196704
12340A8173a56777O8959F5039a54391q7596B08819g7325A78204h8189A56743b1578
$$ 18173 -156777 -87818 65039 -154391 -241987 208819 -77325 178204 -88189 156743 -21578
12328B27239A07114N1787a80089D19386j04645h443k47853A26668o3295J05887
$$ 227239 107114 158901 -180089 419386 314741 -8443 -256296 126668 63373 169260
12318A69260A5387a6458C46982j43740b63475A03944f1825G3960e3435A68299
$$ 169260 15387 -16458 346982 203242 -263475 103944 -61825 73960 -53435 168299
12307h9341j57819P6928a4576f164p3234A26155c30819P1325H5967a60414N1438
$$ -89341 -247160 -170232 -14576 -6164 -79398 126155 -330819 -259494 85967 -160414 -108976
12296a08976A33437a24801p96B59774J89606g2021D9606f4103b3222j64755B59576
$$ -108976 133437 -124801 -125597 259774 449380 -72021 49606 -64103 -23222 -187977 259576
12284a95852A1861J09673m4317d29714C3829b40800B54722a38917E2251K60937
$$ -195852 11861 121534 77217 -429714 33829 -240800 254722 -138917 52251 313188
12274C13188A07060K51031G30K48113a61562A72996O3946a49773j47400o9437
$$ 313188 107060 358091 730 248843 -161562 172996 236942 -149773 -297173 -366610
12264c66610a23017a5088c661k94207B49223a082C30366d0559k25694B42146a27007
$$ -366610 -123017 -15088 -3661 -297868 249223 -1082 330366 -40559 -266253 242146 -127007
12252e0682a0999B34375a34027F4744O1246J29059p3462D1623a96136i6424B90941
$$ -50682 -10999 234375 -134027 64744 125990 255049 181587 41623 -196136 -96424 290941
12240a43476I2826g9638l37593B55020J04244j42229A6513J45384a43043A08158
$$ -143476 92826 -79638 -417231 255020 359264 217035 16513 161897 -143043 108158
12229I4653e5640I4158a92444B19058q5931L07560A44458M70650B03061J1137
$$ 94653 -55640 94158 -192444 219058 133127 440687 144458 615108 203061 214198
12219B14198J20544a0215F4566d4774C62027k6897a71845D11474G1992a21017
$$ 214198 334742 -10215 64566 -44774 362027 335130 -171845 411474 71992 -121017
12208G2665J73667K91463A37231L04568i6502A85052J86033k8890j11032K00K20692
$$ 72665 246332 537795 137231 441799 -96502 185052 371085 342195 231163 231363 452055
12197D52055a76599A9539b03248F415L42107N8651A12203a64395L741A90253I4416
$$ 452055 -176599 19539 -203248 6415 348522 407173 112203 -164395 -160654 190253 94416
12185F7792M4294K54202d3366A60246l2553l3204p519J04466a20735F1205Q8496
$$ 67792 112086 366288 -43366 160246 127693 94489 86970 191436 -120735 61205 149701
12174A49701a76790B6086M4420R3733c316l5319E13613a59854C02352j38219k4712
$$ 149701 -176790 26086 70506 164239 -3316 -38635 513613 -159854 302352 164133 139421
12163A39421k6898C5083c18163C35232A9277M4356J44540b91678F7762l2685J22941
$$ 139421 112523 35083 -318163 335232 19277 63633 208173 -291678 67762 35077 158018
12152A58018E7385a19033d5666B38907h7154n1378B91822A22675B8148J79836
$$ 158018 57385 -119033 -45666 238907 -87154 -138532 291822 122675 28148 207984
12142B07984p2861P9387n3800L1657A2617M30633A8691a76390E0403N3109C5856
$$ 207984 135123 214510 160710 192367 12617 443250 18691 -176390 50403 103512 35856
12130B87282c74266B27179b40721Q6942P6255A10674j7951c30819B379J75158
$$ 287282 -374266 227179 -240721 -153779 -77524 110674 92723 -330819 2379 177537
12120A77537e6945B0799N0561d3539C9176K6019e7222A42622J31694a37772l0216
$$ 177537 -56945 20799 71360 -43539 39176 65195 -57222 142622 274316 -137772 -167988
12109a67988l9937D7461K65700q4248b43766B3525J28168b26109e5425m7300A49061
$$ -167988 -207925 47461 313161 228913 -243766 23525 151693 -226109 -55425 -102725 149061
12097C6597h55C9210j8552a90766f4128G1388e0991B39719i5030j8642L9424j85650
$$ 36597 -855 39210 20658 -190766 -64128 71388 -50991 239719 -95030 -113672 -74248 -259898
12085b59898L2932g8872A9585e7690r6613E40799O11903K75590G10950h0695j57593
$$ -259898 -226966 -78872 19585 -57690 -154303 540799 1152702 1428292 710950 -80695 -238288
12074b38288L521F1303A1626b9501j30579G4693e8461B7416L7811K08M6157a30106
$$ -238288 -234767 61303 11626 -29501 -160080 74693 -58461 27416 65227 65435 111592 -130106
12061A93926a18140l1552k5326d8156A20634j9255a13334k6123A8499p904a3110
$$ 193926 -118140 -149692 -175018 -48156 120634 101379 -113334 -139457 18499 10595 -13110
12049a29125A1474J37a39582f3043a7607k45377J01390O3504E144Q8022f2759
$$ -129125 11474 11611 -139582 -63043 -17607 -262984 -161594 -98090 5144 93166 -62759
12037e8953C28009j47929N5309d15991G9286l3521a74791B38402g3196A81891
$$ -58953 328009 180080 235389 -415991 79286 45765 -174791 238402 -73196 181891
12026a28764E1271h8803j12596H1794k297i9936J3904K4880B84053j20803a19342
$$ -128764 51271 -88803 -201399 81794 79497 -99936 -86032 -61152 284053 163250 -119342
12014D9064P6805D610J50915j6552O7657B4571a38219M9871k0622k08839b1400
$$ 49064 125869 4610 155525 138973 206630 24571 -138219 -88348 -108970 -317809 -21400
12002f9088g860A82938f8318A11744n1958a39221C08308g9693I2726i2672j01109
$$ -69088 -7860 182938 -68318 111744 59786 -139221 308308 -79693 92726 -92672 -193781
11991a93781F4035G842g3930k41788e653H8383L9274d845j55609a1280p8104d2977
$$ -193781 64035 7842 -73930 -315718 -5653 88383 127657 -4845 -160454 -11280 -89384 -42977
11978a78708D2368a06308o7294f3016E3684c4040j62728f4288j43034h1739A88083
$$ -178708 42368 -106308 -173602 -63016 53684 -34040 -196768 -64288 -207322 -81739 188083
11966b9707j72283r4136J36144B8264e83331A45849m2507O4980l3600J4246a19013
$$ -29707 -201990 -296126 -159982 28264 -583331 145849 103342 168322 134722 148968 -119013
11954a7286l8540r806G7383a72130m0461h2464C8492i2354b7306A77420n1987
$$ -17286 -55826 -65632 77383 -172130 -212591 -82464 38492 -92354 -27306 177420 125433
11943A25433b63444b8326A11685f7823k7042p8765A61773b49558A90716a28071
$$ 125433 -263444 -28326 111685 -67823 -94865 -173630 161773 -249558 190716 -128071
11932a33952B94888b72722N9072B61074f5874j91327C30088D8138b6302B08271
$$ -133952 294888 -272722 -213650 261074 -65874 -257201 330088 48138 -26302 208271
11921i1959p6307A11119d5306Q922H7035g81B11191C0083J09031b83465J20136
$$ -91959 -168266 111119 -45306 -36384 87035 -781 211191 30083 139114 -283465 -163329
11910a63329B15724E0387r283K2559Q6277e9226J1324B12457B4231O5290a8612
$$ -163329 215724 50387 41104 63663 149940 -59226 -47902 212457 24231 89521 -18612
11898h7638k5476a908A62881C548a03079K1436A11925J8226j3441K07785b47938
$$ -87638 -113114 -1908 162881 3548 -103079 -81643 111925 130151 116710 324495 -247938
11886h570j31848B55122D448c53114J68146g4218k0016E8373J68938a24821q6556
$$ -8570 -140418 255122 4448 -353114 -184968 -74218 -94234 58373 227311 -124821 -211377
11875b11377f0397J7694k95574P6091a12881m4525D8552J42170M3903a3746A87976
$$ -211377 -60397 -42703 -338277 -262186 -112881 -157406 48552 190722 234625 -13746 187976
11863a86926a4560l15003J13758J06875o7078F7089a32642D480c76336a08597
$$ -186926 -14560 -329563 -215805 -108930 -176008 67089 -132642 4480 -376336 -108597
11852A25828j3099f2971B86879D2869d2492r0275l64257g2406l24940d9021j15789
$$ 125828 112729 -62971 286879 42869 -42492 -132767 -497024 -72406 -397346 -49021 -164810
11841a64810l0700F0084b43576a03404A06075a48640N3266B56320n5070g2333
$$ -164810 -195510 60084 -243576 -103404 106075 -148640 -95374 256320 201250 -72333
11830c00556J15127A5260e5393G6026J08974a46831A99277e8900A21548a18099
$$ -300556 -185429 15260 -55393 76026 185000 -146831 199277 -58900 121548 -118099
11819A90885b62424i8635A83493b49081l6861A63636a33479c8123A24226K79247
$$ 190885 -262424 -98635 183493 -249081 -285942 163636 -133479 -38123 124226 403473
11809D03473a44639A87773J26310C6972P4017b47664H5859j0604J23913F9276
$$ 403473 -144639 187773 314083 36972 110989 -247664 85859 75255 199168 69276
11798b36802B40471c0504j16464l1703C46091a04608A14954a58015j4880j56086
$$ -236802 240471 -30504 -146968 -178671 346091 -104608 114954 -158015 -172895 -328981
11788c28981c4870j9600D2207L20781b43332A3295O9808J39828g6405D7757c11712
$$ -328981 -34870 -54470 42207 362988 -243332 13295 83103 222931 -76405 47757 -311712
11776F1426K62963D188f8381p420r4676B01275q7560d5185E4583L8229b00905
$$ 61426 324389 4188 -68381 -75801 -170477 201275 113715 -45185 54583 92812 -200905
11764A13348C1418J93835i558n9538o2138I2663e79657C31636f5467C30831a60699
$$ 113348 31418 225253 -9558 -69096 -131234 92663 -579657 331636 -65467 330831 -160699
11752C35539a51686o1884D6710M397K12506e7592B280g2638A01102a99417E81681
$$ 335539 -151686 -213570 46710 51107 263613 -57592 2280 -72638 101102 -199417 581681
11740f4441K8765A38405d9027j15627E6545J50341a60711H6668a88126o6504C44038
$$ -64441 -35676 138405 -49027 -164654 56545 206886 -160711 86668 -188126 -254630 344038
11728A4107a83907J1901j75813B10847F7889J31109g2504E8922O4036a4984j24724
$$ 14107 -183907 -172006 -347819 210847 67889 198998 -72504 58922 122958 -14984 -139708
11717a39708j83722d7296j07738B10552F7502a62336B8330f9242B86049j35152
$$ -139708 -323430 -47296 -155034 210552 67502 -162336 28330 -69242 286049 150897
11707A50897k0511a15626E3896K17790o9900b18139k32946A77664c7664C4454
$$ 150897 130386 -115626 53896 271686 201786 -218139 -451085 177664 -37664 34454
11696E14575h4054B18989i1423M4262H3806J65783a22861C3467a35307I9508j1244
$$ 514575 -84054 218989 -91423 -47161 83806 249589 -122861 33467 -135307 99508 88264
11685H8264J25982O7978a06921B09475i343p915C60164c3283k07945E004J98073
$$ 88264 214246 282224 -106921 209475 -9343 -17258 360164 -33283 -241228 5004 203077
11674B03077k6930m7516g5100k31170A24115D9118k905d55276e6790D59150b3233
$$ 203077 176147 128631 -75100 -306270 124115 49118 46213 -455276 -56790 459150 -23233
11662e9829m16393a13446c6034D0051L77091a0718A79015a1532j6764a1976F4099
$$ -59829 -476222 -113446 -36034 40051 417142 -10718 179015 -11532 -28296 -11976 64099
11650E1866b47633A75590n6008a47543G9421b71183I5374a1760r3875A53464d6039
$$ 51866 -247633 175590 119582 -147543 79421 -271183 95374 -11760 -105635 153464 -46039
11638A63845G0511f4089B15316a42239m2032A93199L2779b4997C53207a06979
$$ 163845 70511 -64089 215316 -142239 -184271 193199 225978 -24997 353207 -106979
11627A66695a09337b2212B03979G2664L2349A8839K42761d9406k46366I0387K43862
$$ 166695 -109337 -22212 203979 72664 105013 18839 261600 -49406 -295772 90387 334249
11616C34249I1481K07389e493j13375L0136F52O5375a73189C39444A07457a93016
$$ 334249 91481 298870 -5493 -118868 -88732 652 66027 -173189 339444 107457 -193016
11604B0642a1692j76744h465j16300K5060B85030b57249A32938i1678E2158B3621
$$ 20642 -11692 -188436 -8465 -124765 -99705 285030 -257249 132938 -91678 52158 23621
11592B94235b24712N1743F7934J43241A6543K65470a42851C00356j28600a82558
$$ 294235 -224712 -172969 67934 211175 16543 282013 -142851 300356 171756 -182558
11581B95493A6323K56412h1051j0544A64566e643o4387c1582A27418J64117A12101
$$ 295493 16323 272735 -81051 -91595 164566 -5643 -70030 -31582 127418 291535 112101
11569e4086A09406K71516j54759b9F0570b02933C96223A4429J7361a10578B7649
$$ -54086 109406 380922 226163 -29 60570 -202933 396223 14429 31790 -110578 27649
11557A54169a86328N3981B97977C6778a75522J1536j78256G7134a31303F0843
$$ 154169 -186328 -132347 297977 36778 -175522 -163986 -342242 77134 -131303 60843
11546b55263B0142M90439A94964D8709R6272p117P1148a78458K3195B33001f7327
$$ -255263 20142 510581 194964 48709 144981 137864 209012 -178458 -155263 233001 -67327
11534a25179C42065j13393a87233B94708A01230Q0879J42628C4794J53002a00476
$$ -125179 342065 228672 -187233 294708 101230 182109 324737 34794 187796 -100476
11523i6001B05714m9846f3182r380b9880D65325A05608a95873C7230h6581F05760
$$ -96001 205714 155868 -63182 -72562 -29880 465325 105608 -195873 37230 -86581 605760
11511D2676L30596j37388b13596B05272a5275k08352P9429i640j33289B80409
$$ 42676 373272 235884 -213596 205272 -15275 -223627 -144198 -9640 -142929 280409
11500A75882a04413E51056d4042K343A11981r225i8954a1121n2126C2310R3022
$$ 175882 -104413 551056 -44042 -41699 111981 102756 -98954 -11121 -63247 32310 125332
11489A25332L2897b8035A84626m8901J13751a2292C20153J46120k03708k8834
$$ 125332 158229 -28035 184626 135725 249476 -12292 320153 466273 262565 233731
11479B33731A14336L60593B07317I3156R2517I2829J06801J43881A20123l1962
$$ 233731 114336 474929 207317 93156 185673 92829 199630 343511 120123 88161
11469H8161c8268D04517j88313G7670a52925B64162r5885C7347a8447A40000K7388
$$ 88161 -38268 404517 216204 77670 -152925 264162 168277 37347 -18447 140000 167388
11458A67388Q307l8209n0008A7055a5779B4001a07943e2453C75931A4479J30167
$$ 167388 175695 137486 87478 17055 -15779 24001 -107943 -52453 375931 14479 144646
11447A44646d4819A33725n8802K7753i525j6594H7208J54857I5685a21826A67134
$$ 144646 -44819 133725 74923 102676 -9525 -26119 87208 242065 95685 -121826 167134
11435B42717b66534d2059j15204j9302m3645H1102K67982b32634m2009F0665K57606
$$ 242717 -266534 -42059 -157263 -176565 -220210 81102 349084 -232634 -274643 60665 318271
11424C18271d7619k24890a08366d8081B26202C1544J63599c7948J2401A63376
$$ 318271 -47619 -272509 -108366 -48081 226202 31544 195143 -37948 -25547 163376
11413a99787K1722m1373B38386b41778A25908a34639J7454A01594G934R2825i90
$$ -199787 -178065 -219438 238386 -241778 125908 -134639 -117185 101594 7934 100759 -990
11401H3038J48239C8797J22283c85378B01804k2752a6587n3122C711b36453d6190
$$ 83038 231277 38797 161080 -385378 201804 179052 -16587 -69709 3711 -236453 -46190
11389a17962n988M1941c5098k45631B6924L3239R5678e375b13j09676A503h5680
$$ -117962 -123950 -82009 -35098 -280729 26924 60163 155841 -5375 -213 -109889 1503 -85680
11376g5506a7501q3472M150A79314a60505E6449e2788i225B11169c78966a689
$$ -75506 -17501 -100973 -96823 179314 -160505 56449 -52788 -9225 211169 -378966 -1689
11364A26689K6913A50J01993b09168C7843o9c45219B6314b32392F414b2728A10116
$$ 126689 153602 150 102143 -209168 37843 37774 -345219 26314 -232392 6414 -22728 110116
11351a04187k14490J44152B03841j01588B6028d9069B96876a07811n1770N6188
$$ -104187 -318677 -174525 203841 102253 26028 -49069 296876 -107811 -159581 -103393
11341a03393A15991e3127j58427p3667J24695A08204b1197A6528J23346b72068
$$ -103393 115991 -53127 -211554 -285221 -160526 108204 -21197 16528 139874 -272068
11330A69360c2016n3301k02438i7686A5167d80699A97030b12378R2926B35092
$$ 169360 -32016 -85317 -287755 -97686 15167 -480699 197030 -212378 -119452 235092
11319D59916b30317A56811r806b65064r4006a73620G3385a24533b4701B75043
$$ 459916 -230317 156811 147005 -265064 -359070 -173620 73385 -124533 -24701 275043
11308B610J67668h884j9295o3801B40946b11643h8745j63691E4665a91760C01540
$$ 2610 170278 -8884 -28179 -91980 240946 -211643 -88745 -252436 54665 -191760 301540
11296D18732k00571f8244n2281c5810p4524j47607B8721J30473i6547K72J5225
$$ 418732 218161 -68244 -120525 -35810 -110334 -257941 28721 159194 -96547 -96275 -81050
11285h1050C86677b2257j19685J5985l5606B9121g7038b1065j99914C5765A6943
$$ -81050 386677 -22257 -141942 -125957 -161563 29121 -77038 -21065 -220979 35765 16943
11273a72763L5533j3388H4968a48239P785E0929B672c76293C09814a39278B15213
$$ -172763 -137230 -150618 84968 -148239 -140454 50929 2672 -376293 309814 -139278 215213
11261E6405J07143C7734b54582f4112A96010C1116K2837P2209i4013A31143a37008
$$ 56405 163548 37734 -254582 -64112 196010 31116 53953 126162 -94013 131143 -137008
11249e7910A15363D729h7026A23878c20681A55147C3821K14877H1233D0494M2350
$$ -57910 115363 4729 -87026 123878 -320681 155147 33821 248698 81233 40494 82844
11238H2844O4620c06629g8545k11813R0465O0179B10819a03096M9015j48105b1565
$$ 82844 147464 -306629 -78545 -290358 -199893 -139714 210819 -103096 -54081 -202186 -21565
11226C36K96054b4281j85408B07790b8612m9563c1704J0038j04179k51454J1969
$$ 336 296390 -24281 -209689 207790 -28612 -78175 -31704 -21666 -125845 -377299 -365330
11215c65330J03010J15686B55802A01206a79935j13146a9565A58672k0861b96165
$$ -365330 -262320 -146634 255802 101206 -179935 -293081 -19565 158672 137811 -296165
11204F9390k1311a28038k93919P0144j72257A79236F7969a79998F4042b381r0522
$$ 69390 48079 -128038 -421957 -351813 -524070 179236 67969 -179998 64042 -2381 -92903
11193i2903l8743F4151b12795B4225I687e4801m21758K34253f6669n2356H843
$$ -92903 -131646 64151 -212795 24225 9687 -54801 -476559 -242306 -66669 -119025 8843
11181B95812a9652k31034C52289a7574k76456d358A57103a30018H0456c09244
$$ 295812 -19652 -250686 352289 -17574 -294030 -4358 157103 -130018 80456 -309244
11170c1555I171b39581O5151M1019F521J63442F4488K07875f770B44760H5405
$$ -31555 9171 -239581 -174430 -133411 6521 169963 64488 272363 -6770 244760 85405
11158I1399b34286A59573E4207c34997c5716A63107a6754j41016L9111K403m1403
$$ 91399 -234286 159573 54207 -334997 -35716 163107 -16754 -157770 -118659 -116256 -157659
11147a57659B09197a56123f8165j31907I1263c92420g1890j92580a03572G9564
$$ -157659 209197 -156123 -68165 -200072 91263 -392420 -71890 -264470 -103572 79564
11136a26795A10993B1092d0838A48867O9317M9592A09676b21920c1848B69311
$$ -126795 110993 21092 -40838 148867 218184 267776 109676 -221920 -31848 269311
11125a51549j20781A22946E0629J47036b0332A37448b5506D2153J11200F3652
$$ -151549 -272330 122946 50629 197665 -20332 137448 -25506 42153 153353 63652
11114A28993a54421A79137J1342L0983n6399D4089R1739o1477k2832c2634A73995
$$ 128993 -154421 179137 190479 221462 165063 44089 135828 74351 51519 -32634 173995
11102A57030N4838J21265p9315c2613E5608J56557E8533J31751F6682J49828J49482
$$ 157030 211868 333133 253818 -32613 55608 212165 58533 190284 66682 216510 365992
11091C65992b6417i668B58523a04658A19640i299B06838A01783m1841J42221M1355
$$ 365992 -26417 -9668 258523 -104658 119640 -9299 206838 101783 59942 202163 243518
11080B43518J06343J15361E6491O2043K98040m2843H4389p051R1854N20J27425
$$ 243518 349861 465222 56491 118534 416574 373731 84389 77338 169192 169712 297137
11069B97137O7260j14991P5073r2477M3591I3083m5408J81283K26870n9567L86016
$$ 297137 364397 249406 324479 232002 275593 93083 47675 228958 455828 396261 782277
11058G82277l46942A10198M74694o0255j94546J1056R2367J45792O9756j28762
$$ 782277 435335 110198 584892 524637 330091 341147 433514 579306 649062 520300
11048E20300J63662M5145J69723k99120k23032J1401L09181M4902j56967O0945
$$ 520300 683962 729107 898830 599710 376678 388079 697260 742162 585195 646140
11038F46140m2895k10246L29872j03814m9704K72867l37120Q2066m7349J75765
$$ 646140 603245 392999 722871 619057 569353 842220 505100 587166 539817 715582
11028G15582k75230J42238K93831l54343B44355K85414o359k4532J93690k60227
$$ 715582 440352 582590 876421 522078 244355 529769 523410 498878 692568 432341
11018D32341M5781j50775J59284L5171k01416J1560o10m0740K27334m6290L2139
$$ 432341 478122 327347 486631 521802 320386 331946 331336 290596 517930 471640 503779
11007E03779M8840j29240j65971J51900p5714N91936l70116m293q2802P2530L4022
$$ 503779 552619 423379 257408 409308 333594 925530 555414 551121 468319 540849 574871
10996E74871J22276B78439J55549N9590j48412L57515q9316J16615K9073J66132
$$ 574871 697147 278439 433988 493578 345166 702681 613365 729980 759053 925185
10986I25185k42063L06531D82811K34804O592K12291j9146O12436J2093k71341
$$ 925185 683122 989653 482811 717615 724207 936498 917352 1529788 1541881 1270540
10976A270540M15967L62552j40337M11445k89933L29159K33854l39505l12739
$$ 1270540 1686507 2049059 1908722 2320167 2030234 2359393 2593247 2253742 1941003
10967A941003j5538m67718p7523j90733M26224k26557K85330j7388k86893L02898
$$ 1941003 1925465 1457747 1380224 1189491 1615715 1389158 1674488 1657100 1370207 1673105
10957A673105J09967j10349M0013k01863k47345p5372l32978m2376j79004C00253
$$ 1673105 1783072 1672723 1712736 1510873 1263528 1188156 855178 812802 633798 300253
10946E85880B49402K73971A70759L59404j91449f8101B41662j5158a00545K4381
$$ 585880 249402 523373 170759 530163 338714 -68101 241662 226504 -100545 -76164
10936g6164A12543L8527c5271A43125J56250d1880B3304Q0683f2344r860j97570
$$ -76164 112543 151070 -35271 143125 299375 -41880 23304 103987 -62344 -72204 -269774
10925b69774a0462k53756i152r9021D44553A22613a42852K9333A68186J45171
$$ -269774 -10462 -264218 -9152 -108173 444553 122613 -142852 -113519 168186 313357
10915C13357F6782k5231d21035c9125A1239b62264O646A04689J43666E1109A3204
$$ 313357 66782 41551 -421035 -39125 11239 -262264 -255618 104689 248355 51109 13204
10903A83777C674e9506n6730F9309b8657C043a60813B54524b4921C60551A66375
$$ 183777 3674 -59506 -116236 69309 -28657 3043 -160813 254524 -24921 360551 166375
10891a1319j06262m9752d7716l93157A01670R3196B1212e9596k08651d2577q5984
$$ -11319 -117581 -167333 -47716 -440873 101670 194866 21212 -59596 -268247 -42577 -128561
10880a28561a6619j11868j04984C78736F5607E760M4102a73216J7008B62850C7817
$$ -128561 -16619 -128487 -233471 378736 65607 5760 49862 -173216 -156208 262850 37817
10868B9494b12989A65293a15714f385B15675K6087c19732A54673f6230j20304
$$ 29494 -212989 165293 -115714 -6385 215675 241762 -319732 154673 -66230 -186534
10858a86534A29403b98469D7102J33962D7715K98517a95507H2477J09832a39455
$$ -186534 129403 -298469 47102 181064 47715 346232 -195507 82477 192309 -139455
10847A56535b28493B5139a8355l0518A01612a03534A8724a68036j3798A15360
$$ 156535 -228493 25139 -18355 -48873 101612 -103534 18724 -168036 -181834 115360
10836b6373l0690k30300A71955a01250l9417B68776f8629p0559B4369K46191c82537
$$ -26373 -57063 -287363 171955 -101250 -140667 268776 -68629 -139188 24369 270560 -382537
10824A78243B0140e23202C01821a99339B16607i8478A12834M8943a30028A59236
$$ 178243 20140 -523202 301821 -199339 216607 -98478 112834 161777 -130028 159236
10813b84684A79319c25154A71133f8948B2175O0528A1080b72585A31322a63859
$$ -284684 179319 -325154 171133 -68948 22175 82703 11080 -272585 131322 -163859
10802a32937k74528C9035h7780A4262J38188i7864A26342b64548a09742C6596
$$ -132937 -407465 39035 -87780 14262 152450 -97864 126342 -264548 -109742 36596
10791h9749m9363k09991B73241I9853b69853r620A02593a30726n8284A578J41093
$$ -89749 -139112 -349103 273241 99853 -269853 -279473 102593 -130726 -189010 1578 142671
10780A42671i5210j71326A38321F3825j1231a19666m6603H2639a43049q6431a4442
$$ 142671 -95210 -266536 138321 63825 52594 -119666 -166269 82639 -143049 -229480 -14442
10768a1940j33482j22502j06519A21091K45715j83325p7783a15768e7541k0367
$$ -11940 -145422 -267924 -374443 121091 366806 183481 105698 -115768 -57541 -77908
10758g7908q8851d9937A27927K36511j77700K4688d01496K00196B65958a95026
$$ -77908 -166759 -49937 127927 364438 186738 211426 -401496 -201300 265958 -195026
10747i866k03268B22972R125o7917l0494b07410C7193J35787a17884k06330B04921
$$ -9866 -213134 222972 232097 164180 133686 -207410 37193 172980 -117884 -324214 204921
10735b34085A81189H6214J98506d9560A13914a00771r6614e8057j50596e1779
$$ -234085 181189 86214 284720 -49560 113914 -100771 -197385 -58057 -208653 -51779
10724A04007a35632j41360a035r8249A62118a41646H178c31234B31790b00751
$$ 104007 -135632 -276992 -1035 -99284 162118 -141646 8178 -331234 231790 -200751
10713g4296m5468j74600J17949B59573E8312K134a6960H250J4571K66676a05490
$$ -74296 -119764 -294364 -176415 259573 58312 60446 -16960 8250 22821 289497 -105490
10701A76860h3356j11204c4832B00707b59459A83330n9495i8044j81101j16045
$$ 176860 -83356 -194560 -34832 200707 -259459 183330 123835 -98044 -279145 -395190
10691c95190r9883a43214c4387j49572A22462K0838A2982R4325a5716j41142A25010
$$ -395190 -495073 -143214 -34387 -183959 122462 143300 12982 107307 -15716 -156858 125010
10679D9524c00055n2866d2510J5796K028A8856J059e6125B24840f6657A33519
$$ 49524 -300055 -352921 -42510 -26714 -24686 18856 19915 -56125 224840 -66657 133519
10667i8699C39953A04808K0971a46348A08602c8705A41502c09827B9394c53046
$$ -98699 339953 104808 125779 -146348 108602 -38705 141502 -309827 29394 -353046
10656a39078N3408j17978A332e2409E511g6602A46733n7876i2941A41543c06510
$$ -139078 -85670 -203648 1332 -52409 5511 -76602 146733 88857 -92941 141543 -306510
10644i3332d0653k5120j2368K9991I1444A2599Q5066b89536K6224D52169b37971
$$ -93332 -40653 -65773 -78141 -48150 91444 12599 97665 -289536 -263312 452169 -237971
10632H5973O445a54112H7375c31816D200c23481B68419b7497G1237c04059g8309
$$ 85973 92418 -154112 87375 -331816 4200 -323481 268419 -27497 71237 -304059 -78309
10620b29229g2175k8886B3927a7293p6249j31222H8505b44632B1749b2157O351
$$ -229229 -72175 -101061 23927 -17293 -93542 -224764 88505 -244632 21749 -22157 -15806
10609a5806j34512m1971B94943b09744k02047c0746B15990J60214n7064a55730
$$ -15806 -150318 -192289 294943 -209744 -411791 -30746 215990 376204 319140 -155730
10598b97521G8713B9053J36819a74460m3955M2679C45024b51073I0567J25155
$$ -297521 78713 29053 165872 -174460 -218415 -175736 345024 -251073 90567 215722
10588B15722b62444O0348k3365A67178b08468Q5137a1515j27461N7610R327B1820
$$ 215722 -262444 -202096 -225461 167178 -208468 -123331 -11515 -138976 -81366 -72039 21820
10576F596b01923k64296a17626b6247k18656j4018A53106e4108D1901n862A2639
$$ 6596 -201923 -466219 -117626 -26247 -244903 -258921 153106 -54108 41901 36039 12639
10564B51545p8281G9777J55646I3770a94429e6291A50710G0151P6137M8016a10182
$$ 251545 173264 79777 235423 93770 -194429 -56291 150710 70151 146288 194304 -110182
10552A18025c9782m7142c4960J4020q0445j82822J3530I726a28379H411a30171
$$ 118025 -39782 -86924 -34960 -20940 -101385 -284207 -270677 9726 -128379 8411 -130171
10540F5241f6268H9670O973a43168j11236A01496a74570n984n4148F6169e4960
$$ 65241 -66268 89670 96643 -143168 -254404 101496 -174570 -180554 -234702 66169 -54960
10528d2194E9336a87914l4513A27750a90466A66497K50074D9443f7980C21107
$$ -42194 59336 -187914 -222427 127750 -190466 166497 416571 49443 -67980 321107
10517c13693a48047E5853Q6838P0088J54999i3922E0910P1297b4434G8546f641
$$ -313693 -148047 55853 142691 212779 367778 -93922 50910 122207 -24434 78546 -6641
10505a55051B7027Q0564d6640C46361A03176e2249C07556b83411a21933H2786
$$ -155051 27027 107591 -46640 346361 103176 -52249 307556 -283411 -121933 82786
10494C155J14343O1061a44259b1886E198a55633N2785m3718A56856R066O4066
$$ 3155 117498 178559 -144259 -21886 5198 -155633 -102848 -146566 156856 165922 229988
10483B29988j10092K33276P9185N1419d2987B50757J28640I0373k4224f2467D272
$$ 229988 119896 353172 432357 483776 -42987 250757 379397 90373 66149 -62467 4272
10471A17014a09068l22437J71802C11038I2590J05976a56838a8800I9817a71615
$$ 117014 -109068 -431505 -259703 311038 92590 198566 -156838 -18800 99817 -171615
10460h8214k36405I196O9032J55243a04162c2424B8821b99647J8544J04055j613
$$ -88214 -324619 9196 78228 233471 -104162 -32424 28821 -299647 -281103 -177048 -178661
10449a78661A01254i498j24592k7109c4417l4367j08804O8818A88409H7320a29802
$$ -178661 101254 -9498 -134090 -161199 -34417 -68784 -177588 -108770 188409 87320 -129802
10437b83445A48391m4172J7753b61313L2766d8578o780K1017E8873K158b56580
$$ -283445 148391 104219 121972 -261313 -228547 -48578 -55358 -34341 58873 61031 -256580
10425A0650a63099B01616a67869f7718k4059c735l43875R395a3770A2346d8125
$$ 10650 -163099 201616 -167869 -67718 -91777 -3735 -347610 -338215 -13770 12346 -48125
10413I8405j4826a3560p1690j97998J19434B9768G571J16906c07764E2283a82678
$$ 98405 83579 -13560 -85250 -283248 -163814 29768 7571 124477 -307764 52283 -182678
10401b43144B74553e0925A46898J29221a35979O3347F0991L2954c84598C77216
$$ -243144 274553 -50925 146898 276119 -135979 -72632 60991 93945 -384598 377216
10390D81221A30378e7798A2117i0442B44389e161A92204l4951g2684b9241m2062
$$ 481221 130378 -57798 12117 -90442 244389 -5161 192204 157253 -72684 -29241 -71303
10379g1303B15200J19618j51298b435j3018B00683N76844k09189B30958A4282
$$ -71303 215200 334818 183520 -2435 -15453 200683 777527 568338 230958 14282
10368C02980K52326k1858j10473l8793q9850j45883N440e4196C93653q0673J18984
$$ 302980 555306 533448 422975 384182 294332 148449 153889 -54196 393653 312980 431964
10357D31964A94152a97817a83C01345A8113J19222N74695G0276L13846F4012L17814
$$ 431964 194152 -197817 -183 301345 18113 137335 712030 70276 384122 64012 381826
10346C81826I0816N99996k14967j45154J77799F3270K35678d6142m21A86231G1756
$$ 381826 90816 690812 475845 330691 508490 63270 298948 -46142 -46563 186231 71756
10334a1090B30516p4297Q4993n3540J98651b57723a5592A48673P1194C4150R7086
$$ -11090 230516 156219 241212 187672 386323 -257723 -15592 148673 219867 34150 131236
10323A31236k1452K97742j81711P1593o871D1768J65168l2938p9155a45326k20461
$$ 131236 109784 407526 225815 297408 290537 41768 206936 173998 94843 -145326 -365787
10312c65787B7840J91821l2155h2758H7549l4389g5993E0174g2589k76268I492
$$ -365787 27840 219661 187506 -82758 87549 53160 -75993 50174 -72589 -348857 9492
10300g8470H0373a09930A86263q0912A3604M0334O670J21657d7924j94037H0822
$$ -78470 80373 -109930 186263 105351 13604 53938 60608 182265 -47924 -241961 80822
10288c3416B21307G9377a24068c972r7257G4011K69230h017H1383a38215e2586
$$ -33416 221307 79377 -124068 -3972 -101229 74011 343241 -8017 81383 -138215 -52586
10276a14478L5625H1820J48282K50222j67791c5844j70427j08723A28461a5197
$$ -114478 -78853 81820 230102 480324 312533 -35844 -206271 -314994 128461 -15197
10265b66640A33894D5528K0651a13415C06899a6652B44435K16108b40726A28290
$$ -266640 133894 45528 66179 -113415 306899 -16652 244435 460543 -240726 128290
10254I0907l0497E480a3536j39247J2247b0261j034N554j31852B53445a82793
$$ 90907 60410 5480 -13536 -152783 -140536 -20261 -21295 -15741 -147593 253445 -182793
10242D5168J41931b45669C4200g5873j23124A20565M408L5505b2910k88948D9429
$$ 45168 187099 -245669 34200 -75873 -198997 120565 124973 160478 -22910 -311858 49429
10230F2802K7254B0533g3990A95288o7702b78357P6244j62563A1778d31537A43237
$$ 62802 90056 20533 -73990 195288 127586 -278357 -202113 -364676 11778 -431537 143237
10218h2496r243A05831a40633e1086A59690F1628M5053c08877O2346P8176A92110
$$ -82496 -91739 105831 -140633 -51086 159690 61628 106681 -308877 -246531 -168355 192110
10206G6152l3815b59733D7623f5643i225l00542D3971f3338A379c0557j62790
$$ 76152 42337 -259733 47623 -65643 -9225 -309767 43971 -63338 1379 -30557 -193347
10195a93347N999l1714p3970h4816l23378c5960D1393A6844a03011L1419b2816
$$ -193347 -187348 -219062 -293032 -84816 -408194 -35960 41393 16844 -103011 -71592 -22816
10183C1985f5031p2666A5531h2413j50413p0743A12651f1771j33874b4087j29057
$$ 31985 -65031 -137697 15531 -82413 -232826 -303569 112651 -61771 -195645 -24087 -153144
10172a53144p9691A7551b64228A93900e4049q6711M2172J6204b3929A43677a86057
$$ -153144 -232835 17551 -264228 193900 -54049 -140760 -98588 -82384 -23929 143677 -186057
10160E8201a161l32853a58490C82271A86833a68616I4326C9113O1904L9361C3379
$$ 58201 -1161 -334014 -158490 382271 186833 -168616 94326 39113 101017 140378 33379
10148b42899j08544B2766f9491j16916A39966a5080j36741k13872J82260A3096
$$ -242899 -351443 22766 -69491 -186407 139966 -15080 -151821 -365693 -183433 13096
10137a26442N160k07029J56285A31301E5472e2926l11803A9079J81757n5962a6328
$$ -126442 -121282 -328311 -172026 131301 55472 -52926 -364729 19079 200836 144874 -16328
10125A77841e7481A68064A4028J20377q357b10134A07692a70414m1550i4935J2107
$$ 177841 -57481 168064 14028 134405 126048 -210134 107692 -170414 -211964 -94935 -82828
10114h2828b0162j75152C02721A7987R6285b66457K711g6350A38616a30044k34181
$$ -82828 -20162 -195314 302721 17987 114272 -266457 -263746 -76350 138616 -130044 -364225
10103c64225C7607L6597L3705a92291j20881b2042j49128N9926B5057b38148A86855
$$ -364225 37607 74204 107909 -192291 -313172 -22042 -171170 -111244 25057 -238148 186855
10091d722q6668B88353j20915A1232J54929m4386a32321A98661c3683j18810g0429
$$ -4722 -91390 288353 167438 11232 166161 121775 -132321 198661 -33683 -152493 -70429
10079i0185j15777k21209a48182a0561j14025o8977O9364E735a99382e0273A07389
$$ -90185 -205962 -427171 -148182 -10561 -124586 -193563 -124199 5735 -199382 -50273 107389
10067b76803N6417A16515g0423A08616C8814L7151K1638f7156C06795p1718A997
$$ -276803 -220386 116515 -70423 108616 38814 75965 97603 -67156 306795 235077 1997
10055b00516e2733F709e735k30157a14844k6361r7044g2215B60e12128E7724b50211
$$ -200516 -52733 6709 -5735 -235892 -114844 -141205 -238249 -72215 260 -512128 57724 -250211
10042f9459j08315g9416B4909P5537g823l8717J9213j76517D74055A00685c30578
$$ -69459 -177774 -79416 24909 100446 -7823 -46540 -27327 -203844 474055 100685 -330578
10030i8504E33061D0808g3250A56675h3404m1658L5049A51344e3487A37073j9730
$$ -98504 533061 40808 -73250 156675 -83404 -125062 -90013 151344 -53487 137073 117343
10019A17343c59422C8058c01854J00984B08157A01975a13361k96461a64866A31002
$$ 117343 -359422 38058 -301854 -200870 208157 101975 -113361 -409822 -164866 131002
10008a40912l8082b7823r2229E046a22491a4775q636A08751g3481C649b8634k4800
$$ -140912 -178994 -27823 -120052 5046 -122491 -14775 -23411 108751 -73481 3649 -28634 -53434
9996e3434m1102k7681l980B43209a6766k6883E1265i6579q5011H2268L6026i5445
$$ -53434 -94536 -122217 -126197 243209 -16766 -43649 51265 -96579 -181590 82268 118294 -95445
9983C0281g8448l77355e6305G9219b74620m0107H8595b19447i4050p3664a1682
$$ 30281 -78448 -455803 -56305 79219 -274620 -314727 88595 -219447 -94050 -167714 -11682
9971D294a07414J1167j13615K3410a6817k35014B4558J43968c1520J5596k1708
$$ 4294 -107414 -96247 -209862 -186452 -16817 -251831 24558 168526 -31520 -15924 -37632
9960c7632o6446O495D54996b2k14023R1052j92731g0201n1391E5484b92450H1082
$$ -37632 -104078 -97583 454996 -22 -214045 -122993 -315724 -70201 -121592 55484 -292450 81082
9947a80691d2546k19527B2933n158R4894i7828l7951d644A36075O7230H11e2840
$$ -180691 -42546 -262073 22933 17775 112669 -97828 -135779 -4644 136075 203305 811 -52840
9934b37651K0001B93522c2370J1506j40822A12210b99346e8329j62936B77675
$$ -237651 -217650 293522 -32370 -20864 -161686 112210 -299346 -58329 -221265 277675
9923E2508B1416K19732B5297J5376M2248G990c85144J32423a1020j33445M3153
$$ 52508 21416 241148 25297 40673 82921 7990 -385144 -252721 -11020 -144465 -101312
9912a01312j4431B13645r8286c92420a6200j29276C4484a53199k39688a28238
$$ -101312 -115743 213645 115359 -392420 -16200 -145476 34484 -153199 -392887 -128238
9901a63571d2519B57578h176I6929a48957C70667a88494A39328c2771B41449a54487
$$ -163571 -42519 257578 -8176 96929 -148957 370667 -188494 139328 -32771 241449 -154487
9889I4175i8676A38919a12501D4131b34231J05392o0319q891k99680A59715a19126
$$ 94175 -98676 138919 -112501 44131 -234231 -128839 -189158 -198049 -497729 159715 -119126
9877a09502q6193Q2286G1402d5279o0522j18165f7586m7775j7125j33132F3986
$$ -109502 -195695 -113409 71402 -45279 -105801 -223966 -67586 -115361 -132486 -265618 63986
9865A15379a48067A6188h6734O622B439J25954d09865g6639j68619c4460n2718
$$ 115379 -148067 16188 -86734 -80112 2439 128393 -409865 -76639 -245258 -34460 -87178
9854h7178k15642f7874J2657l00614J05906q2236e5123B66793E5407b81945j65575
$$ -87178 -302820 -67874 -55217 -355831 -249925 -332161 -55123 266793 55407 -281945 -447520
9843d47520G011J46032h6328n153A68912o8017I895a33974B7412A1711b64719
$$ -447520 7011 153043 -86328 -91481 168912 100895 9895 -133974 27412 11711 -264719
9831b59034A93891C516a12599A18361H829K2419a47883A29763a62115g3687D15837
$$ -259034 193891 3516 -112599 118361 8829 31248 -147883 129763 -162115 -73687 415837
9819I2814f92840A53007j2380c6664k502l95057g2186K9830j58911A13457b35395
$$ 92814 -692840 153007 140627 -36664 -39166 -434223 -72186 -42356 -201267 113457 -235395
9807C5551a70100I9969c08375J34107C05773e4364D0136c16011i8776G1552a57890
$$ 35551 -170100 99969 -308375 -174268 305773 -54364 40136 -316011 -98776 71552 -157890
9795c7164j9663k25150j1438J42329F5882c6303n643j55466l6861F6642a16630
$$ -37164 -56827 -281977 -293415 -151086 65882 -36303 -41946 -197412 -234273 66642 -116630
9783D1630j9520a79393A05312a75535A6522c00601R0832o5199O3052h4636D5505
$$ 41630 22110 -179393 105312 -175535 16522 -300601 -209769 -274968 -211916 -84636 45505
9771b82049A3948b04686h4971b5250j05329H8048a3403A37451a92340e8803D9980
$$ -282049 13948 -204686 -84971 -25250 -130579 88048 -13403 137451 -192340 -58803 49980
9759d2521A8889a42810F0080R6249d45358c0798k61562j10663Q5852H8187b06433
$$ -42521 18889 -142810 60080 156329 -445358 -30798 -292360 -403023 -317171 88187 -206433
9747I2147A6495J07017a63490a1064B7691d24263J66707D3656d24610F9019b30671
$$ 92147 16495 123512 -163490 -11064 27691 -424263 -257556 43656 -424610 69019 -230671
9735a18182r2094o8275Q9048P3678B88449b75283a06923R918I5410a80572C4262
$$ -118182 -210276 -278551 -189503 -115825 288449 -275283 -106923 -97005 95410 -180572 34262
9723C06906a57073H6896b50358a22678A90689A3257c7556A03760b68798h661j0065
$$ 306906 -157073 86896 -250358 -122678 190689 13257 -37556 103760 -268798 -8661 -18726
9712a8726l6798B39800a14433J9140L9607J1443k94309a38341a9570j73464E0541
$$ -18726 -55524 239800 -114433 -95293 -55686 -44243 -338552 -138341 -19570 -193034 50541
9700a78286L588f2069A08293i3024l2020n1500d5490C9498R8882a80988Q6441
$$ -178286 -174698 -62069 108293 -93024 -125044 -176544 -45490 39498 138380 -180988 -94547
9689i4547C64013a51789A25691K1849J373B3094g1815j13948A57523o3177J7299
$$ -94547 364013 -151789 125691 147540 148913 23094 -71815 -185763 157523 94346 111645
9678A11645A8808O8778O3998M9879F2914a60140B10634a05498b292p5007A46611
$$ 111645 18808 87586 151584 201463 62914 -160140 210634 -105498 -2292 -77299 146611
9666b1003k5563k57447A7867e7127l8937j59530e3155j5922j01844K4497O0727
$$ -21003 -46566 -304013 17867 -57127 -96064 -255594 -53155 -69077 -170921 -146424 -85697
9655h5697j33097A27335b19056b9501j94781A17918e7972K2632k64687f6505A60501
$$ -85697 -218794 127335 -219056 -29501 -224282 117918 -57972 -35340 -300027 -66505 160501
9643a00517C7837P0934d02774E2608J15689d4357B9820f8166A13799h953l5132
$$ -100517 37837 108771 -402774 52608 168297 -44357 29820 -68166 113799 -8953 -44085
9632d4085B86765k8668b4248A19255D7986b67604a17393I5563a35108H5181f3381
$$ -44085 286765 258097 -24248 119255 47986 -267604 -117393 95563 -135108 85181 -63381
9620C6312J31724a3663n3556m01217a15357c3525I9400a93404o9763A0619a70204
$$ 36312 168036 -13663 -67219 -468436 -115357 -33525 99400 -193404 -263167 10619 -170204
9608C09238A25661l2851a25720k91260a45515j84345J06073G3406K18039a54658
$$ 309238 125661 92810 -125720 -416980 -145515 -329860 -223787 73406 291445 -154658
9597C6284J32346b15199A36251b84126J32096H5058a90697g187A2565R6029J3427
$$ 36284 168630 -215199 136251 -284126 -152030 85058 -190697 -7187 12565 108594 122021
9586A22021b61265j01579F6280Q4525d6181j56525j33354h6296p0144g0392l45810
$$ 122021 -261265 -362844 66280 150805 -46181 -202706 -336060 -86296 -156440 -70392 -416202
9575d16202a79292A76108b96403A50289j6246b76442a02704O734E9898h6909M2000
$$ -416202 -179292 176108 -296403 150289 134043 -276442 -102704 -95970 59898 -86909 -44909
9564d4909l78084C8576q534K39160a5676l5684K517j02887j06795a10095C5390
$$ -44909 -422993 38576 30042 269202 -15676 -51360 -48843 -151730 -258525 -110095 35390
9552a34299A55065a32799B77591b34058P9797O3194j43271i7963L1394K3723o7725
$$ -134299 155065 -132799 277591 -234058 -154261 -91067 -234338 -97963 -66569 -42846 -110571
9541a10571L4804q5901D8660h0044c3156I9751c78599Q4662D8659J838d14605
$$ -110571 -75767 -161668 48660 -80044 -33156 99751 -378599 -293937 48659 50497 -414605
9529a18626J2776j07697A34088a60130j09648J9635c7153k61266d4974l0396k3067
$$ -118626 -105850 -213547 134088 -160130 -269778 -250143 -37153 -298419 -44974 -75370 -98437
9518i8437D7062J12673i4179D68730e2704D23505k05128g7242e449A10599b85737
$$ -98437 47062 159735 -94179 468730 -52704 423505 218377 -77242 -5449 110599 -285737
9506f6188b0898l6632l0574B13917b56960B194b7160A9029c29087g6516j85001
$$ -66188 -20898 -57530 -88104 213917 -256960 2194 -27160 19029 -329087 -76516 -261517
9495b61517b0100m6717A08586j1721a17144k46992a57178e912D44266a2606k08190
$$ -261517 -20100 -66817 108586 96865 -117144 -364136 -157178 -5912 444266 -12606 -220796
9484b20796J07648p0101A36967b748k80309C23344L968H3008a50209J6038B44410
$$ -220796 -113148 -183249 136967 -2748 -283057 323344 327312 83008 -150209 -134171 244410
9472b71038B07928c03604J39775P2593j12038A31094E7349j6516Q3673J57228
$$ -271038 207928 -303604 -163829 -91236 -203274 131094 57349 40833 124506 281734
9462B81734h2656k32701G0609h3752j32258A0802c59358M2664H6387i7929j30211
$$ 281734 -82656 -315357 70609 -83752 -216010 10802 -359358 -316694 86387 -97929 -228140
9451b28140L5657i1966j20176d0970C77841a15995F6111K5853e0974F1448c9244
$$ -228140 -192483 -91966 -212142 -40970 377841 -115995 66111 91964 -50974 61448 -39244
9439B05340d1951a8862B1657K73659a39910L7609A17809J7445g7015k61641A42404
$$ 205340 -41951 -18862 21657 295316 -139910 -102301 117809 135254 -77015 -338656 142404
9427A99261p6206M063i5886C33608H3737a38319L8072m5931P673A17814H344f7951
$$ 199261 123055 127118 -95886 333608 83737 -138319 -100247 -146178 -138505 117814 8344 -67951
9414D8057b48750A66647a13480N4413l29419B42780C3321L4799k4705L1318a84310
$$ 48057 -248750 166647 -113480 -59067 -388486 242780 33321 68120 43415 74733 -184310
9402g4982D7614a41162h2j322j13621j00815c1162j87054H9336b09139C2809i0620
$$ -74982 47614 -141162 -82 -1404 -115025 -215840 -31162 -218216 89336 -209139 32809 -90620
9389A89917h0984m8256N9763B70539j22396i5500A4370i3322m772o6178G7171
$$ 189917 -80984 -129240 -69477 270539 148143 -95500 14370 -93322 -98094 -164272 77171
9377E5387f3920b8981A41339K0496A3084h1447j07890R0608j30593m8929i9338
$$ 55387 -63920 -28981 141339 161835 13084 -81447 -189337 -98729 -229322 -278251 -99338
9365f0534j61631h4975o6356j44507L6745J03580L7096C72617g5132I8069K0067
$$ -60534 -222165 -84975 -151331 -295838 -259093 -155513 -118417 372617 -75132 98069 118136
9354A18136a8071l9931j74337E823b23181A38806a31081J0492A33459i4942l06005
$$ 118136 -18071 -58002 -232339 5823 -223181 138806 -131081 -120589 133459 -94942 -400947
9343d00947J66858n2474K2525j546i1375O579L6076m1868o8617k80026B0774d5078
$$ -400947 -234089 -286563 -264038 -265584 -91375 -84796 -48720 -90588 -159205 -439231 20774 -45078
9330c6988B04326a77360C9086P4498F687J73225a65132G8745a58217f0278B74580
$$ -36988 204326 -177360 39086 113584 6687 179912 -165132 78745 -158217 -60278 274580
9318C5679b19839A9874i0664o9985B2467J08729b5567o0866c8055m4367F1595
$$ 35679 -219839 19874 -90664 -160649 22467 131196 -25567 -86433 -38055 -82422 61595
9306A12292b43518A19420p496b73440K320P7545B06295c31143a27818B08075j6747
$$ 112292 -243518 119420 111924 -273440 -271120 -193575 206295 -331143 -127818 208075 191328
9295A91328a60258L9630k04415A75020j6979o3000b52301B11409B3302c50002
$$ 191328 -160258 -120628 -325043 175020 158041 95041 -252301 211409 23302 -350002
9284F4460d23001A35019a52876M2736L1827B97072a40480A35371l0076c69167
$$ 64460 -423001 135019 -152876 -110140 -78313 297072 -140480 135371 105295 -369167
9273A07342a05862C4468b55238D944h6784A97372a59641C0198a07608A55404p2583
$$ 107342 -105862 34468 -255238 4944 -86784 197372 -159641 30198 -107608 155404 82821
9262H2821J92055i4910j51517N5153O7938A53024b78763j75530a51603q024L4241
$$ 82821 274876 -94910 -246427 -191274 -123336 153024 -278763 -454293 -151603 -159627 -125386
9251a25386k57392C0222J50787b71840d2454j20377m8222j76865A14116L6495
$$ -125386 -382778 30222 181009 -271840 -42454 -162831 -211053 -387918 114116 150611
9241A50611a6016j71082A12325a31734o1433a3576G2559l4010J16331B5277i530
$$ 150611 -16016 -187098 112325 -131734 -193167 -13576 72559 38549 154880 25277 -9530
9229C3349a34428p0931C8363a339p5598j43863J7986c7160j85546c0116m7302
$$ 33349 -134428 -205359 38363 -1339 -76937 -220800 -202814 -37160 -222706 -30116 -77418
9218g7418L716A89528l7808a30003G2897a35663r7294A5252a71796L8839b110
$$ -77418 -73702 189528 151720 -130003 72897 -135663 -232957 15252 -171796 -132957 -2110
9206C05529j20064b43157O2021B7968P5486a70548h3715l36962B18280C4384c0938
$$ 305529 185465 -243157 -181136 27968 103454 -170548 -83715 -420677 218280 34384 -30938
9194A72302a25776A09211e4291k70478a00012j54705D2332b64105E0572J54344
$$ 172302 -125776 109211 -54291 -324769 -100012 -254717 42332 -264105 50572 204916
9184B04916d5981a9643k1273A34207k3633f7576c2581A21945n0506a29018J6484
$$ 204916 -45981 -19643 -40916 134207 110574 -67576 -32581 121945 71439 -129018 -112534
9173a12534A4017b26925k405p0118a44988N4099l1303n398N6760K2344j80473
$$ -112534 14017 -226925 -229330 -299448 -144988 -90889 -122192 -127590 -70830 -48486 -228959
9162b28959r4784Q6091A7769b6236k01776I3873a11443D96L19953b83393a22599
$$ -228959 -323743 -237652 17769 -26236 -228012 93873 -111443 496 320449 -283393 -122599
9150G5903O2655j8387n0543a2438C9822M28846k29413a65235h1946H0038a4555
$$ 75903 138558 120171 69628 -12438 39822 468668 239255 -165235 -81946 80038 -14555
9138G8809O6707J21383q4446b04959i8602A01959i5749A30914M6813b2520C8698
$$ 78809 145516 266899 182453 -204959 -98602 101959 -95749 130914 177727 -22520 38698
9126a26335E980k863h1548g259k48282N0083k07568N6472A50745a56808A8884
$$ -126335 5980 3117 -81548 -7259 -255541 -205458 -413026 -356554 150745 -156808 18884
9114a49330M5810l97899J31246k502r463c2936G0614N8314J53485A1345b44841
$$ -149330 -103520 -501419 -370173 -372675 -382138 -32936 70614 128928 282413 11345 -244841
9102A51048E328J50648a10306j43962D6864b79696C2077c74141P2856J24737M4947
$$ 151048 5328 155976 -110306 -254268 46864 -279696 32077 -374141 -301285 -176548 -131601
9091a31601o22A12479K4302a07832A31238E8899g5629k2013p2459o0811J01054
$$ -131601 -132223 112479 136781 -107832 131238 58899 -75629 -97642 -170101 -230912 -129858
9080a29858K8429I8335a23421d047I5024f5579B66932c52936A57642i691G9385
$$ -129858 -101429 98335 -123421 -4047 95024 -65579 266932 -352936 157642 -9691 79385
9068d30381G4793A8105a31141Q157B36247a81665A13041i1511m8103A42507m8918
$$ -430381 74793 18105 -131141 -122984 236247 -181665 113041 -91511 -139614 142507 93589
9057I3589a70728j9380B7488L6840B3785K13636I7985a48914k3121m9740A6349
$$ 93589 -170728 -190108 27488 64328 23785 237421 97985 -148914 -172035 -221775 16349
9045a10886e1221a3069m6842A8075J4811m830i9961r5671a5197Q81r3895l27952
$$ -110886 -51221 -13069 -59911 18075 32886 28056 -99961 -195632 -15197 -14316 -108211 -436163
9033d36163a55390A06664J35206b18839A49435b07205q3640d501j94518a9768
$$ -436163 -155390 106664 241870 -218839 149435 -207205 -290845 -4501 -199019 -19768
9022e8574j48579f6627r6769e1543o3403m4348A26021j9306C6288f2127B23712
$$ -58574 -207153 -66627 -163396 -51543 -114946 -159294 126021 106715 36288 -62127 223712
9010a06635d326l94254A12196L53639A03783a07186J4761F1317d45883B69793
$$ -106635 -4326 -398580 112196 465835 103783 -107186 -92425 61317 -445883 269793
8999a65265d7978A589M1030a24021j0365e5049a2213B9908a36297j85476C8839
$$ -165265 -47978 1589 42619 -124021 -134386 -55049 -12213 29908 -136297 -321773 38839
8987h8125C1799a02169k44544J54130A57337h3047K854j60137D15361b8996D18449
$$ -88125 31799 -102169 -346713 -192583 157337 -83047 -80193 -240330 415361 -28996 418449
8975b31902g9373k23454B7026b85923Q2136f8381r7334n6658J6161e7724m7012
$$ -231902 -79373 -302827 27026 -285923 -203787 -68381 -165715 -222373 -206212 -57724 -104736
8964a04736A8904L62285E500a77170M6592k1854H4446D937N0605f8849B98326
$$ -104736 18904 381189 5500 -177170 -130578 -152432 84446 4937 55542 -68849 298326
8952e9288J1135m7277C6677a5918o9740E6235a4227j63854B30841a55647b5446
$$ -59288 -48153 -95430 36677 -15918 -85658 56235 -14227 -178081 230841 -155647 -25446
8940C05531L5645j40877k7330Q8222P9107i665F5483e3511H6621K22654O8370
$$ 305531 341176 200299 172969 261191 340298 -9665 65483 -53511 86621 309275 377645
8929C77645a3100C23781n2776M38825J38429M72128L504727N431582n59143B687159
$$ 377645 -13100 323781 271005 709830 848259 1320387 4825114 10256696 9697553 2687159
8918A057739D25518o6916j02293c1902j8302k6573H7319J88205B6011L41962j3943
$$ 1057739 425518 358602 256309 -31902 -50204 -76777 87319 275524 26011 367973 354030
8907C54030e2474B93830j36249c29189J32680C35753k6712c5428j77980h4123
$$ 354030 -52474 293830 157581 -329189 -196509 335753 309041 -35428 -213408 -84123
8896G2476N5920a07327c7061r2965a247o650H3031j6622J01015b81358i6609k02947
$$ 72476 128396 -107327 -37061 -130026 -1247 -7897 83031 66409 167424 -281358 -96609 -299556
8884b99556B35767b6035k5637n6344k28652k2020h8589A9354J93234f0039E7115
$$ -299556 235767 -26035 -51672 -108016 -336668 -358688 -88589 19354 212588 -60039 57115
8872H55c5626D168h8652b3596A31106a05111J5331j61206I945b5624j2134j92374
$$ 855 -35626 4168 -88652 -23596 131106 -105111 -89780 -250986 9945 -25624 -37758 -230132
8860b30132E4388a79953j24957a08608M5433m03773b1854j81505g8245C53185
$$ -230132 54388 -179953 -304910 -108608 -63175 -466948 -21854 -203359 -78245 353185
$$ [...]
##END NTUPLES=NMR SPECTRUM
##END=
