##TITLE=AC1608_CTIAH13338_8316869_ZVBYigi5S5
##JCAMPDX= 6.0         $$ Bruker NMR JCAMP-DX V2.0
##DATA TYPE= NMR SPECTRUM
##DATA CLASS= NTUPLES
##ORIGIN= BRUKER
##OWNER= Administrator
$$ 1.72 TOPSPIN		Version 2.1
$$ 2013-11-12 08:59:42.639 -0800  Administrator@X
$$ Compression mode = diff/dup
##.OBSERVE FREQUENCY= 400.02188249412
##.OBSERVE NUCLEUS= ^1H
##.ACQUISITION MODE= SIMULTANEOUS (DQD)
##.ACQUISITION SCHEME= undefined
##.AVERAGES= 64
##.DIGITISER RES= 22
##SPECTROMETER/DATA SYSTEM= spect
##.PULSE SEQUENCE= noesygpps1d.comp
##.SOLVENT NAME= COFFEE_meoh
##.SHIFT REFERENCE= INTERNAL, COFFEE_meoh, 1, 14.96084
##AUDIT TRAIL= $$ (NUMBER, WHEN, WHO, WHERE, PROCESS, VERSION, WHAT)
$$ ##TITLE= Audit trail, TOPSPIN		Version 2.1
$$ ##JCAMPDX= 5.01
$$ ##ORIGIN= Bruker BioSpin GmbH
$$ ##OWNER= Administrator
$$ $$ E:\/data/COFFEE/nmr/AC1608_CTIAH13338_8316869_ZVBYigi5S5/12/pdata/1/auditp.txt
$$ ##AUDIT TRAIL=  $$ (NUMBER, WHEN, WHO, WHERE, PROCESS, VERSION, WHAT)
(   1,<2013-11-09 23:45:55.856 -0800>,<Administrator>,<X>,<go>,<TOPSPIN 2.1>,
      <created by zg
	started at 2013-11-09 23:34:26.145 -0800,
	POWCHK enabled, PULCHK disabled,
       configuration hash MD5:
       C8 4E 4E 5D D3 5C D8 9E 9F 52 82 E0 59 8A DE 15
       data hash MD5: 64K
       86 2A B2 18 C2 5B B7 1C 47 F9 39 CB D9 A9 D8 37>)
(   2,<2013-11-09 23:45:58.699 -0800>,<Administrator>,<X>,<proc1d>,<TOPSPIN 2.1>,
      <Start of raw data processing
       efp LB = 0.3 FT_mod = 6 PKNL = 1 PHC0 = 0 PHC1 = 0 SI = 128K 
       data hash MD5: 128K
       14 39 18 9E C8 B9 D0 37 57 B6 7D B8 81 39 17 33>)
(   3,<2013-11-09 23:45:59.679 -0800>,<Administrator>,<X>,<proc1d>,<TOPSPIN 2.1>,
      <pk PHC0 = -86.01196 PHC1 = 0 
       data hash MD5: 128K
       C5 06 D6 0A C8 CE D8 58 21 D6 3A 36 15 36 EC 38>)
(   4,<2013-11-09 23:46:00.093 -0800>,<Administrator>,<X>,<proc1d>,<TOPSPIN 2.1>,
      <abs ABSG = 1 
       data hash MD5: 128K
       E4 62 61 4A D9 D1 32 8D 2D 76 30 E1 01 3A F3 7B>)
(   5,<2013-11-09 23:46:00.215 -0800>,<Administrator>,<X>,<proc1d>,<TOPSPIN 2.1>,
      <abs ABSG = 2 
       data hash MD5: 128K
       89 D3 9E CE 4D 4C B8 AF EF 6D D4 E0 F0 88 96 0F>)
(   6,<2013-11-09 23:46:00.322 -0800>,<Administrator>,<X>,<proc1d>,<TOPSPIN 2.1>,
      <abs ABSG = 3 
       data hash MD5: 128K
       5B 94 B3 01 B2 65 78 C2 49 B4 7C 7A 30 92 CE F7>)
(   7,<2013-11-09 23:46:00.414 -0800>,<Administrator>,<X>,<proc1d>,<TOPSPIN 2.1>,
      <abs ABSG = 4 
       data hash MD5: 128K
       FD 35 F3 DC 25 A2 F2 6B 3D 98 F3 36 DE 45 9A B0>)
(   8,<2013-11-09 23:46:00.522 -0800>,<Administrator>,<X>,<proc1d>,<TOPSPIN 2.1>,
      <abs ABSG = 5 
       data hash MD5: 128K
       84 4D CF 79 60 96 0C 65 B1 51 CF 9F 39 C6 02 14>)
(   9,<2013-11-09 23:46:02.987 -0800>,<Administrator>,<X>,<audit>,<TOPSPIN 2.1>,
      <user comment:
       ICON-NMR User ID: COFFEE
       data hash MD5: 128K
       84 4D CF 79 60 96 0C 65 B1 51 CF 9F 39 C6 02 14>)
$$ ##END=
$$ 
$$ $$ hash MD5
$$ [...]
##$TP07= 0
##$TPNAME0= <>
##$TPNAME1= <>
##$TPNAME2= <>
##$TPNAME3= <>
##$TPNAME4= <>
##$TPNAME5= <>
##$TPNAME6= <>
##$TPNAME7= <>
##$TPOAL= (0..7)
0.5 0.5 0.5 0.5 0.5 0.5 0.5 0.5
##$TPOFFS= (0..7)
0 0 0 0 0 0 0 0
##$TUNHIN= 0
##$TUNHOUT= 0
##$TUNXOUT= 0
##$USERA1= <user>
##$USERA2= <user>
##$USERA3= <user>
##$USERA4= <user>
##$USERA5= <user>
##$V9= 5
##$VALIST= <valist>
##$VCLIST= <CCCCCCCCCCCCCCC>
##$VD= 0
##$VDLIST= <DDDDDDDDDDDDDDD>
##$VPLIST= <PPPPPPPPPPPPPPP>
##$VTLIST= <TTTTTTTTTTTTTTT>
##$WBST= 1024
##$WBSW= 4
##$XGAIN= (0..3)
0 0 0 0
##$XL= 0
##$YL= 0
##$YMAX_a= 5917473
##$YMIN_a= -11693165
##$ZGOPTNS= <>
##$ZL1= 120
##$ZL2= 120
##$ZL3= 120
##$ZL4= 120
##$ABSF1= 14.96084
##$ABSF2= -5.597342
##$ABSG= 5
##$ABSL= 3
##$ALPHA= 0
##$AQORDER= 0
##$ASSFAC= 0
##$ASSFACI= 0
##$ASSFACX= 0
##$ASSWID= 0
##$AUNMP= <proc_prof1d_extract.lims>
##$AXLEFT= 0
##$AXNAME= <>
##$AXNUC= <1H>
##$AXRIGHT= 0
##$AXTYPE= 0
##$AXUNIT= <>
##$AZFE= 0.1
##$AZFW= 0.1
##$BCFW= 0
##$BC_mod= 0
##$BYTORDP= 0
##$COROFFS= 0
##$CY= 15
##$DATMOD= 1
##$DC= 0
##$DFILT= <>
##$DTYPP= 0
##$F1P= 0
##$F2P= 0
##$FCOR= 0.5
##$FTSIZE= 131072
##$FT_mod= 6
##$GAMMA= 0
##$GB= 0
##$INTBC= 1
##$INTSCL= 1
##$ISEN= 128
##$LB= 0.3
##$LEV0= 0
##$LPBIN= 0
##$MAXI= 10000
##$MC2= 0
##$MEAN= 0
##$ME_mod= 0
##$MI= 0
##$NCOEF= 0
##$NC_proc= -2
##$NLEV= 6
##$NOISF1= 0
##$NOISF2= 0
##$NSP= 0
##$NTH_PI= 0
##$NZP= 0
##$OFFSET= 14.96084
##$PC= 1
##$PHC0= -86.01196
##$PHC1= 0
##$PH_mod= 1
##$PKNL= yes
##$PPARMOD= 0
##$PPDIAG= 0
##$PPIPTYP= 0
##$PPMPNUM= 2147483647
##$PPRESOL= 1
##$PSCAL= 4
##$PSIGN= 0
##$PYNMP= <proc.py>
##$REVERSE= no
##$SF= 400.020009700946
##$SI= 131072
##$SIGF1= 0
##$SIGF2= 0
##$SINO= 400
##$SIOLD= 131072
##$SPECTYP= <>
##$SREGLST= <1H.CDCl3>
##$SSB= 0
##$STSI= 131072
##$STSR= 0
##$SW_p= 8223.68421052631
##$SYMM= 0
##$S_DEV= 0
##$TDeff= 65536
##$TDoff= 0
##$TI= <>
##$TILT= no
##$TM1= 0
##$TM2= 0
##$TOPLEV= 0
##$USERP1= <user>
##$USERP2= <user>
##$USERP3= <user>
##$USERP4= <user>
##$USERP5= <user>
##$WDW= 1
##$XDIM= 131072
##$YMAX_p= 416036640
##$YMIN_p= -11166
##$CURPLOT= <Network HP LaserJet P1505>
##$CURPRIN= <$Network HP LaserJet P1505>
##$DFORMAT= <normdp>
##$LAYOUT= <+/1D_H.xwp>
##$LFORMAT= <normlp>
##$PFORMAT= <normpl>
##$SURQMSG= 1
$$ End of Bruker specific parameters
$$ ---------------------------------
##NTUPLES= NMR SPECTRUM
##VAR_NAME=  FREQUENCY,     SPECTRUM/REAL,   SPECTRUM/IMAG
##SYMBOL=    X,             R,               I
##VAR_TYPE=  INDEPENDENT,   DEPENDENT,       DEPENDENT
##VAR_FORM=  AFFN,          ASDF,            ASDF
##VAR_DIM=   131072,        131072,          131072
##UNITS=     HZ,            ARBITRARY UNITS, ARBITRARY UNITS
##FACTOR=    0.0627417313425164, 1,          1
##FIRST=     8223.62146879497, 199,          -60160
##LAST=      0,             3707,            -60347
##MIN=       0,             -11166,          0
##MAX=       8223.62146879497, 416036640,    0
$$ Real data points
##PAGE= N=1
##DATA TABLE= (X++(R..R)), XYDATA
$$ [...]
$$ plain form
63956 855712 903337 958351 1021193 1091854 1171572 1263192 1369538 1491999 1630843 1786177 1958121
63945 1958121 2146645 2351803 2573680 2811411 3062404 3322962 3589488 3858652 4126527
63936 4126527 4388066 4637415 4868433 5074993 5251362 5392706 5495505 5557734 5578780 5558923
63926 5558923 5498682 5398815 5261073 5088725 4886201 4658575 4411655 4152031 3886114 3618898
63916 3618898 3354013 3095025 2846071 2610925 2391837 2189802 2005755 1840896 1695603
63907 1695603 1568484 1456985 1358876 1272897 1198129 1133353 1077259 1028852 987193 950971 918752
63896 918752 889560 862816 837876 814085 791216 769327 748093 726827 705331 684225 664211
63885 664211 645450 627933 611969 597887 585587 574867 565901 558953 553832 550181 548230 548705 551862
$$ packed form
63956H55712M7625N5014O2842P0661P9718R1620J06346J22461J38844J55334J71944
63945A958121J88524K05158K21877K37731K50993K60558K66526K69164K67875
63936D126527K61539K49349K31018K06560J76369J41344J02799O2229K1046j9857
63926E558923o0241r9867j37742j72348k02524k27626k46920k59624k65917k67216
63916C618898k64885k58988k48954k35146k19088k02035j84047j64859j45293
63907A695603j27119j11499r8109q5979p4768o4776n6094m8407m1659l6222l2219
63896I18752k9192k6744k4940k3791k2869k1889k1234k1266k1496k1106k0014
63885F64211j8761j7517j5964j4082j2300j0720q966o948n121l651j951M75L157
$$ plain form
63872 551862 557034 563329 570469 578742 588307 598765 609407 619733 629733 639638 649466 658884 667541
63859 667541 675349 682332 688318 692947 695941 697224 696837 694869 691390 686385 679833 671897 662934 653170
63845 653170 642512 630819 618162 604670 590314 575115 559368 543356 526938 509797 492106
63834 492106 474537 457546 440996 424670 408868 394250 381277 369985 360158 351395 343057 334476
63822 334476 325459 316525 308530 301916 296372 291250 286314 281913 278347 275320 272371 269706 268139 267992
63808 267992 268449 268364 267523 266683 266412 266358 265843 264829 263944 263566 263166 261699 258660 254692 251047 248441 246547
63791 246547 244655 242510 240200 237532 234156 230392 227221 225140 223556 221782 220092 219096 218482 217361 215765
63776 215765 214772 214922 215413 215336 214900 214801 214987 214847 214253 213642 213240 212946 212860 213241 213862 214018 213395 212506 212069 212299
$$ packed form
63872E51862N172O295P140Q273R565J0458J0642J0326J0000R905R828R418Q657
63859F67541P808O983N986M629K994J283l87j968l479n005o552p936q963r764
63845F53170j0658j1693j2657j3492j4356j5199j5747j6012j6418j7141j7691
63834D92106j7569j6991j6550j6326j5802j4618j2973j1292r827q763q338q581
63822C34476r017q934p995o614n544n122m936m401l566l027k949k665j567j47
63808B67992M57q5q41q40k71n4n15j014q85l78m00j467l039l968l645k606j894
63791B46547j892k145k310k668l376l764l171k081j584j774j690r96o14j121j596
63776B15765r93J50M91p7m36r9J86j40n94o11m02k94q6L81O21J56o23q89m37K30
$$ plain form
63756 212299 212925 213606 214168 214642 215174 215861 216726 217887 219478 221185 222278 222546 222859 224191 226305 228099
63740 228099 229157 230189 231917 234324 237155 240316 243446 245800 247099 247999 249355 251439 254197 257677
63726 257677 261715 265689 269159 272355 275634 278838 281749 284702 288137 291797 294994 297434 299205 300202
63712 300202 300243 299530 298312 296273 293089 289562 287291 286880 287168 286595 284826 282614 280621 278945 277596 276860
63696 276860 277066 278258 280205 282649 285519 288881 292620 296236 299136 301178 302836 304774 307293 310089
63682 310089 312448 313779 314155 314204 314304 314069 312950 311185 309676 308937 308664 308513 308824 310179 312484 314876
63666 314876 316562 317506 318241 319113 319790 319570 318102 315634 312494 308651 304070 299300 295164 291805 288555
63651 288555 284912 281272 278369 276320 274646 273030 271623 270599 269797 268996 268305 268034 268251 268729 269411 270747
$$ packed form
63756B12299O26O81N62M74N32O87Q65J161J591J707J093K68L13J332K114J794
63740B28099J058J032J728K407K831L161L130K354J299R00J356K084K758L480
63726B57677M038L974L470L196L279L204K911K953L435L660L197K440J771R97
63712C00202M1p13j218k039l184l527k271m11K88n73j769k212j993j676j349p36
63696B76860K06J192J947K444K870L362L739L616K900K042J658J938K519K796
63682C10089K359J331L76M9J00k35j119j765j509p39k73j51L11J355K305K392
63666C14876J686R44P35Q72O77k20j468k468l140l843m581m770m136l359l250
63651B88555l643l640k903k049j674j616j407j024q02q01o91k71K17M78O82J336
$$ plain form
63635 270747 273287 276941 280924 284560 287891 291263 294612 297612 300471 304090 309245 315952 323714 332046
63621 332046 340601 349242 358380 368924 381426 395394 409869 424642 440489 458154 477520 497970
63609 497970 519222 541475 564888 589234 614046 638810 662838 685072 704202 719050 728946 733894
63597 733894 734510 731736 726411 719065 710202 700693 691538 683008 674215 663842 651273 636802 620850
63584 620850 603450 584653 565044 545449 526264 507444 489214 472462 458241 446972 438265 431468
63572 431468 426321 423093 422163 423481 426416 430095 433935 437910 442370 447688 454034 461395 469650 478641
63558 478641 488206 498223 508593 519192 529981 541329 554171 569611 588197 609622 633152 658298
63546 658298 685048 713617 743978 775393 806073 833319 854323 867219 871721 869066 861451 851303
$$ packed form
63635B70747K540L654L983L636L331L372L349L000K859L619N155O707P762Q332
63621C32046Q555Q641R138J0544J2502J3968J4475J4773J5847J7665J9366K0450
63609D97970K1252K2253K3413K4346K4812K4764K4028K2234J9130J4848R896M948
63597G33894O16k774n325p346q863r509r155q530q793j0373j2569j4471j5952
63584F20850j7400j8797j9609j9595j9185j8820j8230j6752j4221j1269q707o797
63572D31468n147l228r30J318K935L679L840L975M460N318O346P361Q255Q991
63558D78641R565J0017J0370J0599J0789J1348J2842J5440J8586K1425K3530K5146
63546F58298K6750K8569L0361L1415L0680K7246K1004J2896M502k655p615j0148
$$ plain form
63534 851303 840634 830680 821868 813926 806097 797585 788004 777295 765102 750458 732365 710577 685675
63521 685675 658578 630316 602053 574775 548799 523947 500302 478391 458515 440407 423903
63510 423903 409533 397860 388397 379856 371537 363993 358006 353355 349065 344690 340836 338330 337211 336817
63496 336817 336595 336486 336613 336940 337381 337990 338860 339922 340966 341792 342241 342218 341859 341585 341829 342743 344286 346451
63478 346451 349180 352172 355043 357688 360176 362303 363550 363619 362722 361289 359646 358112 356980 356037 354347
63463 354347 351048 346369 341574 337804 335235 333431 332195 331841 332720 334743 337401 340197 343025 346195 350093
63448 350093 354845 360340 366529 373558 381555 390354 399603 409171 419333 430462 442595 455477 469071
63435 469071 483898 500683 519659 540239 561280 581495 599618 614541 625712 633545 639355 644781
$$ packed form
63534H51303j0669r954q812p942p829q512r581j0709j2193j4644j8093k1788k4902
63521F85675k7097k8262k8263k7278k5976k4852k3645k1911j9876j8108j6504
63510D23903j4370j1673r463q541q319p544n987m651m290m375l854k506j119l94
63496C36817k22j09J27L27M41O09Q70J062J044Q26M49k3l59k74K44R14J543K165
63478C46451K729K992K871K645K488K127J247O9q97j433j643j534j132r43j690
63463C54347l299m679m795l770k569j804j236l54Q79K023K658K796K828L170L898
63448C50093M752N495O189P029P997Q799R249R568J0162J1129J2133J2882J3594
63435D69071J4827J6785J8976K0580K1041K0215J8123J4923J1171P833N810N426
$$ plain form
63423 644781 651249 659806 671164 685641 703083 723030 745084 769110 795015 822347 850094 876873
63411 876873 901270 922045 938115 948555 952797 950982 944108 933772 921633 908948 896377 883994
63399 883994 871478 858398 844357 828803 810801 789318 763958 735447 705343 675336 646678
63388 646678 619876 594652 570506 547645 527232 510371 496972 486051 477021 470183 465910 463952
63376 463952 463791 465202 468171 472688 478927 487268 497663 509231 520895 532291 543774 555760 568474
63363 568474 582141 596994 613157 630850 650529 672457 696288 721439 747688 774897 802372
63352 802372 828989 853859 876222 894790 907983 915079 916626 913598 906776 897111 885943 874321
63340 874321 862505 850513 838677 827168 815237 801478 784795 764954 742520 718600 694369
$$ packed form
63423F44781O468Q557J1358J4477J7442J9947K2054K4026K5905K7332K7747K6779
63411H76873K4397K0775J6070J0440M242j815o874j0336j2139j2685j2571j2383
63399H83994j2516j3080j4041j5554j8002k1483k5360k8511l0104l0007k8658
63388F46678k6802k5224k4146k2861k0413j6861j3399j0921r030o838m273j958
63376D63952j61J411K969M517O239Q341J0395J1568J1664J1396J1483J1986J2714
63363E68474J3667J4853J6163J7693J9679K1928K3831K5151K6249K7209K7475
63352H02372K6617K4870K2363J8568J3193P096J547l028o822r665j1168j1622
63340H74321j1816j1992j1836j1509j1931j3759j6683j9841k2434k3920k4231
$$ plain form
63329 694369 670480 647099 624659 604168 586344 570898 557156 545139 535409 528125 522844 519060
63317 519060 516150 512785 507209 498433 486795 473232 458623 444014 430762 419815 411067 403817 397650
63304 397650 392536 388405 385150 382994 382294 382849 383770 384232 384149 383894 383504 382357 379659 375124 369238 362933
63288 362933 357026 351812 347115 342649 338260 333782 328875 323341 317745 313354 311112 310731 311068 311291 311281
63273 311281 310988 310063 308479 307001 306493 306937 307668 308465 309884 312430 315848 319446 322771 325764 328493 330986
63257 330986 333314 335696 338519 342168 346694 351673 356632 361623 367238 373987 381863 390546 399857 409881
63243 409881 420874 433058 446408 460544 475038 489903 505649 522813 541619 562079 584151
63232 584151 607619 632032 656919 681961 706910 731587 756019 780291 804134 827032 849038
$$ packed form
63329F94369k3889k3381k2440k0491j7824j5446j3742j2017r730p284n281l784
63317E19060k910l365n576q776j1638j3563j4609j4609j3252j0947q748p250o167
63304C97650n114m131l255k156p00N55R21M62q3k55l90j147k698m535n886o305
63288C62933n907n214m697m466m389m478m907n534n596m391k242l81L37K23j0
63273C11281k93r25j584j478n08M44P31P97J419K546L418L598L325K993K729K493
63257C30986K328K382K823L649M526M979M959M991N615O749P876Q683R311J0024
63243D09881J0993J2184J3350J4136J4494J4865J5746J7164J8806K0460K2072
63232E84151K3468K4413K4887K5042K4949K4677K4432K4272K3843K2898K2006
$$ plain form
63221 849038 871122 894290 918461 942635 966037 988634 1010522 1031259 1049956 1065706 1077718
63210 1077718 1085262 1087722 1084663 1075878 1061562 1042498 1019916 995033 968788 941903 914909 888130
63198 888130 861980 837436 815921 798475 785090 774918 766926 760356 754925 750897 748822 749024 751472
63185 751472 756186 763414 773083 784396 796411 808904 822259 836649 851761 867266 883037 898806
63173 898806 914053 928471 942194 955311 967393 977749 985922 991708 994782 994549 990328 981664 968556
63160 968556 951449 930833 906889 879793 850434 820396 790984 762519 734826 708086 682846
63149 682846 659524 638335 619559 603314 589076 575939 563535 552391 543286 536541 531936 528892
63137 528892 526521 523915 520797 517835 516089 516167 517979 521068 524943 529178 533494 537897 542691 548369 555336
$$ packed form
63221H49038K2084K3168K4171K4174K3402K2597K1888K0737J8697J5750J2012
63210A077718P544K460l059q785j4316j9064k2582k4883k6245k6885k6994k6779
63198H88130k6150k4544k1515j7446j3385j0172p992o570n431m028k075K02K448
63185G51472M714P228R669J1313J2015J2493J3355J4390J5112J5505J5771J5769
63173H98806J5247J4418J3723J3117J2082J0356Q173N786L074k33m221q664j3108
63160I68556j7107k0616k3944k7096k9359l0038k9412k8465k7693k6740k5240
63149F82846k3322k1189j8776j6245j4238j3137j2404j1144r105o745m605l044
63137E28892k371k606l118k962j746P8J812L089L875M235M316M403M794N678O967
$$ plain form
63122 555336 563544 572270 580466 587545 593754 599582 604817 608457 609661 608665 606610 604529 602619 600464
63108 600464 597746 594643 591680 589377 588000 587444 587347 587388 587461 587450 586959 585619 583688 581997 581161 581099 581403 581750
63090 581750 581750 580945 579496 578477 578838 580209 581394 582043 583133 585653 589475 593801 598224 602919 608163 614069
63074 614069 620636 627760 635302 643329 652172 662114 673206 685466 698991 713783 729689 746685 764983
63061 764983 784842 806607 831000 858880 890484 925299 962966 1003810 1048138 1095487 1145109
63050 1145109 1196731 1250241 1304951 1360058 1415703 1472736 1531202 1589804 1647244 1703497 1759259
63039 1759259 1814551 1868623 1921188 1973118 2025465 2077990 2128908 2175972 2217479 2252186 2278795
63028 2278795 2296031 2303081 2299513 2284786 2258337 2220314 2171785 2114152 2048860 1977929 1904143 1830140
$$ packed form
63122E55336Q208Q726Q196P079O209N828N235L640J204r96k055k081j910k155
63108F00464k718l103k963k303j377n56r7M1P3j1m91j340j931j691q36o2L04L47
63090E81750%q05j449j019L61J371J185O49J090K520L822M326M423M695N244N906
63074F14069O567P124P542Q027Q843R942J1092J2260J3525J4792J5906J6996J8298
63061G64983J9859K1765K4393K7880L1604L4815L7667M0844M4328M7349M9622
63050A145109N1622N3510N4710N5107N5645N7033N8466N8602N7440N6253N5762
63039A759259N5292N4072N2565N1930N2347N2525N0918M7064M1507L4707K6609
63028B278795J7236P050l568j4727k6449l8023m8529n7633o5292p0931p3786p4003
$$ plain form
63016 1830140 1757599 1687649 1621631 1560888 1506199 1458059 1417274 1384541 1359547 1341265 1329261
63005 1329261 1323963 1325472 1332727 1344226 1359095 1377127 1398124 1421682 1447481 1475418 1505250 1536148
62993 1536148 1566744 1595946 1623809 1651251 1678634 1704983 1729010 1750340 1768955 1783740 1792679
62982 1792679 1794631 1789985 1779296 1762148 1737833 1706353 1668201 1623774 1573725 1519481 1462833 1405253
62970 1405253 1347975 1292257 1238942 1188109 1139735 1094439 1052965 1015154 980148 947478 917310
62959 917310 889668 864065 840066 817699 797104 778139 760463 743685 727312 710878 694271
62948 694271 677797 661838 646620 632287 619025 607069 596653 587800 579992 572290 564123 555871
62936 555871 548382 542008 536464 531471 527129 523641 520988 518979 517387 515997 514772 513871 513335 512920 512479
$$ packed form
63016A830140p2541o9950o6018o0743n4689m8140m0785l2733k4994j8282j2004
63005A329261n298J509P255J1499J4869J8032K0997K3558K5799K7937K9832L0898
62993A536148L0596K9202K7863K7442K7383K6349K4027K1330J8615J4785Q939
62982A792679J952m646j0689j7148k4315l1480l8152m4427n0049n4244n6648n7580
62970A405253n7278n5718n3315n0833m8374m5296m1474l7811l5006l2670l0168
62959I17310k7642k5603k3999k2367k0595j8965j7676j6778j6373j6434j6607
62948F94271j6474j5959j5218j4333j3262j1956j0416q853p808p702q167q252
62936E55871p489o374n544m993m342l488k653k009j592j390j225r01n36m15m41
$$ plain form
62921 512479 512244 512359 512312 511382 509462 506904 503759 499877 495764 492467 490324 488484 486012 482925 479845
62906 479845 477186 475027 473284 471536 469148 465968 462580 459542 456842 454458 452824 452161 451881 451378 450927
62891 450927 450958 450834 449460 447048 445228 445138 446252 447411 448176 448742 449202 449535 449899 450364 450589 450204 449333 448458
62873 448458 447922 447835 448186 448787 449346 449859 450632 451674 452397 452355 451923 451771 451867 451546 450417 448707 446750 444743
62855 444743 443099 442519 443392 445369 447640 449379 449955 449165 447523 446027 445401 445680 446534 447593 448338 448137
62839 448137 446844 445142 443892 443259 442797 442231 441725 441415 441128 440719 440376 440396 440864 441692 442767 443899 444781
62822 444781 445292 445824 447065 449399 452638 456396 460564 465266 470466 475855 481215 486659 492328 497991 503246
62807 503246 508193 513579 520036 527366 534913 542616 551299 561713 573587 585989 598465 611506 625874
$$ packed form
62921E12479k35J15m7r30j920k558l145l882m113l297k143j840k472l087l080
62906D79845k659k159j743j748k388l180l388l038k700k384j634o63k80n03m51
62891D50927L1j24j374k412j820r0J114J159P65N66M60L33L64M65K25l85q71q75
62873D48458n36q7L51O01N59N13P73J042P23m2m32j52R6l21j129j710j957k007
62855D44743j644n80Q73J977K271J739N76p90j642j496o26K79Q54J059P45k01
62839D48137j293j702j250o33m62n66n06l10k87m09l43K0M68Q28J075J132Q82
62822D44781N11N32J241K334L239L758M168M702N200N389N360N444N669N663N255
62807E03246M947N386O457P330P547P703Q683J0414J1874J2402J2476J3041J4368
$$ plain form
62794 625874 641939 659869 680010 702683 727787 755152 785301 819364 858089 901343 948795
62783 948795 1000687 1057639 1120067 1188208 1262398 1342649 1427922 1516317 1606133 1696343 1785950
62772 1785950 1873229 1955772 2030960 2096263 2149472 2188955 2213685 2223013 2216669 2194994 2158921 2109585
62760 2109585 2048308 1976979 1898044 1813874 1726464 1637822 1550036 1464550 1381815 1302150 1226523
62749 1226523 1155885 1090109 1028402 970663 917711 870048 827149 788208 752980 721547 693713
62738 693713 669061 647309 628291 611767 597535 585492 575374 566643 558920 552323 547078 542961
62726 542961 539420 536224 533682 532215 531935 532695 534378 537021 540665 545197 550480 556764 564829 575443
62712 575443 588629 603718 620275 638665 659570 683245 709584 738741 771314 807936 848942
$$ packed form
62794F25874J6065J7930K0141K2673K5104K7365L0149L4063L8725M3254M7452
62783I48795N1892N6952O2428O8141P4190Q0251Q5273Q8395Q9816R0210Q9607
62772A785950Q7279Q2543P5188O5303N3209L9483K4730R328o344k1675l6073m9336
62760B109585o1277p1329p8935q4170q7410q8642q7786q5486q2735p9665p5627
62749A226523p0638o5776o1707n7739n2952m7663m2899l8941l5228l1433k7834
62738F93713k4652k1752j9018j6524j4232j2043j0118q731p723o597n245m117
62726E42961l541l196k542j467k80P60J683K643L644M532N283O284Q065J0614
62712E75443J3186J5089J6557J8390K0905K3675K6339K9157L2573L6622M1006
$$ plain form
62701 848942 894376 944003 997254 1053437 1112194 1173588 1237633 1303789 1370892 1437422 1501748
62690 1501748 1562306 1617689 1666524 1707160 1737623 1756109 1761644 1754222 1734332 1702568 1659879 1608055
62678 1608055 1549565 1486661 1420663 1352284 1282537 1213110 1145783 1081669 1021125 964237 911204
62667 911204 862335 817805 777453 740786 707239 676538 648794 624169 602527 583473 566611
62656 566611 551615 538109 525683 514102 503334 493273 483625 474193 465182 457036 450020 444093 439055
62643 439055 434580 430224 425806 421911 419579 419149 419651 419779 419297 419038 419582 420509 421046 420913 420185 418815 416785
62626 416785 414462 412307 410391 408655 407514 407637 409059 411063 413147 415704 419442 424469 430322 436669
62612 436669 443566 451007 458694 466475 474800 484380 495340 507075 519142 532101 547095 564666 584497
$$ packed form
62701H48942M5434M9627N3251N6183N8757O1394O4045O6156O7103O6530O4326
62690A501748O0558N5383M8835M0636L0463J8486N535p422j9890l1764m2689n1824
62678A608055n8490o2904o5998o8379o9747o9427o7327o4114o0544n6888n3033
62667I11204m8869m4530m0352l6667l3547l0701k7744k4625k1642j9054j6862
62656E66611j4996j3506j2426j1581j0768j0061r648r432r011q146p016n927n038
62643D39055m475m356m418l895k332m30N02J28m82k59N44R27N37j33p28j370k030
62626D16785k323k155j916j736j141J23J422K004K084K557L738N027N853O347
62612D36669O897P441P687P781Q325R580J0960J1735J2067J2959J4994J7571J9831
$$ plain form
62599 584497 606363 630820 658582 689686 723766 760817 800988 843725 887761 932034 975997
62588 975997 1018823 1058859 1094236 1123685 1146557 1162370 1170665 1171107 1163525 1148132 1125862 1098173
62576 1098173 1066249 1030638 991851 950996 909522 868546 828699 790379 753875 719516 687964
62565 687964 660045 635785 613894 592836 572478 554222 539382 527799 518100 508980 500035 491713
62553 491713 484739 479503 475752 472821 470204 467828 465824 464232 463065 462506 462801 463826 464939 465456 465370
62538 465370 465407 466219 467615 468771 469114 468749 468139 467805 468404 470630 474725 480259 486657 493760 501838 511425
62522 511425 523365 538579 557270 578581 601477 625878 652499 681819 713698 747905 784329
62511 784329 822529 861614 900831 939847 978176 1014705 1048054 1077148 1101195 1119498 1131749
$$ packed form
62599E84497K1866K4457K7762L1104L4080L7051M0171M2737M4036M4273M3963
62588I75997M2826M0036L5377K9449K2872J5813Q295M42p582j5393k2270k7689
62576A098173l1924l5611l8787m0855m1474m0976l9847l8320l6504l4359l1552
62565F87964k7919k4260k1891k1058k0358j8256j4840j1583r699r120q945q322
62553D91713o974n236l751k931k617k376k004j592j167n59K95J025J113N17q6
62538D65370L7Q12J396J156L43l65o10l34N99K226M095N534O398P103Q078R587
62522E11425J1940J5214J8691K1311K2896K4401K6621K9320L1879L4207L6424
62511G84329L8200L9085L9217L9016L8329L6529L3349K9094K4047J8303J2251
$$ plain form
62500 1131749 1138283 1139601 1135710 1126401 1112281 1095093 1076851 1058863 1041803 1026436 1013914 1005379
62488 1005379 1001562 1002823 1009349 1021211 1038334 1060525 1087454 1118601 1153348 1191151 1231416 1273180
62476 1273180 1315148 1356091 1394773 1429225 1456596 1474448 1482179 1480753 1471143 1453503 1427663 1393594
62464 1393594 1351339 1301433 1245854 1187813 1129895 1072817 1016484 961671 909900 862111 818417
62453 818417 779017 744420 714647 689078 667434 650227 637755 629067 622454 616879 612635 610653
62441 610653 611360 614223 618269 622920 628080 633491 638539 642978 647326 651817 655285 655958 653405 648837 643343
62426 643343 636654 628121 618138 607878 598078 588766 579926 571690 563928 556189 548202 540070 531948 523874
62412 523874 516005 508701 502214 496367 490671 484701 478496 472639 467816 464117 460893 457497 454063 451334
$$ packed form
62500A131749O534J318l891r309j4120j7188j8242j7988j7060j5367j2522q535
62488A005379l817J261O526J1862J7123K2191K6929L1147L4747L7803M0265M1764
62476A273180M1968M0943L8682L4452K7371J7852P731j426r610j7640k5840l4069
62464A393594m2255m9906n5579n8041n7918n7078n6333n4813n1771m7789m3694
62453H18417l9400l4597k9773k5569k1644j7207j2472q688o613n575m244j982
62441F10653P07K863M046M651N160N411N048M439M348M491L468O73k553m568n494
62426F43343o689q533r983j0260r800r312q840q236p762p739p987q132q122q074
62412E23874p869p304o487n847n696n970o205n857m823l699l224l396l434k729
$$ plain form
62398 451334 449797 449308 449566 450543 452279 454496 456739 458821 460895 463013 464894 466290 467487 469188 471863
62383 471863 475439 479664 484506 489974 495765 501464 507077 513052 519737 527085 534939 543320 552299 561831
62369 561831 571952 582979 595397 609654 626116 644966 666035 688924 713501 740167 769556
62358 769556 802198 838535 878889 922939 969321 1016100 1061659 1104956 1145043 1180760 1210964
62347 1210964 1234811 1251720 1261382 1264018 1260449 1251678 1238337 1220600 1198532 1172498 1143375 1112542
62335 1112542 1081633 1052030 1024390 998623 974403 951760 931202 913270 898100 885475 875164
62324 875164 866913 859965 852904 844367 833984 822285 809546 795091 778030 758469 737526 716198
62312 716198 694816 673749 653953 636193 620078 604634 589822 576781 566349 557987 550510 543365
$$ packed form
62398D51334j537m89K58R77J736K217K243K082K074K118J881J396J197J701K675
62383D71863L576M225M842N468N791N699N613N975O685P348P854Q381Q979R532
62369E61831J0121J1027J2418J4257J6462J8850K1069K2889K4577K6666K9389
62358G69556L2642L6337M0354M4050M6382M6779M5559M3297M0087L5717L0204
62347A210964K3847J6909R662K636l569q771j3341j7737k2068k6034k9123l0833
62335A112542l0909k9603k7640k5767k4220k2643k0558j7932j5170j2625j0311
62324H75164q251o948p061q537j0383j1699j2739j4455j7061j9561k0943k1328
62312G16198k1382k1067j9796j7760j6115j5444j4812j3041j0432q362p477p145
$$ plain form
62300 543365 536702 530683 525381 521175 518551 517405 517030 516859 516864 517168 517743 518643 520160 522517 525587 529086
62284 529086 532820 536660 540523 544519 548944 553954 559357 564869 570490 576612 583801 592434 602383 613049
62270 613049 623943 635268 647689 661518 676371 691764 707889 725675 746190 769929 796525
62259 796525 825188 855608 888355 924221 963289 1004967 1048721 1094202 1140562 1186154 1229061
62248 1229061 1267492 1299664 1324068 1340321 1349309 1351992 1348412 1338186 1321511 1299047 1271133 1237841
62236 1237841 1199701 1157776 1113050 1066363 1019041 973014 929971 890660 855151 823428 795514
62225 795514 771292 750464 732601 717173 703710 692037 682181 673964 666896 660548 654857 649941 645844
62212 645844 642621 640406 639123 638293 637467 636852 637100 638402 640149 641758 643586 646615 651304 657113 663243
$$ packed form
62300E43365o663o019n302m206k624j146l75j71NL04N75R00J517K357L070L499
62284E29086L734L840L863L996M425N010N403N512N621O122P189Q633R949J0666
62270F13049J0894J1325J2421J3829J4853J5393J6125J7786K0515K3739K6596
62259G96525K8663L0420L2747L5866L9068M1678M3754M5481M6360M5592M2907
62248A229061L8431L2172K4404J6253Q988K683l580j0226j6675k2464k7914l3292
62236A237841l8140m1925m4726m6687m7322m6027m3043l9311l5509l1723k7914
62225G95514k4222k0828j7863j5428j3463j1673r856q217p068o348n691m916m097
62212F45844l223k215j283q30q26o15K48J302J747J609J828L029M689N809O130
$$ plain form
62197 663243 669444 675891 682608 689404 696246 703289 710530 717768 724959 732376 740293 748645 757057 765076
62183 765076 772371 778881 784814 790437 795886 801249 806643 811960 816749 820760 824563 829275 835697 844101
62169 844101 854794 868286 884754 903849 925315 949349 976108 1005211 1035902 1067142 1097263
62158 1097263 1124064 1145909 1162443 1173885 1180039 1180557 1175846 1166902 1154374 1138367 1119098 1097099
62146 1097099 1072709 1045985 1017331 987812 958722 931131 905883 883531 864046 846958 831955
62135 831955 819124 808535 799941 793018 787524 783020 778755 774072 768755 762851 756518 750264 744976 741299
62121 741299 739097 737814 737244 737537 738528 739404 739138 737057 732984 727198 720448 713722 707637 702020 696281
62106 696281 690132 683694 676934 669377 660652 651126 641651 632773 624480 616704 609789 604354 600920 599667
$$ packed form
62197F63243O201O447O717O796O842P043P241P238P191P417P917Q352Q412Q019
62183G65076P295O510N933N623N449N363N394N317M789M011L803M712O422Q404
62169H44101J0693J3492J6468J9095K1466K4034K6759K9103L0691L1240L0121
62158A097263K6801K1845J6534J1442O154N18m711q944j2528j6007j9269k1999
62146A097099k4390k6724k8654k9519k9090k7591k5248k2352j9485j7088j5003
62135H31955j2831j0589q594o923n494m504m265m683n317n904o333o254n288l677
62121G41299k202j283n70K93R91Q76k66k081m073n786o750o726o085n617n739
62106F96281o149o438o760p557q725r526r475q878q293p776o915n435l434j253
$$ plain form
62092 599667 600280 601992 604124 606763 610669 616315 623238 630475 637392 643973 650632 658008 666659 676644
62078 676644 687599 699403 712458 726973 742390 758013 773935 790703 808194 825522 842183
62067 842183 858720 876018 894392 913654 933696 954620 976383 998498 1019956 1039299 1054985
62056 1054985 1065962 1072023 1073625 1071389 1065661 1056359 1043200 1026164 1005649 982107 955750 926882
62044 926882 896297 864855 832695 799411 765268 731790 700749 672749 647117 623062 600564
62033 600564 580099 561882 545626 530978 517833 506138 495595 485903 477216 469979 464190 459137
62021 459137 454063 448779 443389 437796 431923 426165 421102 416837 413098 409946 407838 406985 407059 407643 408511
62006 408511 409425 410193 411139 413050 416335 420562 425106 429872 435117 440892 447073 453673 460567 466916 471375
$$ packed form
62092E99667O13J712K132K639L906N646O923P237O917O581O659P376Q651R985
62078F76644J0955J1804J3055J4515J5417J5623J5922J6768J7491J7328J6661
62067H42183J6537J7298J8374J9262K0042K0924K1763K2115K1458J9343J5686
62056A054985J0977O061J602k236n728r302j3159j7036k0515k3542k6357k8868
62044I26882l0585l1442l2160l3284l4143l3478l1041k8000k5632k4055k2498
62033F00564k0465j8217j6256j4648j3145j1695j0543r692q687p237n789n053
62021D59137n074n284n390n593n873n758n063m265l739l152k108q53P4N84Q68
62006D08511R14P68R46J911L285M227M544M766N245N775O181O600O894O349M459
$$ plain form
61991 471375 473151 472772 471659 470852 470086 468050 463617 456857 448870 440796 433170 426053 419354 412942 406758
61976 406758 400985 395817 391024 386136 381237 377133 374378 372466 370452 368144 366157 364862 363824 362450
61962 362450 360754 359190 357990 356985 356031 355334 355221 355701 356352 356712 356757 356909 357582 358815 360430 362512 365574
61945 365574 370195 376503 384057 392219 400619 409300 418570 428786 440175 452578 465345 477630 488933
61932 488933 499243 508715 517429 525520 533180 540275 546236 550639 553704 555919 557319 557489 556165 553490
61918 553490 549785 545486 541240 537667 535010 533361 533128 534819 538352 543142 548968 556214 565027 574762
61904 574762 584592 594276 603897 613153 621313 627747 632202 634711 635566 635267 634247 632632 630372 627498 624195
61889 624195 620825 617952 616087 615204 614729 614158 613391 612307 610360 606932 601848 595159 586695 576350 564756
$$ packed form
61991D71375J776l79j113q07p66k036m433o760p987q074p626p117o699o412o184
61976D06758n773n168m793m888m899m104k755j912k014k308j987j295j038j374
61962C62450j696j564j200j005r54o97j13M80O51L60M5J52O73J233J615K082L062
61945C65574M621O308P554Q162Q400Q681R270J0216J1389J2403J2767J2285J1303
61932D88933J0310R472Q714Q091P660P095N961M403L065K215J400J70j324k675
61918E53490l705m299m246l573k657j649k33J691L533M790N826P246Q813R735
61904E74762R830R684R621R256Q160O434M455K509Q55k99j020j615k260k874l303
61889F24195l370k873j865q83m75n71p67j084j947l428n084o689q464j0345j1594
$$ plain form
61874 564756 553173 542548 532920 523826 515036 506802 499624 493936 489866 487127 485141 483472 482288 482456
61860 482456 484955 490027 496905 504551 512657 521769 532544 545161 559384 574807 590885 607163 623710
61847 623710 641017 659146 677285 694431 710271 724957 738146 748777 755915 759519 760245 758728
61835 758728 755265 750109 743862 737426 731496 726268 721793 718542 717336 718702 722567 728584 736357 745139
61821 745139 753761 761263 767539 773023 777855 781447 782741 780695 774818 765657 754747 743775 733663
61808 733663 724425 715644 706858 697669 687861 677483 666659 655366 643543 631317 618938 606596
61796 606596 594503 583064 572748 563734 555834 548730 542223 536338 531300 527275 524090 521373 518990
61783 518990 517116 515760 514491 512845 510750 508383 505951 503854 502698 502707 503376 504136 505159 507041 509859
$$ packed form
61874E64756j1583j0625r628r094q790q234p178n688m070k739j986j669j184J68
61860D82456K499N072O878P646Q106R112J0775J2617J4223J5423J6078J6278J6547
61847F23710J7307J8129J8139J7146J5840J4686J3189J0631P138L604P26j517
61835G58728l463n156o247o436n930n228m475l251j206J366L865O017P773Q782
61821G45139Q622P502O276N484M832L592J294k046n877r161j0910j0972j0112
61808G33663r238q781q786r189r808j0378j0824j1293j1823j2226j2379j2342
61796F06596j2093j1439j0316r014p900p104o507n885n038m025l185k717k383
61783E18990j874j356j269j646k095k367k432k097j156RO69P60J023J882K818
$$ plain form
61768 509859 513110 516550 520526 525384 530987 537038 543464 550289 557431 564916 573086 582332 592604 603313
61754 603313 613747 623564 632824 641429 648546 652868 653646 651293 646794 640726 633050 623628 612547 600139
61740 600139 587123 574612 563547 553977 545269 536998 529333 522576 516731 511648 507260 503544 500523
61727 500523 498351 497086 496334 495472 494354 493437 493085 493090 493124 493312 494003 495137 496176 496627 496413 495793 495045 494205
61709 494205 492994 491037 488198 484647 480588 476087 471262 466427 461927 457898 454326 451210 448539 446165
61695 446165 443840 441352 438519 435166 431261 427073 423008 419263 415739 412377 409448 407317 405899 404552
61681 404552 402635 400113 397483 395175 393246 391562 390015 388519 387057 385884 385405 385707 386372 386951 387438
61666 387438 388084 388973 390036 391318 392938 394846 396939 399398 402644 406867 411757 416777 421605 426259 430810
$$ packed form
61768E09859L251L440L976M858N603O051O426O825P142P485Q170R246J0272J0709
61754F03313J0434R817R260Q605P117M322P78k353m499o068p676r422j1081j2408
61740F00139j3016j2511j1065r570q708q271p665o757n845n083m388l716l021
61727E00523k172j265p52q62j118r17l52NL4J88O91J134J039M51k14o20p48q40
61709D94205j211j957k839l551m059m501m825m835m500m029l572l116k671k374
61695D46165k325k488k833l353l905m188m065l745l524l362k929k131j418j347
61681D04552j917k522k630k308j929j684j547j496j462j173m79L02O65N79M87
61666C87438O46Q89J063J282J620J908K093K459L246M223M890N020M828M654M551
$$ plain form
61651 430810 434975 438070 439535 439516 438657 437283 435201 432459 429890 428475 428428 429339 430944 433247 435973 438493
61635 438493 440466 442232 444475 447603 451409 455135 457964 459684 460640 460796 459236 455140 449071 442570 436541
61620 436541 430674 424587 418745 413858 409912 406320 402767 399488 396817 394742 392845 390548 387567 384203
61606 384203 380979 377952 374598 370528 366044 361854 358425 355724 353379 350925 348058 344795 341366 337976
61592 337976 334794 332060 329927 328253 326804 325618 324858 324366 323749 322905 322060 321298 320535 319913 319649 319416 318566
61575 318566 317196 316276 316289 316431 315801 314898 315177 317288 320427 323313 325182 325878 325673 325231 325359 326437 328286
61558 328286 330630 333423 336595 339721 342191 343618 344074 344033 344131 344828 346137 347667 348986 349943 350723 351567
61542 351567 352454 353036 352960 352295 351573 351434 352198 353700 355374 356520 356652 355710 353953 351798 349788 348511 348233
$$ packed form
61651D30810M165L095J465j9q59j374k082k742k569j415m7R11J605K303K726K520
61635D38493J973J766K243L128L806L726K829J720R56J56j560m096o069o501o029
61620D36541n867o087n842m887l946l592l553l279k671k075j897k297k981l364
61606C84203l224l027l354m070m484m190l429k701k345k454k867l263l429l390
61592C37976l182k734k133j674j449j186p60m92o17q44q45p62p63o22k64k33q50
61575C18566j370r20J3J42o30r03K79K111L139K886J869O96k05m42J28J078J849
61558C28286K344K793L172L126K470J427M56m1R8O97J309J530J319R57P80Q44
61542C51567Q87N82p6o65p22j39P64J502J674J146J32r42j757k155k010j277k78
$$ plain form
61525 348233 348737 349730 351231 353222 355109 356115 356177 355933 355737 355314 354584 354175 354653 355675 356433 356630 356645 356970
61507 356970 357938 359719 362089 364325 365842 366938 368556 371284 374820 378353 381263 383548 385869 389055
61493 389055 393250 397610 401141 403771 406322 409490 413144 416584 419144 420542 420965 420971 421113 421613 422450 423640
61477 423640 425210 426958 428529 429719 430510 430841 430593 429806 428659 427179 425215 422829 420505 418829 417984
61462 417984 417604 417050 415804 413686 410824 407506 404155 401303 399362 398328 397915 397996 398727 400133 401914 403817
61446 403817 405908 408169 410157 411457 412364 413745 416224 419764 423881 427912 431187 433380 434768 435878
61432 435878 436893 437655 438126 438441 438524 438192 437740 437952 439259 441221 443160 445013 447229 449980 452831 455234
61416 455234 457120 458946 461185 463753 465948 467116 467377 467479 467818 467865 466716 464054 460404 456651 453543
$$ packed form
61525C48233N04R93J501J991J887J006O2k44j96m23p30m09M78J022P58J97J5L25
61507C56970R68J781K370K236J517J096J618K728L536L533K910K285K321L186
61493C89055M195M360L531K630K551L168L654L440K560J398M23OJ42N00Q37J190
61477D23640J570J748J571J190P91L31k48p87j147j480j964k386k324j676q45
61462D17984l80n54j246k118k862l318l351k852j941j034m13Q1P31J406J781J903
61446D03817K091K261J988J300R07J381K479L540M117M031L275K193J388J110
61432D35878J015P62M71L15Q3l32m52K12J307J962J939J853K216K751K851K403
61416D55234J886J826K239K568K195J168K61J02L39M7j149k662l650l753l108
$$ plain form
61401 453543 451474 450300 449358 447978 446108 444260 442769 441342 439418 436751 433514 430058 426806 424245
61387 424245 422677 421977 421797 422008 422724 423892 425176 426384 427787 429775 432324 435006 437490 439950 442932
61372 442932 446836 451431 455875 459398 461940 463942 465574 466562 466860 466945 467126 467055 466400 465624 465472 465958 466605
61355 466605 467521 469383 472277 475416 478351 481779 486651 492927 499607 505541 509824 511917 512039 511265 510722
61340 510722 510692 510844 511135 512069 514052 516795 519413 521069 521646 521839 522367 523012 522803 521267 519105 517430 516785
61323 516785 517199 518584 520518 522107 522836 523397 525025 528153 532330 537320 543511 551150 559857 569140 578877
61308 578877 589118 599887 611443 624281 638540 653594 668376 681786 692733 700251 704029 704641
61296 704641 702949 699373 693962 686985 679090 670816 662214 653086 643500 633868 624503 615292 605978 596668
$$ packed form
61401D53543k069j174r42j380j870j848j491j427j924k667l237l456l252k561
61387D24245j568p00j80K11P16J168J284J208J403J988K549K682K484K460K982
61372D42932L904M595M444L523K542K002J632R88K98Q5J81p1o55p76j52M86O47
61355D66605R16J862K894L139K935L428M872O276O680N934M283K093J22p74n43
61340E10722l0J52K91R34J983K743K618J656N77J93N28O45k09j536k162j675o45
61323E16785M14J385J934J589P29N61J628L128M177M990O191P639Q707R283R737
61308E78877J0241J0769J1556J2838J4259J5054J4782J3410J0947P518L778O12
61296G04641j692l576n411o977p895q274q602r128r586r632r365r211r314r310
$$ plain form
61282 596668 587834 579889 573098 567860 564514 562637 561111 559387 558350 559270 562158 565719 568789 571114
61268 571114 572787 573759 574229 574847 576122 578028 580489 583867 588564 594461 601103 608158 615287 621769 626731
61253 626731 629822 631395 632058 632246 632207 632167 632449 633467 635429 637972 640296 641976 643506 645695 648511 650883
61237 650883 651816 651422 650634 650145 649980 650004 650399 651452 653229 655726 659190 663921 669792 676282 682992 689870
61221 689870 696907 703917 710741 717367 723719 729618 735132 740697 746612 752590 758054 762704 766614 769963
61207 769963 772971 775884 778719 781188 783246 785625 789487 795443 803161 811923 821343 831536 842824 855372
61193 855372 869015 883309 897637 911125 922544 930722 935343 937138 937156 936042 934166 932016 930003
61180 930003 928007 925458 921752 916462 909496 901447 893482 886374 879750 872683 864815 856524 848246 840288
$$ packed form
61282E96668q834p945o791n238l346j877j526j724j037R20K888L561L070K325
61268E71114J673R72M70O18J275J906K461L378M697N897O642P055P129O482M962
61253F26731L091J573O63J88l9m0K82J018J962K543K324J680J530K189K816K372
61237F50883R33l94p88m89j65K4L95J053J777K497L464M731N871O490O710O878
61221F89870P037P010O824O626O352N899N514N565N915N978N464M650L910L349
61207G69963L008K913K835K469K058K379L862N956P718Q762R420J0193J1288J2548
61193H55372J3643J4294J4328J3488J1419Q178M621J795J8j114j876k150k013
61180I30003j996k549l706n290o966q049p965p108o624p067p868q291q278p958
$$ plain form
61166 840288 833153 827299 822469 817741 812438 806628 800823 795649 791782 789630 788951 789240 790521 793259 797482
61151 797482 802655 808665 816262 826020 837244 848317 857880 865341 870592 873805 875555 876813 878580 881416
61137 881416 885249 889672 894611 900631 908378 917840 928412 939689 951802 964991 979191 994121 1009446
61124 1009446 1024779 1039853 1054893 1070609 1087685 1106375 1126479 1147433 1168483 1189093 1209244
61113 1209244 1229097 1248463 1266934 1284393 1300975 1316530 1330555 1342650 1352644 1360348 1365595 1368490
61101 1368490 1369048 1366606 1360185 1349510 1335183 1317822 1297636 1274946 1250458 1224816 1198356 1171467
61089 1171467 1144610 1117852 1090978 1064225 1038254 1013237 988803 965141 943278 923712 905572
61078 905572 887797 870520 854603 840413 827843 816946 807609 798958 790091 781332 773850 768040 763114
$$ packed form
61166H40288p135n854m830m728n303n810n805n174l867k152o79K89J281K738M223
61151G97482N173O010P597R758J1224J1073R563P461N251L213J750J258J767K836
61137H81416L833M423M939O020P747R462J0572J1277J2113J3189J4200J4930J5325
61124A009446J5333J5074J5040J5716J7076J8690K0104K0954K1050K0610K0151
61113A209244J9853J9366J8471J7459J6582J5555J4025J2095R994P704N247K895
61101A368490N58k442o421j0675j4327j7361k0186k2690k4488k5642k6460k6889
61089A171467k6857k6758k6874k6753k5971k5017k4434k3662k1863j9566j8140
61078I05572j7775j7277j5917j4190j2570j0897r337q651q867q759p482n810m926
$$ plain form
61065 763114 758407 754209 750950 748296 745677 743354 742339 743265 745709 748774 752059 755849 760516 766091
61051 766091 772558 780200 789275 799525 810451 822029 834795 849243 865516 883615 903336 924017
61039 924017 944980 966404 989232 1014031 1040522 1068463 1098271 1130314 1164215 1199456 1236324
61028 1236324 1275629 1317623 1361616 1406568 1451938 1498281 1547360 1601495 1662611 1732095 1811390
61017 1811390 1902102 2005341 2121716 2252571 2401196 2573186 2776572 3021996 3321960 3689262
61007 3689262 4136061 4673544 5310743 6053153 6903769 7866044 8945595 10151163 11496840
60998 11496840 12997500 14642161 16350386 17952637 19236571 20045778 20359093 20288911 20011091
60989 20011091 19692649 19458645 19378408 19437977 19513967 19399890 18899036 17926045 16540804 14898323
$$ packed form
61065G63114m707m198l259k654k619k323j015R26K444L065L285L790M667N575
61051G66091O467P642R075J0250J0926J1578J2766J4448J6273J8099J9721K0681
61039I24017K0963K1424K2828K4799K6491K7941K9808L2043L3901L5241L6868
61028A236324L9305M1994M3993M4952M5370M6343M9079N4135O1116O9484P9295
61017A811390R0712J03239J16375J30855J48625J71990K03386K45424K99964L67302
61007C689262M46799N37483O37199P42410Q50616R62275J079551J205568J345677
60998A1496840J500660J644661J708225J602251J283934Q09207L13315p0182k77820
60989B0011091l18442k34004q0237N9569P5990j14077n00854r72991j385241j642481
$$ plain form
60979 14898323 13167798 11480805 9921666 8536399 7341195 6330212 5485548 4785417
60971 4785417 4207413 3730001 3334742 3007112 2734703 2505870 2310808 2142643 1996485
60962 1996485 1868224 1754752 1654153 1564707 1484433 1412175 1348107 1292308 1243610 1200618 1162898
60951 1162898 1130150 1100817 1072762 1045073 1018374 993485 970544 949232 929126 909806 891116
60940 891116 873302 856562 840621 825019 809578 794244 778819 763225 747723 732549 717645
60929 717645 703122 689532 677217 665723 654409 643343 633096 623924 615718 608525 602394 596834
60917 596834 591022 584699 578382 572687 567806 563696 560348 557712 555569 553584 551403 548877 546376 544731
60903 544731 544517 545466 546798 547945 548633 548472 547049 544562 541850 539527 537352 534708 531502 528219 525115
$$ packed form
60979A4898323j730525j686993j559139j385267j195204j010983q44664p00131
60971D785417n78004m77412l95259l27630k72409k28833j95062j68165j46158
60962A996485j28261j13472j00599q9446q0274p2258o4068n5799m8698m2992l7720
60951A162898l2748k9333k8055k7689k6699k4889k2941k1312k0106j9320j8690
60940H91116j7814j6740j5941j5602j5441j5334j5425j5594j5502j5174j4904
60929G17645j4523j3590j2315j1494j1314j1066j0247r172q206p193o131n560
60917E96834n812o323o317n695m881m110l348k636k143j985k181k526k501j645
60903E44731k14R49J332J147O88j61j423k487k712k323k175k644l206l283l104
$$ plain form
60888 525115 521718 517405 512316 507366 503236 499653 495866 491580 487133 482867 478762 474722 470904 467668
60874 467668 465392 464283 464109 464180 463945 463596 463714 464382 465119 465731 466614 468067 469879 471925 474615 478222 482102
60857 482102 485086 486558 486816 486555 486297 486186 486040 485694 485339 485295 485298 484468 482243 479014 475480 471812 467896
60840 467896 464011 460539 457166 453094 448130 442978 438202 433486 428298 422961 418507 415449 413061 410114
60826 410114 406162 401855 398027 394849 392041 389571 387700 386485 385706 385255 385087 384731 383437 381077 378431
60811 378431 376270 374575 372970 371540 370729 370699 371232 372089 373102 374041 374782 375476 376290 377114 377771 378275 378578
60794 378578 378311 377242 375812 374781 374419 374485 374913 375953 377500 378695 378586 377116 375322 374444 374752 375234
60778 375234 374542 372238 368959 365526 362392 359990 358876 359029 359520 359500 359174 359265 359874 360581 361387 362678 364314
$$ packed form
60888E25115l397m313n089m950m130l583l787m286m447m266m105m040l818l236
60874D67668k276j109j74P1k35l49J18O68P37O12Q83J453J812K046K690L607L880
60857D82102K984J472K58k61k58j11j46l46l55m4Lq30k225l229l534l668l916
60840D67896l885l472l373m072m964n152m776m716n188n337m454l058k388k947
60826D10114l952m307l828l178k808k470j871j215p79m51j68l56j294k360k646
60811C78431k161j695j605j430q11l0N33Q57J013R39P41O94Q14Q24O57N04L03
60794C78578k67j069j430j031l62O6M28J040J547J195j09j470j794q78L08M82
60778C75234o92k304l279l433l134k402j114J53M91k0l26R1O09P07Q06J291J636
$$ plain form
60761 364314 365611 366377 367165 368251 369132 369451 369747 370702 372105 373195 373771 374361 375329 376352 376917 377060 377432
60744 377432 378746 381121 383890 386061 387044 386929 386118 384910 383440 381758 379747 377226 374325 371621 369594
60729 369594 368104 366644 365095 363886 363362 363329 363394 363509 363912 364618 365210 365221 364565 363566 362626 361911 361284 360537
60711 360537 359720 359159 358993 358802 358031 356842 356117 356332 356768 356285 354679 352750 351149 349778 348427 347331
60695 347331 346763 346514 346149 345436 344245 342439 340342 338948 339106 340622 342671 344860 347318 349886 352042
60680 352042 353789 355909 358949 362443 365610 368411 371343 374410 376904 378322 379007 379654 380434 380891 380580
60665 380580 379562 378217 376757 375053 372909 370400 367913 365942 364914 365155 366787 369513 372596 375289
60651 375289 377399 379300 381352 383479 385491 387600 390207 393170 395726 397286 397943 397964 397150 395161 392207
$$ packed form
60761C64314J297P66P88J086Q81L19K96R55J403J090N76N90R68J023N65J43L72
60744C77432J314K375K769K171R83j15q11j208j470j682k011k521k901k704k027
60729C69594j490j460j549j209n24l3O5J15M03P06N92J1o56r99r40p15o27p47
60711C60537q17n61j66j91p71j189p25K15M36m83j606j929j601j371j351j096
60695C47331n68k49l65p13j191j806k097j394J58J516K049K189K458K568K156
60680C52042J747K120L040L494L167K801K932L067K494J418O85O47P80M57l11
60665C80580j018j345j460j704k144k509k487j971j028K41J632K726L083K693
60651C75289K110J901K052K127K012K109K607K963K556J560O57K1q14j989k954
$$ plain form
60636 392207 388923 385593 382021 378178 374533 371593 369458 367919 366704 365555 364407 363618 363747 364971 366904
60621 366904 368957 370579 371310 371105 370628 370678 371226 371586 371636 372117 373438 375033 376444 378217 380868 383551 384858
60604 384858 384730 384520 385102 385907 386090 385814 385839 386408 387126 387649 388001 388339 388809 389653 391171 393457 396196 398761
60586 398761 400544 401276 401114 400483 399868 399694 400167 401110 402124 403068 404253 406114 408869 412662 417713 424011
60570 424011 430987 437902 444606 451650 459642 468620 478046 487190 495470 502488 507851 511080 511893 510546
60556 510546 507633 503558 498492 492891 487597 483242 480003 478180 478501 481345 486084 491753 498101 505390
60542 505390 513440 521642 529980 539391 550819 564218 578635 593035 607014 620904 635152 649418
60530 649418 662401 672713 679753 683518 683946 680950 674893 666540 656626 645901 635350 625766 617074
$$ packed form
60636C92207l284l330l572l843l645k940k135j539j215j149j148p89J29J224J933
60621C66904K053J622P31k05m77N0N48L60N0M81J321J595J411J773K651K683J307
60604C84858j28k10N82Q05J83k76K5N69P18N23L52L38M70Q44J518K286K739K565
60586C98761J783P32j62o31o15j74M73R43J014R44J185J861K755L793N051O298
60570D24011O976O915O704P044P992Q978R426R144Q280P018N363L229Q13j347
60556E10546k913m075n066n601n294m355l239j823L21K844M739N669O348P289
60542E05390Q050Q202Q338R411J1428J3399J4417J4400J3979J3890J4248J4266
60530F49418J2983J0312P040L765M28k996o057q353r914j0725j0551r584q692
$$ plain form
60517 617074 608642 600296 592661 586541 582407 580355 580083 580916 582375 584750 588674 594272 601325 610163 621625
60502 621625 636088 653277 673214 696597 723875 754570 787844 823183 860068 897460 934020
60491 934020 968517 999782 1026779 1049175 1067448 1081985 1092339 1097657 1097387 1091043 1077674 1056292
60479 1056292 1026899 990750 949658 905389 859632 814080 770246 729269 691902 658589 629477
60468 629477 604346 582585 563468 546631 532155 519993 509512 499900 490849 482439 474586 467169
60456 467169 460529 455135 450692 446300 441639 437249 433475 429923 426354 423298 421180 419535 417728 415879
60442 415879 414356 412866 410937 408993 408020 408224 408795 408961 408565 407597 405944 403839 401941 400648 399760 399070
60426 399070 398868 399535 400916 402391 403386 403642 403220 402525 402211 402767 404128 405857 407701 409776 412140 414392
$$ packed form
60517F17074q432q346p635o120m134k052k72Q33J459K375L924N598P053Q838J1462
60502F21625J4463J7189J9937K3383K7278L0695L3274L5339L6885L7392L6560
60491I34020L4497L1265K6997K2396J8273J4537J0354N318k70o344j3369k1382
60479A056292k9393l6149m1092m4269m5757m5552m3834m0977l7367l3313k9112
60468F29477k5131k1761j9117j6837j4476j2162j0481r612r051q410p853p417
60456D67169o640n394m443m392m661m390l774l552l569l056k118j645j807j849
60442D15879j523j490j929j944r73K04N71J66l96r68j653k105j898j293q88o90
60426C99070k02O67J381J475R95K56m22o95l14N56J361J729J844K075K364K252
$$ plain form
60410 414392 416043 417319 419135 421969 425046 427121 427929 428332 429129 430373 431939 433961 436338 438526 440437
60395 440437 442950 446806 451350 455202 457947 460330 462828 464941 466169 466911 467904 469228 470408 471271 472246
60380 472246 473798 475865 477964 479724 481211 482676 484074 485055 485582 486237 487605 489471 491036 491943 492680
60365 492680 493833 495398 497090 498996 501425 504253 506924 509294 512084 516154 521502 527323 533053 538881
60351 538881 545107 551385 556923 561146 563794 564680 563901 562137 560079 557518 553661 548567 543562 539842 537155
60336 537155 534358 530859 527033 523526 520670 518421 516387 514037 511226 508417 506104 504271 502746 501745
60322 501745 501575 502009 502514 502947 503573 504577 506142 508847 513314 519401 526318 533543 541019 548420 554984
60307 554984 560465 565634 571407 577781 584027 589674 594880 599952 604723 608358 609728 608124 603632 596734
$$ packed form
60410D14392J651J276J816K834L077K075Q08M03P97J244J566K022K377K188J911
60395D40437K513L856M544L852K745K383K498K113J228P42R93J324J180Q63R75
60380D72246J552K067K099J760J487J465J398R81N27O55J368J866J565R07P37
60365D92680J153J565J692J906K429K828K671K370K790M070N348N821N730N828
60351E38881O226O278N538M223K648Q86p79j764k058k561l857n094n005l720k687
60336E37155k797l499l826l507k856k249k034k350k811k809k313j833j525j001
60322E01745j70M34N05M33O26J004J565K705M467O087O917P225P476P401O564
60307E54984N481N169N773O374O246N647N206N072M771L635J370j604m492o898
$$ plain form
60293 596734 587705 576883 565377 554809 546067 538804 532497 527438 524174 522376 520984 519399 517933
60280 517933 517028 516539 515938 514860 513207 510928 507974 504405 500358 495924 491147 486211 481551 477677 474753
60265 474753 472362 469772 466580 463079 460073 458281 457805 458031 458146 457911 457874 458693 460360 462344 464320 466386
60249 466386 468598 470820 473100 475723 478637 481303 483412 485243 486950 488015 488062 487768 488147 489133 489767 489743
60233 489743 489798 490322 490639 490223 489837 490625 492656 495173 497902 501206 505168 509469 514169 519671 525788 531761
60217 531761 537519 544069 552212 561534 571230 581172 591511 601800 611381 620344 629284 638312 647020 655330
60203 655330 663615 671985 680117 687864 695384 702592 709080 714723 719813 724507 728633 732094 734846 736418
60189 736418 736131 734032 730892 727069 722105 715761 708650 701372 693790 685782 677999 671097 664765 658395
$$ packed form
60293E96734r029j0822j1506j0568q742p263o307n059l264j798j392j585j466
60280E17933r05m89o01j078j653k279k954l569m047m434m777m936m660l874k924
60265D74753k391k590l192l501l006j792m76K26J15k35l7Q19J667J984J976K066
60249D66386K212K222K280K623K914K666K109J831J707J065M7k94L79R86O34k4
60233D89743N5N24L17m16l86P88K031K517K729L304L962M301M700N502O117N973
60217E31761N758O550Q143R322R696R942J0339J0289R581Q963Q940R028Q708Q310
60203F55330Q285Q370Q132P747P520P208O488N643N090M694M126L461K752J572
60189G36418k87k099l140l823m964o344p111p278p582q008p783o902o332o370
$$ plain form
60175 658395 652278 647178 643017 639017 635033 631668 628967 626030 622343 618644 615850 613716 611229 608033
60161 608033 604835 602427 600783 599223 597237 595034 593329 592660 592961 593723 594457 594919 595109 595279 595834 597001
60145 597001 598648 600575 602874 605801 609441 613762 618802 624476 630247 635439 639974 644546 649955 656440
60131 656440 663635 670997 678135 684832 690819 695713 699423 702576 706087 710183 714301 718224 722608 727904
60117 727904 733326 737809 741625 745988 751106 755723 758908 761350 764270 767738 770760 772649 773695 774603
60103 774603 775713 776698 776733 775074 771812 768050 765122 763532 762607 761130 758382 754749 751220 748157 744750
60088 744750 740045 734259 728525 723467 718714 713887 709246 705048 700956 696602 692255 688401 685020 681753
60074 681753 678411 674895 670957 666570 662233 658230 653818 647812 640036 631647 623922 617152 610810 604359
$$ packed form
60175F58395o117n100m161m000l984l365k701k937l687l699k794k134k487l196
60161F08033l198k408j644j560j986k203j705o69L01P62P34M62J90J70N55J167
60145E97001J647J927K299K927L640M321N040N674N771N192M535M572N409O485
60131F56440P195P362P138O697N987M894L710L153L511M096M118L923M384N296
60117G27904N422M483L816M363N118M617L185K442K920L468L022J889J046R08
60103G74603J110R85L5j659l262l762k928j590r25j477k748l633l529l063l407
60088G44750m705n786n734n058m753m827m641m198m092m354m347l854l381l267
60074F81753l342l516l938m387m337m003m412o006p776q389p725o770o342o451
$$ plain form
60060 604359 597692 591098 585098 580186 576538 573971 572145 570828 570025 569912 570534 571573 572615 573733 575527
60045 575527 578422 582309 587088 593040 600123 607265 613187 617953 622943 629054 635550 641057 645170 648508
60031 648508 651440 653405 653602 651929 648971 645154 640155 633321 624628 615103 606061 598001 590444 582792
60017 582792 575009 567369 559885 552317 544642 537217 530509 524843 520360 516992 514472 512491 510848 509296
60003 509296 507388 504793 501799 499151 497275 495949 494903 494414 494946 496475 498623 501317 504767 508787 512720
59988 512720 516308 520171 525009 530671 536404 541781 546828 551374 554919 557261 558763 559709 559736 558271 555347
59973 555347 551712 548186 545113 542347 539542 536470 533320 530770 529573 529904 531115 532321 533244 534437 536620
59958 536620 539900 543717 547477 551051 554624 558261 561716 564571 566482 567387 567547 567309 566788 565929 564909
$$ packed form
60060F04359o667o594o000m912l648k567j826j317q03j13O22J039J042J118J794
60045E75527K895L887M779N952P083P142N922M766M990O111O496N507M113L338
60031F48508K932J965J97j673k958l817m999o834q693r525r042q060p557p652
60017E82792p783p640p484p568p675p425o708n666m483l368k520j981j643j552
60003E09296j908k595k994k648j876j326j046m89N32J529K148K694L450M020L933
59988E12720L588L863M838N662N733N377N047M546L545K342J502R46K7j465k924
59973E55347l635l526l073k766k805l072l150k550j197L31J211J206R23J193K183
59958E36620L280L817L760L574L573L637L455K855J911R05J60k38n21q59j020
$$ plain form
59943 564909 564251 564394 565250 566364 567383 568230 568929 569486 569917 570310 570907 572122 574322 577513 581400 585719
59927 585719 590231 594341 597222 598544 598738 598233 596907 594704 592383 591008 590859 591401 592194 593301 594964
59912 594964 597475 601337 606906 613784 621021 627932 634231 639424 642825 644367 644792 644770 644271 643014 640992
59897 640992 638375 635393 632559 630460 628991 627330 625099 623103 622490 623534 625660 628311 631255 634292
59883 634292 637234 640166 643352 646903 650813 655212 660270 665805 671169 675584 678629 680515 681851 682952
59869 682952 683496 683124 682224 681556 681103 680011 677826 675161 672856 671122 669868 669159 668822 668274 667512 667746 670225
59852 670225 674747 680085 685564 691386 697647 703970 710043 715658 720133 722578 723023 722588 722250 722038 721673
59837 721673 721330 721335 721560 721514 720766 719069 716416 713219 710098 707286 704604 702048 699857 697706 694520 689641
$$ packed form
59943E64909o58J43Q56J114J019Q47O99N57M31L93N97J215K200L191L887M319
59927E85719M512M110K881J322J94n05j326k203k321j375j49N42P93J107J663
59912E94964K511L862N569O878P237O911O299N193L401J542M25k2m99j257k022
59897F40992k617k982k834k099j469j661k231j996o13J044K126K651K944L037
59883F34292K942K932L186L551L910M399N058N535N364M415L045J886J336J101
59869F82952N44l72r00o68m53j092k185k665k305j734j254p09l37n48p62K34K479
59852F70225M522N338N479N822O261O323O073N615M475K445M45m35l38k12l65
59837G21673l43NK25m6p48j697k653l197l121k812k682k556k191k151l186m879
$$ plain form
59821 689641 683811 678402 673931 669922 665996 662430 659643 657813 657112 657775 659679 662202 664716 666884 668342
59806 668342 668541 667289 665127 662760 660288 657395 654149 651166 649034 647955 647881 648470 648873 648154 646218 643905
59790 643905 641957 640337 638845 637777 637371 637051 635934 633887 631404 628636 625395 622019 619342 617602 616188
59775 616188 614822 614174 614832 616285 617617 618745 620268 622324 624279 625539 626178 626736 627758 629618 632589
59760 632589 636882 642507 649025 655641 661998 668835 677299 687482 698229 708612 718904 729683 740618
59747 740618 750791 759777 767734 774764 780824 786052 790597 794325 797202 799626 801807 803143 802925 801401
59733 801401 799376 796983 793729 789681 785663 782184 779004 775969 773443 771588 769947 768172 766589 765605
59719 765605 764973 764051 762440 760054 756958 753513 750463 748504 747833 748172 749121 750478 752493 755737 760471
$$ packed form
59821F89641n830n409m471m009l926l566k787j830p01O63J904K523K514K168J458
59806F68342J99j252k162k367k472k893l246k983k132j079p4N89M03p19j936k313
59790F43905j948j620j492j068m06l20j117k047k483k768l241l376k677j740j414
59775F16188j366o48O58J453J332J128J523K056J955J260O39N58J022J860K971
59760F32589M293N625O518O616O357O837Q464J0183J0747J0383J0292J0779J0935
59747G40618J0173Q986P957P030O060N228M545L728K877K424K181J336k18j524
59733H01401k025k393l254m048m018l479l180l035k526j855j641j775j583r84
59719G65605o32r22j611k386l096l445l050j959o71L39R49J357K015L244M734
$$ plain form
59704 760471 766234 772495 779496 787844 797414 807464 817863 829212 841472 853518 864664 875731
59692 875731 887680 899779 910176 917974 923857 928779 932967 936286 938772 940467 941237 941050 940088 938404
59678 938404 935756 931959 927149 921549 915160 907847 899601 890746 881966 874114 867745 862797 858768 855192
59664 855192 851869 848859 846570 845786 847237 851020 856529 862924 869554 876137 882883 890445 899382 909493
59650 909493 919830 929345 937302 943096 946077 945801 942228 935519 925853 913639 899637 884526 868483
59637 868483 851512 834162 817562 802639 789531 777843 767196 757425 748487 740437 733327 726893
59625 726893 720416 713136 704775 695511 685569 675122 664496 654102 644050 634103 624176 614677 606295
59612 606295 599612 594924 592016 590012 587836 585209 582957 582072 582667 584130 585946 587925 589842 591470 592985
$$ packed form
59704G60471N763O261P001Q348R570J0050J0399J1349J2260J2046J1146J1067
59692H75731J1949J2099J0397P798N883M922M188L319K486J695P70j87r62j684
59678I38404k648l797m810n600o389p313q246q855q780p852o369m948m029l576
59664H55192l323l010k289p84J451L783N509O395O630O583O746P562Q937J0111
59650I09493J0337R515P957N794K981k76l573o709r666j2214j4002j5111j6043
59637H68483j6971j7350j6600j4923j3108j1688j0647r771q938q050p110o434
59625G26893o477p280q361r264r942j0447j0626j0394j0052r947r927r499q382
59612F06295o683m688k908k004k176k627k252q85N95J463J816J979J917J628J515
$$ plain form
59597 592985 594789 596791 598262 598668 598372 598325 599188 600850 602626 603841 604386 604710 605132 605173 603846 600684 596216
59580 596216 591326 586408 581319 575995 570855 566553 563399 561039 558807 556466 554468 553315 552825 552366 551703
59565 551703 551210 551190 551442 551638 551747 551839 551805 551574 551379 551490 551860 552351 553132 554475 556285 558294 560755 564412
59547 564412 569525 575322 580899 586512 593466 602607 613354 624485 635607 647515 661296 677395 695227
59534 695227 712969 727595 735965 736757 731429 723106 714567 707288 701829 698397 696923 696954 697709 698350 698405
59519 698405 698085 697918 697852 696936 694170 689397 683133 675901 668166 660550 653418 646360 638718 630618 622897
59504 622897 616060 609949 604475 599921 596279 592970 589680 587010 585852 586349 587767 589256 590533 592118
59490 592118 594974 599624 605462 611267 616492 621636 627254 633192 639070 644985 651235 657782 664492 671566
$$ packed form
59597E92985J804K002J471M06k96m7Q63J662J776J215N45L24M22M1j327l162m468
59580E96216m890m918n089n324n140m302l154k360k232k341j998j153m90m59o63
59565E51703m93k0K52J96J09R2l4k31j95J11L70M91P81J343J810K009K461L657
59547E64412N113N797N577N613O954R141J0747J1131J1122J1908J3781J6099J7832
59534F95227J7742J4626Q370P92n328q323q539p279n459l432j474L1P55O41N5
59519F98405l20j67o6r16k766m773o264p232p735p616p132p058p642q100p721
59504F22897o837o111n474m554l642l309l290k670j158M97J418J489J277J585
59490E92118K856M650N838N805N225N144N618N938N878N915O250O547O710P074
$$ plain form
59476 671566 679146 686643 693040 697838 701345 703992 705764 706324 705397 703002 699554 695824 692621 690362 688985
59461 688985 688184 687691 687456 687719 688871 691197 694793 699706 705875 712822 719671 725747 731064 736058 740953
59446 740953 745581 749673 753026 755298 755812 753783 748891 741753 733744 726182 719631 714018 709250 705430
59432 705430 702531 700241 698290 696733 695747 695359 695499 696234 697931 701293 707185 716170 728143 742536 758863
59417 758863 776897 796387 816976 838402 860637 883957 908954 935868 962998 985959 999727
59406 999727 1002198 995568 984197 971717 960227 951108 945556 944477 948290 956393 966195 973104 972509 962281
59392 962281 943529 919375 893320 868178 845551 825899 809173 795283 783902 774344 766178 759691
59380 759691 755227 752296 749916 747696 746014 745218 745240 746008 747577 749736 752038 754445 757454 761269 765274
$$ packed form
59476F71566P580P497O397M798L507K647J772N60r27k395l448l730l203k259j377
59461F88985q01m93k35K63J152K326L596M913O169O947O849O076N317M994M895
59446G40953M628M092L353K272N14k029m892p138q009p562o551n613m768l820
59432G05430k899k290j951j557r86l88J40P35J697L362N892Q985J1973J4393J6327
59417G58863J8034J9490K0589K1426K2235K3320K4997K6914K7130K2961J3768
59406I99727K471o630j1371j2480j1490r119n552j079L813Q103R802O909n95j0228
59392I62281j8752k4154k6055k5142k2627j9652j6726j3890j1381r558q166o487
59380G59691m464k931k380k220j682p96K2P68J569K159K302K407L009L815M005
$$ plain form
59365 765274 768713 771631 774759 778623 783172 788203 793728 799814 806348 813210 820527 828544 837395 847273
59351 847273 858704 872124 887053 902137 916388 930080 944074 958587 973071 987002 1000074
59340 1000074 1011773 1021514 1029340 1035780 1040838 1043712 1043684 1040782 1035403 1027889 1018639 1008049 996116 982696
59326 982696 968303 953869 939510 924490 908782 893691 880234 867884 855746 844036 833302
59315 833302 823011 812326 801844 793114 786549 781124 776136 771929 768676 765796 763131 761699 762577 765730
59301 765730 770439 776198 782523 788266 791697 791142 785515 774806 760449 744798 729775 716162 704182
59288 704182 694200 686509 680952 677202 675172 674777 675589 677198 679759 683830 689687 696989 705085 713540 722432
59273 722432 732239 743336 755588 768555 781996 795862 809851 823382 836052 847756 858233 866981
$$ packed form
59365G65274L439K918L128L864M549N031N525O086O534O862P317Q017Q851R878
59351H47273J1431J3420J4929J5084J4251J3692J3994J4513J4484J3931J3072
59340A000074J1699R741P826O440N058K874k8k902n379p514r250j0590j1933j3420
59326I82696j4393j4434j4359j5020j5708j5091j3457j2350j2138j1710j0734
59315H33302j0291j0685j0482q730o565n425m988m207l253k880k665j432Q78L153
59301G65730M709N759O325N743L431n55n627j0709j4357j5651j5023j3613j1980
59288G04182r982p691n557l750k030l95Q12J609K561M071N857P302Q096Q455Q892
59273G22432R807J1097J2252J2967J3441J3866J3989J3531J2670J1704J0477Q748
$$ plain form
59261 866981 873844 879268 883596 886440 887192 885951 883485 880374 876641 872238 867497 862862 858472 854234
59247 854234 850152 846282 842399 838099 833344 828649 824441 820449 816051 811099 805999 801024 796071 791151
59233 791151 786542 782235 777728 772769 767766 763020 757995 752018 745358 738885 732775 726272 718853 710985
59219 710985 703534 696843 690666 684658 678789 673443 669245 666571 665164 664364 663708 663195 663083 663598 664745
59204 664745 666217 667641 669025 670738 672905 675190 677423 679954 682933 685744 687789 689490 691745 694685
59190 694685 697763 700894 704533 708565 712101 714683 716921 719548 722530 725472 728334 731211 733817 735678
59176 735678 736613 736694 735907 734116 731252 727412 722933 718306 713784 709130 704156 699415 695888 693872 692644
59161 692644 691303 689449 686987 683880 680406 677150 674352 671511 667922 663362 658128 652699 647536 642826
$$ packed form
59261H66981O863N424M328K844P52j241k466l111l733m403m741m635m390m238
59247H54234m082l870l883m300m755m695m208l992m398m952n100m975m953m920
59233G91151m609m307m507m959n003m746n025n977o660o473o110o503p419p868
59219G10985p451o691o177o008n869n346m198k674j407q00o56n13j12N15J147
59204F64745J472J424J384J713K167K285K233K531K979K811K045J701K255K940
59190F94685L078L131L639M032L536K582K238K627K982K942K862K877K606J861
59176G35678R35Q1p87j791k864l840m479m627m522m654m974m741l527k016j228
59161F92644j341j854k462l107l474l256k798k841l589m560n234n429n163m710
$$ plain form
59147 642826 638244 633199 627539 621833 616838 612808 609289 605427 600642 595358 590851 587870 585578 582498
59133 582498 578463 574885 573084 573085 574183 575871 577868 580002 582577 586320 591498 597599 604242 611805 620612
59118 620612 630016 639009 647449 656108 665557 675452 684871 693121 700257 706986 713889 720759 726899 732015
59104 732015 736341 739920 742431 743849 744649 745069 744788 743620 741843 739512 736227 732147 728506 726332 725135
59089 725135 723630 721360 718864 716568 714378 712212 710110 707747 704542 700441 696099 692153 688611 685040
59075 685040 681035 676472 671522 666524 661764 657451 653809 650865 648110 644837 641014 637326 634132 631011
59061 631011 627739 624976 623255 621828 619428 615866 612090 608812 605984 603533 601687 600452 599509 598848 598763
59046 598763 599045 598947 598313 598107 599272 601472 603473 604512 604826 605076 605756 607080 608985 611149 613292 615514
$$ packed form
59147F42826m582n045n660n706m995m030l519l862m785n284m507k981k292l080
59133E82498m035l578j801JJ098J688J997K134K575L743N178O101O643P563Q807
59118F20612R404Q993Q440Q659R449R895R419Q250P136O729O903O870O140N116
59104G32015M326L579K511J418Q00M20k81j168j777k331l285m080l641k174j197
59089G25135j505k270k496k296k190k166k102k363l205m101m342l946l542l571
59075F85040m005m563m950m998m760m313l642k944k755l273l823l688l194l121
59061F31011l272k763j721j427k400l562l776l278k828k451j846j235r43o61q5
59046E98763K82r8o34k06J165K200K001J039L14K50O80J324J905K164K143K222
$$ plain form
59030 615514 618091 620948 623716 626549 630532 636802 645302 654818 664388 674257 685155 697024 708980
59017 708980 720311 730881 740461 748231 753254 755201 754473 751860 748167 743829 738733 732620 725862 719559
59003 719559 714819 712152 711575 712912 715743 719390 723180 726634 729396 731277 732406 733005 733019 732323 731259
58988 731259 730425 729853 728914 727218 725131 723261 722012 721863 723388 726608 730848 735626 741216 748024 756030
58973 756030 765330 776582 790197 805442 820949 835914 850296 864176 877455 890004 901577 911698
58961 911698 919940 926180 930385 932452 932451 930588 926699 920302 911415 900680 888406 874251 858411 842247
58947 842247 827014 812606 798376 784494 771566 759603 748502 739077 732289 727629 723464 718969
58935 718969 714665 711162 708519 706865 706498 707093 707907 709038 711445 715307 719317 722124 723646 724485 724821
$$ packed form
59030F15514K577K857K768K833L983O270Q500R516R570R869J0898J1869J1956
59017G08980J1331J0570R580P770N023J947p28k613l693m338n096o113o758o303
59003G19559m740k667n77J337K831L647L790L454K762J881J129N99J4o96j064
58988G31259q34n72r39j696k087j870j249j49J525L220M240M778N590O808Q006
58973G56030R300J1252J3615J5245J5507J4965J4382J3880J3279J2549J1573J0121
58961I11698Q242O240M205K067jj863l889o397q887j0735j2274j4155j5840j6164
58947H42247j5233j4408j4230j3882j2928j1963j1101r425o788m660m165m495
58935G18969m304l503k643j654l67N95Q14J131K407L862M010K807J522Q39L36
$$ plain form
58920 724821 724549 723879 723106 722159 720920 719684 718891 718708 719242 720766 723361 726671 730432 734976 740803 747975
58904 747975 756338 766091 777617 790793 804887 819182 833361 847234 860363 872228 882763 892558
58892 892558 902417 912765 923658 935325 948289 962662 977689 992490 1007155 1022565 1038975 1055234
58880 1055234 1069674 1081564 1091398 1099854 1106785 1111422 1113469 1113701 1113202 1112222 1110159 1106641 1102063 1096914
58866 1096914 1091170 1084705 1077772 1070556 1062682 1053711 1043820 1033431 1022427 1010360 997241 983587 969834
58853 969834 956253 943236 930980 918969 906467 893660 881708 871516 862844 854636 845837 835847
58841 835847 824632 812521 799763 786397 772749 759646 747646 736415 725455 715189 706550 699700
58829 699700 693949 688922 685019 682623 681592 681715 683004 685334 688331 691745 695494 699291 702810 706308
$$ packed form
58920G24821k72o70p73r47j239j236p93j83N34J524K595L310L761M544N827P172
58904G47975Q363R753J1526J3176J4094J4295J4179J3873J3129J1865J0535R795
58892H92558R859J0348J0893J1667J2964J4373J5027J4801J4665J5410J6410J6259
58880A055234J4440J1890R834Q456O931M637K047K32m99r80k063l518m578n149
58866A096914n744o465o933p216p874q971r891j0389j1004j2067j3119j3654j3753
58853I69834j3581j3017j2256j2011j2502j2807j1952j0192q672q208q799r990
58841H35847j1215j2111j2758j3366j3648j3103j2000j1231j0960j0266q639o850
58829F99700n751n027l903k396j031J23J289K330K997L414L749L797L519L498
$$ plain form
58815 706308 710429 715269 720203 724728 728841 732469 735312 737506 739728 742145 743776 743448 741044 737453
58801 737453 733592 729831 726124 722275 718172 713946 709800 705669 701292 696667 692133 687996 684402 681639
58787 681639 680185 680359 682200 685674 690631 696544 702761 709208 716439 724844 734068 743355 752181 760420
58773 760420 768051 774730 779540 781325 779604 775029 768723 761329 753031 744131 734978 725534 715664 705791
58759 705791 696662 688497 680965 674013 668120 663607 660209 657407 654792 652161 649670 647793 646647 645512
58745 645512 643621 641231 639327 638463 638650 640160 643437 648173 653358 658472 663821 669541 675092 679984 684324
58730 684324 688410 692446 696810 701865 707237 711960 715592 718613 721585 724641 727969 732067 737200 743176
58716 743176 749857 757314 765352 773577 781999 790780 799252 805999 810155 811890 811511 808952 804322 797944
$$ packed form
58815G06308M121M840M934M525M113L628K843K194K222K417J631l28k404l591
58801G37453l861l761l707l849m103m226m146m131m377m625m534m137l594k763
58787F81639j454J74J841L474M957N913O217O447P231Q405R224R287Q826Q239
58773G60420P631O679M810J785j721m575o306p394q298q900r153r444r870r873
58759G05791r129q165p532o952n893m513l398k802k615k631k491j877j146j135
58745F45512j891k390j904q64J87J510L277M736N185N114N349N720N551M892M340
58730F84324M086M036M364N055N372M723L632L021K972L056L328M098N133N976
58716G43176O681P457Q038Q225Q422Q781Q472O747M156J735l79k559m630o378
$$ plain form
58702 797944 789561 778415 764473 748615 731364 712575 692828 673898 656986 641488 626416 612171
58690 612171 599928 589958 581573 574261 567925 562326 557129 552330 548019 544015 540236 537111 535062 533916
58676 533916 533306 533292 534001 535014 535732 536217 537243 539618 543687 549251 555712 562577 569939 578146 586937 595384
58660 595384 602654 608269 611642 612156 609935 605759 600104 593013 585006 577085 569623 562229 555051 549018
58646 549018 544343 539975 535201 530715 527329 524756 522545 521146 520991 521415 521596 521824 522727 523929 524592 524720
58630 524720 524869 525030 524840 524473 524316 524181 523770 523492 523840 524375 524316 523798 523610 524049 525030 526942 530342 534897
58612 534897 539581 543874 548051 552480 557350 562803 568633 574030 578331 581697 584470 586402 587311 587953 589230
58597 589230 590904 592118 592900 594125 596128 598355 600350 602219 604170 606430 609587 614246 620347 627446
$$ packed form
58702G97944q383j1146j3942j5858j7251j8789j9747j8930j6912j5498j5072j4245
58690F12171j2243r970q385p312o336n599n197m799m311m004l779l125k049j146
58676E33916o10j4P09J013P18M85J026K375M069N564O461O865P362Q207Q791Q447
58660E95384P270N615L373N14k221m176n655p091q007p921p462p394p178o033
58646E49018m675m368m774m486l386k573k211j399j55M24J81K28R03J202O63J28
58630E24720J49J61j90l67j57j35m11k78L48N35n9n18j88M39R81J912L400M555
58612E34897M684M293M177M429M870N453N830N397M301L366K773J932R09O42J277
58597E89230J674J214P82J225K003K227J995J869J951K260L157M659O101P099
$$ plain form
58583 627446 635526 644830 655008 665126 674505 683118 691329 699709 708761 718308 727556 736298 745589 756513
58569 756513 768901 782089 796392 812809 831599 852198 874360 898385 924361 951961 980800
58558 980800 1010047 1037860 1062082 1081584 1096341 1106474 1111989 1113241 1110820 1105163 1096994 1087865 1079389
58545 1079389 1072026 1065220 1058408 1051144 1042565 1031665 1017978 1001338 981328 957837 931898 905168
58533 905168 878800 853501 830194 809587 791332 774611 759401 746316 735467 726337 718544 711803
58521 711803 705439 698875 692456 686914 682218 677786 673549 669922 666934 664260 661923 660131 658715 657480
58507 657480 656757 656824 657227 657461 657800 658595 659401 659816 660449 661865 663262 663504 662933 662780 663409 664667 667390 672766
58489 672766 680377 688498 696333 704519 713646 723850 735723 749982 766153 783030 800423 818975
$$ packed form
58583F27446Q080R304J0178J0118R379Q613Q211Q380R052R547R248Q742R291J0924
58569G56513J2388J3188J4303J6417J8790K0599K2162K4025K5976K7600K8839
58558I80800K9247K7813K4222J9502J4757J0133N515J252k421n657q169r129q476
58545A079389p363o806o812p264q579j0900j3687j6640k0010k3491k5939k6730
58533I05168k6368k5299k3307k0607j8255j6721j5210j3085j0849r130p793o741
58521G11803o364o564o419n542m696m432m237l627k988k674k337j792j416j235
58507F57480p23O7M03K34L39P95Q06M15O33J416J397K42n71j53O29J258K723N376
58489F72766P611Q121P835Q186R127J0204J1873J4259J6171J6877J7393J8552
$$ plain form
58477 818975 838327 857094 874646 891256 906355 918217 925650 928560 926878 920594 911049 900530
58465 900530 890195 879880 870090 862436 857702 855187 854521 856495 861487 868572 876913 886716 898125 910393
58451 910393 922707 934633 945267 953152 957477 958264 955108 947190 934949 920311 904733 888367 871692
58438 871692 856434 843996 834125 825850 818813 813116 808884 806478 806244 807806 810564 814916 821725 830527
58424 830527 839696 848473 857269 865800 872748 877655 881308 883631 883038 878709 871905 864174 855779 846699
58410 846699 837641 829069 820564 812034 804263 797587 791353 785467 781059 778833 778083 778061 778872 780341 781605
58395 781605 782712 785011 789012 793326 796737 799873 803777 808197 812313 815836 818481 819716 820070 821257
58381 821257 824003 827102 829618 832512 837007 842809 849215 856573 865348 874942 884651 894717 905326 915748
$$ packed form
58477H18975J9352J8767J7552J6610J5099J1862P433K910j682o284r545j0519
58465I00530j0335j0315r790p654m734k515o66J974M992P085Q341R803J1409J2268
58451I10393J2314J1926J0634P885M325P87l156p918j2241j4638j5578j6366j6675
58438H71692j5258j2438r871q275p037n697m232k406k34J562K758M352O809Q802
58424H30527R169Q777Q796Q531O948M907L653K323n93m329o804p731q395r080
58410H46699r058q572q505q530p771o676o234n886m408k226p50k2Q11J469J264
58395G81605J107K299M001M314L411L136L904M420M116L523K645J235L54J187
58381H21257K746L099K516K894M495N802O406P358Q775R594R709J0066J0609J0422
$$ plain form
58367 915748 925526 935381 946024 957271 969172 982521 997263 1011924 1025691 1039480 1053795 1067137
58355 1067137 1077949 1086589 1093968 1099683 1103054 1104727 1105754 1106254 1106344 1107162 1109594 1113168 1117492 1123433 1131568
58340 1131568 1140799 1149986 1159640 1170608 1182436 1194556 1207767 1222912 1239250 1255614 1272045 1288769
58328 1288769 1304788 1319020 1331775 1343690 1354337 1363210 1370883 1377820 1383269 1386692 1389078 1391582 1394215
58315 1394215 1397081 1401323 1407479 1414473 1421648 1430186 1441021 1453138 1465461 1478612 1493121 1507799
58303 1507799 1521815 1536566 1553459 1571551 1589366 1607260 1625919 1644339 1661629 1679145 1698427
58292 1698427 1718551 1737903 1757093 1777741 1799797 1822468 1846411 1872568 1900108 1927822 1956380
58281 1956380 1987033 2019446 2052902 2088191 2126192 2166136 2207354 2250959 2297562 2345225 2392134
$$ packed form
58367I15748R778R855J0643J1247J1901J3349J4742J4661J3767J3789J4315J3342
58355A067137J0812Q640P379N715L371J673J027N00R0Q18K432L574M324N941Q135
58340A131568R231R187R654J0968J1828J2120J3211J5145J6338J6364J6431J6724
58328A288769J6019J4232J2755J1915J0647Q873P673O937N449L423K386K504K633
58315A394215K866M242O156O994P175Q538J0835J2117J2323J3151J4509J4678
58303A507799J4016J4751J6893J8092J7815J7894J8659J8420J7290J7516J9282
58292A698427K0124J9352J9190K0648K2056K2671K3943K6157K7540K7714K8558
58281A956380L0653L2413L3456L5289L8001L9944M1218M3605M6603M7663M6909
$$ plain form
58270 2392134 2439388 2488671 2539100 2589053 2639195 2690992 2744190 2798539 2855880 2917564 2981806
58259 2981806 3046598 3113033 3182607 3253538 3323312 3392798 3464315 3537681 3611771 3687981 3768460
58248 3768460 3852887 3940687 4034264 4136176 4245213 4359183 4479434 4608679 4746679 4892246
58238 4892246 5047162 5213732 5390869 5576986 5774329 5986050 6211781 6450757 6706181
58229 6706181 6981460 7275436 7586929 7920587 8282404 8673027 9092034 9545207 10040437
58220 10040437 10579900 11163849 11798939 12495016 13257159 14089466 15003695 16015661 17136680
58211 17136680 18378052 19760912 21312298 23055770 25017396 27238644 29773921 32681841
58203 32681841 36034711 39937346 44529212 49978778 56495723 64345615 73830144 85241088
$$ packed form
58270B392134M7254M9283N0429M9953N0142N1797N3198N4349N7341O1684O4242
58259B981806O4792O6435O9574P0931O9774O9486P1517P3366P4090P6210Q0479
58248C768460Q4427Q7800R3577J01912J09037J13970J20251J29245J38000J45567
58238D892246J54916J66570J77137J86117J97343K11721K25731K38976K55424
58229F706181K75279K93976L11493L33658L61817L90623M19007M53173M95230
58220A0040437N39463N83949O35090O96077P62143Q32307R14229J011966J121019
58211A7136680J241372J382860J551386J743472J961626K221248K535277K907920
58203C2681841L352870L902635M591866N449566O516945P849892R484529J1410944
$$ plain form
58195 85241088 98827402 114778956 133206334 154131304 177510983 203269101 231307286
58188 231307286 261513685 293696865 327209551 360209473 389118286 409145990 416036640
58181 416036640 407987000 386360597 354823931 317763492 279057062 241567819 207110755
58174 207110755 176602399 150291824 128012343 109372670 93873811 80998961 70284756
58167 70284756 61343446 53847606 47523362 42157213 37586398 33674958 30305737 27387737
58159 27387737 24852105 22637560 20688852 18965874 17440506 16083850 14866304 13768428
58151 13768428 12780488 11891124 11085736 10355096 9695620 9100479 8558750 8063538 7613002
58142 7613002 7203016 6826074 6477461 6155578 5856094 5572611 5303423 5051357 4816723
$$ packed form
58195H5241088J3586314J5951554J8427378K0924970K3379679K5758118K8038185
58188B31307286L0206399L2183180L3512686L2999922K8908813K0027704O890650
58181D16036640q049640k1626403l1536666l7060439l8706430l7489243l4457064
58174B07110755l0508356k6310575k2279481j8639673j5498859j2874850j0714205
58167G0284756q941310p495840o324244n366149m570815l911440l369221k918000
58159B7387737k535632k214545j948708j722978j525368j356656j217546j097876
58151A3768428r87940q89364q05388p30640o59476n95141n41729m95212m50536
58142G613002m09986l76942l48613l21883k99484k83483k69188k52066k34634
$$ plain form
58133 4816723 4596339 4389367 4197848 4020994 3854679 3697144 3549932 3412728 3282439
58124 3282439 3157951 3040951 2931463 2827093 2727201 2633460 2545780 2461839 2381054 2305062
58114 2305062 2233868 2165328 2098782 2035621 1976044 1918752 1863830 1812398 1763460 1714672 1666200
58103 1666200 1620259 1576919 1534064 1491485 1451239 1413758 1377331 1341930 1309952 1282549 1258393
58092 1258393 1236495 1217058 1199122 1180610 1161340 1143071 1126130 1108883 1090899 1073620 1057312
58081 1057312 1040312 1021903 1003245 984914 966100 946831 928385 910998 893585 876155 860055
58070 860055 845483 831238 817189 804429 792689 780259 766902 754288 743119 732397 721955
58059 721955 713034 705698 698200 689591 680551 671147 660394 648701 638123 629285 620534 611002 602050
$$ packed form
58133D816723k20384k06972j91519j76854j66315j57535j47212j37204j30289
58124C282439j24488j17000j09488j04370r9892r3741q7680q3941q0785p5992
58114B305062p1194o8540o6546o3161n9577n7292n4922n1432m8938m8788m8472
58103A666200m5941m3340m2855m2579m0246l7481l6427l5401l1978k7403k4156
58092A258393k1898j9437j7936j8512j9270j8269j6941j7247j7984j7279j6308
58081A057312j7000j8409j8658j8331j8814j9269j8446j7387j7413j7430j6100
58070H60055j4572j4245j4049j2760j1740j2430j3357j2614j1169j0722j0442
58059G21955q921p336p498q609r040r404j0753j1693j0578q838q751r532q952
$$ plain form
58046 602050 594583 587400 579447 571551 564607 558042 551318 545141 539931 534716 528672 522247 515906 509318
58032 509318 502617 496818 492065 486981 480619 473550 466285 458330 449629 441333 434142 427326 420300 413771
58018 413771 408483 404162 400511 397905 396297 394699 392508 390216 388259 386400 384695 383652 382982 381666
58004 381666 379736 378405 377931 377025 375006 372901 371663 371008 370762 371589 373406 374774 374995 375291 376800 378861
57988 378861 380423 381702 383179 384227 384083 383140 382102 380822 379038 377224 375657 373648 370829 368289 367377
57973 367377 368116 369667 371474 373093 373911 374073 374868 377215 380424 383193 384998 385770 385217 383415 381203 379055
57957 379055 376280 372188 367248 362315 357479 352490 347522 342710 337740 332714 328677 326469 325815 326177 327686
57942 327686 330470 333958 337704 342104 347522 353521 359744 366675 374684 383118 391173 398799 405880 411468
$$ packed form
58046F02050p467p183p953p896o944o565o724o177n210n215o044o425o341o588
58032E09318o701n799m753n084o362p069p265p955q701q296p191o816p026o529
58018D13771n288m321l651k606j608j598k191k292j957j859j705j043o70j316
58004C81666j930j331m74r06k019k105j238o55k46Q27J817J368K21K96J509K061
57988C78861J562J279J477J048j44r43j038j280j784j814j567k009k819k540r12
57973C67377P39J551J807J619Q18J62P95K347L209K769J805P72n53j802k212k148
57957C79055k775m092m940m933m836m989m968m812m970n026m037k208o54L62J509
57942C27686K784L488L746M400N418N999O223O931Q009Q434Q055P626P081N588
$$ plain form
57928 411468 414805 416253 416236 414143 409389 402755 395411 387219 377292 365803 354142 343552 334546 327271
57914 327271 321440 316231 311158 306806 303981 302568 302006 302344 303866 306047 307833 308722 308805 308045 306312 303817
57898 303817 300797 297083 292783 289016 287098 287091 287895 288531 288777 288797 288897 289515 290825 292413 293733 294668 295253
57881 295253 295233 294403 293108 291965 291323 291280 291821 292628 293204 293476 293794 294144 294116 293963 294813 297272 300609 303942
57863 303942 307450 311780 317024 322964 329589 336596 343173 349109 355366 362655 370145 376566 381899 386930
57849 386930 391715 395613 398341 399902 399830 397656 393878 389529 385039 380398 375985 372180 368486 364186 359687
57834 359687 356080 353429 350611 346939 342978 339678 337535 336702 337122 338365 339928 341778 344086 346600 348896
57819 348896 351072 353495 355998 358043 359534 360685 361127 359915 356602 351751 346335 341039 336097 331393
$$ packed form
57928D11468L337J448j7k093m754o634p344q192r927j1489j1661j0590r006p275
57914C27271n831n209n073m352k825j413n62L38J522K181J786Q89Q3p60j733k495
57898C03817l020l714m300l767j918pQ04O36K46K0J00O18J310J588J320R35N85
57881B95253k0q30j295j143o42m3N41Q07N76K72L18L50k8j53Q50K459L337L333
57863C03942L508M330N244N940O625P007O577N936O257P289P490O421N333N031
57849C86930M785L898K728J561p2k174l778m349m490m641m413l805l694m300m499
57834C59687l607k651k818l672l961l300k143q33M20J243J563J850K308K514K296
57819C48896K176K423K503K045J491J151M42j212l313m851n416n296m942m704
$$ plain form
57805 331393 326787 322651 319734 318128 316786 314659 311896 309328 307241 305431 303948 302880 301767 300260
57791 300260 299072 299158 300095 300378 299458 298420 298440 299442 300610 301464 302115 303045 304958 308342 312955 317974 322699
57774 322699 326828 330257 333046 335399 337127 337385 335548 332118 328147 323932 319013 313253 307122 301002
57760 301002 295007 289463 284747 280695 276910 273692 271829 271377 271488 271600 272057 273269 274994 276782 278541
57745 278541 280277 281742 282723 283460 284566 286593 289572 292775 295193 296636 298153 300884 304788 309004 313058
57730 313058 316957 320372 322752 324324 326127 328798 331912 334648 336547 337544 337831 337800 337705 337390 336719 336000
57714 336000 335395 334244 331803 328424 325122 322084 318603 314509 310623 307492 304585 301139 297166 293320
57700 293320 290294 288477 287612 286747 285172 283438 282739 283315 284298 285101 285966 287021 287913 288744 290276 292749
$$ packed form
57805C31393m606m136k917j606j342k127k763k568k087j810j483j068j113j507
57791C00260j188Q6R37K83r20j038K0J002J168Q54O51R30J913L384M613N019M725
57774C22699M129L429K789K353J728K58j837l430l971m215m919n760o131o120
57760C01002n995n544m716m052l785l218j863m52J11J12M57J212J725J788J759
57745B78541J736J465R81P37J106K027K979L203K418J443J517K731L904M216M054
57730C13058L899L415K380J572J803K671L114K736J899R97K87l1r5l15o71p19
57714C36000o05j151k441l379l302l038l481m094l886l131k907l446l973l846
57700B93320l026j817q65q65j575j734o99N76R83Q03Q65J055Q92Q31J532K473
$$ plain form
57684 292749 295409 297817 300727 305072 310883 317916 326646 337871 351862 368690 388913 413216 441593
57671 441593 473411 508027 545021 584278 626191 670932 716451 757243 785931 796575 786935 758681
57659 758681 716391 666013 613067 561444 513563 471135 435342 406421 383549 365308 350288
57648 350288 337555 326846 318277 311793 307035 303690 301538 300023 298293 295991 293665 292038 291128 290415
57634 290415 289585 288705 287817 286751 285333 283497 281121 277950 273858 269257 265115 262232 260343 258233 255050
57619 255050 251260 247980 245760 244449 243866 243803 243547 242314 240242 238223 236666 235143 233373 231726 230520
57604 230520 229625 229078 229297 230231 231001 230890 230132 229232 228103 226357 223985 221271 218456 215936 214221 213239
57588 213239 212152 210421 208604 207539 207140 206681 205940 205350 205201 205300 205405 205502 205604 205647 205548 205107 203968 201928
$$ packed form
57684B92749K660K408K910M345N811P033Q730J1225J3991J6828K0223K4303K8377
57671D41593L1818L4616L6994L9257M1913M4741M5519M0792K8688J0644r640k8254
57659G58681m2290n0378n2946n1623m7881m2428l5793k8921k2872j8241j5020
57648C50288j2733j0709q569o484m758l345k152j515j730k302k326j627r10p13
57634B90415q30q80q88j066j418j836k376l171m092m601m142k883j889k110l183
57619B55050l790l280k220j311n83o3k56j233k072k019j557j523j770j647j206
57604B30520q95n47K19R34P70j11p58r00j129j746k372k714k815k520j715r82
57588B13239j087j731j817j065l99m59p41n90j49R9J05R7J02M3r9m41j139k040
$$ plain form
57570 201928 199249 196466 193998 191936 190013 187748 184954 182199 180330 179439 178761 177759 176741 176180 176014
57555 176014 176044 176481 177586 179139 180776 182520 184532 186573 188135 188900 188829 188122 187390 187401 188305 189415 190069
57538 190069 190232 189987 189078 187517 186089 185547 185656 185713 185636 185832 186260 186437 186274 186177 186329 186475 186455 186409 186417 186480 186887
57517 186887 188100 190158 192569 194890 197099 199354 201633 203688 205135 205618 205144 204229 203574 203562 204135 204958
57501 204958 205596 205697 205131 203896 201941 199407 196958 195301 194346 193437 192546 192406 193102 193442 192473 190890 190097
57484 190097 190400 191101 191884 192960 194005 194150 193209 191971 191045 190213 189209 188364 187964 187525 186279 184077 181456
57467 181456 178971 176826 175056 173816 173340 173598 174043 173943 173104 172115 171703 172065 172906 173797 174243 173830 172754
57450 172754 171896 171934 172620 173381 174237 175501 176866 177655 177921 178496 179808 181341 182450 183149 183777 184431 185072
$$ packed form
57570B01928k679k783k468k062j923k265k794k755j869q91o78j002j018n61j66
57555A76014L0M37J105J553J637J744K012K041J562P65p1p07p32J1R04J110O54
57538A90069J63k45r09j561j428n42J09N7p7J96M28J77j63r7J52J46k0m6QO3M07
57517A86887J213K058K411K321K209K255K279K055J447M83m74r15o55j2N73Q23
57501B04958O38J01n66j235j955k534k449j657r55r09q91j40O96L40r69j583p93
57484A90097L03P01P83J076J045J45r41j238r26q32j004q45m00m39j246k202k621
57467A81456k485k145j770j240m76K58M45j00q39r89m12L62Q41Q91M46m13j076
57450A72754q58L8O86P61Q56J264J365P89K66N75J312J533J109O99O28O54O41
$$ plain form
57433 185072 185815 186821 188082 189557 191228 192872 194024 194424 194337 194243 194370 194643 194912 195027 194774 194015 192997
57416 192997 192394 192796 194052 195336 196038 196431 197150 198222 199152 199880 200933 202454 203757 204242 204098 203626 202505
57399 202505 200395 197808 195610 193984 192596 191539 191372 192297 194003 196251 198940 201669 203915 205712 207577
57384 207577 209711 211817 213796 215979 218504 220926 222713 223816 224614 225525 226691 227776 228107 227268 225473
57369 225473 223167 220523 217667 215071 213164 211716 210168 208481 207167 206559 206590 207176 208279 209635 210972
57354 210972 212464 214478 216882 219156 221142 223194 225574 228196 230959 233820 236548 238908 241055 243277
57340 243277 245381 246826 247423 247404 246905 245904 244589 243223 241824 240533 240058 240986 242741 244072 244557 244840
57324 244840 245370 245824 245969 246164 246741 247628 248908 251007 253926 256897 259120 260388 260866 260910 261290 262822 265432
$$ packed form
57433A85072P43J006J261J475J671J644J152M00q7r4J27K73K69J15k53p59j018
57416A92997o03M02J256J284P02L93P19J072R30P28J053J521J303M85j44m72j121
57399B02505k110k587k198j626j388j057j67R25J706K248K689K729K246J797J865
57384B07577K134K106J979K183K525K422J787J103P98R11J166J085L31q39j795
57369B25473k306k644k856k596j907j448j548j687j314o08L1N86J103J356J337
57354B10972J492K014K404K274J986K052K380K622K763K861K728K360K147K222
57340B43277K104J445N97j9m99j001j315j366j399j291m75R28J755J331M85K83
57324B44840N30M54J45J95N77Q87J280K099K919K971K223J268M78M4L80J532K610
$$ plain form
57307 265432 268206 270608 273032 275841 278639 280906 282736 284448 286047 287488 289016 290766 292444 293808
57293 293808 295129 296907 299502 303144 307750 312473 316082 318166 319495 320973 322768 324710 326871 329406
57279 329406 332382 336131 341124 347191 353384 358981 364024 368625 372555 375986 379897 385110 391474 398406
57265 398406 405559 412469 418359 423067 427543 432682 438220 443468 448603 454373 460959 467925 475037 482432
57251 482432 490263 498690 507825 517176 525680 532995 540224 548645 558297 568617 579800 592375 605880
57238 605880 619184 632008 644992 658324 671472 684400 697927 712607 728157 744288 761237
57227 761237 779054 797107 814793 832188 849577 866891 884015 901278 919227 938138 958045
57216 958045 978958 1000754 1023062 1045580 1068392 1091742 1115542 1139276 1162406 1184777 1206552
$$ packed form
57307B65432K774K402K424K809K798K267J830J712J599J441J528J750J678J364
57293B93808J321J778K595L642M606M723L609K084J329J478J795J942K161K535
57279C29406K976L749M993O067O193N597N043M601L930L431L911N213O364O932
57265C98406P153O910N890M708M476N139N538N248N135N770O586O966P112P395
57251D82432P831Q427R135R351Q504P315P229Q421R652J0320J1183J2575J3505
57238F05880J3304J2824J2984J3332J3148J2928J3527J4680J5550J6131J6949
57227G61237J7817J8053J7686J7395J7389J7314J7124J7263J7949J8911J9907
57216I58045K0913K1796K2308K2518K2812K3350K3800K3734K3130K2371K1775
$$ plain form
57205 1206552 1227767 1248143 1267477 1286046 1304241 1321872 1338381 1353908 1369665 1386913 1405955
57194 1405955 1426392 1447927 1470586 1494588 1520379 1548362 1578203 1608858 1639782 1671627 1705259
57183 1705259 1740578 1776965 1814356 1853023 1892551 1931876 1970336 2008075 2045597 2083486 2122328
57172 2122328 2162234 2202530 2242488 2282137 2321843 2361521 2400993 2440737 2481334 2522345 2562683
57161 2562683 2601999 2640838 2679513 2717815 2755783 2793643 2830840 2866131 2898967 2929937 2959528
57150 2959528 2987319 3012744 3035868 3056973 3076078 3093287 3109015 3123479 3136534 3148382 3159954
57139 3159954 3172241 3185714 3200638 3217514 3237007 3259981 3287751 3321579 3361511 3406188 3454109
57128 3454109 3504867 3559351 3619433 3687214 3763019 3843332 3921583 3992203 4054276 4111698 4170820
$$ packed form
57205A206552K1215K0376J9334J8569J8195J7631J6509J5527J5757J7248J9042
57194A405955K0437K1535K2659K4002K5791K7983K9841L0655L0924L1845L3632
57183A705259L5319L6387L7391L8667L9528L9325L8460L7739L7522L7889L8842
57172B122328L9906M0296L9958L9649L9706L9678L9472L9744M0597M1011M0338
57161B562683L9316L8839L8675L8302L7968L7860L7197L5291L2836L0970K9591
57150B959528K7791K5425K3124K1105J9105J7209J5728J4464J3055J1848J1572
57139C159954J2287J3473J4924J6876J9493K2974K7770L3828L9932M4677M7921
57128C454109N0758N4484O0082O7781P5805Q0313P8251P0620O2073N7422N9122
$$ plain form
57117 4170820 4237871 4316620 4406437 4502501 4599133 4693894 4789212 4890979 5005732 5137925 5288674
57106 5288674 5457152 5643671 5851398 6085479 6352062 6659375 7019515 7448763 7966914
57097 7966914 8597059 9365198 10298614 11423354 12761037 14324357 16112921 18113265 20303046
57088 20303046 22654271 25133920 27707729 30349023 33043110 35779805 38543619 41314226
57080 41314226 44066886 46748876 49236520 51318276 52741373 53300421 52904319 51582304
57072 51582304 49446722 46653351 43377591 39798990 36086064 32384089 28809375 25447913
57064 25447913 22355989 19563559 17080082 14899792 13005143 11370587 9967625 8768582
57056 8768582 7747247 6878298 6137942 5505157 4961893 4492601 4084344 3727103 3413254
$$ packed form
57117D170820O7051P8749Q9817R6064R6632R4761R5318J01767J14753J32193J50749
57106E288674J68478J86519K07727K34081K66583L07313L60140M29248N18151
57097G966914O30145P68139R33416J124740J337683J563320J788564K000344K189781
57088B0303046K351225K479649K573809K641294K694087K736695K763814K770607
57080D1314226K752660K681990K487644K081756J423097N59048l96102j322015
57072E1582304k135582k793371l275760l578601l712926l701975l574714l361462
57064B5447913l091924k792430k483477k180290j894649j634556j402962j199043
57056H768582j021335q68949p40356o32785n43264m69292m08257l57241l13849
$$ plain form
57047 3413254 3136589 2891987 2675482 2483859 2314020 2163008 2028522 1909033 1803394
57038 1803394 1710572 1629532 1558998 1497440 1443707 1397681 1359968 1330957 1310488 1298299 1293998
57027 1293998 1295813 1299236 1297322 1283018 1252090 1204552 1143881 1075132 1003534 933758 869180 811250
57015 811250 759838 714349 674197 638404 605713 575613 548652 525228 504663 486048 469297
57004 469297 454504 440844 427335 414431 403582 395024 387226 378917 370676 363883 358977 355545 353533
56991 353533 353403 355294 358835 363761 370048 377364 384920 392209 399559 407546 415799 422526 425361 422755
56977 422755 414648 402063 386434 369390 352720 337861 325280 314602 305424 297918 292672 290214
56965 290214 290689 293796 299017 306051 315005 326057 339090 353825 369951 386670 402172 414016 420114
$$ packed form
57047C413254k76665k44602k16505j91623j69839j51012j34486j19489j05639
57038A803394r2822q1040p0534o1558n3733m6026l7713k9011k0469j2189m301
57027A293998J815L423j914j4304l0928m7538o0671o8749p1598o9776o4578n7930
57015H11250n1412m5489m0152l5793l2691l0100k6961k3424k0565j8615j6751
57004D69297j4793j3660j3509j2904j0849q558p798q309q241o793m906l432k012
56991C53533j30J891L541M926O287P316P556P289P350P987Q253O727K835k606
56977D22755q107j2585j5629j7044j6670j4859j2581j0678r178p506n246k458
56965B90214M75L107N221P034Q954J1052J3033J4735J6126J6719J5502J1844O098
$$ plain form
56952 420114 419267 411208 396799 378185 358069 338494 320482 304639 291577 281693 275128 272081 272752
56939 272752 276834 283574 292532 303854 317672 333684 351588 371488 393511 417095 440526 460747
56927 460747 473765 476245 467398 449190 424590 396060 365729 335986 308872 285056 264047 245426
56915 245426 229436 216393 205990 197320 189478 182103 175460 169983 165782 162730 160828 160088 159993 159633
56901 159633 158696 158022 158838 161600 165827 170923 176939 184647 194945 208048 223197 239332 256079 273828
56887 273828 292931 313210 334186 355108 374344 389252 397256 397223 389854 377091 361382 345082
56875 345082 330032 317497 308368 303204 302096 304904 311802 323369 340051 361782 388151 418658
56863 418658 452782 490237 531182 575689 622662 669267 711223 743315 760332 758984 739845 707218
$$ packed form
56952D20114q47q059j4409j8614k0116j9575j8012j5843j3062r884o565l047O71
56939B72752M082O740Q958J1322J3818J6012J7904J9900K2023K3584K3431K0221
56927D60747J3018K480q847j8208k4600k8530l0331k9743k7114k3816k1009j8621
56915B45426j5990j3043j0403q670p842p375o643n477m201l052j902p40r5l60
56901A59633r37o74Q16K762M227N096O016P708J0298J3103J5149J6135J6747J7749
56887B73828J9103K0279K0976K0922J9236J4908Q004l3p369j2763j5709j6300
56875C45082j5050j2535r129n164j108K808O898J1567J6682K1731K6369L0507
56863D18658L4124L7455M0945M4507M6973M6605M1956L2092J7017j348j9139l2627
$$ plain form
56851 707218 666915 624282 583703 548426 520063 498952 485622 481349 486947 501874 525264 557087
56839 557087 597480 645545 699862 759933 826179 898465 974962 1051691 1121964 1176447 1205492
56828 1205492 1203064 1169341 1110215 1034642 951702 868651 790518 720898 662546 616994 584124
56817 584124 562851 552243 551750 560678 578075 603072 634897 672654 715525 763029 814459 867598
56805 867598 917843 958418 981777 982021 957378 910981 849315 779827 709333 643107 584132 533198
56793 533198 490257 455555 429247 410697 399099 394484 397134 406061 419034 434393 452240 473581
56781 473581 498623 525909 552447 574313 587437 588448 575537 549348 513290 472268 430337 389510
56769 389510 350776 315361 284346 257761 235044 215992 200365 187001 174532 162921 153178 145533
$$ packed form
56851G07218m0303m2633m0579l5277k8363k1111j3330m273N598J4927K3390L1823
56839E57087M0393M8065N4317O0071O6246P2286P6497P6729P0273N4483K9045
56828A205492k428l3723n9126p5573q2940q3051p8133o9620n8352m5552l2870
56817E84124k1273j0608m93Q928J7397K4997L1825L7757M2871M7504N1430N3139
56805H67598N0245M0575K3359K44k4643m6397o1666o9488p0494o6226n8975n0934
56793E33198m2941l4702k6308j8550j1598m615K650Q927J2973J5359J7847K1341
56781D73581K5042K7286K6538K1866J3124J011j2911k6189l6058m1022m1931m0827
56769C89510l8734l5415l1015k6585k2717j9052j5627j3364j2469j1611r743p645
$$ plain form
56757 145533 138938 132564 126698 121787 117610 113915 111042 109259 108083 106857 105549 104437 103404 102061
56743 102061 100334 98506 96869 95633 94933 94644 94383 93967 93680 93821 94201 94296 93792 92808 91706 90842 90453
56726 90453 90681 91660 93404 95452 96858 96909 95871 94778 94541 95484 97509 100288 103207 105543 106864 107173
56710 107173 106814 106397 106527 107243 107958 108388 109233 111301 114152 116313 116962 116770 116989 118224 120239 122344 123773
56693 123773 124144 123913 124095 125291 127156 128847 129742 129804 129617 130041 131444 133244 134536 135100 135388 135682 135846
56676 135846 135854 135918 135998 135787 135310 134995 134968 134851 134428 133980 133699 133305 132575 131857 131681 132139 132867 133385 133302 132495 131343
56655 131343 130532 130448 130872 131324 131473 131188 130476 129481 128442 127654 127512 128308 129754 131135 132337 134248 137456
56638 137456 140944 143031 143448 143473 143991 144478 144192 143388 142833 142833 143210 143678 143804 143197 142153 141569 141752 141873 141083
$$ packed form
56757A45533o595o374n866m911m177l695k873j783j176j226j308j112j033j343
56743A02061j727j828j637j236p00k89k61m16k87J41L80R5n04r84j102q64l89
56726I0453K28R79J744K048J406N1j038j093k37R43K025K779K919K336J321L09
56710A07173l59m17J30P16P15M30Q45K068K851K161O49j92K19J235K015K105J429
56693A23773L71k31J82J196J865J691Q95O2j87M24J403J800J292N64K88K94J64
56676A35846QO4Q0k11m77l15k7j17m23m48k81l94p30p18j76M58P28N18q3q07j152
56655A31343q11q4M24M52J49k85p12r95j039p88j42P96J446J381J202J911L208
56638A37456L488K087M17K5N18M87k86q04n55%L77M68J26o07j044n84J83J21p90
$$ plain form
56619 141083 139704 138698 138338 138005 137134 135825 134550 133647 133154 132893 132678 132452 132234 132072 132148 132671 133365 133374
56601 133374 132273 130933 130658 131503 132238 132063 131541 131580 132263 133138 134056 135164 136476 137839 139124 140233 141181
56584 141181 142193 143400 144514 145302 146217 147827 149698 150793 151059 151597 153012 154686 156195 158355 161997
56569 161997 166584 170989 175043 179370 184120 188830 193311 197890 202825 208177 214205 221285 229316 237445
56555 237445 244362 248772 249970 248327 245077 241395 237805 234414 231210 227928 224169 219937 215682 211682
56541 211682 207924 204698 202596 201603 200972 200390 200460 201458 202406 202182 200934 199589 198424 197019 195290 193674
56525 193674 192429 191500 190973 191045 191540 191942 191850 191016 189210 186487 183473 180907 179049 177753 176813 175832 174186
56508 174186 171718 169258 167894 167856 168532 169377 170273 171057 171284 170651 169432 168373 168109 168603 169231 169571 169921
$$ packed form
56619A41083j379j006l60l33q71j309j275r03m93k61k15k26k18j62P6N23O94R
56601A33374j101j340k75Q45P35j75n22L9O83Q75R18J108J312J363J285J109R48
56584A41181J012J207J114P88R15J610J871J095K66N38J415J674J509K160L642
56569A61997M587M405M054M327M750M710M481M579M935N352O028P080Q031Q129
56555B37445O917M410J198j643l250l682l590l391l204l282l759m232m255m000
56541B11682l758l226k102r93o31n82P0R98R48k24j248j345j165j405j729j616
56525A93674j245r29n27P2M95M02r2q34j806k723l014k566j858j296r40r81j646
56508A74186k468k460j364l8O76Q45Q96P84K27o33j219j059k64M94O28L40L50
$$ plain form
56491 169921 170661 171391 171399 170847 170685 171301 172175 172933 173708 174148 173314 171163 169144 168468 168682 168755 168698 169161 170109
56472 170109 171000 171760 172615 173368 173722 173987 174613 175393 175884 176178 176470 176366 175487 174373 173860 173974 174299 175060
56454 175060 176772 179096 181043 182183 182838 183325 183809 184632 185892 186914 187024 186581 186391 186403 186026 185460 185555
56437 185555 186379 187065 187160 187107 187227 187156 186551 185629 184786 184275 184302 184801 185195 185084 185111 186327 188691 190984 192282
56418 192282 192798 193192 193849 194932 196437 197932 198778 198784 198280 197618 197068 197044 197784 198848 199499 199521 199263 199066 199155
56399 199155 199781 200795 201381 200964 200149 200070 201044 202517 203969 205066 205349 204767 204246 204778 206169 207601 208995
56382 208995 210689 212149 212486 212154 212634 214296 216015 217175 218586 220847 223141 224456 225022 225752 227043
56367 227043 228794 230931 233227 235109 236250 237023 238020 239419 240987 242243 242565 241764 240715 240821 242670
$$ packed form
56491A69921P40P30Qn52j62O16Q74P58P75M40q34k151k019o76K14P3n7M63R48
56472A70109Q91P60Q55P53L54K65O26P80M91K94K92j04q79j114n13J14L25P61
56454A75060J712K324J947J140O55M87M84Q23J260J022J10m43j90J2l77n66R5
56437A85555Q24O86R5n3J20p1o05r22q43n11K7M99L94j11K7J216K364K293J298
56418A92282N16L94O57J083J505J495Q46On04o62n50k4P40J064O51K2k58j97Q9
56399A99155O26J014N86m17q15p9R74J473J452J097K83n82n21N32J391J432J394
56382B08995J694J460L37l32M80J662J719J160J411K261K294J315N66P30J291
56367B27043J751K137K296J882J141P73R97J399J568J256L22q01j049J06J849
$$ plain form
56352 242670 245663 248937 251967 254309 255626 256199 256706 257275 257407 256955 256499 256578 257263 258624 260884 263927
56336 263927 267286 270767 274457 278124 281383 284483 288034 291864 295074 297453 299859 302875 305966 308352
56322 308352 309890 310721 310891 310790 311223 312482 313913 314783 315091 315146 315023 314880 315347 317055 319989 323540 326998
56305 326998 330055 333163 337283 342830 349020 354776 360034 365432 371019 376200 380867 385567 390499 395276
56291 395276 399797 404459 409410 414431 419638 425433 431758 438333 445690 454889 465966 477654 488886
56278 488886 499696 510498 521475 532938 545379 558894 573320 588955 606270 624911 644113
56267 644113 664146 686248 711034 738222 767951 801019 837582 877096 920104 968685 1024459
56256 1024459 1087352 1156965 1234019 1319742 1414805 1519534 1634268 1758911 1892938 2036188
$$ packed form
56352B42670K993L274L030K342J317N73N07N69J32m52m56P9O85J361K260L043
56336B63927L359L481L690L667L259L100L551L830L210K379K406L016L091K386
56322C08352J538Q31J70j01M33J259J431Q70L08N5j23j43M67J708K934L551L458
56305C26998L057L108M120N547O190N756N258N398N587N181M667M700M932M777
56291C95276M521M662M951N021N207N795O325O575P357R199J1077J1688J1232
56278D88886J0810J0802J0977J1463J2441J3515J4426J5635J7315J8641J9202
56267F44113K0033K2102K4786K7188K9729L3068L6563L9514M3008M8581N5774
56256A024459O2893O9613P7054Q5723R5063J04729J14734J24643J34027J43250
$$ plain form
56246 2036188 2188668 2349159 2515029 2683777 2853625 3022120 3185276 3338655 3478288
56237 3478288 3600227 3700537 3776463 3826617 3849653 3844058 3809909 3749685 3666753 3564121 3445048
56226 3445048 3313365 3172343 3024397 2872481 2720368 2570769 2424502 2282349 2146362
56217 2146362 2018378 1898513 1786121 1681114 1583431 1492482 1408107 1330870 1260493 1195265
56207 1195265 1134046 1077546 1026609 980580 938575 900955 868114 838983 812239 787951 766606
56196 766606 747506 729656 713344 699269 686864 674976 663640 653716 645228 637397 629909 623078
56184 623078 617125 612240 608782 606540 604492 602132 600249 599535 599416 599232 599516 600937 603016 605207 608295
56169 608295 613261 619573 626001 632475 639723 647747 656029 664776 674638 685570 697097 709192 721916
$$ packed form
56246B036188J52480J60491J65870J68748J69848J68495J63156J53379J39633
56237C478288J21939J00310P5926N0154K3036n595l4149o0224q2932j02632j19073
56226C445048j31683j41022j47946j51916j52113j49599j46267j42153j35987
56217B146362j27984j19865j12392j05007r7683r0949q4375p7237p0377o5228
56207A195265o1219n6500n0937m6029m2005l7620l2841k9131k6744k4288k1345
56196G66606j9100j7850j6312j4075j2405j1888j1336r924q488p831p488o831
56184F23078n953m885l458k242k048k360j883p14j19j84K84J421K079K191L088
56169F08295M966O312O428O474P248Q024Q282Q747R862J0932J1527J2095J2724
$$ plain form
56156 721916 734771 747517 761087 776766 795097 816421 841598 871220 905067 943479 988337
56145 988337 1041508 1103179 1172810 1250671 1337159 1431590 1532997 1641132 1754967 1870782 1982995
56134 1982995 2086469 2177347 2253201 2314236 2363732 2405787 2442902 2476174 2506023 2530929 2546714
56123 2546714 2549329 2538244 2516029 2485591 2449058 2407949 2362143 2309009 2245161 2168874 2080121
56112 2080121 1979739 1870354 1757202 1646177 1541379 1445413 1360529 1287708 1225723 1172973
56102 1172973 1129393 1095066 1068144 1046054 1027787 1013295 1001764 992385 985713 982285 980859 979837
56090 979837 979388 980318 982116 984098 987111 991912 997198 1001611 1006381 1013401 1021872 1029539 1036248 1043554 1051697
56075 1051697 1059791 1068265 1078376 1089902 1101892 1114981 1130334 1147007 1163009 1178334 1194347 1210952
$$ packed form
56156G21916J2855J2746J3570J5679J8331K1324K5177K9622L3847L8412M4858
56145I88337N3171O1671O9631P7861Q6488R4431J01407J08135J13835J15815J12213
56134A982995J03474R0878P5854O1035M9496M2055L7115L3272K9849K4906J5785
56123B546714K615j1085k2215l0438l6533m1109m5806n3134o3848p6287q8753
56112B080121j00382j09385j13152j11025j04798r5966q4884p2821o1985n2750
56102A172973m3580l4327k6922k2090j8267j4492j1531r379o672l428j426j022
56090I79837m49R30J798J982L013M801N286M413M770P020Q471P667O709P306Q143
56075A051697Q094Q474J0111J1526J1990J3089J5353J6673J6002J5325J6013J6605
$$ plain form
56063 1210952 1227084 1243242 1260706 1278909 1296429 1313836 1332681 1352333 1370808 1388102 1405709
56052 1405709 1423451 1439897 1455387 1471661 1488991 1506627 1525318 1546242 1568236 1589451 1611081
56041 1611081 1636050 1664635 1694826 1726287 1760221 1795979 1831755 1868336 1908245 1951302 1994852
56030 1994852 2038115 2082484 2127839 2172619 2217363 2264059 2312088 2358872 2404583 2452113 2502510
56019 2502510 2554609 2609004 2667930 2731068 2795850 2862034 2931760 3005238 3080941 3159858 3244699
56008 3244699 3334900 3427473 3522878 3624897 3734475 3849001 3967966 4093948 4227548 4367000
55998 4367000 4513382 4670643 4839776 5018424 5206709 5407669 5621579 5846096 6082762
55989 6082762 6337111 6611568 6904554 7217253 7554660 7919292 8310772 8732385 9191031
$$ packed form
56063A210952J6132J6158J7464J8203J7520J7407J8845J9652J8475J7294J7607
56052A405709J7742J6446J5490J6274J7330J7636J8691K0924K1994K1215K1630
56041A611081K4969K8585L0191L1461L3934L5758L5776L6581L9909M3057M3550
56030A994852M3263M4369M5355M4780M4744M6696M8029M6784M5711M7530N0397
56019B502510N2099N4395N8926O3138O4782O6184O9726P3478P5703P8917Q4841
56008C244699R0201R2573R5405J02019J09578J14526J18965J25982J33600J39452
55998D367000J46382J57261J69133J78648J88285K00960K13910K24517K36666
55989F082762K54349K74457K92986L12699L37407L64632L91480M21613M58646
$$ plain form
55980 9191031 9690156 10230359 10817433 11461747 12169151 12941324 13786091 14718584 15751769
55971 15751769 16895977 18169024 19596603 21202076 23008083 25050937 27383263 30063378
55963 30063378 33158316 36763220 41008467 46050913 52078551 59328502 68079291 78608436
55955 78608436 91154014 105898540 122954498 142352985 164061775 188018104 214140677
55948 214140677 242333991 272452114 304010238 335503382 363759875 384223507 392542977
55941 392542977 386584497 367378339 338381441 303845325 267510753 232117967 199429272
55934 199429272 170377674 145249867 123912649 106012018 91091436 78668662 68304518
55927 68304518 59634742 52355129 46206009 40979672 36519979 32699556 29405507 26547740
$$ packed form
55980I191031M99125N40203N87074O44314P07404P72173Q44767R32493J033185
55971A5751769J144208J273047J427579J605473J806007K042854K332326K680115
55963C0063378L094938L604904M245247N042446O027638P249951Q750789J0529145
55955G8608436J2545578J4744526J7055958J9398487K1708790K3956329K6122573
55948B14140677K8193314L0118123L1558124L1493144K8256493K0463632Q319470
55941C92542977n958480j9206158k8996898l4536116l6334572l5392786l2688695
55934A99429272k9051598k5127807k1337218j7900631j4920582j2422774j0364144
55927F8304518q669776p279613o149120n226337m459693l820423l294049k857767
$$ plain form
55919 26547740 24061847 21893499 19989510 18307243 16819035 15500822 14325986 13273831
55911 13273831 12332886 11490880 10730589 10039230 9412493 8845125 8326000 7846237 7403986
55902 7403986 6997437 6620658 6269848 5946330 5649682 5374485 5117074 4879027 4660796
55893 4660796 4458070 4267640 4091045 3929293 3779368 3638742 3508141 3387240 3272695
55884 3272695 3162874 3059471 2962048 2866088 2768953 2672962 2580187 2489165 2399315 2313751 2234654
55873 2234654 2160033 2087746 2018698 1953482 1889918 1826718 1766023 1709695 1656489 1605247 1557466
55862 1557466 1514236 1473796 1434378 1396408 1359919 1323051 1285353 1249522 1217730 1189047 1162352
55851 1162352 1138644 1118291 1098937 1078427 1057240 1036147 1014130 990605 967065 944560 922087
$$ packed form
55919B6547740k485893k168348j903989j682267j488208j318213j174836j052155
55911A3273831r40945q42006p60291o91359o26737n67368n19125m79763m42251
55902G403986m06549l76779l50810l23518k96648k75197k57411k38047k18231
55893D660796k02726j90430j76595j61752j49925j40626j30601j20901j14545
55884C272695j09821j03403r7423r5960r7135r5991r2775r1022q9850q5564p9097
55873B234654p4621p2287o9048o5216o3564o3200o0695n6328n3206n1242m7781
55862A557466m3230m0440l9418l7970l6489l6868l7698l5831l1792k8683k6695
55851A162352k3708k0353j9354k0510k1187k1093k2017k3525k3540k2505k2473
$$ plain form
55840 922087 899234 877769 858716 840467 821778 804024 788498 773892 758564 743040 728397
55829 728397 714430 701272 690468 682411 674939 666444 658194 651551 645110 636796 626776 616156 604680
55816 604680 592019 579630 569105 560027 551392 543688 537708 532755 527946 524014 521997 521407 521296 521869
55802 521869 523486 525471 527513 530854 536370 542707 547915 551689 554479 555673 554389 551042 546616 541299
55788 541299 535098 528740 522753 516812 511139 507085 505014 502991 499093 493901 489295 486092 484322 484704
55774 484704 488248 495238 505830 520582 539009 558361 574803 584977 586009 576018 556164 530863
55762 530863 504479 478745 454180 432112 413641 398224 385038 374463 366511 359264 350921 342331
55750 342331 335531 330724 326623 322907 320223 318319 316119 313364 310558 307692 304546 301807 300383 299825
$$ packed form
55840I22087k2853k1465j9053j8249j8689j7754j5526j4606j5328j5524j4643
55829G28397j3967j3158j0804q057p472q495q250o643o441q314j0020j0620j1476
55816F04680j2661j2389j0525r078q635p704n980m953m809l932k017n90j11N73
55802E21869J617J985K042L341N516O337N208L774K790J194j284l347m426n317
55788E41299o201o358n987n941n673m054k071k023l898n192m606l203j770L82
55774D84704L544O990J0592J4752J8427J9352J6442J0174J032r991j9854k5301
55762E30863k6384k5734k4565k2068j8471j5417j3186j0575p952p247q343q590
55750C42331o800m807m101l716k684j904k200k755k806k866l146k739j424n58
$$ plain form
55736 299825 298764 296522 293124 288294 281857 274743 268273 262740 257704 253103 249022 244983 240665 236695
55722 236695 233557 230455 226565 222707 220399 219849 220326 221944 225509 230909 237091 243460 250013 256295 261375
55707 261375 264700 265993 264734 260828 255417 249899 244454 238517 232120 225608 218581 210478 201873 193936
55693 193936 186915 180340 174343 169519 165780 162600 160128 158831 158323 157894 157926 159403 162139 164900 167290
55678 167290 170158 173993 178136 181799 184648 186149 185507 182764 179101 175649 172631 169866 167482 165854
55664 165854 165334 166097 167768 169321 169986 170204 171112 173082 175320 176819 177205 176834 176596 177489 179850 183129
55648 183129 186679 190310 193614 195480 195217 193747 192701 192497 192094 190426 187154 182203 175513 167463 158953
55633 158953 150937 144203 139361 136492 134941 133932 133217 132798 132438 131920 131403 130980 130365 129558 129265 130005 131276
$$ packed form
55736B99825j061k242l398m830o437p114o470n533n036m601m081m039m318l970
55722B36695l138l102l890l858k308n50M77J618L565N400O182O369O553O282N080
55707B61375L325J293j259l906n411n518n445n937o397o512p027q103q605p937
55693A93936p021o575n997m824l739l180k472j297n08m29L2J477K736K761K390
55678A67290K868L835M143L663K849J501o42k743l663l452l018k765k384j628
55664A65854n20P63J671J553O65K18R08J970K238J499L86l71k38Q93K361L279
55648A83129L550L631L304J866k63j470j046k04m03j668l272m951o690q050q510
55633A58953q016o734m842k869j551j009p15m19l60n18n17m23o15q07k93P40J271
$$ plain form
55616 131276 132226 132607 132432 131344 129219 126789 124696 122447 119294 115700 112844 111063 109812 108837 108288
55601 108288 107916 107293 106731 106899 107588 107796 107055 105809 104526 103281 102128 101066 99694 97705 95632 94316
55585 94316 93790 93454 93146 93181 93535 93915 94553 95970 97990 99905 101615 103705 106353 108989 111135 112861
55569 112861 114358 115773 117446 119599 121776 123175 123502 122956 121657 119773 117862 116239 114233 111008 106903
55554 106903 103006 99598 96099 92464 89496 87607 86277 85012 83980 83488 83527 83984 84673 85188 85431 86156
55538 86156 88067 90500 91938 91917 91407 91245 91231 91000 90669 90221 89191 87535 86038 85331 85057 84502 83575 82706
55520 82706 82147 81769 81333 80695 79847 78731 76992 74278 71079 68766 68111 68241 67843 66979 66710 67229 67628
55503 67628 67507 67558 68276 69206 69915 70760 72075 73398 74078 74087 73687 72768 71037 68669 66378 64994 64996 66226
$$ packed form
55616A31276R50L81j75j088k125k430k093k249l153l594k856j781j251r75n49
55601A08288l72o23n62J68O89K08p41j246j283j245j153j062j372j989k073j316
55585I4316n26l36l08L5L54L80O38J417K020J915J710K090K648K636K146J726
55569A12861J497J415J673K153K177J399L27n46j299j884j911j623k006l225m105
55554A06903l897l408l499l635k968j889j330j265j032m92L9M57O89N15K43P25
55538H6156J911K433J438k1n10j62j4k31l31m48j030j656j497p07k74n55r27q69
55520H2706n59l78m36o38q48j116j739k714l199k313o55J30l98q64k69N19L99
55503F7628j21N1P18R30P09Q45J315J323O80Rm00r19j731k368k291j384KJ230
$$ plain form
55485 66226 67986 69649 71122 72518 73682 74446 75056 75837 76646 77190 77640 78396 79547 81085 83127 85251
55469 85251 86181 85099 82816 80596 78353 75227 71567 68787 67351 66441 65714 65846 66926 67797 67642 67044
55453 67044 66821 66827 66583 66196 65962 65756 65359 64844 64293 63705 63316 63308 63152 62197 60965 60736 61659 62466 62411 62185
55433 62185 62386 62391 61501 60097 58903 58064 57726 58450 60132 61513 61720 61487 61867 62609 62878 62861 63419 64693
55415 64693 66161 67651 69195 70238 70143 69311 68801 68896 69005 68870 68869 69019 68579 67014 64794 62914 61965 61766
55397 61766 61636 60938 59607 58197 57312 57099 57402 58117 59179 60477 62042 64104 66699 69402 71586 72771
55381 72771 72719 71613 70296 69822 70453 71374 71591 70807 69403 68038 67359 67517 67805 67280 65940 64685 63991
55364 63991 63381 62486 61750 61621 61821 61999 62395 63181 63764 63563 63012 63027 63752 64515 64842 64878 64939 65097 65113 64523
$$ packed form
55485F6226J760J663J473J396J164P64O10P81Q09N44M50P56J151J538K042K124
55469H5251R30j082k283k220k243l126l660k780j436r10p27J32J080Q71j55n98
55453F7044k23Ok44l87k34k06l97n15n51n88l89qj56r55j232k29R23Q07n5k26
55433F2185K01Nq90j404j194q39l38P24J682J381K07k33L80P42K69j7N58J274
55415F4693J468J490J544J043r5q32n10R5J09j35jJ50m40j565k220j880r49j99
55397F1766j30o98j331j410q85k13L03P15J062J298J565K062K595K703K184J185
55381G2771n2j106j317m74O31R21K17p84j404j365o79J58K88n25j340j255o94
55364F3991o10q95p36j29K00J78L96P86N83k01n51J5P25P63L27L6O1J58J6n90
$$ plain form
55344 64523 63084 61334 60283 60241 60442 60132 59490 59075 59009 59230 59906 60970 61778 61889 61718 61838 62160 62478
55326 62478 63174 64501 65695 65823 65206 64939 65205 65132 64341 63567 63540 64087 64646 64943 64887 64347 63388 62327 61313
55307 61313 60238 59180 58529 58443 58516 58278 57829 57733 58318 59232 59720 59410 58752 58518 58861 59193 59104 59030 59741 61437
55287 61437 63637 65690 67059 67374 66692 65669 65156 65514 66403 67135 67211 66716 66292 66498 67140 67512 67307 66910
55269 66910 66684 66477 66032 65407 64701 63853 63026 62757 63335 64356 65191 65604 65708 65773 66279 67581 69168 69829
55251 69829 69036 67662 66876 66849 67130 67692 68768 69974 70470 70008 69178 68523 67874 66684 64760 62651 61380
55234 61380 61623 63001 64378 64903 64501 63429 61979 60710 60268 60668 61333 62062 63247 64856 66057 66329
55218 66329 66094 65713 64777 63158 61786 61398 61255 60261 58797 58234 59027 60465 62086 64072 66266 67905
$$ packed form
55344F4523j439j750j051m2K01l10o42m15o6K21O76J064Q08J11j71J20L22L18
55326F2478O96J327J194J28o17k67K66p3p91p74k7N47N59K97n6n40r59j061j014
55307F1313j075j058o51q6P3k38m49r6N85R14M88l10o58k34L43L32q9p4P11J696
55287F1437K200K053J369L15o82j023n13L58Q89P32P6m95m24K06O42L72k05l97
55269F6910k26k07m45o25p06q48q27k69N78J021Q35M13J04O5N06J302J587O61
55251F9829p93j374p86k7K81N62J076J206M96m62q30o55o49j190j924k109j271
55234F1380K43J378J377N25m02j072j450j269m42M00O65P29J185J609J201K72
55218F6329k35l81r36j619j372l88j43r94j464n63P93J438J621J986K194J639
$$ plain form
55202 67905 68571 68578 68305 67853 67428 67363 67633 67853 67814 67597 67276 66968 66942 67211 67290 66858 66334 66215 66312 66317 66592 67532
55180 67532 68602 68985 68824 68837 69016 68840 68490 68625 69069 69034 68689 69177 70816 72479 73145 72991 72536 71802 70866
55161 70866 70329 70558 71135 71592 72086 72887 73801 74585 75478 76803 78379 79636 80069 79527 78438 77724 77894 78269
55143 78269 77719 76207 74790 74044 73417 72404 71394 70859 70546 70077 69683 69682 69767 69489 69026 68889 69111 69287 69226
55124 69226 69165 69466 70380 71890 73580 74895 75750 76609 77788 78959 79553 79394 78732 77896 77076 76281 75451 74783
55106 74783 74836 75951 77661 79128 80135 81126 82274 83090 83103 82416 81418 80385 79501 78922 78679 78782 79368 80430
55088 80430 81588 82578 83724 85327 86851 87515 87540 87934 89065 90391 91559 92706 93568 93427 92320 91234
55072 91234 90660 89992 88881 88138 88538 89603 90426 90988 91833 93015 94153 95068 95666 95634 94941 94201 93956 93989
$$ packed form
55202F7905O66Pk73m52m25o5K70K20l9k17l21l08k6K69P9m32n24j19R7NK75R40
55180F7532J070L83j61J3J79j76l50J35M44l5l45M88J639J663O66j54m55p34r36
55161G0866n37K29N77M57M94Q01R14P84Q93J325J576J257M33n42j089p14J70L75
55143G8269n50j512j417p46o27j013j010n35l13m69l94jQ5k78m63j37K22J76o1
55124F9226o1L01R14J510J690J315Q55Q59J179J171N94j59o62q36q20p95q30o68
55106G4783N3J115J710J467J007R91J148Q16J3o87r98j033q84n79k43J03N86J062
55088H0430J158R90J146J603J524O64K5L94J131J326J168J147Q62j41j107j086
55072I1234n74o68j111p43M00J065Q23N62Q45J182J138R15N98l2o93p40k45L3
$$ plain form
55054 93989 93914 93899 94138 94169 93445 92169 90808 89255 87265 85344 84286 84080 84113 84226 84687 85218 84977 83643
55036 83643 81846 80395 79654 79664 80234 80818 80907 80726 81033 82048 83050 83233 82569 81646 80956 80602 80485 80549 80797
55017 80797 81172 81502 81682 81884 82345 82897 83052 82647 82080 81729 81567 81563 82019 83091 84325 85106 85238 84791 83845
54998 83845 82910 83078 84913 87435 89065 89537 90055 91405 92758 92802 91446 89825 88903 88627 88445 88174 88117
54981 88117 88461 88929 89148 89210 89520 90087 90401 90224 90106 90730 91951 92909 92998 92401 91731 91510 91981 93094 94534
54962 94534 95911 96990 97687 97956 97822 97438 96983 96559 96313 96502 97209 98070 98505 98209 97308 96072 94638 93091
54944 93091 91687 90855 90838 91303 91523 91124 90499 90237 90337 90335 90078 89924 90198 90920 92061 93616 95375 97143
54926 97143 99186 101884 104910 107508 109764 112807 117373 122880 128418 133888 139491 144773 149023 152229
$$ packed form
55054I3989p5j5K39L1p24j276j361j553j990j921j058k06L3J13M61N31k41j334
55036H3643j797j451p41J0N70N84Q9j81L07J015J002J83o64r23o90l54j17O4K48
55017H0797L75L30J80K02M61N52J55m05n67l51j62mM56J072J234P81J32m47r46
54998H3845r35J68J835K522J630M72N18J350J353M4j356j621r22k76j82k71n7
54981H8117L44M68K19O2L10N67L14j77j18O24J221R58Q9n97o70k21M71J113J440
54962I4534J377J079O97K69j34l84m55m24k46J89P07Q61M35k96r01j236j434j547
54944I3091j404q32j7M65K20l99o25k62J00kk57j54K74P22J141J555J759J768
54926I7143K043K698L026K598K256L043M566N507N538N470N603N282M250L206
$$ plain form
54912 152229 154750 156239 155763 153046 148943 144543 140267 135861 130946 125585 120555 116887 114789 113247
54898 113247 111168 108733 107122 106997 107727 108106 107450 106014 104693 104288 104774 105351 105473 105585 106476 108163 109972
54881 109972 111604 113496 116078 119220 122680 126637 131455 137066 142813 147941 152105 155385 157807 159067
54867 159067 158857 157286 154579 150490 144636 137526 130624 125068 120837 117482 114965 113243 111673 109631
54853 109631 107382 105570 104145 102546 100817 99701 99605 100055 100254 99647 98041 95731 93527 92131 91426 90826
54837 90826 90206 89937 90055 90077 89794 89674 90205 91294 92504 93515 94110 94026 93100 91515 89736 88264 87396 87144
54819 87144 87369 88023 89066 90169 90849 91070 91390 92269 93567 94871 95842 96021 94983 93126 91690 91359 91408
54802 91408 90906 90131 89941 90328 90694 91152 92302 93846 94702 94570 94335 94708 95461 96222 96977 97537 97499 97188 97674
$$ packed form
54912A52229K521J489m76k717m103m400m276m406m915n361n030l668k098j542
54898A13247k079k435j611j25P30L79o56j436j321m05M86N77J22J12Q91J687J809
54881A09972J632J892K582L142L460L957M818N611N747N128M164L280K422J260
54867A59067k10j571k707m089n854p110o902n556m231l355k517j722j570k042
54853A09631k249j812j425j599j729j116r6M50J99o07j606k310k204j396p05o00
54837I0826o20k69J18K2k83j20N31J089J210J011N95q4r26j585j779j472q68k52
54819H7144K25O54J043J103O80K21L20Q79J298J304R71J79j038j857j436l31M9
54802I1408n02p75j90L87L66M58J150J544Q56j32k35L73P53P61P55N60l8l11M86
$$ plain form
54783 97674 99318 101085 101892 101935 102161 103033 104423 106130 107889 109261 110148 111118 112779 115079 117637 120519
54767 120519 124255 129220 135243 141657 147667 152938 157896 163119 168407 172841 175700 176744 175656 172084
54753 172084 166506 160249 154226 148345 142508 137352 133330 129763 125683 121183 117186 114231 112188 110931
54739 110931 110499 110651 110879 110919 110823 110661 110557 110858 111794 113113 114479 116005 117939 120040 121850 123467 125438
54722 125438 127935 130674 133717 137702 142954 148773 153926 157601 159667 160305 159685 157946 155235 151717 147607
54707 147607 143186 138735 134431 130282 126175 122064 118198 115048 112946 111735 110855 109766 108353 106995
54693 106995 106173 106010 106221 106506 106679 106317 104764 102027 99386 98411 99330 100933 102086 102639 102701 101977 100456
54676 100456 99081 98848 99456 99614 98679 97313 96397 95898 95213 94279 93843 94513 95847 96676 96342 95326 94483
$$ packed form
54783I7674J644J767Q07M3K26Q72J390J707J759J372Q87R70J661K300K558K882
54767A20519L736M965O023O414O010N271M958N223N288M434K859J044j088l572
54753A72084n578o257o023n881n837n156m022l567m080m500l997k955k043j257
54739A10931m32J52K28M0r6j62j04L01R36J319J366J526J934K101J810J617J971
54722A25438K497K739L043L985N252N819N153L675K066O38o20j739k711l518m110
54707A47607m421m451m304m149m107m111l866l150k102j211q80j089j413j358
54693A06995q22j63K11K85J73l62j553k737k641r75R19J603J153N53O2p24j521
54676A00456j375k33O08J58r35j366r16m99o85r34m36O70J334Q29l34j016q43
$$ plain form
54659 94483 93984 93442 92890 92985 94084 95622 96705 97014 96858 96660 96666 96900 97152 97193 97152 97478 98398 99652 100858
54640 100858 101791 102190 101815 100907 100161 99884 99617 98980 98413 98562 99327 100143 100948 102174 103825 105246 105934 106079
54622 106079 106095 105995 105460 104306 102724 101158 100033 99514 99468 99663 99941 100211 100461 100837 101499 102309 102911 103241
54604 103241 103673 104418 105017 104779 103521 101703 99984 98841 98404 98393 98419 98514 99096 100199 101131 101288 101027 101212
54586 101212 102091 103130 103854 104271 104446 104206 103514 102816 102684 103195 103800 103823 103080 102021 101235 100868 100677 100564
54568 100564 100688 100974 100942 100307 99449 98993 99205 100001 101235 102652 103852 104674 105423 106423 107573 108679 109797
54551 109797 110857 111346 110917 110053 109581 109729 110242 111130 112548 114086 114950 114916 114478 113967 113273 112521 112281 112776
54533 112776 113441 113574 112962 111680 109877 108109 107281 107687 108453 108430 107445 106226 105347 104807 104549 104816 105800 107254
$$ packed form
54659I4483m99n42n52R5J099J538J083L09j56j98OK34K52M1m1L26R20J254J206
54640A00858R33L99l75r08p46k77k67o37n67J49P65Q16Q05J226J651J421O88J45
54622A06079J6j00n35j154j582j566j125n19m6J95K78K70K50L76O62Q10O02L30
54604A03241M32P45N99k38j258j818j719j143m37j1K6R5N82J103R32J57k61J85
54586A01212Q79J039P24M17J75k40o92o98j32N11O05K3p43j059p86l67j91j13
54568A00564J24K86l2o35q58m56K12P96J234J417J200Q22P49J000J150J106J118
54551A09797J060M89m29q64m72J48N13Q88J418J538Q64l4m38n11o94p52k40M95
54533A12776O65J33o12j282j803j768q28M06P66k3r85j219q79n40k58K67R84J454
$$ plain form
54515 107254 108665 109652 110130 110232 110240 110512 111267 112335 113171 113297 112827 112417 112610 113250 113663 113355 112448 111493 110948
54496 110948 110744 110336 109326 108086 107496 107858 108377 108073 107015 106285 106847 108803 111617 114507 116552 117022
54480 117022 115991 114444 113549 113807 114908 116271 117595 118983 120496 121663 121752 120768 119910 120548 122838 125758
54464 125758 128409 130757 133021 134910 135750 135129 133243 130834 128798 127525 126568 125252 123608 122296 121604
54449 121604 121124 120523 120048 119913 119759 119179 118385 117838 117545 117197 116763 116411 116021 115332 114480 113899 113726 113764 114034
54430 114034 114769 115767 116266 115800 114853 114351 114698 115568 116466 117298 118437 120360 123062 125730 127244 127158 126077
54413 126077 124896 123959 123235 122971 123541 124707 125603 125705 125400 125373 125801 126398 126875 127006 126619 125985 125916 126896 128310
54394 128310 129146 129357 129855 131133 132696 134011 135177 136202 136392 135232 133417 132221 131986 131968 131628 131352
$$ packed form
54515A07254J411R87M78J02QK72P55J068Q36J26m70m10J93O40M13l08r07r55n45
54496A10948k04m08j010j240n90L62N19l04j058p30N62J956K814K890K045M70
54480A17022j031j547q95K58J101J363J324J388J513J167Q9r84q58O38K290K920
54464A25758K651K348K264J889Q40o21j886k409k036j273r57j316j644j312o92
54449A21604m80o01m75j35j54n80p94n47k93l48m34l52l90o89q52n81j73L8K70
54430A14034P35R98M99m66r47n02L47Q70Q98Q32J139J923K702K668J514q6j081
54413A26077j181r37p24k64N70J166Q96J02l05k7M28N97M77J31l87o34o9R80J414
54394A28310Q36K11M98J278J563J315J166J025J90j160j815j196k35j8l40k76
$$ plain form
54378 131352 131736 132765 134049 135530 137547 140239 143124 145411 146755 147594 148637 150056 151533 152999 154813
54363 154813 156972 158672 159072 158162 156443 154219 151823 150168 150206 151783 153665 154772 154850 153969 152055 149213
54347 149213 145962 142821 139933 137313 135098 133398 132186 131456 131217 131263 131287 131308 131589 131996 131909 131018 129908
54330 129908 129553 130370 131897 133208 133537 132795 131568 130473 129522 128363 127069 126214 126150 126639 127297 127929 128287
54313 128287 128024 127172 126240 125573 125028 124556 124580 125353 126353 126899 127142 127893 129519 131465 132872 133329 133000 132288
54295 132288 131501 130717 129887 129075 128456 128080 127794 127515 127352 127463 127987 129091 130712 132162 132500 131598 130451
54278 130451 130103 130561 131144 131570 132179 133236 134512 135577 136183 136341 136292 136387 136783 137287 137684 138091 138779 139753
54260 139753 140727 141444 141849 142118 142630 143749 145338 146695 147213 146960 146371 145635 144740 143903 143439 143235 142813 141992
$$ packed form
54378A31352L84J029J284J481K017K692K885K287J344Q39J043J419J477J466J814
54363A54813K159J700M00r10j719k224k396j655L8J577J882J107P8q81j914k842
54347A49213l251l141k888k620k215j700j212p30k39M6K4K1K81M07q7q91j110
54330A29908l55Q17J527J311L29p42j227j095r51j159j294q55o4M89O58O32L58
54313A28287k63q52r32o67n45m72K4P73J000N46K43P51J626J946J407M57l29p12
54295A32288p87p84q30q12o19l76k86k79j63J11N24J104J621J450L38r02j147
54278A30451l48M58N83M26O09J057J276J065O06J58m9R5L96N04L97M07O88R74
54260A39753R74P17M05K69N12J119J589J357N18k53n89p36q95q37m64k04m22q21
$$ plain form
54242 141992 141110 140553 140388 140558 141114 142061 143132 143875 143917 143152 141778 140134 138367 136338 133982 131639 129849
54225 129849 128930 128924 129794 131287 132770 133667 134044 134402 134797 134654 133591 132046 130757 129917 129132 128038 126717
54208 126717 125614 125302 126170 128048 130143 131603 132199 132339 132498 132850 133397 134148 135040 135894 136628 137326 137991
54191 137991 138352 138199 137813 137762 138200 138640 138529 137899 137295 137285 138179 140002 142403 144661 146136 146781 147028 147163
54173 147163 147049 146516 145782 145324 145426 145945 146385 146205 145229 143829 142591 141725 140953 139993 138994 138400 138490 139075
54155 139075 139575 139394 138378 136940 135694 135027 135087 135871 136983 137501 136699 134966 133569 133341 134009 134879 135668
54138 135668 136373 136855 137045 137244 137761 138415 138838 139150 139907 141357 143043 144266 144772 145001 145676 147087 148830
54121 148830 150445 152199 154818 158356 161904 164667 166817 168850 170582 171404 171247 170672 170104 169544 168875 167882
$$ packed form
54242A41992q82n57j65J70N56R47J071P43M2p65j374j644j767k029k356k343j790
54225A29849r19oQ70J493J483Q97L77L58L95j43j063j545j289q40p85j094j321
54208A26717j103l12Q68J878K095J460N96J40J59L52N47P51Q92Q54P34O98O65
54191A37991L61j53l86n1M38M40j11o30o04j0Q94J823K401K258J475O45K47J35
54173A47163j14n33p34m58J02N19M40j80r76j400j238q66p72r60r99n94R0N85
54155A39075N00j81j016j438j246o67O0P84J112N18q02j733j397k28O68Q70P89
54138A35668P05M82J90J99N17O54M23L12P57J450J686J223N06K29O75J411J743
54121A48830J615J754K619L538L548K763K150K033J732Q22j57n75n68n60o69r93
$$ plain form
54105 167882 166058 163085 159610 156905 155510 154691 153490 151876 150504 149723 149281 148858 148454 148185 147992 147676
54089 147676 147162 146666 146599 147296 148806 150852 152890 154263 154554 154012 153519 153945 155493 157721 160053 162141
54073 162141 163883 165329 166581 167678 168609 169467 170427 171456 172183 172220 171521 170372 169230 168624 168931 169981
54057 169981 171097 171750 171949 171881 171554 171108 171127 172181 174231 176881 179942 183324 186615 189375 191802 194612
54041 194612 198315 203035 208878 215881 223579 231204 238388 245245 251769 257747 263289 268775 274111 278629
54027 278629 282020 284753 287208 288972 289571 289476 289717 290628 291505 291480 290278 288082 285042 281173 276535 271321
54011 271321 265754 260031 254396 249180 244576 240358 236037 231468 227086 223314 219958 216570 213213 210415
53997 210415 208384 206799 205487 204794 205016 205801 206456 206594 206316 205990 206134 207282 209634 212794 216049 218983
$$ packed form
54105A67882j824k973l475k705j395q19j201j614j372p81m42m23m04k69j93l16
54089A47676n14m96o7O97J510K046K038J373K91n42m93M26J548K228K332K088
54073A62141J742J446J252J097R31Q58R60J029P27L7o99j149j142o06L07J050
54057A69981J116O53J99o8l27m46J9J054K050K650L061L382L291K760K427K810
54041A94612L703M720N843P003P698P625P184O857O524N978N542N486N336M518
54027B78629L391K733K455J764N99r5K41R11Q77k5j202k196l040l869m638n214
54011B71321n567n723n635n216m604m218m321m569m382l772l356l388l357k798
53997B10415k031j585j312o93K22P85O55J38k78l26J44J148K352L160L255K934
$$ plain form
53981 218983 221781 224861 228122 230564 230931 228934 225578 222015 218380 214225 209773 205966 203233 200924
53967 200924 198197 194910 191428 188207 185911 185357 186710 188955 190623 191021 190566 190203 190710 192259 194358
53952 194358 196308 197902 199447 201148 202912 204905 207708 211528 215680 219348 222575 226040 230077 234335
53938 234335 238292 241742 244900 248289 252381 257147 262133 267081 272097 277099 281664 285778 290183 295460
53924 295460 301230 306814 312232 317827 323358 328332 333116 338808 345954 353996 362030 369491 376163 382166
53910 382166 387971 393727 398533 401123 401410 400662 399973 399298 398162 396505 394341 391323 387275 382650 377885
53895 377885 372730 366784 360315 353878 347344 339992 331535 322536 313779 305692 298382 291825 285898 280457
53881 280457 275443 270774 266277 261971 258257 255413 252956 249906 245820 241261 237170 234002 231503 229081
$$ packed form
53981B18983K798L080L261K442L67j997l356l563l635m155m452l807k733k309
53967B00924k727l287l482l221k296n54J353K245J668L98m55l63N07J549K099
53952A94358J950J594J545J701J764J993K803L820M152L668L227L465M037M258
53938B34335L957L450L158L389M092M766M986M948N016N002M565M114M405N277
53924B95460N770N584N418N595N531M974M784N692P146Q042Q034P461O672O003
53910C82166N805N756M806K590K87p48o89o75j136j657k164l018m048m625m765
53895C77885n155n946o469o437o534p352q457q999q757q087p310o557n927n441
53881B80457n014m669m497m306l714k844k457l050m086m559m091l168k499k422
$$ plain form
53867 229081 226275 223136 220300 218465 217567 216628 214626 211471 207975 204963 202603 200634 198941 197657 196759
53852 196759 195827 194356 192284 190073 188306 187329 187221 187897 189095 190354 191136 191037 189991 188400 186989 186276
53836 186276 186125 186041 185949 186292 187213 188062 188158 187718 187475 187582 187520 187117 186886 187168 187629 188042 188961 190978 193734
53817 193734 196382 198843 201825 205592 209445 212682 215442 218255 221197 223938 226369 228788 231613 235168
53803 235168 239621 244823 250333 255797 261233 266774 272287 277466 282162 286387 290105 293281 296018 298442
53789 298442 300528 302255 303802 305289 306431 306744 306070 304640 302618 299862 296148 291400 285711 279373 272917
53774 272917 266867 261434 256546 252087 247925 243837 239762 236003 232888 230269 227731 225154 222681 220209
53760 220209 217476 214632 212154 210045 207771 205210 203083 202004 201573 200827 199309 197320 195472 194362 194323
$$ packed form
53867B29081k806l139k836j835q98r39k002l155l496l012k360j969j693j284q98
53852A96759r32j471k072k211j767r77j08O76J198J259P82r9j046j591j411p13
53836A86276j51q4r2L43R21Q49R6m40k43J07o2m03k31K82M61M13R19K017K756
53817A93734K648K461K982L767L853L237K760K813K942K741K431K419K825L555
53803B35168M453N202N510N464N436N541N513N179M696M225L718L176K737K424
53789B98442K086J727J547J487J142L13o74j430k022k756l714m748n689o338o456
53774B72917o050n433m888m459m162m088m075l759l115k619k538k577k473k472
53760B20209k733k844k478k109k274k561k127j079m31p46j518j989j848j110l9
$$ plain form
53745 194323 195073 195838 196188 196484 197155 197914 198167 197892 197568 197509 197808 198704 200354 202305 203862 204941 205976
53728 205976 207011 207599 207666 207809 208479 209497 210614 211968 213589 215013 215884 216621 217980 220163 222737 225252
53712 225252 227504 229346 230711 231827 233093 234619 236115 237316 238389 239856 242145 245183 248456 251594
53698 251594 254859 258840 263632 268575 272994 276840 280396 283597 286069 287693 288707 289254 289209 288524 287409
53683 287409 286008 284188 281843 279262 276991 275381 274371 273610 272693 271435 270105 269358 269738 271178 273015
53668 273015 274529 275453 276009 276555 277126 277251 276337 274418 272516 271884 272762 274054 274465 273781 272842 272460 272782
53651 272782 273619 274857 276314 277587 278383 278847 279307 279896 280698 282059 284308 287191 289911 291838 292875 293147
53635 293147 292727 291928 291483 291988 293200 294245 294581 294511 294662 295221 295977 296957 298601 301112 303940 306280 308020
$$ packed form
53745A94323P50P65L50K96O71P59K53k75l24n9K99Q96J650J951J557J079J035
53728B05976J035N88O7J43O70J018J117J354J621J424Q71P37J359K183K574K515
53712B25252K252J842J365J116J266J526J496J201J073J467K289L038L273L138
53698B51594L265L981M792M943M419L846L556L201K472J624J014N47m5o85j115
53683B87409j401j820k345k581k271j610j010p61r17j258j330p47L80J440J837
53668B73015J514R24N56N46N71J25r14j919j902o32Q78J292M11o84r39l82L22
53651B72782Q37J238J457J273P96M64M60N89Q02J361K249K883K720J927J037K72
53635B93147m20p99m45N05J212J045L36p0J51N59P56R80J644K511K828K340J740
$$ plain form
53618 308020 309891 312582 315983 319404 322303 324652 326847 329478 332971 337148 341288 344922 348432 352464
53604 352464 356834 360487 362703 363941 365213 366939 368728 370085 370884 371154 370824 369971 369087 368759 369042 369401
53588 369401 369389 369170 369128 369153 368661 367298 365254 362813 359960 356683 353352 350478 348250 346532 345087 343548
53572 343548 341482 338921 336680 335672 335911 336596 337057 337137 336725 335591 333970 332748 332709 333846 335667 337806
53556 337806 340025 341883 342867 342835 342124 341298 340904 341287 342430 344064 346007 348224 350443 352127 353131 354143
53540 354143 356132 359411 363484 367689 371691 375575 379820 385122 391824 399482 407299 415116 423610 433413
53526 433413 444268 455275 465796 475949 486314 497379 509287 521960 535314 549307 563854
53515 563854 578820 594166 610054 626795 644761 664272 685341 707437 729738 751843 774056
$$ packed form
53618C08020J871K691L401L421K899K349K195K631L493M177M140L634L510M032
53604C52464M370L653K216J238J272J726J789J357P99K70l30q53q84l28K83L59
53588C69401j2k19m2K5m92j363k044k441k853l277l331k874k228j718j445j539
53572C43548k066k561k241j008K39O85M61Q0m12j134j621j222l9J137J821K139
53556C37806K219J858R84l2p11q26l94L83J143J634J943K217K219J684J004J012
53540C54143J989L279M073M205M002L884M245N302O702P658P817P817Q494R803
53526D33413J0855J1007J0521J0153J0365J1065J1908J2673J3354J3993J4547
53515E63854J4966J5346J5888J6741J7966J9511K1069K2096K2301K2105K2213
$$ plain form
53504 774056 796759 819658 841989 863354 883974 904092 923480 941710 958544 973948 988029
53493 988029 1001316 1014828 1029426 1045075 1060959 1076327 1091018 1105215 1119100 1132927 1147121
53482 1147121 1161981 1177304 1192465 1206888 1220363 1232967 1244761 1255491 1264487 1271008 1274861 1276524
53470 1276524 1276389 1274127 1269232 1262113 1253979 1245423 1235725 1224058 1210906 1197632 1184917 1172370 1159574
53457 1159574 1146652 1133554 1119589 1104172 1087566 1070444 1053150 1035874 1019143 1003428 988400
53446 988400 973287 957982 943219 929586 917007 905522 895968 889301 885415 883150 881413 879912 878736
53433 878736 877725 876629 875775 876149 878623 883172 888936 895005 901054 907393 914640 923394 933946 946146
53419 946146 959678 974584 991295 1009913 1029659 1049489 1069250 1089906 1112432 1136817 1162400
$$ packed form
53504G74056K2703K2899K2331K1365K0620K0118J9388J8230J6834J5404J4081
53493I88029J3287J3512J4598J5649J5884J5368J4691J4197J3885J3827J4194
53482A147121J4860J5323J5161J4423J3475J2604J1794J0730Q996O521L853J663
53470A276524j35k262m895p119q134q556r698j1667j3152j3274j2715j2547j2796
53457A159574j2922j3098j3965j5417j6606j7122j7294j7276j6731j5715j5028
53446I88400j5113j5305j4763j3633j2579j1485r554o667l886k265j737j501j176
53433H78736j011j096q54L74K474M549N764O069O049O339P247Q754J0552J2200
53419I46146J3532J4906J6711J8618J9746J9830J9761K0656K2526K4385K5583
$$ plain form
53408 1162400 1188932 1216918 1246870 1278566 1311240 1344401 1378288 1413526 1450517 1489314 1529950
53397 1529950 1572558 1616922 1662155 1707271 1752185 1797767 1844682 1892405 1939708 1985874 2030973
53386 2030973 2075056 2117700 2158580 2197968 2236186 2272779 2306683 2337160 2364203 2388032 2408557
53375 2408557 2425415 2438157 2446344 2449727 2448469 2442913 2433029 2418366 2398699 2374383 2345823 2312962
53363 2312962 2275737 2234949 2192278 2149311 2106664 2063972 2020590 1976464 1932490 1889920 1849269
53352 1849269 1810016 1771517 1733808 1697197 1661441 1626006 1590970 1556955 1524146 1492070 1460460
53341 1460460 1429768 1400565 1373024 1347262 1323640 1302297 1282841 1264907 1248595 1233897 1220107
53330 1220107 1206478 1193269 1181433 1171230 1161613 1151083 1138759 1124674 1109552 1094515 1080574
$$ packed form
53408A162400K6532K7986K9952L1696L2674L3161L3887L5238L6991L8797M0636
53397A529950M2608M4364M5233M5116M4914M5582M6915M7723M7303M6166M5099
53386B030973M4083M2644M0880L9388L8218L6593L3904L0477K7043K3829K0525
53375B408557J6858J2742Q187L383j258n556r884j4663j9667k4316k8560l2861
53363B312962l7225m0788m2671m2967m2647m2692m3382m4126m3974m2570m0651
53352A849269l9253l8499l7709l6611l5756l5435l5036l4015l2809l2076l1610
53341A460460l0692k9203k7541k5762k3622k1343j9456j7934j6312j4698j3790
53330A220107j3629j3209j1836j0203r617j0530j2324j4085j5122j5037j3941
$$ plain form
53319 1080574 1068018 1056398 1045284 1034933 1026024 1018857 1013014 1007963 1003859 1001508 1001427 1003135 1005646
53306 1005646 1008490 1011905 1016094 1020941 1026658 1034078 1043762 1055214 1067593 1080936 1096015 1113080 1131510
53293 1131510 1150775 1171106 1192872 1215776 1238975 1261665 1283267 1303389 1321992 1339381 1355655
53282 1355655 1370225 1382280 1391675 1399069 1405059 1409429 1411365 1410273 1406262 1399931 1391872 1382377 1371390
53269 1371390 1358599 1343655 1326500 1307494 1287154 1265774 1243423 1220143 1196035 1171294 1146480
53258 1146480 1122543 1100018 1078167 1055520 1031510 1007028 983179 960190 937969 916879 897039
53247 897039 877352 856405 834329 812826 793269 775605 759178 743608 728457 713014 697139
53236 697139 681708 667566 654500 641922 630139 620102 612063 605233 598795 592609 586657 580377 572955
$$ packed form
53319A080574j2556j1620j1114j0351q909p167n843n051m104k351q1J708K511
53306A005646K844L415M189M847N717P420R684J1452J2379J3343J5079J7065J8430
53293A131510J9265K0331K1766K2904K3199K2690K1602K0122J8603J7389J6274
53282A355655J4570J2055R395P394N990M370J936j092m011o331q059r495j0987
53269A371390j2791j4944j7155j9006k0340k1380k2351k3280k4108k4741k4814
53258A146480k3937k2525k1851k2647k4010k4482k3849k2989k2221k1090j9840
53247H97039j9687k0947k2076k1503j9557j7664j6427j5570j5151j5443j5875
53236F97139j5431j4142j3066j2578j1783j0037q039o830o438o186n952o280p422
$$ plain form
53223 572955 564188 554758 545551 536662 527159 515943 502875 488941 475373 462877 451672 441719 432663
53210 432663 423963 415500 407792 401239 395382 389273 382407 374886 366946 358808 350880 343539 336641 329671
53196 329671 322451 315328 308644 302434 296724 291697 287404 283602 280037 276638 273315 269862 266211 262530
53182 262530 258938 255385 251922 248826 246250 243995 241808 239691 237696 235641 233391 231292 229969 229650
53168 229650 229901 230097 230023 229950 230206 230740 231098 230849 230012 229022 228297 227916 227690 227367 226765 225841 224738 223608 222403
53149 222403 220981 219486 218391 218045 218404 219342 220961 223262 225678 227346 227897 227764 227626 227741 227908 227875 227708
53132 227708 227788 228492 229774 231090 231859 232047 232187 232812 233964 235274 236393 237311 238365 239960 242187 244699
53116 244699 247059 249202 251423 253914 256457 258599 259948 260279 259574 258105 256281 254278 251980 249423 247031
$$ packed form
53223E72955q767r430r207q889r503j1216j3068j3934j3568j2496j1205r953r056
53210D32663q700q463p708o553n857o109o866p521p940q138p928p341o898o970
53196C29671p220p123o684o210n710n027m293l802l565l399l323l453l651l681
53182B62530l592l553l463l096k576k255k187k117j995k055k250k099j323l19
53168B29650K51J96p4p3K56N34L58k49q37r90p25l81k26l23o02r24j103j130j205
53149B22403j422j495j095l46L59R38J619K301K416J668N51j33j38J15J67l3j67
53132B27708Q0P04J282J316P69J88J40O25J152J310J119R18J054J595K227K512
53116B44699K360K143K221K491K543K142J349L31p05j469j824k003k298k557k392
$$ plain form
53101 247031 245190 243728 242152 240331 238663 237538 236883 236308 235519 234530 233556 232692 231629 229812 227071 224000
53085 224000 221465 219810 218784 218127 217823 217807 217879 218027 218397 218788 218609 217620 216328 215359 214775 214316 213872 213285
53067 213285 212130 210337 208707 208094 208177 207812 206598 205329 204777 204795 204966 205397 206357 207635 208868 210076 211305
53050 211305 212061 211803 210934 210652 211692 213671 215763 217583 219185 220500 221101 220514 218709 216332 214354 213330
53034 213330 213030 212918 212838 212951 213149 212990 212335 211698 211712 212416 213321 214045 214685 215565 216770 218032 218992 219535 219779
53015 219779 219793 219466 218732 217777 216890 216167 215493 214711 213679 212310 210844 209958 210265 211641 213323 214737 215948
52998 215948 217199 218353 219047 219254 219409 219967 221009 222305 223721 225467 227844 230683 233230 234831 235619
52983 235619 236233 236888 237211 237061 237026 237704 238846 239611 239501 238667 237470 236254 235502 235686 236742 238016 238918
$$ packed form
53101B47031j841j462j576j821j668j125o55n75p89r89r74q64j063j817k741l071
53085B24000k535j655j026o57l04j6P2J48L70L91j79r89j292r69n84m59m44n87
53067B13285j155j793j630o13Q3l65j214j269n52J8J71M31R60J278J233J208J229
53050B11305P56k58q69k82J040J979K092J820J602J315O01n87j805k377j978j024
53034B13330l00j12q0J13J98j59o55o37J4P04R05P24O40Q80J205J262R60N43K44
53015B19779J4l27p34r55q87p23o74p82j032j369j466q86L07J376J682J414J211
52998B15948J251J154O94K07J55N58J042J296J416J746K377K839K547J601P88
52983B35619O14O55L23j50l5O78J142P65j10q34j197j216p52J84J056J274R02
$$ plain form
52966 238918 239448 239926 240456 240898 241230 241684 242515 243760 245198 246484 247344 247710 247654 247176 246120 244396 242249
52949 242249 240238 238845 238040 237226 235721 233375 230737 228579 227306 226841 226893 227141 227303 227238 227069 227040 227210
52932 227210 227426 227568 227612 227486 227095 226578 226294 226428 226809 227186 227499 227744 227851 227879 228131 228721 229199 228913 227790
52913 227790 226508 225894 226266 227293 228276 228608 228233 227660 227336 227089 226459 225565 225248 226191 228133 230154 231466
52896 231466 231780 231183 230113 229379 229745 231215 232860 233627 233319 232674 232455 232712 233127 233793 235143 236984 238248
52879 238248 238167 237400 237371 238612 240372 241817 242944 244110 245380 246767 248511 250575 252252 252902 252813 252799 253155
52862 253155 253587 253945 254296 254345 253521 251825 249934 248222 246226 243399 239894 236331 233200 230770 229098 227694
52846 227694 225669 222718 219645 217349 215557 213260 210256 207601 206373 206582 207474 208388 209009 209142 208702 207811
$$ packed form
52966B38918N30M78N30M42L32M54Q31J245J438J286Q60L66n6m78j056j724k147
52949B42249k011j393q05q14j505k346k638k158j273m65N2K48J62o5j69k9J70
52932B27210K16J42M4j26l91n17k84J34L81L77L13K45J07K8K52N90M78k86j123
52913B27790j282o14L72J027R83L32l75n73l24k47o30q94l17R43J942K021J312
52896B31466L14n97j070p34L66J470J645P67l08o45k19K57M15O66J350J841J264
52879B38248q1p67k9J241J760J445J127J166J270J387J744K064J677O50q9j4L56
52862B53155M32L58L51M9q24j696j891j712j996k827l505l563l131k430j672j404
52846B27694k025k951l073k296j792k297l004k655j228K09Q92R14O21J33m40q91
$$ plain form
52830 207811 206690 205565 204740 204564 205051 205693 205905 205617 205266 205226 205404 205447 205243 205163 205775 207285 209314 211295
52812 211295 212991 214421 215406 215630 215280 215211 216072 217455 218264 217800 216099 213409 209975 206487 204091 203422
52796 203422 203869 204228 204005 203722 204019 204849 205632 205869 205501 204891 204599 204998 205891 206584 206466 205505 204203 203162
52778 203162 202707 202771 203058 203382 203833 204510 205150 205248 204603 203526 202451 201597 201091 201077 201485 201962 202340 202981 204286
52759 204286 206036 207567 208529 209100 209514 209785 209967 210351 211248 212715 214520 216179 217163 217379 217490 218429 220470
52742 220470 223011 225232 226724 227532 228010 228638 229540 230180 230055 229721 230382 232225 233942 234389 234001 233868 234051
52725 234051 233783 232946 232181 231614 230580 228869 227271 226408 225825 224898 223999 223991 224878 225667 225520 224516 223335 222630
52707 222630 222710 223415 224178 224464 224229 223856 223694 223854 224346 225144 226100 226951 227470 227512 227049 226321 225827 225912 226422 226990
$$ packed form
52830B07811j121j125q25j76M87O42K12k88l51m0J78M3k04q0O12J510K029J981
52812B11295J696J430R85K24l50o9Q61J383Q09m64j701k690l434l488k396o69
52796B03422M47L59k23k83K97Q30P83K37l68o10k92L99Q93O93j18r61j302j041
52778B03162m55O4K87L24M51O77O40R8o45j077j075q54n06j4M08M77L78O41J305
52759B04286J750J531R62N71M14K71J82L84Q97J467J805J659R84K16J11R39K041
52742B20470K541K221J492Q08M78O28R02O40j25l34O61J843J717M47l88j33J83
52725B34051k68q37p65n67j034j711j598q63n83r27q99qQ87P89j47j004j181p05
52707B22630Q0P05P63K86k35l73j62J60M92P98R56Q51N19M2m63p28m94Q5N10N68
$$ plain form
52687 226990 227538 228177 228689 228593 227826 226959 226546 226547 226638 226769 227051 227312 227183 226594 225814 225046 224297 223722 223691 224313
52667 224313 225173 225814 226302 227060 228222 229440 230319 230817 231191 231784 232912 234713 236930 238983 240491 241681
52651 241681 243119 244995 246760 247525 246791 244827 242411 240209 238348 236594 234883 233560 232991 233112 233557
52636 233557 234212 235377 237217 239237 240584 240883 240644 240765 241759 243506 245622 247878 250265 252746 255009
52621 255009 256480 256666 255643 254189 253219 252957 252776 251972 250605 249411 249000 249363 250073 250628 250569 249657 248239
52604 248239 247214 247274 248217 249237 249849 250254 250815 251528 252163 252705 253365 254216 254984 255277 255021 254653 254873 255995
52586 255995 257522 258477 258295 257353 256552 256443 256912 257575 258275 259087 260056 261065 261940 262551 262834 262800 262515 262010
52568 262010 261259 260357 259683 259705 260472 261350 261430 260248 258109 255739 253678 251962 250343 248765 247562 247144 247492
$$ packed form
52687B26990N48O39N12r6p67q67m13JR1J31K82K61j29n89p80p68p49n75l1O22
52667B24313Q60O41M88P58J162J218Q79M98L74N93J128J801K217K053J508J190
52651B41681J438J876J765P65p34j964k416k202j861j754j711j323n69J21M45
52636B33557O55J165J840K020J347K99k39J21R94J747K116K256K387K481K263
52621B55009J471J86j023j454r70k62j81q04j367j194m11L63P10N55n9r12j418
52604B48239j025O0R43J020O12M05N61P13O35N42O60Q51P68K93k56l68K20J122
52586B55995J527R55j82r42q01j09M69O63P00Q12R69J009Q75O11K83l4k85n05
52568B62010p51r02o74K2P67Q78Q0j182k139k370k061j716j619j578j203m18L48
$$ plain form
52551 247492 248085 248405 248400 248373 248567 248988 249514 249947 250062 249845 249625 249660 249646 249029 247917 247250 247762 249143 250588
52532 250588 251930 253716 256222 258908 261017 262339 263081 263254 262579 261078 259492 258827 259466 260834 262077
52517 262077 262952 263877 265112 266274 266870 267140 268023 270256 273663 277390 280686 283473 286225 289294 292262
52502 292262 294051 293780 291505 288041 284187 280304 276531 273108 270316 268169 266223 263807 260627 257245
52488 257245 254734 253699 253801 254404 255321 256571 257692 257898 256972 255475 254049 253020 252742 253689 255776 258075
52472 258075 259707 260778 262031 263830 265957 268270 270955 274099 277478 280913 284457 288011 291041 292999
52458 292999 293907 294273 294429 294134 292862 290405 287071 283423 279937 276899 274376 272122 269673 266840 264114
52443 264114 262267 261434 260834 259556 257497 255379 254001 253638 253938 254203 253921 253262 252931 253338 254080 254497 254546
$$ packed form
52551B47492N93L20nk7J94M21N26M33J15k17k20L5j4o17j112o67N12J381J445
52532B50588J342J786K506K686K109J322P42J73o75j501j586o65O39J368J243
52517B62077Q75R25J235J162N96K70Q83K233L407L727L296K787K752L069K968
52502B92262J789k71k275l464l854l883l773l423k792k147j946k416l180l382
52488B57245k511j035J02O03R17J250J121K06r26j497j426j029k78R47K087K299
52472B58075J632J071J253J799K127K313K685L144L379L435L544L554L030J958
52458B92999R08L66J56k95j272k457l334l648l486l038k523k254k449k833k726
52443B64114j847q33o00j278k059k118j378l63L00K65k82o59l31M07P42M17M9
$$ plain form
52426 254546 254725 255321 256215 257392 259041 260960 262409 262966 263141 263745 264939 266380 268112 270760 274740 279682
52410 279682 284772 289441 293697 298081 303345 309821 316968 323735 329387 333714 336445 337002 335118 331323
52396 331323 326501 321229 315880 310929 306663 302857 299291 296321 294303 292629 290272 287351 285270 285004
52382 285004 286070 287639 289724 292505 295255 297049 298250 300227 303622 307792 311960 316029 320092 324074
52368 324074 328219 333112 338659 343636 346829 348254 348785 348965 348717 347951 346843 345644 344626 344062 343936 343843
52352 343843 343548 343469 344186 345636 347238 348699 350230 352092 354444 357611 361896 366992 372091 376804 381596
52337 381596 387019 393002 399282 406274 414913 425637 437889 450815 464181 478404 493860 510479
52325 510479 528062 546668 566390 586894 607538 628022 648557 669243 689586 708920 727087
$$ packed form
52426B54546J79N96Q94J177J649J919J449N57J75O04J194J441J732K648L980M942
52410B79682N090M669M256M384N264O476P147O767N652M327K731N57j884l795
52396C31323m822n272n349m951m266l806l566k970k018j674k357k921k081k66
52382B85004J066J569K085K781K750J794J201J977L395M170M168M069M063L982
52368C24074M145M893N547M977L193J425N31J80k48p66j108j199j018n64j26r3
52352C43843k95p9P17J450J602J461J531J862K352L167M285N096N099M713M792
52337C81596N423N983O280O992Q639J0724J2252J2926J3366J4223J5456J6619
52325E10479J7583J8606J9722K0504K0644K0484K0535K0686K0343J9334J8167
$$ plain form
52314 727087 744404 761156 777533 793885 810517 827171 843161 858140 872378 886115 899064
52303 899064 910783 921211 930506 938627 945444 951095 955857 959699 962278 963297 962526 959481 953588 944926
52289 944926 934561 923842 913460 903416 893766 885006 877641 871676 866754 862693 859728 858314 858889
52276 858889 861842 867427 875533 885586 896839 908840 921623 935431 950208 965305 979771 993071
52264 993071 1005529 1017929 1030654 1043343 1055440 1066840 1077851 1088695 1099306 1109517 1119170 1128012
52252 1128012 1135741 1142257 1147680 1151948 1154543 1154755 1152215 1146949 1138964 1128048 1114207 1098221 1081481
52239 1081481 1065153 1049604 1034644 1020034 1005589 991083 976551 962660 950299 939655 930034
52228 930034 920756 911891 903890 896863 890646 885305 881069 877879 875463 873845 873286 873644 874239 874644 875300
$$ packed form
52314G27087J7317J6752J6377J6352J6632J6654J5990J4979J4238J3737J2949
52303H99064J1719J0428R295Q121O817N651M762L842K579J019p71l045n893q662
52289I44926j0365j0719j0382j0044r650q760p365n965m922m061k965j414N75
52276H58889K953N585Q106J0053J1253J2001J2783J3808J4777J5097J4466J3300
52264I93071J2458J2400J2725J2689J2097J1400J1011J0844J0611J0211R653Q842
52252A128012P729O516N423M268K595K12k540n266p985j0916j3841j5986j6740
52239A081481j6328j5549j4960j4610j4445j4506j4532j3891j2361j0644r621
52228I30034r278q865q001p027o217n341m236l190k416j618n59L58N95M05O56
$$ plain form
52213 875300 877071 880301 884527 889000 893328 897732 902742 908512 914331 919014 921986 923869 925822 928456
52199 928456 931597 934933 938522 942613 947340 952735 958795 965253 971478 976859 981308 985139 988509 991239
52185 991239 993158 994242 994220 992395 988225 981966 974375 965955 956914 947733 939121 931225 923453 915483 908032
52170 908032 902206 898343 895978 894722 894595 895537 897163 899180 901707 905010 909159 913993 919134 923956 927827
52155 927827 930541 932331 933425 933795 933431 932606 931757 931331 931757 933255 935504 937850 940086 942767 946426 950688
52139 950688 954562 957601 960439 964109 969100 975232 982272 990384 999963 1011233 1024235 1039159 1056329
52126 1056329 1075738 1096858 1119237 1143122 1169076 1197001 1225976 1255153 1284386 1313738 1342743
52115 1342743 1370479 1396119 1419137 1439240 1456509 1471502 1484800 1496376 1505584 1511707 1514409 1513881
$$ packed form
52213H75300J771L230M226M473M328M404N010N770N819M683K972J883J953K634
52199I28456L141L336L589M091M727N395O060O458O225N381M449L831L370K730
52185I91239J919J084k2j825m170o259p591q420r041r181q612p896p772p970p451
52170I08032n826l863k365j256j27R42J626K017K527L303M149M834N141M822L871
52155I27827K714J790J094L70l64q25q49m26M26J498K249K346K236K681L659M262
52139I50688L874L039K838L670M991O132P040Q112R579J1270J3002J4924J7170
52126A056329J9409K1120K2379K3885K5954K7925K8975K9177K9233K9352K9005
52115A342743K7736K5640K3018K0103J7269J4993J3298J1576R208O123K702n28
$$ plain form
52103 1513881 1510915 1506737 1502267 1497461 1491663 1484618 1476805 1468617 1459563 1448571 1434979 1419060 1401701
52090 1401701 1383719 1365359 1346358 1326593 1306742 1288118 1271693 1257461 1244986 1234387 1226427
52079 1226427 1221692 1219982 1220609 1223000 1226984 1232759 1240749 1251243 1263879 1277632 1291639 1305963 1321276
52066 1321276 1337735 1354464 1370282 1384726 1398175 1411117 1423563 1435181 1445799 1455556 1464523 1472264
52054 1472264 1477966 1481135 1482048 1481267 1478763 1473836 1465993 1455507 1442805 1427631 1409309 1387790 1364000
$$ packed form
52103A513881k966m178m470m806n798p045p813q188r054j0992j3592j5919j7359
52090A401701j7982j8360j9001j9765j9851j8624j6425j4232j2475j0599p960
52079A226427m735j710O27K391L984N775P990J0494J2636J3753J4007J4324J5313
52066A321276J6459J6729J5818J4444J3449J2942J2446J1618J0618R757Q967P741
52054A472264N702L169R13p81k504m927p843j0486j2702j5174j8322k1519k3790
$$ [...]
##END NTUPLES=NMR SPECTRUM
##END=
