##TITLE=AC1609_PANGN13339_8316979_mCgYCGTRdA
##JCAMPDX= 6.0         $$ Bruker NMR JCAMP-DX V2.0
##DATA TYPE= NMR SPECTRUM
##DATA CLASS= NTUPLES
##ORIGIN= BRUKER
##OWNER= Administrator
$$ 1.72 TOPSPIN		Version 2.1
$$ 2013-11-10 00:46:34.869 -0800  Administrator@X
$$ Compression mode = diff/dup
##.OBSERVE FREQUENCY= 400.02188249412
##.OBSERVE NUCLEUS= ^1H
##.ACQUISITION MODE= SIMULTANEOUS (DQD)
##.ACQUISITION SCHEME= undefined
##.AVERAGES= 8
##.DIGITISER RES= 22
##SPECTROMETER/DATA SYSTEM= spect
##.PULSE SEQUENCE= zg30
##.SOLVENT NAME= COFFEE_meoh
##.SHIFT REFERENCE= INTERNAL, COFFEE_meoh, 1, 14.98509
##AUDIT TRAIL= $$ (NUMBER, WHEN, WHO, WHERE, PROCESS, VERSION, WHAT)
$$ ##TITLE= Audit trail, TOPSPIN		Version 2.1
$$ ##JCAMPDX= 5.01
$$ ##ORIGIN= Bruker BioSpin GmbH
$$ ##OWNER= Administrator
$$ $$ E:\/data/COFFEE/nmr/AC1609_PANGN13339_8316979_mCgYCGTRdA/10/pdata/1/auditp.txt
$$ ##AUDIT TRAIL=  $$ (NUMBER, WHEN, WHO, WHERE, PROCESS, VERSION, WHAT)
(   1,<2013-11-10 00:46:28.059 -0800>,<Administrator>,<X>,<go>,<TOPSPIN 2.1>,
      <created by zg
	started at 2013-11-10 00:45:21.805 -0800,
	POWCHK enabled, PULCHK disabled,
       configuration hash MD5:
       C8 4E 4E 5D D3 5C D8 9E 9F 52 82 E0 59 8A DE 15
       data hash MD5: 64K
       BE A0 97 E2 73 DC 4B C9 AD 24 85 3C 5E 56 13 EE>)
(   2,<2013-11-10 00:46:31.026 -0800>,<Administrator>,<X>,<proc1d>,<TOPSPIN 2.1>,
      <Start of raw data processing
       efp LB = 0 FT_mod = 6 PKNL = 1 PHC0 = 0 PHC1 = 0 SI = 32K 
       data hash MD5: 32K
       EF DC A9 63 0D E4 AB F6 9F 77 B9 DE 72 AA 8D 79>)
(   3,<2013-11-10 00:46:31.354 -0800>,<Administrator>,<X>,<proc1d>,<TOPSPIN 2.1>,
      <pk PHC0 = 90.71411 PHC1 = 0 
       data hash MD5: 32K
       F3 73 68 D2 E3 5B 53 55 F1 5D D8 C1 98 D3 7D 3A>)
(   4,<2013-11-10 00:46:31.448 -0800>,<Administrator>,<X>,<proc1d>,<TOPSPIN 2.1>,
      <abs ABSG = 1 
       data hash MD5: 32K
       56 3D 56 69 93 8F B9 42 1E FE 24 D1 90 6B 6D 94>)
(   5,<2013-11-10 00:46:31.541 -0800>,<Administrator>,<X>,<proc1d>,<TOPSPIN 2.1>,
      <abs ABSG = 2 
       data hash MD5: 32K
       80 EE ED 3F 04 6D 45 E9 2B 38 99 A7 7C CB 01 1B>)
(   6,<2013-11-10 00:46:31.619 -0800>,<Administrator>,<X>,<proc1d>,<TOPSPIN 2.1>,
      <abs ABSG = 3 
       data hash MD5: 32K
       64 A7 DA 3F 8C 85 3F 4C 9D 6C FA 89 60 29 82 27>)
(   7,<2013-11-10 00:46:31.682 -0800>,<Administrator>,<X>,<proc1d>,<TOPSPIN 2.1>,
      <abs ABSG = 4 
       data hash MD5: 32K
       BE 54 67 0E CF CC CB 3C A5 07 0A 96 0A 61 CA 7C>)
(   8,<2013-11-10 00:46:31.744 -0800>,<Administrator>,<X>,<proc1d>,<TOPSPIN 2.1>,
      <abs ABSG = 5 
       data hash MD5: 32K
       6C DD 50 C5 92 6E C2 70 63 BA 22 0B CF A0 AF 94>)
$$ ##END=
$$ 
$$ $$ hash MD5
$$ $$ D3 83 5B DB DF D5 03 E0 92 F4 AB 9D 2F 82 C8 39
##$RELAX= 
##$RELAX= 
##$RELAX= 
##$RELAX= 
##$RELAX= 
##$RELAX= 
##$RELAX= 
$$ Bruker specific parameters
$$ --------------------------
##$DU= <E:\>
##$EXPNO= 10
##$NAME= <AC1609_PANGN13339_8316979_mCgYCGTRdA>
$$ [...]
##$TP= (0..7)
150 150 150 150 150 150 150 150
##$TP07= 0
##$TPNAME0= <>
##$TPNAME1= <>
##$TPNAME2= <>
##$TPNAME3= <>
##$TPNAME4= <>
##$TPNAME5= <>
##$TPNAME6= <>
##$TPNAME7= <>
##$TPOAL= (0..7)
0.5 0.5 0.5 0.5 0.5 0.5 0.5 0.5
##$TPOFFS= (0..7)
0 0 0 0 0 0 0 0
##$TUNHIN= 0
##$TUNHOUT= 0
##$TUNXOUT= 0
##$USERA1= <user>
##$USERA2= <user>
##$USERA3= <user>
##$USERA4= <user>
##$USERA5= <user>
##$V9= 5
##$VALIST= <valist>
##$VCLIST= <CCCCCCCCCCCCCCC>
##$VD= 0
##$VDLIST= <DDDDDDDDDDDDDDD>
##$VPLIST= <PPPPPPPPPPPPPPP>
##$VTLIST= <TTTTTTTTTTTTTTT>
##$WBST= 1024
##$WBSW= 4
##$XGAIN= (0..3)
0 0 0 0
##$XL= 0
##$YL= 0
##$YMAX_a= 640126
##$YMIN_a= -551303
##$ZGOPTNS= <>
##$ZL1= 120
##$ZL2= 120
##$ZL3= 120
##$ZL4= 120
##$ABSF1= 14.98509
##$ABSF2= -5.573092
##$ABSG= 5
##$ABSL= 3
##$ALPHA= 0
##$AQORDER= 0
##$ASSFAC= 0
##$ASSFACI= 0
##$ASSFACX= 0
##$ASSWID= 0
##$AUNMP= <proc_prof1d_extract_pilot.lims>
##$AXLEFT= 0
##$AXNAME= <>
##$AXNUC= <1H>
##$AXRIGHT= 0
##$AXTYPE= 0
##$AXUNIT= <>
##$AZFE= 0.1
##$AZFW= 0.1
##$BCFW= 0
##$BC_mod= 0
##$BYTORDP= 0
##$COROFFS= 0
##$CY= 15
##$DATMOD= 1
##$DC= 0
##$DFILT= <>
##$DTYPP= 0
##$F1P= 0
##$F2P= 0
##$FCOR= 0.5
##$FTSIZE= 32768
##$FT_mod= 6
##$GAMMA= 0
##$GB= 0
##$INTBC= 1
##$INTSCL= 1
##$ISEN= 128
##$LB= 0
##$LEV0= 0
##$LPBIN= 0
##$MAXI= 10000
##$MC2= 0
##$MEAN= 0
##$ME_mod= 0
##$MI= 0
##$NCOEF= 0
##$NC_proc= -8
##$NLEV= 6
##$NOISF1= 0
##$NOISF2= 0
##$NSP= 0
##$NTH_PI= 0
##$NZP= 0
##$OFFSET= 14.98509
##$PC= 1
##$PHC0= 90.71411
##$PHC1= 0
##$PH_mod= 1
##$PKNL= yes
##$PPARMOD= 0
##$PPDIAG= 0
##$PPIPTYP= 0
##$PPMPNUM= 2147483647
##$PPRESOL= 1
##$PSCAL= 4
##$PSIGN= 0
##$PYNMP= <proc.py>
##$REVERSE= no
##$SF= 400.02
##$SI= 32768
##$SIGF1= 0
##$SIGF2= 0
##$SINO= 400
##$SIOLD= 32768
##$SPECTYP= <>
##$SREGLST= <1H.CDCl3>
##$SSB= 0
##$STSI= 32768
##$STSR= 0
##$SW_p= 8223.68421052631
##$SYMM= 0
##$S_DEV= 0
##$TDeff= 65536
##$TDoff= 0
##$TI= <>
##$TILT= no
##$TM1= 0
##$TM2= 0
##$TOPLEV= 0
##$USERP1= <user>
##$USERP2= <user>
##$USERP3= <user>
##$USERP4= <user>
##$USERP5= <user>
##$WDW= 1
##$XDIM= 32768
##$YMAX_p= 469602651
##$YMIN_p= -660115
##$CURPLOT= <Network HP LaserJet P1505>
##$CURPRIN= <$Network HP LaserJet P1505>
##$DFORMAT= <normdp>
##$LAYOUT= <+/1D_H.xwp>
##$LFORMAT= <normlp>
##$PFORMAT= <normpl>
##$SURQMSG= 1
$$ End of Bruker specific parameters
$$ ---------------------------------
##NTUPLES= NMR SPECTRUM
##VAR_NAME=  FREQUENCY,     SPECTRUM/REAL,   SPECTRUM/IMAG
##SYMBOL=    X,             R,               I
##VAR_TYPE=  INDEPENDENT,   DEPENDENT,       DEPENDENT
##VAR_FORM=  AFFN,          ASDF,            ASDF
##VAR_DIM=   32768,         32768,           32768
##UNITS=     HZ,            ARBITRARY UNITS, ARBITRARY UNITS
##FACTOR=    0.250966925370066, 1,           1
##FIRST=     8223.43324360094, -193138,      10396
##LAST=      0,             -9616,           -114152
##MIN=       0,             -660115,         0
##MAX=       8223.43324360094, 469602651,    0
$$ Real data points
##PAGE= N=1
##DATA TABLE= (X++(R..R)), XYDATA
$$ [...]
19557b6008H8692C5949a51568B75858D9345e4848m3148p3095j3183B6320G495
19545B88075j34915n7016c6717I3824R5240E5279K53090a06397d2906m7172A50706
19533f1821E0303l09J59850a00486j39645J06629L5301A54753c21404a08359N2744
19522e5615j66761B32217b9735j16397M9704j76827B7614d0783C03464m7820j00768
19511A54876J10848i2574j16737B12287a21016r894A44732a07824b1255A44069
19500a36552j7675K4843A73968b77257M6014H4129N0695a56827O4536j56617G2171
19488b37178a5521o3885b525a038q6793I6785K2511a52538j4038P3300a5612j25316
19476a40928b3841k45792i4927C1675j2064P8916C8917a95296p9747b1313j46616
$$ plain form
19557 -26008 88692 35949 -151568 275858 49345 -54848 -97996 -171091 -184274 26320 7495
19545 288075 153160 96144 -36717 93824 189064 55279 308369 -106397 -42906 -90078 150706
19533 -61821 50303 49994 209844 -100486 -240131 -133502 -98201 154753 -321404 -108359 -55615
19522 -55615 -222376 232217 -29735 -146132 -96428 -273255 27614 -40783 303464 255644 154876
19511 154876 265724 -92574 -209311 212287 -121016 -130910 144732 -107824 -21255 144069
19500 -136552 -154227 -129384 173968 -277257 -231243 84129 134824 -156827 -92291 -248908 72171
19488 -237178 -15521 -79406 -2525 -1038 -87831 96785 119296 -152538 -166576 -93276 -15612 -140928
19476 -140928 -23841 -269633 -94927 31675 19611 98527 38917 -195296 -275043 -21313 -167929
19465a67929g5944B32329b61239A15962k1538a40039A83101a03267B51208i2183
19454a17706q7954j45954E6307a90210A53992n5301n964b93720f4217p4093r307
19443a47617i678o1097e309A58041c86276A21373J64701b12547E6191L35460i14
19431b42836M700k4905O1740H3988M9719c80214H959b17865J03579G8525b34208
19419C7694K76908a16884l3204C54898A12682b59976N2537A37986b54188F940
19408G6786d52414A79780a49829A01148h926G140c42868J58372k03093B52252
19397d0427j77591e468G2611b75039A61218e4151p3200I2933F946a66087C5388
19385a67986f5302A05146a55342C5859b29272M5489L9416j4234B09376a97288
$$ plain form
19465 -167929 -75944 232329 -261239 115962 94424 -140039 183101 -103267 251208 -92183
19454 -117706 -205660 -351614 56307 -190210 153992 98691 92727 -293720 -64217 -138310 -147617
19443 -147617 -9678 -70775 -5309 158041 -386276 121373 286074 -212547 56191 391651 -914
19431 -242836 -238136 -263041 -201301 83988 133707 -380214 8959 -217865 -114286 78525 -234208
19419 37694 314602 -116884 -150088 354898 112682 -259976 -207439 137986 -254188 6940
19408 76786 -452414 179780 -149829 101148 -8926 7140 -342868 -184496 -387589 252252
19397 -40427 -218018 -5468 72611 -275039 161218 -54151 -127351 92933 6946 -166087 35388
19385 -167986 -65302 105146 -155342 35859 -229272 -183783 -144367 -158601 209376 -197288
19374C35597H6755O1826r529P0184a4705n3891j91043A24906L0426C8917b17965
19362a80203j2574D53123f0742j90361J13072j63585c7362j11947A96851b27606
19351B3718b26960R6790M2024m8824K9037K2142k20p1448K3760D1377a41959d0222
19338h9667D2131b95414J37816L9183B774c98829H0319a68173l040e3893L930
19327d9963A09911l8242J36241a57480q3807A83468a89713A4353a48838j10325
19317b59163J24799B9204c7656C9696a18796b4992A13248a77500B8859b82623
19306H1150J63992a46828A42617n8715a24680F999a52453F0933K07242A11191
19295I9396L8550f3275A22604a70380e6715F832J58935b29934I0493i8805o2871
$$ plain form
19374 335597 86755 148581 139052 209236 -14705 -68596 -259639 124906 155332 38917 -217965
19362 -180203 -192777 453123 -60742 -251103 -138031 -301616 -37362 -149309 196851 -227606
19351 23718 -226960 -130170 -88146 -136970 -107933 -85791 -86011 -157459 -133699 41377 -141959 -40222
19338 -89667 42131 -295414 -157598 -118415 2774 -398829 80319 -168173 -171213 -53893 -49963
19327 -49963 109911 71669 207910 -157480 -241287 183468 -189713 14353 -148838 -259163
19317 -259163 -134364 29204 -37656 39696 -118796 -24992 113248 -177500 28859 -282623
19306 81150 245142 -146828 142617 83902 -124680 6999 -152453 60933 268175 111191
19295 99396 137946 -63275 122604 -170380 -56715 6832 165767 -229934 90493 -98805 -161676
19284a61676J6949H7471b06322C6369O717a97008O8981b7591j45624B2065a13418
19272d03750a30246H062a00671k79100A76754b17650A15093a1693k40797I8483
19261a30466C6569c8806A24805J19071E0043M040b18956B034c34439f6294K9920
19250c6374p3411m8242R71K9120c5907j06931a2908l63697a42735G5654L35174
19239D10828c79789a51115i671I306g1838c2958B0385i0728j89459F4698Q2343
19228A47041b35652h517l66884b8695k06533F3640d41980I7067b63927D16023
19217a21969j305F5674e3141r0451L8983a5327j86089A0343b94930L0877g5047
19205A86190L181b57870J28718b5728D6100e268A73979d3045n8012f410l02964
$$ plain form
19284 -161676 -144727 87471 -206322 36369 43086 -197008 -128027 -27591 -173215 22065 -113418
19272 -403750 -130246 8062 -100671 -379771 176754 -217650 115093 -11693 -252490 98483
19261 -130466 36569 -38806 124805 243876 50043 54083 -218956 2034 -334439 -66294 -36374
19250 -36374 -109785 -158027 -157056 -127936 -35907 -142838 -12908 -376605 -142735 75654 410828
19239 410828 -379789 -151115 -9671 9306 -71838 -32958 20385 -90728 -280187 64698 147041
19228 147041 -235652 -8517 -375401 -28695 -235228 63640 -441980 97067 -263927 416023
19217 -121969 -123274 65674 -53141 -143592 -104609 -15327 -201416 10343 -294930 -264053 -75047
19205 186190 189371 -257870 -129152 -25728 46100 -5268 173979 -43045 -101057 -6410 -309374
19194c09374A26202A0409i4193a8074A72369J4380n1576B4367b31168a04277j40459
19183b44736B56305B2997b95543j02635J9297B52542b4058k3946k31913i7248
19172g5615H425J95295k8293C0183J24295c9243A16500a57451B8058d53615a47421
19160i0215j6569b9765k5470B58648H7974b54624D5288J50033h4391A33652a30249
19148a94534c5755A27834J04551a24062K0955o640B2722O0045l8468O0611a68444
19136A31388L3170k2831L72a25091D2759a16574j39181K3770h9795l06730A11409
19124b03922n3867K2264i2543j96435J38629P528f6555k14722a25790A81672Q2909
19113B64581j16473a62758C8685b3985p944c50B56359a43485A1321O0303c10829
$$ plain form
19194 -309374 126202 10409 -94193 -18074 172369 186749 135173 24367 -231168 -104277 -244736
19183 -244736 256305 22997 -295543 -398178 -378881 252542 -24058 -48004 -279917 -97248
19172 -75615 8425 203720 175427 30183 154478 -39243 116500 -157451 28058 -453615 -147421
19160 -90215 -106784 -29765 -55235 258648 87974 -254624 45288 195321 -84391 133652 -130249
19148 -194534 -35755 127834 232385 -124062 -103107 -109747 22722 82767 44299 104910 -168444
19136 131388 164558 141727 142099 -125091 42759 -116574 -255755 -231985 -89795 -396525 111409
19124 -203922 -257789 -235525 -92543 -288978 -150349 -142821 -66555 -281277 -125790 181672 264581
19113 264581 148108 -162758 38685 -23985 -31929 -350 256359 -143485 11321 71624 -310829
19101b7380n21248e1153k52659J07520j27136f0811j46300G2670P5787A1039R4534
19090A05573j477C7110k724c7793j38723A2205c76261c5662I5053c08827J37866
19079a70961A14174J02273C4735h4666l8273e185j03090l9558j25136l9096A44426
19067c25828a08685A16458d37679A44970J53732a08098M8418A47872K4587q3348
19057H9111D3090g9732N42A81566a43946c5777C39209d69920A06984l6057h6906
19045a28874d4122j17144f8081j76512B59991N8166H3417a75947O2749j38611
19035b51809d1843m935A18725J71731A04950L57965N4447A25737b37471A11296
19024B18556C5052K28896m6426a34436J7021k5046B51932d8945p1908A3170d7881
$$ plain form
19101 -27380 -548628 -51153 -303812 -196292 -323428 -60811 -207111 72670 148457 11039 105573
19090 105573 104096 37110 34386 -37793 -176516 12205 -376261 -35662 95053 -308827 -170961
19079 -170961 114174 216447 34735 -84666 -122939 -5185 -108275 -147833 -272969 -312065 144426
19067 -325828 -108685 116458 -437679 144970 298702 -108098 -59680 147872 172459 89111
19057 89111 43090 -79732 -79190 181566 -143946 -35777 339209 -469920 106984 70927 -86906
19045 -128874 -44122 -161266 -68081 -244593 259991 318157 83417 -175947 -113198 -251809
19035 -251809 -41843 -46778 118725 290456 104950 462915 517362 125737 -237471 111296
19024 218556 35052 263948 217522 -134436 -117415 -142461 251932 -48945 -120853 13170 -47881
19012a90567A51742a242j31409f2821j08477m342C61416a4436m85681a21003A73511
19000d038j30763m4298c213j75892e2545D8953a13531j69719A62360a34052A04079
18988g7142k28522A9099J0135a42307d0077E4582L5392g8448c0867A07820a30718
18976c4662j14441C6521c41406b3269A44211c33943L2526h8651A44438F0094J743
18965F1837a20899A09270M5393C0204C206L7875c7337D0919J00167i773p4224
18954h3997l6418D2217a62726D51163a69959C3920a45189f5771G0278a71804g8487
18942b14042a02745K2749j50262k900j72770J54495A05804B8836a67617n1842
18932b19459A98390a68732C0717b60522B32576a19269A96052e9008j5468l3893
$$ plain form
19012 -190567 151742 -1242 -132651 -62821 -171298 -175640 361416 -14436 -500117 -121003 173511
19000 -4038 -134801 -179099 -3213 -179105 -52545 48953 -113531 -283250 162360 -134052 104079
18988 -77142 -305664 19099 29234 -142307 -40077 54582 89974 -78448 -30867 107820 -130718
18976 -34662 -149103 36521 -341406 -23269 144211 -333943 -301417 -88651 144438 60094 61837
18965 61837 -120899 109270 154663 30204 3206 41081 -37337 40919 141086 -9773 -83997
18954 -83997 -120415 42217 -162726 451163 -169959 33920 -145189 -65771 70278 -171804 -78487
18942 -214042 -102745 -79996 -230258 -233158 -405928 -251433 105804 28836 -167617 -219459
18932 -219459 198390 -168732 30717 -260522 232576 -119269 196052 -59008 -74476 -108369
18922a08369p3914p3437G9365k7475K45112a81021C0699J10299C2965P8555b8879
18910b4216B42921b05273B90999a60228L1630j10221R5585m6283l6839a2059n2986
18899f5045j58299g52A29024a85621D5062M7194a66506F7251a69288j26001P5891
18888b19398A07434i0083b5491o5665A01975K9902b39342M4953e3447E9081J33462
18877A92543I6236b9475l4706K9892k24775A21036J5968r89a26554F7796b13034
18865c42927J24500B3917J93057q301e8808j64816k23387i754j89491A30191b59280
18853a05818A80284c87901a3598e785A74422F8186f5332L245D7141L8621N4757
18842A40519A1034J01774K9500b45561N9774K7641b7776A35384b53723a03789
$$ plain form
18922 -108369 -182283 -255720 79365 51890 297002 -181021 30699 140998 32965 111520 -28879
18910 -24216 242921 -205273 290999 -160228 -128598 -238819 -143234 -189517 -226356 -12059 -65045
18899 -65045 -223344 -752 129024 -185621 45062 92256 -166506 67251 -169288 -295289 -219398
18888 -219398 107434 -90083 -25491 -91156 101975 131877 -239342 -194389 -53447 59081 192543
18877 192543 96236 -29475 -64181 -34289 -259064 121036 137004 136015 -126554 67796 -213034
18865 -342927 -218427 23917 216974 208673 -58808 -223624 -447011 -9754 -199245 130191 -259280
18853 -105818 180284 -387901 -13598 -5785 174422 68186 -65332 -62087 47141 85762 140519
18842 140519 11034 112808 142308 -245561 -185787 -158146 -27776 135384 -253723 -103789
18831a17638L8051J9011A4163O3075i8034j772q8747O8954k87985J98622D3789
18819B37403I4807n125N9998i7618A2143c08730I9241L15476j26921l8599q5823
18808A63374O8875A3479n766N2205L03923e6627A5150g9892l45412a95667L2396
18797a63271A75530b58213B35925b19732j69238A40971A5875c35541J27812B07835
18786A22152l9787f8636E758M7211k2328b69875J18457O8128p2274B04931i8000
18774a04347j02122j34a01867b467E139c75370G3100h275m1575G8767l3072c16391
18761a89902b9656l14067P172J66901O0530F2955O2072a31481L7464k87903h1832
18749a39051m9221j47048A46124b478I76i0774j70030h6944A96370a27729b8779
$$ plain form
18831 -117638 -79587 -60576 14163 77238 -98034 -99806 -188553 -119599 -407584 -208962 43789
18819 237403 94807 89682 149680 -97618 12143 -308730 99241 414717 287796 249197 163374
18808 163374 232249 13479 7713 59918 363841 -56627 15150 -79892 -425304 -195667 -163271
18797 -163271 175530 -258213 235925 -219732 -388970 140971 15875 -335541 -207729 207835
18786 122152 82365 -68636 5758 52969 30641 -269875 -151418 -83290 -155564 204931 -98000
18774 -104347 -206469 -206603 -101867 -2467 5139 -375370 73100 -8275 -49850 78767 45695 -316391
18761 -189902 -29656 -343723 -336551 -169650 -109120 62955 125027 -131481 -94017 -381920 -81832
18749 -139051 -188272 -335320 146124 -2478 976 -90774 -260804 -86944 196370 -127729 -28779
18737c30980a46060a2194k56303J30966k1595O8682l52779a31621A47355c2634
18726A26366O9651a79738K6710j81290A17391k7283j9683d4696G1554a02737D0193
18714A52818i1791E6711N3717C8639a70135a7716j45532A50470a81270j14760
18704b96030B7184J48071a18355n2030b2102A01689a07055L726d731k84445J38616
18693a50560j81203R5440C6649n58c26758A53620E4967c90505J91038J3873k86586
18682d72180a11838I0369b14098N9091g6966A9522a74761b1762k46448i1444o0605
18671a52049k94232I9858L9864n7935a41373k35675A62703p6576P9055a09045
18660b40344C3588b94329A54063a07599k94897a93942h3971k15366d2138A02517
$$ plain form
18737 -330980 -146060 -12194 -268497 -137531 -159126 -90444 -443223 -131621 147355 -32634
18726 126366 196017 -179738 -153028 -334318 117391 90108 70425 -44696 71554 -102737 40193
18714 152818 -91791 56711 110428 38639 -170135 -17716 -163248 150470 -181270 -296030
18704 -296030 27184 175255 -118355 -170385 -22102 101689 -107055 -103329 -4731 -289176 -150560
18693 -150560 -331763 -236323 36649 36091 -326758 153620 54967 -390505 -199467 -185594 -472180
18682 -472180 -111838 90369 -214098 -155007 -76966 19522 -174761 -21762 -268210 -91444 -152049
18671 -152049 -446281 99858 139722 81787 -141373 -377048 162703 86127 165182 -109045
18660 -240344 33588 -294329 154063 -107599 -402496 -193942 -83971 -299337 -42138 102517
18649e2454E2157b40709H8818Q6886C5234e0001j57110b1605m362B34132m5204
18638A88928b41105A95780c99066a3191D5744b4962I019d1774h228n04268A10874
18626c0845G163J18811D7688a76607Q5410j02257A15453c4907n7343C09748g4187
18614b62222g8963c5275A23646c20750b0261j9872r4702j15935g640k86507C6263
18602a25007D4690f806A466b2632q8655A84227C0517a33244A31944D4706b80070
18590D0738N6976N169a43230m5778k8664h0897H1155J594i1605A07003i4149C1263
18577d383B4486a71735F5412a52057K7311B3200b509A55486f9801k89320a14286
18565B49679d88058G7041d3923B59080b16807E630b39724K28A3144J17323c29602
$$ plain form
18649 -52454 52157 -240709 88818 175704 35234 -50001 -207111 -21605 -25967 234132 188928
18638 188928 -241105 195780 -399066 -13191 45744 -24962 9019 -41774 -8228 -512496 110874
18626 -30845 7163 125974 47688 -176607 -91197 -193454 115453 -34907 -92250 309748 -74187
18614 -262222 -78963 -35275 123646 -320750 -20261 -40133 -134835 -250770 -7640 -294147 36263
18602 -125007 44690 -6806 1466 -22632 -111287 184227 30517 -133244 131944 44706 -280070
18590 40738 97714 102883 -143230 -189008 -217672 -80897 81155 82749 -91605 107003 -94149 31263
18577 -4383 24486 -171735 65412 -152057 -124746 23200 -2509 155486 -69801 -359121 -114286
18565 249679 -488058 77041 -43923 259080 -216807 5630 -239724 -239496 13144 130467 -329602
18553A2615a89873c3366E9187M4374k0582M1490c9509A17659N3971d9203C38465
18541C103a35956K4149o6365E4249i9676G9822b05744N057k8362g1192D4844G350
18528a85945P0565J8988H3002N1300a76263j67018j38114b32137b4176M672B34609
18516a03068C5496L147g5129B16346b22210D4860L9205i4988j783j54674A19960
18504a9538j33118j43990e9051k32757J25225j04274A09838b37806b9888j82067
18494b11955H1075c7760a414j53248j2961b4869l6764l5205A92079a00279j7029
18483a17308G3165B6114A1455b18197B69128a58808n9068M3959A163a45411f489
18471A2722b5106I1853A6399a7252p6961c5088p6538E8702a10524k0743M0784
$$ plain form
18553 12615 -189873 -33366 59187 103561 82979 124469 -39509 117659 171630 -49203 338465
18541 3103 -135956 -111807 -178172 54249 -99676 79822 -205744 -200687 -229049 -71192 44844 7350
18528 -185945 -115380 -96392 83002 134302 -176263 -343281 -481395 -232137 -24176 -19504 234609
18516 -103068 35496 38643 -75129 216346 -222210 44860 84065 -94988 -96771 -251445 119960
18504 -19538 -152656 -296646 -59051 -291808 -166583 -270857 109838 -237806 -29888 -211955
18494 -211955 81075 -37760 -1414 -154662 -167623 -24869 -61633 -96838 192079 -100279 -117308
18483 -117308 73165 26114 11455 -218197 269128 -158808 -217876 -173917 1163 -145411 -6489
18471 12722 -25106 91853 16399 -17252 -94213 -35088 -111626 58702 -110524 -131267 -90483
18460i0483O99k88508b7544G7414j4690g0274j25838A29522c21547J09363j27501
18449c39685i6047A66695O8228A1326J49282J00045F1232b45233M122B24542a81466
18437G3756c19960H3536c6592B16601a97881B1804a6332C9097c8014j07856I4806
18425b68543C2666c57672Q0371P9320C14895h4280A6478e9119E103P8499b87847
18413i0343j12844D88020A80399f6347q0359j2733A24793A3108f4041c1762A7681
18401B57048j23681c39495A27709a79829c9512j16343f2545H8217a07234B9357
18390A59063h5600k94619J62980j7882C45450D1187a10587a2205C8806d3560H8899
18378b07429j04337a19464A73310n4357L9324C5335I493a79943C7957f2352m3834
$$ plain form
18460 -90483 -89784 -378292 -27544 77414 62724 -70274 -196112 129522 -321547 -212184 -339685
18449 -339685 -96047 166695 234923 11326 160608 260653 61232 -245233 -241111 224542 -181466
18437 73756 -319960 83536 -36592 216601 -197881 21804 -16332 39097 -38014 -145870 94806
18425 -268543 32666 -357672 -277301 -197981 314895 -84280 16478 -59119 5103 83602 -287847
18413 -90343 -203187 488020 180399 -66347 -146706 -159439 124793 13108 -64041 -31762 17681
18401 257048 133367 -339495 127709 -179829 -39512 -155855 -62545 88217 -107234 29357
18390 159063 -85600 -380219 -217239 -235121 345450 41187 -110587 -12205 38806 -43560 88899
18378 -207429 -311766 -119464 173310 118953 158277 35335 9493 -179943 37957 -62352 -106186
18367a06186C3646K52400h4581p3510A53482d46439h4369K8612H5423N4838O6795
18356B07056a63898j30859A6813c97519D4427J49959D8394q4N1703o261R3884
18345A87636a42304B0307d55136a05837C53016b98863f2034C0408d0596k92810
18335c33406e0527j16034A68212b89431d0255k15731J19409p4720O2573J9325
18325a29399A89723i4453M6934B17818e4836j66047j17060B83342j1010g606A7220
18313A93214G6133b3278j99007F1412g0165J1393A96238d6900o4143d3294o0621
18302a03915q4282G1620d51189B22535c55277J56157H488J11010a6970O751H3672
18290b5006k1499q2256L9847j65909a13749q2861B61821e9284n5516E0515A4330
$$ plain form
18367 -106186 33646 286046 -84581 -158091 153482 -446439 -84369 -55757 85423 140261 207056
18356 207056 -163898 -294757 16813 -397519 44427 194386 48394 48310 100013 93752 187636
18345 187636 -142304 20307 -455136 -105837 353016 -298863 -62034 30408 -40596 -333406
18335 -333406 -50527 -166561 168212 -289431 -40255 -255986 -136577 -211297 -148724 -129399
18325 -129399 189723 -94453 -47519 217818 -54836 -220883 -337943 283342 272332 -7606 17220
18313 193214 76133 -23278 -222285 61412 -70165 -58772 196238 -46900 -111043 -43294 -103915
18302 -103915 -188197 71620 -451189 222535 -355277 -199120 8488 119498 -16970 -10219 83672
18290 -25006 -46505 -128761 -88914 -254823 -113749 -196610 261821 -59284 -114800 50515 14330
18278A2238K00147E4714d0508A7799a59058n5778A36844i9053D2514A20J34633
18267A34753c32094L458E8217K38331B3320P6931a30983C53096f1038k50470a12401
18255c15669E6814a94835b688D6684b59422R8090B53215a92113I0181g0020A08443
18243b23283P6371K8748q3382P2379B9367M5766b70608P8889E2450J36670d2176
18231c01479h1695A67696d94763A56407B9409L22722f7105j92850B54878A05384
18220b04795K6453D4653h2969A44984a24150j35608J13664r6394H6352J8901J18076
18209B23329b27197o6853h1673A91547b83302A13525a18176d0375l1472A35597
18198c22645D6682Q5324b09034b7855j15069j8048j1385M3813F194a84031A56187
$$ plain form
18278 12238 212385 54714 -40508 17799 -159058 -214836 136844 -99053 42514 120 134753
18267 134753 -332094 -328636 58217 296548 23320 100251 -130983 353096 -61038 -311508 -112401
18255 -315669 56814 -194835 -2688 46684 -259422 -161332 253215 -192113 90181 -70020 108443
18243 -223283 -146912 -118164 -201546 -129167 29367 75133 -270608 -191719 52450 189120 -42176
18231 -301479 -81695 167696 -494763 156407 29409 352131 -67105 -259955 254878 105384
18220 -204795 -178342 44653 -82969 144984 -124150 -259758 -146094 -242488 86352 105253 223329
18209 223329 -227197 -294050 -81673 191547 -283302 113525 -118176 -40375 -71847 135597
18198 -322645 46682 132006 -209034 -27855 -142924 -160972 -172357 -128544 6194 -184031 156187
18186a57291C3877b35522c4301f509k72163J30494a7209o767j37601d7922E95
18174D4481a96985C8299K5284g4977j72115B90488A10809h8096A16921c52385
18163a21634B84346a84771j05806J44131N7993B07003a68756o58k74664a9047
18152b53794B681J45677a7124I321b60595B32477d350H506N9862h7293B36722
18140A20299k8262a90426M3635L9237d318p3990j99869A74880b2247l51634a2487
18128B15665d3728D2954N3106a63122l03198b6564F9599B8159j90b57768C8751
18116I0542h9852b048A36497c78293I954a3585A13403D0315a84020N2080C66727
18104A46147a69324H455K86603A0143h0268q9079F1929j2078J94130A20538a03829
$$ plain form
18186 -157291 33877 -235522 -34301 -6509 -278672 -148178 -17209 -23976 -161577 -47922 595
18174 44481 -196985 38299 63583 -74977 -247092 290488 110809 -88096 116921 -352385
18163 -121634 284346 -184771 -290577 -146446 -88453 207003 -168756 -169414 -444078 -19047
18152 -253794 2681 148358 -17124 9321 -260595 232477 -4350 8506 68368 -87293 236722
18140 120299 92037 -190426 -146791 -107554 -4318 -78308 -278177 174880 -22247 -373881 -12487
18128 215665 -43728 42954 96060 -163122 -466320 -26564 69599 28159 27969 -257768 38751
18116 90542 -89852 -2048 136497 -378293 9954 -13585 113403 40315 -184020 -131940 366727
18104 146147 -169324 8455 295058 10143 -80268 -169347 61929 49851 243981 120538 -103829
18092a30636J2489E2993i9834F0459a80954A82667a05404A29943a34954N1916
18082h3038a5803k16404A80294F1480R0336b70351B49792a6404l3745A46243o9886
18071G6357n082a96541M4951M8199I0593k8869a26055b1589A41511b52562a19866
18059a68978B028a55795p0948A74063a66919d898o0417G2566a39620I6678B0341
18047h9029k01776j34733G9167a0163k02672A09244n10P5512i8192b2708q6992
18036a09700k21145k5790H5873a32004B5066e7115C70950i791D38805A40585N2271
18025A92856a80876A3076K54069h1275A39119P238C7405b49956K394E0438d33504
18013a4076p0950B11808c42511H4038h6338k43450a06773A94669H768a95961a5432
$$ plain form
18092 -130636 -118147 52993 -99834 60459 -180954 182667 -105404 129943 -134954 -83038
18082 -83038 -15803 -232207 180294 61480 151816 -270351 249792 -16404 -50149 146243 76357
18071 76357 71275 -196541 -151590 -103391 90593 61724 -126055 -21589 141511 -252562 -119866
18059 -168978 2028 -155795 -226743 174063 -166919 -4898 -65315 72566 -139620 96678 20341
18047 -89029 -290805 -425538 79167 -10163 -212835 109244 108734 184246 -98192 -22708 -109700
18036 -109700 -330845 -356635 85873 -132004 25066 -57115 370950 -9791 438805 140585 192856
18025 192856 -180876 13076 267145 -81275 139119 146357 37405 -249956 -247562 50438 -433504
18013 -14076 -85026 211808 -342511 84038 -86338 -329788 -106773 194669 8768 -195961 -15432
18001E9898a31920A21732k7473e9287A86332D2788A2720J91572P9408a26942B29653
17989F1706A2044M10494c48684R9837o5553D5095b9573m10338A49611c74985h9035
17977b33892G5916a97822e5023a526H0534a7182C27243A39285d3518H0276d7936
17965A14036L9841e2938j50961P2291j88628F5043b50653h5864o5221d797A92288
17953D7477b22678R3713p1672M5235j48018N0287g9089a0202k5136q0896n08619
17942f24853b55602C62102F3166a18100a2936A89617a7219j57805B48341a01126
17931b68767C18965E9732c47623C82084b23447h6252D2998J07206c24773i8866
17920c55282a68646k0592I0548J7610a88150g9672H4074c37664a21085c0685k51771
$$ plain form
18001 59898 -131920 121732 94259 -59287 186332 42788 12720 204292 283700 -126942 229653
17989 61706 12044 422538 -348684 -248847 -314400 45095 -29573 -439911 149611 -374985 -89035
17977 -233892 75916 -197822 -55023 -1526 80534 -17182 327243 139285 -43518 80276 -47936
17965 114036 153877 -52938 -203899 -131608 -320236 65043 -250653 -85864 -151085 -4797 192288
17953 47477 -222678 -128965 -200637 -155402 -303420 -253133 -79089 -10202 -35338 -116234 -624853
17942 -624853 -255602 362102 63166 -118100 -12936 189617 -17219 -175024 248341 -101126
17931 -268767 318965 59732 -347623 382084 -223447 -86252 42998 150204 -324773 -98866
17920 -355282 -168646 -189238 90548 108158 -188150 -79672 84074 -337664 -121085 -30685 -282456
17909b82456N1500A70929o8905I531M6335d4509j41451K7889P408O1463H8581
17897A60721g6867o616B08975G3848a10619R671j32028B30358Q4847C4393a85873
17885f695A21612a21346B77586a57038j05548F9908g7588F17255D9613Q4376b59184
17873b67251H8121a63523m4031A33727m6899a70871L0925K0404j78861E1319K59157
17862C10476E8148g1375j14360b686A00014b17218A67569G4858a30218G8645a1525
17850A96948H2063a37925j1424O6880A15539D6443a67241A10558J56345a59984
17839a5128C29866D5953c10751b0707o8426k64479J27691E4404N6232B4556M38364
17828D62920k04279c10948c8539i880B01044b40491P2408A25845c28504g7295
$$ plain form
17909 -282456 -230956 170929 102024 9531 55866 -44509 -185960 -158071 -150663 -89200 88581
17897 160721 -76867 -83483 208975 73848 -110619 -100948 -232976 230358 315205 34393 -185873
17885 -6695 121612 -121346 277586 -157038 -262586 69908 -77588 617255 49613 133989 -259184
17873 -267251 88121 -163523 -207554 133727 86828 -170871 -139946 -119542 -298403 51319 310476
17862 310476 58148 -71375 -185735 -2686 100014 -217218 167569 74858 -130218 78645 -11525
17850 196948 82063 -137925 -149349 -82469 115539 46443 -167241 110558 266903 -159984
17839 -15128 329866 45953 -310751 -20707 -89133 -353612 -225921 54404 110636 24556 462920
17828 462920 258641 -310948 -38539 -9880 201044 -240491 -168083 125845 -328504 -77295
17817C11390A47635a38230j63667C14438q7237a622j87527j11202a37302C29557
17806F7014D212a81031D6639i3831A43802N4567A1470b05513K9805C99174c88338
17794B70555b25082D19915A03075G911L8576c8068o6008m8856L4788j31177a11056
17782C8401j1519c17317C1487M6271g1240A37319b53520A12598j3766l0405a01071
17770c38811i5358j65468A90667E6500B1617J38933G6504J19581R1457d0979r3991
17759a34970A99457a10784a5685A31454n1136J9309a73221B03598n3947A3710
17748A18176c442q6366A50416b21928C18866A03206a9050B93985A01600M4451
17738A46051B1682M3462b00937B77010A28877L1296A2210d8271a7562k38401E2476
$$ plain form
17817 311390 147635 -138230 -301897 314438 227201 -1622 -189149 -300351 -137302 329557
17806 67014 4212 -181031 46639 -93831 143802 198369 11470 -205513 -175708 399174 -388338
17794 270555 -225082 419915 103075 7911 46487 -38068 -104076 -152932 -118144 -249321 -111056
17782 38401 26882 -317317 31487 77758 -71240 137319 -253520 112598 98832 68427 -101071
17770 -338811 -95358 -260826 190667 56500 21617 160550 76504 196085 287542 -40979 -134970
17759 -134970 199457 -110784 -15685 131454 80318 99627 -173221 203598 149651 13710
17748 118176 -3442 -89808 150416 -221928 318866 103206 -19050 293985 101600 146051
17738 146051 21682 65144 -200937 277010 128877 160173 12210 -48271 -17562 -255963 52476
17726D1814Q3418a47792F9889c05614J11140j11206a38731D7007J38073I0078
17715G05J27036R3131a9374M305j52120b6023E5720K433K29954a90102E6586J07046
17703A63632p3671a87025A03813n1338h2803m9058J0524C04212j5999F3911J7899
17692H1810d6828B34397r8336a85155B8302K84489H539J9972J37810o5282O19
17681A01658b52422R6169C16314j21084h9463L670A81257i745D9052g6178E3231
17669b08450o3873A70103b11870c8531B12304b15619D5350a64329j41051I7513
17658a03626B96319a29662B3632a18649j54883j45519d8443a8930R238B08020
17647A33919c07607J32443f6124b3993C59198d3567A70197E8743R7773Q3306a52461
$$ plain form
17726 41814 125232 -147792 69889 -305614 -194474 -305680 -138731 47007 185080 90078
17715 705 127741 220872 -19374 -15069 -167189 -26023 55720 58153 288107 -190102 56586 163632
17703 163632 89961 -187025 103813 52475 -82803 -131861 -121337 304212 288213 63911 81810
17692 81810 -46828 234397 136061 -185155 28302 312791 8539 28511 166321 101039 101658
17681 101658 -252422 -156253 316314 195230 -89463 -85793 181257 -9745 49052 -76178 53231
17669 -208450 -272323 170103 -211870 -38531 212304 -215619 45350 -164329 -305380 97513
17658 -103626 296319 -129662 23632 -118649 -273532 -419051 -48443 -18930 -9692 208020
17647 133919 -307607 -175164 -66124 -23993 359198 -43567 170197 58743 156516 239822 -152461
17635a19858d751j00698A87841a58736e5185j56650c7205A71615o8280a33316
17624a27426B08113b04224N7405A0084b01505i8319E9181K4455L31919a73469
17613B1661a05512c817A57168D3109D806a97479l0981e8141D6138J6965K1723
17602H4826O918b67191a14478E3820J40066a95059L8702E73359A16486A8770K31387
17591B50157c50789J42452d362D02813b1316A964K2497a30574F2531b15905C9747
17579d6859j54760A87167a19591A09315K79572A20915K48909J33606A60525d51319
17568h1149A90959f1210A62248J32093c28567A3973a42835c5045B91561O3944
17558C55505b01338C2319a19074A14373B9511p745h7661a2130k63288a16755A20659
$$ plain form
17635 -119858 -4751 -105449 187841 -158736 -55185 -211835 -37205 171615 103335 -133316
17624 -127426 208113 -204224 -146819 10084 -201505 -98319 59181 83636 415555 -173469
17613 21661 -105512 -3817 157168 43109 4806 -197479 -228460 -58141 46138 63103 84826
17602 84826 91744 -267191 -114478 53820 193886 -195059 -156357 573359 116486 18770 250157
17591 250157 -350789 -208337 -4362 402813 -21316 1964 24461 -130574 62531 -215905 39747
17579 -46859 -201619 187167 -119591 109315 388887 120915 369824 503430 160525 -451319
17568 -81149 190959 -61210 162248 294341 -328567 13973 -142835 -35045 291561 355505
17558 355505 -201338 32319 -119074 114373 29511 21766 -87661 -12130 -275418 -116755 120659
17546h4171D6292L05950J06228c05089a00762G1950J6869l889h9547j17178P9812
17535a26913A6541a18506Q308E576N9309O2318N0457b7366A11913D2503J2847
17524E5350P2451C0447J87919J45875j4839a11047A09413c6192p9881C69823c74438
17512a31330Q274J1150d5285n2044B25893J14855k2386b55526A7952m480b86648
17500B12111I6054A8505J77789i3748D67762k19712A23114c4220F6998P1556E8873
17488D20691l6685i5060B75328p1243d905k83611a08221A60913D33J63594o8861
17477I5166J74571K6620a90135C31510a51383K592B12258B3179J68822C5847K55695
17466B91542b9957B04240f240B39461M7100e5066A07496P4531J04415M652A02931
$$ plain form
17546 -84171 46292 352242 458470 -305089 -100762 71950 88819 84930 -89547 -206725 -126913
17535 -126913 16541 -118506 -110198 5576 64885 127203 177660 -27366 111913 42503 55350
17524 55350 127801 30447 218366 364241 349402 -111047 109413 -36192 -116073 369823 -374438
17512 -131330 -123056 -111906 -45285 -97329 225893 340748 318362 -255526 17952 13472 -286648
17500 212111 96054 18505 196294 -93748 467762 248050 123114 -34220 66998 138554 58873
17488 420691 384006 -95060 275328 204085 -4905 -288516 -108221 160913 433 164027 95166
17477 95166 269737 296357 -190135 331510 -151383 -148791 212258 23179 192001 35847 291542
17466 291542 -29957 204240 -6240 239461 286561 -55066 107496 182027 286442 291094 102931
17454c8630H5805a63291C59840j48782K31183J27112A64893G2678a53840A06306
17443B06180n4250O3366m0500b8193A52137F6826P571K53215K16073E3606a33350
17431A39967K45284i0733A67752J90782A30388R9417m8614Q950a00244A79324
17420a3577F16554k58486j35963B8212J54654O8260K78691A20674e0388J0839
17410c9549D59475H8819K11730d717B80788A34308K6312K7387e5751E48983j23775
17399D25208q187n9667m4045C1633o593J49533Q7729M7712c9531H2856M4496f2543
17386B7294K2878c3110B56972B2046L4114a26743E541P8188P3242c42890I3913
17374B92358l8671A12889J45162m2736I7393J12144J26648A64327e4698j08439
$$ plain form
17454 -38630 85805 -163291 359840 211058 442241 569353 164893 72678 -153840 106306
17443 206180 151930 215296 174796 -28193 152137 66826 74397 327612 543685 53606 -133350
17431 139967 385251 -90733 167752 358534 130388 229805 181191 190141 -100244 179324
17420 -13577 616554 358068 222105 28212 182866 251126 529817 120674 -50388 -39549
17410 -39549 459475 88819 300549 -4717 280788 134308 160620 188007 -55751 548983 425208
17399 425208 417021 357354 313309 31633 25040 174573 262302 310014 -39531 82856 127352 -62543
17386 27294 50172 -33110 256972 22046 56160 -126743 5541 83729 156971 -342890 93913
17374 292358 253687 112889 258051 215315 97393 209537 336185 164327 -54698 -163137
17364a63137A59793b35162J05456E10497e7747I3494A1676K13298G8449l5347
17354D3102J70161g3623O855C8710J13788m1455a9772C58323j26672A2768K12577
17343B25345a47017B94510F5944a72497A66791n6058b7122C04742F735a43088
17332I7467A1079J67886o6338Q2102b67030e5466C52181B0705a9455A26557b19704
17320A24708j0493J16221Q1954g4108q759C40543A45481m4639N8718R0984C2054
17308B20122a96996C87275n6395A13932m8890f9505G147L24306N5564A12203J55270
17297B67473J09547E1522i507B48758o2719O5325j01431B0853b5788j85773K530
17286b09031B94362a75815A21048M3876J21714p0204k038m5736a23784B65813
$$ plain form
17364 -163137 159793 -235162 -129706 510497 -57747 93494 11676 224974 78449 43102
17354 43102 213263 -73623 -66768 38710 152498 111043 -19772 358323 231651 12768 225345
17343 225345 -147017 294510 65944 -172497 166791 110733 -27122 304742 6735 -143088
17332 97467 11079 178965 112627 194729 -267030 -55466 352181 20705 -19455 126557 -219704
17320 124708 114215 230436 312390 -74108 -82867 340543 145481 100842 159560 250544 32054
17308 220122 -196996 387275 330880 113932 65042 -69505 7147 331453 387017 112203 267473
17297 267473 377020 51522 -9507 248758 186039 251364 149933 20853 -25788 -211561 -209031
17286 -209031 294362 -175815 121048 164924 286638 216434 214396 168660 -123784 265813
17275A68843E2874F742N07086a26710A94538G2778L61758F1936a02865B18082
17264B56868Q5588l8739J1852E3359K22433M8084B6743J43469L68412A69376A5809
17252B24052K4813R2258J7865j66942o6626J0393L9626q5595m1016a54395E6406
17240B12109B9346a21523E5742f9128e474j39500A83242a8799B06914J28755A25677
17228a34141F7946f3106J0839C37730d8508C50183j25997e6986H9196l0045M63090
17217E22241r7963B04196J58286K15328A53564J78965j00221q8944E184L70765
17207C75949k0012G7671J45470b9479a2240B26666k8031p3166Q7353J01918k0437
17196B94303q8755b0261B60220j8077l7285E6382K9012P0924L88451l7452j42865
$$ plain form
17275 168843 52874 6742 513828 -126710 194538 72778 434536 61936 -102865 218082
17264 256868 342456 303717 315569 53359 275792 323876 26743 170212 538624 169376 15809
17252 224052 248865 341123 358988 192046 125420 135813 175439 89844 48828 -154395 56406
17240 212109 29346 -121523 55742 -69128 -5474 -144974 183242 -18799 206914 335669 125677
17228 -134141 67946 -63106 -52267 337730 -48508 350183 224186 -56986 89196 59151 522241
17217 522241 424278 204196 362482 577810 153564 332529 232308 143364 5184 375949
17207 375949 355937 77671 223141 -29479 -12240 226666 198635 125469 212822 314740 294303
17196 294303 205548 -20261 260220 242143 204858 56382 85394 156318 544769 507317 364452
17185C64452A51189O8176o3976Q589L20059J6941A86036G0484J10448J16336A22759
17173D57407B4684N2330c9936A11828J73588K41804B30086J98365K7559B24221
17162D64860A96258K52104n5522K9358J0875C8325M39512j88013n4845j4539N9478
17151B79918M03839G1297J62525J37670m8643G0886J93660g9043B52415F6889
17140B35550L81892A95116K64326D1636O20690A10621J1794P6895L54899k42152
17130C12057L05591G0791Q9660M85552B65482B5829A994M09369B2447P08802B87862
17118B82940R8101a80626A97438K58914n2220P3966j01495L6658F2189K26225
17108B88414K89313A12270J79576J17656A00289O25180k46173j68379k0829J42848
$$ plain form
17185 364452 151189 219365 155389 163978 484037 500978 186036 70484 180932 297268 122759
17173 457407 24684 77014 -39936 111828 285416 527220 230086 428451 456010 224221
17162 464860 196258 448362 392840 422198 433073 38325 477837 289824 234979 220440 279918
17151 279918 683757 71297 233822 371492 322849 70886 264546 -79043 252415 66889
17140 235550 617442 195116 459442 41636 662326 110621 122415 199310 554209 312057
17130 312057 617648 70791 160451 646003 265482 25829 1994 411363 22447 731249 287862
17118 282940 381041 -180626 197438 456352 404132 478098 376603 413261 62189 288414
17108 288414 577727 112270 291846 409502 100289 725469 479296 310917 290088 432936
17098D32936p6341j29920J778R5779J37064E0470K23283K38984K01752k14389
17088E00100j08389J25375A75717J48762N7660r2421K97567A27034J57989j5526
17078B69497K6720K76663A88417N6934m9520K92794j69601Q509R054K50649j14579
17067D72657m4072N21040D65100K9649j49833J33081B11631J92266K60968j75615
17057D89250P376L6025k28508J69738j18843J54015J31889r3418k29872q692M32884
17046G41844C44562R7290R5532L3360N5755l01244N34044l52379k3709K07660
17036F90871B78062L26680k38758M6403K48859j0047O235j82276j3276K48675
17026G10557j18245L1537C1789O20334q5735m6315J98405j59657Q1681p8464K16083
$$ plain form
17098 432936 356595 226675 228453 324232 461296 50470 273753 512737 714489 500100
17088 500100 391711 517086 175717 324479 382139 289718 587285 127034 285023 269497
17078 269497 296217 572880 188417 245351 195831 488625 319024 327533 336587 587236 472657
17067 472657 428585 949625 465100 494749 344916 477997 211631 403897 664865 489250
17057 489250 496626 532651 304143 473881 355038 509053 640942 547524 317652 308960 741844
17046 741844 344562 441852 537384 570744 626499 325255 859299 506920 483211 690871
17036 690871 278062 604742 365984 412387 661246 651199 657434 475158 461882 710557
17026 710557 592312 623849 31789 652123 566388 520073 718478 558821 640502 562038 778121
17015G78121K80294k44809k48903j47239j6009M25556l11507n8504p1612R4073
17005D79461J30954r2282K49016j06123L19389l51660n659M50139p3670k43259
16995G56306k52622K47569j05097L55590k25347j42331J10885J46417k29683J17991
16985G79678j82407K12786l64251M06347k10262K33456l7145K28147k70208N3205
16975H49346k52899J62387J93440J1290K02591n38371l6632K91193j83053p7075
16965F22217K68685q0967n406j49650L56402j91985J33747J505j76789K73826
16955A051585j40470j92026K38845p6973N41518j87811l66082K95180k73248J54184
16945A044702K51774n04319K61740M1231j40845j53857K80924J51616j81380J56796
$$ plain form
17015 778121 1058415 813606 564703 417464 401455 827011 515504 457000 385388 479461
17005 479461 610415 518133 767149 661026 980415 628755 623096 1073235 999565 756306
16995 756306 503684 751253 646156 1001746 776399 634068 744953 891370 661687 779678
16985 779678 597271 810057 445806 852153 641891 875347 838202 1066349 796141 849346
16975 849346 596447 758834 952274 963564 1166155 627784 591152 882345 699292 622217
16965 622217 890902 809935 804529 654879 1011281 819296 953043 954548 777759 1051585
16955 1051585 911115 719089 957934 880961 1422479 1234668 868586 1163766 890518 1044702
16945 1044702 1296476 792157 1053897 1095128 954283 800426 1081350 1232966 1051586 1208382
16935A208382j03670j25399k9039n5949K63648l7685K21431n9401J07502m23544
16925I66276K76764J25063l50797K99442l4802N6470J84996J15553l78393j31008
16915A129564k9925J57669J55250m7904J26247K10903m51618L66735j56422J46887
16905A607386j82961J00634j1523j52088k35354N59206L8230j703J5013j22454
16895A614386M3106k4933J8835L01184J6077j69471n9434J14210m24046M26174
16885A856088K78378l54504j55155L32240J47408l31901K31547k1256L38629m92166
16875A829308L16178M2836J92360l00881J16345J07706J19426K87519j55019k32063
16865B323715k8024K51595J86105k41042Q1298K22903j22935K15354j38703O4034
$$ plain form
16935 1208382 1104712 979313 950274 894325 1157973 1120288 1341719 1282318 1389820 966276
16925 966276 1243040 1368103 1017306 1316748 1281946 1338416 1523412 1638965 1260572 1129564
16915 1129564 1099639 1257308 1412558 1364654 1490901 1701804 1250186 1616921 1460499 1607386
16905 1607386 1424425 1525059 1513536 1361448 1126094 1685300 1723530 1721827 1736840 1614386
16895 1614386 1657492 1632559 1651394 1952578 1968655 1799184 1739750 1853960 1429914 1856088
16885 1856088 2134466 1779962 1624807 1957047 2104455 1772554 2004101 1982845 2321474 1829308
16875 1829308 2145486 2188322 2380682 2079801 2196146 2303852 2423278 2710797 2555778 2323715
16865 2323715 2295691 2547286 2733391 2492349 2573647 2796550 2673615 2888969 2750266 2814300
16855B814300j29940K6458J97847J74507L6271k13691J18860J68394n8406n3121
16845C081479K40359l20798K41041r1835M96638j08772j92621m0311N67004j32707
16835C739477L27026K6222k93477J07313j48840M76389n3849j48088K19912m0350
16825D211735M07167K58665j20697K32093j32524K36388q6454K54228o6921K62862
16815E456542R8143K14394J13855J77514O0672m22425P46430q2938K13861J57685
16805F733733j61256J02873K49697L83706p9851J72231K72105p9700M86481M2112
16795H122131J85224p5518K99599N69254J25297j864K39768J13022O01779K16284
16785A0394976L86614K26618L79343J85480Q81281m87R8864j21028O60428M48343
$$ plain form
16855 2814300 2684360 2710818 2908665 3083172 3119443 2905752 3024612 3193006 3134600 3081479
16845 3081479 3321838 3001040 3242081 3150246 3646884 3538112 3345491 3305180 3872184 3739477
16835 3739477 4066503 4092725 3799248 3906561 3757721 4234110 4180261 4032173 4252085 4211735
16825 4211735 4618902 4877567 4756870 4988963 4856439 5092827 5006373 5260601 5193680 5456542
16815 5456542 5554685 5769079 5882934 6060448 6121120 5698695 6445125 6362187 6576048 6733733
16805 6733733 6572477 6675350 6925047 7308753 7228902 7401133 7673238 7593538 8080019 8122131
16795 8122131 8307355 8231837 8531436 9100690 9225987 9224123 9463891 9576913 10178692 10394976
16785 10394976 10781590 11008208 11387551 11573031 12454312 12453825 12552689 12431661 13092089 13540432
16775A3540432Q97182k0730R47835P6554M07572O43763N92051N17166L97564P71129
16765A8770518N44607J019329M17425J185124O36268O34800J062243R05816J148145
16756B6324275R47721J185282J647185P75125J447568J356531J527833J321790
16748C6533310K286289J405868K017565K270147K464096K188980K608404K534895
16740E4309554L155170K878376L539402L417878M413184M111175M476895M698841
16732H5000475M950666N066114O226375N840865O375736O792652P115085P503259
16724A34871227P136386P219738Q028522O889396O907511O970904N192961M915798
16716A88132443L677213K930344J450609m6436q84116k683151l663202m330045
$$ plain form
16775 13540432 14437614 14416884 15364719 15441273 15848845 16492608 17084659 17601825 17999389 18770518
16765 18770518 19315125 20334454 20751879 21937003 22573271 23208071 24270314 25176130 26324275
16756 26324275 27271996 28457278 30104463 30879588 32327156 33683687 35211520 36533310
16748 36533310 38819599 40225467 42243032 44513179 46977275 49166255 51774659 54309554
16740 54309554 57464724 60343100 63882502 67300380 71713564 75824739 80301634 85000475
16732 85000475 89951141 95017255 101243630 107084495 113460231 120252883 127367968 134871227
16724 134871227 142007613 149227351 157255873 164145269 171052780 178023684 183216645 188132443
16716 188132443 191809656 194740000 196190609 196144173 195260057 192576906 188913704 184583659
16708A84583659n856808o149368p101330p335877p586357p700255p361687p207088
16700A28284889p358049o676462o943302o274393n865641n844524m953420n237047
16692G9132051m697358m031576l942726l440412l783105k845509l252919k945550
16684E0192896k299473k801124k136783j918470k080399j863456j856983j536333
16676C3699875j322463j437816j618529r85310j643427j196460p61634q28941
16668B3905295j178093n47524j030707p53502r07289p58208k69603j099778o20618
16659A6739973m77767n41864l98005o03868p8476j049065l34092k59802n15750
16650A2481284l84332k27096m95488j31770m05523n14085j16252k365m16376n58783
$$ plain form
16708 184583659 178726851 172577483 165476153 158140276 150553919 142853664 135491977 128284889
16700 128284889 120926840 114250378 107307076 101032683 95167042 89322518 84369098 79132051
16692 79132051 74434693 70403117 66460391 63019979 59236874 56391365 53138446 50192896
16684 50192896 47893423 45092299 42955516 41037046 38956647 37093191 35236208 33699875
16676 33699875 32377412 30939596 29321067 28335757 26692330 25495870 24734236 23905295
16668 23905295 22727202 22179678 21148971 20395469 19488180 18729972 18460369 17360591 16739973
16659 16739973 16262206 15720342 15322337 14718469 14639993 13590928 13256836 12997034 12481284
16650 12481284 12096952 11869856 11374368 11242598 10837075 10322990 10206738 10204373 9787997 9229214
16640I229214k9395j98057n71442K23357n12553J55289j94831l64885j15566l49497
16630G271634j65039j96919o1811k19615K4480m16656j48892n4720p5747n515
16620E951200o2940k75710K1279m81565r2787J81410N3123k90460l14488j23460
16610D565602j53001J57055k20363O566L9871j99979j19599K26095k73293j41468
16600C887486j21371L9428j47736j15242J5867K86793r36498K29009L01947j77951
16590C261732P1336j82061q437J20444k68577j58685k4026r1871j72381L18875
16580B866349k84132k83221J40208Q6354k0598K33946j59508k07233l7236P006
16570B341935K31313k87913J55303k05828m82509L12544L5202K62320j02070J37379
$$ plain form
16640 9229214 9199819 9001762 8430320 8653677 8141124 8296413 8101582 7736697 7621131 7271634
16630 7271634 7106595 6909676 6847865 6628250 6652730 6236074 6087182 6032462 5956715 5951200
16620 5951200 5888260 5612550 5633829 5152264 5059477 5240887 5294010 5003550 4689062 4565602
16610 4565602 4412601 4569656 4349293 4355859 4395730 4195751 4076152 4302247 4028954 3887486
16600 3887486 3766115 3805543 3657807 3542565 3558432 3845225 2908727 3137736 3439683 3261732
16590 3261732 3333068 3151007 3142570 3263014 2994437 2835752 2811726 2719855 2547474 2866349
16580 2866349 2582217 2298996 2439204 2525558 2504960 2738906 2579398 2372165 2334929 2341935
16570 2341935 2573248 2285335 2440638 2234810 1752301 2064845 2100047 2362367 2260297 2397676
16560B397676l37766l801j71852l0575J21393l47366N29353j26638j4854k05589
16550A809981n8815J59558k08188j27112J86640k09571K704J02512Q7004l62138
16540A382575k08734K86295L8001K48511k94566Q4158o5987O3475j28106j95397
16530A210225p4669J55346K68457p4202L06154l62396r8200k43815L29641N5683
16520A472224l11075M5424R443J15582j66847P3557Q5424k54969k4571K95627
16510A339819j64071l43320K41482j92870j36281L80443k89348J52340K6142m4319
16500I70017J2249m7572Q6239j33830K76325j59132j86919L04656m42720L09617
16490I88930j27390M5002J06891k91303K01461J74791k30198j30626L45362l97837
$$ plain form
16560 2397676 2059910 2056109 1884257 1853682 1975075 1627709 2157062 2030424 2015570 1809981
16550 1809981 1751166 1910724 1702536 1575424 1762064 1552493 1555197 1657709 1744713 1382575
16540 1382575 1173841 1460136 1498137 1746648 1452082 1536240 1470253 1533728 1405622 1210225
16530 1210225 1135556 1290902 1559359 1485157 1791311 1428915 1330715 1086900 1416541 1472224
16520 1472224 1161149 1206573 1216016 1331598 1164751 1238308 1323732 1068763 1044192 1339819
16510 1339819 1175748 832428 1073910 881040 744759 1125202 835854 988194 1014336 970017
16500 970017 982266 934694 1020933 887103 1163428 1004296 817377 1122033 679313 988930
16490 988930 861540 906542 1013433 722130 923591 1098382 868184 737558 1082920 685083
16480F85083m9467L60454j84975k53563J07668J41939K21053m81515M1313L69479
16470I57469m62208k6802N06139k23984k75290J58971L3902J45796J15248k60989
16460F68252C24619K63190j33865K94246k1409O4845l18018J70258l5704j46990
16450D61172K94607k22870J22898j73109m0859L06382k57990k6773J37606k61552
16440C39512K91048n8989l2017j29644M8082j10960K94309L6173k31161o3810
16430C82543J99905o7375r1554K88363k67548Q2076j71207J2244J34108k0217
16420D81338j4773m2225J60107q9745o8982j07144J45913j23620L72336B15073
16409B53312J15639L8602M0539L07047j29771k05359Q6790K60379B86379J38388
$$ plain form
16480 685083 635616 996070 811095 557532 665200 807139 1028192 546677 587990 957469
16470 957469 495261 468459 974598 750614 475324 634295 668197 813993 929241 668252
16460 668252 324619 587809 453944 748190 726781 791626 473608 643866 608162 461172
16450 461172 755779 532909 655807 482698 441839 748221 490231 463458 601064 339512
16440 339512 630560 571571 539554 409910 457992 347032 641341 677514 446353 382543
16430 382543 582448 515073 423519 711882 444334 526410 355203 367447 501555 481338
16420 481338 466565 424340 584447 494702 425720 318576 464489 340869 713205 215073
16409 253312 368951 407553 448092 755139 625368 420009 506799 767178 286379 424767
16399D24767Q6010j41543J86505M0164k39556j40750R6466L41597j91992j67079
16389B94589L0877J4064q9466m2222J35699J29340j04001g961B41365O9738J3542
16378C24645A17516c1317E75511A96892R8830p3496J35121l8882J75207A83914
16367A57493K2636K99995k39734J04896n0724C5245L14888i763F4169Q7162J52645
16356C03976A45796K56283j55982P8459M6229J74860g9307C84575j88447L98956
16346E95084j10008B16391I5954l0828K70143k4508j06290r9176J80651J52534
16336D38480A03798Q6618B6312L58401J76065A26722N2578l4479l3048M2810L54567
16325E09150n1389j98479R3230k0216g0959A19425J32344d9045B96190j8651K38490
$$ plain form
16399 424767 510777 369234 555739 595903 356347 215597 312063 653660 461668 294589
16389 294589 325466 339530 250064 207842 343541 472881 368880 -7961 241365 311103 324645
16378 324645 117516 -31317 575511 196892 295722 222226 357347 318465 493672 183914
16367 157493 180129 480124 240390 345286 294562 35245 350133 -9763 64169 151331 303976
16356 303976 145796 402079 246097 324556 370785 545645 -79307 384575 196128 595084
16346 595084 485076 216391 95954 65126 335269 310761 204471 105295 285946 438480
16336 438480 103798 190416 26312 384713 560778 126722 179300 144821 111773 154583 509150
16325 509150 457761 259282 352512 332296 -70959 119425 251769 -49045 296190 277539 516029
16314E16029k46627L1980b73599B49462D832K26931E3514O8899J22165e9264D68642
16302C67765j22979l3339D2112J96459c86207B31169O4036J38540A23294P2448
16292A95742a366G8367J10370k7785n6199i5207A68695J67652j918a64877A25218
16280C80913a10697A53984a41405D10684r4035H736P8629J18114C496M30306H9025
16268a8789l5948E4778k4787K18912l9911b1433k4684F0283A9753b5143k5789
16257e0932B52131f3168A30469k6273f3353A52403E1664d3925p5808I5026J06169
16246B01195I4383M8046R4215o6418E6046g8132A44220A311M61749A22643f0148
16234E3241N9491K24088g3868A50503Q0443O6194j43344M0277h4454D465K0427
$$ plain form
16314 516029 269402 301382 -273599 249462 4832 231763 53514 122413 244578 -59264 468642
16302 367765 244786 211447 42112 238571 -386207 231169 295205 433745 123294 195742
16292 195742 -1366 78367 188737 160952 104753 -95207 168695 336347 334429 -164877 125218
16280 380913 -110697 153984 -141405 410684 316649 8736 87365 205479 3496 433802 89025
16268 -18789 -54737 54778 29991 248903 208992 -21433 -46117 60283 19753 -25143 -50932
16257 -50932 252131 -63168 130469 104196 -63353 152403 51664 -43925 -119733 95026 201195
16246 201195 94383 142429 236644 170226 56046 -78132 144220 1311 463060 122643 -60148
16234 53241 112732 336820 -73868 150503 230946 297140 153796 194073 -84454 4465 24892
16223B4892a56416O80j95790B27526E05b05217f2180A53118K07970F1709J4822
16212G6531C7295L37855G2978K2838C7965R0295J11843a12498o9503A97374n0387
16201A46987d9445j42573A1609J10918d7462m757F2218a26702h454k27687g1870
16189c03140P7131f7794A43636j0606g7051B66240a27440A02627J84442A5588
16178D612R7016a7006b176D9433J71265j06482n3270K02683o6293n7289P7009
16167B17056c12285f4626j86451N1982g3209A56401J44403E8573P2643a9175A04071
16155A06417A1307N9987d08255c6033I8626M1127O836k3013g6839B26081a62326
16143C84057a19790M4374k29003F7882j0082J08920L0891n45E6943f3725D7215
$$ plain form
16223 24892 -156416 -155736 -351526 227526 505 -205217 -62180 153118 361088 61709 76531
16212 76531 37295 375150 72978 95816 37965 128260 240103 -112498 -182001 197374 146987
16201 146987 -49445 -192018 11609 122527 -47462 -52219 62218 -126702 -8454 -236141 -71870
16189 -303140 -226009 -67794 143636 133030 -77051 266240 -127440 102627 287069 15588
16178 4612 101628 -17006 -2176 49433 220698 114216 60946 263629 197336 140047 217056
16167 217056 -312285 -64626 -251077 -199095 -73209 156401 300804 58573 131216 -19175 104071
16155 106417 11307 71294 -408255 -36033 98626 139753 146589 123576 -76839 226081 -162326
16143 384057 -119790 -75416 -304419 67882 57800 166720 197611 197066 56943 -63725 47215
16131G9200a56347G711R454a40526e901k22273B76460a96119A11306J90384A2788
16119c2208j89817A64012a3386k28746A85981I2094a40505B48426I8062e1280
16108f0025A71149A7379M15633C6132c23685I0096M1414J59123n4770o5087q193
16097A62583D5826K1615i9756a3146A55364k5855M8386J01011b78226M9198H0794
16085I7262C973R7259a68131A38746f8794C2897h0440k62230B10454c1702A61531
16073a67074o2345E6411J44592a223o6227f993C4667N5253a37875d7550p9434
16062a26984d8436A28079j3078e840B92058B3815d08872C516J77563f8653A15138
16050B16370e4169n8324j55676A13296K27311d5708I7764b73992B8535d5469B24756
$$ plain form
16131 79200 -156347 7711 17165 -140526 -5901 -228174 276460 -196119 111306 301690 12788
16119 -32208 -222025 164012 -13386 -242132 185981 92094 -140505 248426 98062 -51280
16108 -60025 171149 17379 433012 36132 -323685 90096 131510 290633 235863 170776 162583
16097 162583 45826 67441 -99756 -13146 155364 129509 177895 278906 -278226 -229028 80794
16085 97262 3973 101232 -168131 138746 -68794 32897 -80440 -342670 210454 -31702 161531
16073 -167074 -229419 56411 201003 -1223 -67450 -6993 34667 89920 -137875 -47550 -126984
16062 -126984 -48436 128079 115001 -5840 292058 23815 -408872 3516 181079 -68653 115138
16050 216370 -54169 -112493 -268169 113296 340607 -45708 97764 -273992 28535 -45469 224756
16038A62065b74187M9636b0116C0393J74705j1597b06861M4565f9717r4738k83
16027a64738j66572J52664A47017o0768D0327J61760N0733b55140Q4205O7404
16017a03531B71797j35102n9952J1800b20737j45861A81445Q976h264B74857a43278
16005c5944j20484b364p9978B18426e6488r7746A06827b04211c7278G8823j230
15994G7593P207a75467h3037B95711a19143g127m7918j94846A84239C5183J62631
15983A97814q1122K00824j21499o2543J6399b94245B48643a0472k43868B4386
15972b65670J27141d1095o6462F7960L48219b4816G3066B4786b3253j63116C7997
15960d12458A29600c37024A60413D4165a04089l2D2146d1880H7889c1221A67473
$$ plain form
16038 162065 -274187 -224551 -20116 30393 205098 193501 -206861 -162296 -69717 -164455 -164738
16027 -164738 -331310 -178646 147017 86249 40327 202087 252820 -255140 -170935 -103531
16017 -103531 271797 136695 76743 88543 -220737 -366598 181445 190421 -8264 274857 -143278
16005 -35944 -156428 -2364 -82342 218426 -56488 -154234 106827 -204211 -37278 78823 77593
15994 77593 84800 -175467 -83037 295711 -119143 -7127 -55045 -249891 184239 35183 197814
15983 197814 116692 317516 196017 133474 149873 -294245 248643 -10472 -254340 24386
15972 -265670 -138529 -41095 -107557 67960 416179 -24816 73066 24786 -23253 -186369 37997
15960 -412458 129600 -337024 160413 44165 -104089 -104121 42146 -41880 87889 -31221 167473
15948c53110C0378g9508j64885P0481o2148p0602E1493b44816M7267A86089c65536
15936I0610K13523a00964E51503b930L12l12886f1155b9129k80676d5667j48213
15925a93880h8529P568j90723J35763r3610J05072e5125A00188m9813a17282l9448
15914a56730a9138B39706b0347k87635D67280b41896A35457a22960p7567j12602
15904c13129G8727C5898d5348A34339d08458a94360A14909b1259D5618k2330f8559
15892A15106b62716G39a05511p52j93361B60840c2487o8228B07027a11371A62562
15880C2072b33099e4396k57342c270A26888a15245E0222g3313B75910F0203K3491
15869H3694b76782a9668o2216L7741a2550j39244r8819c6326A13599b06901B3684
$$ plain form
15948 -353110 30378 -79508 -244393 -173912 -236060 -306662 51493 -244816 -197549 186089 -365536
15936 90610 304133 -100964 551503 -2930 -2618 -315504 -61155 -29129 -309805 -45667 -193880
15925 -193880 -88529 -80961 -271684 -135921 -229531 -124459 -55125 100188 50375 -117282 -156730
15914 -156730 -19138 239706 -20347 -307982 467280 -241896 135457 -122960 -200527 -313129
15904 -313129 78727 35898 -45348 134339 -408458 -194360 114909 -21259 45618 23288 -68559
15892 115106 -262716 739 -105511 -106263 -299624 260840 -32487 -100715 207027 -111371 162562
15880 32072 -233099 -54396 -311738 -3270 126888 -115245 50222 -73313 275910 60203 83694
15869 83694 -276782 -19668 -81884 -44143 -12550 -151794 -250613 -36326 113599 -206901 23684
15857A39662B5795O0889J76429f6073j93860b3005j9190k6675A95657a64137b7211
15845H7463c53026a60839P5536r9759h0602m2021q4254N0574i723j17403E5106
15833f5082k50002J50842A23584K25777a9256D8882L3185i8423M0652j23774A97011
15821d5761j85405B68286b90959g2633B34971a31965f2581G427d66496D8108a25847
15809A7477O8955c39750h1502A70754l8037a96473h3914l7350b1212A91337I018
15797a20694m9583F695J14308n3628J8718K29408j03180b34505D5625B144J6605
15786A8749J85947b11457A13876a25167A78792D4841a4433j46514e878m0327K1525
15775b4680A69419p3530h3765H663L28538b78220A1058b41508I2022c31416f9177
$$ plain form
15857 139662 25795 86684 263113 -66073 -259933 -23005 -42195 -68870 195657 -164137 -27211
15845 87463 -353026 -160839 -85303 -185062 -80602 -122623 -206877 -156303 -9723 -127126 55106
15833 -65082 -315084 -164242 123584 349361 -19256 48882 82067 -98423 -57771 -181545 197011
15821 -45761 -231166 268286 -290959 -72633 234971 -131965 -62581 7427 -466496 48108 -125847
15809 17477 86432 -339750 -81502 170754 132717 -196473 -83914 -121264 -21212 191337 9018
15797 -120694 -170277 6695 121003 67375 86093 315501 212321 -234505 45625 2144 18749
15786 18749 204696 -211457 113876 -125167 178792 44841 -14433 -160947 -5878 -46205 -24680
15775 -24680 169419 95889 -83765 8663 337201 -278220 11058 -241508 92022 -331416 -69177
15763A36823i22k92398O0787B77096b40014A67030a85888H2346b0100p5612A03683
15751a06127p187L830C29716A58824A8434g630G2911M1075J63475M4749b86055
15739e9632H4684Q024A4514a29047o3414I1340h7363k8924k45767J49213a0189
15727a02072J2768A96458p2520E703J45617c38242R4848f5352E4065e1516A9230
15715f6255D9898e60059E7626a90746h2407l77692A79130a245B90292a992j49417
15704a51409B92837c95735f8297k40136P5687F0180a16873I8394J39439a23954
15693h4459B54338a20422B34010G5931a39672B26597i4096j77287G3017J13419
15683A86436a28257c8801A8342a94616D5613b31082Q1163e2962K2584H6335b33007
$$ plain form
15763 136823 -922 -293320 -232533 277096 -240014 167030 -185888 82346 -20100 -95712 103683
15751 -106127 -113314 -109484 329716 158824 18434 -7630 72911 113986 277461 322210 -286055
15739 -59632 84684 92708 14514 -129047 -192461 91340 -87363 -116287 -362054 -212841 -10189
15727 -102072 -89304 196458 123938 5703 151320 -338242 -243394 -65352 54065 -51516 19230
15715 -66255 49898 -560059 57626 -190746 -82407 -460099 179130 -1245 290292 -1992 -151409
15704 -151409 292837 -395735 -68297 -308433 -232746 60180 -116873 98394 237833 -123954
15693 -84459 254338 -120422 234010 75931 -139672 226597 -94096 -271383 73017 186436
15683 186436 -128257 -38801 18342 -194616 45613 -231082 -149919 -52962 -30378 86335 -233007
15671b37832J7827g7869B42223q5546B0973a52478f6041j71552B7300a27424B08622
15659a94759i3524E6103J80122c03585j69830A6620J42802a7506r8260A25799
15648I253K7257A1291b82387G1281J636g0729k57618J34447A23369g2215A51600
15636A32919e5683j22933k7760D3485O1190a35653H4217a53818J2388j37957J05200
15625a74187c4985j64897B83487e0609d07j33588j28864G6676J46785A10171c2738
15613A57519D989a74709A66808p3457M58196a57269k41401a95740A19277e5275
15602f0900k72171c5241B9043a30149j77721F9044J10133a91129B05121b40324
15591D0420K75209c20055h9634j82076A40888m2154l0433B1488K10166A03751
$$ plain form
15671 -237832 -220005 -77869 242223 156677 20973 -152478 -66041 -237593 27300 -127424 208622
15659 -194759 -93524 56103 236225 -303585 -473415 16620 159422 -17506 -115766 125799
15648 9253 36510 11291 -282387 71281 72917 -70729 -328347 -193900 123369 -72215 151600
15636 132919 -55683 -178616 -206376 43485 104675 -135653 84217 -153818 -141430 -279387 -174187
15625 -174187 -34985 -199882 283487 -50609 -407 -133995 -262859 76676 223461 110171 -32738
15613 157519 4989 -174709 166808 93351 551547 -157269 -398670 -195740 119277 -55275
15602 -60900 -333071 -35241 29043 -130149 -307870 69044 179177 -191129 205121 -240324
15591 40420 315629 -320055 -89634 -271710 140888 98734 68301 21488 231654 103751
15580a5804B0057b74300A89677d21831A76988b60865C30666a29553k39108A29113
15569f2189A85086m1205a46057C6149J51121C7882j5339b48690d1922j31910h1250
15557b750j6903A28064D3148F237b14156A70212g9174B5337J03819C492a39286
15545A15185B2471c08522C68841i9600f271m5575j59906G0160j6688a41982M4017
15534i7965A54806o4829K9409E6928B6217J29826a95957i5905G472J66883G0232
15522B11105b69722A28869a2561A31511f6543n6694a6016j41072B37104A8536
15511F4006A5638K13856p1030c34395J23958g4798D6512E485Q2536c44029p312
15500c51341b061E280b92p492l99712A11270m5744b4022C5459K77058b00173A13971
$$ plain form
15580 -15804 20057 -274300 189677 -421831 176988 -260865 330666 -129553 -368661 129113
15569 -62189 185086 143881 -146057 36149 187270 37882 22543 -248690 -41922 -173832 -81250
15557 -2750 -19653 128064 43148 6237 -214156 170212 -79174 25337 129156 3492 -139286
15545 115185 22471 -308522 368841 -99600 -6271 -51846 -211752 70160 53472 -141982 -97965
15534 -97965 154806 89977 119386 56928 26217 156043 -195957 -95905 7472 174355 70232
15522 211105 -269722 128869 -12561 131511 -66543 -123237 -16016 -157088 237104 18536
15511 64006 15638 229494 158464 -334395 -210437 -74798 46512 5485 88021 -344029 -351341
15500 -351341 -2061 5280 -292 -7784 -407496 111270 65526 -24022 35459 312517 -200173 113971
15487a1943k29219e8319J8025A39351J8480b395j23626r4705A12501b9488I1662
15475C8359J83131a0007B9305a57193A68184e7983l39390A44807e9393o2682q0389
15464b02464R8240B03890r5630b35285C2127O0277l130M9727j1579B7409c56220
15452D095J44771a19049j15716B9715c4998o6089j31938a2084B26931c05441k42995
15441e48436I6588I310Q892e7621I6457O0480j3077e9056A66130E1726P877J9741
15429G9344i1857p5902j79363B1453K5014b48604l9363A37165b22389Q1302I60
15417a32701L2471B26950b17344A13562P0531c84366B86957b28089E404f3243
15406g4841H4204c13679E3466a86368B773Q8545P2569p8253a90524A18253d4179
$$ plain form
15487 -11943 -241162 -58319 -40294 139351 157831 -2395 -126021 -220726 112501 -29488 91662
15475 38359 221490 -10007 29305 -157193 168184 -57983 -397373 144807 -59393 -122075 -202464
15464 -202464 -104224 203890 108260 -235285 32127 92404 89274 139001 127422 27409 -356220
15452 4095 148866 -119049 -234765 29715 -34998 -101087 -233025 -12084 226931 -305441 -548436
15441 -548436 96588 9310 18202 -57621 96457 156937 143860 -59056 166130 51726 59603 79344
15429 79344 -91857 -167759 -347122 21453 46467 -248604 -287967 137165 -222389 -141087 960
15417 -132701 -100230 226950 -217344 113562 184093 -384366 286957 -228089 5404 -63243
15406 -74841 84204 -313679 53466 -186368 2773 91318 163887 85634 -190524 118253 -44179
15394a21707B32377K6768b17161A86589H4388a72586r7336L1342I6435e2839A88715
15382e6731o9008a0347A6268f3339B4430K04605e21901f8663n153H7385e377q2759
15370h8136A81087R9933B8530a00901M2273l5753A7645n050b12119C58070a89673
15358A36028o1873K39963b14995i6648L0988B0448J3165c6035k76346F5745f2849
15346A41194i5319q9324B52528L5872C3225O0834c00265I8130I37J53891m1055
15335A13773b52684a373D8399J69524M9422f6904n7090j14321n6709F9519k4018
15324D5501b1750j54050n5801A41342i4671j2951I3007d98231C13178a07580N1651
15313e5929d825j26952G6983d3062B02610b18193k60768J93010I722J92716c2407
$$ plain form
15394 -121707 232377 259145 -217161 186589 84388 -172586 -269922 -238580 96435 -52839 188715
15382 -56731 -125739 -10347 16268 -63339 24430 229035 -521901 -68663 -73816 87385 -5377 -88136
15370 -88136 181087 281020 28530 -100901 -58628 -94381 17645 12595 -212119 358070 -189673
15358 136028 74155 314118 -214995 -96648 -65660 20448 33613 -36035 -312381 65745 -62849
15346 141194 -95319 -184643 252528 288400 33225 94059 -300265 98130 937 154828 113773
15335 113773 -252684 -1373 48399 217923 267345 -66904 -123994 -238315 -295024 69519 45501
15324 45501 -21750 -175800 -231601 141342 -94671 -107622 93007 -498231 313178 -107580 -55929
15313 -55929 -4825 -131777 76983 -43062 202610 -218193 -478961 -285951 9722 202438 -32407
15301C8047R8337J10219p5219r355K3735c3946j72251k15555a14935b8442I7227
15289b61174e0096A6894b57926A75042H7247M1618a30858D9552C42a9740j57527
15278a77267D7828J79804Q1086A15503b02023L1771C5512K3857J77509j14099
15268A22779R2416e5479A93584C2562a07493d1617G274d6334A77370i8379E26055
15256d5301j41573D03113a01740A55632o5522L14924J76455j3420J028396l09421
15246A287044m15291J95215m37453l09822b18359E7708L03211A54695P9325a80857
15235b58347I605b03871A73821P3800f7518C87587c4787B7136K7710O1851b78062
15223A60592c8831C27240B2108f8014A09060b09692B05181p9535n1269J18780
$$ plain form
15301 38047 136384 246603 171384 162029 185764 -33946 -206197 -421752 -114935 -28442 97227
15289 -261174 -50096 16894 -257926 175042 87247 128865 -130858 49552 342 -19740 -177267
15278 -177267 47828 227632 308718 115503 -202023 -170252 35512 59369 236878 122779
15268 122779 215195 -55479 193584 32562 -107493 -41617 7274 -46334 177370 -98379 526055
15256 -45301 -186874 403113 -101740 155632 90110 405034 581489 568069 1596465 1287044
15246 1287044 871753 1066968 629515 319693 -218359 57708 360919 154695 234020 -180857
15235 -258347 9605 -203871 173821 247621 -67518 387587 -34787 27136 54846 116697 -278062
15223 160592 -38831 327240 22108 -68014 109060 -209692 205181 125646 74377 193157
15213A93157a27364J9362B15091I67i4475I5698D7826g7874k45778g5090C47477
15201D1265J74074G020d0590B50234m5713a59798a6888A31147d6929A55449O3305
15190B18754f6875E8177N6111Q2166D1393J82748E7472a8787B12756Q3498j7831
15179B78423o0474D0964j04J01587f2953B05737R22J19915j22387F2744O0110
15168A22854P6423q8237j1126j3141d795A38716M9856b4314A08596J28590n4396
15157A82790O7935A12422C3597J04234c66131A6299a67745n5853A92880p8566
15147A14314b41891A20057k7274i4192C01991h5513G7896b76410G1338K02552
15137B73890g2546j21545b2424B41020a77313C540L13251Q7394j78999g6229A2793
$$ plain form
15213 193157 -127364 -108002 215091 967 -94475 95698 47826 -77874 -323652 -75090 347477
15201 41265 215339 7020 -40590 250234 204521 -159798 -16888 131147 -46929 155449 218754
15190 218754 -66875 58177 114288 196454 41393 224141 57472 -18787 212756 296254 278423
15179 278423 217949 40964 40860 142447 -62953 205737 206659 326574 204187 62744 122854
15168 122854 199277 111040 99914 86773 -4795 138716 188572 -24314 108596 237186 182790
15157 182790 250725 112422 33597 137831 -366131 16299 -167745 -223598 192880 114314
15147 114314 -241891 120057 92783 -94192 301991 -85513 77896 -276410 71338 273890
15137 273890 -72546 -194091 -22424 241020 -177313 3540 316791 404185 225186 -76229 12793
15125c1073A33633n2741a11065a0299A91980R0296D3566J832J25601J019H0026
15113A31803K68113A22630m8680g0046q843B42962K9980B5596L1538K00158B1355
15101d8817m4901G6087J05163l3029c11566c017I7042O2199K7133h3382c8260
15089C2727O7123P3228M7203F8387c3729C3724J94036K76763a11367A56162E5996
15077C81870j33256O6115l4180I6208g4504o0684B68345L5147a17001D27629A0957
15065a82647C16339a42963E2732J25616K90983F7434J90830A13602L4163k1079
15055A26686d3500B48702d5431I1549a61713A30685o4896k2405N25636B26538
15044a38626C07258i082E5736M27739C3326J55967D824J53570j1302K22348j36043
$$ plain form
15125 -31073 133633 80892 -111065 -10299 191980 282276 43566 45398 170999 172018 80026
15113 131803 399916 122630 73950 -70046 -78889 242962 272942 25596 57134 257292 21355
15101 -48817 -93718 76087 181250 148221 -311566 -3017 97042 159241 186374 -83382 -38260
15089 32727 99850 173078 220281 68387 -33729 33724 227760 504523 -111367 156162 55996
15077 381870 248614 314729 280549 96208 -74504 -135188 268345 303492 -117001 427629 10957
15065 -182647 316339 -142963 52732 178348 469331 67434 258264 113602 147765 126686
15055 126686 -43500 248702 -45431 91549 -161713 130685 65789 43384 569020 226538
15044 -138626 307258 -9082 55736 483475 33326 189293 4824 158394 147092 369440 233397
15033B33397F5299J32355D7486N57105i4605b3891E6110J23082l4942L2121K95171
15022D71542E9829l956a18380B57284a65157e778A14642q763i17F9642M6898i8293
15009b6595B90129l4500j09600J08177C7288M54620F428J77048N0242o8682F0491
14997B71920n9603H4446J68561O9224j20121K51426d591A95617J39967j65958
14987A69626L31284A37496D9894L47386A61540E2286J51385j6939a17402A40698
14976A00607J1493P3891J90704K62289j75246k25668N6529j33045L79845B57074
14965C56430L0132n3299O8091f7633C57706E629K457L7620Q8084K54661o4854
14954C23597L1563P3168j79393m3993C9210N41142a6919E63147B11791J02429
$$ plain form
15033 233397 65299 197654 47486 604591 -94605 -23891 56110 179192 144250 176371 471542
15022 471542 59829 55873 -118380 257284 -165157 -5778 114642 105879 -917 69642 116540 -98293
15009 -26595 290129 255629 146029 254206 37288 491908 6428 183476 233718 165036 60491
14997 271920 212317 84446 253007 322231 202110 453536 -4591 195617 335584 169626
14987 169626 500910 137496 49894 397280 161540 52286 203671 186732 -117402 140698
14976 100607 112100 185991 376695 638984 463738 238070 294599 161554 541399 257074
14965 356430 386562 333263 401354 -67633 357706 5629 8086 45706 133790 388451 323597
14954 323597 355160 428328 248935 204942 39210 580352 -16919 563147 211791 314220
14944C14220A2802K31971r4482K03420L0212K19632j84405k02227M5819j2995
14934B49747M3884O5179M510j53467C9138M4362K43144A44223K81726A31213M93262
14923F24475j49279A08477h0161C49847n6100j06342G1650M00254q7583j40504
14913B43817J37226N396A57465J85589m3982K04477k33947A1160O277K76296k2515
14902B71218L88961k63974q4088A15637K49805A06937M4022J55734I8572K99961
14892C98533J18880j2416N0677A32957K35800P5249J5006A80604J52250j21356
14882B11498n5080M66201C01797J42112B06140K61240N3273I8250J90481J4798
14872C03529c2488D40828K3973j29040O6355j47724J38526K3163K4106c5438F10354
$$ plain form
14944 314220 12802 244773 150291 353711 383923 603555 419150 216923 262742 249747
14934 249747 293631 358810 363320 209853 39138 83500 326644 144223 425949 131213 624475
14923 624475 475196 108477 -80161 349847 293747 187405 71650 471904 384321 243817
14913 243817 381043 386439 157465 343054 299072 503549 269602 11160 17437 293733 271218
14902 271218 660179 396205 312117 115637 365442 106937 150959 306693 98572 398533
14892 398533 517413 504997 555674 132957 368757 444006 459012 180604 332854 211498
14882 211498 156418 622619 301797 443909 206140 467380 520653 98250 288731 303529
14872 303529 -32488 440828 464801 335761 402116 254392 392918 416081 440187 -35438 610354
14860A07506L29278B09815J10326Q9099r352Q4728j94414K90608B59460O2597
14850C22057L07388A76371O5737K76692J52657l30970J91206r8534K85938B06330
14839D20489J66724k22916j5668J28920j60387J41633j96069J77034R1186j04308
14829D26638j09199n5993K55790r0262m0054M04459j5532n2635l55038A05044
14818D32540J41734j13438j82040k5493M68054C35759R1828j80512J60105J3156
14808D20336J3425L40086k90823A33464M19115J65673k31328K4044K41645j96935
14798E55678k17929Q3996j81114J24968R7899I4225M54531r9061j02499L45369
14788F92565l46028J51257M3526m8303J42234j38806J68657B84014L27492J0737
$$ plain form
14860 107506 436784 209815 320141 409240 399888 484616 290202 580810 259460 322057
14850 322057 629445 176371 242108 518800 671457 340487 531693 433159 719097 206330
14839 420489 587213 364297 348629 477549 317162 458795 262726 439760 530946 426638
14829 426638 317439 261446 517236 426974 386920 791379 775847 723212 368174 105044
14818 432540 574274 460836 278796 253303 721357 335759 427587 247075 407180 420336
14808 420336 433761 773847 483024 133464 552579 718252 486924 510968 752613 555678
14798 555678 337749 421745 240631 365599 463498 94225 548756 449695 347196 692565
14788 692565 346537 497794 541320 493017 635251 496445 665102 284014 611506 622243
14778F22243A38031O12604j74189K07253k8816K25843m47928N7371m7267J33424
14768F76326q0011K25992k41048k10700R2639J40069j05146p5162K95754q353
14758G10360L0335J51134j59661j51522M91376n25132J00234m5947B58559N93623
14748H52182l74228K25325j30044L447k06849J81865O75359m58619k25600L37501
14738H80339j69126q8611J3487k21881N45703k41687M2764L1439q3882l28953
14728C79592M06567P8851j64597L54815k08608p0579l4578r7287J72218l60963
14718D55431M78895l23782K06041J69515L4756j61123j12278l6624j65350N0445
14708E95926J37645R1821J00253j29465J6811o8258J72638O6812J59089m71675
$$ plain form
14778 622243 138031 750635 576446 783699 754883 980726 532798 590169 542902 676326
14768 676326 596315 822307 581259 370559 463198 603267 498121 422959 718713 710360
14758 710360 740695 891829 732168 580646 1072022 546890 647124 601177 258559 852182
14748 852182 477954 703279 573235 576682 369833 551698 1227057 768438 542838 880339
14738 880339 711213 622602 636089 414208 959911 718224 760988 792427 708545 379592
14728 379592 786159 865010 700413 1055228 846620 776041 741463 644176 816394 455431
14718 455431 934326 610544 816585 986100 1020856 859733 747455 710831 545481 595926
14708 595926 733571 825392 925645 796180 812991 744733 917371 984183 1143272 671597
14698F71597J45086k39685K73970j2438k10178M59763l59896K85420k34971o3768
14688G14900K47010j77300K49734j85635L91950k77397j2210l674l00880N35807
14678A182305n05603M60630j36901k85118K81966N2980j19525j1524L92392k13089
14668A098513j08378k4566J81005k44056l6006K48936j6784k70535J78217J01436
14658A107782J67152m9589j56197m5711n5079Q0892q2105J13903j47268K70126
14648A203906k97516J3534L89840n37607R894M97114j89348P1757j4436J48862
14638A296000j09183L8885J65954J21121k52552K71157m28420J88080p0739J03398
14628A323701o0981m2890m5198K68648L48603l58926j30050J69931k54437K07231
$$ plain form
14698 671597 816683 576998 850968 838530 628352 1088115 728219 1013639 778668 714900
14688 714900 961910 784610 1034344 848709 1240659 963262 951052 947378 646498 1182305
14678 1182305 676702 1137332 1000431 715313 997279 1050259 930734 919210 1311602 1098513
14668 1098513 990135 965569 1146574 902518 866512 1115448 1098664 828129 1006346 1107782
14658 1107782 1274934 1225345 1069148 1023437 968358 1049250 967145 1081048 933780 1203906
14648 1203906 906390 919924 1309764 772157 782051 1279165 1089817 1161574 1147138 1296000
14638 1296000 1186817 1225702 1391656 1512777 1260225 1531382 1102962 1291042 1220303 1323701
14628 1323701 1262720 1219830 1174632 1443280 1791883 1432957 1302907 1472838 1218401 1425632
14618A425632J83221K38950l38874j66498N7193K60743J48059m19181j41348K90853
14608A538750M2344J92463l53534M62226l55683J806K03493q9594J41487j03059
14598A680699n18870M60916k6989l83078N26541j88749Q6666K08328k9184k13071
14588A603209J96776L6388j23664J45263l298m3102J86924k4609J00031J7645
14578B091563k9835K58785l02199k33395K76914K30614r5661k16841J74038K57271
14568B411254o7089k76806O2268J3112L21189L990o0469p6374L51755J06948p0801
14557B718977J1381M87815N910J13694J61291O97218O34212J047175J654947N837091
14547A3369711J1565312J6508703k87103j9422206H678499m173520j319349q84268
$$ plain form
14618 1425632 1608853 1847803 1508929 1342431 1399624 1660367 1808426 1389245 1247897 1538750
14608 1538750 1581094 1773557 1420023 1882249 1526566 1528372 1731865 1642271 1783758 1680699
14598 1680699 1161829 1622745 1595756 1212678 1739219 1550470 1637136 1845464 1816280 1603209
14588 1603209 1799985 1836373 1712709 1857972 1854674 1811572 1998496 1973887 2073918 2091563
14578 2091563 2061728 2320513 2018314 1784919 2061833 2292447 2196786 1979945 2153983 2411254
14568 2411254 2344165 2067359 2129627 2142739 2463928 2467918 2407449 2331075 2682830 2789778 2718977
14557 2718977 2730358 3218173 3224083 3337777 3499068 4196286 4830498 5877673 7532620 13369711
14547 13369711 24935023 41443726 41156623 21734417 8678499 4504979 3185630 2301362
14539B301362k88699L9602r2029k54383L02358K62517o0684k0708O5344j48923
14529B105757K8221P0607L36551l86638L06533p1041J9830k2554M5341J9108K78770
14518B730485k19314j45155J88964q3818M36982q3763j58685l3723K52093Q2024
14508B966090j86978L4066M0399J60990m25849O24303k66162l9898K4903K10356
14498C142220K35503o9558m14813J61009K72797k4206p6558L21635k75358K66635
14488C539306M4803o7383J98971L42938n16841J17567N17323l99126q1223K09248
14478C905583l344j45214J62104J35619N37167m55777R8409k12150K89006K89558
14468D600961j90185J34055K574o1523J41266k10603J58230M32006P5342m11695
$$ plain form
14539 2301362 2012663 2052265 1960236 1705853 2008211 2270728 2210044 2189336 2254680 2105757
14529 2105757 2133978 2204585 2541136 2154498 2461031 2389990 2409820 2387266 2432607 2451715 2730485
14518 2730485 2511171 2366016 2554980 2471162 2908144 2824381 2665696 2631973 2884066 2966090
14508 2966090 2779112 2813178 2853577 3014567 2588718 3213021 2946859 2906961 2931864 3142220
14498 3142220 3377723 3308165 2893352 3054361 3327158 3302952 3226394 3548029 3272671 3539306
14488 3539306 3584109 3516726 3715697 4058635 3541794 3659361 4176684 3777558 3696335 3905583
14478 3905583 3902239 3757025 3919129 4054748 4591915 4136138 4234547 4022397 4311403 4600961
14468 4600961 4410776 4544831 4547405 4485882 4627148 4416545 4574775 5006781 5082123 4670428
14458D670428L95708q8988M2918L1664J93636M6690J16639L8455K27056k87788
14448E386418j31260O00501j32396k03543M83807k15254J85086J71161N00384
14439F644904m34508l6220J90012o345k8478K35148j53350L55027m9084K49445
14429F966551K15432r8808p3617m9949M56025J23157J13568l4833J23031L2727
14419G773284L20370J05349K08061K10586J16612K25542k02097K96208j21763
14410H932152J77341K10183K21964P126M90701l548K7372P3720J72988K76355
14400A0586354L7332J39385N04093Q5831J24897R9228J08260N06924N8848K79970
14390A2531122j53354O51515L16312O469K68582J47671L17147L43868R4615N23597
$$ plain form
14458 4670428 5066136 4977148 5020066 5051730 5245366 5292056 5408695 5447150 5674206 5386418
14448 5386418 5255158 5855659 5723263 5519720 6003527 5788273 5973359 6144520 6644904
14439 6644904 6210396 6174176 6364188 6357843 6329365 6564513 6411163 6766190 6717106 6966551
14429 6966551 7181983 7083175 7009558 6959609 7415634 7538791 7652359 7617526 7740557 7773284
14419 7773284 8093654 8199003 8407064 8617650 8734262 8959804 8757707 9053915 8932152
14410 8932152 9109493 9319676 9541640 9548766 10039467 10035919 10063291 10137011 10309999 10586354
14400 10586354 10623686 10763071 11267164 11352995 11477892 11577120 11685380 12192304 12251152 12531122
14390 12531122 12377768 13029283 13345595 13352064 13620646 13768317 14085464 14429332 14523947 15047544
14380A5047544j20188M94001L83448o9361O31528L95164O3976N95244l8318L67921
14370A7750959N68896J54935L38381O15089L36115L54959M66405M06654P37412
14361B1729805K19298N81537L00125P28627P88743J25350P07123N10370J052689
14352B6743667J92682Q89504P15543N00785R32621O69197R62971Q23390P07932
14343C3138292J052625Q79315O40658J162992J431222P70825J020073R71294J546220
14334D2613516J329864J117264J434548J294815J567296J394895J741487J858833
14326E4352518J826105J961308J864329J898899K220019K554972K021757K546815
14318G1246722K519819L017853K889418L210544L207459L474879L514025M009026
$$ plain form
14380 15047544 14927356 15421357 15804805 15735444 16366972 16762136 16826112 17421356 17383038 17750959
14370 17750959 18319855 18474790 18813171 19428260 19764375 20119334 20585739 20992393 21729805
14361 21729805 21949103 22530640 22830765 23559392 24348135 24473485 25180608 25690978 26743667
14352 26743667 26936349 27825853 28541396 29042181 29974802 30643999 31606970 32430360 33138292
14343 33138292 34190917 35070232 35710890 36873882 38305104 39075929 40096002 41067296 42613516
14334 42613516 43943380 45060644 46495192 47790007 49357303 50752198 52493685 54352518
14326 54352518 56178623 58139931 60004260 61903159 64123178 66678150 68699907 71246722
14318 71246722 73766541 76784394 79673812 82884356 86091815 89566694 93080719 97089745
14310I7089745L760189M418044M501587N019545N019463N369459N862636N987720
14302A37028388O474153O443486P673869P581291P761190Q984892Q750078R308770
14294B00006117J0380452J0445638J1735493J1910785J2145876J3131008J3694205
14287B83449574J3889263J4676253J4905491J5123676J5449130J5219300J5028319
14280C87741006J4756148J4008587J3335794J1430948J0440802Q489457O361598
14273D66564340L038311j036547n331046k727804l439856l715198m432879q999943
14265D39919378j0914160j1378049j3317660j4453268j5267508j5683824j5640712
14258C43264197j5683859j5528635j4675967j4001682j3413417j3423984j2652631
$$ plain form
14310 97089745 100849934 105267978 109769565 114789110 119808573 125178032 131040668 137028388
14302 137028388 143502541 149946027 157619896 165201187 172962377 181947269 190697347 200006117
14294 200006117 210386569 220832207 232567700 244478485 256624361 269755369 283449574
14287 283449574 297338837 312015090 326920581 342044257 357493387 372712687 387741006
14280 387741006 402497154 416505741 429841535 441272483 451713285 460202742 466564340
14273 466564340 469602651 468566104 463235058 460507254 457067398 453352200 448919321 439919378
14265 439919378 429005218 417627169 404309509 389856241 374588733 358904909 343264197
14258 343264197 327580338 312051703 297375736 283374054 269960637 256536653 243884022
14251B43884022j2147120j1733474j0624775j0183705j0025282q736491q722079
14244A71711096q021274p524364p239588o910557o449305o150635n150617n385270
14236A18879486n070195m986094m807601l880215l935337l473829l695118l703035
14228H5328062l432488l051892k862840k539085l114688k239729k461448j959021
14220F3666871j893294k403983j749800k008576j922475j682655r09356j551253
14212D9545479j822047j633591j345323j301202j322194m12968j209484j497244
14204C9001426r04233j290912m41376r15851j338166o85892q74098r67683o18511
14195C0964704j102712j04402j000354p50511p61358n72827q37033k86762n25778
$$ plain form
14251 243884022 231736902 220003428 209378653 199194948 189169666 180433175 171711096
14244 171711096 163689822 156165458 148925870 142015313 135566008 129415373 124264756 118879486
14236 118879486 113809291 108823197 104015596 100135381 96200044 92726215 89031097 85328062
14228 85328062 81895574 78843682 75980842 73441757 70327069 68087340 65625892 63666871
14220 63666871 61773577 59369594 57619794 55611218 53688743 52006088 51096732 49545479
14212 49545479 47723432 46089841 44744518 43443316 42121122 41708154 40498670 39001426
14204 39001426 38097193 36806281 36364905 35449054 34110888 33424996 32550898 31583215 30964704
14195 30964704 29861992 29757590 28757236 28006725 27245367 26672540 25835507 25548745 25022967
14186B5022967k57749j018395m09959q79968l00324k2907o06417m43394l59711
14177B0724143n78397n99228j22859n95178k34979n73055l10259l09422l13305
14168A7087461m06050J66l85900l66595o9534m70507k09109m35959k9931M1490
14158A4755532p12964l34062l9597j47034l00737k34253m81113P9924j43987l14882
14148A2126827l72311K7972k28186l11118L19117l04155n47753K14630k37803
14139A0687220k84328j43486J4935l05685k72176J20406l16184O2659m35844m1461
14129I086056m4584m5053l51481L92629l70271k04392k09568m46502J71336M9958
14119H028128j9671l93882M00074k77926j35807o4465q0506j96852j66613M0811
$$ plain form
14186 25022967 24765218 23746823 23336864 22456896 22156572 22133665 21527248 21083854 20724143
14177 20724143 20145746 19546518 19423659 18828481 18593502 18020447 17710188 17400766 17087461
14168 17087461 16681411 16681577 16295677 15929082 15859548 15389041 15179932 14743973 14714042 14755532
14158 14755532 14042568 13708506 13668909 13521875 13221138 12986885 12505772 12585696 12441709 12126827
14148 12126827 11754516 11782488 11554302 11243184 11562301 11258146 10710393 10925023 10687220
14139 10687220 10402892 10259406 10274341 9968656 9696480 9816886 9500702 9563361 9127517 9086056
14129 9086056 9041472 8996419 8644938 9037567 8667296 8462904 8253336 7806834 7978170 8028128
14119 8028128 8008457 7614575 8014649 7736723 7600916 7536451 7455945 7259093 7092480 7133291
14109G133291m3023k42386J16905m89029K31464k75647K10687k29249Q7762j79983
14099F320792j82421k23373J54704O1078j8211k73943j51992k14998P2304O1891
14089E605831n7845q9253j21535J02165j94478l715j16472j82611K39339k50100
14079D931326L00316l19241p0978J01578m85922M00671k22295L15469l39708j2998
14069D598218l3333m86188L24065j67763K07950j14176K38845l97995m8730O0734
14059D181627K09901k24566J66444j63916k80017N33467l43076q3510k50070K6075
14049C772359K43622l25815K63961p28656K78636l30845K29121M2747M35626n08691
14039C372065n6239j40458J00235q8998J29652k80096M95329j83233j79060K11128
$$ plain form
14109 7133291 7090268 6847882 6964787 6475758 6707222 6431575 6642262 6413013 6500775 6320792
14099 6320792 6138371 5914998 6069702 6130780 6112569 5838626 5686634 5471636 5543940 5605831
14089 5605831 5547986 5458733 5337198 5439363 5244885 5241170 5124698 4942087 5181426 4931326
14079 4931326 5231642 4912401 4841423 4943001 4457079 4857750 4635455 4950924 4611216 4598218
14069 4598218 4564885 4078697 4402762 4234999 4442949 4328773 4567618 4169623 4120893 4181627
14059 4181627 4391528 4166962 4333406 4169490 3889473 4422940 4079864 3996354 3746284 3772359
14049 3772359 4015981 3690166 3954127 3225471 3504107 3173262 3402383 3445130 3880756 3372065
14039 3372065 3315826 3175368 3275603 3186605 3316257 3036161 3531490 3348257 3169197 3380325
14029C380325l87864j43671M8941R4936o6464R7779K05932m98712K30140l42521
14019B618821K86728l85752J47673k14175J39671m57843N78876j75532J99964
14010B738431L726p5162J58737m51244j89514j11574J32321J91181j35447J68114
14000B429569j2361M0472o46316J57267M29757l16389j9289J8755J475L48479
13990B431419L96788J239332L290928J0398042J7448612P016057j6598060j2389700
13982A3233418m928662k108823j357361q38313m42658j73913O5658l24488j94144
13973B930714J95188k24807j80787k35242Q5703P1042j43183l95696M90985p5188
13963B518729k55834j0411o6029O0065O204q1151J77799n8585J7327j50184r8271
$$ plain form
14029 3380325 2992461 2848790 2897731 2992667 2926203 3023982 3229914 2731202 2961342 2618821
14019 2618821 2905549 2519797 2667470 2453295 2592966 2135123 2713999 2538467 2738431
14010 2738431 2742157 2666995 2825732 2374488 2184974 2073400 2205721 2396902 2261455 2429569
14000 2429569 2417208 2457680 1811364 1968631 2398388 2081999 2062710 2081465 2082940 2431419
13990 2431419 2828207 4067539 7358467 17756509 35205121 42221178 25623118 13233418
13982 13233418 8304756 6195933 4838572 4000259 3557601 3383688 3449346 3124858 2930714
13973 2930714 3125902 2901095 2720308 2485066 2570769 2641811 2498628 2102932 2593917 2518729
13963 2518729 2262895 2252484 2186455 2246520 2252724 2171573 2349372 2290787 2308114 2157930 2059659
13952B059659j69495R7760m565L18893l60509j0404P6971P8496k10090J12760
13942A989476J2704K08360l21284J27688m58834J40783L69389r766l06352n851
13932A746313Q1011N8126J9897p8905j22160P9147k38438M01041q5999j8389k73375
13921A568269R4395P0853K33721m17242K28020j44293K48264k76599M35r59j04930
13910A499934J70873m13438Q0420L27910l52827L94422k86026L4136k13781L26019
13900A567642j67391K39807q6031j70912P0324j75026L57336n86849K52906J30873
13890A432679q7992k42851K75951J73078k87481l73836M84342n3007L379K44447
13880A568709l33004m7093N5403M2281K50368l74759j69042K23015J98031n5232
$$ plain form
13952 2059659 1890164 1987924 1983359 2302252 1941743 1931339 2008310 2086806 1876716 1989476
13942 1989476 2002180 2210540 1889256 2016944 1558110 1698893 2068282 2058516 1752164 1746313
13932 1746313 1827324 1885450 1905347 1826442 1704282 1783429 1544991 1946032 1860033 1841644 1568269
13921 1568269 1662664 1733517 1967238 1549996 1778016 1633723 1881987 1605388 1605823 1604864 1499934
13910 1499934 1670807 1257369 1337789 1665699 1312872 1707294 1421268 1455404 1241623 1567642
13900 1567642 1400251 1640058 1554027 1383115 1453439 1278413 1635749 1048900 1301806 1432679
13890 1432679 1344687 1101836 1377787 1550865 1263384 889548 1373890 1320883 1324262 1568709
13880 1568709 1235705 1188612 1244015 1286296 1536664 1161905 992863 1215878 1413909 1358677
13870A358677M7837l02566m9652k41013M34705j66159K01176Q7847k78904J38124
13860A230072k374l36249J49865J14472q7306K58035l3594m2322k0285j84953
13850A045361J4968P211k12856R9500k5846J89085J69875k10288l9097K2451k85164
13839G75200K23430j53559L02761m3120j54217L21662F16207L37854j50977M43922
13829A247006l0584n6101j13963O9122m00773J93769K03059q4905k42040k00608
13819E83982N47171j99234M2382P6374m05750J05583N8863j306J77066j41731
13809H43400j31362M83633m88677L86015k28811j16806P8353K13379j14784p4598
13799H49742n831P9698P805j8866j10032J33605J3527j22590k37596K58737J0178
$$ plain form
13870 1358677 1406514 1103948 1054296 813283 1247988 1081829 1283005 1370852 1091948 1230072
13860 1230072 1227698 891449 1041314 1155786 1068480 1326515 1292921 1250599 1230314 1045361
13850 1045361 1060329 1067540 854684 954184 928338 1117423 1287298 1077010 1037913 1060364 775200
13839 775200 998630 845071 1147832 1104712 950495 1272157 616207 954061 803084 1247006
13829 1247006 1216422 1160321 1046358 1115480 714707 908476 1111535 1026630 784590 583982
13819 583982 1131153 931919 974301 1050675 644925 750508 809371 808065 985131 843400
13809 843400 712038 1195671 706994 1093009 864198 747392 825745 1039124 924340 849742
13799 849742 843911 923609 931414 912548 802516 936121 949648 827058 589462 848199 858377
13788H58377j20011j70883K69091M7221P3244j69773j7645J83603J64712l08337
13778H09599k9598j51881P7716P1770L27588q1872l87492q0073J54292p2148J61683
13767G99584m9082K64987l22921J15511J9793j61643L10921O9678D89700J82473
13757F72173J30619j27973J27711l24182K87729M9373j76335k55614L43296j98040
13747E28757L83134j72008K50639l43579m7693J65799j33505k1162n9799J15696
13737F66279j8369j86400J07173n0338L6005O9702j80285J63619n5819m8235R4944
13726E98276B37799N30295o7182l39110n6582N87461k79983k30690N6184P1087
13716E09279M83317l39892k6904R5670k4624n5767K48482C22283N98414l54888
$$ plain form
13788 858377 738366 567483 836574 883795 957039 787266 769621 953224 1117936 809599
13778 809599 780001 628120 705836 777606 1105194 1023322 635830 555757 710049 637901 799584
13767 799584 750502 1015489 692568 808079 827872 666229 977150 1046828 489700 672173
13757 672173 802792 674819 802530 478348 766077 815450 639115 383501 726797 528757
13747 528757 911891 739883 990522 646943 599250 765049 631544 610382 550583 666279
13737 666279 647910 461510 568683 518345 554350 624052 443767 607386 551567 503332 598276
13726 598276 237799 768094 700912 361802 305220 892681 612698 382008 438192 509279
13716 509279 992596 652704 625800 721470 696846 641079 889561 322283 920697 565809
13706E65809B70320L60101L860l093J22897k81548A94390M88940L795j22733L8391
13695F02783B93886M57793r2203B74940N50889j98389K6320l20336L21726p7521
13685E77629j07650N8163l7652l6157J61641j7222j42464B24808R0647Q308K09913
13674E33676q9504N08571C80830K6491J66657n60O4330l01041M4719l4350K87364
13663F34440k5951j43985K78801k92722J6193m7791j64428J70549M4034J61941
13653F31081j03002k18523J71419n8428J04523k57516O647k4758L3942J63974
13643D49359J04417j39841K58700B49154J74569j23153L04122F1334K11555K94406
13633E67295m5755j74382L01793j0019A5034K80831L07511P6496B86490N0646
$$ plain form
13706 565809 270320 630421 634281 631188 754085 472537 194390 683330 687125 564392 602783
13695 602783 293886 751679 659476 274940 825829 627440 653760 333424 655150 577629
13685 577629 469979 528142 490490 454333 615974 598752 456288 224808 315455 323763 533676
13674 533676 444172 952743 380830 407321 573978 573418 637748 336707 381426 347076 634440
13663 634440 608489 464504 743305 450583 466776 418985 254557 425106 469140 631081
13653 631081 528079 309556 480975 422547 527070 269554 276201 251443 285385 449359
13643 449359 553776 413935 672635 249154 423723 300570 604692 61334 272889 567295
13633 567295 521540 347158 648951 638932 15034 295865 603376 679872 286490 337136
13623C37136L02724m2988j65738A61996a4991G89112B29855K25716j76473K46708
13613E25806j3657m2342q745R8213B0026L13387O4872K40717L2090k31901j54658
13602B84533q3292K82180C4641O04891l0379B29080A12618L44329j52605J24273
13592D28615j18022N2640J31421B44074J86414j8021k8933M8826J4002Q3105O6694
13581E96161j38709R167N5374j84512j01758R413O7499K53064e7420E12447B50234
13569h347E8596K43576Q3P4266j33071K18827j45445j14195J9196K69102B23553
13557C69245L0628j65502O45762D16223J74416A35264K17432q0983J52584j79774
13547B44523I6799J31793J00934j5914m4440F3037L7077L91646j04945j09516
$$ plain form
13623 337136 639860 596872 431134 161996 -14991 789112 229855 455571 279098 525806
13613 525806 512149 469807 461062 559275 20026 333413 398285 639002 671092 439191 284533
13602 284533 201241 483421 34641 639532 609153 229080 112618 456947 304342 428615
13592 428615 310593 363233 494654 244074 430488 412467 383534 432360 446362 529467 596161
13581 596161 457452 466619 521993 337481 235723 245136 312635 565699 -57420 512447 250234
13569 -8347 58596 302172 302255 376521 243450 462277 316832 202637 221833 490935 223553
13557 369245 399873 234371 880133 416223 590639 135264 352696 271713 424297 244523
13547 244523 96799 228592 329526 313612 269172 63037 100114 491760 386815 277299
13537B77299p2782J45062K82279B82139N0900P2307p2692J020m3609n4970J11008
13526C46103j11305I4982K81386A37984O8958L28486J70029k67652A65281H0474
13515A82886o2713J28715K88742k52268k8391M43020I4552P4584J84976K16810
13505E70922j25758j52795Q2548j0396J00227A45297K21042j50870m3240K03815
13495C76044r3086R7523a14018G6003K31584q5307J68080G7847J28053j6194B362
13483A28832K57551o9602M68756C30627A16389J32707J95670A63160K33208A00294
13472B79669K955K9464q2858J05315Q521A47131K71028j42972o8487n7897L6627
13461A85430J67173A24903a2179E32239B15064K48489A9256M13350j29632I1813
$$ plain form
13537 277299 204517 349579 631858 282139 333039 405346 332654 333674 290065 235095 346103
13526 346103 234798 94982 376368 137984 206942 535428 705457 437805 165281 80474
13515 182886 120173 248888 537630 285362 256971 699991 94552 169136 354112 570922
13505 570922 445164 292369 374917 364521 464748 145297 366339 215469 172229 376044
13495 376044 282958 380481 -114018 76003 307587 222280 390360 77847 205900 189706 2362
13483 128832 386383 316781 785537 330627 116389 249096 444766 163160 396368 100294
13472 279669 282624 312088 229230 334545 343066 147131 418159 275187 206700 148803 185430
13461 185430 352603 124903 -12179 532239 215064 463553 19256 432606 302974 91813
13450A90061J64251N06c9521m5968A73222r71J03810p3196i0002A09417K26340
13439C35757j28772k5936N0892J09955R3983D7826J63788L20363A03506J30409
13429B33915i8585C95410G3075Q9019M54K77310j02082O7015j68109j02118J18561
13418B53125H7705J94516G1030K86376j36990b33066D8270M17555A40595M5068
13408A85663J31931H3101Q7657M40778k26722N5642A89990K02421G1656J83072
13398B54728o5714J59479J6703D4560g5084D3815K9193L46283j90591J4998J6585
13387B60283o6380n0674P6550l3557K7032n3506e196D54892k25424D8567d6913
13375A50077D7332J36236M973p4246m9478P7252L22242A51122K82496n5395A07326
$$ plain form
13450 190061 354312 354818 -39521 -85489 173222 172251 276061 202865 -90002 109417 335757
13439 335757 206985 181049 231941 341896 435879 47826 211614 531977 103506 233915
13429 233915 -98585 395410 73075 162094 162548 439858 337776 404791 236682 134564 253125
13418 253125 87705 282221 71030 357406 220416 -233066 48270 465825 140595 185663
13408 185663 317594 83101 170758 611536 384814 440456 189990 392411 71656 254728
13398 254728 189014 348493 365196 44560 -75084 43815 73008 419291 228700 243698 260283
13387 260283 193903 143229 219779 186222 213254 159748 -5196 454892 229468 48567 -46913
13375 150077 47332 183568 188541 114295 64817 142069 464311 151122 433618 378223 107326
13363D0742j3340J7942K30972h2748a0861E3282K42722j36715J86978Q4196A98170
13351B26045O4946k3813I7816j9330J4550K53192L42902k84699A33262J11444
13341B44706A03377b21254D06065K7260n9715A34864J28587d9002E12507g8090
13330A7710R9749O6757q8768L52999A68067l7470a5152E67497k20514p3465N6187
13319C29705j11737a43598C82417q725Q2309j74718q7285m5002J72872E093O9252
13308G4345J60562J00142n7650A05842J20295q9003D9256L00772p8039F9230N1798
13297A21028N2099m6071J63874r9298O194C3627J11890K15506b26959C99822a16022
13285E60128B00680Q6781A11620L2400O6325p2779A5148M63798A25965K80750
$$ plain form
13363 40742 27402 45344 276316 -82748 -10861 53282 296004 159289 346267 430463 198170
13351 226045 290991 267178 97816 78486 93036 346228 689130 404431 133262 244706
13341 244706 103377 -221254 406065 433325 373610 134864 263451 -49002 512507 -78090
13330 17710 117459 184216 95448 448447 168067 130597 -15152 567497 346983 273518 329705
13319 329705 217968 -143598 382417 373692 456001 281283 193998 148996 321868 5093 74345
13308 74345 234907 335049 277399 105842 226137 137134 49256 350028 271989 69230 121028
13297 121028 173127 127056 290930 191632 197826 33627 145517 361023 -226959 399822 -116022
13285 560128 200680 287461 111620 144020 210345 137566 15148 478946 125965 406715
13275D06715c0649A12662J3662K14463G6552f1190C97286j87911K94043b85876
13264I1637R7283K03630B39J0041K91891p0339j13392m000J1193J90300C124a27626
13251A48643m1144k5175L52682e6029F0135k9437L6397R0306A1111J94228j4719
13240A90620N5979K8882j11780l3008K06186c5801I5309J04276O8231a58519A34360
13228B11476c3153D63707A49611L44969j69481A61110g5046L4384A61359J31188
13218B92547H7227C0864J72024a89475A84618H5579J86965M2453a05559B364M32917
13207D35281A25389D3491J06577A3766Q7233B8036a262p8543A00059J74396J01735
13196C76190A40271d95013D6747J98166C8777J1172J45241i0487D8357a95846
$$ plain form
13275 406715 -30649 112662 126324 340787 76552 -61190 397286 209375 503418 -285876
13264 91637 188920 392550 239 10280 302171 231832 118440 114440 125633 315933 3124 -127626
13251 148643 107499 82324 435006 -56029 60135 30698 67095 157401 11111 205339 190620
13240 190620 246599 275481 163701 130693 336879 -35801 95309 199585 267816 -158519 134360
13228 211476 -33153 463707 149611 494580 325099 161110 -75046 -40662 161359 292547
13218 292547 87227 30864 202888 -189475 184618 85579 272544 314997 -105559 2364 435281
13207 435281 125389 43491 150068 13766 100999 28036 -1262 -79805 100059 274455 376190
13196 376190 140271 -495013 46747 244913 38777 49949 195190 -90487 48357 -195846
13185C49124A18011g0771A37849a74801f4406A48277f3260H3161d622C24684E4301
13173a32140K8375K7767F3917R8367J8623E1056a94509I0473i127A2982K27349
13162B40331p1341c29169c0165F4682j153N7374E5238L0321F996J66279p4006
13151I9269C3772a05466B84980F9695K54337G5978J0626c64797A22793J11791
13141B34584e9609C4504J62831a09948d0559C14868C2148N41028j86831A42203
13130e4139q8866D9943c4868k11885C44513E5138a39337c9040B10056B5852K47056
13119B72908E0670j4472Q329J19696p087l9205n2449J22844E2778a92818g0690
13107a26167B58873C1332E571a3781A08832a81707A28870J24942J0101A2370J27974
$$ plain form
13185 349124 118011 -70771 137849 -174801 -64406 148277 -63260 83161 -4622 324684 54301
13173 -132140 -103765 -75998 63917 162284 180907 51056 -194509 90473 -9127 12982 240331
13162 240331 168990 -329169 -30165 64682 63529 120903 55238 85559 6996 173275 99269
13151 99269 33772 -105466 284980 69695 324032 75978 86604 -364797 122793 234584
13141 234584 -59609 34504 197335 -109948 -40559 314868 32148 573176 386345 142203
13130 -54139 -143005 49943 -34868 -246753 344513 55138 -139337 -39040 210056 25852 272908
13119 272908 50670 36198 44527 164223 157136 117931 65482 188326 52778 -192818 -70690
13107 -126167 258873 31332 5571 -13781 108832 -181707 128870 253812 263913 12370 140344
13096A40344j3893O7973J31380o8998g1507A99933L682E8744J56978q3109l9831
13085I2782i0053B32602E9604p71K5167g1346A07473J56324j6349c58865G5811
13073e9020C19084G5733g2160C20309A39037K29913j24806n2566K78928j74586
13063B95920D1517K09026j3729J79709j94043L22875f6337A79757J22780L9083
13053C41620e1738A5870L8310A6189b97788R1525A4085c0496B10900O1689q1523
13042A91066P6205q5762J38102Q1977j35713n8093B6965L47461a92909A5512g6693
13030E8389f1863C98989c1714A21624D5997d5533A44776F9908L61910K6524A04707
13018f1014A22909q939M3746d1392E14426n3434D7178b0723C61076A77487d17762
$$ plain form
13096 140344 126451 194424 325804 256806 -71507 199933 203615 58744 215722 132613 92782
13085 92782 -90053 232602 59604 58833 84000 -71346 107473 263797 247448 -358865 75811
13073 -59020 319084 75733 -72160 320309 139037 368950 244144 191578 470506 295920
13063 295920 41517 250543 236814 416523 222480 545355 -66337 179757 302537 341620
13053 341620 -51738 15870 54180 16189 -297788 -206263 14085 -30496 210900 272589 191066
13042 191066 267271 181509 319611 401588 265875 207782 26965 374426 -192909 15512 -76693
13030 58389 -61863 398989 -31714 121624 45997 -45533 144776 69908 431818 458342 104707
13018 -61014 122909 113970 157716 -41392 514426 460992 47178 -20723 361076 177487 -417762
13006A65157P3818a2513A70567b2784o0206F827K14430q6941c859j35418h814
12994A09502J85564Q7050m1294a61061B45877L3704E3902J30461I457M9986f3042
12982A64498k637k8716e4576A06968Q8597o4584M2930h6685A88616J73790I1077
12970b46454A75537b82794A75160K77748d8803c847j93888d4789p1246A16438
12959I2273C306K92152b45871B22953g0082C4701J92673E0327M6943k1020l0859
12948D5391a38846N9704G1426a1471B30434a21024E7673K04292c9282B3641a72768
12936B08311J4429b41135e8888I8363K11378E3057K54251G5769K8203K90655d7285
12924i392A58176a76883A30111k5400b6641j77689e9904J5047k64479g1925A74350
$$ plain form
13006 165157 238975 -12513 170567 -22784 -82990 6827 221257 134316 -3859 -139277 -8814
12994 109502 295066 382116 340822 -161061 245877 279581 53902 184363 9457 59443 -63042
12982 164498 161861 133145 -54576 106968 195565 130981 173911 -86685 188616 362406 91077
12970 -246454 175537 -282794 175160 452908 -48803 -3847 -197735 -44789 -116035 116438
12959 92273 3306 295458 -245871 222953 -70082 34701 227374 50327 97270 76250 45391
12948 45391 -138846 -79142 71426 -11471 230434 -121024 57673 261965 -39282 23641 -172768
12936 208311 222740 -241135 -58888 98363 309741 53057 307308 75769 103972 394627 -47285
12924 -9392 158176 -176883 130111 104711 -26641 -204330 -59904 -44857 -309336 -71925 174350
12912A93341m2591b4068B68818D1637K02421J5475p0794a18624A51545n975J01027
12901B46597j12954p482i2949J9933D4101J93263C7837J31455L6514q0734e4677
12889D7319f7140k31739a6252B70639A24711a44609E8780L88758A4516f1662a6656
12877b5543A24N4842a39869A34797a69002A33749a87300c7047A469h2896E5600
12865a15561B76287a0437C0676R0553J4796D4740J38880f6382C12610a6313A19782
12853a49133n3627e3540E1137Q5669Q3745M2290I8090l514N8976o0167d383j39232
12841a43615E441M16422e8169B60861a46046I0229a48724k1574A67187a6555B49493
12829C23595F7075R4048J28021a7395j45933N4367E5362L9998r170J02241a32505
$$ plain form
12912 193341 150750 -24068 268818 41637 244058 259533 188739 -118624 151545 145570 246597
12901 246597 133643 126161 -92949 -73016 44101 237364 37837 169292 205806 125072 -54677
12889 47319 -67140 -298879 -16252 270639 124711 -144609 58780 447538 14516 -61662 -16656
12877 -25543 124 54966 -139869 134797 -169002 133749 -187300 -37047 1469 -82896 55600
12865 -115561 276287 -10437 30676 121229 136025 44740 183620 -66382 312610 -16313 119782
12853 -149133 -202760 -53540 51137 136806 220551 262841 98090 94576 153552 93385 -4383 -143615
12841 -143615 5441 421863 -58169 260861 -146046 90229 -148724 -170298 167187 -16555 249493
12829 323595 67075 161123 289144 -17395 -163328 -108961 55362 95360 86190 188431 -132505
12817F3030h6059l52314D32356b18654q511C1449a54219A46566b35744I91b16942
12805C15901b3977k0463B32002b61612A39637J1423R4036a72555A10890a5521
12794C47403A41148h01A06627a88962h2488D5968P3544J69948b2860j36866D6902
12782B49090g1638E63P5120n84l1161a52005r3722F6023B9032f1448A71483F7773
12769A58997e2219A31005f4513A61993c7145E2981J44261B6727b76688B87351
12758C29022A22672a07966G5620A186K91937j31411B5312O7808a27708D1800d4602
12746C5051O8385a23939c05A31322a93982l2609c5076G5036b45372D5350K304
12735D7654O2391j4962P6768n0907h6162K5753B8312a07093A46K68693b296k08436
$$ plain form
12817 63030 -86059 -438373 432356 -218654 -227165 31449 -154219 146566 -235744 991 -216942
12805 315901 -23977 -44440 232002 -261612 139637 151060 245096 -172555 110890 -15521
12794 347403 141148 -801 106627 -188962 -82488 45968 119512 289460 -22860 -159726 46902
12782 249090 -71638 563 75683 75099 43938 -152005 -245727 66023 29032 -61448 171483 67773
12769 158997 -52219 131005 -64513 161993 -37145 52981 197242 26727 -276688 287351
12758 329022 122672 -107966 75620 1186 293123 161712 25312 93120 -127708 41800 -44602
12746 35051 103436 -123939 -305 131322 -193982 -226591 -35076 75036 -245372 45350 47654
12735 47654 110045 95083 171851 120944 -86162 -60409 28312 -107093 146 268839 -2296 -210732
12723b10732A24138J40652H5647m0143a13231A4496a89206A68191f101r5607j01169
12712b02877H2146a85595A59835p6092J25451K17727F7539K80420J67201B53304
12701A59814L37275D9633g1020p4490j46485H7067k7049n199J52023a09192B02502
12689e3314j92563B52822D4868f3263C35578G3985a6302A41558h2511A34311j5557
12678A18754P6697J22466B8869K34941O8645o8789a06083E0442N89909h2535A09785
12666a32345j27346b1635C8959b15089H2809J4307b0021E63101A83088E5021q750
12655D6271k1306J04253a95370L9735C09318E5667K83400G8315K20571B3801K92874
12644C16675A57942a28551I5290b3238A2454M17485f6860A35255N4808D6593J59123
$$ plain form
12723 -210732 124138 264790 85647 45504 -113231 14496 -189206 168191 -6101 -101708 -202877
12712 -202877 82146 -185595 159835 83743 209194 426921 67539 347959 515160 253304
12701 159814 497089 49633 -71020 -145510 -291995 87067 60018 54819 206842 -109192 202502
12689 -53314 -245877 252822 44868 -63263 335578 73985 -16302 141558 -82511 134311 118754
12678 118754 195451 317917 28869 263810 332455 263666 -106083 50442 640351 -82535 109785
12666 -132345 -259691 -21635 38959 -215089 82809 97116 -20021 563101 183088 55021 46271
12655 46271 24965 129218 -195370 -155635 309318 55667 339067 78315 298886 23801 316675
12644 316675 157942 -128551 95290 -23238 12454 429939 -66860 135255 190063 46593 205716
12633B05716F5159K69014k4084E9230J05917R4715J9939A09255C7038J13374k550
12622A47862K86752n6087h3937A48282O9761r7983B9160a54997D4836a92086C23707
12610B4129R4757A915J78853a02514A94842b20963B82269D2405g5925B3989R0847
12599A14836J9269J32769q0136b47120F7792J65246B2989L51340j62457G9035
12588E857O4569J5262g8780B39908a86138R3052D44815a33402A31682d47256f661
12576a2759d963B96523c61905A66773l7099a82727A03875c23290C20414A21786
12565B0491b15692A07806J65753H2123M4944a15754b3566A3759J80903c4684n1202
12554h5886M0639D0752g9400G4380K84553e7068m12B48289f3022q356A30151b18795
$$ plain form
12633 205716 65159 334173 310089 59230 165147 259862 279801 109255 37038 150412 147862
12622 147862 434614 378527 -83937 148282 218043 120060 29160 -154997 44836 -192086 323707
12610 24129 118886 1915 180768 -102514 194842 -220963 282269 42405 -75925 23989 114836
12599 114836 134105 266874 186738 -247120 67792 233038 22989 374329 211872 79035
12588 5857 70426 85688 -78780 239908 -186138 -93086 444815 -133402 131682 -447256 -6661
12576 -12759 -4963 296523 -361905 166773 129674 -182727 103875 -323290 320414 121786
12565 20491 -215692 107806 273559 82123 127067 -115754 -23566 13759 194662 -34684 -85886
12554 -85886 -45247 40752 -79400 74380 358933 -57068 -57480 248289 -63022 -71378 130151 -218795
12541D3458a30541J3601B3484K7120a0743B83698b07377B51920E9732g5869C27911
12529C05533j49558a4419o3571B33092f0964n1585C70468A04380l0812g4866k50237
12518c25103c9681j00689I501d5461A0019a20465p0504B15339b38827A12471d6494
12506f407l7142j39467N1205F121J68312C1099K9071b63343B50197b57172q3748
12495c40920a8662A67206c8490C66245j71919c0965A23595l8808M3818n908f8146
12483d398A5601J01785a16405H044J09767Q743m9868J80812B8910g0187l5542
12472a05729c0855B28670c36199B03251I7320i2306L4371B02118a78274a8345
12461a04365J3278j28979K9829B25029o5327g9897j2422j22636A12869a23132
$$ plain form
12541 43458 -130541 -116940 23484 50604 -10743 283698 -207377 251920 59732 -75869 327911
12529 305533 155975 -14419 -77990 233092 -60964 -112549 370468 104380 73568 -74866 -325103
12518 -325103 -39681 -140370 9501 -45461 10019 -120465 -190969 215339 -238827 112471 -46494
12506 -6407 -43549 -183016 -131811 6121 174433 31099 60170 -263343 250197 -257172 -340920
12495 -340920 -18662 167206 -38490 366245 194326 -30965 123595 84787 128605 122697 -68146
12483 -4398 15601 117386 -116405 8044 117811 126554 76686 257498 28910 -70187 -105729
12472 -105729 -30855 228670 -336199 203251 97320 -92306 -57935 202118 -178274 -18345
12461 -104365 -91087 -220066 -190237 225029 159702 -79897 -92319 -214955 112869 -123132
12450B32527M0926a88293B89431a72779c4858N021A18132O9244H8054g2460C48139
12438A16751f903l90488G9452j2706a16348L0622L8014m5575r9165l8696D6691
12426G933b22937O8614j9581H6535c05336C3939a45741O6293m597k37986c7042
12414B08205a61716P1684B77099A22294J58472I8051D1703a37424A69526h0619
12403a21673I0903J04171q9735A4434K45452j10865J27183H6649b9378E0525c9814
12391a04652p6074A58585J28108G5996l0306l388J30876H5116a0514n386j36609
12380a52509j8778B61913a60940e8507j17602A61236k3049a89080I8151a02351
12369c8972o3390G3739b6334B30230D4537K49106G5254c43147b0003A65186C1163
$$ plain form
12450 232527 273453 -188293 289431 -172779 -34858 -29837 118132 187376 88054 -72460 348139
12438 116751 -6903 -397391 79452 66746 -116348 -85726 -47712 -93287 -192452 -231148 46691
12426 7933 -222937 -154323 -173904 86535 -305336 33939 -145741 -79448 -84045 -322031 -37042
12414 208205 -161716 -90032 277099 122294 280766 98051 41703 -137424 169526 -80619
12403 -121673 90903 195074 105339 14434 259886 149021 276204 86649 -29378 50525 -39814
12391 -104652 -180726 158585 286693 75996 45690 42302 173178 85116 -10514 -15900 -152509
12380 -152509 -171287 261913 -160940 -58507 -176109 161236 138187 -189080 98151 -102351
12369 -38972 -102362 73739 -26334 230230 44537 293643 75254 -343147 -20003 165186 31163
12357f4058K6486p6651m4843n0553C50902A52350M8490J69739f8641A83249l9746
12346A43503a76110m1396j5664j15659a70119I8396b28980A20401h3542l2683
12336a16225A02836b6252P239B98524I587P8624C7555O7894A9719b05881F5549
12324A88318F9328M2931h6809A1174d938o4240B1602J29226c9311I6648d4777
12312a31175A29245J13976a64008B1252M1229R3468M4458c841j68128A0197L5852
12301D6049c26149c1453F7023a19441A24749a24171A09311Q9032a1883B06844
12290B93587j09283b24102I9033b25680A22938L9457c983B34223g9736A21440
12279C19012a41597L5716D0695M48015J34890B2217K38522b192C42299j22203
$$ plain form
12357 -64058 -37572 -114223 -159066 -209619 350902 152350 200840 370579 -68641 183249 143503
12346 143503 -176110 -217506 -233170 -348829 -170119 98396 -228980 120401 -83542 -116225
12336 -116225 102836 -26252 -19013 298524 9587 88211 37555 105449 19719 -205881 65549
12324 188318 69328 112259 -86809 11174 -4938 -69178 21602 150828 -39311 96648 -44777
12312 -131175 129245 243221 -164008 21252 62481 155949 200407 -3841 -171969 10197 46049
12301 46049 -326149 -31453 67023 -119441 124749 -124171 109311 198343 -11883 206844
12290 293587 184304 -224102 99033 -225680 122938 162395 -3983 234223 -79736 121440
12279 319012 -141597 -105881 40695 488710 623600 22217 260739 -2192 342299 220096
12269B20096I9516a05375A00040B9669J17115J0363f0503C8020d372B13309i243
12257A76802n2848b41121A27464b09063B35362E8197e0951H1464K82927j58620
12247B05771e3794r749A5096b23992E1910J38102J54746E6824K32341A36976c5162
12235C76062A6995J81320e7293F5433J73909h8145C4265L74704A25663g8482B88124
12223A51573j296A4417J99188J43294j00292F282K54650j10196p1699N451J01373
12212A85861d6488E4232L11489a58780A85618b02777B66787j31460J19420P3022
12202C27769H1984N1338D6114j3930J80081d856D05119p8109j10693l605p1308
12191A41404a38449A62143K91722b17986A8108a18457N1964h149j2934C67363
$$ plain form
12269 220096 99516 -105375 100040 29669 146784 157147 -60503 38020 -4372 213309 -9243
12257 176802 123954 -241121 127464 -209063 235362 58197 -50951 81464 364391 205771
12247 205771 -53794 -63543 15096 -223992 51910 190012 344758 56824 289165 136976 -35162
12235 376062 16995 198315 -57293 65433 239342 -88145 34265 408969 125663 -78482 288124
12223 151573 150277 14417 213605 356899 256607 6282 260932 150736 79037 84488 185861
12212 185861 -46488 54232 365721 -158780 185618 -202777 266787 135327 254747 327769
12202 327769 81984 133322 46114 32184 212265 -4856 405119 327010 216317 212712 141404
12191 141404 -138449 162143 453865 -217986 18108 -118457 -66493 -8149 -21083 367363
12180B75081A27608L6294b6024D59435A70547l4122D2722c6812C20345b69769
12169F9586K18270I643L29034a88367A56619L16983A47530f3129A40279R1283
12159B31562c2718j78928e9874k1930J200C79238H2927K31404o081D3785A1279
12147a36616A43265i806A05703a91378C18272A14395n48h7592B13417k7765a64363
12135B21699F6411a30336R2b0861B83362C560J47452a762A20511c53061A30642
12123F2827K1612a14471m950j77139h7636B36513a02370B01939r0169g1485k9283
12112a00768C50237f3512n9995A76870K2965n8892D3283M00933a70633K6066I827
12100a26104L9214K2168l4097B3766J88233a76208I7631J41164r7009a36278k09549
$$ plain form
12180 275081 127608 163902 -26024 459435 170547 136425 42722 -36812 320345 -269769
12169 69586 287856 9643 338677 -188367 156619 473602 147530 -63129 140279 231562
12159 231562 -32718 -211646 -59874 -81804 -80604 379238 82927 314331 308250 43785 11279
12147 -136616 143265 -9806 105703 -191378 318272 114395 113847 -87592 213417 185652 -164363
12135 221699 66411 -130336 -130244 -20861 283362 3560 151012 -1762 120511 -353061 130642
12123 62827 84439 -114471 -119421 -296560 -87636 236513 -102370 201939 111770 -71485 -100768
12112 -100768 350237 -63512 -123507 176870 199835 140943 43283 444216 -170633 -144567 9827
12100 -126104 -86890 -64722 -98819 23766 211999 -176208 97631 238795 141786 -136278 -345827
12089c45827H1326G088J8190O3844Q6945h0499l502H8600J44644r3886K04691
12078C44049G885P21590L44590L30593F28346A41489J05130c70369b8148j53374
12068a81522A16669J78430b82963j6170D6581c5900E5436K0314i4292C05376a72293
12056a28039A52570b44656D61346d09198J51117a11502A96013a57866A30908a72509
12045a2953B9394a48399G4959E809d8919j3044A27089o1360a13859B2022K1676
12034D3698a3486l06774b4130q3999E1523a25136J7815D8402e2704l226I827b59223
12021h9995G2349J21453D5641J78799B4771R6790L0406M4484q2173a92623G0915
12009c63104a22715A90518c7944C46512A67039J01355C0448e6373k06345g6785
$$ plain form
12089 -345827 81326 7088 25278 89122 176067 -80499 -84001 88600 233244 139358 344049
12078 344049 7885 729475 1074065 1404658 628346 141489 246619 -370369 -28148 -181522
12068 -181522 116669 295099 -282963 -299133 46581 -35900 55436 75750 -94292 305376 -172293
12056 -128039 152570 -244656 461346 -409198 -258081 -111502 196013 -157866 130908 -172509
12045 -12953 29394 -148399 74959 5809 -48919 -61963 127089 65729 -113859 22022 43698
12034 43698 -13486 -320260 -24130 -108129 51523 -125136 -107321 48402 -52704 -55930 9827 -259223
12021 -89995 72349 193802 45641 224440 24771 121561 151967 196451 114278 -192623 70915
12009 -363104 -122715 190518 -37944 346512 167039 268394 30448 -56373 -262718 -76785
11998A85117A4083c9156k04224f8056j06387j440f7447a9631B01957i1878A75265
11986b30923A4668a06853A86210a65834f2170j58900Q1759j47724B05848n2610
11976A53238f2030r5038j81458a28017A94535a74132O019P1260H2258J4490b71292
11964b5384A35632d63295K29518B2977b43155B09153h9452l0783A21869a43655
11953a97853A15558g3620B37284d72189E6249b89085A19871a82313H7127K73706
11943C60833a08704d0872j74281E9759d9388A05596f67m22258a55917B7014f765
11931A16717L78666A38602N3936a07988G504J99887a9437j00357L8131b2794E8905
11919g9059B72628i7983G4632j3004K5355e7889a3518A96337a47891E815J69695
$$ plain form
11998 185117 14083 -39156 -243380 -68056 -174443 -175883 -67447 -19631 201957 -91878 175265
11986 -230923 14668 -106853 186210 -165834 -62170 -221070 -139311 -287035 205848 153238
11976 153238 -62030 -157068 -338526 -128017 194535 -174132 -168113 -96853 82258 96748 -271292
11964 -25384 135632 -463295 -233777 22977 -243155 209153 -89452 -120235 121869 -143655
11953 -197853 115558 -73620 237284 -472189 56249 -289085 119871 -182313 87127 360833
11943 360833 -108704 -40872 -215153 59759 -49388 105596 -667 -422925 -155917 27014 -6765
11931 116717 495383 138602 192538 -107988 7504 207391 -19437 -119794 -81663 -22794 58905
11919 -79059 272628 -97983 74632 61628 86983 -57889 -13518 196337 -147891 5815 175510
11908A75510o9311a10963j91988a44058A14851K35956E3204b7433k27362E0056
11897A59256M80a56438e0412j49038R5044k43193A00243h6447n3276N3150l7011
11886a23584B17687D0955L9854I709h4429a3915j55386N0788j52321A09105a74556
11874A99937N6815b20726B01074a52425B7010K75409a59241A6551O8346b3353
11863a41222O9643D57297b45570J03583q5605R2203A80230l2174D4482a29068
11852i4745k37283h1133H8405a06092K2007F9369e3808o8434L105b7020j65350
11841a92370e2339p3269e3410k10219D6499b98536a12793d1614j71083A7252a95066
11829B0328b10083N9707n9793A92424a91497G0454B0924f3611k5666d659o9173
$$ plain form
11908 175510 106199 -110963 -302951 -144058 114851 350807 53204 -27433 -254795 50056
11897 159256 159736 -156438 -50412 -199450 -104406 -347599 100243 -86447 -139723 -86573 -123584
11886 -123584 217687 40955 80809 9709 -84429 -13915 -169301 -118513 -270834 109105 -174556
11874 199937 256752 -220726 201074 -152425 27010 302419 -159241 16551 84897 -23353
11863 -141222 -71579 457297 -245570 -141987 -227592 -135389 180230 148056 44482 -129068
11852 -94745 -332028 -81133 88405 -106092 -84085 69369 -53808 -122242 -119137 -27020 -192370
11841 -192370 -52339 -125608 -53410 -263629 46499 -298536 -112793 -41614 -212697 17252 -195066
11829 20328 -210083 -150376 -210169 192424 -191497 70454 20924 -63611 -89277 -4659 -73832
11818g3832A0a82277o7875j82831d7128j88402f5378A00178J32270a00235p6836
11807a77071A35024b57796F705c6872p6700M1197b983p0689A27809N89d90187
11795i769A0829J16735c24034h8521B3538a40146n7935j45044N1680D9346P5369
11784A24715a37480j64244e1460K505H7246C1198M01251F9361c11123c7924B23545
11772d8050B14125a34512D6577a57902a7575H1306K13604c50234B3267g9287c253
11760A36333b33397E10222F3338b43692B10428n1801a6267D0299a55961B8496
11749B1123b02571c1182D7722q745K9306j7560J98143E3042M32677j21810a22348
11737B72787e2166n6578e2710H3306K46170a31890B21332D1141d2449l323E9218
$$ plain form
11818 -73832 10 -182277 -250152 -432983 -47128 -235530 -65378 100178 232448 -100235 -177071
11807 -177071 135024 -257796 6705 -36872 -113572 -72375 -2983 -73672 127809 128398 -490187
11795 -9769 10829 127564 -324034 -88521 23538 -140146 -198081 -343125 -291445 49346 124715
11784 124715 -137480 -301724 -51460 -48955 87246 31198 432449 69361 -311123 -37924 223545
11772 -48050 214125 -134512 46577 -157902 -17575 81306 294910 -350234 23267 -79287 -3253
11760 136333 -233397 510222 63338 -243692 210428 158627 -16267 40299 -155961 28496
11749 21123 -202571 -31182 47722 38977 68283 50723 248866 53042 485719 363909 -122348
11737 272787 -52166 -108744 -52710 83306 329476 -131890 221332 41141 -42449 -45772 59218
11725c00724A67550H1166c966A39858a23902m7644A56733P4090a63470A10483
11714B80252a21137J3322K0947A08694j3230j1074h4300L8516j46744c3753J2967
11703b0786o2183F2209J62846a42400k2912B02302f9504B06408l8945A0449i6380
11691B44997J0874j00716b6544C42566F4672C335L12159A41104i6044B16080J7503
11680B33583o7335J54109A11333m0658a84790B05649I6653K40068A16234k825
11670A13409a93976A62993L8374G0473a07843r228a2901q0308L5779r3762H4279
11658d7761j12067C21796H3679i2834C4743J59675j4057a67319F9265b0594e422
11646b6953o8107m9894G9410J67843G2000L1513a36684c3693A06787C7302b21620
$$ plain form
11725 -300724 167550 81166 -3966 139858 -123902 -171546 156733 230823 -163470 110483
11714 280252 -121137 -107815 -86868 108694 95464 84390 -84300 -45784 -192528 -33753 -20786
11703 -20786 -82969 62209 225055 -142400 -165312 202302 -69504 206408 167463 10449 -96380
11691 244997 255871 155155 -26544 342566 64672 3335 315494 141104 -96044 216080 233583
11680 233583 166248 320357 111333 70675 -184790 205649 96653 336721 116234 113409
11670 113409 -193976 162993 201367 70473 -107843 -117071 -12901 -93209 -57430 -151192 84279
11658 -47761 -159828 321796 83679 -92834 34743 194418 180361 -167319 69265 -20594 -5422
11646 -26953 -95060 -144954 79410 247253 72000 103513 -136684 -33693 106787 37302 -221620
11634A47212F8790G776a02747F5276i0499F673e4968J2717H0080J34511a06433
11622B21408a51127A27780M9d8979m4548A39806L6210n4456A9453L02354m6704
11611B75103l1351o8232a33534B41592J7122F3154J13421l7942J7865b70867A17918
11599E889J92056p6415b2715H708b82696G5666b81106I9350J1143I683L1507O1159
11587A02349k7677K53708A56318o6039J84403A21214J65120A2410J06424J44269
11577B63103g1748j7765A66834C4528e15892a9184H6882c1723H5756J72659a33815
11565A37686a47456A33742c06904A48594C3384K71032A39244a139j08119J2421
11555i6837B8228K4168i1867a321j6039j75992B59619J2222H4351K4606b30168
$$ plain form
11634 147212 68790 7776 -102747 65276 -90499 6673 -54968 -42251 80080 214591 -106433
11622 221408 -151127 127780 127829 -48979 -93527 139806 176016 121560 19453 321807 275103
11611 275103 243752 175520 -133534 241592 258714 63154 176575 138633 156498 -270867 117918
11599 5889 197945 121530 -22715 8708 -282696 75666 -281106 99350 110493 9683 41190 102349
11587 102349 74672 328380 156318 90279 274682 121214 286334 12410 118834 263103
11577 263103 -71748 -89513 166834 34528 -515892 -19184 86882 -31723 85756 258415 -133815
11565 137686 -147456 133742 -306904 148594 33384 304416 139244 -1139 -109258 -96837
11555 -96837 28228 52396 -91867 -1321 -17360 -193352 259619 271841 84351 108957 -230168
11543h6840B09421i1078A04740d997k75044B94311c716f82l0772B59037c8990
11531C56218q3007A16906J58957d3589B91793b7023A09036D476M9082i4349A78045
11519B25909a32136l6989C90500A45744gA43833k5506h9287A15795O2021K2862
11508B00678q000d2258A39397h8454C3143L82159I5622J64574G1844K5722A8475
11496d6089n7603F5622J00640K22699A28394L5613p7970e1592B41754e4655F9274
11484B22981p2024P3824I6419J50141H8362J18423J53804D4479L71660K74374
11474F90513A48344J2247l5992J40036a40899G4504j7257J73970G2155J05353
11464A77508J50432H5287O0086a80756B44885a15529F4800J18695Q3789F7927
$$ plain form
11543 -86840 209421 -91078 104740 -4997 -280041 294311 -3716 -682 -31454 259037 -38990
11531 356218 273211 116906 275863 -43589 291793 -27023 109036 4476 53558 -94349 178045
11519 225909 -132136 -169125 390500 145744 -7 143833 118327 -89287 115795 177816 200678
11508 200678 192678 -42258 139397 -88454 33143 415302 95622 260196 71844 97566 18475
11496 -46089 -103692 65622 166262 388961 128394 164007 86037 -51592 241754 -54655 69274
11484 222981 150957 224781 96419 246560 88362 206785 360589 44479 416139 690513
11474 690513 148344 160591 124599 264635 -140899 74504 57247 231217 72155 177508
11464 177508 327940 85287 145373 -180756 244885 -115529 64800 183495 267284 67927
11453C13624j3621o8537j08993K12491b6192A20702K3776a07927A65076F8651
11442A46457O1998H0573J35025q4945K16805G1954a37790A72514L09533k30476
11432B51571G4578a65387F2668K23856E103b8978p2915A89683E4306j2745d8821
11420C5085O3720g8527j24597J0472k9515e4293A47914e0949B49548A22282j968
11409A20314K664m808J23278D7524c34815A56661C9787g5745j89436A14098J08422
11398B22520f5233A8284M3368J1803b56205A4028K07078a37778A77025a11391
11387B03342F144c28769A98083P1934k4619o1017K6094R1692p5679a59163E5834
11375A22534K9096a3659n0332q2710o0758M7053G8678J93877G2717a34843j72350
$$ plain form
11453 313624 300003 231466 122473 334964 -26192 120702 144478 -107927 165076 68651
11442 146457 208455 80573 215598 130653 347458 71954 -137790 172514 482047 251571
11432 251571 74578 -165387 62668 286524 5103 -28978 -101893 189683 54306 41561 -48821
11420 35085 98805 -78527 -203124 -192652 -222167 -54293 147914 -50949 249548 122282 120314
11409 120314 122978 118170 241448 47524 -334815 156661 39787 -75745 -265181 114098 222520
11398 222520 -65233 18284 61652 73455 -256205 14028 221106 -137778 177025 -111391
11387 203342 6144 -328769 198083 270017 245398 184381 210475 302167 226488 -159163 55834
11375 122534 151630 -13659 -63991 -146701 -207459 -160406 78678 272555 72717 -134843 -307193
11364c07193G0605K89379a4033A9097P5176K30176a05091E0046K01755b85494
11353E9351a81415P4162A78387a21843a542j01004D4903Q152N1401d3038k15286
11342b58324A28393i8309D0626d5004a8041l55034g8368n8722A20486C5999i0465
11330B14627F6672d9671A81413c80484a70991e5797B09083E9845b2239F0753a70895
11318c06632d4617k83695h848H21M6952a28510d1301D0148J21723i2910b9421
11306I1422B072i6124A8050a30135r7654B13291d5038A94998b72025R7301a2016
11294A94815i2027A44753C3419J11523a92186N6473j52089A21898n8642J99851
11284B63107i4104A14298N7286c56312A3362Q4106g7588a0539o9347k09660f969
$$ plain form
11364 -307193 70605 359984 -14033 19097 94273 324449 -105091 50046 251801 -285494
11353 59351 -181415 -107253 178387 -121843 -1542 -102546 44903 53055 104456 -43038 -258324
11342 -258324 128393 -98309 40626 -45004 -18041 -373075 -78368 -137090 120486 35999 -90465
11330 214627 66672 -49671 181413 -380484 -170991 -55797 209083 59845 -22239 60753 -170895
11318 -306632 -44617 -328312 -8848 821 47773 -128510 -41301 40148 161871 -92910 -29421
11306 91422 2072 -96124 18050 -130135 -227789 213291 -45038 194998 -272025 -174724 -12016
11294 194815 -92027 144753 33419 144942 -192186 -135713 -287802 121898 63256 263107
11284 263107 -94104 114298 171584 -356312 13362 97468 -77588 -10539 -79886 -289546 -6969
11272A57585a21109N1775n5288c3651F7642l2217a1225r1949C38352c10398A52148
11260b27793g1455j1044j24166A97189d12915f4878m4849q26B48220d4487A27409
11248f5568a1779j07838c4086A8037K63623C7976a91470f4197J1212A87846M1258
11237B29104m8891h5447a0594C6373h9413l6144C2368J07320b98004D0138f5463
11225a50547D2026h7303F4348C0573b79524h6414L8270C7032C392J24397g5408
11213c21025J21006r217d8484o761n6813C18339j14694o4905M6301q7613J9967
11202A17395H14a78507o2069N9117A4074K23080a20094M7349l50627a70568j31235
11191c01803A33985i7694F9701K3028d7035A7979a55587f9345E62965A99742b47992
$$ plain form
11272 157585 -121109 -69334 -124622 -33651 67642 35425 -11225 -103174 338352 -310398 152148
11260 -227793 -71455 -82499 -206665 197189 -412915 -64878 -109727 -110553 248220 -44487 127409
11248 -65568 -11779 -119617 -34086 18037 281660 37976 -191470 -64197 -52985 187846 229104
11237 229104 180213 -85447 -10594 36373 -89413 -125557 32368 139688 -298004 40138 -65463
11225 -150547 42026 -87303 64348 30573 -279524 -86414 -48144 37032 3392 127789 -75408
11213 -321025 -200019 -209236 -48484 -55245 -112058 318339 203645 138740 185041 97428 117395
11202 117395 814 -178507 -240576 -181459 14074 237154 -120094 -72745 -423372 -170568 -301803
11191 -301803 133985 -97694 69701 92729 -47035 17979 -155587 -69345 562965 199742 -247992
11179c41701J66938b0645E0026b16422A30515k25g8143c2130l1772K4241A28454
11167a03831j55313H7394a3370j38345C170b78326J14725e2128p2719C7116b46927
11155C6896a23600A70420b47725L9197R4261c1530B62090a3461E9148c2139A47803
11143a98423a5702o2400Q016B385L50388C3863p278b16462D29721h7684B50026
11131A31589a26691l4956f8555A70128f5188q6881c9922B95542j47270K05033
11121C53305a50975E7292K7188c1995B96418e8774C90587c9777p8360B63573h3307
11109B18400d6583C23043L8663J34833A83689A8603L77586K55366B74972G3078
11098D05627E236L4477Q6973n4734f1624B68332L48721A42869Q3114M7743j11289
$$ plain form
11179 -341701 -174763 -20645 50026 -216422 130515 130290 -78143 -32130 -63902 -39661 128454
11167 -103831 -259144 87394 -13370 -151715 3170 -278326 -163601 -52128 -124847 37116 -246927
11155 36896 -123600 170420 -247725 -208528 -114267 -31530 262090 -13461 59148 -32139 147803
11143 -198423 -15702 -78102 -70086 2385 352773 33863 26585 -216462 429721 -87684 250026
11131 131589 -126691 -161647 -68555 170128 -65188 -152069 -39922 295542 148272 353305
11121 353305 -150975 57292 84480 -31995 296418 -58774 390587 -39777 -118137 263573 -83307
11109 218400 -46583 323043 361706 496539 183689 18603 396189 651555 274972 73078
11098 405627 5236 39713 126686 71952 -61624 268332 617053 142869 225983 273726 162437
11087A62437G9950K4048J91812B6644K27304J67191k05165o8301J23608K1223
11077B92504m0911J39782j10047E4032N4920D6058J41193l3145O9630a76962B92112
11065D92064k24482I2346K73024j26488K55418O2134l2670L10721l61352K02819
11055F75952k38484J11092p932J69508K82005l72271l5345J02377l18888L71027
11045G39041k3253k00891J80651k08577M41821D54259L66167p8322J8473k79590
11035D80987J04661K3562L13661l17760J26506j89344J9279p9373L11305M21032
11025A214516m44083m3405o3752K51147k74561m6901J61943j67953l4409O6715
11015F19257p7330k4094K03396j62637B35872J28660J96157m1262j50029J0992
$$ plain form
11087 162437 79950 103998 295810 26644 253948 421139 215974 147673 271281 292504
11077 292504 251593 391375 281328 54032 108952 46058 187251 154106 223736 -176962 292112
11065 492064 267582 92346 365370 238882 494300 556434 523764 834485 473133 675952
11055 675952 437468 548560 540628 710136 992141 619870 584525 686902 368014 739041
11045 739041 715788 514897 695548 486971 928792 454259 820426 742104 760577 480987
11035 480987 585648 609210 922871 605111 731617 542273 561552 482179 793484 1214516
11025 1214516 770433 727028 663276 914423 639862 592961 754904 586951 552542 619257
11015 619257 541927 517833 721229 558592 235872 364532 560689 519427 369398 380390
11005C80390K14739o772J79982r6657r2214M04171k12785C67950M72008j54637
10995F85321q4175J47809n2885J41139r4993l31717O40159m01702O40261o07134
10985F82083M20653k21223K31329q741K05395j17269j09107L11372l6416M65637
10975A823713j51542P67246J85094M17176n12010L76452j21984n44069n5706p84851
10965A399519K94048J53789k05026n0730K79986M8571P6043k60347P9688M5447
10955A860988j92666P1049k08826l74752k06423p4643p0640j65063o8810j64272
10945D05942j25253M5574H7100J72698e9332A95455J29183o2043o0958p3311a4350
10933E99898j41142f5754D1518n611P155L25085A37281d8704r6744B27982o6709
$$ plain form
11005 380390 595129 588357 768339 671682 579468 983639 770854 367950 839958 685321
10995 685321 601146 748955 696070 837209 742216 410499 1050658 648956 1289217 682083
10985 682083 1102736 881513 1112842 1104101 1309496 1192227 1083120 1394492 1358076 1823713
10975 1823713 1672171 2439417 2624511 3041687 2529677 2906129 2784145 2240076 2184370 1399519
10965 1399519 1693567 1847356 1642330 1591600 1871586 1920157 1996200 1735853 1815541 1860988
10955 1860988 1668322 1739371 1530545 1155793 949370 874727 804087 639024 570214 405942
10945 405942 280689 326263 87100 259798 -59332 195455 324638 262595 201637 128326 -14350
10933 599898 458756 -65754 41518 35907 43062 368147 137281 -48704 -145448 227982 161273
10922A61273o1888Q3545a02695N1180a2978n5097k92542A60647a06191j2445H7774
10910A70283C6840L1137M8933a23579J0466A75634e3870I8376i0287k33306A02873
10898a21836j28051f3942p6826A10447J50176h41A09017l0754d39550A35229Q140
10887A43369E5455A0387Q5983P9312K27216A17700c6751r1361J7144J9766L4244
10876e6958A27759J05120F668b40873a2929I7351e85242a02712F5773b8087k18201
10865b46288J17359k34904c6274a2571B26873c2790a3205D7174Q6242i7598B82095
10853b23017O6964j7920F0926d49068A44798C9866g8713B15127m365I645b1212
10841B18130b72505b6825a1442m29306g4722G8499b71969k003C85708b2399C9983
$$ plain form
10922 161273 99385 182930 -102695 -51515 -12978 -68075 -360617 160647 -106191 -118636 87774
10910 170283 36840 67977 116910 -123579 -113113 175634 -53870 98376 -90287 -323593 102873
10898 -121836 -249887 -63942 -140768 110447 260623 -841 109017 78263 -439550 135229 143369
10887 143369 55455 10387 96370 175682 402898 117700 -36751 -128112 -110968 -91202 -56958
10876 -56958 127759 232879 6668 -240873 -12929 97351 -585242 -102712 65773 -28087 -246288
10865 -246288 -128929 -363833 -36274 -12571 226873 -32790 -13205 47174 133416 -97598 282095
10853 -223017 -156053 -173973 60926 -449068 144798 39866 -78713 215127 210762 9645 -21212
10841 218130 -272505 -26825 -11442 -440748 -74722 78499 -271969 -273972 385708 -22399 39983
10829a20075j46603d6188H8856g4591A83850c5124A10007g5966K9712G8995J47479
10818B26474b01255B83134b20929n047N6514C2673B608f6015k44844d1690k01051
10807b42741J06587a4016k4246A44488a91850D7319g7408F5455K9082a37834o153
10796a43987B6937c59903G2598J76710f776k67300e5898j42131g0570j52072L3822
10785a88820j05043F2589a31454H4355l1548N6407J30344J64276a41417f1784
10774A53353J84733b58733A7517d52455A45348C7404A2428K34543b43696B07759
10763H6107a66387j14618K0060C46591a3598j02114K0581K0347j6937E4714a21578
10751A79940b24720c5567r6239C7570b18756F3411i6439d038p3243A75822N546
$$ plain form
10829 -120075 -266678 -46188 88856 -74591 183850 -35124 110007 -75966 -46254 78995 226474
10818 226474 -201255 283134 -220929 -225976 -169462 32673 2608 -66015 -310859 -41690 -242741
10807 -242741 -136154 -14016 -38262 144488 -191850 47319 -77408 65455 94537 -137834 -143987
10796 -143987 26937 -359903 72598 249308 -6776 -274076 -55898 -198029 -70570 -222642 -188820
10785 -188820 -293863 62589 -131454 84355 52807 109214 239558 403834 -141417 -61784
10774 153353 338086 -258733 17517 -452455 145348 37404 12428 246971 -243696 207759
10763 86107 -166387 -281005 -260945 346591 -13598 -115712 -95131 -74784 -91721 54714 -121578
10751 179940 -224720 -35567 -131806 37570 -218756 63411 -96439 -4038 -77281 175822 181368
10740A81368b4974k30499B54724E6636p521a57137C74264a43719C7257Q5877b51803
10728A26434a95038B65944r6509b79218J38838m3305j01735F2121L9392N8720
10718A60233F5631K08085a00559A5855J1851P5015k6632l5369b9425B0864c15772
10706B19820I3341R9668b03911A45272o866b01018A02296p46g2837k54849M8999
10695b78687j89801a77294c8277k69644a24825b4017l20982a30239j9265B00226
10684f7705f522I7117b08048A49327b11258b8374I4125c01636A09268a6927l15639
10673c32566A36786a4816j52818d5044k74208A24672b6028A776K1494c42136A08584
10661E1899f5447B09666a46995j13931A6032a97086g6346a612k5927k78723b9235
$$ plain form
10740 181368 -24974 -255473 254724 56636 49115 -157137 374264 -143719 37257 123134 -251803
10728 126434 -195038 265944 169435 -279218 -140380 -183685 -285420 62121 101513 160233
10718 160233 65631 273716 -100559 15855 27706 102721 76089 40720 -29425 20864 -315772
10706 219820 93341 193009 -203911 145272 138406 -201018 102296 101550 -72837 -327686 -278687
10695 -278687 -468488 -177294 -38277 -307921 -124825 -24017 -344999 -130239 -149504 200226
10684 -67705 -6522 97117 -208048 149327 -211258 -28374 94125 -301636 109268 -16927 -332566
10673 -332566 136786 -14816 -167634 -45044 -319252 124672 -26028 1776 23270 -342136 108584
10661 51899 -65447 209666 -146995 -260926 16032 -197086 -76346 -1612 -27539 -306262 -29235
10649a50128g1193J7287A10468C533N2026f3601H9633J43691f7243j51094B13433
10637c7278k12703d0817j05565e7705o4456q1420B7766J03962a94398C4323a08776
10625a47750H0814c7296A11776a26597j5786b9470o8444b3234q5991j68869a19096
10613E1879a00770A14517b90925M8553a09206B4174f7494k08413f763I7676c15992
10601A29785l5292a26441m5796M6747M0976j50294O1552r9938a14346A3680J06265
10590A19945b06752A4575O8852J63764a7108C3762O8346a29140a3095A26476C9490
10578B06194G5438C6951a21596R750j84688A03697B7236J56548H0612a04672a7866
10566C53386c63616N9271k9166a6199j29937j4138a3022n5075c1088l7967a3414
$$ plain form
10649 -150128 -71193 -53906 110468 3533 55559 -63601 89633 233324 -67243 -218337 213433
10637 -37278 -249981 -40817 -146382 -57705 -122161 -203581 27766 131728 -194398 34323 -108776
10625 -147750 80814 -37296 111776 -126597 -142383 -29470 -97914 -23234 -109225 -278094 -119096
10613 51879 -100770 114517 -290925 -242372 -109206 24174 -67494 -275907 -6763 97676 -315992
10601 129785 94493 -126441 -172237 -125490 -84514 -234808 -173256 -273194 -114346 13680 119945
10590 119945 -206752 14575 83427 247191 -17108 33762 102108 -129140 -13095 126476 39490
10578 206194 75438 36951 -121596 -111846 -296534 103697 27236 183784 80612 -104672 -17866
10566 353386 -363616 -304345 -333511 -16199 -146136 -160274 -13022 -68097 -31088 -69055 -13414
10554D66975A40419a9248l90256B32344i7473O923C02361f5312m9273I338a71284
10542A4785K624J84080b54968I328L0341a71161N1174j5461a6929o5904e924o1416
10530f7340j42073D2615c52413a2074A90150f02288E0354c07798A80616f071l96923
10519d02994a05319C12640A15476L03776A13115h1612A70239b53639B07022B5477
10508c46881L6885a37316A96482f0303H937c80693A54320b39046P0367d7532j94753
10497b42285i9714H0488J106b73347J16151J1534P1654E8930J53115f4090Q140
10486e5950B32140P8071a05563D11735j410K7408M85377l31333A58544L21331
10476D79875E2029J17146p8974J42224J47396A60996J69855A6000a9826k26131
$$ plain form
10554 466975 140419 -19248 -409504 232344 -97473 -90550 302361 -65312 -114585 9338 -171284
10542 14785 17409 201489 -254968 9328 39669 -171161 -119987 -135448 -16929 -82833 -5924 -67340
10530 -67340 -209413 42615 -352413 -12074 190150 -602288 50354 -307798 180616 -6071 -402994
10519 -402994 -105319 312640 115476 419252 113115 -81612 170239 -253639 207022 25477
10508 -346881 -309996 -137316 196482 -60303 8937 -380693 154320 -239046 -168679 -47532 -242285
10497 -242285 -99714 80488 81594 -273347 -157196 -145662 -74008 58930 212045 -64090 -55950
10486 -55950 232140 310211 -105563 411735 410325 437733 923110 591777 158544 479875
10476 479875 52029 169175 90201 232425 379821 160996 330851 16000 -19826 -245957
10466b45957A23404a20783p3925r3069k9628A80790H282a12661o4260J2818B10356
10454C2794a2255A17767E0802d430j60945J2236F6527j5263K3965b6552A50601
10442a43631G4900j248l0228a74226q429a4448k8221I9115b55236j2975B74962
10430c06189b8266H3179b85325J01159H4275K92717a92394b6364B83110d27220
10419a23754K0100D5876J25789k9014a71427b736A18650a20992d5391o1953p6154
10408a83498c4530A69448a38023A09428b5858j2175j50770j64119A10800b4956
10397a50059A11895N3114D3633J02315F5536L1838M1794K12325B6079J52466l4909
10386A43636b37908d7753q166m2660C62739e2757A46211L68589A44146K16451
$$ plain form
10466 -245957 123404 -120783 -194708 -287777 -317405 180790 8282 -112661 -176921 -164103 210356
10454 32794 -12255 117767 50802 -4430 -165375 -153139 66527 51264 75229 -26552 150601
10442 -143631 74900 73652 43424 -174226 -182655 -14448 -42669 99115 -255236 -268211 274962
10430 -306189 -28266 83179 -285325 -184166 84275 376992 -192394 -26364 283110 -427220
10419 -123754 -103654 45876 171665 142651 -171427 -2736 118650 -120992 -45391 -107344 -183498
10408 -183498 -34530 169448 -138023 109428 -25858 -38033 -188803 -352922 110800 -24956
10397 -150059 111895 165009 43633 145948 65536 97374 139168 351493 26079 178545 143636
10386 143636 -237908 -47753 -55919 -98579 362739 -52757 146211 514800 144146 360597
10376C60597b7692n6840B45100L55670B56155q617K89653H9270L065M69412p5267
10365D86480A95097K42743H1805J31986D4768L25909n1551a54178A81110B923
10354B59720m9541J0103L79914j67641L18084l24418j12643H4905L25089j37892
10344B72102o999N9493K1960E5102K48196J21023A30443N6611K56801B03077c9614
10332c9727B1148R5989K91149j25581I8055j9197B973M16163j39721L80816i5392
10320C28069A03096I984J59263F2861L26798p2733A57786a66064f3055A04602
10309F889L04241C3969g2962A81013d84355h478H4690C1088J11795B1902c3528
10297H8393d1734m5830c8369p4029B7004c5292j5540m86716A50274A052K46479
$$ plain form
10376 360597 -27692 -84532 245100 600770 256155 247538 537191 89270 92335 561747 486480
10365 486480 195097 437840 81805 213791 44768 370677 319126 -154178 181110 2923
10354 259720 210179 220282 600196 432555 750639 426221 313578 84905 409994 272102
10344 272102 265103 324596 346556 55102 303298 424321 130443 187054 443855 203077 -39614
10332 -39727 21148 117137 408286 282705 98055 78858 2973 419136 279415 660231 -95392
10320 328069 103096 9984 169247 62861 389659 316926 157786 -166064 -63055 104602
10309 6889 311130 33969 -72962 181013 -484355 -8478 84690 31088 142883 21902 -33528
10297 88393 -41734 -87564 -38369 -112398 27004 -35292 -50832 -537548 150274 1052 247531
10286B47531a15804k33327B24312a93791F2688b99723E0678J40198f9862B5646
10275b7400A72091f610l76879B18174b4090A28586g7870l6338B75976b315B98027
10263A21221f3783A53813o2922J78847r3380M37778A74687a79575C09447A2153
10252c98446B30134a76187C52376I1556j7248c73004B54368b01281i6748r6284
10242a93032k86157D8425L6923B1460r029R417J1890J08980b14168D17317A32925
10230A37554a72739r2061a12193d9997A6316J08476b7600q0488A4508b08367b6736
10218a13282l03526J53491A3222L8137b44580M2296J2638a2188H4723C9964h394
10206f9817j38520B7847b99659f1841a6163j06778n0698A83732C0762a19173c4110
$$ plain form
10286 247531 -115804 -349131 224312 -193791 62688 -299723 50678 190876 -69862 25646
10275 -27400 172091 -6610 -383489 218174 -24090 128586 -77870 -114208 275976 -2315 298027
10263 121221 -63783 153813 90891 269738 176358 614136 174687 -179575 309447 12153
10252 -398446 230134 -176187 352376 91556 74308 -373004 254368 -201281 -96748 -193032
10242 -193032 -479189 48425 85348 21460 12431 21848 33738 142718 -214168 417317 132925
10230 137554 -172739 -264800 -112193 -49997 16316 124792 -27600 -108088 14508 -208367 -26736
10218 -113282 -416808 -263317 13222 51359 -244580 -202284 -189646 -12188 84723 39964 -8394
10206 -69817 -208337 27847 -299659 -61841 -16163 -122941 -173639 183732 30762 -119173 -34110
10194e7360A76691c11307h7506j43520d5845l32593g1398B15862f6367n8105B30613
10182F8812d8086j38045N6352l396o1454b4822k01391p3210B4153a57059k69625
10171d26684a20169A97077b249m8964j28237j5878B6242L7281a64628B20196a482
10159D0380J76689m445b85186i1153K3505c13A76688a29883D8698Q0800a32778
10147B6990i471E7513K59192G4109b79383Q7737p4357J11714g227G0423g1399
10135i319E6025B7416a72265l07912A14121c0035A48618a92580g0466C7550b67063
10123b03796d7761j90109M9982L0267c8860j65540h884k28093J15407A17282e4694
10111B99610D8157b00986B27419I5846c52145B7240Q0738A31a4117j4312o5530
$$ plain form
10194 -57360 176691 -311307 -87506 -231026 -45845 -378438 -71398 215862 -66367 -124472 230613
10182 68812 -48086 -186131 -129779 -133175 -194629 -24822 -226213 -299423 24153 -157059 -426684
10171 -426684 -120169 197077 -2249 -51213 -179450 -195328 26242 63523 -164628 220196 -1482
10159 40380 217069 212624 -285186 -91153 -67648 -313 176688 -129883 48698 129498 -132778
10147 26990 -9471 57513 316705 74109 -279383 -191646 -266003 -154289 -7227 70423 -71399
10135 -9319 56025 27416 -172265 -480177 114121 -30035 148618 -192580 -70466 37550 -267063
10123 -203796 -47761 -237870 -187888 -157621 -38860 -204400 -8884 -236977 -121570 117282 -54694
10111 299610 48157 -200986 227419 95846 -352145 27240 107978 131 -14117 -28429 -93959
10100i3959c3560C16219b99087a35797l04126E5711k2663N2751M9188i8413I2693
10088b62615B73685A11280c19656a53817l0354c0917A65750c76163a01394p6739
10078a78133n3200L3255j34576A9915b32461b4176n6814K0700H5070b48409Q5194
10067a63215A73262A6607a24949G7733a63741A31387d978I9848A2452a40392k19332
10056c59724a16795A10267N8804a61245D3604J98751B8754c0520k70023j49359
10046d49902a24921o2361j29875a05302j65752J30755j14793j08167F7111b38271
10035c03783A10370b42620f4844l08543J04994A28478l6572Q0393C9130a34806
10024A17655i4449B84924G6361g7921A14466b62637a01358C2362c58725F332a84022
$$ plain form
10100 -93959 -33560 316219 -299087 -135797 -439923 55711 33048 85799 134987 -98413 92693
10088 -262615 273685 111280 -319656 -153817 -184171 -30917 165750 -376163 -101394 -178133
10078 -178133 -231333 -198078 -332654 19915 -232461 -24176 -80990 -60290 85070 -248409 -163215
10067 -163215 173262 16607 -124949 77733 -163741 131387 -4978 99848 12452 -140392 -359724
10056 -359724 -116795 110267 169071 -161245 43604 242355 28754 -30520 -300543 -449902
10046 -449902 -124921 -187282 -317157 -105302 -271054 -140299 -255092 -363259 67111 -238271
10035 -303783 110370 -242620 -64844 -373387 -268393 128478 91906 172299 39130 -134806
10024 117655 -94449 284924 76361 -77921 114466 -262637 -101358 32362 -358725 6332 -184022
10012A30051a24433E423e0941j4048p7410K5574l2878e1165m7083k3377e2329
10000c66974A76622c31207P7670A19292J55308j31959L2294a43049f3139l38936
9990d02075n7060b19152c3540A53309d56466i696m43792D2180a69390c0726l65647
9979c96373A82870i6165k11507A0305f2768j61237E5458J87287a10568O11k9881
9968a39838B05096b93595M8610C28554b61471e1215J6775j17047B06151b9097
9957a35104A20326b04148I628Q0052C7125a49047l417F9211a64296B59616I9679
9945e031H389K48549a51529A14087a45876p2505h2948j97240J29558B3520e0758
9933f2402b2865A49869d0659m46873h6788J1470L3609B09268p5159l1075d6598
$$ plain form
10012 130051 -124433 5423 -50941 -64989 -142399 -116825 -149703 -51165 -98248 -121625 -52329
10000 -366974 176622 -331207 -253537 119292 274600 142641 174935 -143049 -63139 -402075
9990 -402075 -459135 -219152 -33540 153309 -456466 -9696 -453488 42180 -169390 -30726 -396373
9979 -396373 182870 -96165 -307672 10305 -62768 -224005 55458 242745 -110568 -109957 -139838
9968 -139838 205096 -293595 -244985 328554 -261471 -51215 -34440 -151487 206151 -29097
9957 -135104 120326 -204148 9628 89680 37125 -149047 -152464 69211 -164296 259616 99679
9945 -5031 8389 256938 -151529 114087 -145876 -218381 -82948 -280188 -150630 23520 -50758
9933 -62402 -22865 149869 -40659 -487532 -86788 -75318 -41709 209268 134109 103034 -46598
9921a06519C38188a66472b7839b882k15111j3572C72768A28889d6562C40630F1554
9909B78213j37923a74401j80807j37271I3391m0013b85064E270a75288A12759
9898a61079j814c0381k13348k9954A18598a32035k1397O3942j8721p2283e3041
9886A76283p1167a5437j39236E6317a35175A3018a52405C4174c3388p1204B78847
9874c7074k10958a10770A00389f5811o9014p7617q763c729j90439j7011j45211
9863c56390c104m45492h6435A14000p209e483E6853g7363A46876A5429a10349
9851D026K65303b99903a26583b0974j12024M882B07884Q1792a73882A51984E9332
9839a52674A1378K0538c3317B13493b44697A22803e3744k19131o3476E7152a27534
$$ plain form
9921 -106519 338188 -166472 -27839 -2882 -217993 -231565 372768 128889 -46562 340630 61554
9909 278213 140290 -174401 -355208 -492479 93391 53378 -285064 5270 -175288 112759
9898 -161079 -162893 -30381 -243729 -273683 118598 -132035 -153432 -89490 -108211 -180494 -53041
9886 176283 105116 -15437 -154673 56317 -135175 13018 -152405 34174 -33388 -104592 278847
9874 -37074 -248032 -110770 100389 -65811 -134825 -212442 -221205 -3729 -194168 -211179 -356390
9863 -356390 -3104 -448596 -86435 114000 106791 -5483 56853 -77363 146876 15429 -110349
9851 4026 269329 -299903 -126583 -20974 -132998 -128116 207884 289676 -173882 151984 59332
9839 -152674 11378 31916 -33317 213493 -244697 122803 -53744 -272875 -336351 57152 -127534
9827b86808A08556a81594c9010I2942c91680J47342K8785e2725B75911c5475r8854
9816a34329G342J81325a6498q3804H0275A3044b85737c5607k20962i8876j3582
9805a12458A17106d5445q7997I5317a21402K2293j85074a37366r2434P4066G8277
9793A97225d23787a0589A05113r210D5563K59799A8379m760N0063Q4369o6591
9782H1460h4315B05581a03514b4090p5670j74324a36779C36564a08507H1253e5175
9770A73064A6386O9129e8297n0872A82841a6787l26340H2690b95260g1358N251
9759f6107k45256K4780r910J07527C0821K29685h8361A59347b34818N1231C0589
9747b6585a848k7704L240A8560a81869F3750a99872h5294j36468E8351b42653
$$ plain form
9827 -286808 108556 -181594 -39010 92942 -391680 -244338 -215553 -52725 275911 -35475 -134329
9816 -134329 7342 188667 -16498 -100302 80275 13044 -285737 -35607 -256569 -98876 -112458
9805 -112458 117106 -45445 -133442 95317 -121402 -99109 -284183 -137366 -229800 -155734 78277
9793 197225 -423787 -10589 105113 95903 45563 305362 18379 13619 63682 148051 81460
9782 81460 -84315 205581 -103514 -24090 -99760 -274084 -136779 336564 -108507 81253 -55175
9770 173064 16386 85515 -58297 -109169 182841 -16787 -343127 82690 -295260 -71358 -66107
9759 -66107 -311363 -286583 -296493 -188966 30821 260506 -88361 159347 -234818 -183587 30589
9747 -26585 -1848 -29552 -26312 18560 -181869 63750 -199872 -85294 -221762 58351 -242653
9735a08692B63855a48051l2670A32964c01441A46953E5339c51179a30440e055
9724A37010A0501a8740j79844A35580a75393m3647j36110H5489c31515a12287
9713a06483m7117E1556k2641e5347A61125h3626O081i384A13366d14453A26304
9701a17086K1939j13280d7050B18646b06626Q7067n9269A16243a41098N6377l4610
9690a19331d2617a4837A89005c9054G5336A3221K5535J81896c0778j435A6398
9678a71684i747j18872A42925a57857H7205a10048m7582B51887a07093n4804F903
9666a70963A24887B042a98260C23783h4491A07248d9301a3604A08485i7249q2342
9655a79591C7979b46875a0448j79542b577j51582k4845D45h297C693n03K58607
$$ plain form
9735 -108692 263855 -148051 -180721 132964 -301441 146953 55339 -351179 -130440 -5055
9724 137010 10501 -18740 -198584 135580 -175393 -219040 -355150 85489 -331515 -112287
9713 -106483 -153600 51556 28915 -55347 161125 -83626 -77545 -9384 113366 -414453 126304
9701 -117086 -95147 -208427 -47050 218646 -206626 -119559 -178828 116243 -141098 -84721 -119331
9690 -119331 -42617 -14837 189005 -39054 75336 13221 38756 220652 -30778 -32213 16398
9678 -171684 -9747 -128619 142925 -157857 87205 -110048 -157630 251887 -107093 -161897 6903
9666 -170963 124887 2042 -198260 323783 -84491 107248 -49301 -13604 108485 -97249 -179591
9655 -179591 37979 -246875 -10448 -189990 -2577 -154159 -179004 445 -8297 3693 3190 261797
9643B61797a43333A56698b45651a4862k31817I774a54608H4989a4731j47114r3355
9632b55200J27508g568j02306p1581A34209K7389a00381l0738A3768c31668A1539
9620f2595A46471J45063H573N8459A608h74q744k02366b1026F9109M4006a51965
9607a11729J2300m4883k76084A73087a38079K8675k3666G5205B5172Q1528C5031
9595b76134a07947C6162R0131c40892A36292c01002C0285J14338a2130r8747k97012
9584d07889b6764A3962c25366B64944c10508A66312a19719D57812A0171K40457
9574B50628G4974a56161M2168M0763A28600l5940J05193P5097c39494B36365b72897
9562B24212c35309J24889b3982k30159A39308a30430D8572J839K09346b026j09611
$$ plain form
9643 261797 -143333 156698 -245651 -14862 -246679 9774 -154608 84989 -14731 -161845 -255200
9632 -255200 -127692 -7568 -109874 -181455 134209 161598 -100381 -131119 13768 -331668 11539
9620 -62595 146471 291534 8573 67032 1608 -874 -9618 -211984 -21026 69109 113115 -151965
9607 -111729 -99429 -144312 -420396 173087 -138079 -109404 -133070 75205 25172 106700 35031
9595 -276134 -107947 36162 126293 -340892 136292 -301002 30285 144623 -12130 -110877 -407889
9584 -407889 -26764 13962 -325366 264944 -310508 166312 -119719 457812 10171 250628
9574 250628 74974 -156161 -113993 -73230 128600 92660 197853 272950 -339494 236365 -272897
9562 224212 -335309 -210420 -23982 -254141 139308 -130430 48572 50411 259757 -2026 -111637
9551a11637e1474m3041l21356B40865a22233j09904F1016c20504A98051c5055
9540b68991J13015N7196j67612e5811E6635a95202d8431C815b84663Q1070B9056
9528G454e347k32203j6540j61289a9836A66641M928b00238g7463c6209B1860g0680
9515C1714b58052A8942b53635i285n1288H2042P2928b20183A16597c24097C40059
9503C22545A08315D9635P1828a15385E8825h9791M2355k7078b0025o5303k24419
9492c09747J35788D9479a12208c4665o1478k11378B59851A7838a23650k4576q7590
9481b35816A1722O6041B9212D385J13931E1538a64135o5911d4287J701A9539d06592
9468a12910A5815J81717I8215d0293F5345b13634m6621C6187a18811N2156j14348
$$ plain form
9551 -111637 -51474 -94515 -415871 240865 -122233 -232137 61016 -320504 198051 -35055
9540 -268991 -155976 -98780 -266392 -55811 56635 -195202 -48431 3815 -284663 -203593 29056
9528 7454 -5347 -237550 -254090 -415379 -19836 166641 171569 -200238 -77463 -36209 21860 -70680
9515 31714 -258052 18942 -253635 -9285 -60573 82042 154970 -220183 116597 -324097 340059
9503 322545 108315 49635 121463 -115385 58825 -89791 -47436 -74514 -20025 -85328 -309747
9492 -309747 -173959 49479 -112208 -34665 -96143 -307521 259851 17838 -123650 -148226 -235816
9481 -235816 11722 77763 29212 4385 118316 51538 -164135 -230046 -44287 -42586 19539 -406592
9468 -112910 15815 197532 98215 -40293 65345 -213634 -260255 36187 -118811 -66655 -181003
9457a81003c1041B10011b88627B03827C5329g9423j00167c1392k47881R9529p4088
9446b53832n9311n0503J23146J09880N9302l27266h6368o4194f3016b8803D6311
9434b94990A2106N1331N7260f8871B05260D5784a87636d3817a8793o7728j19792
9423b06313q4734J13755A60949i1608K3846c160I8554b25187D43028d9361j36270
9412a85631a1801A37267e6940F3793G797a41301j524l3396j77003A43015h440
9400b98739A6259K14599G7868J782b37805b3529j09347H0672J26924c5910j67923
9389b03833Q0298n6782G5597P5044b77126g7674b9638A83998D9680a78502J9964
9378a58538c9040G5473b85410f0471o4500A68747c750B4413b54852D6751K12586
$$ plain form
9457 -181003 -31041 210011 -288627 203827 35329 -79423 -179590 -31392 -279273 -179744 -253832
9446 -253832 -313143 -363646 -240500 -130620 -71318 -398584 -86368 -150562 -63016 -28803 46311
9434 -294990 12106 63437 120697 -68871 205260 45784 -187636 -43817 -18793 -86521 -206313
9423 -206313 -291047 -177292 160949 -91608 -67762 -3160 98554 -225187 443028 -49361 -185631
9412 -185631 -11801 137267 -56940 63793 7797 -141301 -142825 -176221 -353224 143015 -8440
9400 -298739 16259 230858 77868 79650 -237805 -23529 -132876 80672 207596 -35910 -203833
9389 -203833 -123535 -180317 75597 150641 -277126 -77674 -29638 183998 49680 -178502 -158538
9378 -158538 -39040 75473 -285410 -60471 -124971 168747 -3750 24413 -254852 46751 259337
9367B59337a72203B09274a51129a8706A48880a42721H8913a77562B08139Q19O1929
9356B70887E259a58374Q336B51613n9010i9589C00975a34204A46409b14878C6460
9344e37911a78522C8099g2935A58404E2786b69164J7922j73236o5189G6960a63379
9332B7735c17679C3949J95805b20939B40723b40725A5861K96286H7667b71451
9321D305b77253j63438q3114a40938j3790G1557K8396b11855c6008q6669B1176
9309c30828J21049I7515M0490b9755H5178e949k98857h4619k75041B9780g4490
9297b66140B32967G5454R4291c04768P9599k49484E7505i4505E1951i569B26440
9285c2428h385j88049A53543g6297J6716j32830c8038k30356B2150a84919b9663
$$ plain form
9367 259337 -172203 209274 -151129 -18706 148880 -142721 88913 -177562 208139 208958 270887
9356 270887 5259 -158374 -150038 251613 192603 -99589 300975 -134204 146409 -214878 36460
9344 -537911 -178522 38099 -72935 158404 52786 -269164 -251242 -424478 -489667 76960 -163379
9332 27735 -317679 33949 229754 -220939 240723 -240725 15861 312147 87667 -271451
9321 4305 -277253 -440691 -523805 -140938 -154728 71557 99953 -211855 -36008 -122677 21176
9309 -330828 -209779 97515 138005 -29755 85178 -5949 -304806 -84619 -359660 29780 -74490
9297 -266140 232967 75454 169745 -304768 -225169 -474653 57505 -94505 51951 -9569 226440
9285 -32428 -8385 -196434 153543 -76297 -59581 -192411 -38038 -268394 22150 -184919 -29663
9273B01797c12346J42783B36549b05362g3746D9494N4605a12268G9059b18381
9262b86j9774A45420R6442b9226j49674B125b92202O5706A99774a63472B24448
9250A29033F0300M2455a88513L436j7242j22844g0046j35231e3041E224b2995
9238I6226c33868a074j47554A25790E8389O6076c11820H0511b71671p0490F2827
9226G9481d43283g0942k02451N0339A99050H8258k3557h8649p9786A29673m8447
9215H1226k5031d49813a49696A48242e7908I1658c70448J45621g3861q7607I6092
9203A2914a89529A96266i5209K2975k26852M6749A19821e409j21685b4833l280
9192b8113F7955J62115o9630i8999B72018d38406b4145r0839k5935O6378B28461
$$ plain form
9273 201797 -312346 -169563 236549 -205362 -73746 49494 104099 -112268 79059 -218381
9262 -286 -20060 145420 241862 -29226 -178900 2125 -292202 -226496 199774 -163472 224448
9250 129033 60300 102755 -188513 -185077 -202319 -325163 -70046 -205277 -53041 5224 -22995
9238 96226 -333868 -1074 -148628 125790 58389 124465 -311820 80511 -271671 -342161 62827
9226 79481 -443283 -70942 -273393 -223054 199050 88258 64701 -88649 -168435 129673 81226
9215 81226 56195 -449813 -149696 148242 -57908 91658 -370448 -224827 -73861 -161468 96092
9203 12914 -189529 196266 -95209 -72234 -299086 -252337 119821 -5409 -127094 -24833 -28113
9192 -28113 67955 230070 160440 -98999 272018 -438406 -24145 -114984 -140919 -74541 228461
9180b56754E3407b26629B7703J55396b40127J10571N7638k3034C81634a18027
9169a57663K5330A80580q9363D3765a8188j66025A41192E3459L8043b51908A22366
9157a41289k5444B04953L7070j18797J55924a28582p6935a3102j08849q3604k3738
9146b29293C1598c8513k52307J18725H2730a34357E1835A5057e1084j27669g7946
9134I908d65311a01033A70589J38610g4868G4535J96501c74098J63762R2642m9222
9123a66916K3355J4509l9218C0836i9725K7584j16588j68164A32261i856k0461
9112c0317r8128j46786c8125j80331B45831F3302K40631A33627b63319L0811i6963
9100A28374g9618c0548p5141B23368f7298j48858K6661F5013J33895a0698A08353
$$ plain form
9180 -256754 53407 -226629 27703 183099 -240127 -129556 -71918 -94952 381634 -118027
9169 -157663 -132333 180580 91217 43765 -18188 -184213 141192 53459 91502 -251908 122366
9157 -141289 -166733 204953 242023 123226 279150 -128582 -205517 -13102 -121951 -205555 -229293
9146 -229293 31598 -38513 -290820 -172095 82730 -134357 51835 15057 -51084 -178753 -77946
9134 9908 -465311 -101033 170589 309199 -74868 74535 271036 -374098 -210336 -117694 -166916
9123 -166916 -143561 -129052 -168270 30836 -99725 -72141 -188729 -356893 132261 -9856 -30317
9112 -30317 -128445 -275231 -38125 -218456 245831 63302 303933 133627 -263319 -232508 -96963
9100 128374 -79618 -30548 -105689 223368 -67298 -216156 -189495 65013 198908 -10698 108353
9088a42593d9819B82656b95424B57601d1409A78401a5969I4404f1257m5648M0459
9077f6446j12286A9050a36131l1447L0261A56140o4513b90745d4953A95383J90649
9066C86032a7218B2756O0316Q0126c07145a47928E9972a84092A86864r532a04836
9054A54997c05415I2337b94011P7583A49000b74784B01028j987p9794b45679K6938
9043b18741c9185I5667b52775A16768d8898j75118N1018J0020F2830a42934m9672
9032a92606I4646a01018J9033j64594a12511B81614a83067o7256d5463j89756
9022b35219h3271a7375l4556A08718d5614E8396n510Q266c80189a27093A40816
9010a68305g4692l28161e0621I1967e5119o3028A93924b07407N3750a710l48723
$$ plain form
9088 -142593 -49819 282656 -295424 257601 -41409 178401 -15969 94404 -61257 -106905 -66446
9077 -66446 -178732 19050 -136131 -167578 -137317 156140 91627 -290745 -44953 195383 386032
9066 386032 -17218 22756 83072 163198 -307145 -147928 59972 -184092 186864 177332 -104836
9054 154997 -305415 92337 -294011 -216428 149000 -274784 201028 199041 119247 -245679 -218741
9043 -218741 -39185 95667 -252775 116768 -48898 -224016 -172998 -162978 62830 -142934 -192606
9032 -192606 94646 -101018 -81985 -246579 -112511 281614 -183067 -250323 -45463 -235219
9022 -235219 -83271 -17375 -51931 108718 -45614 58396 52886 61152 -380189 -127093 140816
9010 -168305 -74692 -402853 -50621 91967 -55119 -118147 193924 -207407 -153657 -1710 -350433
8999c50433I8668f8320C3186J05392a08112F3127a47339d2164k06713I3908d03198
8987A3837J19424L303a87976a056l82543J64465e2136A37204O0572d1742Q383
8976c3359p1354C87647a38079p702L0977j16930A35014m1989Q8887q0678a73552
8964i4035a3424k3434j35226A35137E5612c8521j60121R6500B25742c0869p0561
8953a01430H7974a86269e7815k58422M8749A7450a75490h7654B57861a31831A38966
8941c39820A95880b1077j77879P0044A43045B8397K51719A25920e0002J1189d947
8929a00614H7599C1083A576R0337J25569Q22773K633681M293707K547258C281841
8918F75575N6488j65980k45907c849k00555B09660m050o0599J29490j31998m3136
$$ plain form
8999 -350433 98668 -68320 33186 138578 -108112 63127 -147339 -42164 -248877 93908 -403198
8987 13837 133261 136564 -187976 -1056 -383599 -219134 -52136 137204 197776 -41742 -33359
8976 -33359 -104713 387647 -138079 -145781 -114804 -231734 135014 93025 181912 101234 -173552
8964 -94035 -13424 -36858 -172084 135137 55612 -38521 -198642 -102142 225742 -30869 -101430
8953 -101430 87974 -186269 -57815 -316237 -267488 17450 -175490 -87654 257861 -131831 138966
8941 -339820 195880 -21077 -198956 -128912 143045 28397 280116 125920 -50002 -38813 -4947
8929 -100614 87599 31083 1576 91913 217482 1040255 3673936 7967643 10514901 3281841
8918 675575 732063 566083 320176 -3849 -204404 209660 205610 145011 274501 142503 99367
8907I9367K48658a85446C18610A25945a54506A24923q543a03488L4902o40l8293
8896a07519k14043P5692f8642A26417C1734L3432J64625a69367j09442g0139A75454
8884c55442B19651l7769m3569c58707B7717b28939m4243j30826P091D8220f000
8872g4554E0435a55988p2748J04848A96769b67302A73992E5251B347g7506A74609
$$ plain form
8907 99367 348025 -185446 318610 125945 -154506 124923 116380 -103488 -68586 -69226 -107519
8896 -107519 -321562 -245870 -68642 126417 31734 65166 229791 -169367 -278809 -70139 175454
8884 -355442 219651 181882 138313 -358707 27717 -228939 -273182 -404008 -396917 48220 -6000
8872 -74554 50435 -155988 -228736 -123888 196769 -267302 173992 55251 2347 -77506 174609
$$ [...]
##END NTUPLES=NMR SPECTRUM
##END=
