##TITLE=AC1609_PANGN13339_8316979_mCgYCGTRdA
##JCAMPDX= 6.0         $$ Bruker NMR JCAMP-DX V2.0
##DATA TYPE= NMR SPECTRUM
##DATA CLASS= NTUPLES
##ORIGIN= BRUKER
##OWNER= Administrator
$$ 1.72 TOPSPIN		Version 2.1
$$ 2013-11-10 00:59:32.971 -0800  Administrator@X
$$ Compression mode = diff/dup
##.OBSERVE FREQUENCY= 400.02188249412
##.OBSERVE NUCLEUS= ^1H
##.ACQUISITION MODE= SIMULTANEOUS (DQD)
##.ACQUISITION SCHEME= undefined
##.AVERAGES= 64
##.DIGITISER RES= 22
##SPECTROMETER/DATA SYSTEM= spect
##.PULSE SEQUENCE= noesygpps1d.comp
##.SOLVENT NAME= COFFEE_meoh
##.SHIFT REFERENCE= INTERNAL, COFFEE_meoh, 1, 14.96088
##AUDIT TRAIL= $$ (NUMBER, WHEN, WHO, WHERE, PROCESS, VERSION, WHAT)
$$ ##TITLE= Audit trail, TOPSPIN		Version 2.1
$$ ##JCAMPDX= 5.01
$$ ##ORIGIN= Bruker BioSpin GmbH
$$ ##OWNER= Administrator
$$ $$ E:\/data/COFFEE/nmr/AC1609_PANGN13339_8316979_mCgYCGTRdA/12/pdata/1/auditp.txt
$$ ##AUDIT TRAIL=  $$ (NUMBER, WHEN, WHO, WHERE, PROCESS, VERSION, WHAT)
(   1,<2013-11-10 00:59:28.069 -0800>,<Administrator>,<X>,<go>,<TOPSPIN 2.1>,
      <created by zg
	started at 2013-11-10 00:47:58.963 -0800,
	POWCHK enabled, PULCHK disabled,
       configuration hash MD5:
       C8 4E 4E 5D D3 5C D8 9E 9F 52 82 E0 59 8A DE 15
       data hash MD5: 64K
       9B 57 E2 0F E0 2F 39 78 E2 C0 5D A9 F9 80 85 99>)
(   2,<2013-11-10 00:59:30.965 -0800>,<Administrator>,<X>,<proc1d>,<TOPSPIN 2.1>,
      <Start of raw data processing
       efp LB = 0.3 FT_mod = 6 PKNL = 1 PHC0 = 0 PHC1 = 0 SI = 128K 
       data hash MD5: 128K
       54 51 EA 9E CD 02 08 E1 5F 23 26 5D 5F DA 7D 10>)
(   3,<2013-11-10 00:59:31.945 -0800>,<Administrator>,<X>,<proc1d>,<TOPSPIN 2.1>,
      <pk PHC0 = -86.9458 PHC1 = 0 
       data hash MD5: 128K
       3F 31 87 9A D8 72 BA 98 B1 83 77 63 19 87 75 89>)
(   4,<2013-11-10 00:59:32.373 -0800>,<Administrator>,<X>,<proc1d>,<TOPSPIN 2.1>,
      <abs ABSG = 1 
       data hash MD5: 128K
       89 A2 90 79 50 7E 39 A4 EF EC C0 A5 B9 B9 21 E8>)
(   5,<2013-11-10 00:59:32.465 -0800>,<Administrator>,<X>,<proc1d>,<TOPSPIN 2.1>,
      <abs ABSG = 2 
       data hash MD5: 128K
       F1 36 7D C5 80 A7 92 DD 24 9C BE 3A 51 B1 5C 9D>)
(   6,<2013-11-10 00:59:32.573 -0800>,<Administrator>,<X>,<proc1d>,<TOPSPIN 2.1>,
      <abs ABSG = 3 
       data hash MD5: 128K
       8E ED 07 51 18 3D B9 26 F5 4B 5A A5 EA B7 B4 4D>)
(   7,<2013-11-10 00:59:32.680 -0800>,<Administrator>,<X>,<proc1d>,<TOPSPIN 2.1>,
      <abs ABSG = 4 
       data hash MD5: 128K
       DE 25 30 BC 78 B3 3A 3C A2 CF D1 1B F3 83 11 AC>)
(   8,<2013-11-10 00:59:32.756 -0800>,<Administrator>,<X>,<proc1d>,<TOPSPIN 2.1>,
      <abs ABSG = 5 
       data hash MD5: 128K
       47 6E CC 54 6B 3D 56 8F CA 7B 77 8B 95 B8 1D F5>)
$$ ##END=
$$ 
$$ $$ hash MD5
$$ $$ 9C 4D 1D 6D 56 03 EB D6 19 4A A4 85 C4 D4 FA 04
##$RELAX= 
##$RELAX= 
##$RELAX= 
##$RELAX= 
##$RELAX= 
##$RELAX= 
##$RELAX= 
##$RELAX= 
$$ Bruker specific parameters
$$ --------------------------
##$DU= <E:\>
##$EXPNO= 12
$$ [...]
150 150 150 150 150 150 150 150
##$TP07= 0
##$TPNAME0= <>
##$TPNAME1= <>
##$TPNAME2= <>
##$TPNAME3= <>
##$TPNAME4= <>
##$TPNAME5= <>
##$TPNAME6= <>
##$TPNAME7= <>
##$TPOAL= (0..7)
0.5 0.5 0.5 0.5 0.5 0.5 0.5 0.5
##$TPOFFS= (0..7)
0 0 0 0 0 0 0 0
##$TUNHIN= 0
##$TUNHOUT= 0
##$TUNXOUT= 0
##$USERA1= <user>
##$USERA2= <user>
##$USERA3= <user>
##$USERA4= <user>
##$USERA5= <user>
##$V9= 5
##$VALIST= <valist>
##$VCLIST= <CCCCCCCCCCCCCCC>
##$VD= 0
##$VDLIST= <DDDDDDDDDDDDDDD>
##$VPLIST= <PPPPPPPPPPPPPPP>
##$VTLIST= <TTTTTTTTTTTTTTT>
##$WBST= 1024
##$WBSW= 4
##$XGAIN= (0..3)
0 0 0 0
##$XL= 0
##$YL= 0
##$YMAX_a= 6036966
##$YMIN_a= -12245177
##$ZGOPTNS= <>
##$ZL1= 120
##$ZL2= 120
##$ZL3= 120
##$ZL4= 120
##$ABSF1= 14.96088
##$ABSF2= -5.597301
##$ABSG= 5
##$ABSL= 3
##$ALPHA= 0
##$AQORDER= 0
##$ASSFAC= 0
##$ASSFACI= 0
##$ASSFACX= 0
##$ASSWID= 0
##$AUNMP= <proc_prof1d_extract.lims>
##$AXLEFT= 0
##$AXNAME= <>
##$AXNUC= <1H>
##$AXRIGHT= 0
##$AXTYPE= 0
##$AXUNIT= <>
##$AZFE= 0.1
##$AZFW= 0.1
##$BCFW= 0
##$BC_mod= 0
##$BYTORDP= 0
##$COROFFS= 0
##$CY= 15
##$DATMOD= 1
##$DC= 0
##$DFILT= <>
##$DTYPP= 0
##$F1P= 0
##$F2P= 0
##$FCOR= 0.5
##$FTSIZE= 131072
##$FT_mod= 6
##$GAMMA= 0
##$GB= 0
##$INTBC= 1
##$INTSCL= 1
##$ISEN= 128
##$LB= 0.3
##$LEV0= 0
##$LPBIN= 0
##$MAXI= 10000
##$MC2= 0
##$MEAN= 0
##$ME_mod= 0
##$MI= 0
##$NCOEF= 0
##$NC_proc= -2
##$NLEV= 6
##$NOISF1= 0
##$NOISF2= 0
##$NSP= 0
##$NTH_PI= 0
##$NZP= 0
##$OFFSET= 14.96088
##$PC= 1
##$PHC0= -86.9458
##$PHC1= 0
##$PH_mod= 1
##$PKNL= yes
##$PPARMOD= 0
##$PPDIAG= 0
##$PPIPTYP= 0
##$PPMPNUM= 2147483647
##$PPRESOL= 1
##$PSCAL= 4
##$PSIGN= 0
##$PYNMP= <proc.py>
##$REVERSE= no
##$SF= 400.020009686731
##$SI= 131072
##$SIGF1= 0
##$SIGF2= 0
##$SINO= 400
##$SIOLD= 131072
##$SPECTYP= <>
##$SREGLST= <1H.CDCl3>
##$SSB= 0
##$STSI= 131072
##$STSR= 0
##$SW_p= 8223.68421052631
##$SYMM= 0
##$S_DEV= 0
##$TDeff= 65536
##$TDoff= 0
##$TI= <>
##$TILT= no
##$TM1= 0
##$TM2= 0
##$TOPLEV= 0
##$USERP1= <user>
##$USERP2= <user>
##$USERP3= <user>
##$USERP4= <user>
##$USERP5= <user>
##$WDW= 1
##$XDIM= 131072
##$YMAX_p= 402490090
##$YMIN_p= -12871
##$CURPLOT= <Network HP LaserJet P1505>
##$CURPRIN= <$Network HP LaserJet P1505>
##$DFORMAT= <normdp>
##$LAYOUT= <+/1D_H.xwp>
##$LFORMAT= <normlp>
##$PFORMAT= <normpl>
##$SURQMSG= 1
$$ End of Bruker specific parameters
$$ ---------------------------------
##NTUPLES= NMR SPECTRUM
##VAR_NAME=  FREQUENCY,     SPECTRUM/REAL,   SPECTRUM/IMAG
##SYMBOL=    X,             R,               I
##VAR_TYPE=  INDEPENDENT,   DEPENDENT,       DEPENDENT
##VAR_FORM=  AFFN,          ASDF,            ASDF
##VAR_DIM=   131072,        131072,          131072
##UNITS=     HZ,            ARBITRARY UNITS, ARBITRARY UNITS
##FACTOR=    0.0627417313425164, 1,          1
##FIRST=     8223.62146879497, -2273,        -59229
##LAST=      0,             -612,            -59774
##MIN=       0,             -12871,          0
##MAX=       8223.62146879497, 402490090,    0
$$ Real data points
##PAGE= N=1
##DATA TABLE= (X++(R..R)), XYDATA
$$ [...]
61651D32145O496N770M792L529J765l4q81o61n24j286k192j981p07L87O04N03
61635D47725R16K013L476M901N774N607M544L360K537J706L39j412l006m378n848
61620D68254p366q394q655q423p999p339o392n349m350l325k416k176k946m208
61606C88916n019n000m571m295m320m502m683m688m354l696k999k604k635k928
61592C32622l117k849k071j214q76j222j824k152k111j952j809j540j037m61p3
61577C08314O3P9P9J21K80N97R05R17O01L11L64P00J086J492K007K527K791K777
61559C26011K744K875L051L092K979K824K741K796K861K577J687N03k56k05K85
61544C56565N40K35l78p52m85K98R86J087P75N81O11N15J94NP9rn96j368j821
$$ y = [432145, 438641, 444411, 449203, 452732, 454497, 454463, 453582, 452921, 452397, 451111, 448919, 446938, 446231, 446618, 447222, 447725, 448641, 450654, 454130, 459031, 464805, 470412, 474956, 478316, 480853, 482559, 482898, 481486, 478480, 474102, 468254, 460888, 452494, 443839, 435416, 427417, 420078, 413686, 408337, 403987, 400662, 398246, 396070, 393124, 388916, 383897, 378897, 374326, 370031, 365711, 361209, 356526, 351838, 347484, 343788, 340789, 338185, 335550, 332622, 329505, 326656, 324585, 323371, 322495, 321273, 319449, 317297, 315186, 313234, 311425, 309885, 308848, 308387, 308314, 308377, 308456, 308535, 308656, 308936, 309533, 310438, 311355, 311956, 312267, 312631, 313331, 314417, 315909, 317916, 320443, 323234, 326011, 328755, 331630, 334681, 337773, 340752, 343576, 346317, 349113, 351974, 354551, 356238, 356741, 356485, 356280, 356565, 357105, 357340, 356962, 356210, 355725, 356023, 357009, 358096, 358871, 359452, 360063, 360578, 360772, 360777, 360856, 360847, 360251, 358883, 357062]
61525C57062j882j768j536j216j033j062j002o78m66p13j049q69k85N9N7L02J138
61508C45059K140K766L002L146L342L543L644L505L146L045L823N428O916P365
61494C99870O787N960N504N425N366N048M422L621K867K332K004J723J439J369
61480D53737J797K685L653M440N140N744N772M893L695L148L210K768J270m07
61466E01545j260j583k289l335l885l762l689m065m460m547m632m923m991m446
61452D49678l644l213l159k919k151j148m95m16m07L51J982L491L738K780J721
61437D46189J297J191Q90M86K74J03l63j042j572j839j952j833j249k22Q29J459
61421D42646J609J683K209L267M282M500L714K391J048j81j393k563l480l838
$$ y = [357062, 355180, 353412, 351876, 350660, 349627, 348565, 347563, 346885, 346419, 345706, 344657, 343788, 343503, 343562, 343619, 343921, 345059, 347199, 349965, 352967, 356113, 359455, 362998, 366642, 370147, 373293, 376338, 380161, 385589, 392505, 399870, 406657, 412617, 418121, 423546, 428912, 433960, 438382, 442003, 444870, 447202, 449206, 450929, 452368, 453737, 455534, 458219, 461872, 466312, 471452, 477196, 482968, 487861, 491556, 494704, 497914, 500682, 501952, 501545, 500285, 498702, 496413, 493078, 489193, 485431, 481742, 477677, 473217, 468670, 464038, 459115, 454124, 449678, 446034, 442821, 439662, 436743, 434592, 433444, 432949, 432533, 432126, 432477, 434459, 437950, 441688, 444468, 446189, 447486, 448677, 449567, 450053, 450327, 450430, 450067, 449025, 447453, 445614, 443662, 441829, 440580, 440358, 441187, 442646, 444255, 445938, 448147, 451414, 455696, 460196, 463910, 466301, 467349, 467168, 465775, 463212, 459732, 455894]
61407D55894l420k428j577j481j952k130j460l32L24r8j300k236k042j034m90
61392D34238j013j586r23N97J371Q28O1J01O55J099J656K773M112M994N382N635
61376D59980N712N419N070N199N756O232O353O092N260L802K272J385J119Q98
61362E20549N09J99p6p17j672k231j889r82k26L4m5j54j36j11l30q04j169j221
61344E09528j278j709k205k012r49L21J049J084P15K19k53n86o96n34j65R0k16
61327E02403j091j836j753j029m77n29q63r97o32M46K221M011M889M825M830N681
61311E20099P017Q171R236J0672J2301J3507J4266J5095J5981J6099J4921J2921
61299F70286J0809Q590N973L315J437M98k94j712l638n441o838p993q989r585
$$ y = [455894, 452474, 450046, 448469, 446988, 445036, 442906, 441446, 441114, 441438, 441340, 440040, 437804, 435762, 434728, 434238, 433225, 431639, 430716, 431313, 432684, 433512, 433573, 433674, 434329, 435428, 437084, 439857, 443969, 448963, 454345, 459980, 465692, 471111, 476181, 481380, 487136, 493368, 499721, 505813, 511073, 514875, 517147, 518532, 519651, 520549, 521058, 521257, 521181, 520464, 518792, 516561, 514672, 513690, 513464, 513498, 513453, 513299, 513163, 513052, 512722, 511918, 510749, 509528, 508250, 506541, 504336, 502324, 501375, 501696, 502745, 503829, 504544, 504763, 504510, 503924, 503228, 502694, 502529, 502619, 502403, 501312, 499476, 497723, 496694, 496217, 495688, 494825, 493828, 493196, 493642, 495863, 499874, 504763, 509588, 514418, 520099, 527116, 535287, 544523, 555195, 567496, 581003, 595269, 610364, 626345, 642444, 657365, 670286, 681095, 689685, 695658, 698973, 700410, 700908, 700614, 698902, 695264, 689823, 682985, 674992, 666003, 656418]
61285F56418r589r206q892q912r062q823p879o484n214m363l720l004k205j399
61271E67666n54J57K29n04j289j096J82J650K595L207L977M910N586N712N355
61256E97783M821M474M457M529M408M231M338M648M667M214L598K983K212J337
61242F52700P40M09k24j341k323k776l298m465n617n604m434l233k620k046q63
61227F15005P30K144L259M409N784P167Q123Q382Q108P747P563P410P076O565
61213F99472N819M584K928J526R47Q98P65O40J102K130L043L537M063M942N829
61198G42225O412P054Q264R922J1396J2210J2240J1487J0034Q167O225M346K460
61185H52442N64j109k271k961l703n020o756q161q813r105r532r999j0188j0233
$$ y = [656418, 646829, 637623, 628731, 619819, 610757, 601934, 594055, 587571, 582357, 577994, 574274, 571270, 569065, 567666, 567112, 567269, 567498, 566994, 565705, 564609, 564791, 566441, 569036, 572243, 576220, 581130, 586716, 592428, 597783, 602604, 607078, 611535, 616064, 620472, 624703, 629041, 633689, 638356, 642570, 646168, 649151, 651363, 652700, 653440, 653849, 653625, 652284, 649961, 647185, 643887, 639422, 633805, 628201, 623767, 620534, 617914, 615868, 615005, 615735, 617879, 621138, 625547, 631331, 638498, 646621, 655003, 663111, 670858, 678421, 685831, 692907, 699472, 705291, 709875, 712803, 714329, 715276, 716174, 716939, 717579, 718681, 720811, 723854, 727391, 731454, 736396, 742225, 748637, 755691, 763955, 773877, 785273, 797483, 809723, 821210, 831244, 839411, 845636, 849982, 852442, 853006, 851897, 849626, 846665, 842962, 837942, 831186, 823025, 814212, 805107, 795575, 785576, 775388, 765155]
61171G65155j0344j0165r284q229q076q984r947j0175r963r964j0273j0606j0720
61158F38425j0404r544q508p848p336o060l845j809r25q19o78o39j347k553l333
61143E72777l481l697m363n005n180n028m669l886k735j828j531j361o54N75J913
61128E31847L297M934O664Q033Q952R785J0768J1709J2472J3329J4638J6348J8093
61115F70869J9577K0704K1427K1756K1878K2064K2343K2342K1589K0048J8309
61104I02906J7093J6418J5356J2952R310N512K335m34l248n919p991r619j1284
61091I43387j2830j3644j3822j4285j5463j6600j6848j6308j5491j4403j2887
61080G80806j1332j0236r329p948o085m382l149k091r58J91J338K584L887N207
$$ y = [765155, 754811, 744646, 735362, 727133, 719057, 710073, 700126, 689951, 679988, 670024, 659751, 649145, 638425, 628021, 618477, 609969, 602121, 594785, 588725, 584880, 583071, 582146, 581327, 580649, 580010, 578663, 576110, 572777, 569296, 565599, 561236, 556231, 551051, 546023, 541354, 537468, 534733, 532905, 531374, 530013, 529359, 529934, 531847, 535144, 540078, 546742, 554775, 563727, 573512, 584280, 595989, 608461, 621790, 636428, 652776, 670869, 690446, 711150, 732577, 754333, 776211, 798275, 820618, 842960, 864549, 884597, 902906, 919999, 936417, 951773, 964725, 974035, 979547, 981882, 981448, 978200, 972281, 964290, 954671, 943387, 930557, 916913, 903091, 888806, 873343, 856743, 839895, 823587, 808096, 793693, 780806, 769474, 759238, 749909, 741961, 735876, 731494, 728345, 726254, 725296, 725487, 726825, 729409, 733296, 738503]
61066G38503O733Q457R800J0388J0942J2419J4445J5694J5977J6652J8585K0838
61054H99433K2109K2506K2999K3874K4838K6072K8080L0601L2590L3403L3422
61043A199927L3458L3957L4722L5076L4386L2810L1315L0607L0381K9951K9226
61032A555816K8502K7699K6608K5589K5209K5203K4706K3639K3031K3712K5371
61021A835085K7415L0093L4211M0041M7043N4649O2927P2502Q4041R8014J15033
61010B501054J36445J64445K01576K50459L14374L97446N03279O33203P86228
61001E888509R59889J148764J340476J513417J638913J685479J623570J435442
60993A7234459J132588P68539M27065J83737O8007N6453R6723J32898J12909r235
$$ y = [738503, 745236, 753693, 763493, 773881, 784823, 797242, 811687, 827381, 843358, 860010, 878595, 899433, 921542, 944048, 967047, 990921, 1015759, 1041831, 1069911, 1100512, 1133102, 1166505, 1199927, 1233385, 1267342, 1302064, 1337140, 1371526, 1404336, 1435651, 1466258, 1496639, 1526590, 1555816, 1584318, 1612017, 1638625, 1664214, 1689423, 1714626, 1739332, 1762971, 1786002, 1809714, 1835085, 1862500, 1892593, 1926804, 1966845, 2013888, 2068537, 2131464, 2203966, 2288007, 2386021, 2501054, 2637499, 2801944, 3003520, 3253979, 3568353, 3965799, 4469078, 5102281, 5888509, 6848398, 7997162, 9337638, 10851055, 12489968, 14175447, 15799017, 17234459, 18367047, 19135586, 19562651, 19746388, 19814395, 19870848, 19967571, 20100469, 20213378, 20204143]
60983B0204143k56156o03325r79296j300622j513782j609564j606986j531503
60975A0802909j406222j252402j088717r28610p80393o49545n39047m48239l73820
60966C335914l12803k63653k24860j94047j69031j48700j32246j18429j06111
60957A666034r4876q4579p4847o5613n7482n0941m5555m0594l6164l2942l1028
60946A051413k9781k8734k7922k7226k6108k4363k2544k1269k0494j9808j9126
60935G84038j8580j8018j7077j5806j4726j4205j3969j3409j2264j0902r837r087
60923F16158q141o727n379m887n233n561n210m329l387k585k068k095k532k636
60909E55388j896p68k4K90O35J025J029N78L4n10j254j993k191j917j958k706
$$ y = [20204143, 19947987, 19344662, 18365366, 17064744, 15550962, 13941398, 12334412, 10802909, 9396687, 8144285, 7055568, 6126958, 5346565, 4697020, 4157973, 3709734, 3335914, 3023111, 2759458, 2534598, 2340551, 2171520, 2022820, 1890574, 1772145, 1666034, 1571158, 1486579, 1411732, 1346119, 1288637, 1237696, 1192141, 1151547, 1115383, 1082441, 1051413, 1021632, 992898, 964976, 937750, 911642, 887279, 864735, 843466, 822972, 803164, 784038, 765458, 747440, 730363, 714557, 699831, 685626, 671657, 658248, 645984, 635082, 625245, 616158, 608017, 601290, 595911, 591024, 585791, 580230, 575020, 570691, 567304, 564719, 562651, 560556, 558024, 555388, 553492, 552724, 552700, 552990, 553625, 554650, 555679, 556257, 556291, 555781, 554527, 552534, 550343, 548426, 546468, 543762]
60893E43762l610m070m227m477m747m841m932n201n340n077m878n441o591p251
60879D73079o704n427m555m707n489n954n507m371l221k439j896j390r31m81K43
60864D20250J391K642L492L814L903M094M487M939N116M699L699K512J644J366
60850D68048J619K053K215K025J977K482L071K762J380j13q11r38j316k250l362
60835D78842m226m709m862m877m911m776m106l120k724l414m516n015m808m476
60821D18302m208l707l088k982l597m285m293l550k580j982k069k693l310l509
60807C72449l510l775m213m180l376k273j550j392j547j707j677j438j167j031
60793C39613q65l27N53J229J265R02Q00J269J959K320K240K129K314K533K271
$$ y = [543762, 540152, 536082, 531855, 527378, 522631, 517790, 512858, 507657, 502317, 497240, 492362, 486921, 480330, 473079, 466375, 460948, 456393, 451686, 446197, 440243, 434736, 430365, 427144, 424705, 422809, 421419, 420488, 420007, 420250, 421641, 424283, 427775, 431589, 435492, 439586, 444073, 449012, 454128, 458827, 462526, 465038, 466682, 468048, 469667, 471720, 473935, 475960, 477937, 480419, 483490, 486252, 487632, 487519, 486708, 485770, 484454, 482204, 478842, 474616, 469907, 465045, 460168, 455257, 450481, 446375, 443255, 440531, 437117, 432601, 427586, 422778, 418302, 414094, 410387, 407299, 404317, 400720, 396435, 392142, 388592, 386012, 384030, 381961, 379268, 375958, 372449, 368939, 365164, 360951, 356771, 353395, 351122, 349572, 348180, 346633, 344926, 343249, 341811, 340644, 339613, 338748, 338421, 338974, 340203, 341468, 342370, 343170, 344439, 346398, 348718, 350958, 353087, 355401, 357934, 360205]
60778C60205J572J104J284J735J881J676J335P50k31j155j317p42k24k37l80p2
60762C67184O26J188J238P95J39l58n08n27p48j051r38l30J08k74j246j912j683
60745C61703p81J69Q18J266J627J644Q85o01k092k939l307l831m573m812l938
60730C41238k226n09N98R60P11J03n08q18p46l54K75J014J613J789J486R82P09
60713C46317Q42J058Q52J66l99k18O43J519J919J944J931J960J811J338P54M74
60697C62911O32Q43O18jm95n81n01n10n01m36o43j182j405p61J65K25p53j686
60679C55939j574m78R11K031K528K299J788J740K284K673K260J354O24J00p39
60664C73740k007l095l361k820k060j672j777j985j806j161m04J01M24R29J880
$$ y = [360205, 361777, 362881, 364165, 365900, 367781, 369457, 370792, 371542, 371311, 370156, 368839, 368097, 367873, 367636, 367256, 367184, 367810, 368998, 370236, 371031, 371170, 370812, 370304, 369777, 369029, 367978, 367040, 366710, 366818, 366544, 365298, 363386, 361703, 360922, 361091, 361909, 363175, 364802, 366446, 367331, 366730, 364638, 361699, 358392, 354561, 349988, 345176, 341238, 339012, 338503, 339101, 340061, 340772, 340875, 340367, 339549, 338803, 338449, 338724, 339738, 341351, 343140, 344626, 345608, 346317, 347159, 348217, 349069, 349235, 348836, 348618, 349261, 350780, 352699, 354643, 356574, 358534, 360345, 361683, 362437, 362911, 363543, 364386, 365004, 365003, 364508, 363927, 363426, 362916, 362415, 361979, 361336, 360154, 358749, 357988, 358153, 358378, 357625, 355939, 354365, 353887, 354798, 356829, 359357, 361656, 363444, 365184, 367468, 370141, 372401, 373755, 374379, 374479, 373740, 371733, 368638, 365277, 362457, 360397, 358725, 356948, 354963, 353157, 351996, 351592, 351693, 352117, 353046, 354926]
60649C54926L096M035M194L599K808K318K070J679R56j1j083k053k603k658k621
60634C68652k803k863k370j694j536j719j369m18J54m3m7Q71J822J541L55k83
60618C58250J38P65R18Q96J001Q71K80j99N8P88J239J167Q98O78N11N55J098K008
60600C71920K630K449J653Q25L07K5j59k06n6K03M29N73O08M51Q8l11n56n93l61
60581C79919L37J448K327K211J162J75J66J140K440L529M298M950N836P140Q515
60566D25593R224R013Q495Q366Q453Q021O753M947K833M40j831l249l669l843
60552D79546m338m659l989k419p17Q99K839M956O236O154N641O032P426Q884R973
60537E22464J1237J3092J5018J6189J6414J6131J5760J5332J4454J2477R030M596
$$ y = [354926, 358022, 362057, 366251, 369850, 372658, 374976, 377046, 378725, 379681, 379670, 378587, 376534, 373931, 371273, 368652, 365849, 362986, 360616, 358922, 357386, 355667, 354298, 353880, 354034, 353991, 353944, 354815, 356637, 358178, 358533, 358250, 358388, 359153, 360071, 360967, 361968, 362839, 363119, 362920, 362978, 363766, 365005, 366172, 367070, 367748, 368259, 368814, 369912, 371920, 374550, 376999, 378652, 379477, 379784, 379809, 379650, 379444, 379388, 379591, 380020, 380593, 381201, 381652, 381740, 381429, 380873, 380280, 379919, 380256, 381704, 384031, 386242, 387404, 387579, 387745, 388885, 391325, 394854, 399152, 404102, 409938, 417078, 425593, 434817, 443830, 452325, 460691, 469144, 477165, 483918, 488865, 491698, 492138, 490307, 487058, 483389, 479546, 475208, 470549, 466560, 464141, 463424, 464323, 467162, 472118, 478354, 484508, 490149, 496181, 503607, 512491, 522464, 533701, 546793, 561811, 578000, 594414, 610545, 626305, 641637, 656091, 668568, 677598, 682194]
60525F82194K31l418o419q884j0512j1157j1180j0844r956q567p444p082o803
60512E80159n674l920k480j418O8K103L731M418N008O697R701J3347J6912J9987
60498F48639K2444K4501K6531K8593L0366L1613L2226L1849L0109K7330K4411
60487I58612K1754J8969J5805J2628R625O288K148k598p696j3351j9548k5500
60475I77136l0475l4622l8237m0675m0982l9305l6817l4324l1675k8566k5162
60464E96296k1818j8723j6013j3820j2119j0805r891r358q913q253p429o688o082
60451D46384n551n128m773m195l324k595k344k220j822j576k134l125l377k564
60437D01656j726j789k328k231j175J10P79O82L83N85J400K101J837O29o35j238
$$ y = [682194, 682425, 679007, 672588, 663704, 653192, 642035, 630855, 620011, 610055, 601488, 594044, 586962, 580159, 574485, 570565, 568085, 566667, 566735, 568838, 572569, 576987, 581995, 588692, 598393, 611740, 628652, 648639, 671083, 695584, 722115, 750708, 781074, 812687, 844913, 876762, 906871, 934201, 958612, 980366, 999335, 1015140, 1027768, 1037393, 1043681, 1045829, 1043231, 1035535, 1022184, 1002636, 977136, 946661, 912039, 873802, 833127, 792145, 752840, 716023, 681699, 650024, 621458, 596296, 574478, 555755, 539742, 525922, 513803, 502998, 493107, 483749, 474836, 466583, 459154, 452466, 446384, 440833, 435705, 430932, 426737, 423413, 420818, 418474, 416254, 414432, 412856, 410722, 407597, 404220, 401656, 399930, 398141, 395813, 393582, 392407, 392517, 393296, 393978, 394361, 394946, 396346, 398447, 400284, 400913, 400278, 399040]
60421C99040j326j349j297q58o5O89J174J503J753J812J679J616J777J865J452
60406D09465O99L46Q66J833K478K623K690K862K856K585K507K972L677M157M386
60391D47002M581M662M462M150L930L564K809K122K309L344M224M106L144J986
60377D96395R88K41m0L32J093J618J520J001O06O51R46J069R08Q61J366K362L317
60360E15234L773L741L644L969M879O049O962P439P779Q282Q839R122Q939Q232
60346F06883O925N060K914P60j352l327m776n393n431n494n869o311o392n921
60332E72276n075m377m251m522m542m088l725l984m497m451l647k640k010j869
60318E18598j921j542q4K330M569N675O017O634P722Q640R282J0326J1901J3020
$$ y = [399040, 397714, 396365, 395068, 394210, 394145, 394834, 396008, 397511, 399264, 401076, 402755, 404371, 406148, 408013, 409465, 410164, 410510, 411376, 413209, 415687, 418310, 421000, 423862, 426718, 429303, 431810, 434782, 438459, 442616, 447002, 451583, 456245, 460707, 464857, 468787, 472351, 475160, 477282, 479591, 482935, 487159, 491265, 494409, 496395, 497383, 497624, 497584, 497916, 499009, 500627, 502147, 503148, 503754, 504405, 505351, 506420, 507328, 508189, 509555, 511917, 515234, 519007, 522748, 526392, 530361, 535240, 541289, 548251, 555690, 563469, 571751, 580590, 589712, 598651, 606883, 613808, 618868, 621782, 622542, 621190, 617863, 613087, 607694, 602263, 596769, 590900, 584589, 578197, 572276, 567201, 562824, 558573, 554051, 549509, 545421, 541696, 537712, 533215, 528764, 525117, 522477, 520467, 518598, 516677, 515135, 515051, 517381, 521950, 527625, 533642, 540276, 547998, 556638, 565920, 576246, 588147, 601167]
60304F01167J2843J1701J0385R027P305N222K991N30k351n426q299j0921j3374
60291F20800j5230j5748j4768j2975j1161r556q020o606n549m839m119l163k210
60278E06856j675j590j621j585j644j938k338k701l080l477l718l749l703l506
60264D70531k866j918j384j589j898j700j422j794k531k737k326k010j933j388
60250D43035p8J335K176K434K222J451M00j77J5M30N65N78P03P96Q26J111J582
60233D59404J583R09L23M91J137J771K465L274L695L525L586M569N841O437O669
60218E05679P469Q568Q834Q250Q112Q950R692R393Q595Q263Q307Q069P605P543
60204F23329P973Q341Q328Q174Q079P840P210O356N740N654N805N411L930J840
$$ y = [601167, 614010, 625711, 636096, 645123, 652428, 657650, 660641, 661171, 658820, 653394, 645095, 634174, 620800, 605570, 589822, 575054, 562079, 550918, 541362, 533342, 526736, 521187, 516348, 512229, 509066, 506856, 505181, 503591, 501970, 500385, 498741, 496803, 494465, 491764, 488684, 485207, 481489, 477740, 474037, 470531, 467665, 465747, 464363, 462774, 460876, 459176, 457754, 455960, 453429, 450692, 448366, 446356, 444423, 443035, 442957, 444292, 446468, 448902, 451124, 452575, 452975, 452798, 452813, 453243, 453808, 454386, 455089, 455885, 456711, 457822, 459404, 460987, 461896, 462219, 462710, 463847, 465618, 468083, 471357, 475052, 478577, 482163, 486732, 492573, 499010, 505679, 513148, 521716, 530550, 538800, 546912, 555862, 565554, 574947, 583542, 591805, 600112, 608181, 615786, 623329, 631302, 639643, 647971, 656145, 664224, 672064, 679274, 685630, 691370, 697024, 702829, 708240, 712170, 714010]
60190G14010L83K43O89L81j027k528l011k527k074k376l222l927m126l956l726
60175F83206l593l510l313k889k397k170k313k502k458k454k923l666l956l584
60161F41478l240l600m417m946m860m375l744l174k958l126l042j973j53J280
60147E99150J586J200J001J236J532J640J675J728J719J659J795K308L018L518
60133F24765L564L300L087L188L536L792L692L305K940K747K607K419K375K707
60119F68024L327L954M529N214N932O385O620P130Q046Q683Q343P230O089N200
60105G54706M353L604L289L278K964K179J462J171R56M37j67m44m08l02k98o65
60089G76115j732l300m554n125n675o883q278q826q345p588p109o857o790p020
$$ y = [714010, 714393, 714636, 715325, 715706, 714679, 712151, 709140, 706613, 704539, 702163, 698941, 695014, 690888, 686932, 683206, 679613, 676103, 672790, 669901, 667504, 665334, 663021, 660519, 658061, 655607, 652684, 649018, 645062, 641478, 638238, 634638, 630221, 625275, 620415, 616040, 612296, 609122, 606164, 603038, 599996, 598023, 597870, 599150, 600736, 601936, 602937, 604173, 605705, 607345, 609020, 610748, 612467, 614126, 615921, 618229, 621247, 624765, 628329, 631629, 634716, 637904, 641440, 645232, 648924, 652229, 655169, 657916, 660523, 662942, 665317, 668024, 671351, 675305, 679834, 685048, 690980, 697365, 703985, 711115, 719161, 727844, 736187, 743417, 749506, 754706, 759059, 762663, 765952, 769230, 772194, 774373, 775835, 777006, 777962, 778399, 778232, 777788, 777380, 777078, 776780, 776115, 774383, 771083, 766529, 761404, 755729, 748846, 740568, 731742, 723397, 715809, 708700, 701843, 695053, 688033]
60075F88033p303p118o468n961n867n693n009m171l877m377n370o351o742o178
60061F07548m993m176m416n327n906n535m295k682j398j138k000l153l552l005
60047E55972k117j275k82R70K119K952L834N013N949N941N148M348L820L222K501
60032E98115K126K199K088J358M20j78n19q64j053j073j656l443n844p645q472
60017E75559q749q447p119n213m093m289m819m769m497m549m435l521k457k513
60003E06089l696m638m306l085k041j735j878j703o85Q26J859J980J904K447L375
59988D94713L881L868L957M377M751M961N309N684N394M197K817K022J716J321
59974E48968N72m54j652k793l392l247k848k876l347l654l409k872k460k119j433
$$ y = [688033, 680730, 673612, 667144, 661183, 655316, 649623, 644614, 640443, 636566, 632189, 626819, 620468, 613726, 607548, 602555, 598379, 593963, 588636, 582730, 577195, 572900, 570218, 568820, 567682, 565682, 562529, 558977, 555972, 553855, 552580, 552298, 553268, 555387, 558339, 562173, 567186, 573135, 579076, 584224, 588572, 592392, 595614, 598115, 600241, 602440, 604528, 605886, 606306, 606128, 605609, 604745, 603692, 602619, 600963, 597520, 591676, 584031, 575559, 566810, 558363, 551244, 546031, 541938, 537649, 532830, 528061, 523564, 519015, 514580, 511059, 508602, 506089, 502393, 497755, 493449, 490364, 488323, 486588, 484710, 483007, 482322, 483148, 485007, 486987, 488891, 491338, 494713, 498594, 502462, 506419, 510796, 515547, 520508, 525817, 531501, 536895, 541092, 543909, 545931, 547647, 548968, 549540, 549086, 547434, 544641, 541249, 538002, 535154, 532278, 528931, 525277, 521868, 518996, 516536, 514417, 512984]
59959E12984l01P76J201J017Q32J021J239R67K26m35n31M3J106K216K816K686
59943E27863K183J740J304O80K18N39J562K403K445K001J701J667J633J574J858
59928E51371K816M412O225P710Q567Q865Q735Q046O699N155M245M301M829N149
59914F37125N070M782M443M055L597L057K487K091K007J922J226l43k403m357
59900F64759n813o562o561o118n665n122l946k117m89L42J014K484M442N636N668
59885F41952N549O175P109P477P354P505Q150Q785R128R406R615R200P834O035
59871G51274M598L706K900J734J20j739l454m568m927m880m886m992m882m287
59857G25717l168j687k38P52J375K283L767N150N644N476N392N264M183J978l71
$$ y = [512984, 512683, 513459, 514660, 515677, 516509, 517530, 518769, 519736, 519962, 519527, 518996, 519039, 520145, 522361, 525177, 527863, 530046, 531786, 533090, 533770, 533988, 534527, 536089, 538492, 540937, 542938, 544639, 546306, 547939, 549513, 551371, 554187, 558599, 564824, 572534, 581101, 589966, 598701, 606747, 613446, 618601, 622846, 627147, 631976, 637125, 642195, 646977, 651420, 655475, 659072, 662129, 664616, 666707, 668714, 670636, 671862, 671519, 669116, 664759, 658946, 652384, 645823, 639705, 634040, 628918, 624972, 622855, 622366, 622708, 623722, 626206, 630648, 636284, 641952, 647501, 653676, 660785, 668262, 675616, 683121, 691271, 700056, 709184, 718590, 728205, 737405, 745239, 751274, 755872, 759578, 762478, 764212, 764332, 762593, 759139, 754571, 749644, 744764, 739878, 734886, 730004, 725717, 722549, 720862, 720624, 721376, 722751, 725034, 728801, 733951, 739595, 745071, 750463, 755727, 759910, 761888, 761517]
59842G61517k098l445m646n134m459l262k484k241k193k452l241m067m172l563
59828G14060k766j831m94Q96J575J507J418J616J657J372J357K091L258M263M967
59813G34946N515N889N936N541M637L300J850N09r18k584l992m463m171l982m228
59798G43785m492m643n183o149o680o236n542n570o197o547o282n757n247m773
59784F64487m476m503m539m133l469l169l273l038j961n64K74M46O72J474K482
59769F36710K952K763K630L260M538N709O195N965N303M540M033M025M451N057
59755F98131N757O626P588Q416R024R428R412Q666P301N890M807L844K603J011
59741G88504o18j779k043j446p07o67j439k389k959l121k982k506j758j053o24
$$ y = [761517, 759419, 755974, 751328, 746194, 741735, 738473, 735989, 733748, 731555, 729103, 725862, 721795, 717623, 714060, 711294, 709463, 708969, 709865, 711440, 712947, 714365, 715981, 717638, 719010, 720367, 722458, 725716, 729979, 734946, 740461, 746350, 752286, 757827, 762464, 765764, 767614, 768123, 767205, 764621, 760629, 756166, 751995, 748013, 743785, 739293, 734650, 729467, 723318, 716638, 710402, 704860, 699290, 693093, 686546, 680264, 674507, 669260, 664487, 660011, 655508, 650969, 646836, 643367, 640198, 636925, 633887, 631926, 631362, 631636, 632082, 632754, 634228, 636710, 639662, 642425, 645055, 648315, 652853, 658562, 664757, 670722, 676025, 680565, 684598, 688623, 693074, 698131, 703888, 710514, 718102, 726518, 735542, 744970, 754382, 763048, 770349, 776239, 781046, 784890, 787493, 788504, 787886, 786107, 784064, 782618, 781911, 781244, 779805, 777416, 774457, 771336, 768354, 765848, 764090, 763037, 762413]
59726G62413m41m14l98n9P20J327J008N9l51K01P60M32l35m98J16Q97J509K166
59708G69112L075M223N573O962Q071Q870R811J1149J2420J3097J3384J3781J4275
59695H93803J4544J4608J4584J4168J3114J1901J1080J0171Q260N528L191J813
59683A016765P28n90j667k052k278l103m412n635o730q010r280r927r737r060
59669I45012q167p011n614m227k960j683l77P84J869L369N627Q256J0382J1514
59655I56774J1924J2259J2941J3926J4765J4731J3163J0052O291L000M77j951
59643A068352n026q723j2533j6079j9106k1090k1579k0965k0320k0163j9802j8332
59631H64634j5985j3870j2497j1274r703q439q511r793j1010j1357j1372j1869
$$ y = [762413, 761972, 761558, 761160, 761101, 761821, 763148, 764156, 764215, 763864, 764065, 764825, 765257, 764922, 764424, 764540, 765437, 766946, 769112, 772187, 776410, 781983, 788945, 797016, 805886, 815697, 826846, 839266, 852363, 865747, 879528, 893803, 908347, 922955, 937539, 951707, 964821, 976722, 987802, 997973, 1006233, 1011761, 1014952, 1016765, 1017493, 1016903, 1015236, 1013184, 1010906, 1007803, 1003391, 997756, 991026, 983016, 973736, 963809, 954072, 945012, 936845, 929834, 924220, 919993, 917033, 915350, 914973, 915757, 917626, 920995, 926622, 934878, 945260, 956774, 968698, 980957, 993898, 1007824, 1022589, 1037320, 1050483, 1060535, 1066826, 1069826, 1070303, 1068352, 1063326, 1054603, 1042070, 1025991, 1006885, 985795, 964216, 943251, 922931, 902768, 882966, 864634, 848649, 834779, 822282, 811008, 801305, 792866, 784355, 774562, 763552, 752195, 740823, 728954]
59619G28954j2577j2532j1576j0688j0674j1076j0733r163p063n495m828m514
59607F18035l788k459r70J95Q98J094O63j55n69k5R28J224O92J76J94K56r6l32
59589F15961L01J471K021J405K41o17j018j368j933k544k855k738k488k601l287
59574E99951m225m937n291n460n508n290m783m218l729l091k103j125q82j577
59560E47732k487k718k157j328m87N40J600K032J599J025J040J490J982K854M581
59545E57298O580P735Q068Q785J0524J2649J4530J6499J8874K0968K1745K0834
59533G25089J8276J4043Q607L436p3j926l049l797l757k857j761j075p77p06j014
59518G48659j891l138m250m837m940n090n934p658r733j1278j1657j0816r326
$$ y = [728954, 716377, 703845, 692269, 681581, 670907, 659831, 649098, 639935, 632872, 627377, 622549, 618035, 614247, 611788, 610818, 611013, 611911, 613005, 613668, 613513, 612944, 612919, 613847, 615071, 615763, 615939, 616133, 616389, 616293, 615961, 616262, 617733, 619754, 621159, 621400, 620783, 619765, 618397, 616464, 613920, 611065, 608327, 605839, 603238, 599951, 595726, 590789, 585498, 580038, 574530, 569240, 564457, 560239, 556510, 553419, 551316, 550191, 549309, 547732, 545245, 542527, 540370, 539042, 538555, 539095, 540695, 542727, 544326, 545351, 546391, 547881, 549863, 552717, 557298, 563878, 571613, 579681, 588466, 598990, 611639, 626169, 642668, 661542, 682510, 704255, 725089, 743365, 757408, 766015, 769451, 769378, 767452, 764403, 760606, 756849, 753992, 752231, 751156, 750379, 749673, 748659, 746768, 743630, 739380, 734543, 729603, 724513, 718579, 710921, 701188, 689910, 678253, 667437, 658111]
59505F58111q117p705p633o987n581m122l132k351j483q48p83r78r27n47J19J278
59489F08314K898M298M937N226N929P086Q133Q784R100R006Q439P749P327P046
59475G04272O643O247N890M904K731R3j646k211k608l556m628n064m646l548k058
59460G00815o63J37M09P80J708L102M611N846O465O483O383O478O383N646M566
59445G59149L648K606P58j783m220o207p833q722q412p590p661q719r280q441
59431F87293p067o213n659m841m136m034l836k388K52K927M901O455Q096R912
59417F81662J1735J3388J4875J6598J9120K2304K5032K6111K5015K1420J4904
59406H92164O043k715q455j0182r116o783l642L35M714Q607J1030J0929P552J347
$$ y = [658111, 649994, 642289, 634656, 627669, 622088, 617966, 614834, 612483, 611000, 610152, 609369, 608391, 607464, 606917, 607036, 608314, 611212, 615510, 620447, 625673, 631602, 638688, 646821, 655605, 664705, 673711, 682150, 689899, 697226, 704272, 710915, 717162, 723052, 727956, 730687, 730780, 729134, 726923, 724315, 720759, 716131, 711067, 706421, 702873, 700815, 700152, 700289, 700698, 701478, 703186, 706288, 710899, 716745, 723210, 729693, 736076, 742554, 748937, 754583, 759149, 762797, 765403, 766161, 764378, 760158, 753951, 746118, 737396, 728984, 721394, 713733, 705014, 695734, 687293, 680226, 674013, 668354, 663513, 659377, 655343, 651507, 649119, 649371, 652298, 657199, 663654, 671750, 681662, 693397, 706785, 721660, 738258, 757378, 779682, 804714, 830825, 855840, 877260, 892164, 898207, 895492, 887037, 876855, 867739, 860956, 857314, 857649, 862363, 870970, 882000, 892929, 900481, 901828]
59392I01828n755j1489j4715j5662j5095j3643j1777r969q485p171n650l763j764
59379G76890l6J206J901K031J739J437J514J887K094J800J092K79l55o38n97m68
59363G91776l55K1R62K211L161L677M270N294O439P239P710Q235R103J0466J2393
59348H72602J4661J6666J7915J8515J8980J9656K0492K1183K1310K0482J8615
59337A081077J6069J3398J0967Q820O747M455J791j101l937o571q972j1064j2813
59324A098866j4418j6064j7501j8248j8220j7835j7406j6905j6342j5950j5800
59313I14177j5642j5375j5287j5464j5397j4525j3012j1532j0346q934o590l312
59301G68761jK252L106L021K313N08k882p154j0689j2544j3149j3339j3281j2706
$$ y = [901828, 896073, 884584, 869869, 854207, 839112, 825469, 813692, 803723, 795238, 788067, 782417, 778654, 776890, 776854, 778060, 779961, 781992, 783731, 785168, 786682, 788569, 790663, 792463, 793555, 793834, 793479, 792841, 792244, 791776, 791421, 791442, 792404, 794615, 797776, 801453, 805723, 811017, 817456, 824695, 832405, 840640, 849743, 860209, 872602, 887263, 903929, 921844, 940359, 959339, 978995, 999487, 1020670, 1041980, 1062462, 1081077, 1097146, 1110544, 1121511, 1130331, 1137078, 1141533, 1143324, 1142223, 1138286, 1131715, 1122743, 1111679, 1098866, 1084448, 1068384, 1050883, 1032635, 1014415, 996580, 979174, 962269, 945927, 929977, 914177, 898535, 883160, 867873, 852409, 837012, 822487, 809475, 797943, 787597, 778663, 772073, 768761, 768760, 771012, 774118, 777139, 779452, 779960, 777078, 769924, 759235, 746691, 733542, 720203, 706922, 694216]
59287F94216j1624j0238q552o500m327k401q31M89J576K430L299M578O427Q550
59273F77092J0384J1534J2198J2996J4131J4931J4649J3537J2483J1660J0327
59262H15922Q124N657L465J219j363l609m635m647m635n052n471n430m948m254
59248G90343l534k988k663k279j579p19L3Q15J890L021L647L707L669L789L826
59233H00978L594L215K627J415n22k560m064n242o730q455r561r568r122r136
59219G46869r632r945r823r637r530r100q234p500p185o566m931k818j477j274
59205F49217j456j294o79L39J684K901L560L997M848N798N935N470N809P485R257
59190G02871J0026J0409J1410J2522J2581J1820J1559J2084J2222J1193R646Q451
$$ y = [694216, 682592, 672354, 663802, 657302, 652975, 650574, 649743, 650232, 651808, 654238, 657537, 662115, 668542, 677092, 687476, 699010, 711208, 724204, 738335, 753266, 767915, 781452, 793935, 805595, 815922, 824046, 829703, 833168, 834387, 833024, 829415, 824780, 820133, 815498, 810446, 804975, 799545, 794597, 790343, 786809, 783821, 781158, 778879, 777300, 776581, 776614, 777429, 779319, 782340, 785987, 789694, 793363, 797152, 800978, 804572, 807787, 810414, 811829, 811307, 808747, 804683, 799441, 792711, 784256, 774695, 765127, 756005, 746869, 737237, 727292, 717469, 707832, 698302, 689202, 680968, 673468, 666283, 659717, 654786, 651968, 650491, 649217, 647761, 646467, 645788, 646127, 647811, 650712, 654272, 658269, 663117, 668915, 674850, 680320, 686129, 693614, 702871, 712897, 723306, 734716, 747238, 759819, 771639, 783198, 795282, 807504, 818697, 828343, 836794]
59178H36794P333N347K226j190l753m994n441n962o831p562p723p546p434p326
59164G85938o978o626o794p500q082p847o727n395m758n152n893o084n842o104
59150F96156p028p458o551n136m574m869m906m233l471l153l166l434m175n191
59136F28811n713n341m571m151m276m629m777m267k825p17J334K765L603M214
59122E99460M909N778O722P600Q405R213R878J0068R843R784J0179J0407R714
59109G11960Q243O766N580M351L035K091J739J577J216P54L50j91j131k300l180
59094G40860l365k869k063j397j111j217j666k291k614k147j141o07j184k327
59080G14861l072l277l531m116m650m713m297l642l055k800k803k636k105j708
$$ y = [836794, 844127, 849474, 851700, 850510, 846757, 841763, 836322, 830360, 823529, 815967, 808244, 800698, 793264, 785938, 778960, 772334, 765540, 758040, 749958, 742111, 735384, 729989, 725231, 720079, 714186, 708102, 702260, 696156, 689128, 681670, 675119, 669983, 665409, 660540, 655634, 651401, 647930, 644777, 641611, 638177, 634002, 628811, 623098, 617757, 613186, 609035, 604759, 600130, 595353, 591086, 588261, 587544, 588878, 591643, 595246, 599460, 604369, 610147, 616869, 624469, 632874, 642087, 651965, 662033, 671876, 681660, 691839, 702246, 711960, 720203, 726969, 732549, 736900, 739935, 742026, 743765, 745342, 746558, 747312, 747662, 747471, 746340, 744040, 740860, 737495, 734626, 732563, 731166, 730055, 728838, 727172, 724881, 722267, 720120, 718979, 718372, 717188, 714861, 711789, 708512, 704981, 700865, 696215, 691502, 687205, 683563, 680508, 677708, 674905, 672269, 670164, 668456]
59066F68456k023k859l524l756l889m176m517m804n006n016m831m798n162n528
59052F08567n274m403l464k762k171j666j403j264q92j85N82J113J180O32j72
59037E88418k88P46K003K172J306O73R13J359J410J487K201L410M637N855P255
59022F23557Q698R851J0527J0623J0051R064Q167P459O432M776K958J607O80l13
59008G14137j478k365k559k164j582j057m79L53J361K213K769L271L861M231L980
58993G24492L167K200J341O51J84j26n71j264j817j786j222m17N42J586K438L119
58977G32517M290O335Q540R979J0910J2352J4496J6564J8126J9434K0375K0219
58965H94137J8736J6633J4524J2268R636O835M022J025k034m646o767r094j1968
$$ y = [668456, 666433, 663574, 660050, 656294, 652405, 648229, 643712, 638908, 633902, 628886, 624055, 619257, 614095, 608567, 603293, 598890, 595426, 592664, 590493, 588827, 587424, 586160, 585268, 585083, 585665, 586778, 587958, 588590, 588418, 588130, 588876, 590879, 593051, 594357, 595030, 595943, 597302, 598712, 600199, 602400, 605810, 610447, 616302, 623557, 632255, 642106, 652633, 663256, 673307, 682371, 690538, 697997, 704429, 709205, 712163, 713770, 714450, 714137, 712659, 710294, 707735, 705571, 703989, 702932, 702453, 702806, 704167, 706380, 709149, 712420, 716281, 720512, 724492, 727659, 729859, 731200, 731851, 732035, 731909, 731338, 730074, 728257, 726471, 725249, 724832, 725374, 726960, 729398, 732517, 736807, 743142, 751682, 761661, 772571, 784923, 799419, 815983, 834109, 853543, 873918, 894137, 912873, 929506, 944030, 956298, 965934, 972769, 976791, 977816, 975782, 971136, 964369, 955275, 943307]
58952I43307j4677j6325j6900j7015j7030j6846j6270j5189j3744j2417j1628
58941G75266j1102j0096q383o508n016l992l409l268l232k785j966j307j009q10
58927G12383p72j312k261k713k166j054N0R16J218O70j11N7J155J769J267R47
58911G10043K081L935M994N235N855P280Q884J0340J1938J3581J4718J5343J6080
58898H30307J7082J7733J7562J6750J5558J4094J2825J2609J3771J5632J7287
58887A001210J8447J9268J9715J9550J8784J7765J6746J5581J3985J2029J0153
58876A183233Q545O818M588K192L51q87k319m436o697q205q840r294j0197j1528
58862A143324j2746j3390j3544j3790j4579j5770j6950j7950j8654j8657j7770
$$ y = [943307, 928630, 912305, 895405, 878390, 861360, 844514, 828244, 813055, 799311, 786894, 775266, 764164, 754068, 745685, 739177, 734161, 730169, 726760, 723492, 720260, 717475, 715509, 714202, 713193, 712383, 711611, 710299, 708038, 705325, 703159, 702105, 702155, 703071, 704289, 704959, 704848, 704905, 706060, 707829, 709096, 710043, 712124, 716059, 721053, 726288, 732143, 739423, 748307, 758647, 770585, 784166, 798884, 814227, 830307, 847389, 865122, 882684, 899434, 914992, 929086, 941911, 954520, 968291, 983923, 1001210, 1019657, 1038925, 1058640, 1078190, 1096974, 1114739, 1131485, 1147066, 1161051, 1173080, 1183233, 1191778, 1198596, 1203184, 1205376, 1205727, 1204840, 1202521, 1198085, 1191388, 1183183, 1174343, 1165049, 1154852, 1143324, 1130578, 1117188, 1103644, 1089854, 1075275, 1059505, 1042555, 1024605, 1005951, 987294, 969524]
58851I69524j6661j6247j6439j6308j5488j4543j3902j3381j2893j2684j2577
58840H08401j2004j1203j1226j2266j2998j2385j1071j0155r529q482p101n890
58828F84091m624k861j109l26l49o0R94K157K880L416M177N148O086O731O730
58813G13081O060N428N662O567O973O048M115K060M58o05j260j637j864k198l061
58798G45827m586o098o526n696m650m358m527m264l393k438j602n32J014K911
58784G01082M968P038Q930J0616J2390J4376J6106J7032J7126J6599J5335J3216
58772H54814J0573P698M173n00n772j0314j3339j5043j5781j5632j4813j3847
58760G72217j3103j2563j2188j2000j1746j0950r510p889o599n742n103m474l802
$$ y = [969524, 952863, 936616, 920177, 903869, 888381, 873838, 859936, 846555, 833662, 820978, 808401, 796397, 785194, 773968, 761702, 748704, 736319, 725248, 715093, 705564, 697082, 689981, 684091, 679467, 676606, 675497, 675171, 674822, 674762, 675756, 677913, 680793, 684209, 688386, 693534, 699620, 706351, 713081, 719141, 724569, 730231, 736798, 743771, 749819, 753934, 755994, 756452, 755847, 754587, 752950, 751086, 748888, 745827, 741241, 735143, 728617, 722921, 718271, 713913, 709386, 705122, 701729, 699291, 697689, 697157, 698171, 701082, 706050, 713088, 722018, 732634, 745024, 759400, 775506, 792538, 809664, 826263, 841598, 854814, 865387, 873085, 877258, 876758, 870986, 860672, 847333, 832290, 816509, 800877, 786064, 772217, 759114, 746551, 734363, 722363, 710617, 699667, 690157, 682268, 675669, 669927, 664824, 660350, 656548]
58747F56548l150k575k007j332o57k16P6O76J783L026L919M359M466M340M206
58732F73462M351M687M750M450M337M696M949M468L530K915K881L099L341L695
58718G29611M344N464P078Q729R694R815R635R426Q726P276N604M075K092r27
58704H20642m335o964q720j0538j3048j6035j8921k0991k1506k0362j8568j7274
58692F43380j6485j5364j3551j1532r877q827q380q179p529o104m405l044j995
58679E28108j094o36o82l89R61K642L345K983K695L253M493O137Q063R842J0972
58664E80693J1594J2106J2210J1261R361P138M497P77l849q129j1086j2702j3223
58651F00648j2784j1842j0993j0130q695o891n695n456n431n040m647m655m662
$$ y = [656548, 653398, 650823, 648816, 647484, 646827, 646611, 646687, 647363, 649146, 652172, 656091, 660450, 664916, 669256, 673462, 677813, 682500, 687250, 691700, 696037, 700733, 705682, 710150, 713680, 716595, 719476, 722575, 725916, 729611, 733955, 739419, 746497, 755226, 764920, 774735, 784370, 793796, 802522, 809798, 815402, 819477, 821569, 820642, 816307, 809343, 800623, 790085, 777037, 761002, 742081, 721090, 699584, 679222, 660654, 643380, 626895, 611531, 597980, 586448, 576571, 567744, 559364, 551185, 543656, 537552, 533147, 530103, 528108, 527014, 526378, 525696, 525307, 526268, 528910, 532255, 535238, 537933, 541186, 545679, 551816, 559879, 569721, 580693, 592287, 604393, 616603, 627864, 637225, 644363, 648860, 649637, 645788, 637659, 626573, 613871, 600648, 587864, 576022, 565029, 554899, 546204, 539313, 533618, 528162, 522731, 517691, 513044, 508389, 503727]
58638E03727m016k613q04R75K194K407J816J191J017J117J235J416J675J742J411
58623E14490P53r7r92j576j458o24N50J693K562L017L217L600M222M505M085L490
58607E41437L330L321K892K350K435L005L162K626J958J478Q57jo06n83j69J30
58591E67622K8k84mJ758M712P227Q144Q216Q838R976J0539J0319J0139J0364J0562
58576F68156J0555J0445R743P943N976N551O804Q083Q453Q988J0924J3826J6423
58563G91870J8304J9950K1684K3312K4370K4364K3038K0633J7546J3843R621N490
58551A014025K053q10l372n110n402m870m869n772o889p982r581j1885j4490j7247
58537I17799k0143k2415k3075k2379k1477k0605j9004j6638j4492j2978j1482
$$ y = [503727, 499711, 497098, 496294, 497269, 499463, 501870, 503686, 504877, 505894, 507011, 508246, 509662, 511337, 513079, 514490, 515243, 515146, 514154, 512578, 511120, 510496, 511046, 512739, 515301, 518318, 521535, 525135, 529357, 533862, 537947, 541437, 544767, 548088, 550980, 553330, 555765, 558770, 561932, 564558, 566516, 567994, 568851, 568850, 568244, 567661, 567492, 567622, 567650, 567366, 567362, 569120, 573832, 581059, 589203, 597419, 606257, 616233, 626772, 637091, 647230, 657594, 668156, 678711, 689156, 698899, 706842, 712818, 718369, 725173, 733256, 741709, 750697, 761621, 775447, 791870, 810174, 830124, 851808, 875120, 899490, 923854, 946892, 967525, 985071, 998914, 1008535, 1014025, 1016078, 1015268, 1011896, 1006786, 1001384, 996514, 991645, 985873, 978984, 971002, 961421, 949536, 935046, 917799, 897656, 875241, 852166, 829787, 808310, 787705, 768701, 752063, 737571, 724593, 713111]
58526G13111r785q437p487o312n056m689n261n552n009m511m662m777m267l604
58512F33702l171k499j362m21j03L3J93j26r56j466j344j298j558j274j31P96
58496F19015P29L76N70R80J133J499K526L649M305M959O140P363P985Q373R342
58481F78944J1077J3231J5376J6826J6971J6249J5751J5411J3762J0118N744K092
58469H31552q74l782o508q653j0284j1275j0849q714n810l137p74J420L166M540
58455G70018O287Q598J0534J1318J1140J0187Q125N182K463M52j625m258o773
58442H31648q641j0258j1682j2029j1005r601q456o958m861l185k438j550K53
58429G41237K020K757L168M390O290Q160R868J1071J0706Q505N796L642J531j036
$$ y = [713111, 703326, 694889, 687402, 681090, 676034, 671345, 666084, 660532, 655523, 651012, 646350, 641573, 637306, 633702, 630531, 628032, 626670, 626249, 626146, 626179, 626372, 626246, 625290, 623824, 622480, 621182, 619624, 618350, 618219, 619015, 619744, 620120, 620690, 621670, 622803, 624302, 626828, 630477, 634782, 639741, 645881, 653244, 661229, 669602, 678944, 690021, 703252, 718628, 735454, 752425, 768674, 784425, 799836, 813598, 823716, 829460, 831552, 830678, 826896, 820388, 811735, 801451, 790176, 779327, 770613, 764803, 761666, 760892, 762312, 765478, 770018, 776305, 784903, 795437, 806755, 817895, 828082, 836207, 841389, 843852, 844304, 842679, 838421, 831648, 823007, 812749, 801067, 789038, 778033, 768432, 759976, 753018, 748157, 744972, 742534, 740984, 741237, 743257, 746014, 749182, 753572, 759862, 768022, 777890, 788961, 799667, 808172, 813968, 817610, 819141, 818105]
58415H18105l217m410n530p279q613q452p567p168p028o506o069o163n851m274
58401G29978k245q93P3J224J983J926K045L037L715L019K157K730L996M093K954
58386G59792J932J461J079R79J637K639L450M492N917O549N745N022N870P170
58372H13734O923N482M904N828P087P879Q420R007R874J1347J2911J3166J1979
58359I28541J1230J2077J3071J2567J1164R905Q064N005K364J808K241J837J270
58346A021144K161L742M101L539L792M938N867O814Q647J0569J1259J1403J2478
58333A110454J4012J4704J5044J6096J6864J5829J3921J2944J2247J0116P342
58322A259573O065O004N195L722L282L805L806L503M305N849O761P585R662J2001
$$ y = [818105, 814888, 810478, 804948, 797669, 789056, 780604, 773037, 765869, 758841, 752335, 746266, 740103, 734252, 729978, 727733, 726840, 726913, 728137, 730120, 732046, 734091, 737128, 740843, 743862, 746019, 748749, 752745, 756838, 759792, 761724, 763185, 764264, 765243, 766880, 769519, 772969, 777461, 783378, 789927, 795672, 800694, 806564, 813734, 820657, 826139, 831043, 836871, 843958, 851837, 860257, 869264, 879138, 890485, 903396, 916562, 928541, 939771, 951848, 964919, 977486, 988650, 998555, 1006619, 1011624, 1013988, 1015796, 1018037, 1019874, 1021144, 1023305, 1027047, 1031148, 1034687, 1038479, 1043417, 1049284, 1056098, 1064745, 1075314, 1086573, 1097976, 1110454, 1124466, 1139170, 1154214, 1170310, 1187174, 1203003, 1216924, 1229868, 1242115, 1252231, 1259573, 1265638, 1271642, 1276837, 1280559, 1283841, 1287646, 1291452, 1294955, 1299260, 1305109, 1311870, 1319455, 1329117, 1341118]
58308A341118J2652J2303J3015J4339J4402J3883J4919J6789J6879J5348J4752
58297A500399J5472J5672J5431J6563J8586J9149J8442J8905K0643K1447K1276
58286A701985K2312K4479K5390K4977K5663K7654K8594K8285K9140L1416L2607
58275B002502L2267L2905L5321L7422L8483M0249M3071M5185M6485M8762N1688
58264B454340N2985N2984N4558N8047O0822O2204O4031O6146O6392O5452O6457
58253C124418O9302P0741P0518P1864P5391P8309Q0360Q4475R0760R5900R9510
58242D011548J04868J12441J19042J24430J32007J41992J50682J57738J67070
58233E221818J79328J90772K00954K13895K30251K46171K61430K80409L03473
$$ y = [1341118, 1353770, 1366073, 1379088, 1393427, 1407829, 1421712, 1436631, 1453420, 1470299, 1485647, 1500399, 1515871, 1531543, 1546974, 1563537, 1582123, 1601272, 1619714, 1638619, 1659262, 1680709, 1701985, 1724297, 1748776, 1774166, 1799143, 1824806, 1852460, 1881054, 1909339, 1938479, 1969895, 2002502, 2034769, 2067674, 2102995, 2140417, 2178900, 2219149, 2262220, 2307405, 2353890, 2402652, 2454340, 2507325, 2560309, 2614867, 2672914, 2733736, 2795940, 2859971, 2926117, 2992509, 3057961, 3124418, 3193720, 3264461, 3334979, 3406843, 3482234, 3560543, 3640903, 3725378, 3816138, 3912038, 4011548, 4116416, 4228857, 4347899, 4472329, 4604336, 4746328, 4897010, 5054748, 5221818, 5401146, 5591918, 5792872, 6006767, 6237018, 6483189, 6744619, 7025028, 7328501]
58224G328501L26064L48050L74853M07515M41260M75899N17377N66788O18785
58215A1405092O73446P38231Q15327Q99318R90583J097988J224957J367221J528434
58206B0740597J722532J956077K225497K538085K918224L387456L960143M668824
58198D4117435N574082O743779Q252022J0211037J2766805J6026985J9992141
58191A23684286K4531714K9336838L3831754L7186310L8527761L7199877L2866121
58184C57164661K5521142J5611799M192488p217501j7155224k4727584k9715948
58177C23673833l2324228l2915887l1913301k9767658k6908272k3703080k0456043
58170A25685364j7399244j4667932j2305665j0308467q655504p305948o201648
$$ y = [7328501, 7654565, 8002615, 8377468, 8784983, 9226243, 9702142, 10219519, 10786307, 11405092, 12078538, 12816769, 13632096, 14531414, 15521997, 16619985, 17844942, 19212163, 20740597, 22463129, 24419206, 26644703, 29182788, 32101012, 35488468, 39448611, 44117435, 49691517, 56435296, 64687318, 74898355, 87665160, 103692145, 123684286, 148216000, 177552838, 211384592, 248570902, 287098663, 324298540, 357164661, 382685803, 398297602, 402490090, 395272589, 378117365, 353389781, 323673833, 291349605, 258433718, 226520417, 196752759, 169844487, 146141407, 125685364, 108286120, 93618188, 81312523, 71004056, 62348552, 55042604, 48840956]
58163D8840956n291844m544955l933341l424508k994023k631770k328310k067420
58155B1624785j837370j637014j464920j313058j175820j054699r49377q53836
58147A1338691p65340o87788o22165n62738n06568m57898m19107l85791l54785
58138F576511l28881l09412k91856k73034k55632k41494k27255k10710j95134
58129D243103j83156j72232j60072j48912j40624j32942j24140j16394j10979
58120B953652j05120r7057q9549q4907q1117p6127p1596o9132o6928o3409o0252
58109B088458n8663n6589n2642m9033m7592m6455m3785m1257m0709m0669l9301
58098A571763l7796l7784l8089l6954l5060l3699l2244k9866k7476k5822k3905
$$ y = [48840956, 43549112, 39004157, 35070816, 31646308, 28652285, 26020515, 23692205, 21624785, 19787415, 18150401, 16685481, 15372423, 14196603, 13141904, 12192527, 11338691, 10573351, 9885563, 9263398, 8700660, 8194092, 7736194, 7317087, 6931296, 6576511, 6247630, 5938218, 5646362, 5373328, 5117696, 4876202, 4648947, 4438237, 4243103, 4059947, 3887715, 3727643, 3578731, 3438107, 3305165, 3181025, 3064631, 2953652, 2848532, 2751475, 2661926, 2577019, 2495902, 2419775, 2348179, 2279047, 2212119, 2148710, 2088458, 2029795, 1973206, 1920564, 1871531, 1823939, 1777484, 1733699, 1692442, 1651733, 1611064, 1571763, 1533967, 1496183, 1458094, 1421140, 1386080, 1352381, 1320137, 1290271, 1262795, 1236973, 1213068]
58087A213068k1194j9052j8212j7285j5564j4654j5569j6803j7028j7104j7722
58076A022881j7800j6938j6645j7365j7165j5313j4117j5030j5882j4474j2171
58065H49981j1305j1433j0908r970r614r294q290p673q553r940j0462j0627j1297
58052G20615j1629j0641r267q829q897q492p959p881p673o904o530p080p359o525
58038F04949n785o291p090o951o496o734p143p085p443q905j0212j0042r147q697
58024D96928q171o853n826o229o963o346m833l916l474k481j394j563k909m089
58010D31881m486m381l856l040k638k788k397r24L50L92L17J419K654K242P12
57995D15457N4O06R78O14L03M12N04N38Q27J015N88P9L27Q84O32l19p88l42L69
$$ y = [1213068, 1191874, 1172822, 1154610, 1137325, 1121761, 1107107, 1091538, 1074735, 1057707, 1040603, 1022881, 1005081, 988143, 971498, 954133, 936968, 921655, 907538, 892508, 876626, 862152, 849981, 838676, 827243, 816335, 806365, 796751, 787457, 779167, 771494, 762941, 753001, 742539, 731912, 720615, 708986, 698345, 689078, 680249, 671352, 662860, 654901, 647020, 639347, 632443, 625913, 618833, 611474, 604949, 599164, 592873, 585783, 578832, 572336, 565602, 558459, 551374, 543931, 535026, 524814, 514772, 505625, 496928, 488757, 481904, 476078, 469849, 462886, 456540, 451707, 447791, 444317, 441836, 440442, 438879, 435970, 431881, 427395, 423014, 419158, 416118, 413480, 410692, 408295, 407371, 407721, 408113, 408430, 409849, 412503, 414745, 415457, 415511, 416117, 417095, 417709, 418012, 418424, 418928, 419466, 420293, 421308, 421896, 421975, 422302, 423186, 423818, 423499, 422711, 422369, 422738]
57976D22738R01J478K294L338M620N839O328O002N684N699N088L200R79m77j613
57961D72098l295m992n601n345n347n891o547p406q724r810r647q378o999n954
57947C78162n142m649m490m062k977j773q34N35K802M886N566N397N765O697P137
57932C93020O850O446N961M839L097J236o53k504l621l627l571m706o572p706
57918C88489p675p130o323n127m088l879l903k932j047N09J226J750K418K727
57904C55015K295J300l4j436k320k448k559l289l923l304j708m89k38m18n28m18
57888C35498K29J505K583K620K114K125K516K274J344P23P53O67j00j213k179
57873C51459k750k684j973j262j154j364j404j610k460l311l107k021j166r22
$$ y = [422738, 423639, 425117, 427411, 430749, 435369, 441208, 447536, 453538, 459222, 464921, 470009, 473209, 474188, 473711, 472098, 468803, 463811, 458210, 452865, 447518, 441627, 435080, 427674, 418950, 409140, 399493, 391115, 384116, 378162, 373020, 368371, 363881, 359819, 356842, 355069, 354235, 354770, 357572, 362458, 368024, 373421, 379186, 385883, 393020, 399870, 406316, 412277, 417116, 420213, 421449, 420796, 418292, 414671, 411044, 407473, 402767, 396195, 388489, 380814, 373684, 367361, 362234, 358146, 354267, 350364, 347432, 346385, 346894, 348120, 349870, 352288, 355015, 357310, 358610, 358576, 357140, 354820, 352372, 349813, 346524, 342601, 339297, 337589, 337100, 336862, 336444, 335916, 335498, 335727, 337232, 339815, 342435, 344549, 346674, 349190, 351464, 352808, 353531, 354284, 354951, 354851, 353638, 351459, 348709, 346025, 344052, 342790, 341636, 340272, 338868, 337258, 334798, 331487, 328380, 326359, 325193, 324271]
57859C24271p32l18P1M76J120J770K113K482L170L518K866J832J383J264P32J58
57843C46176L29P45L55m61n26p1k92r51o54N51J057M25M8O67J276J139R14J073
57825C51800J059P79J137K140K266P77r23j327q37n68n70m94q91k414m523o142
57809C41269p034p541p628p193o708o665o744o305n315m170l044j967j068k98
57795B69589O73J874K795L044K727K005R10j43m42Q8P12R20J022J411J958K399
57779B91542K678K689K333J978K125K542K532K088J819J634P44p94j732j381o14
57764C10183n56j204j920k419k643k412j773j132o96l81l31p30j029m04Q97J727
57748B95177J754J731J972J938J653J839K226J444n87k007j797j405k252l247
$$ y = [324271, 323539, 323221, 323292, 323768, 324888, 326658, 328771, 331253, 334423, 337941, 340807, 342639, 344022, 345286, 346018, 346176, 346505, 347250, 347605, 347144, 346618, 346547, 346255, 345304, 344650, 345201, 346258, 346683, 346731, 347398, 348674, 349813, 350727, 351800, 352859, 353638, 354775, 356915, 359181, 359958, 359035, 357708, 356871, 356303, 355733, 355239, 354348, 351934, 347411, 341269, 334235, 326694, 319066, 311873, 305165, 298500, 291756, 285451, 280136, 275966, 272922, 270955, 269887, 269589, 270262, 272136, 274931, 277975, 280702, 282707, 283617, 283474, 283032, 283120, 283832, 284752, 285774, 287185, 289143, 291542, 294220, 296909, 299242, 301220, 303345, 305887, 308419, 310507, 312326, 313960, 314704, 313910, 312178, 310797, 310183, 309627, 308423, 306503, 304084, 301441, 299029, 297256, 296124, 295428, 295047, 294716, 293986, 292957, 292553, 293450, 295177, 296931, 298662, 300634, 302572, 304225, 306064, 308290, 309734, 309147, 307140, 305343, 303938, 301686, 298439]
57734B98439k633r21Ok12m15k27l31p03m69M18R87R35J049J669K007J441M43j77
57716C01306j78K64Q73J178P70j09p11o73l53k18l11m34m60l99m29p81j368j724
57698B96243j566j181j010j145j515k154k899l222k909k502k606l025l102k576
57684B64831j684p08M0K55J26N44K156M581P060R578J2722J6778K1650K7463L4435
57669C99827M2092M9153N4223N6238N4379M8022L6962K1686L702j4315k9320l9508
57657F83141m5035m6993m6164m3077l8617l3805k9150k4724k0587j6750j3118
57646C25121r866p483n954m485k607j011n48q65r39o20o50j343k084k295k118
57631B82253j997k154k533k827k681k200k110k860l834m016l300k503k234k343
$$ y = [298439, 295806, 294885, 294891, 294679, 294264, 294037, 293706, 293003, 292534, 292952, 293939, 294874, 295923, 297592, 299599, 301040, 301483, 301306, 301128, 301392, 302265, 303443, 304213, 304104, 303393, 302720, 302367, 302149, 301838, 301404, 300944, 300545, 300116, 299335, 297967, 296243, 294677, 293496, 292486, 291341, 289826, 287672, 284773, 281551, 278642, 276140, 273534, 270509, 267407, 264831, 263147, 262439, 262479, 262734, 262860, 263404, 265560, 270141, 277201, 286779, 299501, 316279, 337929, 365392, 399827, 441919, 491072, 545295, 601533, 655912, 703934, 740896, 762582, 766284, 751969, 722649, 683141, 638106, 591113, 544949, 501872, 463255, 429450, 400300, 375576, 354989, 338239, 325121, 315255, 307772, 301818, 297333, 294726, 293715, 293167, 292302, 291363, 290743, 290093, 288750, 286666, 284371, 282253, 280256, 278102, 275569, 272742, 270061, 267861, 265751, 262891, 259057, 255041, 251741, 249238, 247004, 244661]
57617B44661k454k371j972j276p30q69j619k277k278j660r13o20j111j968k097
57602B20446q29J098K207J860P50j40n45p98j189j657j911j787j537j514j530
57587B12924r27M10J611J826J353J096J303J492J403J228R78L15q05j897k488
57572B19822k466j993j400j212j735k616l171l168k899k624k379k305k564k897
57558A86393k724j850p55m6J37J12L24R69J763K164J966J592J492J529J213M61
57542A94740k57m07J39R79J341P14m95j232j006m83n34j174j801j990j590n91
57526A86353N10P28k77j464j650j035o58o49j55J089K236K568K352K086J724J071
57510A94829M08K10N88J247J789J895J534J047Q04P42N07J2m36n84n17m98p50
$$ y = [244661, 242207, 239836, 237864, 236588, 235858, 234989, 233370, 231093, 228815, 227155, 226242, 225622, 224511, 222543, 220446, 219617, 220715, 222922, 224782, 225532, 225392, 224847, 224049, 222860, 221203, 219292, 217505, 215968, 214454, 212924, 211997, 212407, 214018, 215844, 217197, 218293, 219596, 221088, 222491, 223719, 224697, 225012, 224207, 222310, 219822, 217356, 215363, 213963, 212751, 211016, 208400, 205229, 202061, 199162, 196538, 194159, 191854, 189290, 186393, 183669, 181819, 181064, 181018, 181155, 181267, 181591, 182560, 184323, 186487, 188453, 190045, 191537, 193066, 194279, 194740, 194483, 194076, 194215, 195194, 196535, 197249, 196754, 195522, 194516, 194033, 193499, 192325, 190524, 188534, 186944, 186353, 186863, 187591, 187314, 185850, 184200, 183165, 182507, 181858, 181703, 182792, 185028, 187596, 189948, 192034, 193758, 194829, 195237, 195447, 196035, 197282, 199071, 200966, 202500, 203547, 204351, 205093, 205600, 205612, 205176, 204592, 204075, 203577, 202827]
57493B02827j209j392p67N13J609J995K001J978J591N16o97j271j283j235j054
57478B04122m55J07j02q10j077p91p40j188j549j637j997k690k887k229j566j702
57462A82809k256k389j957j298n11L77R91J010O51L20N3k83n40n31l73k76j72
57445A75625J56P18J315J714J720J322P90L81O1j58J84J373K642K791J804J013
57429A93451J241J712J340M27K05J098K186K354J462K96k77j01J91j14j050j963
57413B02458k228j745q40L9N92R38J511K320K617J773K96o99q66p60p16n51l82
57396B03757p37j538j916j454q05n87m36K00J015J311J080R13J108J428J608J699
57380B06646J949K560L379L773L197J945R24N83N59M51L32K11k64j203k133k619
$$ y = [202827, 201618, 200226, 199459, 199972, 201581, 203576, 205577, 207555, 209146, 209662, 208965, 207694, 206411, 205176, 204122, 203667, 203774, 203672, 202862, 201785, 200994, 200254, 199066, 197517, 195880, 193883, 191193, 188306, 186077, 184511, 182809, 180553, 178164, 176207, 174909, 174398, 174775, 175766, 176776, 177427, 177747, 177800, 177517, 176977, 176446, 176073, 175797, 175625, 175781, 176499, 177814, 179528, 181248, 182570, 183360, 183741, 183802, 183644, 183828, 185201, 187843, 190634, 192438, 193451, 194692, 196404, 197744, 198171, 198376, 199474, 201660, 204014, 205476, 205772, 205495, 205394, 205585, 205471, 204421, 202458, 200230, 198485, 197645, 197684, 198276, 199214, 200725, 203045, 205662, 207435, 207731, 207032, 206166, 205406, 204690, 204139, 203757, 203020, 201482, 199566, 198112, 197307, 196720, 196284, 196484, 197499, 198810, 199890, 200803, 201911, 203339, 204947, 206646, 208595, 211155, 214534, 218307, 221504, 223449, 224373, 224956, 225515, 225966, 226298, 226509, 226245, 225042, 222909, 220290]
57364B20290k735k583j958q71J01M55L30Q8j32j57L09J121J616J539J439J676
57348B20528J734J114L29J70N36O88M02M2j98m32o23n99l66j1N27J080J051J51
57330B26123r66j446j305j135r78l35Q32J872K279K189J922J622J403J336J130
57315B34543L28q91j591j044L59J446J466P19J0l14n21q01q16k23O49J164J225
57298B35708J288J569J798J796J669J417R13M41O04J443K263K555K540K570K657
57283B61231K831L261L713L633L099K944L496M018L945L878M557N642O268O329
57269C18845O335O429O391O229O021N505M500L503L103L187L280L346L582L796
57255C84052L680L439L462L614L525L272L208L424L885M679N522N638M838M182
$$ y = [220290, 217555, 214972, 213014, 212143, 212244, 212699, 213029, 213117, 212985, 212828, 213137, 214258, 215874, 217413, 218852, 220528, 222262, 223376, 223705, 223875, 224411, 225099, 225501, 225543, 225345, 224913, 224290, 223691, 223325, 223314, 223841, 224921, 225972, 226123, 225157, 223711, 222406, 221271, 220293, 219958, 220790, 222662, 224941, 227130, 229052, 230674, 232077, 233413, 234543, 234871, 233980, 232389, 231345, 231704, 233150, 234616, 235335, 235345, 235031, 234510, 233709, 232893, 232670, 233319, 234483, 235708, 236996, 238565, 240363, 242159, 243828, 245245, 246158, 246599, 247203, 248646, 250909, 253464, 256004, 258574, 261231, 264062, 267323, 271036, 274669, 277768, 280712, 284208, 288226, 292171, 296049, 300606, 306248, 312516, 318845, 325180, 331609, 338000, 344229, 350250, 355755, 360255, 363758, 366861, 370048, 373328, 376674, 380256, 384052, 387732, 391171, 394633, 398247, 401772, 405044, 408252, 411676, 415561, 420240, 425762, 431400, 436238, 440420]
57241D40420M724O076P184P953R015J0216J0697J0352J0033J0209J0510J0728
57229E48117J1171J1768J1798J0947R857R239R083R064R201R690J0499J1373J2130
57216F83937J2791J3606J4797J6112J6894J6941J6903J7374J7940J7772J6875
57205H61942J6041J5774J5900J6063J6014J5599J5007J4786J5100J5261J4708
57194A032195J3947J3754J3826J3252J2041J1198J1364J2265J3476J4828J6037
57183A178183J6735J6979J7113J7217J7162J7049J6977J6803J6709J7438J9124
57172A367489K0530K0550J9930K0220K1483K2440K2582K2630K2998K3304K3444
57161A607600K3787K4174K4034K3584K3605K4048K4120K3782K3643K3401K2008
$$ y = [440420, 445144, 451220, 458404, 466357, 475372, 485588, 496285, 506637, 516670, 526879, 537389, 548117, 559288, 571056, 582854, 593801, 603658, 612897, 621980, 631044, 640245, 649935, 660434, 671807, 683937, 696728, 710334, 725131, 741243, 758137, 775078, 791981, 809355, 827295, 845067, 861942, 877983, 893757, 909657, 925720, 941734, 957333, 972340, 987126, 1002226, 1017487, 1032195, 1046142, 1059896, 1073722, 1086974, 1099015, 1110213, 1121577, 1133842, 1147318, 1162146, 1178183, 1194918, 1211897, 1229010, 1246227, 1263389, 1280438, 1297415, 1314218, 1330927, 1348365, 1367489, 1388019, 1408569, 1428499, 1448719, 1470202, 1492642, 1515224, 1537854, 1560852, 1584156, 1607600, 1631387, 1655561, 1679595, 1703179, 1726784, 1750832, 1774952, 1798734, 1822377, 1845778, 1867786]
57150A867786J9667J8001J7812J8200J8354J8701J9696K0916K2025K3388K5162
57139B089708K6934K8741L1189L4194L6944L9421M2495M6115M9021N0720N2149
57128B527631N3842N5177N6067N7588O0173O3049O6206P0879P7097Q2829Q6859
57117C257397R0655R6037J02943J10973J21143J34359J49775J66399J84779K05459
57107D619919K27572K50725K76575L06861L41808L82597M33669N00566N87392
57098G927684O98647Q41465J023485J250519J528536J865076K264496K722731
57090B0122639L228305L764689M307725M825042N285027N666260N956380O148900
57082E9304967O247734O261191O164691N862927N215492M133224K662369R73601
$$ y = [1867786, 1887453, 1905454, 1923266, 1941466, 1959820, 1978521, 1998217, 2019133, 2041158, 2064546, 2089708, 2116642, 2145383, 2176572, 2210766, 2247710, 2287131, 2329626, 2375741, 2424762, 2475482, 2527631, 2581473, 2636650, 2692717, 2750305, 2810478, 2873527, 2939733, 3010612, 3087709, 3170538, 3257397, 3348052, 3444089, 3547032, 3658005, 3779148, 3913507, 4063282, 4229681, 4414460, 4619919, 4847491, 5098216, 5374791, 5681652, 6023460, 6406057, 6839726, 7340292, 7927684, 8626331, 9467796, 10491281, 11741800, 13270336, 15135412, 17399908, 20122639, 23350944, 27115633, 31423358, 36248400, 41533427, 47199687, 53156067, 59304967, 65552701, 71813892, 77978583, 83841510, 89057002, 93190226, 95852595, 96826196]
57074I6826196p29129k292062l632338m715638n532650o087316o390629o459561
57066F0986873o322014o019214n598865n105750m578543m050343l546603l082572
57058B2682969k665330k298136j981635j712768j485768j294767j134404r98881
57050I111280q82494p81165o92338o13689n43188m80039m24287l75426l32305
57041C986349k94182k60904k32056k06742j84131j63518j44013j24928j06266
57032B269609q8157p0028n1148l1879j3760J419J1654J4041N642j3806m0246o6937
57020A926404q8109j01454j07823j09115j06489j00387r1710q2231p3499o5808
57010I99779n8736n2232m6544m1508l6808l2738k9854k7870k5884k3751k2214
$$ y = [96826196, 96097067, 93805005, 90172667, 85457029, 79924379, 73837063, 67446434, 60986873, 54664859, 48645645, 43046780, 37941030, 33362487, 29312144, 25765541, 22682969, 20017639, 17719503, 15737868, 14025100, 12539332, 11244565, 10110161, 9111280, 8228786, 7447621, 6755283, 6141594, 5598406, 5118367, 4694080, 4318654, 3986349, 3692167, 3431263, 3199207, 2992465, 2808334, 2644816, 2500803, 2375875, 2269609, 2181452, 2111424, 2060276, 2028397, 2014637, 2016056, 2027710, 2041751, 2047393, 2033587, 1993341, 1926404, 1838295, 1736841, 1629018, 1519903, 1413414, 1313027, 1221317, 1139086, 1065587, 999779, 941043, 888811, 842267, 800759, 763951, 731213, 701359, 673489, 647605, 623854, 601640]
56999F01640k1458k0602j9121j7701j7023j6559j5438j3707j1848r671o732l407
56987D28373m02K442N713Q980J0925J0914R353O483K059l499q790j2813j5699
56974D44039j7657j8294j7529j6209j4965j3273j0548p417m901k832j16L634P743
56961C31675J1512J4779J7504J9538K0724K0518J7776J1858L987l389q805j2689
56949D44988j5965j8646k0138k0201j9021j6799j3775j0416p170m082r33K410
56937C00252N954R781J4040J8684K3261K6964K8934K8592K5689K0100J1908J858
56925E16017q537j7669k4547k8824l0533l0158k8604k6561k4023k0783j7231j4153
56913B44394j1950j0439r347q469p572o558n708n221m733l820k785k244k058j417
$$ y = [601640, 580182, 559580, 540459, 522758, 505735, 489176, 473738, 460031, 448183, 438512, 431780, 428373, 427971, 430413, 436126, 445106, 456031, 466945, 476298, 482781, 484840, 481341, 472551, 459738, 444039, 426382, 408088, 390559, 374350, 359385, 346112, 335564, 328147, 323246, 320414, 320298, 323932, 331675, 343187, 357966, 375470, 395008, 415732, 436250, 454026, 465884, 469871, 466482, 457677, 444988, 429023, 410377, 390239, 370038, 351017, 334218, 320443, 310027, 302857, 298775, 297842, 300252, 306206, 315987, 330027, 348711, 371972, 398936, 427870, 456462, 482151, 502251, 514159, 516017, 507480, 489811, 465264, 436440, 405907, 375749, 347145, 320584, 296561, 275778, 258547, 244394, 232444, 222005, 212658, 204189, 196617, 190059, 184351, 179130, 174397, 170577, 167792, 165548, 163490, 162073]
56899A62073r7J154J685J788K249L563N776Q593J1432J3809J5827J7824J9558
56886B65234K0284J9694J8037J5286J1001N418j46m501p569r723j0838j0697r740
56873C01740q564o985m392q67K809O306J0214J5235K1428K8343L5420M2005M7224
56860D89916N0146M9979M6102L8199K6643J2768j441j4111k4133l1100l4857l5379
56848E72732l3165k9303k4687j9353j2898n372K740J1297K0692L1180M2489N4116
56836F10468O5392P5086Q1417Q2722P7799O5731M6410K1714m388k7738m5962n8617
56824I90034o6050o8780o7527o3151n6440m8243l9543l0996k2463j3324l196P758
56812E18079J8998K9821L9566M7797N3935N6646N4085M5291L1184J3964m160k1336
$$ y = [162073, 161976, 163130, 164815, 166603, 168852, 172415, 178191, 186784, 198216, 212025, 227852, 245676, 265234, 285518, 305212, 323249, 338535, 349536, 354954, 354808, 350307, 342738, 333015, 322177, 311480, 301740, 293176, 286191, 281799, 280932, 283741, 290047, 300261, 315496, 336924, 365267, 400687, 442692, 489916, 540062, 590041, 636143, 674342, 700985, 713753, 712312, 698201, 674068, 642968, 608111, 572732, 539567, 510264, 485577, 466224, 453326, 447954, 450694, 461991, 482683, 513863, 556352, 610468, 675860, 750946, 832363, 915085, 992884, 1058615, 1105025, 1126739, 1122351, 1094613, 1048651, 990034, 923984, 855204, 787677, 724526, 668086, 619843, 580300, 549304, 526841, 513517, 510321, 518079, 537077, 566898, 606464, 654261, 708196, 764842, 818927, 864218, 895402, 909366, 905206, 883870]
56800H83870l5819m6268n2416n5006n4882n2415m7764m1411l4285k7355k1025
56789D15224j4926q457j600N094J1260J7000K2330K6711K9295K9194K5538J8107
56777E74770Q191j980j1096j9367k6862l2344l4692l4601l3577l1867k8835k4964
56765C02776k1839j9907j7943j5176j2513j0959j0057q911p732p225p142o583
56753A56789n401m222l329k524j946k005k442k431j757j106r03p80n32o85j513
56738A25213k205j886r53m84o48o27p5M19M56M77Q66J165Q29J69r6J29M49P73
56720A23971J268J690J550J007Q77J541K364K419J437j13j501k142j891j079j35
56705A31263Q78K011K836K658J403j16r59p76J82J249J596R08o9k81K68N97L17
$$ y = [883870, 848051, 801783, 749367, 694361, 639479, 587064, 539300, 497889, 463604, 436249, 415224, 400298, 391841, 390241, 395335, 406595, 423595, 445925, 472636, 501931, 531125, 556663, 574770, 582961, 580981, 569885, 550518, 523656, 491312, 456620, 422019, 388442, 356575, 327740, 302776, 280937, 261030, 243087, 227911, 215398, 204439, 194382, 185471, 177739, 170514, 163372, 156789, 151388, 147166, 143837, 141313, 139367, 137362, 134920, 132489, 130732, 129626, 128723, 127943, 127411, 126726, 125213, 123008, 121122, 120169, 119685, 119037, 118410, 118335, 118754, 119210, 119687, 120553, 121718, 122547, 122716, 122620, 122749, 123198, 123971, 125239, 126929, 128479, 129486, 130363, 131904, 134268, 136687, 138124, 138011, 136510, 134368, 132477, 131398, 131263, 132141, 134152, 136988, 139646, 141049, 140933, 139974, 139198, 139380, 140629, 142225, 143133, 143064, 142783, 143051, 143648, 143965]
56688A43965K02Q32J561J575J191J267J845K317K550K951L540L820L496K710J590
56673A75412K62p39q50l12ml05p11o94l75r9J07M06Q02J133J217Q97K56k47k05
56654A75951J96M54N06P23J072R97L46j73K8M78K74n91j186r16k08K46L84N43
56636A79124O76M09j92n29l51j92n38j013j029r06j435k385k476j229J14J98o29
56619A67617r94n16q3l12p76r34r28j059j117p44p0M54O22N69M39K53rl06n31
56600A61575n96n77o81q46o36J91J105J250N34k79n77n78p11q32m99K50Q75J006
56582A59974Q09O46O79Q41J010J107J147J235J441J677J831J953K198K504K590
56567A81642K369K255K806M083N605O918Q009R072J0164J1181J1870J1711J0059
$$ y = [143965, 144167, 144999, 146560, 148135, 149326, 150593, 152438, 154755, 157305, 160256, 163796, 167616, 171112, 173822, 175412, 175674, 174935, 174085, 173773, 173769, 173464, 172753, 172059, 171684, 171585, 171692, 172098, 172900, 174033, 175250, 176147, 176403, 176156, 175951, 176147, 176601, 177107, 177830, 178902, 179899, 180245, 180072, 180100, 180578, 180852, 180261, 179075, 178159, 177951, 178197, 178581, 179124, 179800, 180209, 180017, 179488, 179137, 178945, 178407, 177394, 176365, 175459, 174024, 171639, 169163, 167934, 168048, 168246, 167617, 166623, 166107, 166024, 165712, 164936, 164002, 163074, 162015, 160898, 160154, 160084, 160538, 161160, 161729, 162168, 162421, 162412, 162106, 161575, 160979, 160402, 159721, 158875, 158239, 158430, 159535, 160785, 161319, 161040, 160463, 159885, 159174, 158342, 157843, 158093, 158968, 159974, 160783, 161429, 162108, 162949, 163959, 165066, 166213, 167448, 168889, 170566, 172397, 174350, 176548, 179052, 181642, 184011, 186266, 189072, 193155, 198760, 205678, 213687, 222759, 232923, 244104, 255974, 267685, 277744]
56554B77744O863L002m01k861m472n307n403n144m928m548l528k176j517j934
56540B45390k583k493j728j037q64j117j551j932k061k005k019k053j703q96k53
56525B21095l58r75j376j183o43l16o08j378j919j760j422j779k651k886k075
56510A99766j193j117j445j495j488j889k324k178j705j509j450j020m54l46n03
56495A79650k08M89P79L23l60o69l50N92J654J776N23r64j173j93N82M93J40n3
56477A83031m71j185j473j009n03n79p98m09N29J288J333P40R9J24R65J859J978
56460A85519J449R39N21j62p74n03N16J099P40L06O59J530K269K780L075K857
56444B02820K110J447J228R82L07l73n65n48q09j181j217r44o45k97J78N27N91
$$ y = [277744, 284607, 287609, 287208, 284347, 279875, 274568, 269165, 264021, 259093, 254545, 251017, 248841, 247324, 245390, 242807, 240314, 238586, 237549, 236685, 235568, 234017, 232085, 230024, 228019, 226000, 223947, 222244, 221348, 221095, 220737, 219762, 218386, 217203, 216560, 216244, 215636, 214258, 212339, 210579, 209157, 207378, 204727, 201841, 199766, 198573, 197456, 196011, 194516, 193028, 191139, 188815, 186637, 184932, 183423, 181973, 180953, 180499, 180153, 179650, 179442, 179931, 180710, 181033, 180673, 180004, 179654, 180246, 181900, 183676, 184199, 183235, 182062, 181869, 182451, 182944, 183084, 183031, 182560, 181375, 179902, 178893, 178390, 177811, 177013, 176604, 177133, 178421, 179754, 180494, 180593, 180717, 181682, 183541, 185519, 186968, 187907, 188428, 188266, 187492, 186989, 187505, 188604, 189344, 189650, 190309, 191839, 194108, 196888, 199963, 202820, 204930, 206377, 207605, 208587, 208894, 208521, 207956, 207408, 206599, 205418, 204201, 203257, 202612, 202315, 202493, 203020, 203611]
56427B03611P10J116J343Q50n9n95n46l54l31l19j09K44N44N64J56n44j100j179
56409B04002q07j74N62J139J218Q26M71N94J046J275R11J13m76k13P80J500J119
56392B13886J19k16O02J767K359K315K015J595J056N63K54Q8N8J78K08j15n21
56375B26211l99L48J166J640J809J705J230O86O35J060J361J341J407J631J538
56360B43369J107J053J689K305K264J874J689J674J652J787K017J728O64l90n70
56345B63912l1M90P01O78M08k3j42L57J173J935K672L332L527L196K939L053K966
56328B91143K287J696J971K713K961K656K547K928L316L260K724J801O65k69o97
56313C21702q29j029j215j012l41N13J255J768K149K670L480M307M903N644P007
$$ y = [203611, 204321, 205437, 206780, 207630, 207571, 206976, 206430, 206076, 205745, 205426, 205317, 205561, 206105, 206669, 206825, 206281, 205181, 204002, 203195, 203021, 203583, 204722, 205940, 206766, 207237, 207831, 208877, 210152, 211063, 211176, 210700, 210487, 211267, 212767, 213886, 214005, 213789, 214391, 216158, 218517, 220832, 222847, 224442, 225498, 226061, 226315, 226403, 226461, 226639, 226847, 226732, 226211, 225812, 226160, 227326, 228966, 230775, 232480, 233710, 234396, 235031, 236091, 237452, 238793, 240200, 241831, 243369, 244476, 245529, 247218, 249523, 251787, 253661, 255350, 257024, 258676, 260463, 262480, 264208, 264872, 264482, 263912, 263881, 264371, 265072, 265750, 266158, 266135, 265993, 266350, 267523, 269458, 272130, 275462, 278989, 282185, 285124, 288177, 291143, 293430, 295126, 297097, 299810, 302771, 305427, 307974, 310902, 314218, 317478, 320202, 322003, 322668, 322399, 321702, 320873, 319844, 318629, 317617, 317276, 317789, 319044, 320812, 322961, 325631, 329111, 333418, 338321, 343965, 350972]
56298C50972Q417Q661P555O199N244M222L026K707L812N162N514N406O046P181
56284D30124P656P504P893R105J0074J0073R674R698J0160J0642J1047J1607J2419
56271E57676J3201J3512J3406J3821J5739J8783K1424K2942K4343K6814L0228
56260G71889L3898L7945M2813M8198N3592N9466O6783P5648Q5387R5641J06431
56249A477691J17452J28285J39035J49837J59889J67861J73114J75726J75540
56240B864430J71890J64162J52045J35460J14810R1007O4804L6553P105k1812
56230C780454m8721p3208r4993j13096j26887j37060j44505j48984j50111j48816
56220B594073j46417j42888j37475j30485j23034j15421j07299r9137r1942q5639
$$ y = [350972, 359389, 368050, 375605, 381804, 387048, 391270, 394296, 397003, 400815, 405977, 411491, 416897, 422943, 430124, 437780, 445284, 453177, 462282, 472356, 482429, 492103, 501801, 511961, 522603, 533650, 545257, 557676, 570877, 584389, 597795, 611616, 627355, 646138, 667562, 690504, 714847, 741661, 771889, 805787, 843732, 886545, 934743, 988335, 1047801, 1114584, 1190232, 1275619, 1371260, 1477691, 1595143, 1723428, 1862463, 2012300, 2172189, 2340050, 2513164, 2688890, 2864430, 3036320, 3200482, 3352527, 3487987, 3602797, 3693804, 3758608, 3795161, 3802266, 3780454, 3731733, 3658525, 3563532, 3450436, 3323549, 3186489, 3041984, 2893000, 2742889, 2594073, 2447656, 2304768, 2167293, 2036808, 1913774, 1798353, 1691054, 1591917, 1499975, 1414336]
56210A414336p9277p2703o6677o1371n6240n1356m7389m4091m0267l5566l0967
56199H28432k7226k4017k1076j8907j7818j7183j6245j4882j3258j1365r367p745
56187F29343o810o414o250o011n383m377l542l236l020k317j374q14n77j67L80
56172E79431N98M71M19O64J266K363L701M431M231M026M640N465N547N340O029
56157F28622P617R116J0283J1741J3643J5477J7100J8840K0843K3398K7444L3469
56145H37593M0348M6662N2693N9703O7615P4989Q0907Q5273Q7419Q6162Q1390
56134A600754P4227O5735N6663M8244M1759L7271L3931L1088K7989K3161J5845
56123B056667P546L64n694j1979j8531k4479l0605l8860m9195n9259o7509p4306
$$ y = [1414336, 1335059, 1262356, 1195679, 1134308, 1078068, 1026712, 979323, 935232, 894965, 859399, 828432, 801206, 777189, 756113, 737206, 719388, 702205, 685960, 671078, 657820, 646455, 637088, 629343, 622533, 616119, 609869, 603858, 598475, 594098, 590556, 587320, 584300, 581983, 580609, 579795, 579218, 579051, 579431, 580029, 580500, 580919, 581583, 582849, 585212, 588913, 593344, 597575, 601601, 606241, 611706, 617253, 622593, 628622, 636239, 645355, 655638, 667379, 681022, 696499, 713599, 732439, 753282, 776680, 804124, 837593, 877941, 924603, 977296, 1036999, 1104614, 1179603, 1260510, 1345783, 1433202, 1519364, 1600754, 1674981, 1740716, 1797379, 1845623, 1887382, 1924653, 1958584, 1989672, 2017661, 2040822, 2056667, 2064213, 2064577, 2058883, 2046904, 2028373, 2003894, 1973289, 1934429, 1885234, 1825975, 1758466, 1684160]
56111A684160p9561q1735p9999p5464o9535o2661n5250m8100m1254l4046k6705
56100A029850k0514j6019j2544r707p853o814n813m699l791k582l56K108L354
56087I44620L620M325N478N905N942P250R688J1059J0469R480R286R234Q828Q828
56073A054012R554J0257J0873J2293J4297J5406J5319J5323J5854J6071J6128
56062A205387J7268J9047J9326J7816J6874J7809J9019J8942J8203J7701J7055
56051A404447J6187J6109J6957J7427J7128J7326J8554J9766K0600K1958K3775
56040A610234K4810K5247K6655K8858K9929K9939L1293L4459L6915L7481L8163
56029A953983M0318M2538M3777M5031M6449M6356M4786M4419M6404M8791N0566
$$ y = [1684160, 1604599, 1522864, 1442865, 1367401, 1297866, 1235205, 1179955, 1131855, 1090601, 1056555, 1029850, 1009336, 993317, 980773, 971066, 963213, 956399, 950586, 945887, 942096, 939514, 939158, 941266, 944620, 948240, 952565, 958043, 963948, 969890, 977140, 986828, 997887, 1008356, 1017836, 1027122, 1036356, 1045184, 1054012, 1063566, 1073823, 1084696, 1096989, 1111286, 1126692, 1142011, 1157334, 1173188, 1189259, 1205387, 1222655, 1241702, 1261028, 1278844, 1295718, 1313527, 1332546, 1351488, 1369691, 1387392, 1404447, 1420634, 1436743, 1453700, 1471127, 1488255, 1505581, 1524135, 1543901, 1564501, 1586459, 1610234, 1635044, 1660291, 1686946, 1715804, 1745733, 1775672, 1806965, 1841424, 1878339, 1915820, 1953983, 1994301, 2036839, 2080616, 2125647, 2172096, 2218452, 2263238, 2307657, 2354061, 2402852, 2453418]
56018B453418N3322N7364O0316O1579O3893O8318P2012P3406P5167P9334Q3788
56007C201917Q6523Q9250R3643R8068J01250J05205J11465J18208J24137J31225
55997D260891J40573J49744J57248J65394J75657J85746J94474K04834K18967
55988E853528K34822K50997K69704K91663L13725L35073L59852L89952M21643
55979H720959M53342M89749N33863N82372O33879O93779P65435Q44777R29839
55970A4647994J027158J142497J274663J425544J606134J824983K081995K382694
55962B7413662K746934L194804L739251M406070N248346O331288P724511R527500
55954G0332366J1876800J4889758J8592897K2888604K7514741L1958927L5438164
$$ y = [2453418, 2506740, 2564104, 2624420, 2685999, 2749892, 2818210, 2890222, 2963628, 3038795, 3118129, 3201917, 3288440, 3377690, 3471333, 3569401, 3670651, 3775856, 3887321, 4005529, 4129666, 4260891, 4401464, 4551208, 4708456, 4873850, 5049507, 5235253, 5429727, 5634561, 5853528, 6088350, 6339347, 6609051, 6900714, 7214439, 7549512, 7909364, 8299316, 8720959, 9174301, 9664050, 10197913, 10780285, 11414164, 12107943, 12873378, 13718155, 14647994, 15675152, 16817649, 18092312, 19517856, 21123990, 22948973, 25030968, 27413662, 30160596, 33355400, 37094651, 41500721, 46749067, 53080355, 60804866, 70332366, 82209166, 97098924, 115691821, 138580425, 166095166, 198054093, 233492257]
55947B33492257L7070518L6144297L2265505K5373901J5830600M596062o811693
55940C77961447j6788164k4261732k8963236l1209830l1519473l0384658k8234585
55933A86599769k5450873k2368956j9272167j6376529j3807585j1601945r745348
55926F7976366q208124o950101n919602n069331m368393l792137l311657k902560
55918B7454461k553926k258932k004575j778620j578468j404670j252151j115039
55910A3508080r93578q89166p98153p16753o46376n88123n37536m90493m48905
55901G398997m14953l85015l54983l26619l02938k81820k59854k38473k20764
55892D613578k05788j91036j77120j65357j54003j41404j29715j21210j14198
$$ y = [233492257, 270562775, 306707072, 338972577, 364346478, 380177078, 384773140, 377961447, 361173283, 336911551, 307948315, 276738485, 245219012, 214834354, 186599769, 161148896, 138779940, 119507773, 103131244, 89323659, 77721714, 67976366, 59768242, 52818141, 46898539, 41829208, 37460815, 33668678, 30357021, 27454461, 24900535, 22641603, 20637028, 18858408, 17279940, 15875270, 14623119, 13508080, 12514502, 11625336, 10827183, 10110430, 9464054, 8875931, 8338395, 7847902, 7398997, 6984044, 6599029, 6244046, 5917427, 5614489, 5332669, 5072815, 4834342, 4613578, 4407790, 4216754, 4039634, 3874277, 3720274, 3578870, 3449155, 3327945, 3213747]
55883C213747j06625j00403r7876r7084r4791r1342q8512q5497q1095p7134p5473
55872B217915p4158p0559o6015o3384o2148n9865n6506n3644n1037m7539m3777
55861A569283m0798l7833l4334l2183l2759l3965l3352l2067l2284l2905l1564
55850A195239k9068k7998k8199k7434k5559k4415k4318k3885k2869k2230k1869
55839I17395k0910j9644j8848j7890j5919j4007j3740j4450j4191j2725j1308
55828G43763j0306r252q524q783r436r550r545j0202j0980j1087j1118j1775j2143
55815F11062j1243j0067r954j0165r258p690o777o140m618k737j849j560l72J673
55801E30305L298M304N400O231N729M096K432Q28j300l471m627m957n478o252
$$ y = [3213747, 3107122, 3006719, 2908843, 2811759, 2716968, 2625626, 2537114, 2451617, 2370522, 2293388, 2217915, 2143757, 2073198, 2007183, 1943799, 1881651, 1821786, 1765280, 1711636, 1660599, 1613060, 1569283, 1528485, 1490652, 1456318, 1424135, 1391376, 1357411, 1324059, 1291992, 1259708, 1226803, 1195239, 1166171, 1138173, 1109974, 1082540, 1056981, 1032566, 1008248, 984363, 961494, 939264, 917395, 896485, 876841, 857993, 840103, 824184, 810177, 796437, 781987, 767796, 755071, 743763, 733457, 724205, 715681, 706898, 697462, 687912, 678367, 668165, 657185, 646098, 634980, 623205, 611062, 599819, 589752, 579798, 569633, 560375, 552685, 545908, 539768, 535150, 532413, 530564, 529004, 528632, 530305, 533603, 537907, 543307, 549538, 555267, 559363, 561795, 562623, 561323, 557852, 553225, 548268, 542790, 536538]
55787E36538o629o665o711o270m963l895m342n783o825p207p143n756k253K137
55773D64233N521P984J0840J3899J5604J5281J3173Q849J874o205j2741j6784
55761E21528j9199k0395j9967j8261j6258j4023j1190q617p595p590o879n338
55749C66216m495m826n013m185k993k165j580j134j008r39m99j63p71k077l128
55734C31240l818m628n265n151m902n513o463o459n787n882o728o826n846n122
55720B52850n219n072m083l066k433j254R83L191M195M267M444N194O266O937
55706B67200O193L638M14j829k879l808n068o074o634p298q085q320p941p572
55692B11937p121n799l829k593k552k496j403J88J288J760J900J781J591J754
$$ y = [536538, 529909, 523244, 516533, 510263, 505300, 501405, 497063, 491280, 484455, 477248, 470105, 464349, 462096, 464233, 469754, 477738, 488578, 502477, 518081, 533362, 546535, 555384, 557258, 551053, 538312, 521528, 502329, 481934, 461967, 443706, 427448, 413425, 402235, 393618, 386023, 378433, 371554, 366216, 361721, 356895, 351882, 347697, 344704, 342539, 340959, 339825, 338817, 337878, 337379, 337216, 336445, 334368, 331240, 327422, 322794, 317529, 312378, 307476, 301963, 295500, 289041, 283254, 277372, 270644, 263818, 257972, 252850, 247631, 242559, 238476, 235410, 232977, 231723, 232706, 235897, 240092, 244359, 248803, 253997, 260263, 267200, 273393, 277031, 277445, 275616, 272737, 268929, 263861, 257787, 251153, 243855, 235770, 227450, 219509, 211937, 204816, 199017, 195188, 192595, 190043, 187547, 186144, 186332, 187620, 189380, 191280, 193061, 194652, 196406]
55678A96406K203K341J971J490J002J64r39j716j985k047j858j199o30j023k105
55663A92075k652k313j881j651q83P25K310L148L449L504L127K448K105K188J961
55648B07660J079J70j73m4L29Q77J165N63q07k167l255m393n397n595n033m521
55632A80458m334m077l787l826l640k224o7J044N49j25J21O75P65O92P14K55p40
55615A62453j173o09l08j340k866l553l514l499l246k121o25J80K87N04R59J004
55599A42533L70n52j376j922j957j506j113j249j695k030k282k666l094l387l498
55584A14576l255k442j421r85j206j140j83J069J749J777J559J374J529K300L241
55569A18542L460K980K824L281L289K244J100P08L31r79k552l098k727k538k759
$$ y = [196406, 198609, 200950, 202921, 204411, 205413, 205577, 204638, 202922, 200937, 198890, 197032, 195833, 195203, 194180, 192075, 189423, 187110, 185229, 183578, 182695, 183420, 185730, 188878, 192327, 195831, 198958, 201406, 203511, 205699, 207660, 208739, 208909, 208736, 208692, 209021, 209898, 211063, 211626, 210819, 208652, 205397, 201004, 195607, 190012, 184979, 180458, 176124, 172047, 168260, 164434, 160794, 158570, 158503, 159547, 160096, 159971, 160092, 160767, 161532, 162224, 162938, 163193, 162453, 161280, 160671, 160363, 159023, 156157, 152604, 149090, 145591, 142345, 140224, 139599, 139779, 140066, 140570, 141529, 142533, 142903, 142351, 140975, 139053, 137096, 135590, 134477, 133228, 131533, 129503, 127221, 124555, 121461, 118074, 114576, 111321, 108879, 107458, 106473, 105267, 104127, 103944, 105013, 106762, 108539, 110098, 111472, 113001, 115301, 118542, 122002, 124982, 127806, 131087, 134376, 136620, 137720, 138428, 138759, 137780, 135228, 132130, 129403, 126865, 124106]
55554A24106k806k766l250l962l819k577j132j39N78J098R67Q5q13r11j33R25
55538A05451J506J159J50o43o72l32k70m12l10q2k79r19j429j467j274j146j135
55521I7896j222j341j243q09l84l67o48q87j076j322j314p08Q2K12m30j052j051
55504H4336p19o26q10q74n97j20K97N47O79P40O79M70L17M58P85Q87O36M07N26
55485H8018Q02Q42O11M35O34J316K291L034L036K375J652J181O71j12q22j061
55469A04903j019j190j708k386l057l479l239k262j217q78j178j314p88J23R00
55454H2211J317J324P79k97j392j793j370p79o34o29J1J273K160J995J278P55
55438H6209L64k30o43l19L21M09J21M73J576K274J745M61p52j600j977j743j234
$$ y = [124106, 121300, 118534, 115284, 111322, 107503, 104926, 103794, 103655, 104233, 105331, 106298, 106383, 105570, 104659, 104526, 105451, 106957, 108116, 108266, 107623, 106951, 106619, 106349, 105937, 105627, 105545, 105266, 104347, 102918, 101451, 100177, 99031, 97896, 96674, 95333, 94090, 93281, 92897, 92530, 91882, 90995, 89919, 88597, 87283, 86575, 86657, 86869, 86439, 85387, 84336, 83617, 82991, 82181, 81307, 80710, 80590, 80887, 81434, 82113, 82853, 83532, 84002, 84319, 84777, 85562, 86449, 87085, 87492, 88018, 88820, 89662, 90273, 90708, 91342, 92658, 94949, 97983, 101019, 103394, 105046, 106227, 106898, 106786, 105964, 104903, 103884, 102694, 100986, 98600, 95543, 92064, 88825, 86563, 85346, 84468, 83290, 81976, 81188, 81311, 82211, 83528, 84852, 85631, 85334, 83942, 82149, 80779, 80000, 79366, 78737, 78748, 80021, 82181, 84176, 85454, 86209, 86573, 86343, 85700, 85381, 85702, 86111, 86232, 86705, 88281, 90555, 92300, 92761, 92009, 90409, 88432, 86689, 85455]
55421H5455j119j323j013l1O46M07p4K0N25R73J390J702J284Mj068r79k13J43
55403H6729p2l17m57o78q15o84o68j121j554j314o45k41j53L6L16L64K68L36M63
55384G9793L84K22J96J21j56l69m91j081k185k666j700k24K95j0R7P99J053N02
55366G4580P4M51J185J581J497J046M24J02L83O64J19r33j298n98L56R08J210
55349H1751J316Q91J34j18K74L55m02j169j083o00o44j074j011k60M96Q03R06
55332H0565J106J232R71L20m52j138j718k218k519k388j726p42K10Q89J194J102
55316G4688P18K43k30o75q11k05R84J809J538N68j22j97j30l51p97j231j485j432
55298G2882j026m44J02N74R32J041R87J105J453J596J364J186J263J060K57m28
$$ y = [85455, 84336, 83013, 82000, 81969, 82615, 83022, 82948, 82968, 83493, 84466, 85856, 87558, 88842, 88846, 87778, 86799, 86586, 86729, 86657, 86340, 85883, 85205, 84390, 83706, 83038, 81917, 80363, 79049, 78404, 78163, 78010, 78046, 78362, 78726, 78994, 79330, 79793, 80177, 80399, 80595, 80716, 80560, 80191, 79700, 78619, 76434, 73768, 72068, 71844, 72139, 72129, 72226, 73025, 74078, 74580, 74654, 75105, 76290, 77871, 79368, 80414, 80838, 80940, 81323, 81987, 82106, 81173, 79875, 79277, 79633, 80541, 81751, 83067, 83958, 84092, 83974, 84248, 84603, 84201, 83032, 81949, 81349, 80705, 79631, 78620, 78360, 78856, 79659, 80565, 81671, 82903, 83874, 84194, 83742, 82604, 80886, 78668, 76149, 73761, 72035, 71293, 71503, 72392, 73586, 74688, 75406, 75649, 75419, 74744, 73933, 73728, 74712, 76521, 78059, 78627, 78505, 78308, 78178, 77827, 77030, 75799, 74314, 72882, 71856, 71412, 71514, 72088, 73020, 74061, 75048, 76153, 77606, 79202, 80566, 81752, 83015, 84075, 84332, 83904]
55282H3904k40L16J77o73j311j329j106q27l01L03M82K66J04l0m42p72l11O79
55264G8889J102O47J44J16J06j83k67O1J57l24o55k33K72j20j136j526o73P75
55246G7152J787J955J577J050L67o44j596j594m94N11L68k26J01J051R38n69j738
55229G9996j379n63p32j449j380m80K13L84N87R19Q49L33l2o8j98n13n01k8K70
55210G6228n6m59l3J289K573K829J962P55L0r0o5k38n31p37q21p98o23l37q8N8
55190H0848J08k5l83o96o30k43J70O54J361J889J594O68J43N18J116J119N24k82
55172H8453j107j688j556p96k86n17q35m71K49N56M96O43R67R47O16M98N88L10
55154H7067m54j060j022o50m81o11o97l57N13J517J898J270J37o97j026j192j284
$$ y = [83904, 83664, 83980, 84157, 83484, 82173, 80844, 79738, 78911, 78610, 78913, 79395, 79661, 79765, 79735, 79293, 78521, 78210, 78889, 79991, 80638, 80782, 80898, 81004, 80821, 80554, 80615, 80772, 80448, 79793, 79560, 79832, 79712, 78576, 77050, 76377, 77152, 78939, 80894, 82471, 83521, 83888, 83244, 81648, 80054, 79560, 80071, 80439, 80213, 80314, 81365, 82303, 81734, 79996, 78617, 78054, 77322, 75873, 74493, 74013, 74226, 74610, 75197, 76116, 76965, 77298, 77266, 77198, 77000, 76487, 75986, 75958, 76228, 76172, 75713, 75680, 76969, 79542, 82371, 84333, 85088, 85118, 85028, 84963, 84725, 84194, 83457, 82636, 81838, 81215, 80878, 80790, 80848, 80956, 80931, 80548, 79852, 79222, 78979, 79149, 79803, 81164, 83053, 84647, 85315, 85458, 85976, 87092, 88211, 88735, 88453, 87346, 85658, 84102, 83306, 83020, 82503, 81668, 81197, 81446, 82002, 82498, 83141, 84108, 85055, 85671, 86169, 86757, 87067, 86613, 85553, 84531, 83881, 83400, 82789, 82092, 81735, 82248, 83765, 85663, 86933, 87070, 86373, 85347, 84155, 82871]
55137H2871j013l87J28K13R4J54M83Q95J095P99J7p22p43j9P17P73K39k01n8N32
55117H5867J057J206J131J045P83L0r95j549j258o52m02m40k41K41N29L74Q5%
55099H6811J21L28O58J157J695J996J845J260N67J98K70N26P83J145J550J457
55083A02367M71q84j526r96J24R53J145R17O33N02M50K44j76n39n90m78n17o67
55065A01433n89k05J73L35L94M46K84l34j339k326k764k297j112l4J61l69o15
55048I1242K7J000J316P63m4o15j007j291j209o55r2l4k97k57K48P14P31M48K21
55029I1209J58K50N52R28R91O16J74q7n15j376k101j852p10L90Q12O90L08k25
55011I0212n59k28N97J085Q44M15L54M46K83J9J4J49P2j77k74j37J04M48Q73J095
$$ y = [82871, 81858, 81471, 81599, 81812, 81906, 82060, 82543, 83438, 84533, 85332, 85349, 84627, 83884, 83865, 84582, 85355, 85594, 85393, 85335, 85867, 86924, 88130, 89261, 90306, 91089, 91119, 90124, 88575, 87317, 86665, 86263, 85823, 85582, 85823, 86352, 86726, 86811, 86811, 86932, 87260, 87918, 89075, 90770, 92766, 94611, 95871, 96438, 96636, 96906, 97432, 98215, 99360, 100910, 102367, 102838, 101954, 100428, 99432, 99556, 100509, 101654, 102571, 103204, 103706, 104156, 104400, 104224, 103685, 103095, 102617, 102100, 101433, 100844, 100639, 100812, 101147, 101541, 101987, 102271, 101937, 100598, 98272, 95508, 93211, 92099, 92065, 92226, 91857, 91242, 91269, 92269, 93585, 94348, 94304, 93689, 92682, 91391, 90182, 89527, 89435, 89401, 89104, 88847, 89095, 89809, 90540, 90988, 91209, 91367, 91617, 92169, 93097, 94088, 94704, 94878, 94791, 94276, 92900, 90799, 88947, 88237, 88627, 89439, 90129, 90437, 90212, 89653, 89425, 90022, 91107, 91951, 92366, 92720, 93166, 93449, 93468, 93482, 93631, 93703, 93526, 93252, 93115, 93219, 93667, 94540, 95635]
54991I5635Q64M03J81L83Q37J285J459J126L60m45r71j156r12j60O87Q62K87j27
54973A00598K12O16J30r54j466r45J9Q58J538J962J787J056L58J16J62J94J10
54956A06351j87q21j499j553p31L66Q83N50j85o21l42M29R06N37l26p95n81k78
54938A02103m40q20q14k62M75J081J504J738J680J277P21L49L87Q12J500K403
54922A13694L404M090M093L772M140N634P283P623O294M327K799J798P60o85k407
54907A66619m033n173n606n444n041m689m406m062l566k917k224j643j230q94
54893A15691o21n52o78o61j98N04R56J020J017J225J562J763J679J355J059J174
54877A26295J898L015M148N112N882O347O316N655M297K294J25j400j926k027
$$ y = [95635, 96499, 96902, 97083, 97466, 98303, 99588, 101047, 102173, 102533, 102088, 101117, 99961, 99049, 98889, 99576, 100438, 100725, 100598, 100810, 101426, 101556, 100602, 99136, 98191, 98210, 99068, 100606, 102568, 104355, 105411, 105769, 105885, 106047, 106241, 106351, 106164, 105343, 103844, 102291, 101560, 101926, 102809, 103359, 103174, 102553, 102211, 102640, 103546, 104083, 103757, 102962, 102381, 102103, 101663, 100843, 100029, 99767, 100242, 101323, 102827, 104565, 106245, 107522, 108243, 108592, 108979, 109791, 111291, 113694, 117098, 121188, 125281, 129053, 133193, 138827, 146110, 153733, 160027, 164354, 167153, 168951, 169711, 169026, 166619, 162586, 157413, 151807, 146363, 141322, 136633, 132227, 128165, 124599, 121682, 119458, 117815, 116585, 115691, 115070, 114518, 113840, 113179, 112981, 113485, 114441, 115461, 116478, 117703, 119265, 121028, 122707, 124062, 125121, 126295, 128193, 131208, 135356, 140468, 146350, 152697, 159013, 164668, 168965, 171259, 171384, 169984, 168058, 166031]
54863A66031k513l453m255m571m548m384m120l890l822l694l228k631k408k615
54849A15899k810k728k485k060j261k86K09r3q17j438j733j591j033n27o93j357
54833I5196j562q54O9M50M96P32R99Q53M99M57N89L46j23o5N82R39M96j25j74
54814I9800J56K84L12Q02J624J903J238L14K6L69O43N21M01O96J154J131M30m69
54796A11335j000j136j258j503j541j114m88p5J89O77J237J205M85rM41J176J029
54779A09650Q5l74K98J312J739J652J502J201O29L49R83K287L672N192P046Q493
54763A45716Q401O947N647N442N683N297M071K313P4k562m872n965n710m844m217
54748A61421m236m781n295n195m444l639l310l317l163k565j564l30P94J273Q15
$$ y = [166031, 163518, 160065, 155810, 151239, 146691, 142307, 138187, 134297, 130475, 126781, 123553, 120922, 118514, 115899, 113089, 110361, 107876, 105816, 104555, 104269, 104478, 104385, 103568, 102130, 100397, 98806, 97773, 97246, 96553, 95196, 93634, 92780, 92849, 93299, 93795, 94527, 95526, 96379, 96878, 97335, 97924, 98270, 98147, 98082, 98664, 99603, 100099, 99974, 99800, 99956, 100240, 100552, 101354, 102978, 104881, 106119, 106433, 106459, 106828, 107471, 107992, 108393, 109089, 110243, 111374, 111804, 111335, 110335, 109199, 107941, 106438, 104897, 103783, 103295, 103220, 103409, 104086, 105323, 106528, 107013, 107004, 107445, 108621, 109650, 109735, 109361, 109659, 110971, 112710, 114362, 115864, 117065, 117694, 118043, 119026, 121313, 124985, 130177, 137223, 145716, 154117, 161064, 166711, 172153, 177836, 183133, 187204, 189517, 189591, 187029, 182157, 176192, 170482, 165638, 161421, 157185, 152404, 147109, 141914, 137470, 133831, 130521, 127204, 124041, 121476, 119912, 119582, 120376, 121649, 122464]
54733A22464k18j074j264p63K06J290K062K314K272K332K567K780L028L669M764
54718A46429N679N661M750L737L146K546J184r01k841l982m459m610m376l700
54704A48263l096l184l784m041l435k283j193n42m46q17j262j330r96o67n95o38
54688A19954o56p84j079j290j185r13p84q28p81m24J57N34K52o90j657j951j529
54671A06346r44o97q05r36p07N6J008J416J003L99K60J93n96j800k130j149PK37
54653A01161j30j86J08K09J80N71J287J529R64K58J47N31O96K63m04n79K3Q46
54635A07474J002K75o60j083r75p06l64J57O67P59M20Q3R4M00P58R79R79P71M77
54616A11507J45l48j000j414j163l76K93L90J72K59Q88J560J461L93p83q54M21
$$ y = [122464, 122246, 121172, 119908, 119145, 119351, 120641, 122703, 125017, 127289, 129621, 132188, 134968, 137996, 141665, 146429, 152108, 157769, 162519, 166256, 169402, 171948, 173132, 172231, 169390, 165408, 160949, 156339, 151963, 148263, 145167, 141983, 138199, 134158, 130723, 128440, 127247, 126705, 126259, 125442, 124180, 122850, 121854, 121187, 120592, 119954, 119298, 118514, 117435, 116145, 114960, 114047, 113263, 112435, 111654, 111230, 111387, 111921, 112173, 111483, 109826, 107875, 106346, 105402, 104705, 103900, 102964, 102257, 102313, 103321, 104737, 105740, 106139, 106399, 106592, 105996, 104196, 102066, 100917, 100924, 101161, 101031, 100845, 100953, 101162, 101342, 101913, 103200, 104729, 105693, 105951, 106098, 106629, 107325, 107588, 107184, 106605, 106628, 107474, 108476, 108751, 108091, 107008, 106033, 105327, 104963, 105120, 105787, 106546, 106966, 107049, 107143, 107543, 108301, 109280, 110259, 111030, 111507, 111652, 111304, 110304, 108890, 107727, 107351, 107644, 108034, 108206, 108465, 109353, 110913, 112374, 112767, 111984, 111130, 111551]
54599A11551J893K142R61n38j125n87L13P18L97k52p32q24n76j32J91po98j132
54581A11563o21M51R57N29k8o2m6o38j370j180n4Q28O66pk06K44P29P54M04K7
54561A12940k02l67n33n02L9J052J982K278J990J616J432J223P13o6q94j599k012
54544A19090j896j162j32O73J027J144J295J412J230P79M39M43N55M18M1l18n36
54527A24502n93k91M86J353J693J441J073P83K47o18j294j451j482j779j930j298
54511A20842j11P37Q16M96J96j04n08q83j058r96o93j96K43L87M00O70J128J161
54493A22527M20n58q99m11K30L04j19l06K35J112J471R99L03J50N89J033J097
54476A28177R71R66J016Q55N23M07P14J095J002M56J62O88J680K259K054J457
$$ y = [111551, 113444, 115586, 116547, 116009, 114884, 114297, 114610, 115328, 115725, 115473, 114741, 113917, 113341, 113209, 113400, 113393, 112695, 111563, 110942, 111393, 112350, 112879, 112851, 112789, 112743, 112105, 110735, 109555, 109501, 110329, 110995, 110988, 110782, 111026, 111755, 112509, 112913, 112940, 112738, 112371, 111838, 111336, 111375, 112427, 114409, 116687, 118677, 120293, 121725, 122948, 123661, 123595, 122701, 121102, 119090, 117194, 116032, 115900, 116573, 117600, 118744, 120039, 121451, 122681, 123460, 123899, 124342, 124897, 125315, 125356, 125038, 124502, 123909, 123618, 124104, 125457, 127150, 128591, 129664, 130447, 130694, 130076, 128782, 127331, 125849, 124070, 122140, 120842, 120731, 121468, 122284, 122780, 122976, 122872, 122364, 121481, 120423, 119427, 118734, 118538, 118781, 119168, 119568, 120238, 121366, 122527, 122947, 122389, 121490, 121079, 121309, 121613, 121494, 121188, 121423, 122535, 124006, 125005, 125308, 125458, 126047, 127080, 128177, 129148, 130114, 131130, 131985, 132508, 132915, 133629, 134724, 135726, 136182, 136344, 137032, 138712, 140971, 143025, 144482]
54460A44482Q60K38l97o08j47M30K85o42j527j624r93k76l4l66r33j250j116p87
54442A35595o87r36j305j490j381j059o73l37p6O5ok51l53k8N63R38Q81O13L60
54423A30433J23k3J47O10R54Q98O49N58O64P53N58j05j049j462o23R30J653Q61
54405A36529l51o43j44J48L2J01M40M72J30R4O84J356J577J421J076M91j23j72
54387A43118M81J065Q03j11q91j162j087q03k59M05Q30Q29N85L76L23M46Q31J488
54369A47267K176K510K352K028J974K199K359K288K224K338K407K159J677J192
54355A77150O70o2q90j464j550j214p70o95j347k515l479l741l447k929k203j254
54339A50260m20qP9m1o04j625k399k240j471r08o32o9Q14J316J051M19j47o44
$$ y = [144482, 145342, 145580, 145183, 144575, 144428, 144858, 145143, 144501, 142974, 141350, 140357, 140081, 140047, 139681, 138748, 137498, 136382, 135595, 134908, 133972, 132667, 131177, 129796, 128737, 128064, 127727, 127651, 127716, 127710, 127459, 127106, 127078, 127641, 128579, 129460, 130073, 130433, 130556, 130533, 130680, 131290, 132244, 133142, 133791, 134349, 135013, 135766, 136324, 136219, 135170, 133708, 133085, 134015, 135668, 136529, 136178, 135535, 135391, 135539, 135571, 135672, 136112, 136584, 136714, 136808, 137492, 138848, 140425, 141846, 142922, 143413, 143290, 143118, 143599, 144664, 145467, 145356, 144465, 143303, 142216, 141413, 141154, 141559, 142389, 143218, 143803, 144179, 144502, 144948, 145779, 147267, 149443, 151953, 154305, 156333, 158307, 160506, 162865, 165153, 167377, 169715, 172122, 174281, 175958, 177150, 177820, 177758, 176868, 175404, 173854, 172640, 171870, 171175, 169828, 167313, 163834, 160093, 156646, 153717, 151514, 150260, 149840, 149832, 149911, 149870, 149266, 147641, 145242, 143002, 141531, 140623, 139991, 139922, 140736, 142052, 143103, 143522, 143375, 142731]
54321A42731j028r93n23q1jj42k84m03m36k53J7J22J23J75n8r63j916j631K4J448
54301A35928J160m59j816j960j138o1O85P63K85k16l69m08o46q51n17L80J268
54284A32028J571J147L42k19r1N47J021R24M75R1n3J07N71J024R32K12o16j149
54266A38864j427j361n36Q38J574R58lK75J782K922K726J983J853K224K134J275
54250A56081K76l08o13r57j241j264j243j569k062k015j131k7N39N71N47N39K53
54233A46376k19l93j67P0J78M67R43J009L37n44r64r25p98o49m37m83j117k002
54215A40682k356j810p01L87J075J254J068Q38P73Q29Q64P91N43J30j82j32J17
54198A44170J78J10K80M80j6j176j770q58Q88K081K321K222K164J919J386Q58
$$ y = [142731, 141703, 140710, 140187, 140106, 140105, 139963, 139679, 139276, 138840, 138587, 138604, 138726, 138849, 139024, 138966, 138003, 136087, 134456, 134480, 135928, 137088, 136629, 134813, 132853, 131715, 131654, 132339, 133102, 133387, 133171, 132802, 132394, 131748, 130897, 130380, 130760, 132028, 133599, 134746, 135088, 134869, 134778, 135325, 136346, 137270, 137745, 137836, 137783, 137890, 138461, 139485, 140417, 140629, 140013, 138864, 137437, 136076, 135540, 136378, 137952, 138910, 138907, 139182, 140964, 143886, 146612, 148595, 150448, 152672, 154806, 156081, 156357, 156049, 155436, 154479, 153238, 151974, 150731, 149162, 147100, 145085, 143954, 143927, 144466, 145037, 145584, 146123, 146376, 146157, 145764, 145597, 145667, 145845, 146312, 147255, 148264, 148601, 148057, 147093, 146168, 145370, 144721, 144284, 143801, 142684, 140682, 138326, 136516, 135815, 136202, 137277, 138531, 139599, 140437, 141210, 142039, 142903, 143694, 144237, 144367, 144185, 144053, 144170, 144348, 144458, 144738, 145218, 145202, 144026, 142256, 141398, 142286, 144367, 146688, 148910, 151074, 152993, 154379, 155237]
54182A55237N54M52N78R41J241J150P92M69J28l72p48o42l64n59j234j801j946
54165A53876j823j474q68m33p18j404j513q04j26j59n84q30q43o68n7R04J440
54148A43916J021K00j69j40l79j011j477j449j169r03n94j82K39O85J269J797
54132A41654J810J140K48k85l71l45l85k37M21J403K006J730Q92K91K58M13L98
54115A51041M13O59P58L27j24L32J588K371J866Q53O13J259J890K060K259K898
54099A71063L668M164M429M431L614J599r26k652k956k377j857j890k252k311
54085A75747j634n69j5l32p87n04L77J109J577K256L086L350K840K240J973J572
54069A92286O35l74r13j238j742k028j529o74m69j095j727j719j263q42o50o58
$$ y = [155237, 155791, 156243, 156821, 157762, 159003, 160153, 160945, 161414, 161542, 161170, 160422, 159780, 159416, 158857, 157623, 155822, 153876, 152053, 150579, 149711, 149278, 148560, 147156, 145643, 144839, 144713, 144554, 143970, 143140, 142297, 141629, 141572, 142476, 143916, 144937, 145137, 144968, 144828, 144449, 143438, 141961, 140512, 139343, 138440, 137846, 137664, 137903, 138588, 139857, 141654, 143464, 144604, 144852, 144567, 144196, 143851, 143466, 143229, 143650, 145053, 147059, 148789, 149681, 149972, 150230, 150643, 151041, 151454, 152113, 152871, 153198, 153074, 153406, 154994, 157365, 159231, 160084, 160697, 161956, 163846, 165906, 168165, 171063, 174731, 178895, 183324, 187755, 191369, 192968, 192042, 189390, 186434, 184057, 182200, 180310, 178058, 175747, 174113, 173544, 173529, 173197, 172410, 171906, 172283, 173392, 174969, 177225, 180311, 183661, 186501, 188741, 190714, 192286, 192921, 192547, 191634, 190396, 188654, 186626, 185097, 184423, 183954, 182859, 181132, 179413, 178150, 177308, 176658, 176000]
54053A76000o71l46L96R94P86j9m44Q8J232K407L414M139M278L798L298L457M268
54036B07075N091N377N092M593M286M351M563M448L779K898K407K446K545K276
54022B61227J953K245L079L360K188R9j502j942j828j994k642l554m457m878m407
54007B46947l471l148l760m422m492m530n045n210m096k460j853k282k304j425
53993A98449p94j160j708j588j290j543j888j424l63K57L7m82p89q59o76j15O92
53976A84756J271J263P50J57K2O41J630K182J965J595J826K609L345L825M374
53961B12211N179N909O089N439L872J558r45k885l847l941l521k916k409k144
53947B17649j931j361l07Q66J735K390L228M220M687M171L244L002L684M315L944
$$ y = [176000, 175329, 174983, 175379, 176373, 177159, 177140, 176696, 176784, 178016, 180423, 183837, 187976, 192254, 196052, 199350, 202807, 207075, 212166, 217543, 222635, 227228, 231514, 235865, 240428, 244876, 248655, 251553, 253960, 256406, 258951, 261227, 263180, 265425, 268504, 271864, 274052, 274151, 272649, 270707, 268879, 266885, 264243, 260689, 256232, 251354, 246947, 243476, 240328, 236568, 232146, 227654, 223124, 218079, 212869, 208773, 206313, 204460, 202178, 199874, 198449, 197655, 196495, 194787, 193199, 191909, 190366, 188478, 187054, 186691, 186948, 186985, 186503, 185714, 184855, 184179, 184064, 184756, 186027, 187290, 188040, 188197, 188219, 188860, 190490, 192672, 194637, 196232, 198058, 200667, 204012, 207837, 212211, 217390, 223299, 229388, 234827, 238699, 240257, 239312, 236427, 232580, 228639, 225118, 222202, 219793, 217649, 215718, 214357, 214050, 214916, 216651, 219041, 222269, 226489, 231176, 235347, 238591, 241593, 245277, 249592, 253536]
53932B53536K780J737J260J161J374K150L386M376M477L692K545J677J615K497
53918B88263L830M869N352N600N898O123O068N764N395N148N183N293M731K902
53904C60419L79j478k069k145k564l151l249k825k456k590l363m741o348p414
53890C16405p479o941o505o333o189o052n988n707m957m188m111m589m678l893
53876B38795k763j978j578j317j280j673k282k645k678k765l170l624l557k705
53862B04780j474o87q85j816k609k539j640n93q1j87m61m84l29l51o48r20q97
53845A88179o55m27l48m50p33j101j343j374j289j103o14K49J152J683J792J741
53829A85359J656J412Q84J92l28l38J41O28N76O7j85K59R77J285J143J101J467
$$ y = [253536, 256316, 258053, 259313, 260474, 261848, 263998, 267384, 271760, 276237, 279929, 282474, 284151, 285766, 288263, 292093, 296962, 302314, 307914, 313812, 319935, 326003, 331767, 337162, 342310, 347493, 352786, 357517, 360419, 360798, 359320, 357251, 355106, 352542, 349391, 346142, 343317, 340861, 338271, 334908, 330167, 323819, 316405, 308926, 301985, 295480, 289147, 282958, 276906, 270918, 265211, 260254, 256066, 251955, 247366, 242688, 238795, 236032, 234054, 232476, 231159, 229879, 228206, 225924, 223279, 220601, 217836, 214666, 211042, 207485, 204780, 203306, 202619, 201734, 199918, 197309, 194770, 193130, 192537, 192456, 192269, 191808, 191324, 190995, 190644, 189996, 189076, 188179, 187524, 187097, 186749, 186299, 185566, 184465, 183122, 181748, 180459, 179356, 178742, 178991, 180143, 181826, 183618, 185359, 187015, 188427, 189311, 189503, 189175, 188837, 188978, 189606, 190182, 190249, 190064, 190323, 191300, 192585, 193728, 194829, 196296]
53812A96296K033K532K930L163L062K735K653L068L577L663L496L796M797N730
53798B43531N608M359K973K425K742L188L134K592K010J802K017K306K176J484
53784B82347O25J18O4R8k01j073k531m293n718o248n875n062m203l469l010k920
53768B38649k983k908k805k974l258l163k676k408k607k655j911o35K92K89n34
53753B07713j546j912j241j86P2p18j436j121l01k00r76j580j204j38P46Q46J64
53736A96982o79q86k93L65M30K16M45J049J306J075R68J284J486J126N64L68M86
53719B06292M47J44n2K11R17J746K322K470K333K216K324K672L090L198K621J573
53703B34524R57J465K648L410L279K792K600K750K965L104L156L134L198L503
$$ y = [196296, 198329, 200861, 203791, 206954, 210016, 212751, 215404, 218472, 222049, 225712, 229208, 233004, 237801, 243531, 249139, 253498, 256471, 258896, 261638, 264826, 267960, 270552, 272562, 274364, 276381, 278687, 280863, 282347, 282972, 283090, 283154, 283252, 283051, 281978, 279447, 275154, 269436, 263188, 257313, 252251, 248048, 244579, 241569, 238649, 235666, 232758, 229953, 226979, 223721, 220558, 217882, 215474, 212867, 210212, 208301, 207666, 207958, 208247, 207713, 206167, 204255, 203014, 202828, 202900, 202182, 200746, 199625, 199324, 199124, 198148, 196568, 195364, 195226, 195972, 196818, 196982, 196303, 195417, 195124, 195489, 195919, 196135, 196580, 197629, 198935, 200010, 200978, 202262, 203748, 204874, 205438, 205806, 206292, 206739, 206883, 206831, 207042, 207959, 209705, 212027, 214497, 216830, 219046, 221370, 224042, 227132, 230330, 232951, 234524, 235481, 236946, 239594, 243004, 246283, 249075, 251675, 254425, 257390, 260494, 263650, 266784, 269982, 273485]
53689B73485L876L922L523K891K069Q37p32k081k738k752k362j693r46n23o22
53674B76154r91j324j567j643j260l68M92O91K29l44n96n21l46k80l30k01M45
53657B68240J387J771J056j72p28j50Q58J399J379J296J349J184N79K1K34J196
53641B80899K027K059J674J735K390K912K761K220J905K019K372K804L216L426
53627C14419L254K703J949J239R07J141J682J980J890J860K232K663K590K054
53613C42563J588J515J729K078K555L055L376L531L739M003M011L616L212L301
53599C83872L768L816K801J081j84k15M97P55N9r08j295j124r94j106j167j121
53583C88535j390k153k884k927k318j694j515j662j746j632j488j483j580j652
$$ y = [273485, 277361, 281283, 284806, 287697, 289766, 290603, 289871, 287790, 285052, 282300, 279938, 278245, 277299, 276776, 276154, 275163, 273839, 272272, 270629, 269369, 269001, 269493, 270184, 270413, 270069, 269473, 268952, 268606, 268326, 267996, 267795, 268240, 269627, 271398, 272454, 272282, 271554, 271404, 272262, 273661, 275040, 276336, 277685, 278869, 279448, 279469, 279703, 280899, 282926, 284985, 286659, 288394, 290784, 293696, 296457, 298677, 300582, 302601, 304973, 307777, 310993, 314419, 317673, 320376, 322325, 323564, 324471, 325612, 327294, 329274, 331164, 333024, 335256, 337919, 340509, 342563, 344151, 345666, 347395, 349473, 352028, 355083, 358459, 361990, 365729, 369732, 373743, 377359, 380571, 383872, 387640, 391456, 394257, 395338, 395154, 394939, 395436, 396191, 396250, 395342, 394047, 392923, 391929, 390823, 389656, 388535, 387145, 384992, 382108, 379181, 376863, 375169, 373654, 371992, 370246, 368614, 367126, 365643, 364063, 362411]
53569C62411j666j608j398r84n82n02o83o78k92J01J59J82O32J255J304P13L08
53552C58672O17J052Q17R2k96q9K49M72R09J727K493K786K741K687K668K726L199
53535C83522M214N208N522N357N589O594P822Q622Q999R304R609R772R903J0339
53521D90376J1180J2088J2641J2830J3121J3989J5328J6487J7109J7653J8789
53510F51591K0367K1587K2227K2977K4261K5295K5050K3737K2627K2385K2401
53499I04505K1871K0920K0272K0171K0179J9783J8824J7422J5866J4717J4637
53488A109167J5719J7142J7792J7373J6696J6741J7576J8376J8370J7515J6345
53477A298812J5476J5212J5264J4802J3087J0262P212M564K181k42k572m572o466
$$ y = [362411, 360745, 359137, 357739, 356755, 356173, 355671, 354988, 354310, 354018, 354119, 354278, 354460, 355092, 356347, 357651, 358364, 358672, 359289, 360341, 361158, 361250, 360954, 360865, 361114, 361586, 362495, 364222, 366715, 369501, 372242, 374929, 377597, 380323, 383522, 387736, 392944, 398466, 403823, 409412, 416006, 423828, 432450, 441449, 450753, 460362, 470134, 480037, 490376, 501556, 513644, 526285, 539115, 552236, 566225, 581553, 598040, 615149, 632802, 651591, 671958, 693545, 715772, 738749, 763010, 788305, 813355, 837092, 859719, 882104, 904505, 926376, 947296, 967568, 987739, 1007918, 1027701, 1046525, 1063947, 1079813, 1094530, 1109167, 1124886, 1142028, 1159820, 1177193, 1193889, 1210630, 1228206, 1246582, 1264952, 1282467, 1298812, 1314288, 1329500, 1344764, 1359566, 1372653, 1382915, 1390127, 1394691, 1396872, 1396630, 1394058, 1389486, 1383020]
53464A383020q547j0468j1475j1442j1120j1308j2099j3073j3888j4493j5017
53453A250090j5709j6821j8259j9419j9603j8775j7740j7378j7718j7976j7495
53442A053197j6344j4846j2948j0586q318o873o143n359m274l379k728j548M07
53429I60258K029K277J789K127L761N729P111P877Q399R009J0160J2140J4487
53416A047153J6292J7311J8114J9126K0196K1242K2531K4075K5435K6544K8071
53405A286090L0440L3034L4906L5944L6851L8185L9875M1592M3218M4874M6679
53394A711688M8495M9968N0972N1815N2741N3403N3239N2353N1440N0758M9764
53383B276636M7955M5593M3279M1302L9559L7772L5491L2251K8077K3568J9274
$$ y = [1383020, 1374473, 1364005, 1352530, 1341088, 1329968, 1318660, 1306561, 1293488, 1279600, 1265107, 1250090, 1234381, 1217560, 1199301, 1179882, 1160279, 1141504, 1123764, 1106386, 1088668, 1070692, 1053197, 1036853, 1022007, 1009059, 998473, 990155, 983282, 977139, 971780, 967506, 964127, 961399, 959851, 960258, 962287, 964564, 966353, 968480, 972241, 977970, 985081, 992958, 1001357, 1010366, 1020526, 1032666, 1047153, 1063445, 1080756, 1098870, 1117996, 1138192, 1159434, 1181965, 1206040, 1231475, 1258019, 1286090, 1316530, 1349564, 1384470, 1420414, 1457265, 1495450, 1535325, 1576917, 1620135, 1665009, 1711688, 1760183, 1810151, 1861123, 1912938, 1965679, 2019082, 2072321, 2124674, 2176114, 2226872, 2276636, 2324591, 2370184, 2413463, 2454765, 2494324, 2532096, 2567587, 2599838, 2627915, 2651483, 2670757]
53372B670757J5178J0945O375J474l660q929j4418k0397k6763l2608l6895l9630
53360B521429m1795m4113m6432m8328m9514m9549m8076m5699m3730m2624m1465
53349B020104l9548l7617l6749l6716l6431l5618l5046l5247l5748l5576l4094
53338A621714l1414k8438k6181k4791k3407k1362j8954j6822j5109j3808j3252
53327A388176j3536j4017j4112j4113j4420j4624j4244j3849j4269j5062j5000
53316A230930j3911j2816j2200j1487j0328r166q157o741m816l276k664k164p61
53303A132443J289K987M100N296P036R040J0851J2434J4093J6153J8598K0936
53291A255256K2546K3263K3487K3599K3605K3351K2781K1820K0376J8612J6855
$$ y = [2670757, 2685935, 2696880, 2703255, 2704729, 2701069, 2692140, 2677722, 2657325, 2630562, 2597954, 2561059, 2521429, 2479634, 2435521, 2389089, 2340761, 2291247, 2241698, 2193622, 2147923, 2104193, 2061569, 2020104, 1980556, 1942939, 1906190, 1869474, 1833043, 1797425, 1762379, 1727132, 1691384, 1655808, 1621714, 1590300, 1561862, 1535681, 1510890, 1487483, 1466121, 1447167, 1430345, 1415236, 1401428, 1388176, 1374640, 1360623, 1346511, 1332398, 1317978, 1303354, 1289110, 1275261, 1260992, 1245930, 1230930, 1217019, 1204203, 1192003, 1180516, 1170188, 1161022, 1152865, 1146124, 1141308, 1138032, 1135368, 1133204, 1132443, 1133732, 1136719, 1140819, 1146115, 1153151, 1162191, 1173042, 1185476, 1199569, 1215722, 1234320, 1255256, 1277802, 1301065, 1324552, 1348151, 1371756, 1395107, 1417888, 1439708, 1460084, 1478696, 1495551]
53280A495551J5143J3143J0754Q292N963L541Q76j742m006o081q312j0739j3204
53267A509179j5629j7873j9611k0763k1765k3032k4306k4955k4823k4501k4679
53256A267242k5499k6430k6712k5992k4703k3609k2973k2376k1490k0654k0373
53245A006431k0632k1092k1677k2468k3125k2952k1723j9990j8504j7482j6679
53234G80107j5891j5105j4226j2938j1084r034p472o719o539o733p537r082j0725
53221F47022j1572j1645j1907j2953j4279j5092j5277j5091j4480j3333j2078
53210D99315j1325j1057j0745j0228r832r621r195q385p596p181o985o836p043
53197C83286p915r066r723r610r094q527p905p212o662o330n945n320m696m375
$$ y = [1495551, 1510694, 1523837, 1534591, 1542883, 1548846, 1552387, 1553263, 1551521, 1547515, 1541434, 1533122, 1522383, 1509179, 1493550, 1475677, 1456066, 1435303, 1413538, 1390506, 1366200, 1341245, 1316422, 1291921, 1267242, 1241743, 1215313, 1188601, 1162609, 1137906, 1114297, 1091324, 1068948, 1047458, 1026804, 1006431, 985799, 964707, 943030, 920562, 897437, 874485, 852762, 832772, 814268, 796786, 780107, 764216, 749111, 734885, 721947, 710863, 701829, 694357, 687638, 681099, 674366, 666829, 657747, 647022, 635450, 623805, 611898, 598945, 584666, 569574, 554297, 539206, 524726, 511393, 499315, 487990, 476933, 466188, 455960, 446128, 436507, 427312, 418927, 411331, 404150, 397165, 390329, 383286, 375371, 366305, 356582, 346972, 337878, 329351, 321446, 314234, 307572, 301242, 295297, 289977, 285281, 280906]
53183B80906m127l449k350j486j360j734k050k134k191k233j939j194n07o15j618
53168B51919k687k769j679l30K32j00o09p38o25o01o32n15k95j45n9J0o9l88p08
53149B39212p19n01l86n25q21j155j353j168o78m56q46j246p63M99J515J717J538
53132B33864J438J181N68J27M45J234J683J519J136R21R30J142J532J935K197
53117B51852K401K616K522J797P68K16L96P12N39%l45l73n77j344k391l005k838
53100B52946k289k032k317k843l198l167k653j663n50J05O9k51l67l10l92n75
53084B30513m57Q7O98R80R02O38K74k16q51j564k132k232j728r57m54l66l95l31
53066B22409l97p60j072q57k11K49K15N3J92M49K94l39q98q78l92N0J15q9k10
$$ y = [280906, 276779, 273330, 270980, 269494, 268134, 266400, 264350, 262216, 260025, 257792, 255853, 254659, 254152, 253537, 251919, 249232, 246463, 244784, 244454, 244686, 244586, 243977, 243239, 242614, 242013, 241381, 240866, 240571, 240426, 240367, 240377, 240308, 239920, 239212, 238493, 237992, 237606, 237081, 236260, 235105, 233752, 232584, 231906, 231450, 230604, 229358, 228595, 229094, 230609, 232326, 233864, 235302, 236483, 237051, 237178, 237623, 238857, 240540, 242059, 243195, 244116, 245046, 246188, 247720, 249655, 251852, 254253, 256869, 259391, 261188, 261956, 262172, 262568, 263280, 263819, 263819, 263474, 263101, 262524, 261180, 258789, 255784, 252946, 250657, 248625, 246308, 243465, 240267, 237100, 234447, 232784, 232234, 232339, 232408, 232157, 231790, 231480, 231088, 230513, 230056, 230143, 230841, 231821, 232723, 233361, 233635, 233419, 232568, 231004, 228872, 226640, 224912, 223955, 223501, 223135, 222740, 222409, 222012, 221252, 220180, 219323, 219112, 219361, 219576, 219629, 219821, 220270, 220564, 220225, 219327, 218449, 218057, 218107, 218222, 218133, 217923]
53047B17923M1O07J031Q02p1r37j152p42k58p7j13j55j81k60l50l80l88m75o40
53028B14225p33n95k31J65L97N28P61J073J142P77K62N2K50N93Q35Q78O81L21
53010B21381R1K28O04R44J200J420J396R44M11L51O21M22n45j541j662q94O0O26
52992B26057O73L51jK7N07R70R03L62j25j10M72J333J963J979J567J380J754K291
52974B42353K465K301K100J792J091J28n73p40n66k82N5L64M67L43J53jj78m12
52956B50860o59q94j084j096q92p05p21o98l30P2j88j205k199k462k159j799j434
52939B32407q39k13k4k09j88J47J18p14j606j379RJ296J392N73j24k00R1M65R02
52920B31904J149O17q42k366k771j765j95Q76J112Q78N79K69r4l22j53L03O21
$$ y = [217923, 217964, 218571, 219602, 220404, 220333, 219396, 218244, 217502, 217244, 217167, 217054, 216899, 216718, 216458, 216108, 215728, 215340, 214865, 214225, 213492, 212897, 212666, 212831, 213228, 213756, 214517, 215590, 216732, 217509, 217771, 217823, 218073, 218666, 219501, 220379, 221060, 221381, 221472, 221700, 222304, 223248, 224448, 225868, 227264, 228208, 228619, 228970, 229591, 230013, 229468, 227927, 226265, 225371, 225431, 226057, 226730, 227081, 227080, 227107, 227614, 228584, 229487, 229849, 229724, 229614, 230086, 231419, 233382, 235361, 236928, 238308, 240062, 242353, 244818, 247119, 249219, 251011, 252102, 252230, 251657, 250917, 250351, 250069, 250124, 250488, 250955, 251298, 251451, 251450, 251272, 250860, 250201, 249307, 248223, 247127, 246235, 245530, 244809, 244111, 243781, 243853, 243665, 242460, 240261, 237799, 235640, 233841, 232407, 231568, 231355, 231331, 231122, 230934, 231081, 231199, 230485, 228879, 227500, 227509, 228805, 230197, 230770, 230646, 230446, 230537, 231002, 231904, 233053, 233670, 232828, 230462, 227691, 225926, 225731, 226607, 227719, 228597, 229176, 229445, 229351, 229029, 228876, 229179, 229800]
52903B29800N60L11O4k84p47r03m04L90P70O03L79L80M34M88P41J022P57j10p20
52884B33531l43O04J170J045O62M05L40M89P75Q69N31J28K20Q06J416J859K398
52867B46905L069L422L022J944O71j91k10N00J182J095L21m64r13j264j712k099
52851B55278k392k888l644m085l610k363j157p69j399k608l550l569k808k070
52837B18366j852j766j114J03J145J376Q72J73k45k44L8K92K19k45p99r87n87
52820B14745J76P87Q77M52j75o40o74k59K91N46M44M16Q18J361J396P60l0m95
52802B20796p93j331k059k483k350j937j582j256q32n59q43j565k018j706q76
52787A98606n4O41J278J573J104Q1o99p82m74j94J06N78J074J375J517J475R64
$$ y = [229800, 230360, 230671, 230735, 230451, 229704, 228801, 228397, 228787, 229557, 230160, 230539, 230919, 231353, 231841, 232582, 233604, 234361, 234251, 233531, 233188, 233792, 234962, 236007, 236669, 237074, 237414, 237903, 238678, 239547, 240078, 240206, 240426, 241232, 242648, 244507, 246905, 249974, 253396, 256418, 258362, 259033, 258842, 258632, 259132, 260314, 261409, 261730, 261266, 260353, 259089, 257377, 255278, 252886, 249998, 246354, 242269, 238659, 236296, 235139, 234370, 232971, 230363, 226813, 223244, 220436, 218366, 216514, 214748, 213634, 213737, 214882, 216258, 217130, 217303, 217058, 216814, 216852, 217144, 217363, 217118, 216319, 215332, 214745, 214921, 215708, 216585, 217037, 216862, 216222, 215548, 215289, 215580, 216126, 216570, 216986, 217804, 219165, 220561, 221321, 221291, 220796, 220003, 218672, 216613, 214130, 211780, 209843, 208261, 207005, 206173, 205614, 204771, 203206, 201188, 199482, 198606, 198552, 199193, 200471, 202044, 203148, 203229, 202530, 201748, 201274, 201080, 201186, 201764, 202838, 204213, 205730, 207205, 208169]
52770B08169k5q46q93m58l34o09n06M45J614J921J066j45o75l33J68J54k21k92
52752B08200J33O28Q61R69J023Q72P22J188K289L013K594J667J304J441J198N39
52736B28641L88J030J476R00j47m92J68J090J438J028K98j70j71o7l42j080j993
52719B31995k781l176k880j912q95m33l44j2O42J148J326J357J145L93n43q05
52703B24225k84J33j16n19m57j73j08k9M63J012Q49j18j139j423p43M73J403J403
52685B24852P00J83L14O29N53K20N7P2K9m1n5k08n87q30o42l01j68j1N09J079
52665B26354J124P05L34J35j39l86k06L83R61J460K255L360M178M234L661K837
52649B51250J939J049K99l11r34j573j939j735r52J1M22l02j800k777k238o39
$$ y = [208169, 208144, 207298, 206405, 205947, 205613, 205004, 204498, 204943, 206557, 208478, 209544, 209399, 208724, 208391, 208559, 208713, 208492, 208200, 208333, 208961, 209822, 210791, 211814, 212686, 213408, 214596, 216885, 219898, 222492, 224159, 225463, 226904, 228102, 228641, 229029, 230059, 231535, 232435, 232288, 231796, 231964, 233054, 234492, 235520, 235818, 235648, 235477, 235410, 235068, 233988, 231995, 229214, 226038, 223158, 221246, 220351, 219918, 219574, 219562, 220204, 221352, 222678, 224035, 225180, 225573, 225030, 224225, 223941, 224074, 223958, 223439, 222982, 222809, 222701, 222672, 223135, 224147, 224996, 224878, 223739, 222316, 221573, 222046, 223449, 224852, 225552, 225735, 226049, 226678, 227231, 227451, 227508, 227580, 227609, 227568, 227513, 227305, 226718, 225888, 225246, 224945, 224777, 224766, 225275, 226354, 227478, 228183, 228517, 228652, 228513, 228127, 227921, 228304, 229265, 230725, 232980, 236340, 240518, 244752, 248413, 251250, 253189, 254238, 254537, 254226, 253292, 251719, 249780, 248045, 247093, 247104, 247526, 247224, 245424, 242647, 240409, 239770]
52633B39770P24J253J396J556J580J431J582K246K832K674J890J046K69o59j548
52618B58042j759j107l26l19j091j737j526p22j47p4K2N73J212J303Q69N34O40
52601B54387R57J225J530J870J791Q09q19k061k024r55j15m22j303j319l1J373
52585B54893J665J163R88J256J011m3q81n33O74J718K114J991J514Q18K48O0R2
52568B68748K6j34k57m46q20j144j132r54r69j077q57l22l6l59j044j670k047
52551B55506k060j605r51p39j198j602j050L24J456J661J347J169J050N00l82
52536B53426q93o84j66K15O20J334K115K454K296J934J377L79q26j458j153n13
52520B60457k93l23J77J377K471K698K262J890J798J554R61O31J316K862M137
$$ y = [239770, 240494, 241747, 243143, 244699, 246279, 247710, 249292, 251538, 254370, 257044, 258934, 259980, 260249, 259590, 258042, 256283, 255176, 254850, 254531, 253440, 251703, 250177, 249455, 249308, 249234, 249256, 249829, 251041, 252344, 253213, 253747, 254387, 255344, 256569, 258099, 259969, 261760, 262569, 261750, 259689, 257665, 256710, 256595, 256173, 254870, 253551, 253520, 254893, 256558, 257721, 258709, 259965, 260976, 260933, 260052, 259519, 260193, 261911, 264025, 266016, 267530, 268348, 268596, 268656, 268748, 268774, 268640, 268383, 267937, 267117, 265973, 264841, 263887, 262918, 261841, 260984, 260662, 260626, 260267, 259223, 257553, 255506, 253446, 251841, 250890, 250151, 248953, 247351, 246301, 246625, 248081, 249742, 251089, 252258, 253308, 253808, 253426, 252533, 251849, 251683, 251898, 252518, 253852, 255967, 258421, 260717, 262651, 264028, 264407, 263581, 262123, 260970, 260457, 260164, 259841, 260018, 261395, 263866, 266564, 268826, 270716, 272514, 274068, 275029, 275660, 276976, 279838, 283975]
52505B83975M135K888J199k91j515k551l189l153k636k284k528l069l187k587
52491B65207j733j261j222j155q19m97n51q77j039p72j47O27J361J847J894J518
52475B62381R92O01L72J56n5jM48R36R81P59J083K305L616L926L227K448K126
52458B86301J953J682J576J599R57q40k996m250m343m021l781l442k879k417k268
52443B62831k157j740j075m20J09N11P09O05K13k99o96q79r69j114j125o04M22
52426B54322J372J830K013K185K061J349N47M41R88J363J110O36M87P62J298J943
52410B74707K519K957L562M676O051O994P138O644N737M562L413K428J158q51
52396C31695k975l984l745l547m293n262n174l839k090o56K42O16O98R11J385
$$ y = [283975, 288110, 290998, 292197, 291906, 290391, 287840, 284651, 281498, 278862, 276578, 274050, 270981, 267794, 265207, 263474, 262213, 260991, 259836, 259017, 258520, 257969, 257092, 256053, 255281, 255134, 255761, 257122, 258969, 260863, 262381, 263373, 263974, 264346, 264502, 264447, 264446, 264894, 265830, 266811, 267570, 268653, 270958, 274574, 278500, 281727, 284175, 286301, 288254, 289936, 291512, 293111, 294068, 293228, 290232, 285982, 281639, 277618, 273837, 270395, 267516, 265099, 262831, 260674, 258934, 257859, 257439, 257548, 258059, 258768, 259373, 259586, 259287, 258591, 257712, 256743, 255629, 254504, 253900, 254322, 255694, 257524, 259537, 261722, 263783, 265132, 265679, 266120, 267108, 268471, 269581, 270217, 270704, 271466, 272764, 274707, 277226, 280183, 283745, 288421, 294472, 301466, 308604, 315248, 320985, 325547, 328960, 331388, 332546, 331695, 328720, 324736, 320991, 317444, 313151, 307889, 302715, 298876, 296786, 296130, 296372, 296988, 297686, 298597, 299982]
52381B99982J694J469R41N97O73J200K082K846K907K519K742L972N231N509N105
52366C39469M862M738M111K964J677J73j618k778k268o23M41K66j96j53K2p1N5
52349C51071P82J548J786J928K595L442L709L461L485M193N345O573P576Q002
52335D05496P897Q013R069J0707J1894J2303J2654J3618J5052J6503J7884J9297
52323E60387K0677K1929K3165K4374K5129K5042K4399K3937K3935K3911K3427
52312H20312K2734K2362K2246K1786K0791J9850J9465J9214J8225J6271J4004
52301A037260J2157J0966J0320R958R360P934N638L093Q23j370l927o724r160
52288A086328j0930j2244j3264j3682j3103j1651r920q353o801m850k483j91J681
$$ y = [299982, 301676, 303145, 304086, 304683, 305356, 306556, 308638, 311484, 314391, 316910, 319652, 323624, 328855, 334364, 339469, 344331, 349069, 353180, 356144, 357821, 357994, 356376, 353598, 351330, 350707, 351148, 351414, 351218, 351065, 351087, 351016, 351071, 351853, 353401, 355187, 357115, 359710, 363152, 366861, 370322, 373807, 378000, 383345, 389918, 397494, 405496, 413393, 421406, 430475, 441182, 453076, 465379, 478033, 491651, 506703, 523206, 541090, 560387, 581064, 602993, 626158, 650532, 675661, 700703, 725102, 749039, 772974, 796885, 820312, 843046, 865408, 887654, 909440, 930231, 950081, 969546, 988760, 1006985, 1023256, 1037260, 1049417, 1060383, 1070703, 1080661, 1090021, 1097955, 1103593, 1106686, 1107509, 1106139, 1102212, 1095488, 1086328, 1075398, 1063154, 1049890, 1036208, 1023105, 1011454, 1001534, 993181, 986380, 981530, 979047, 978856, 980537]
52275I80537L452N621Q007R905J1101J2273J4027J5948J7047J6975J6382J6094
52263A127369J6298J6492J6083J5019J3953J3642J4074J4385J3861J2748J1696
52252A285620J0697R135O763M080J592p38l134n504p634r550j1459j3444j5429
52239A250995j7207j8427j8826j8646j8531j8796j9041j8740j7930j7001j6068
52228A051782j4958j3689j2466j1247r806q251p083o478n879m591k714j168p05
52215I52747j080j217k64J609L465M593N046N176N016M445L769L581M012M454
52201I95352M317L741L330L361L552L600L599L864M485N182N560N416M810M009
52187A054178L345L019K798J994R7k466m547n469n760o373p433q249q382q140
$$ y = [980537, 983989, 989610, 997617, 1007522, 1018623, 1030896, 1044923, 1060871, 1077918, 1094893, 1111275, 1127369, 1143667, 1160159, 1176242, 1191261, 1205214, 1218856, 1232930, 1247315, 1261176, 1273924, 1285620, 1296317, 1305452, 1312215, 1316295, 1317887, 1317149, 1314015, 1308511, 1300877, 1291327, 1279868, 1266424, 1250995, 1233788, 1215361, 1196535, 1177889, 1159358, 1140562, 1121521, 1102781, 1084851, 1067850, 1051782, 1036824, 1023135, 1010669, 999422, 989616, 981365, 974282, 967804, 961925, 957334, 954620, 953452, 952747, 951667, 950450, 950186, 951795, 955260, 959853, 964899, 970075, 975091, 979536, 983305, 986886, 990898, 995352, 999669, 1003410, 1006740, 1010101, 1013653, 1017253, 1020852, 1024716, 1029201, 1034383, 1039943, 1045359, 1050169, 1054178, 1057523, 1060542, 1063340, 1065334, 1065431, 1062965, 1058418, 1052949, 1047189, 1040816, 1033383, 1025134, 1016752, 1008612]
52173A008612p893p519o816n982n287m557l359j661k0Q79Q81O71J345L250N262
52158I77806N749M479K980K633L084L135K599K305K480K300J250P1j54P48K096
52143A013561L206L816L985M008M258M773N258N621O231P256Q214Q623Q932J0203
52129A097945J2845J6126J9088K1515K3785K6112K8358L0432L2461L4382L5670
52118A378719L5705L4442L2493L0602K9094K7758K6118K3802K0855J7729J4825
52107A672142J2068R115N984L143R18p91k123k984l434l969n072o774q946j1595
52093A657682j4452j6691j7848j8671k0265k2482k3983k3978k3020k1840k0228
52082A434224j7589j4041j0389p282m826k724n37K017M770P306R549J1836J4260
$$ y = [1008612, 1000719, 993200, 986384, 980402, 975115, 970558, 967199, 965538, 965518, 966397, 967278, 967949, 969294, 972544, 977806, 983555, 988034, 991014, 993647, 996731, 999866, 1002465, 1004770, 1007250, 1009550, 1010800, 1010871, 1010717, 1011465, 1013561, 1016767, 1020583, 1024568, 1028576, 1032834, 1037607, 1042865, 1048486, 1054717, 1061973, 1070187, 1078810, 1087742, 1097945, 1110790, 1126916, 1146004, 1167519, 1191304, 1217416, 1245774, 1276206, 1308667, 1343049, 1378719, 1414424, 1448866, 1481359, 1511961, 1541055, 1568813, 1594931, 1618733, 1639588, 1657317, 1672142, 1684210, 1693325, 1699309, 1702452, 1703370, 1702579, 1700456, 1697472, 1694038, 1690069, 1684997, 1678223, 1669277, 1657682, 1643230, 1626539, 1608691, 1590020, 1569755, 1547273, 1523290, 1499312, 1476292, 1454452, 1434224, 1416635, 1402594, 1392205, 1384923, 1380097, 1377373, 1376836, 1378853, 1383623, 1390929, 1400478, 1412314, 1426574]
52069A426574J6427J7952J8882J9362J9420J9212J9048J8901J8417J7644J7106
52058A628945J6817J5925J3863J1305R221P537N472K862J99k414n451r118j3020
52045A682143j6799k0404k3643k5995k7174k7497k7558k7728k7993k7972k7226
52034A402154k5773k4170k2784k1326j9509j7823j6895j6303j4993j2906j1320
52023A198352j1212j1980j2271j1619j0671j0204j0387j0897j1265j1056j0090
52012A076700q682p616p662q978j0913j2591j3758j4845j6145j7310j7920j8171
52000I22109j8534j8956j8968j8429j7642j6774j5638j4104j2381j0853r964r986
51988G39880j0593j0885j0415r904j0303j1386j2116j2254j2625j3595j4369j4172
$$ y = [1426574, 1443001, 1460953, 1479835, 1499197, 1518617, 1537829, 1556877, 1575778, 1594195, 1611839, 1628945, 1645762, 1661687, 1675550, 1686855, 1696076, 1703613, 1709085, 1711947, 1712146, 1709732, 1704281, 1695163, 1682143, 1665344, 1644940, 1621297, 1595302, 1568128, 1540631, 1513073, 1485345, 1457352, 1429380, 1402154, 1376381, 1352211, 1329427, 1308101, 1288592, 1270769, 1253874, 1237571, 1222578, 1209672, 1198352, 1187140, 1175160, 1162889, 1151270, 1140599, 1130395, 1120008, 1109111, 1097846, 1086790, 1076700, 1068018, 1060402, 1052740, 1043762, 1032849, 1020258, 1006500, 991655, 975510, 958200, 940280, 922109, 903575, 884619, 865651, 847222, 829580, 812806, 797168, 783064, 770683, 759830, 749866, 739880, 729287, 718402, 707987, 698083, 687780, 676394, 664278, 652024, 639399, 625804, 611435, 597263]
51976E97263j3249j2223j1153r853q581p737p247o650n558l747j260J352L349
51963E14706M644N774O799P045O339N578N331M664K471o72l132m357n161n904
51949E44125n739m077j774j54N24J102K420M784Q132J2180J6352J9995K2861K5229
51935F45960K7522K9811L1652L2384L1517K8733K3709J6260O865l248j2766k0949
51923H37450k7497l2139l4750l5647l5363l4148l1996k9044k5700k2396j9446
51912E09324j6983j4784j2395r681p132n199l638j895K9J646K766L656M327M389
51898D54430L660K499J256j13j678l204m463n599o858q199r273r631q848o847
51884C97132m288k250j150l69Q11K207L157L633M304N518O782P440P394O879N912
$$ y = [597263, 584014, 571791, 560638, 550785, 542204, 534467, 527220, 520570, 515012, 511265, 510005, 511357, 514706, 519350, 525124, 531923, 538968, 545307, 550885, 556216, 560880, 563351, 562679, 559547, 555190, 550029, 544125, 538386, 534309, 532535, 532381, 532905, 534007, 536427, 541211, 549343, 561523, 577875, 597870, 620731, 645960, 673482, 703293, 734945, 767329, 798846, 827579, 851288, 867548, 874413, 871165, 858399, 837450, 809953, 777814, 743064, 707417, 672054, 637906, 605910, 576866, 551166, 528770, 509324, 492341, 477557, 465162, 455481, 448349, 443150, 439512, 437617, 437646, 439292, 442058, 445714, 450041, 454430, 458090, 460589, 461845, 461732, 460054, 456850, 452387, 446788, 439930, 431731, 422458, 412827, 403979, 397132, 392844, 390594, 389444, 389075, 389886, 392093, 395250, 398883, 403187, 408705, 415487, 422927, 430321, 437200, 443112]
51869D43112M453K898J919J623J316K88j335k798l606l848l732l277k542j755
51855D32716r64J02J504K700L068K650J971J249K59j063k392l496m495n501o322
51840D21986o771o928o838o312n300m215l459k811j740k78Q35J068P64O73R79
51825C81653J143O77k33r85j239j190j255j677k389l063l238k667j633p11j33
51810C63060M38J312K176K462K118J639J280Q00P7m50l48R7K12j68n60n93n00
51793C73052o27r08j119j407k118l073l495k864j581n65k88m29m47k17j2KR4O58
51775C54656J641K440K615K569L071M144M969N112N232O051P126P414O788O073
51761D19901N640M943L584J944L73j451l811o236q100r308r922r642q353o704
$$ y = [443112, 447565, 450463, 452382, 454005, 455321, 455609, 454274, 451476, 447870, 444022, 440290, 437013, 434471, 432716, 431752, 431854, 433358, 436058, 439126, 441776, 443747, 444996, 445255, 444192, 441800, 438304, 433809, 428308, 421986, 415215, 408287, 401449, 395137, 389837, 385622, 382163, 379352, 377612, 377334, 378169, 379237, 380001, 380674, 381653, 382796, 383473, 383240, 382255, 381016, 379826, 378571, 376894, 374505, 371442, 368204, 365537, 363904, 363193, 363060, 363498, 364810, 366986, 369448, 371566, 373205, 374485, 375285, 375362, 374912, 374564, 374661, 374873, 374705, 374145, 373552, 373052, 372425, 371517, 370398, 368991, 366873, 363800, 360305, 357441, 355860, 355295, 355007, 354578, 354131, 353914, 353902, 353904, 353998, 354656, 356297, 358737, 361352, 363921, 366992, 371136, 376105, 381217, 386449, 392500, 399626, 407040, 413828, 419901, 425541, 430484, 434068, 436012, 436385, 434934, 431123, 424887, 416787, 407479, 397557, 387915, 379562, 372858]
51747C72858n474m709m084l640l455k982j668R3J435K287L282M594N760O527O962
51732C77786O828N840M605M130M265L779K330J155J232J858J911J520J425J413
51718D20077N31j356l306m503m909m769m204l387k610k050j752j799k107k280
51704C81576j970j266l06J071K759L782L104J052q33j498j314j162j201j017m79
51689C82298Q3L55L02q5q90k074l339m291m634m239l150j726o35l47n02j43J117
51672C58100K470K893K553K620L781N629P554R398J0925J1406J0340Q077N264
51659D41010K231o57k743l859m779o086p058o539m585k261j99J613K791K550R41
51644D12370r71k414l564m672n463n747n775n598m813l392k034j231o85j00J29
$$ y = [372858, 367384, 362675, 358591, 354951, 351496, 348514, 346846, 346939, 348374, 350661, 353943, 358537, 364297, 370824, 377786, 384614, 390454, 395059, 399189, 403454, 407233, 409563, 410718, 411950, 413808, 415719, 417239, 418664, 420077, 420608, 419252, 415946, 411443, 406534, 401765, 397561, 394174, 391564, 389514, 387762, 385963, 383856, 381576, 379606, 378340, 378034, 379105, 381864, 385646, 388750, 389802, 388969, 387471, 386157, 384995, 383794, 382777, 382298, 382381, 382736, 383038, 382953, 382063, 379989, 376650, 372359, 367725, 363486, 360336, 358610, 357975, 357628, 357126, 356983, 358100, 360570, 363463, 366016, 368636, 372417, 378046, 385600, 394998, 405923, 417329, 427669, 435746, 441010, 443241, 442584, 439841, 435982, 431203, 425117, 418059, 411520, 406935, 404674, 404475, 406088, 408879, 411429, 412370, 411399, 408985, 405421, 400749, 395286, 389539, 383764, 378166, 373353, 369961, 367927, 366696, 366011, 365911, 366040]
51629C66040l25r47r98n23q9P1om96j579k968m130m828n024m651l906l358l221
51612C29062k952k180j537j769k458k493j604n44J49O00R51J154J548K689M382
51597C24998N705O285O740P561Q337Q480P973O943N121K391o15l029m518n152
51583C77220m950m044k906j818n49J026K431L343M362O222Q601J0545J1897J3276
51569D24656J4665J5161J4430J3452J3273J3693J3879J3734J3959J5058J6930
51558E82890J9284K1805K3939K5042K4825K3349K0538J6160J0393M072j912p248
51546G63137j2112j6563k0252k2720k3883k4185k4165k3857k2698k0288j7073
51535E35341j4059j1794r932p945n982m735m569n120n717n969n930n909o226o908
$$ y = [366040, 365715, 364768, 363770, 363247, 363158, 363229, 363223, 362727, 361148, 358180, 354050, 349222, 344198, 339547, 335641, 332283, 329062, 326110, 323930, 322393, 320624, 318166, 315673, 314069, 313525, 313674, 314274, 315225, 316379, 317927, 320616, 324998, 330703, 336988, 343728, 351289, 359626, 368106, 376079, 383022, 388143, 390534, 389919, 386890, 382372, 377220, 372270, 368226, 365320, 363502, 362953, 363979, 366410, 369753, 374115, 380337, 388938, 399483, 411380, 424656, 439321, 454482, 468912, 482364, 495637, 509330, 523209, 536943, 550902, 565960, 582890, 602174, 623979, 647918, 672960, 697785, 721134, 741672, 757832, 768225, 772297, 770385, 763137, 751025, 734462, 714210, 691490, 667607, 643422, 619257, 595400, 572702, 552414, 535341, 521282, 509488, 499556, 491611, 485629, 480894, 476325, 471205, 465488, 459519, 453589, 447680, 441454, 434546]
51521D34546p503p426o675o036o218o892o978o011m753m183m238m043l229k418
51507C57943k300k737l068k941k436j684p96p4J95J51K35N27O05J93l33k86N63
51490C43757J725K411K193J401Q56J019J434J326O63J76K00J01p52j926k478k267
51474C49839k035k282k662k661k281j837j598j844k755l960m580m177l294k675
51460C11198k283j595n89J61L32J62m5j91r5N05J431K092K346K888M317O227P777
51443C34638Q872J0106J1600J2609J2454J1342R911Q387O566M388K120J66j046
51430D32113j177m11K61k93k295m896p051q246q405p682o586n792n416m841l692
51415C65591k574k284k515k203j094j90l36j057j309q17j42K64M28M97N82Q43
$$ y = [434546, 427043, 419617, 412942, 406906, 400688, 393796, 386818, 380807, 376054, 371871, 367633, 363590, 360361, 357943, 355643, 352906, 349838, 346897, 344461, 342777, 341981, 341907, 342102, 342253, 342488, 343015, 343620, 343813, 343480, 343194, 343757, 345482, 347893, 350086, 351487, 352343, 353362, 354796, 356122, 356785, 356961, 357161, 357262, 356510, 354584, 352106, 349839, 347804, 345522, 342860, 340199, 337918, 336081, 334483, 332639, 329884, 325924, 321344, 317167, 313873, 311198, 308915, 307320, 306731, 306892, 307224, 307386, 307341, 307150, 307055, 307560, 308991, 311083, 313429, 316317, 320634, 326861, 334638, 343510, 353616, 365216, 377825, 390279, 401621, 411532, 419919, 426485, 430873, 432993, 433159, 432113, 430936, 430525, 430786, 430493, 428198, 423302, 416251, 408005, 399600, 391918, 385332, 379540, 374124, 369283, 365591, 363017, 360733, 358218, 356015, 354921, 354731, 354395, 353338, 352029, 351212, 351070, 351334, 351762, 352259, 352841, 353684]
51399C53684J280J485J072L58J57Q50K055L259M317N198N797O229P022Q613J0852
51384D12228J3221J5408J7532J9952K2995K6652L0437L3767L6499L8767M0317
51373G07775M0437L8612L4786K8855K0758J1384K565m736j1503j8970k6329l1445
51361G92189l3682l4643l5795l6703l6288l4648l2619l0322k7260k3518j9822
51350D46889j6611j3894j1872j0757j0037q801p025n593m940m403l358k253j886
51337C45459k218k508k294j638o68N11J545J955J657R81K32n20j234j829k263
51322C37168k451k230j619j055r58j113r44l62R3O2j41q0J86L19K71J69j02p73
51304C26440j600j834j020L51J187Q14l51j261j319r26p98r85q55j17O45P05J27
$$ y = [353684, 354964, 356449, 357521, 357879, 358036, 358886, 360941, 364200, 368517, 373715, 379512, 385741, 392763, 401376, 412228, 425449, 440857, 458389, 478341, 501336, 527988, 558425, 592192, 628691, 667458, 707775, 748212, 786824, 821610, 850465, 871223, 882607, 885172, 880436, 868933, 849963, 823634, 792189, 758507, 723864, 688069, 651366, 615078, 580430, 547811, 517489, 490229, 466711, 446889, 430278, 416384, 404512, 393755, 383718, 374917, 367892, 362299, 357359, 352956, 349598, 347345, 345459, 343241, 340733, 338439, 336801, 336133, 336644, 338189, 340144, 341801, 342782, 343014, 342494, 341260, 339431, 337168, 334717, 332487, 330868, 329813, 328855, 327742, 326798, 326436, 326529, 326591, 326450, 326370, 326556, 326875, 327146, 327315, 327213, 326440, 324840, 323006, 321986, 322337, 323524, 324338, 323987, 322726, 321407, 320481, 319683, 318698, 317843, 317726, 318371, 319076, 319203]
51287C19203l59k06N55J629K688L380L506L313L261L495L737L745L449K733J569
51272C55698M93L77J377K515K766K258J913K140K421K140J309L45m47r96j369
51257C72940j709k097k375k335k135k187k561k763k405j812j704k270k850k625
51243C41112j475j49M72J55n95j168j398j422j289r42m54O7O79J336J491N49j093
51226C35876k042j366L24J683K134K046J680Q03n08j404j114P2J052J097N30K57
51210C41120Q14J893K664K622K064J704J821K072K147K256K628K879K357J187
51196C70228L72N99J271J175m1j475k050j588p48k36l54r78j648j851j494j020
51180C60162q15o81k77J81J90j70k32K61P80Q81Q44J076J392J351R66N53J61k51
$$ y = [319203, 318844, 318638, 319193, 320822, 323510, 326890, 330396, 333709, 336970, 340465, 344202, 347947, 351396, 354129, 355698, 356191, 356568, 357945, 360460, 363226, 365484, 367397, 369537, 371958, 374098, 375407, 375752, 375305, 374309, 372940, 371231, 369134, 366759, 364424, 362289, 360102, 357541, 354778, 352373, 350561, 348857, 346587, 343737, 341112, 339637, 339488, 339960, 340115, 339520, 338352, 336954, 335532, 334243, 333301, 332847, 332914, 333593, 334929, 336420, 336969, 335876, 333834, 332468, 332792, 334475, 336609, 338655, 340335, 341138, 340630, 339226, 338112, 338184, 339236, 340333, 340863, 341120, 341934, 343827, 346491, 349113, 351177, 352881, 354702, 356774, 358921, 361177, 363805, 366684, 369041, 370228, 370600, 371199, 372470, 373645, 373604, 372129, 370079, 368491, 367743, 367507, 367153, 366175, 364527, 362676, 361182, 360162, 359347, 358666, 358389, 358570, 358760, 358590, 358358, 358619, 359399, 360280, 361124, 362200, 363592, 364943, 365909, 366462, 366623, 366372]
51162C66372l80O5P55J071R44P51N04j48j031j408j034n64n85q11p08l93l61o56
51144C62383q27n81j01J70j56j088j931j673r3J751K589K385K177K650L373L531
51128C74559K883J850R77N43M93N48M67K59J08J17K11K67K05N6L5M18J183J848
51110C87027J939J510J016P61P37Q59J070J269J391J638K238K952L151K508J442
51095D11508P11P23J269J802J902J577J082N21k38j074j431r65j58J80o4k90j64
51078D16891L3P4J93N24P46O42M97N84O80O08P31J386K267K974L854N463P450
51061D45597Q862R560J0429J1981J3535J4200J3956J3306J2424J1259J0003Q917
51049E84029P950P049O504O430O113M706K408K69j251k757m709o502p218o797
$$ y = [366372, 365992, 366057, 366812, 367883, 368827, 369578, 370082, 369934, 368903, 367495, 366461, 365897, 365312, 364501, 363793, 363400, 363039, 362383, 361556, 360975, 360874, 361044, 360888, 359800, 357869, 356196, 356103, 357854, 360443, 362828, 365005, 367655, 371028, 374559, 377442, 379292, 380269, 380812, 381305, 381853, 382320, 382579, 382687, 382804, 383015, 383282, 383487, 383543, 383578, 383996, 385179, 387027, 388966, 390476, 391492, 392253, 392990, 393849, 394919, 396188, 397579, 399217, 401455, 404407, 407558, 410066, 411508, 412219, 412942, 414211, 416013, 417915, 419492, 420574, 421095, 420857, 419783, 418352, 417387, 417229, 417409, 417345, 417055, 416891, 416924, 416998, 417191, 417715, 418461, 419103, 419600, 420184, 420864, 421472, 422203, 423589, 425856, 428830, 432684, 438147, 445597, 454459, 464019, 474448, 486429, 499964, 514164, 528120, 541426, 553850, 565109, 575112, 584029, 591979, 599028, 605532, 611962, 618075, 622781, 625189, 625458, 624207, 621450, 616741, 610239, 603021, 596224]
51035E96224n875m843l780l099l610n634q423j0651j1412j0755r461q326p465
51022E02890o354m649k775j373l28J129L272N377O694P418Q326R648J0823J1276
51008E51374J1025J0515J0164J0095R973R189P493N532M309L975L584K368Q40
50995F40436J43M95R57P88M01O51J640K813L958N420P271Q978J0235J1657J4064
50980G09907J7256K0058K1558K1796K1286K0409J9595J9558K0890K3537K7096
50969I42946L1432L6604M2325M7968N3220N8350O3610O8789P3497P7668Q1398
50958A577807Q4419Q6059Q5822Q3760Q0193P5274O8997O1572N3426M4784L5463
50947B337576K5373J5111N764j958q082j2823j6110j7960j9080k0449k2310k3965
$$ y = [596224, 590349, 585506, 581726, 578627, 575017, 569383, 560960, 550309, 538897, 528142, 518681, 510355, 502890, 496536, 491887, 489112, 487739, 487411, 488540, 491812, 497189, 503883, 511301, 519627, 529275, 540098, 551374, 562399, 572914, 583078, 593173, 603146, 612335, 619828, 625360, 629669, 633644, 637228, 639596, 640436, 640579, 641074, 642031, 642819, 643220, 643871, 645511, 648324, 652282, 657702, 664973, 673951, 684186, 695843, 709907, 727163, 747221, 768779, 790575, 811861, 832270, 851865, 871423, 892313, 915850, 942946, 974378, 1010982, 1053307, 1101275, 1154495, 1212845, 1276455, 1345244, 1418741, 1496409, 1577807, 1662226, 1748285, 1834107, 1917867, 1998060, 2073334, 2142331, 2203903, 2257329, 2302113, 2337576, 2362949, 2378060, 2383824, 2381866, 2373784, 2360961, 2344851, 2326891, 2307811, 2287362, 2265052, 2241087]
50935B241087k4789k5023k5384k6139k6988k7688k8497k9931l2363l5801l9848
50924A918636m3791m7019m9554n2058n4991n7816n9307n8782n6820n4592n2646
50913A331260n0584m7828m4253m0085l5652l1391k7801k5037k2784k0805j9324
50902I65716j8551j8076j7248j6020j4866j3862j2470j0375q075o276n096m139
50890H20662l165k343j920j858j752j107J81J619K627L216L864M772N670O453
50876H36919P415Q664R849J0771J1791J3191J4676J5952J7314J9003K0545K1493
50864A007583K2452K4393K7203K9918L2362L5450L9709M4625M9808N5809O3112
50853A432424P1235P9594Q8616R9103J10977J23368J35605J47397J58393J68380
$$ y = [2241087, 2216298, 2191275, 2165891, 2139752, 2112764, 2085076, 2056579, 2026648, 1994285, 1958484, 1918636, 1874845, 1827826, 1778272, 1726214, 1671223, 1613407, 1554100, 1495318, 1438498, 1383906, 1331260, 1280676, 1232848, 1188595, 1148510, 1112858, 1081467, 1053666, 1028629, 1005845, 985040, 965716, 947165, 929089, 911841, 895821, 880955, 867093, 854623, 844248, 836173, 829897, 824801, 820662, 817497, 815154, 813234, 811376, 809624, 808517, 808698, 810317, 812944, 816160, 820024, 824796, 830466, 836919, 844334, 852998, 862847, 873618, 885409, 898600, 913276, 929228, 946542, 965545, 986090, 1007583, 1030035, 1054428, 1081631, 1111549, 1143911, 1179361, 1219070, 1263695, 1313503, 1369312, 1432424, 1503659, 1583253, 1671869, 1770972, 1881949, 2005317, 2140922, 2288319, 2446712, 2615092]
50843B615092J77603J86140J93062J97025J97497J94584J87792J75984J58716
50834D283495J36880J11767Q4400N5952K7980J667k2500m3939o1432p3975q1589
50823D418706q4769q3669p8466p0172o0461n0895m2721l7000l4308l4536l7562
50812C804147m3728n3047o4359p6144q7984j00313j12780j23855j32238j37779
50802B871920j40731j40995j38564j34034j28072j20806j12176j02516r2325q1869
50792A679832p1397o1426n2364m4166l6732l0268k4848k0013j5395j1418q796
50781A303009p516o902o503o304o195n931n658n849o593p462q254r278j0671j1979
50767A197914j2765j3218j3772j4462j5021j5417j5811j6099j5905j5080j3894
$$ y = [2615092, 2792695, 2978835, 3171897, 3368922, 3566419, 3761003, 3948795, 4124779, 4283495, 4420375, 4532142, 4616542, 4672494, 4700474, 4702141, 4679641, 4635702, 4574270, 4500295, 4418706, 4333937, 4250268, 4171802, 4101630, 4041169, 3990274, 3947553, 3910553, 3876245, 3841709, 3804147, 3760419, 3707372, 3643013, 3566869, 3478885, 3378572, 3265792, 3141937, 3009699, 2871920, 2731189, 2590194, 2451630, 2317596, 2189524, 2068718, 1956542, 1854026, 1761701, 1679832, 1608435, 1547009, 1494645, 1450479, 1413747, 1383479, 1358631, 1338618, 1323223, 1311805, 1303009, 1295493, 1288591, 1282088, 1275784, 1269589, 1263658, 1258000, 1252151, 1245558, 1238096, 1229842, 1220564, 1209893, 1197914, 1185149, 1171931, 1158159, 1143697, 1128676, 1113259, 1097448, 1081349, 1065444, 1050364, 1036470]
50756A036470j2580j1015q991o651m395k316l3K808N985R047J2077J5649J9852
50743A055907K3843K6859K9412L2825L7626M3008M8056N2930N8396O4552P0604
50732A544018P5837Q0385Q4837Q9314R3231R5988R7686R8898R9826R9952R8616
50721B558588R5585R0718Q3409P2888N9090M2831K5112O649j1824k9310m4821
50710B948915n7609o6908p1863p2082o8169o1453n3239m4423l5520k6872j8964
50699B371813j2707r185q937j1621j6562k3374l1795m1216n0737n9653o7511p3863
50687A964652p8184q0131p9639p6818p2061o6171o0071n4160m8141m1541l4360
50676A273375k7073k0076j3325o617j39N504R919J3393J6401J8818K0072K0074
$$ y = [1036470, 1023890, 1012875, 1003884, 997233, 992838, 990522, 990489, 993297, 999282, 1008329, 1020406, 1036055, 1055907, 1079750, 1106609, 1136021, 1168846, 1206472, 1249480, 1297536, 1350466, 1408862, 1473414, 1544018, 1619855, 1700240, 1785077, 1874391, 1967622, 2063610, 2161296, 2260194, 2360020, 2459972, 2558588, 2654173, 2744891, 2828300, 2901188, 2960278, 3003109, 3028221, 3034870, 3023046, 2993736, 2948915, 2891306, 2824398, 2752535, 2680453, 2612284, 2550831, 2497592, 2453169, 2417649, 2390777, 2371813, 2359106, 2349921, 2340984, 2329363, 2312801, 2289427, 2257632, 2216416, 2165679, 2106026, 2038515, 1964652, 1886468, 1806337, 1726698, 1649880, 1577819, 1511648, 1451577, 1397417, 1349276, 1307735, 1273375, 1246302, 1226226, 1212901, 1206284, 1206145, 1211649, 1221568, 1234961, 1251362, 1270180, 1290252, 1310326]
50664A310326J9534J9094J8597J7580J6119J4768J3892J3516J3637J4179J4662
50653A485904J4529J3874J3492J4010J5337J7030J8839K0705K2584K4582K7035
50642A687921L0106L3394L6193L8154L9516M0740M2052M3331M4184M4084M2703
50631B122378M0323L7822L5997L4831L3617L1758K9126K5479J9966J1791J356
50620B424444r603j9160k6127k9985l0493k7813k2797j6692j0553m990k55L568
50608B229544O364P769P348N014R96m702j2353k1677l1429m0221m7627n4003n9494
50595A985529o3712o6354o7564o7659o6898o5537o3766o1464n8319n4261m9627
50584A300368m4913m0561l6867l3759l0746k7357k3627j9935j6517j3365j0388
$$ y = [1310326, 1329860, 1348954, 1367551, 1385131, 1401250, 1416018, 1429910, 1443426, 1457063, 1471242, 1485904, 1500433, 1514307, 1527799, 1541809, 1557146, 1574176, 1593015, 1613720, 1636304, 1660886, 1687921, 1718027, 1751421, 1787614, 1825768, 1865284, 1906024, 1948076, 1991407, 2035591, 2079675, 2122378, 2162701, 2200523, 2236520, 2271351, 2304968, 2336726, 2365852, 2391331, 2411297, 2423088, 2424444, 2414841, 2395681, 2369554, 2339569, 2309076, 2281263, 2258466, 2241774, 2231221, 2226231, 2225976, 2229544, 2235908, 2243677, 2251025, 2256039, 2257035, 2252333, 2239980, 2218303, 2186874, 2146653, 2099026, 2045023, 1985529, 1921817, 1855463, 1787899, 1720240, 1653342, 1587805, 1524039, 1462575, 1404256, 1349995, 1300368, 1255455, 1214894, 1178027, 1144268, 1113522, 1086165, 1062538, 1042603, 1026086, 1012721, 1002333]
50573A002333p380m122r31J326K391L385N582Q631J0986J2155J3278J5290J7572
50560A080496J9088J9902K0691K1561K2217K2898K4097K5528K6274K5972K5209
50549A333933K4646K4358K4164K4088K4263K4676K5215K5927K7175K9451L2910
50538A620806L7078M1254M5329M9819N4965O0257O5110O9548P3801P7748Q1370
50527B277085Q5299R0206R5751J00868J04948J08120J10354J11069J09659J05916
50517C299275R9829R1434Q0973O8674N4388L7929J9831J225j7056l4721n1341
50506C650440o6146p8576q8341r4795r7050r5078q9898q2161p1390n7301m1158
50495B788546k4868r175O232K0920L3076M0826M3557M1646L5498K5181J0743p323
$$ y = [1002333, 994953, 990831, 989900, 991226, 993617, 997002, 1002584, 1011215, 1022201, 1034356, 1047634, 1062924, 1080496, 1099584, 1119486, 1140177, 1161738, 1183955, 1206853, 1230950, 1256478, 1282752, 1308724, 1333933, 1358579, 1382937, 1407101, 1431189, 1455452, 1480128, 1505343, 1531270, 1558445, 1587896, 1620806, 1657884, 1699138, 1744467, 1794286, 1849251, 1909508, 1974618, 2044166, 2117967, 2195715, 2277085, 2362384, 2452590, 2548341, 2649209, 2754157, 2862277, 2972631, 3083700, 3193359, 3299275, 3399104, 3490538, 3571511, 3640185, 3694573, 3732502, 3752333, 3753558, 3736502, 3701781, 3650440, 3584294, 3505718, 3417377, 3322582, 3225532, 3130454, 3040556, 2958395, 2887005, 2829704, 2788546, 2763678, 2754503, 2760735, 2781655, 2814731, 2855557, 2899114, 2940760, 2976258, 3001439, 3012182, 3004859]
50483C004859k7722m8435o7520q3905r7253j07203j13262j15551j14995j12532
50473B116481j08354j02279r4569q6112p7931p0757o4846n9954n5483n0879m5968
50462A299349m0946l6091l1518k7024k2252j7169j2362q579n819l204J35M175
50450A098695Q144J1334J3676J5738J8287K1609K5137K8004L0044L1813L3337
50439A335818L3412L0669K5115J8121J1133M978J85k904m600n720o674p120o692
50426A425721n613m307k899j302N88L074O432J0224J3417J5748J8320K2298K7412
50413A529113L2540L7177M1466M5177M7896N0080N2670N5443N6961N6486N4797
50402B059806N2633M9498M4849L9354L3783K7496J9333R486q75j1534k3216l5615
$$ y = [3004859, 2977137, 2928702, 2861182, 2777277, 2680024, 2572821, 2459559, 2344008, 2229013, 2116481, 2008127, 1905848, 1811279, 1725167, 1647236, 1576479, 1511633, 1451679, 1396196, 1345317, 1299349, 1258403, 1222312, 1190794, 1163770, 1141518, 1124349, 1111987, 1103408, 1097589, 1094385, 1094520, 1098695, 1106839, 1118173, 1131849, 1147587, 1165874, 1187483, 1212620, 1240624, 1270668, 1302481, 1335818, 1369230, 1399899, 1425014, 1443135, 1454268, 1459246, 1459431, 1456527, 1451927, 1446207, 1439533, 1432413, 1425721, 1420108, 1415801, 1412902, 1411600, 1412188, 1415262, 1421694, 1431918, 1445335, 1461083, 1479403, 1501701, 1529113, 1561653, 1598830, 1640296, 1685473, 1733369, 1783449, 1836119, 1891562, 1948523, 2005009, 2059806, 2112439, 2161937, 2206786, 2246140, 2279923, 2307419, 2326752, 2336238, 2335363, 2323829, 2300613, 2264998]
50390B264998m6909n5703o2220o6963o9397o8847o5837o1457n5892m8591l9640
50379A623542l0049k0720j1864l529L934J0064J4500J6936J7192J5376J1657N988
50367A653027j574j0364j9332k7697l5013m0759m4463m6225m6571m5739m3661
50356A291629m0721l7747l5015l1936k8134k4284k1250j9047j7285j6218j6456
50345A003536j7783j9165j9915k0125j9760j8235j5332j1902q980o583l976r93
50333H40787J676L457M586N579O496P091P420P805Q284Q493Q257P973Q146Q686
50319I34736R000Q774Q305P956P571O787N681M746M168L531K423J117L68O22J643
50304A007428K895M134N497P131Q844J0185J0888J1260J2066J4005J7238K1414
$$ y = [2264998, 2218089, 2162386, 2100166, 2033203, 1963806, 1894959, 1829122, 1767665, 1711773, 1663182, 1623542, 1593493, 1572773, 1560909, 1557380, 1561314, 1571378, 1585878, 1602814, 1620006, 1635382, 1647039, 1653027, 1651453, 1641089, 1621757, 1594060, 1559047, 1518288, 1473825, 1427600, 1381029, 1335290, 1291629, 1250908, 1213161, 1178146, 1146210, 1118076, 1093792, 1072542, 1053495, 1036210, 1019992, 1003536, 985753, 966588, 946673, 926548, 906788, 888553, 873221, 861319, 852339, 845756, 841780, 840787, 842463, 845920, 850506, 856085, 862581, 869672, 877092, 884897, 893181, 901674, 909931, 917904, 926050, 934736, 943736, 952510, 960815, 968771, 976342, 983129, 988810, 993556, 997724, 1001255, 1003678, 1004795, 1005163, 1005785, 1007428, 1010323, 1014457, 1019954, 1027085, 1035929, 1046114, 1057002, 1068262, 1080328, 1094333, 1111571, 1132985]
50292A132985K6127L1158L6255M0717M3574M4209M2472L7900K9280J5801j123
50281A479355j7851l0765l8387m1296m0753l8007l4227l0075k5375j9954j4710
50270A147955j1006r019p599n836l871j915M38L358O178Q435J0776J3955J7531
50257A169380K0515K2784K4871K6712K7662K7684K7441K7235K6818K6254K5927
50246A453283K5513K3920K0571J5927J0427L902l535j0911j7397k3077k8064l1568
50234A438991l2707l1824l0116k8250k6176k4079k2691k2597k3795k5887k8265
50223A142604l0203l1278l1707l1825l1461l0259k8388k6300k3935k0937j7629
50212H38682j4974j3321j1900r906p560n626m415l624k956k351j796j276q82p99
$$ y = [1132985, 1159112, 1190270, 1226525, 1267242, 1310816, 1355025, 1397497, 1435397, 1464677, 1480478, 1479355, 1461504, 1430739, 1392352, 1351056, 1310303, 1272296, 1238069, 1207994, 1182619, 1162665, 1147955, 1136949, 1127930, 1120331, 1114495, 1110624, 1108709, 1109147, 1112505, 1118683, 1127118, 1137894, 1151849, 1169380, 1189895, 1212679, 1237550, 1264262, 1291924, 1319608, 1347049, 1374284, 1401102, 1427356, 1453283, 1478796, 1502716, 1523287, 1539214, 1549641, 1553543, 1550008, 1539097, 1521700, 1498623, 1470559, 1438991, 1406284, 1374460, 1344344, 1316094, 1289918, 1265839, 1243148, 1220551, 1196756, 1170869, 1142604, 1112401, 1081123, 1049416, 1017591, 986130, 955871, 927483, 901183, 877248, 856311, 838682, 823708, 810387, 798487, 788581, 781021, 775395, 770980, 767356, 764400, 762049, 760253, 758977, 758095, 757296]
50198G57296j143j900k882l667l832l371k777k572k874l501m257m948n298n223
50184G09051n045n213n737o052n598m463l418l180l697m210m088l453k813k270
50170F49814j502m45L86O08O26J223K482L540L587K909K664L616N309O702P446
50155F88965Q255R977J2601J5372J7621J9244K0564K2048K4106K6843K9991L3255
50143I28842L6627M0159M3563M6421M8704N0682N2322N3278N3609N3962N4778
50132A462947N5691N5995N5392N3847N0987M6129L8922K9638J8751O528o872k0918
50120A847037l4423m5843n4080n9175o2003o3209o2648o0057n5947n1406m7112
50109A251134m2885l8339l3635k9481k6479k4571k3001k0933j8231j5668j4170
$$ y = [757296, 756153, 754253, 751371, 747704, 743872, 740501, 737724, 735152, 732278, 728777, 724520, 719572, 714274, 709051, 704006, 698793, 693056, 687004, 681406, 676943, 673525, 670345, 666648, 662438, 658350, 654897, 652084, 649814, 648312, 647867, 648253, 648861, 649487, 650710, 653192, 656732, 660319, 663228, 665892, 669508, 674817, 681519, 688965, 697220, 707197, 719798, 735170, 752791, 772035, 792599, 814647, 838753, 865596, 895587, 928842, 965469, 1005628, 1049191, 1095612, 1144316, 1194998, 1247320, 1300598, 1354207, 1408169, 1462947, 1518638, 1574633, 1630025, 1683872, 1734859, 1780988, 1819910, 1849548, 1868299, 1874827, 1867955, 1847037, 1812614, 1766771, 1712691, 1653516, 1591513, 1528304, 1465656, 1405599, 1349652, 1298246, 1251134, 1208249, 1169910, 1136275, 1106794, 1080315, 1055744, 1032743, 1011810, 993579, 977911, 963741]
50098I63741j3864j4029j3900j3257j2186j0630q486n981l638j737j5J861L650
50085H71529M634M502L901L731M003L847K787J529J104J512J754J118p8j123j812
50070I02938k437l162l751l923l688l349l241l497m010m560m935m980m699m374
50056H48332m388m681m572l507j879o69k35P2R29K263L721N347P246Q977R972
50041H66928J0413J1008J1919J2550J2467J1939J1377J0847J0387J0276J0638
50030I90749J1247J2049J3407J5366J7228J8430J9440K1045K3057K4577K5478
50019A192073K6628K8394K9787K9623K7937K5693K3514K1346J9148J7237J5756
50008A457136J4162J1488O987N96p134j5517k4064l2388l9811m5372m8379m8732
$$ y = [963741, 949877, 935848, 921948, 908691, 896505, 885875, 877389, 871408, 867770, 866033, 866018, 867879, 871529, 876163, 880665, 884566, 888297, 892300, 896147, 898934, 900463, 901567, 903079, 904833, 905951, 905873, 904750, 902938, 900501, 897339, 893588, 889665, 885977, 882628, 879387, 875890, 871880, 867320, 862385, 857405, 852706, 848332, 843944, 839263, 834691, 831184, 829305, 828636, 828401, 828473, 829402, 831665, 835386, 840733, 847979, 856956, 866928, 877341, 888349, 900268, 912818, 925285, 937224, 948601, 959448, 969835, 980111, 990749, 1001996, 1014045, 1027452, 1042818, 1060046, 1078476, 1097916, 1118961, 1142018, 1166595, 1192073, 1218701, 1247095, 1276882, 1306505, 1334442, 1360135, 1383649, 1404995, 1424143, 1441380, 1457136, 1471298, 1482786, 1489773, 1490369, 1483235, 1467718, 1443654, 1411266, 1371455, 1326083, 1277704, 1228972]
49996A228972m6777m3101l8583l4245l0671k7756k5129k2654k0329j8071j5995
49985I05661j4632j4446j5234j6355j7425j8412j9100j9026j8037j6577j5291
49974G21126j4488j3971j3224j1804r814p941o752o030n189m236l835m243m721
49961F14878m345l141j981j521j515j255l52R93K331L437M402N369O332P174P794
49946F38600Q097P964P392O570N757N105M607M120L335J992K71j342k693m233
49932F85542o303q493j0109j1091j1864j2458j2361j1340r829q289o698m936l258
49919E68513k039j241n17L13J090J615J895K099K304K360K133J851K041K939M157
49904E89513N237O212P361Q620R667J0353J0648J0285R093P484O055M776L210
$$ y = [1228972, 1182195, 1139094, 1100511, 1066266, 1035595, 1007839, 982710, 960056, 939727, 921656, 905661, 891029, 876583, 861349, 844994, 827569, 809157, 790057, 771031, 752994, 736417, 721126, 706638, 692667, 679443, 667639, 657825, 649884, 643132, 637102, 631913, 627677, 623842, 619599, 614878, 610533, 607392, 605411, 603890, 602375, 601120, 600768, 601761, 604092, 607529, 611931, 617300, 623632, 630806, 638600, 646697, 654661, 662053, 668623, 674380, 679485, 684092, 688212, 691547, 693539, 693810, 692468, 689775, 685542, 679239, 670746, 660637, 649546, 637682, 625224, 612863, 601523, 591694, 583405, 576707, 571771, 568513, 566474, 565233, 564716, 565029, 566119, 567734, 569629, 571728, 574032, 576392, 578525, 580376, 582417, 585356, 589513, 594750, 600962, 608323, 616943, 626610, 636963, 647611, 657896, 666989, 674473, 680528, 685304, 688514]
49891F88514J465J49o34j489k781m234n635p098q368q817q507q368q846r235q987
49876F07129q692q960r138q290o726n483m676l621k261j285q14j60R72K075K886
49861E52956L878N392P025Q242R014R539R927J0380J1076J1655J1408J0292R125
$$ y = [688514, 689979, 690128, 689494, 688005, 685224, 680990, 675355, 668257, 659889, 651072, 642565, 634197, 625351, 616116, 607129, 598437, 589477, 580339, 572049, 565323, 559840, 555164, 551543, 549282, 547997, 547183, 547023, 547995, 550070, 552956, 556834, 562226, 569251, 577493, 586507, 596046, 605973, 616353, 627429, 639084, 650492, 660784, 669909]
$$ [...]
##END NTUPLES=NMR SPECTRUM
##END=
