##TITLE=AC1610_PANGH13340_8317028_0kdhY4ZLGg
##JCAMPDX= 6.0         $$ Bruker NMR JCAMP-DX V2.0
##DATA TYPE= NMR SPECTRUM
##DATA CLASS= NTUPLES
##ORIGIN= BRUKER
##OWNER= Administrator
$$ 1.72 TOPSPIN		Version 2.1
$$ 2013-11-10 01:23:21.208 -0800  Administrator@X
$$ Compression mode = diff/dup
##.OBSERVE FREQUENCY= 400.02188249412
##.OBSERVE NUCLEUS= ^1H
##.ACQUISITION MODE= SIMULTANEOUS (DQD)
##.ACQUISITION SCHEME= undefined
##.AVERAGES= 8
##.DIGITISER RES= 22
##SPECTROMETER/DATA SYSTEM= spect
##.PULSE SEQUENCE= zg30
##.SOLVENT NAME= COFFEE_meoh
##.SHIFT REFERENCE= INTERNAL, COFFEE_meoh, 1, 14.98509
##AUDIT TRAIL= $$ (NUMBER, WHEN, WHO, WHERE, PROCESS, VERSION, WHAT)
$$ ##TITLE= Audit trail, TOPSPIN		Version 2.1
$$ ##JCAMPDX= 5.01
$$ ##ORIGIN= Bruker BioSpin GmbH
$$ ##OWNER= Administrator
$$ $$ E:\/data/COFFEE/nmr/AC1610_PANGH13340_8317028_0kdhY4ZLGg/10/pdata/1/auditp.txt
$$ ##AUDIT TRAIL=  $$ (NUMBER, WHEN, WHO, WHERE, PROCESS, VERSION, WHAT)
(   1,<2013-11-10 01:23:14.427 -0800>,<Administrator>,<X>,<go>,<TOPSPIN 2.1>,
      <created by zg
	started at 2013-11-10 01:22:08.302 -0800,
	POWCHK enabled, PULCHK disabled,
       configuration hash MD5:
       C8 4E 4E 5D D3 5C D8 9E 9F 52 82 E0 59 8A DE 15
       data hash MD5: 64K
       FB D0 9C 06 4B D8 4E 19 9B 5D 5A 12 82 64 18 DF>)
(   2,<2013-11-10 01:23:17.411 -0800>,<Administrator>,<X>,<proc1d>,<TOPSPIN 2.1>,
      <Start of raw data processing
       efp LB = 0 FT_mod = 6 PKNL = 1 PHC0 = 0 PHC1 = 0 SI = 32K 
       data hash MD5: 32K
       43 F9 00 2B A8 AB 1E 6B 22 87 47 9A 03 4B BE 1B>)
(   3,<2013-11-10 01:23:17.739 -0800>,<Administrator>,<X>,<proc1d>,<TOPSPIN 2.1>,
      <pk PHC0 = 90.0769 PHC1 = 0 
       data hash MD5: 32K
       23 72 2D 51 62 B6 03 7C 2A 58 DA 49 72 EA DA 34>)
(   4,<2013-11-10 01:23:17.864 -0800>,<Administrator>,<X>,<proc1d>,<TOPSPIN 2.1>,
      <abs ABSG = 1 
       data hash MD5: 32K
       DD 0B 87 7A C9 EF 61 CC C1 C2 3F 5A 80 9B 5F 3E>)
(   5,<2013-11-10 01:23:17.927 -0800>,<Administrator>,<X>,<proc1d>,<TOPSPIN 2.1>,
      <abs ABSG = 2 
       data hash MD5: 32K
       12 B9 01 2C CE 13 3E 00 03 18 56 DC A8 D3 83 62>)
(   6,<2013-11-10 01:23:18.021 -0800>,<Administrator>,<X>,<proc1d>,<TOPSPIN 2.1>,
      <abs ABSG = 3 
       data hash MD5: 32K
       3B F4 FB 42 1F 3D 97 AD D2 C5 54 F4 60 7F A6 A6>)
(   7,<2013-11-10 01:23:18.083 -0800>,<Administrator>,<X>,<proc1d>,<TOPSPIN 2.1>,
      <abs ABSG = 4 
       data hash MD5: 32K
       78 DB CF 4E 76 DB 76 EF 68 D9 2C D4 DB 0F C5 23>)
(   8,<2013-11-10 01:23:18.146 -0800>,<Administrator>,<X>,<proc1d>,<TOPSPIN 2.1>,
      <abs ABSG = 5 
       data hash MD5: 32K
       DC EF E8 47 8C 6D 1E 7C 79 CE 91 27 E7 36 A6 96>)
$$ ##END=
$$ 
$$ $$ hash MD5
$$ $$ 4C 7B DF 8D CA 71 00 FB 38 0D A4 41 77 98 C5 24
##$RELAX= 
##$RELAX= 
##$RELAX= 
##$RELAX= 
##$RELAX= 
##$RELAX= 
##$RELAX= 
$$ Bruker specific parameters
$$ --------------------------
##$DU= <E:\>
##$EXPNO= 10
##$NAME= <AC1610_PANGH13340_8317028_0kdhY4ZLGg>
$$ [...]
##$TP= (0..7)
150 150 150 150 150 150 150 150
##$TP07= 0
##$TPNAME0= <>
##$TPNAME1= <>
##$TPNAME2= <>
##$TPNAME3= <>
##$TPNAME4= <>
##$TPNAME5= <>
##$TPNAME6= <>
##$TPNAME7= <>
##$TPOAL= (0..7)
0.5 0.5 0.5 0.5 0.5 0.5 0.5 0.5
##$TPOFFS= (0..7)
0 0 0 0 0 0 0 0
##$TUNHIN= 0
##$TUNHOUT= 0
##$TUNXOUT= 0
##$USERA1= <user>
##$USERA2= <user>
##$USERA3= <user>
##$USERA4= <user>
##$USERA5= <user>
##$V9= 5
##$VALIST= <valist>
##$VCLIST= <CCCCCCCCCCCCCCC>
##$VD= 0
##$VDLIST= <DDDDDDDDDDDDDDD>
##$VPLIST= <PPPPPPPPPPPPPPP>
##$VTLIST= <TTTTTTTTTTTTTTT>
##$WBST= 1024
##$WBSW= 4
##$XGAIN= (0..3)
0 0 0 0
##$XL= 0
##$YL= 0
##$YMAX_a= 637749
##$YMIN_a= -551918
##$ZGOPTNS= <>
##$ZL1= 120
##$ZL2= 120
##$ZL3= 120
##$ZL4= 120
##$ABSF1= 14.98509
##$ABSF2= -5.573092
##$ABSG= 5
##$ABSL= 3
##$ALPHA= 0
##$AQORDER= 0
##$ASSFAC= 0
##$ASSFACI= 0
##$ASSFACX= 0
##$ASSWID= 0
##$AUNMP= <proc_prof1d_extract_pilot.lims>
##$AXLEFT= 0
##$AXNAME= <>
##$AXNUC= <1H>
##$AXRIGHT= 0
##$AXTYPE= 0
##$AXUNIT= <>
##$AZFE= 0.1
##$AZFW= 0.1
##$BCFW= 0
##$BC_mod= 0
##$BYTORDP= 0
##$COROFFS= 0
##$CY= 15
##$DATMOD= 1
##$DC= 0
##$DFILT= <>
##$DTYPP= 0
##$F1P= 0
##$F2P= 0
##$FCOR= 0.5
##$FTSIZE= 32768
##$FT_mod= 6
##$GAMMA= 0
##$GB= 0
##$INTBC= 1
##$INTSCL= 1
##$ISEN= 128
##$LB= 0
##$LEV0= 0
##$LPBIN= 0
##$MAXI= 10000
##$MC2= 0
##$MEAN= 0
##$ME_mod= 0
##$MI= 0
##$NCOEF= 0
##$NC_proc= -8
##$NLEV= 6
##$NOISF1= 0
##$NOISF2= 0
##$NSP= 0
##$NTH_PI= 0
##$NZP= 0
##$OFFSET= 14.98509
##$PC= 1
##$PHC0= 90.0769
##$PHC1= 0
##$PH_mod= 1
##$PKNL= yes
##$PPARMOD= 0
##$PPDIAG= 0
##$PPIPTYP= 0
##$PPMPNUM= 2147483647
##$PPRESOL= 1
##$PSCAL= 4
##$PSIGN= 0
##$PYNMP= <proc.py>
##$REVERSE= no
##$SF= 400.02
##$SI= 32768
##$SIGF1= 0
##$SIGF2= 0
##$SINO= 400
##$SIOLD= 32768
##$SPECTYP= <>
##$SREGLST= <1H.CDCl3>
##$SSB= 0
##$STSI= 32768
##$STSR= 0
##$SW_p= 8223.68421052631
##$SYMM= 0
##$S_DEV= 0
##$TDeff= 65536
##$TDoff= 0
##$TI= <>
##$TILT= no
##$TM1= 0
##$TM2= 0
##$TOPLEV= 0
##$USERP1= <user>
##$USERP2= <user>
##$USERP3= <user>
##$USERP4= <user>
##$USERP5= <user>
##$WDW= 1
##$XDIM= 32768
##$YMAX_p= 471241639
##$YMIN_p= -787391
##$CURPLOT= <Network HP LaserJet P1505>
##$CURPRIN= <$Network HP LaserJet P1505>
##$DFORMAT= <normdp>
##$LAYOUT= <+/1D_H.xwp>
##$LFORMAT= <normlp>
##$PFORMAT= <normpl>
##$SURQMSG= 1
$$ End of Bruker specific parameters
$$ ---------------------------------
##NTUPLES= NMR SPECTRUM
##VAR_NAME=  FREQUENCY,     SPECTRUM/REAL,   SPECTRUM/IMAG
##SYMBOL=    X,             R,               I
##VAR_TYPE=  INDEPENDENT,   DEPENDENT,       DEPENDENT
##VAR_FORM=  AFFN,          ASDF,            ASDF
##VAR_DIM=   32768,         32768,           32768
##UNITS=     HZ,            ARBITRARY UNITS, ARBITRARY UNITS
##FACTOR=    0.250966925370066, 1,           1
##FIRST=     8223.43324360094, 17983,        -12072
##LAST=      0,             222430,          -87869
##MIN=       0,             -787391,         0
##MAX=       8223.43324360094, 471241639,    0
$$ Real data points
##PAGE= N=1
##DATA TABLE= (X++(R..R)), XYDATA
$$ [...]
19563a96186b9461F9901b55346b9623j12726E0172a18876I8718j3060N4527b212
$$ -196186 -29461 69901 -255346 -29623 -142349 50172 -118876 98718 85658 140185 -2212
19551a43965B91576c69814Q3178A14126b92195j80678G9762c51489A93394H8719
$$ -143965 291576 -369814 -286636 114126 -292195 -472873 79762 -351489 193394 88719
19540B19804f4505B63894a4208r3626A49150a12745C66687i2646c9563k36812
$$ 219804 -64505 263894 -14208 -107834 149150 -112745 366687 -92646 -39563 -276375
19530b76375C38112f0850l24410A5321J10648J06416b06463c8991q6614H7717
$$ -276375 338112 -60850 -385260 15321 125969 232385 -206463 -38991 -125605 87717
19519A04713e4946B95451G6002Q3136a51535a8202k94297J40844J0027f1715j17757
$$ 104713 -54946 295451 76002 159138 -151535 -18202 -312499 -171655 -161628 -61715 -179472
19508a79472B7508b55014J1565H7605e9744j75429g7656A57410a24416L3868o3514
$$ -179472 27508 -255014 -243449 87605 -59744 -235173 -77656 157410 -124416 -90548 -154062
19497a54062B24458A3305d27096G5601a2113k15824h7668k24292A00699a11729
$$ -154062 224458 13305 -427096 75601 -12113 -227937 -87668 -311960 100699 -111729
19486A3669i3690o4966C9042J18590f5516L1520L150j31006E8784b41103d358
$$ 13669 -93690 -158656 39042 157632 -65516 -33996 -30846 -161852 58784 -241103 -4358
19474a1562l41010J71896I5208A176g5018A15377K14727A54378f717j06482r3497
$$ -11562 -352572 -180676 95208 1176 -75018 115377 330104 154378 -6717 -113199 -206696
19463b06696I2438N682a25872A85321a83876E430J48573c94604a39511f5241B44321
$$ -206696 92438 98120 -125872 185321 -183876 5430 154003 -394604 -139511 -65241 244321
19451a19014j20202M0895Q4355A73480G1163a57321a0024j14469N7527K0937r2319
$$ -119014 -239216 -198321 -113966 173480 71163 -157321 -10024 -124493 -66966 -46029 -138348
19440a38348L5420J2555B18789a84961i0724m9045a6831l04383a5563r1045B432
$$ -138348 -102928 -90373 218789 -184961 -90724 -139769 -16831 -321214 -15563 -106608 2432
19428i7427j21982Q6901B36683b11952c4923l4374F3288a89761O3505N5316m1907
$$ -97427 -219409 -132508 236683 -211952 -34923 -69297 63288 -189761 -126256 -70940 -112847
19417a12847l0089b9311j52651b1397n7480a1840D12397c66442H1512M3113d7110
$$ -112847 -142936 -29311 -181962 -21397 -78877 -11840 412397 -366442 81512 124625 -47110
19405B62947c545A80302p4539b31169g8077j75564k66117a32716B98245g3292
$$ 262947 -3545 180302 105763 -231169 -78077 -253641 -519758 -132716 298245 -73292
19394b14928A08170g4395q4942Q958j42447C5358P3023a79756e2119A79871p4457
$$ -214928 108170 -74395 -159337 -150379 -292826 35358 108381 -179756 -52119 179871 105414
19383A05414k2524R493J40131b10706l8497G6312a19211o5549B16373a60245O788
$$ 105414 82890 92383 232514 -210706 -249203 76312 -119211 -184760 216373 -160245 -153457
19372a53457r9634a22996r085C4069K1635a7373A37186e3589K0507q0044p387
$$ -153457 -253091 -122996 -132081 34069 55704 -17373 137186 -53589 -33082 -113126 -120513
19361a20513e8018k6938j57713q9265B11145b50783g8275a1900B78885c4894j09811
$$ -120513 -58018 -84956 -242669 -331934 211145 -250783 -78275 -11900 278885 -34894 -144705
19350a44705B12902f3913k4239j03362J0584G6575k5329J36823l3386d25108A1762
$$ -144705 212902 -63913 -88152 -191514 -180930 76575 51246 188069 154683 -425108 11762
19338c73241F5238K74404b57222C1291e5079b081n1276n1208B7435c3758C61322
$$ -373241 65238 339642 -257222 31291 -55079 -2081 -53357 -104565 27435 -33758 361322
19326e3266k46841a06539n4421K3129r8191E7517K04945C7421P2039a31619N9637
$$ -53266 -300107 -106539 -160960 -137831 -236022 57517 262462 37421 109460 -131619 -71982
19315g1982C24754a75281A6298a229k71835B51681E9727b7188a2933k03886f146
$$ -71982 324754 -175281 16298 -1229 -273064 251681 59727 -27188 -12933 -216819 -6146
19303d2608l15000C67519a73847q1543O7908f3314n4754n363b8690j88351A36691
$$ -42608 -357608 367519 -173847 -255390 -187482 -63314 -118068 -123431 -28690 -217041 136691
19291b02804h3037G1013O8421a76001B74786H1217B3463b52712m748A08618M8630
$$ -202804 -83037 71013 139434 -176001 274786 81217 23463 -252712 -257460 108618 157248
19280A57248c91989c9457J5689r0991m2710l6507i628q1091B0046N7009a69994
$$ 157248 -391989 -39457 -23768 -114759 -157469 -193976 -9628 -90719 20046 77055 -169994
19268b5775k42525d5889A63711a38641k47052A48273i9472k14847A00649m8816
$$ -25775 -268300 -45889 163711 -138641 -385693 148273 -99472 -314319 100649 51833
19258E1833b09584D3623b48580A8197a13529c510A05544B3319b93327J23744p2651
$$ 51833 -209584 43623 -248580 18197 -113529 -3510 105544 23319 -293327 -169583 -242234
19247b42234A2085a65932m8279O0037j51197C5830a31387j5457D3073b79815J31433
$$ -242234 12085 -165932 -214211 -154174 -305371 35830 -131387 -146844 43073 -279815 -148382
19236a48382b1006j16694G4471c1027B86239b58906P0578J3589g6008b3782j08001
$$ -148382 -21006 -137700 74471 -31027 286239 -258906 -188328 -174739 -76008 -23782 -131783
19225a31783A93269F2473d5483E7894b17211B38728c49765c8198j76822f9416
$$ -131783 193269 62473 -45483 57894 -217211 238728 -349765 -38198 -215020 -69416
19214G6308l4296h6869F9104h7704k25227J44266A2307J03603a98558l6340b1007
$$ 76308 42012 -86869 69104 -87704 -312931 -168665 12307 115910 -198558 -234898 -21007
19202A96712j8155q4060K38938a4744o8619j32718J06503H6968b5k84822A53313
$$ 196712 178557 94497 333435 -14744 -83363 -216081 -109578 86968 -25 -284847 153313
19190A08673d4819C9053e5917B41632I7755a17777e0366C40409a0052j85461k65023
$$ 108673 -44819 39053 -55917 241632 97755 -117777 -50366 340409 -10052 -195513 -460536
19179d60536i4558A84302a93916A71224c62232R2973A22271M4993a57764G5890
$$ -460536 -94558 184302 -193916 171224 -362232 -269259 122271 167264 -157764 75890
19168a88616j64979a02727C20562b60976A18650b52699A96078I0467a83696r492
$$ -188616 -353595 -102727 320562 -260976 118650 -252699 196078 90467 -183696 -193188
19158a93188A25997a81315J0275M0252m9752d0452A38521a13356j74647i1393
$$ -193188 125997 -181315 -171040 -130788 -180540 -40452 138521 -113356 -288003 -91393
19147b08366n9029A17183c85900A51143B0878L48712b80841B79488H6716R5715
$$ -208366 -267395 117183 -385900 151143 20878 369590 -280841 279488 86716 182431
19137A82431c24539I3027c7629k27394A96071b35546m5993a2068j64434B39149
$$ 182431 -324539 93027 -37629 -265023 196071 -235546 -281539 -12068 -176502 239149
19126c6393l07756L1035i135k0393F9570b74425A17144d6291k43186G3734f1625
$$ -36393 -344149 -313114 -9135 -29528 69570 -274425 117144 -46291 -289477 73734 -61625
19114d07395A21173a25669A3791a84617K5470a4194C4437b51146B85890A17835
$$ -407395 121173 -125669 13791 -184617 -159147 -14194 34437 -251146 285890 117835
19103A95430e02933C1639K73869A50528b7277I4833e8267r878j48477m5863H0146
$$ 195430 -502933 31639 305508 150528 -27277 94833 -58267 -68145 -216622 -262485 80146
19091B60231m5238f5592L1330A21228a0667j45677A12772R4039c28656F1631e8705
$$ 260231 214993 -65592 -34262 121228 -10667 -156344 112772 206811 -328656 61631 -58705
19079B24409a01879A04913K6177a97218O8839f0751j54960C92920b90551A10818
$$ 224409 -101879 104913 131090 -197218 -128379 -60751 -215711 392920 -290551 110818
19068A21645i6082j19329g7698c8531A08376b92482a31749p0350j20972H9884
$$ 121645 -96082 -215411 -77698 -38531 108376 -292482 -131749 -202099 -323071 89884
19057I3290b75184J29512d2095l34451J81392b286B49397b6320j75074r292K5143
$$ 93290 -275184 -145672 -42095 -376546 -195154 -2286 249397 -26320 -201394 -210686 -185543
19046a85543a0164B30872r2000D3715f4480B7933q309e064l0511A07676a68200
$$ -185543 -10164 230872 138872 43715 -64480 27933 19624 -5064 -35575 107676 -168200
19034a85120A10832c87051a32760j42210g2345q3920C3714N7345K24006F3647
$$ -185120 110832 -387051 -132760 -274970 -72345 -156265 33714 91059 315065 63647
19023C07625D6906J99208j08832M05215A22364K68276E7809d7384A57602i7110
$$ 307625 46906 246114 137282 542497 122364 390640 57809 -47384 157602 -97110
19012e0202k14971A01130b46511B285a34136r0799h4642c3973A7244a09548A04072
$$ -50202 -265173 101130 -246511 2285 -134136 -224935 -84642 -33973 17244 -109548 104072
19000b52357A01645a91521B4569b38051P5630k69874a14812j90355e5065B4956
$$ -252357 101645 -191521 24569 -238051 -162421 -432295 -114812 -305167 -55065 24956
18989a60782C4713B883a69037e0059r486B3959c23085A5892J37662e1458K3933
$$ -160782 34713 2883 -169037 -50059 -59545 23959 -323085 15892 153554 -51458 -27525
18978b7525j45879j46934M5277N8110B71471a46636b9674A15693l396a61482B00
$$ -27525 -173404 -320338 -275061 -216951 271471 -146636 -29674 115693 112297 -161482 200
18966c8771a862j63633K3338J0034j074k11615L7470a49116n0232R3319D9445
$$ -38771 -1862 -165495 -142157 -132123 -133197 -344812 -307342 -149116 -199348 -106029 49445
18954A49143m6371a29507A2251a3522m1167G0582a61531n7647B30100H4716c02085
$$ 149143 102772 -129507 12251 -13522 -54689 70582 -161531 -219178 230100 84716 -302085
18942f7052A34572o324e7464k07590h0737j43161Q3073l07884c1044r9856O1920
$$ -67052 134572 128248 -57464 -265054 -80737 -223898 -140825 -448709 -31044 -130900 -68980
18931f8980k45259C6416J08917h0560p7232B15332I1624N0987j6951b4256A45426
$$ -68980 -314239 36416 145333 -80560 -157792 215332 91624 142611 125660 -24256 145426
18919A56843f5243j08761L5580A67374C2676R9797a81772P1699A79201b59405
$$ 156843 -65243 -174004 -138424 167374 32676 132473 -181772 -110073 179201 -259405
18908e5738b7033l08069E0437P7577d0046j51405A28171k4812D4599N4520a28076
$$ -55738 -27033 -335102 50437 128014 -40046 -191451 128171 103359 44599 99119 -128076
18896a20381A54766e9232j32126A02549Q05b67506A07294A4253O1257a5764D3884
$$ -120381 154766 -59232 -191358 102549 103354 -267506 107294 14253 75510 -15764 43884
18884g5692r294C9180J820a20682K7554r4898E9789a60548H1661e4031B76588
$$ -75692 -84986 39180 41000 -120682 -93128 -188026 59789 -160548 81661 -54031 276588
18872c1830n9813A05276d90184B96008i7839j06295B3673R0962a60359n576N5411
$$ -31830 -91643 105276 -490184 296008 -97839 -204134 23673 114635 -160359 -165935 -110524
18861a10524h52j01113K9753l20577f0575j74974B31114a04269B92762b04189
$$ -110524 -852 -101965 -72212 -392789 -60575 -235549 231114 -104269 292762 -204189
18850a15340B57942F4004i3506B39817J50660a63281j11778D03951a60114e8769
$$ -115340 257942 64004 -93506 239817 390477 -163281 -275059 403951 -160114 -58769
18839A05126K82342H0027B5533J5805a97531D4379J94026g9798N089j39925j92500
$$ 105126 387468 80027 25533 41338 -197531 44379 238405 -79798 -74709 -214634 -407134
18828d07134C01683A48829g0577i474j64473o0932K5437L4927A5106K08988N8589
$$ -407134 301683 148829 -70577 -9474 -173947 -234879 -209442 -174515 15106 224094 282683
18817B82683h3428A12036B3986i5770B31955N194F3673M1320d5761A7056L24805
$$ 282683 -83428 112036 23986 -95770 231955 237149 63673 104993 -45761 17056 341861
18806C41861b0695O201A03310L10076I4130a49489A9454E139b18961A72440a12479
$$ 341861 -20695 -14494 103310 413386 94130 -149489 19454 5139 -218961 172440 -112479
18794b07057H5834g3038B014a00383C8512J74681d9765P872A17823J4817a39156
$$ -207057 85834 -73038 2014 -100383 38512 213193 -49765 -41893 117823 132640 -139156
18782a17624B83385H8227a31045A42915b03287C9716M4262P6169a3371o8247j23140
$$ -117624 283385 88227 -131045 142915 -203287 39716 83978 160147 -13371 -81618 -204758
18771b04758j46522J71936H5264a23945k47241a35563r7412k70588e5441C1810
$$ -204758 -351280 -179344 85264 -123945 -371186 -135563 -232975 -503563 -55441 31810
18760E920a32293G986N2055H809J00737a79981Q8264l53761B49610a13286N288
$$ 5920 -132293 7986 60041 8809 109546 -179981 -91717 -445478 249610 -113286 -107998
18749a07998B30055E2342a66745d9918A63094b38817j03280h399k39658B00419
$$ -107998 230055 52342 -166745 -49918 163094 -238817 -342097 -8399 -248057 200419
18738A98083a68340O2049D7065r160a48440P4170c1587l63019C47918c6794B7675
$$ 198083 -168340 -106291 47065 37905 -148440 -74270 -31587 -394606 347918 -36794 27675
18726B43812R2892b64762G851a80200O9410q3379K6840j83766B10807n3250F8379
$$ 243812 336704 -264762 7851 -180200 -110790 -194169 -167329 -351095 210807 157557 68379
18714C862a85180b1391n21150i8827B2859J05236c27599B07705c34197h2227m4875
$$ 3862 -185180 -21391 -542541 -98827 22859 128095 -327599 207705 -334197 -82227 -127102
18703a27102A96334b9203o7122B74829G3038i8284A77357E617a87516k21111C38952
$$ -127102 196334 -29203 -96325 274829 73038 -98284 177357 5617 -187516 -408627 338952
18691A58762N5678b73997a17257e987A71923o9665a78332H254K0341i9364A8845
$$ 158762 214440 -273997 -117257 -5987 171923 102258 -178332 8254 28595 -99364 18845
18679a06772B81631d24711a56069P5517B6501c39703a02335c5837r5086A15344
$$ -106772 281631 -424711 -156069 -80552 26501 -339703 -102335 -35837 -130923 115344
18668A14868f9960B14234C7925f0276D5074i1790K745F8923a63361k27960A1700
$$ 114868 -69960 214234 37925 -60276 45074 -91790 -89045 68923 -163361 -391321 11700
18656A58232a0957k44651h146B3448b9459l03805B0556g0657b6842l08142B4133
$$ 158232 -10957 -255608 -8146 23448 -29459 -333264 20556 -70657 -26842 -334984 24133
18644f5175B3965a93747M6258l8597H0002c07887a23686k5255j92628A23296E5879
$$ -65175 23965 -193747 -147489 -186086 80002 -307887 -123686 -148941 -341569 123296 55879
18632a51872c841F3310B5851b83678D1633F600c95343D37562a04586k00237B24158
$$ -151872 -3841 63310 25851 -283678 41633 6600 -395343 437562 -104586 -304823 224158
18620b79066h0862m08199i4659b2083j30583A14874a43029B13718h540j93798
$$ -279066 -80862 -489061 -94659 -22083 -152666 114874 -143029 213718 -8540 -202338
18610b02338h9417I606K5706a38827A14729d3643l08171i1386F3268j0251O133
$$ -202338 -89417 9606 35312 -138827 114729 -43643 -351814 -91386 63268 53017 59150
18599E9150a5155j97950B4456d8409A76245E539g5313r6096a589r5332A00561
$$ 59150 -15155 -213105 24456 -48409 176245 5539 -75313 -171409 -1589 -96921 100561
18587F2663a9507A79510d2116p8829a4994A30229E8965a6894j86875e7463m3875
$$ 62663 -19507 179510 -42116 -120945 -14994 130229 58965 -16894 -203769 -57463 -101338
18576a01338A28518b82861a39538A95018f2869D6215b5872j00382n4607D3489
$$ -101338 128518 -282861 -139538 195018 -62869 46215 -25872 -126254 -180861 43489
18565A36681n9126c32145h4925l8690l6982C17436a60136j4095j7233M5112e4410
$$ 136681 77555 -332145 -84925 -123615 -160597 317436 -160136 -174231 -191464 -146352 -54410
18553A09274a42540e284m26507B36146B3948a32652A16122d8027A11006a90499
$$ 109274 -142540 -5284 -431791 236146 23948 -132652 116122 -48027 111006 -190499
18542A14729f5173G7607l2001P279J4059L3964h2541b7351A38913f427j4655q3514
$$ 114729 -65173 77607 45606 52885 66944 100908 -82541 -27351 138913 -6427 -21082 -104596
18530a04596b1570L763I5706a00988q8603A48065J28981c19806B09951c10228
$$ -104596 -21570 -17807 95706 -100988 -189591 148065 277046 -319806 209951 -310228
18519f7889c2728A2045b43146g805j70454o110c9931m184A85503C8517h2881j96282
$$ -67889 -32728 12045 -243146 -7805 -178259 -184369 -39931 -44115 185503 38517 -82881 -279163
18507b79163J01830j13090I8977d4815j3439k30471a19353l6731N649E3405d28784
$$ -279163 -177333 -290423 98977 -44815 -58254 -288725 -119353 -156084 -150435 53405 -428784
18495B32674k7541b45259C13243g5985B07926d9002J2371k20192j00277J16535
$$ 232674 205133 -245259 313243 -75985 207926 -49002 -36631 -256823 -357100 -240565
18485b40565F9945h8203B57989F3363O6482P062E8671g5542p4466j2864J6196
$$ -240565 69945 -88203 257989 63363 129845 136907 58671 -75542 -150008 -162872 -146676
18474a46676A00699N5012C6158a70189A8986K0567a33648F730a87318A2220g2171
$$ -146676 100699 155711 36158 -170189 18986 39553 -133648 6730 -187318 12220 -72171
18462D568M0437J77706b08175A84388a11659m2617B6105e0915k34273A64297m2158
$$ 4568 45005 222711 -208175 184388 -111659 -154276 26105 -50915 -285188 164297 122139
18451A22139K1607l1735D2532c6047j60363f4486J3710A56851d9802b2128j92375
$$ 122139 143746 112011 42532 -36047 -196410 -64486 -50776 156851 -49802 -22128 -214503
18440b14503B77206h4116r9898C2698a02959M3675B1609J38829a17495j0526D0310
$$ -214503 277206 -84116 -184014 32698 -102959 -59284 21609 160438 -117495 -128021 40310
18428b40104b9532o9040c534j3907E1306a27885Q93D93910A01969a02707A23980
$$ -240104 -29532 -98572 -3534 -17441 51306 -127885 -126992 493910 101969 -102707 123980
18416i7216M3531r1689b6044j22969A96595b89644d5556j00227D349b1715l0317
$$ -97216 -53685 -145374 -26044 -149013 196595 -289644 -45556 -145783 4349 -21715 -52032
18405e2032L531B34387n8532F6403f0934k50828n5960I4584h4762b0690A58833
$$ -52032 -48501 234387 175855 66403 -60934 -311762 -367722 94584 -84762 -20690 158833
18393B45570b12471j91188D14395a74564B74742b78981A32069c00202A90205G5292
$$ 245570 -212471 -403659 414395 -174564 274742 -278981 132069 -300202 190205 75292
18382i9809C8709f605F3005c15069B46877i6572j11198D102h3218A68374b84785
$$ -99809 38709 -6605 63005 -315069 246877 -96572 -207770 4102 -83218 168374 -284785
18370A27934c2654n6712L5412j22822A02616j2277b8677o2114j05632G6346a50588
$$ 127934 -32654 -89366 -53954 -176776 102616 90339 -28677 -90791 -196423 76346 -150588
18358H2784O0895o6126C738N9271a79537Q4964j19457O5976k64469f5990j6268
$$ 82784 143679 77553 3738 63009 -179537 -94573 -214030 -148054 -412523 -65990 -82258
18347h2258A02298d33750J47064B0377L36218a5014B42497K2861g6245j87905
$$ -82258 102298 -433750 -286686 20377 356595 -15014 242497 265358 -76245 -264150
18337b64150K510H3616a04144b6306A58106k62a96046n7095g6199I9576J18219
$$ -264150 -261640 83616 -104144 -26306 158106 157844 -196046 -253141 -76199 99576 217795
18326B17795A04384D2441g7001C903b19597A31959b00712F2210c27840H0967g5039
$$ 217795 104384 42441 -77001 3903 -219597 131959 -200712 62210 -327840 80967 -75039
18314a54118A6567a36087l26123C82121a06151k0846F7050b01395Q9189j39583
$$ -154118 16567 -136087 -462210 382121 -106151 -126997 67050 -201395 -112206 -251789
18304b51789B03335d886a385G7050c26151j3282A14373a5138C2699b34650B014
$$ -251789 203335 -4886 -1385 77050 -326151 -339433 114373 -15138 32699 -234650 2014
18292A29070a43369c9207C3506L7610c3637j55098J4504h0425j81175A30909C6076
$$ 129070 -143369 -39207 33506 71116 -33637 -188735 -174231 -80425 -261600 130909 36076
18280f5478m3686A76214a12015j4975n7121o3297O9153B15068c845C50463b7978
$$ -65478 -109164 176214 -112015 -126990 -184111 -247408 -178255 215068 -3845 350463 -27978
18268B93239f2020B62316b07579C0708J08495a71993g2567J3931o8426B83764
$$ 293239 -62020 262316 -207579 30708 139203 -171993 -72567 -58636 -127062 283764
18257D03963B3022b5524o2279l9110H8890C8146a19722K2686A25696a13000C19853
$$ 403963 23022 -25524 -87803 -126913 88890 38146 -119722 -97036 125696 -113000 319853
18245c8475B7248a76449k5319E545N4140k683d9878q1664M9408k26560J14055
$$ -38475 27248 -176449 -201768 5545 59685 57002 -49878 -131542 -82134 -308694 -194639
18234a94639E9632a56460D032J46995a50310M1538B9369b15283E6657K043D917
$$ -194639 59632 -156460 4032 151027 -150310 -108772 29369 -215283 56657 58700 4917
18222A92114J14189A9634d32565e5999N705j72179m0410e6787A85666a68720B20942
$$ 192114 306303 19634 -432565 -55999 -50294 -222473 -262883 -56787 185666 -168720 220942
18210a13920j08148A19058c7457j01332M9722D0236a04399H3028a74172J9272
$$ -113920 -222068 119058 -37457 -138789 -89067 40236 -104399 83028 -174172 -154900
18200a54900A08997A415K08870H6998b4701m0926b1923A6750a22589A6574e5495
$$ -154900 108997 1415 210285 86998 -24701 -65627 -21923 16750 -122589 16574 -55495
18188h9846k2125c825j23382A20000b21352B9829b77530J35835c3783A63802d68659
$$ -89846 -111971 -3825 -127207 120000 -221352 29829 -277530 -141695 -33783 163802 -468659
18176G2862a55096N924e9680A09608B2541J55844j8942c15788a38397A16930g7850
$$ 72862 -155096 -149172 -59680 109608 22541 178385 159443 -315788 -138397 116930 -77850
18164b00003d7704j58266A55736E1504a12131l27848d937G3089k6048b68172B9611
$$ -200003 -47704 -205970 155736 51504 -112131 -439979 -4937 73089 47041 -268172 29611
18152f3637j06669g2166F9543b0955C0927i3239o8991D8644B1390j0328J2129
$$ -63637 -170306 -72166 69543 -20955 30927 -93239 -162230 48644 21390 11062 23191
18141B3191q396O2223a57785B1124a22012b7072p1951F593c7583p2896q7434C25907
$$ 23191 14795 77018 -157785 21124 -122012 -27072 -99023 6593 -37583 -110479 -197913 325907
18128D4048J51603h2354A13674g7537J9015k05109A55352e3559G0588b5091r9066
$$ 44048 195651 -82354 113674 -77537 -58522 -263631 155352 -53559 70588 -25091 -124157
18117a24157D4961b55997F4721a495q2950A61706D5531j5729a56123n4711A04491
$$ -124157 44961 -255997 64721 -1495 -84445 161706 45531 29802 -156123 -210834 104491
18105g9118l4323C34133b06105h2174j62580i69j71193C8266b35514d1799J059
$$ -79118 -113441 334133 -206105 -82174 -244754 -969 -172162 38266 -235514 -41799 -40740
18094d0740H399R00N8502R0346g9571p9408j45094A34779d4895g706G5120b40025
$$ -40740 8399 9299 67801 158147 -79571 -158979 -304073 134779 -44895 -7706 75120 -240025
18081f395p4148B53538A08621J46733c8465A03635J80a41037A21835J1481d6462
$$ -6395 -80543 253538 108621 255354 -38465 103635 103815 -141037 121835 133316 -46462
18069d583A3813e8653B55786G0022b27580h25j17611k25841B6989K2629K38220
$$ -4583 13813 -58653 255786 70022 -227580 -825 -118436 -344277 26989 49618 287838
18058B87838a35836J2230k0455j3803A17585a85454L5698B49988c16789B38410
$$ 287838 -135836 -123606 -144061 -157864 117585 -185454 -149756 249988 -316789 238410
18047a05321c127G9739i346C35525c30464C06674M6109A74513L5847C9552g4847
$$ -105321 -3127 79739 -9346 335525 -330464 306674 352783 174513 210360 39552 -74847
18035e1449b281B10195b85606h7319p95j47792B30686j00211c16279P9288G9740
$$ -51449 -2281 210195 -285606 -87319 -88114 -235906 230686 130475 -316279 -236991 79740
18023e6161A33459a06325A8956Q0334j208Q3425G1579J6059h2161f07k27187G4841
$$ -56161 133459 -106325 18956 99290 98082 181507 71579 87638 -82161 -607 -227794 74841
18010d40834R2758P440a26123B7878d7596j55046r5796A45000M0680F6168a43955
$$ -440834 -348076 -340636 -126123 27878 -47596 -202642 -298438 145000 185680 66168 -143955
17998A13226c8041l04111a4114k44042b44A89224p2042N3576l4465i571F8107
$$ 113226 -38041 -342152 -14114 -258156 -244 189224 117182 170758 136293 -9571 68107
17986c13831h6117j60175I3288h8999k40481g6443A50141D0076R3066a3795j50894
$$ -313831 -86117 -246292 93288 -88999 -329480 -76443 150141 40076 133142 -13795 -164689
17975a64689l3092P9144D2632P1798a46128j69758A6465a16783K314k63699C81105
$$ -164689 -197781 -118637 42632 114430 -146128 -315886 16465 -116783 -114469 -378168 381105
17963A30107j0303b64030E72L9517h6951q4051a1869j03346K6129E9635J09171
$$ 130107 119804 -264030 572 40089 -86951 -171002 -11869 -115215 -89086 59635 168806
17952A68806o5372A5109K18796l389a95438A60481A0872J5685b14460B19513b25251
$$ 168806 103434 15109 233905 230516 -195438 160481 10872 26557 -214460 219513 -225251
17940c4313p5049n2401C2074J22395i4295B75108r2607f6422C1475c6049j31140
$$ -34313 -109362 -161763 32074 154469 -94295 275108 182501 -66422 31475 -36049 -167189
17929a67189r8101e7103j2313m909I9226J4364a03321N0234l83499J94184k3999
$$ -167189 -265290 -57103 -69416 -74325 99226 113590 -103321 -53087 -436586 -242402 -266401
17918b66401J25339n5630j25491a00205B9785Q5198a88801e5885j27414q8556
$$ -266401 -141062 -196692 -322183 -100205 29785 114983 -188801 -55885 -183299 -271855
17908b71855A30520a15713F8639c03172d8754B38654C4022O7593b74579A21889
$$ -271855 130520 -115713 68639 -303172 -48754 238654 34022 101615 -274579 121889
17897a68662D8893K5072k594a03835j8107q4023b9592B34099a05468k42679a20513
$$ -168662 48893 73965 71371 -103835 -121942 -205965 -29592 234099 -105468 -348147 -120513
17885a5073q4508C55138A5872K82670i8630j38163B68188A24946D3964a06302
$$ -15073 -99581 355138 15872 298542 -98630 -236793 268188 124946 43964 -106302
17874B42037a74116I7044a02258r0922Q1582j1812B74845h8361B15591a53047
$$ 242037 -174116 97044 -102258 -193180 -111598 -123410 274845 -88361 215591 -153047
17863E4169B5619Q3804g5575F9464J61790C4527J76579J00418b58680c1073F0853
$$ 54169 25619 109423 -75575 69464 231254 34527 211106 311524 -258680 -31073 60853
17851f098A30488c4904G5610A3115b43451A80406a02025A35397j0342K39293I3499
$$ -6098 130488 -34904 75610 13115 -243451 180406 -102025 135397 125055 364348 93499
17839a80348M235O6905k667k82637C0425R0511m2121J03207E9765a53792n8280
$$ -180348 -176113 -109208 -111875 -394512 30425 120936 78815 182022 59765 -153792 -212072
17828b12072R3406N3604D5129J73212E1832J21188F2480K05921K74187B28961
$$ -212072 -118666 -65062 45129 218341 51832 173020 62480 268401 542588 228961
17817a40058A25442n6192K87216i7458E7402i7402L3044C04194i851q2073B90334
$$ -140058 125442 69250 356466 -97458 57402 -97402 -64358 304194 -9851 -91924 290334
17805D05512j23143A3815R2784a74378P6163l32533B76542I5219f9041m5776p0392
$$ 405512 282369 13815 106599 -174378 -98215 -430748 276542 95219 -69041 -114817 -185209
17794a85209A56761K22440b8093k06125G0705e6960j47340R7691E3901A5340J7927
$$ -185209 156761 379201 -28093 -234218 70705 -56960 -204300 -106609 53901 15340 33267
17783C3267d1147G4357L97343a12531o9022A4224a2169m8949q6015A87197a2296
$$ 33267 -41147 74357 471700 -112531 -181553 14224 -12169 -61118 -147133 187197 -12296
17771A3935a37075B23022r0830d25899G3215d7559j32333c1498A88507b26842
$$ 13935 -137075 223022 132192 -425899 73215 -47559 -179892 -31498 188507 -226842
17760a64497F3937a28719B38674h8216j02133F8593a72349p5687h7793k25288
$$ -164497 63937 -128719 238674 -88216 -190349 68593 -172349 -248036 -87793 -313081
17750c13081e1749A59693a00091o5685F3982a06588D9507i5671m7714N8326k70251
$$ -313081 -51749 159693 -100091 -165776 63982 -106588 49507 -95671 -143385 -85059 -355310
17739c55310A74877a61424l1552I3427O5358C7892j933K53339a85424A7957b16660
$$ -355310 174877 -161424 -192976 93427 158785 37892 35959 289298 -185424 17957 -216660
17727A62792a78736I618N2691J80262c4614J5418F1571a62986f5370A15392d09142
$$ 162792 -178736 9618 62309 242571 -34614 -19196 61571 -162986 -65370 115392 -409142
17715D9497B0875a02532J294A84395M3906e0814l2238C8858b3011k04424d8783
$$ 49497 20875 -102532 -101238 184395 228301 -50814 -83052 38858 -23011 -227435 -48783
17703E1672K8289j2833K36060b56642D0286K4894N8509a21407A65898J32109B1867
$$ 51672 79961 67128 303188 -256642 40286 65180 123689 -121407 165898 298007 21867
17691B79303j6648G4121N8045b07838A74251e3931j78424c7140E241d4972B21609
$$ 279303 262655 74121 132166 -207838 174251 -53931 -232355 -37140 5241 -44972 221609
17679C5028K06618a13899p051b4868C6585j5040a4942j13208B49854b35812E455
$$ 35028 241646 -113899 -120950 -24868 36585 21545 -14942 -128150 249854 -235812 5455
17667a34426o0610H9662N8874c3574I6045b62764B94041N5641A45973b22773k5205
$$ -134426 -195036 89662 148536 -33574 96045 -262764 294041 349682 145973 -222773 -247978
17656b47978d3779k90814a34135A04126K7246l0767i3586A21581a31620D20963
$$ -247978 -43779 -334593 -134135 104126 131372 100605 -93586 121581 -131620 420963
17645b71224F2146e2297j11260F1604J38692h5882B23042a82151B73739J12856
$$ -271224 62146 -52297 -163557 61604 200296 -85882 223042 -182151 273739 386595
17635C86595A92917L4199b2509H0702L8598b56554i687j13848A19527J6953a38800
$$ 386595 192917 227116 -22509 80702 119300 -256554 -9687 -123535 119527 136480 -138800
17623b08915A12823L2691D1394a6782k72343g4872B35856h8590B75118m6108c59585
$$ -208915 112823 145514 41394 -16782 -289125 -74872 235856 -88590 275118 229010 -359585
17611f0798k02246L9401J0908G6199a5688A2866J97638g375D54254a78389D03278
$$ -60798 -263044 -223643 -212735 76199 -15688 12866 210504 -7375 454254 -178389 403278
17599B61700c10526B24406o4521b15166G8094M9991b26891Q6579n7218d965B78642
$$ 261700 -310526 224406 159885 -215166 78094 128085 -226891 -140312 -197530 -4965 278642
17587B45592E9183O2570J4049N1349b78002B55437a14972A5772h2627A24730m7314
$$ 245592 59183 121753 135802 187151 -278002 255437 -114972 15772 -82627 124730 77416
17576G7416D655b92470J32117O1099B57340L5178j04230J82150A19083k5210i198
$$ 77416 4655 -292470 -160353 -99254 257340 292518 188288 370438 119083 93873 -9198
17564B10869i7158B24973a02764B87739j26695G0206d8581A64007A4890J18853
$$ 210869 -97158 224973 -102764 287739 161044 70206 -48581 164007 14890 133743
17554A33743M5327a4687B41196a56238B39226K2200O151a2875H9876a36270e8217
$$ 133743 179070 -14687 241196 -156238 239226 261426 267577 -12875 89876 -136270 -58217
17542H0836a3926G4507R9849C7782A381O7303a34025B12705c7925B80750a2410
$$ 80836 -13926 74507 174356 37782 1381 68684 -134025 212705 -37925 280750 -12410
17530f8576k7673B2069K05886h5180D12587B3063J91866r6834b89140B95612F7253
$$ -68576 -96249 22069 227955 -85180 412587 23063 214929 118095 -289140 295612 67253
17518A00291J54771B2185d5707E52833G5426K53991L0060j67622a14464b847A689
$$ 100291 255062 22185 -45707 552833 75426 329417 359477 191855 -114464 -2847 1689
17506A47792c0140A48137D2919a68677A23240M02841a7861C9852a51147B70004
$$ 147792 -30140 148137 42919 -168677 123240 526081 -17861 39852 -151147 270004
17495D5772c4571J5540k3730k358a226F9842K09659b6150A64782J70721I1283
$$ 45772 -34571 -19031 -42761 -45119 -1226 69842 279501 -26150 164782 335503 91283
17483B24713D8400M02567A78804q6086A5289Q7474L8459K79785A20380l371P2153
$$ 224713 48400 450967 178804 92718 15289 102763 141222 421007 120380 117009 189162
17472A89162I675R8692B7694c652A59843j1059k656B1369a9737A86642i1283B86361
$$ 189162 9675 108367 27694 -3652 159843 148784 146128 21369 -19737 186642 -91283 286361
17459a94039A32353K94696j91843J01322A5423L1111Q4614P5756H7532J38665
$$ -194039 132353 427049 235206 336528 15423 46534 131148 206904 87532 226197
17449B26197K75724c0777D89421K5200n2059a57075F5758L01634H170K52047F5717
$$ 226197 501921 -30777 489421 514621 462562 -157075 65758 367392 8170 260217 65717
17437D73428j29311D368K58822j3378E8043L99477E7978J74774n8359R9672p2222
$$ 473428 344117 4368 263190 249812 58043 457520 57978 232752 174393 274065 201843
17426B01843P6869A32355M173J65259a6007j46003D05399o8881A46061n8754g3403
$$ 201843 278712 132355 136528 301787 -16007 -162010 405399 336518 146061 87307 -73403
17414D25343j6778j95803F7267J81780I0465k8614L61732A16032R4117O8853A13200
$$ 425343 408565 212762 67267 249047 90465 61851 423583 116032 210149 279002 113200
17402D31334A58114i5463C38060m266A58275a50041A89177k0649p9634L28726
$$ 431334 158114 -95463 338060 333794 158275 -150041 189177 168528 88894 417620
17392D17620a36322C69899I9583J04925q0900K5893R499K954K31250a05284b0939
$$ 417620 -136322 369899 99583 204508 123608 149501 159000 161954 393204 -105284 -20939
17380A32955k7287D3194J27631J09001p2796A02541d0726F3646L02998I6572J11521
$$ 132955 105668 43194 170825 279826 207030 102541 -40726 63646 366644 96572 208093
17369B08093r1287m7351J32252D1021L90843k06458R4511e3074G0391i8512B57719
$$ 208093 116806 69455 201707 41021 431864 225406 319917 -53074 70391 -98512 257719
17357B06789i7012M4101a7102D7437a06824j6988D5383R7051D0993o068f8931
$$ 206789 -97012 -52911 -17102 47437 -106824 -123812 45383 142434 40993 34925 -68931
17345B74991a32448c8311A52031m9611C4375J8859j4301L5446M7271a18676A95439
$$ 274991 -132448 -38311 152031 102420 34375 53234 38933 74379 121650 -118676 195439
17333A27405B2187h45D31780A15927n2116M16524c7840B78464R5966F4433K01704
$$ 127405 22187 -845 431780 115927 63811 480335 -37840 278464 374430 64433 266137
17322B66137b00798A81126j2581R1006p4835J4204Q8456a2128B84865A12142M6373
$$ 266137 -200798 181126 168545 259551 184716 198920 287376 -12128 284865 112142 158515
17311A58515l4890h9929C56106j60518K39938D6211K15402g9090p2396b0899j52880
$$ 158515 123625 -89929 356106 195588 435526 46211 261613 -79090 -151486 -20899 -173779
17300a73779P4515A95109D8270K20702K45215A53555K34147J98322A40012b65899
$$ -173779 -99264 195109 48270 268972 514187 153555 387702 586024 140012 -265899
17289A32785J2363Q5235J0164J59473a94793P8493I8056O3095K24222A4933b8930
$$ 132785 145148 230383 240547 400020 -194793 -116300 98056 161151 385373 14933 -28930
17277C0188k342k174L77843e027A3933L03400C9833J5636K02969j9368R4753P8788
$$ 30188 27846 25672 403515 -5027 13933 317333 39833 55469 258438 239070 333823 412611
17265D12611I4775J11320k896m9701B2480K76379I1516P3066M5887M4675q8465
$$ 412611 94775 206095 203199 153498 22480 298859 91516 164582 210469 255144 166679
17254A66679f0397B20871j03982O2290o6777A5774N88539B57652C8432K30898
$$ 166679 -60397 220871 116889 179179 112402 15774 604313 257652 38432 269330
17244B69330A05747k1650J84305L9681q0215c4512B53634A26726J34277J58778
$$ 269330 105747 84097 268402 308083 227868 -34512 253634 126726 261003 419781
17234D19781k05279g091A13446K01114j6155g136A53074n7219K22351G3814J36491
$$ 419781 214502 -7091 113446 314560 298405 -7136 153074 95855 318206 73814 210305
17223B10305k9501P7625b3946B55977J38617J53009D6001O8443K01573B9286J41964
$$ 210305 180804 258429 -23946 255977 394594 547603 46001 114444 316017 29286 171250
17212A71250h8613B20529J72723A37678L56300N6115B38303K44248j74865J4458
$$ 171250 -88613 220529 393252 137678 493978 550093 238303 482551 307686 322144
17202C22144K54660a5755m1968C54935j22090m9360P3240J83267H4010L27921
$$ 322144 576804 -15755 -57723 354935 232845 183485 256725 439992 84010 411931
17192D11931A13048O1366P1992Q1574j21531q9180J00955Q3880J87990e7422G1165
$$ 411931 113048 174414 246406 327980 206449 117269 218224 302104 490094 -57422 71165
17180C1803J34875P3380m4698K19546q7882R8839A51950o6648j0938Q3096K21393
$$ 31803 166678 240058 195360 414906 327024 425863 151950 85302 74364 157460 378853
17169C78853r9027P8510K7578b4573F96652B06960J13219K65391a48432B77867
$$ 378853 279826 358336 385914 -24573 696652 206960 320179 585570 -148432 277867
17158D10684k2518k0006I9105L60239A67849j4100k0919R896J72198o0269M86969
$$ 410684 388166 368160 99105 459344 167849 153749 132830 142726 314924 254655 741624
17147G41624B30314B6169J74763K7008P5365p3133M6827A0545K36838f0369C51297
$$ 741624 230314 26169 200932 227940 303305 230172 276999 10545 247383 -60369 351297
17135C26290J43346n0624p6271J65244k3733j76093J41643K4590j00458J4807
$$ 326290 469636 419012 342741 507985 484252 308159 449802 474392 373934 388741
17125C88741J55782A55384b13653A20922K37365q055L7403h1987C93206A85366
$$ 388741 544523 155384 -213653 120922 358287 350232 387635 -81987 393206 185366
17114F77045l01633p3765J87656j88607p5443K10134D4273b7398E28414A81444
$$ 677045 375412 301647 489303 300696 225253 435387 44273 -27398 528414 181444
17103D73876j71011p413M1637A06185J7154K29501l114l3761J38594j08346m2629
$$ 473876 302865 295452 337089 106185 123339 352840 349726 315965 454559 346213 303584
17092C03584j18286M67890k63752j15060J90993C8830N50271m5026K59925B27045
$$ 303584 185298 653188 389436 274376 465369 38830 589101 544075 804000 227045
17081D51901M3346k3528p8029A62311J77855Q7936j38589K46572k8347j44635
$$ 451901 495247 471719 393690 162311 340166 428102 289513 536085 507738 363103
17071C63103K10110J62269o6198k36309A76446K17285K3840L02530A27101M71503
$$ 363103 573213 735482 669284 432975 176446 393731 417571 720101 127101 598604
17061E98604A34133K13649J75585k5154A70664Q6200L34413K160O2873K11540
$$ 598604 134133 347782 523367 498213 170664 256864 591277 593437 656310 867850
17051H67850m31919J42210J0239k89512K91864k21368L36178j90655J9670P2385
$$ 867850 435931 578141 588380 298868 590732 369364 705542 514887 534557 606942
17041F06942M78220D26519M85725m52494N6781O8606P0199j06160A64645K79224
$$ 606942 1085162 426519 912244 459750 516531 585137 655336 549176 164645 443869
17031D43869K83180B82352M79611C21880L89500j25244r9115K37514k5636j92595
$$ 443869 727049 282352 761963 321880 711380 586136 487021 724535 698899 506304
17021E06304K37638k29292J27208m0163J52128k74925r1865J90006j58904Q6084
$$ 506304 743942 514650 641858 601695 753823 478898 387033 577039 418135 504219
17011E04219j167M31720p3626p906r6595q4439k3091Q323N2081j08323k33079
$$ 504219 503052 934772 861146 853240 756645 672206 649115 657438 709519 601196 368117
17000C68117O76034C95329J68349m5292K93530J3018j72629J06655j74236J04733
$$ 368117 1044151 395329 563678 518386 811916 824934 652305 758960 584724 689457
16990F89457J47542k15878K8875K76182j90560l49853M97227Q6782l12065M15629
$$ 689457 836999 621121 649996 926178 735618 385765 882992 969774 657709 1073338
16980A073338k97685L7821m2765J04418j01339j64470K22702R4386j23445J85630
$$ 1073338 775653 813474 770709 875127 773788 609318 832020 926406 802961 988591
16970I88591J25293N5725l84807J75874j72240n8976K68977J5072k46796n1625
$$ 988591 1113884 1169609 784802 960676 788436 729460 998437 1013509 766713 715088
16960G15088J7440L12964L79537l51883j49243j81589M4927L32576k53329J70099
$$ 715088 732528 1045492 1425029 1073146 923903 742314 787241 1119817 866488 1036587
16950A036587j15373K78355j49868Q2618k43880j38105Q8845L47444k12948j23659
$$ 1036587 921214 1199569 1049701 1132319 888439 750334 839179 1186623 973675 850016
16940H50016r915J96506J16156J53395k95982O7138j3183j23465N50155G22815
$$ 850016 840101 1036607 1152763 1306158 1010176 1077314 1064131 940666 1490821 722815
16929A503240m16387M10731m13354J13293Q6451K1645l9124L20462k54670K73878
$$ 1503240 1086853 1497584 1084230 1197523 1283974 1305619 1266495 1586957 1332287 1606165
16919A606165m02336N10168q5045j28291j08149N875M99338n04660J76090p6738
$$ 1606165 1203829 1713997 1628952 1500661 1392512 1398387 1897725 1393065 1569155 1492417
16909A492417j81394K15054J96272l17208M87909l12258K8658J28742n44187M56490
$$ 1492417 1311023 1526077 1722349 1405141 1893050 1580792 1609450 1738192 1194005 1650495
16899A650495K87528K9318n53513J31894L47926j63236l15913M97607m59186M71702
$$ 1650495 1938023 1967341 1413828 1545722 1893648 1730412 1414499 1912106 1452920 1924622
16889A924622L4998j83967J80539K74584k88811j24074k4467L96016l01790K61256
$$ 1924622 1959620 1775653 1956192 2230776 1941965 1817891 1793424 2189440 1887650 2148906
16879B148906n7769j30433J24971o1803L4567L10406M1435k78711p8227J91145
$$ 2148906 2091137 1960704 2085675 2023872 2058439 2368845 2410280 2131569 2053342 2244487
16869B244487K68423k46828J89735k49931Q7787L17896j10301L37192J23335l48582
$$ 2244487 2512910 2266082 2455817 2205886 2293673 2611569 2501268 2838460 2961795 2613213
16859B613213p0090J88481K60583N2809j38438n92261O95396N2895j29505q394
$$ 2613213 2543123 2731604 2992187 3044996 2906558 2314297 3009693 3062588 2933083 2924689
16849B924689K68749M24377m25956K93834m44669K54507k7420R1223p3685J32333
$$ 2924689 3193438 3617815 3191859 3485693 3041024 3295531 3268111 3359334 3285649 3417982
16839C417982r4622L28525R4591K4429O5992O4100J69976j85352L32318j16219
$$ 3417982 3323360 3651885 3746476 3770905 3836897 3900997 4070973 3885621 4217939 4101720
16829D101720J35800p6071k41979M96610Q1711j11870L23532N960Q7897P014J5757
$$ 4101720 4237520 4161449 3919470 4416080 4497791 4385921 4709453 4715413 4803310 4810324 4826081
16818D826081O9721k1236K14915N25615k5883M01255q24696P77310k38346O66168
$$ 4826081 4895802 4874566 5089481 5615096 5589213 5990468 5165772 5943082 5704736 6370904
16808F370904j5163k89412K76772j60767L86776K12733J99715K73193k50699K44414
$$ 6370904 6355741 6066329 6343101 6182334 6569110 6781843 6981558 7254751 7004052 7248466
16798G248466M80833j38351M03520O38073n10013L62046K98916K0066L91042J00107
$$ 7248466 7729299 7590948 7994468 8632541 8122528 8484574 8783490 8803556 9194598 9294705
16788I294705O06385M0178K22903K73676L04500L21976M17038J75833O43796O904
$$ 9294705 9901090 9941268 10164171 10437847 10742347 11064323 11481361 11657194 12300990 12307894
16778A2307894M30121O75622L43139L05784M14409O55921J64912N11373R85487
$$ 12307894 12738015 13413637 13756776 14062560 14476969 15132890 15297802 15809175 16794662
16769A6794662J77736N93220O78110N43794M34981R83981P52255R76758O44124
$$ 16794662 16972398 17565618 18243728 18787522 19222503 20206484 20958739 21935497 22579621
16760B2579621J169740N35440J007884Q17549J383692R57257J382778J208549
$$ 22579621 23749361 24284801 25292685 26110234 27493926 28451183 29833961 31042510
16752C1042510J529812J667927J517022J786810J556284K040372K273373K178933
$$ 31042510 32572322 34240249 35757271 37544081 39100365 41140737 43414110 45593043
16744D5593043K716492K386491K527726K905084L367957L891869L234386M179344
$$ 45593043 48309535 50696026 53223752 56128836 59496793 63388662 66623048 70802392
16736G0802392M173484M855222M865488N581169N694766N691377P001143O882778
$$ 70802392 74975876 79831098 84696586 90277755 95972521 101663898 108665041 115547819
16728A15547819P342937P801784P693658Q421805Q502306Q487343Q383706P380235
$$ 115547819 122890756 130692540 138386198 146808003 155310309 163797652 172181358 179561593
16720A79561593P845746O157669N837697M267722L022915J306112r7898j852927
$$ 179561593 187407339 193565008 199402705 203670427 206693342 207999454 207901556 206048629
16712B06048629l058974m501410o033153o630125p399732q055952q536583q479635
$$ 206048629 202989655 198488245 192455092 185824967 178425235 170369283 161832700 153353065
16704A53353065q534837q573662q128865p549153p674224o838798o619302o277774
$$ 153353065 144818228 136244566 128115701 120566548 112892324 106053526 99434224 93156450
16696I3156450n625288n576341n367831m438979m378874m229030l416444l212376
$$ 93156450 87531162 81954821 76586990 72148011 67769137 63540107 60123663 56911287
16688E6911287l643781k942531k755163k475620k365375k013555j819780k257741
$$ 56911287 53267506 50324975 47569812 45094192 42728817 40715262 38895482 36637741
16680C6637741j766373j840450j345613j758290j231250j222857j314232j161857
$$ 36637741 34871368 33030918 31685305 29927015 28695765 27472908 26158676 24996819
16672B4996819j273952q11996j071197n91138q87911o03051r75256p37721q96150
$$ 24996819 23722867 22910871 21839674 21248536 20360625 19757574 18782318 18044597 17148447
16663A7148447l87683n24277p48365l57450n48496o92730m54577n49711l03980
$$ 17148447 16760764 16236487 15488122 15130672 14582176 13889446 13434869 12885158 12581178
16654A2581178n38677j49641m07834l80301m28642k80095K943j28157p34497k54549
$$ 12581178 12042501 11892860 11485026 11104725 10676083 10395988 10398931 10270774 9536277 9281728
16644I281728j31517n04633k72573j06277j85221r9206k04747k0352o37043n7114
$$ 9281728 9150211 8645578 8373005 8266728 8081507 7982301 7777554 7757202 7120159 7063045
16634G063045J20830k33219M6298n47073l36483o4840p6128O7109o6663k16594
$$ 7063045 7183875 6950656 6996954 6449881 6113398 6048558 5972430 6039539 5972876 5756282
16624E756282l18182P225l96175M8463j03850J63022q344n07905L7047j26923
$$ 5756282 5438100 5445325 5049150 5097613 4993763 5156785 5148441 4640536 4677583 4550660
16614D550660k68589K47071n48380M01460n24847K3768R0725k47224k39294L21260
$$ 4550660 4282071 4529142 3980762 4382222 3857375 3881143 3971868 3724644 3485350 3806610
16604C806610p9938K64314k21179m34296J6656L16609l97398J42466n20241N99563
$$ 3806610 3726672 3990986 3769807 3335511 3352167 3668776 3271378 3413844 2893603 3493166
16594C493166k92848m40671J86997l82003K79478K38590l37695K69361l57135
$$ 3493166 3200318 2759647 2946644 2564641 2844119 3082709 2745014 3014375 2657240
16585B657240j90303K68145m06051J76825K61642o95087M92237m29736L9186J17587
$$ 2657240 2466937 2735082 2329031 2505856 2767498 2072411 2564648 2134912 2174098 2291685
16575B291685j42003R9552k79668q9658M29803l45283J04471k66975J2434r6071
$$ 2291685 2149682 2249234 1969566 1879908 2309711 1964428 2068899 1801924 1814358 1718287
16565A718287R5002k09611O762L55107n3285r4158J8111l33599K00263J84308
$$ 1718287 1813289 1603678 1610440 1965547 1912262 1818104 1836215 1502616 1702879 1887187
16555A887187k36897k24071L2184k6870K41713k85268j28578m8658P8810J01331
$$ 1887187 1650290 1426219 1458403 1431533 1673246 1387978 1259400 1210742 1289552 1390883
16545A390883o7526J48483p5884k99118N00659k40281k0322j8817l880l00676
$$ 1390883 1323357 1471840 1395956 1096838 1597497 1357216 1336894 1318077 1314197 1013521
16535A013521J79170N8978j09740l02011J09202K05854r3094n3790p2231L8595
$$ 1013521 1192691 1251669 1141929 839918 949120 1154974 1061880 1008090 935859 974454
16525I74454M20250l24764J22884J95969l25270k6457q5415O8934J51525k7773
$$ 974454 1394704 1069940 1192824 1388793 1063523 1037066 951651 1020585 1172110 1144337
16515A144337q4326J61530k41670J60736l31223J02891m16257K24028j79370L78764
$$ 1144337 1060011 1221541 979871 1140607 809384 912275 496018 720046 540676 919440
16505I19440J25491k12981L2573P2621J77663j86570K8019k14687J13L12848l21574
$$ 919440 1044931 831950 864523 937144 1114807 928237 956256 741569 741682 1054530 732956
16494G32956J44165R8900l20417L03112m47726J6701k7371L96937J52848k69431
$$ 732956 877121 976021 655604 958716 510990 527691 500320 897257 1050105 780674
16484G80674K6885l9619K5244K4731j06094j8035C18158L21390K14174l48643
$$ 780674 807559 767940 793184 817915 711821 693786 318158 639548 853722 505079
16474E05079J66168M5240C23235J32976L34424j45986p6589l2280O0601j26369
$$ 505079 671247 716487 323235 456211 790635 644649 568060 535780 596381 470012
16464D70012N6767L4676n0622P3072j18389K50431k700n5383j22382J18906L8473
$$ 470012 526779 561455 510833 583905 465516 715947 713247 657864 535482 654388 692861
16453F92861P7029j14411r8707j51475A29647J29706M22474k33409p8286j22218
$$ 692861 769890 655479 556772 405297 129647 259353 681827 448418 370132 247914
16443B47914K00431j48591N2135K04980p1156o1485r6689J58201G5298J80389
$$ 247914 448345 299754 351889 556869 485713 424228 327539 485740 75298 255687
16433B55687l7767K89965j30905R7000k26218P7985o3187L20386j77492N4490
$$ 255687 217920 507885 376980 473980 247762 325747 262560 582946 405454 459944
16423D59944A87781K50279j46338A27494K76617M14367B68536J34424K79921j11927
$$ 459944 187781 438060 291722 127494 404111 818478 268536 402960 682881 570954
16413E70954B3079M26326j45567o2918J17413J87604A55251L44631G4891K19204
$$ 570954 23079 449405 303838 240920 358333 545937 155251 499882 74891 294095
16403B94095o243N3581Q5439j98172I5352K25601a450B48487o7938L86232A76940
$$ 294095 287852 341433 426872 228700 95352 320953 -1450 248487 180549 566781 176940
16391D31103G0140M09717o1393P8583J17738k88472j34308K12336A49453J80910
$$ 431103 70140 479857 418464 497047 614785 326313 192005 404341 149453 330363
16381C30363J14714K24922A68730J92984l8394E958L01627r8999L3945a021A97104
$$ 330363 445077 669999 168730 361714 323320 5958 307585 208586 242531 -1021 197104
16369B83590D2080i9024D21592J8642G5483K73901J2868r3801P4724j00568K14665
$$ 283590 42080 -99024 421592 440234 75483 349384 362252 268451 343175 242607 457272
16358D57272A50658k3234J53903j31966O8222P141d4834A26356K27589J08640
$$ 457272 150658 127424 281327 149361 217583 224724 -44834 126356 353945 462585
16348D62585G1543J02491J80558F7391a72748C89876Q1852B05815h2478C65218
$$ 462585 71543 174034 354592 67391 -172748 389876 471728 205815 -82478 365218
16337B01631J07625a65416H7482l5482J42734E6495b0198B3340L13983E0379N417
$$ 201631 309256 -165416 87482 52000 194734 56495 -20198 23340 337323 50379 55796
16326E5796k7672K6300L99303m3652j27567G9438a3376D13322e4108B1296N31125
$$ 55796 28124 54424 453727 410075 282508 79438 -13376 413322 -54108 21296 552421
16315E52421k47930A33292k8412h3137F8025K4770J03484B514M77463j29698A26768
$$ 552421 304491 133292 104880 -83137 68025 92795 196279 2514 479977 350279 126768
16303A02906P3021b26094B85129n4617j13559N9081p4538K36412r0692A18737
$$ 102906 175927 -226094 285129 230512 116953 176034 101496 337908 247216 118737
16292B01391c9039B23507j5869r5377Q0194c37643E31736B38248c3495A45785
$$ 201391 -39039 223507 207638 112261 192455 -337643 531736 238248 -33495 145785
16281i6947q1388F1702j9302r426a55275E0953A0133L71080b45892F2400J26225
$$ -96947 -178335 61702 42400 32974 -155275 50953 10133 381213 -245892 62400 188625
16270A88625d4757E272J3911J16944b418E456N7813I123K74864G600b51525A80041
$$ 188625 -44757 5272 19183 136127 -2418 5456 63269 9123 283987 7600 -251525 180041
16257C12093a5153n96240B67067c60899A15729a59326I5816l711i8254o9765L4470
$$ 312093 -15153 -611393 267067 -360899 115729 -159326 95816 92105 -98254 -168019 -133549
16246a33549d3706r9258B40010k7627p7409L3934b17274C8170M45091H1593Q4139
$$ -133549 -43706 -142964 240010 212383 134974 168908 -217274 38170 483261 81593 165732
16235A65732b38811l6683D43364C3136g1750I1908c22622B59208A7617d6993H7006
$$ 165732 -238811 -275494 443364 33136 -71750 91908 -322622 259208 17617 -46993 87006
16223A10813a58475r4418C62270a90133C38375A754J3842i2638b0531j06162M3670
$$ 110813 -158475 -252893 362270 -190133 338375 1754 15596 -92638 -20531 -126693 -83023
16212h3023m5017A76774D4943e3447A88243E7335b03225I4805q754a8185l62829
$$ -83023 -128040 176774 44943 -53447 188243 57335 -203225 94805 86051 -18185 -381014
16201c81014N8593J11642I5022K05999j49669B6849r235J47591b76790A72119
$$ -381014 -322421 -210779 95022 301021 151352 26849 17614 165205 -276790 172119
16190A47635E7881j6922Q8833d7058B44405O1940c54275A08465E0450H787a48321
$$ 147635 57881 40959 129792 -47058 244405 306345 -354275 108465 50450 8787 -148321
16178H7155b65510A55633D9439K52196G6556a37983A02314K9709a09473L7793
$$ 87155 -265510 155633 49439 301635 76556 -137983 102314 132023 -109473 -71680
16168g1680j0030k5091A94456g3848k2395D59598A06688q187P9560K7004q9106
$$ -71680 -81710 -106801 194456 -73848 -96243 459598 106688 98501 178061 205065 115959
16157A15959O113a90817I2740j4772a06204j10529B4901K9279J3988A5264b838
$$ 115959 122072 -190817 92740 77968 -106204 -216733 24901 54180 68168 15264 -2838
16145G2027K57390b2640A93494a06779A1487i4955j18172d6412A69352l2414c16366
$$ 72027 329417 -22640 193494 -106779 11487 -94955 -213127 -46412 169352 136938 -316366
16133A31038f7140b0914C15262f3276a338C6637N5686C8575e6908j91393d0956
$$ 131038 -67140 -20914 315262 -63276 -1338 36637 92323 38575 -56908 -248301 -40956
16121g5986F2330J6297K04560A02022f2743A49369n9103b84750A61945p2534k9710
$$ -75986 62330 78627 283187 102022 -62743 149369 90266 -284750 161945 89411 59701
16110E9701J71917L5215a49609E8749L9014K0332b50221G6655J43031j9707J00731
$$ 59701 231618 266833 -149609 58749 97763 118095 -250221 76655 219686 199979 300710
16099C00710A34114P7098b76993f3821B15066D448b31619E5729O3288q906K9641
$$ 300710 134114 211212 -276993 -63821 215066 4448 -231619 55729 119017 110111 139752
16088A39752J13254d82158a29973A78018o2898d4642D0006b43582f8986B58288
$$ 139752 253006 -482158 -129973 178018 115120 -44642 40006 -243582 -68986 258288
16077B5268e885B05759g5391j57766k66726a81612b1402A74886a63176g7112k2599
$$ 25268 -5885 205759 -75391 -233157 -499883 -181612 -21402 174886 -163176 -77112 -99711
16066i9711c8181I0782N2157f2222j9039D387g676A81426a6892l07784B52621
$$ -99711 -38181 90782 142939 -62222 -81261 4387 -7676 181426 -16892 -324676 252621
16054b95712B5219f0925A22684l2696K5502J77456j08737d13428C6282K64505
$$ -295712 25219 -60925 122684 89988 115490 292946 184209 -413428 36282 300787
16044C00787a5188A75330q4333a29711M8939q144c7628M374k76886M7327B42308
$$ 300787 -15188 175330 90997 -129711 -80772 -88916 -37628 -33254 -310140 -262813 242308
16032b10261A24574b15975J06227m9c3910o655b734H9900a22164N4530p8711g952
$$ -210261 124574 -215975 -109748 -109797 -33910 -40565 -2734 89900 -122164 -67634 -146345 -7952
16019a88559r9603C69688A41674o5404l7878d39409A72568b49157L3761a06179
$$ -188559 -288162 369688 141674 76270 38392 -439409 172568 -249157 -215396 -106179
16008B81863b24860I5028a36380B86320p1854a23972A81445f7589j8762I9571
$$ 281863 -224860 95028 -136380 286320 214466 -123972 181445 -67589 -86351 99571
15997C26000a26032G4926g9344m6729I9312l8704E352a25352j49894b8531k718
$$ 326000 -126032 74926 -79344 -126073 99312 60608 5352 -125352 -275246 -28531 -31249
15986c1249A46700J39188B8183M09264j16813j10612M7977k2294d4715k0433B6913
$$ -31249 146700 285888 28183 437447 320634 210022 257999 235705 -44715 -65148 26913
15974A05545A9420O9371g5968q962k55618J10888d8418j51582A77396E1453g647
$$ 105545 19420 88791 -75968 -84930 -340548 -229660 -48418 -200000 177396 51453 -7647
15962B2462M24786b7122A67232B90b86419q706m6617N2405C0331i1518A11817
$$ 22462 447248 -27122 167232 290 -286419 -295125 -341742 -289337 30331 -91518 111817
15950B47313a874E6886c84364d4930B76191f354G7557b24110H1220a94039L7912
$$ 247313 -1874 56886 -384364 -44930 276191 -6354 77557 -224110 81220 -194039 -156127
15939a56127K3173k51265D7202K09264A00306c4870j30899A75286F7650a55135
$$ -156127 -132954 -384219 47202 256466 100306 -34870 -165769 175286 67650 -155135
15928b35214d2507j03571k12618A34885a36277j80077B2940K63936f8144G9862
$$ -235214 -42507 -146078 -358696 134885 -136277 -316354 22940 286876 -68144 79862
15917a04314k57837J37786i1750L6844j32781A41399C9092b90361i7347D3937
$$ -104314 -362151 -224365 -91750 -54906 -187687 141399 39092 -290361 -97347 43937
15906a61090A36382a11361M7522A13275J7293J50707a24838N6214Q213m1636b2951
$$ -161090 136382 -111361 -63839 113275 130568 281275 -124838 -68624 -60411 -102047 -22951
15894H6762a17330B97013A944J2612K26012A11836B3552h3555C0063J44010a30023
$$ 86762 -117330 297013 1944 14556 240568 111836 23552 -83555 30063 174073 -130023
15882A29096b16315F9469a29512k4334A47650a11495A39146a63817e8130A58580
$$ 129096 -216315 69469 -129512 -153846 147650 -111495 139146 -163817 -58130 158580
15871a05590m7268A7216f4625k49343B0354b96476j39788c2075B79796m2877a54645
$$ -105590 -152858 17216 -64625 -313968 20354 -296476 -436264 -32075 279796 236919 -154645
15859A62098e9701B85842a53689M0982k3925r246d281A11832d8331l06754H4737
$$ 162098 -59701 285842 -153689 -112707 -136632 -145878 -4281 111832 -48331 -355085 84737
15847I6557d80090D0376b25859k76689K36161n9299B20874b33657G359b62899
$$ 96557 -480090 40376 -225859 -502548 -266387 -325686 220874 -233657 7359 -262899
15836I1525A8322a44634b5396m6264H5087i9770A52774c5500A47374D0993J75713
$$ 91525 18322 -144634 -25396 -71660 85087 -99770 152774 -35500 147374 40993 216706
15825B16706a8667p9008c8105A13085J75124F4441a14960N7467j29751p5338C8417
$$ 216706 -18667 -97675 -38105 113085 288209 64441 -114960 -57493 -187244 -262582 38417
15813a19496B86049B7969b41615F2720J33777d2223B80015j19604M31a36344A46007
$$ -119496 286049 27969 -241615 62720 196497 -42223 280015 160411 160842 -136344 146007
15801a86811F6525c0831A5901i8898B38725c40519C4867b19824c3714q7518B32526
$$ -186811 66525 -30831 15901 -98898 238725 -340519 34867 -219824 -33714 -121232 232526
15789b13500n837A97041a77091e2027I0134i8884A46502d35366C1746i2487A02737
$$ -213500 -219337 197041 -177091 -52027 90134 -98884 146502 -435366 31746 -92487 102737
15777c1886j33907a6132A08053a504k75066a34407A79926f4078B68430I9009J84389
$$ -31886 -165793 -16132 108053 -1504 -276570 -134407 179926 -64078 268430 99009 283398
15766B83398a64665A8736b47248e581A14344K8859c60843F2935c4270L499B66190
$$ 283398 -164665 18736 -247248 -5581 114344 143203 -360843 62935 -34270 -30771 266190
15754C96687D7654e8466k2592j27177F5621L0325J50359e9790A93923d7801j00108
$$ 396687 47654 -58466 -81058 -208235 65621 95946 246305 -59790 193923 -47801 -147909
15743a47909h452j23307D8007r653P128a08798A65259D5608a38644L7026E0811
$$ -147909 -8452 -131759 48007 38354 45482 -108798 165259 45608 -138644 -101618 50811
15731a5584A28626a68371A85097h7835A64392a57858b3876F3891k4202c68765
$$ -15584 128626 -168371 185097 -87835 164392 -157858 -23876 63891 39689 -368765
15720d4908k61980b5792k37251H9609d8298N958o2263o2363f8450k10213a20982
$$ -44908 -306888 -25792 -263043 89609 -48298 -42340 -104603 -166966 -68450 -278663 -120982
15708a05511m472d8673k64366a04662j60587D9310c8537j12225D67251B29896
$$ -105511 -109983 -48673 -313039 -104662 -265249 49310 -38537 -150762 467251 229896
15697a42052e7401j11113M8384l5470B29528g4278A00298J90382b17897i299G4649
$$ -142052 -57401 -168514 -120130 -155600 229528 -74278 100298 290680 -217897 -9299 74649
15685B55219d32525B0914L3351b0558j85178F0191b3576B12336k6256a60961J8502
$$ 255219 -432525 20914 54265 -20558 -205736 60191 -23576 212336 186080 -160961 -142459
15674a42459j65244B29148F2432J97570j03005J31031q7806a71595K3319A17940
$$ -142459 -307703 229148 62432 260002 156997 288028 200222 -171595 -148276 117940
15663E2986d07829f2314J9670C26769A5103L8301a13072k84624a05268b0810l4095
$$ 52986 -407829 -62314 -42644 326769 15103 53404 -113072 -397696 -105268 -20810 -54905
15652e4905j74919c1378K287B13238r8655k8671j7476Q6821c33282C9930h8158
$$ -54905 -229824 -31378 -29091 213238 114583 85912 68436 155257 -333282 39930 -88158
15640a11945j27260j55964A29313J32731c62186a07822F2231R6173c43936C14361
$$ -111945 -239205 -395169 129313 262044 -362186 -107822 62231 158404 -343936 314361
15629c13840B63545a52932c0306k9156n4201C47270d3829B98498E0421J60806
$$ -313840 263545 -152932 -30306 -59462 -113663 347270 -43829 298498 50421 211227
15619B11227q8591M4735m4903k8631g6712c5302m39674C5725J53312J75659o4976
$$ 211227 122636 167371 122468 93837 -76712 -35302 -474976 35725 189037 364696 299720
15608B99720E046J3143J34256c8841j36871A47170J34642i2966B52753a13928
$$ 299720 5046 18189 152445 -38841 -175712 147170 281812 -92966 252753 -113928
15597A75365a33523b8481I6946a0161D7778a4449m8140k36547J24296C9585K23203
$$ 175365 -133523 -28481 96946 -10161 47778 -14449 -62589 -299136 -174840 39585 262788
15586B62788g8561c0390l0818j72098e3780H7109M9183b95557j47112F6527M885
$$ 262788 -78561 -30390 -61208 -233306 -53780 87109 136292 -295557 -442669 66527 71412
15575G1412P7490Q4940a88917j5240a6820j12775A2733M3196k2867K65215C8515
$$ 71412 148902 233842 -188917 -204157 -16820 -129595 12733 55929 33062 298277 38515
15563c3532k3806m0616A4156J92296h9362A68744C2424b715j53504f0076J7055
$$ -33532 -57338 -97954 14156 206452 -89362 168744 32424 -2715 -156219 -60076 -43021
15552d3021A71564e6592k34278R0733k3440C0568a99409B99296a83503L2751b1794
$$ -43021 171564 -56592 -290870 -200137 -223577 30568 -199409 299296 -183503 -150752 -21794
15540C26750b29575c4462I4325a05316o7099p5847d4648P231j18329D24249c20040
$$ 326750 -229575 -34462 94325 -105316 -172415 -248262 -44648 -37417 -155746 424249 -320040
15528c39662B50715F1066a3918b501C08283i5745j46344P0444A09583J92239a61820
$$ -339662 250715 61066 -13918 -2501 308283 -95745 -242089 -171645 109583 301822 -161820
15516a69357C9590J08362K756a58558p015A1279L28746a56726H2b67174R3989
$$ -169357 39590 147952 150708 -158558 -165573 11279 340025 -156726 82 -267174 -173185
15505a73185h3943p169C218P1138e5532k7439F6724b01870k05765J34190B38352
$$ -173185 -83943 -91112 3218 74356 -55532 -82971 66724 -201870 -407635 -273445 238352
15493H1583a43801k77945K08454D1148P0683L2551a04798G7727i8718j52658C01756
$$ 81583 -143801 -421746 -213292 41148 111831 144382 -104798 77727 -98718 -251376 301756
15481D99869a77527C17353f0820l1081j19997A5768J44471b90826E5854d3762
$$ 499869 -177527 317353 -60820 -91901 -211898 15768 160239 -290826 55854 -43762
15470D1459j9912g7649k27886A79902I757R9107e1837j14553B12951n541o007
$$ 41459 21547 -77649 -305535 179902 9757 108864 -51837 -166390 212951 207410 201403
15459B01403C0556K02408I8239i9827A51087A9830J15370a84648o4870A23588
$$ 201403 30556 232964 98239 -99827 151087 19830 135200 -184648 -249518 123588
15448G7892d7202A25991k7327A1076c7300j75479b9371j65401Q7496C4034M7626
$$ 77892 -47202 125991 98664 11076 -37300 -212779 -29371 -194772 -107276 34034 81660
15437H1660g5024N107J9546D5565J33476l3942P8849a34995A59476c0984R396
$$ 81660 -75024 -69917 -50371 45565 179041 145099 223948 -134995 159476 -30984 -21588
15426b1588j01636a5912p3553A47047n508f2666j35217j93160i6987K1889j32821
$$ -21588 -123224 -15912 -89465 147047 141539 -62666 -197883 -391043 -96987 -75098 -207919
15415b07919P3914O1866r0876k02328J41802a812G7177a97441b635I4571J07549
$$ -207919 -134005 -72139 -163015 -365343 -223541 -1812 77177 -197441 -2635 94571 202120
15404B02120K11409b4322D75240A96885k7457d9516a0464B93331A3553l966a52489
$$ 202120 413529 -24322 475240 196885 169428 -49516 -10464 293331 13553 9587 -152489
15392H2810l3823K37358E4006J4048c0881J0875A26667a42981j31761A2881N2116
$$ 82810 48987 286345 54006 68054 -30881 -20006 126667 -142981 -274742 12881 64997
15381F4997K24409c49365c7157A23713c95400A35416a19618C8069J76877b23047
$$ 64997 289406 -349365 -37157 123713 -395400 135416 -119618 38069 214946 -223047
15370A84319c49996H9096K1427b42780n9709h5759C45844b58820A82789j3862
$$ 184319 -349996 89096 110523 -242780 -302489 -85759 345844 -258820 182789 168927
15360A68927G4143B7594P5005b71492i8333C5552K0576J6879b26712J06386B15280
$$ 168927 74143 27594 102599 -271492 -98333 35552 56128 73007 -226712 -120326 215280
15348E9888K63990d7218A19355a45148n0766q7358K7093B33980J10866b65182
$$ 59888 323878 -47218 119355 -145148 -195914 -283272 -256179 233980 344846 -265182
15337c3089j4722M318N801j23299p0925C71098a78005j35468D1750J10530O4636
$$ -33089 -47811 -43493 -37692 -160991 -231916 371098 -178005 -313473 41750 152280 216916
15326B16916P2224r9580K4024j3326b47771A59890b45032a1925A9443d172C2268
$$ 216916 289140 189560 213584 200258 -247771 159890 -245032 -11925 19443 -4172 32268
15314A31382a71149c7739A09322D61J63985J19551A05154i7544M4779D07444C3854
$$ 131382 -171149 -37739 109322 461 164446 283997 105154 -97544 -52765 407444 33854
15302a58435q2411L7385H7311K42600A8821a90617H121L06407a60486f2186k666
$$ -158435 -240846 -203461 87311 329911 18821 -190617 8121 314528 -160486 -62186 -64852
15291f4852q6191j2500b8769F14046k02897B2200l919P0664B2040K15951c426
$$ -64852 -151043 -163543 -28769 614046 411149 22200 18281 88945 22040 237991 -3426
15279a20892C264L7055e6510A43417D8706p836K1418K05804o7791r9371P8889
$$ -120892 3264 40319 -56510 143417 48706 40870 62288 268092 200301 100930 179819
15268A79819g6831r4956l9041I1558b9840A53784j3969i4270j1727D44423f083
$$ 179819 -76831 -171787 -210828 91558 -29840 153784 139815 -94270 -105997 444423 -6083
15256A74820k0842J41995l4775p9311P204b6306C46905R1239J048102m50399J12364
$$ 174820 153978 295973 261198 181887 189091 -26306 346905 438144 1486246 1035847 1148211
15245A148211M90653o57029I6349f2152m4360I9008i6149B56027b23572A964L35017
$$ 1148211 1638864 981835 96349 -62152 -106512 99008 -96149 256027 -223572 1964 336981
15234C36981r4889C1617o791a12682N2689m4211C48263C7268d9066D38709D0470
$$ 336981 242092 31617 24826 -112682 -59993 -104204 348263 37268 -49066 438709 40470
15222F6977a01589A40685a28390P878A02799c84454E1185g7901c4526A25602a18038
$$ 66977 -101589 140685 -128390 -120512 102799 -384454 51185 -77901 -34526 125602 -118038
15210A69262a00505E8917f9434m8464j57866G787K9516c0628G6096a82429L4438
$$ 169262 -100505 58917 -69434 -117898 -275764 7787 37303 -30628 76096 -182429 -147991
15199a47991A53613n015K10559B8334c06982A44097a38737D40326E1815O7410
$$ -147991 153613 148598 359157 28334 -306982 144097 -138737 440326 51815 119225
15189A19225l0471f9095l352L0487r491b3830A67374l3116C6079A1630e4446j31745
$$ 119225 88754 -69095 -72447 -41960 -51451 -23830 167374 134258 36079 11630 -54446 -186191
15177a86191C6264b60005A13497A0974L31190c7858B35068F9035J00831b8777
$$ -186191 36264 -260005 113497 10974 342164 -37858 235068 69035 169866 -28777
15166H1906L55491A70342d9006D8584J10424N8060A6344L66936H3024J9703j9670
$$ 81906 437397 170342 -49006 48584 159008 217068 16344 383280 83024 102727 83057
15155H3057A3361J65332J67285a43787D3422K10188m6656J44622r8074k3522q5518
$$ 83057 13361 178693 345978 -143787 43422 253610 206954 351576 253502 229980 144462
15144A44462b2724C3573J56962J16274b38518A96971p9229M8135J32636g0527
$$ 144462 -22724 33573 190535 306809 -238518 196971 117742 165877 298513 -70527
15133a19095D85721k26125A02656J66715f613k07012i3068j00905G9475J07666
$$ -119095 485721 259596 102656 269371 -6613 -213625 -93068 -193973 79475 187141
15123A87141G1884a19361I960J63050a17153B43908c6332B62113q9952p614n3131
$$ 187141 71884 -119361 9960 173010 -117153 243908 -36332 262113 172161 164547 111416
15112A11416g0033a089E1781a53259F4356M31329o2544B09581H0872J38221J20905
$$ 111416 -70033 -1089 51781 -153259 64356 495685 433141 209581 80872 219093 339998
15101C39998A40756E8811J44341J43573M3580A72697k6705J83603j27186E6905
$$ 339998 140756 58811 203152 346725 390305 172697 145992 329595 202409 56905
15090A44885c0018B0676b51164A42987h615B28965b402A87303J01830C4911c9820
$$ 144885 -30018 20676 -251164 142987 -8615 228965 -2402 187303 289133 34911 -39820
15078c04510b569A16140N94119A88129q6200J35067A12569P1800n4558J15657
$$ -304510 -2569 116140 710259 188129 101929 236996 112569 184369 129811 245468
15068B45468a0267A69878J0135L53621F4995J09981M0612P7624I741J9510c16578
$$ 245468 -10267 169878 180013 533634 64995 174976 215588 293212 9741 29251 -316578
15056B45960r4340K00521j55607B445a77893e329j5852m3925G7136a43478f0496
$$ 245960 151620 352141 196534 2445 -177893 -5329 -21181 -65106 77136 -143478 -60496
15044a62776C24629A26861J15837K01287A3246K93845a2336A80995J5444a08491
$$ -162776 324629 126861 242698 443985 13246 307091 -12336 180995 196439 -108491
15033H098a24974B31913K28683k29961B7675M34837j20109B4715J89992K42846
$$ 8098 -124974 231913 460596 230635 27675 462512 342403 24715 214707 457553
15023D57553k02113e2823C45673a57279G15100k26424D4552K46919o7235G2110
$$ 457553 255440 -52823 345673 -157279 715100 488676 44552 291471 224236 72110
15012B99725A40926J99010n7755J69991j56570J06523a4505B31841J1443J32221
$$ 299725 140926 339936 282181 452172 295602 402125 -14505 231841 243284 375505
15002C75505o5148n8134F5459Q7221n022O254J75261H0430K13650q1957L46100
$$ 375505 310357 252223 65459 152680 147658 153912 329173 80430 294080 212123 558223
14991E58223k45642A53766K2535J29843j47779J78805A60575R3679F7108J126
$$ 558223 312581 153766 176301 306144 158365 337170 160575 254254 67108 68234
14981F8234J04642O1597K7441r4736J48298p2950j1560a91570B33561J49965A79963
$$ 68234 172876 234473 261914 167178 315476 242526 230966 -191570 233561 383526 179963
14969D2908J89612J13996j69383M2328R8143J13068A93253g1847N596E27561A37352
$$ 42908 232520 346516 177133 219461 317604 430672 193253 -71847 -66251 527561 137352
14957C56133H2196L26617J64915j73323A97906K52327K41375A87724J07634K58628
$$ 356133 82196 408813 573728 400405 197906 450233 691608 187724 295358 553986
14947E53986j97787O653K01289G1000P8230L41155J72989k19882E232K60018J57052
$$ 553986 356199 362852 564141 71000 149230 490385 663374 443492 5232 265250 422302
14936D22302D9416L23401N8332e2007B61108R2834J3689C9723L8712a8310D50918
$$ 422302 49416 372817 431149 -52007 261108 353942 367631 39723 78435 -18310 450918
14924C01941k7764N5631j59018c2332D23384r7291p5978j16806L24234m4833j78476
$$ 301941 274177 329808 170790 -32332 423384 326093 250115 133309 457543 412710 234234
14913B34234J41080j46690J93246H1339L89737C0850K60626n7425J52359k2403
$$ 234234 375314 228624 421870 81339 471076 30850 291476 234051 386410 364007
14903C64007n0535q4909q285O7620A14576K03279j54727L19227j91706K54073
$$ 364007 313472 228563 220278 287898 114576 317855 163128 482355 290649 544722
14893E44722k61342L45225B73742j05048J186K55910j06662K75463B84564o6059
$$ 544722 283380 628605 273742 168694 169880 425790 319128 594591 284564 218505
14883B18505m0342K50461k11265J46772J64810k44323m3522K29512j71924Q7895
$$ 218505 178163 428624 217359 364131 528941 284618 241096 470608 298684 386579
14873C86579m4721j6676M8061A68132L37326L6995n7916j59657J40205j72435
$$ 386579 341858 325182 373243 168132 505458 542453 484537 324880 465085 292650
14863B92650K81244K01062C73820j70667q9103k5443M28792J66224j69221J4221
$$ 292650 573894 774956 373820 203153 114050 88607 517399 683623 514402 528623
14853E28623j80051O014R3204O8187B28061K12814J65873k5821q9317k41358K55851
$$ 528623 348572 354586 447790 515977 228061 440875 606748 580927 491610 250252 506103
14842E06103n09B07006N21012l30041q6030J25670N3667A89169I669N23384J01768
$$ 506103 505594 207006 728018 397977 311947 437617 491284 189169 9669 533053 634821
14831F34821j55039A70047M21313j26375k0703J75915J47276B38807J63601m3307
$$ 634821 479782 170047 591360 464985 444282 620197 767473 238807 402408 359101
14821C59101O9459J36864J0509N5564J29402j58921j45363j04201K55962j01187
$$ 359101 428560 565424 575933 631497 760899 601978 456615 352414 608376 507189
14811E07189n8004B24146j10712K51437m6676O62973C55466J67120j06532L97343
$$ 507189 449185 224146 113434 364871 318195 981168 355466 522586 416054 813397
14801H13397k4877k91145P1420K26289j88545n0864k9039j25784L84760l49134
$$ 813397 788520 497375 568795 795084 606539 555675 526636 400852 785612 436478
14791D36478J67860J14537j43649B73515N37345r3712k64850R8468L43623k25745
$$ 436478 604338 718875 575226 273515 810860 717148 452298 550766 894389 668644
14781F68644N3703m9271k69629l2308J62836J0155L58948D40073R268J51730J66364
$$ 668644 722347 673076 403447 371139 533975 544130 903078 440073 449341 601071 767435
14770G67435j63205j82072j18299O89853D07616K08663J74424q5449O2052l63320
$$ 767435 604230 422158 303859 993712 407616 616279 790703 705254 767306 403986
14760D03986K64233j73268K25243r9673K00098j22441k15399K69350l3500l6421
$$ 403986 668219 494951 720194 620521 820619 698178 482779 752129 718629 682208
14750F82208Q5884J70755k84296J53804k27529J22843n9714J819K2309j341k00851
$$ 682208 768092 938847 654551 808355 580826 703669 643955 645774 668083 666742 465891
14739D65891K74857L54497m69304n3560O9132K74389l97900k37631K45710o7503
$$ 465891 740748 1095245 625941 572381 641513 915902 518002 280371 526081 458578
14729D58578K11785J97486k33072r3493N22037l06558J14088k55889K21427l14252
$$ 458578 670363 867849 634777 541284 1063321 756763 870851 614962 836389 522137
14719E22137J68449K78643o3870r9678L69394k73938J44510m31610M56771m62105
$$ 522137 690586 969229 905359 805681 1175075 901137 1045647 614037 1070808 608703
14709F08703L54244j83315K89107P6765l06304k12645L24988k63604M12012N775
$$ 608703 962947 779632 1068739 1145504 839200 626555 951543 687939 1099951 1105726
14699A105726n24367K54951k01220R4581j58815N98485k13322j93439J27525P1441
$$ 1105726 581359 836310 635090 729671 570856 1169341 956019 762580 890105 961546
14689I61546p8178J10361j73042K87393J1803j57719J39330j86948k74514L45829
$$ 961546 883368 993729 820687 1108080 1119883 962164 1101494 914546 640032 985861
14679I85861j3353j87387L0469L12075k17190N57271m59201J283J8762K7402J3202
$$ 985861 972508 785121 815590 1127665 910475 1467746 1008545 1009828 1028590 1055992 1069194
14668A069194r9750j23723L42155o0481K25231o13408L95138J20021l64430K56646
$$ 1069194 969444 845721 1187876 1127395 1352626 739218 1134356 1254377 889947 1146593
14658A146593j26455K69459l53109M84717k64000k35167L00460j7653n9493N41
$$ 1146593 1020138 1289597 936488 1421205 1157205 922038 1222498 1204845 1145352 1145893
14648A145893O7135O1187J77790k50469o1350j54097K64325Q9947L8042k30383
$$ 1145893 1213028 1274215 1452005 1201536 1140186 986089 1250414 1340361 1378403 1148020
14638A148020K18063o351K01667l91086O2787Q3687j36040O1748l9135J99803
$$ 1148020 1366083 1359732 1561399 1170313 1233100 1316787 1180747 1242495 1203360 1403163
14628A403163l8674L2656n4247Q8849K08731k55720j06407K9407J61881L33482
$$ 1403163 1364489 1397145 1342898 1431747 1640478 1384758 1278351 1307758 1469639 1803121
14618A803121m20720J57157j84754K14022R2243k08614j0509k61853M58504l25544
$$ 1803121 1382401 1539558 1354804 1568826 1661069 1452455 1441946 1180093 1638597 1313053
14608A313053L25513N1977j90490K42072o4607l2726J84877m44141M19495r323
$$ 1313053 1638566 1690543 1500053 1742125 1677518 1644792 1829669 1385528 1805023 1795700
14598A795700l60j72034K31081k92223J19232p7238L27333P9831k233k63939J856
$$ 1795700 1795340 1623306 1854387 1562164 1681396 1604158 1931491 2011322 2009089 1745150 1747006
14587A747006L27164k60495J09983p769k23052L15036o6906k33611K95918O7878
$$ 1747006 2074170 1813675 1923658 1915889 1692837 2007873 1940967 1707356 2003274 2071152
14577B071152Q8839J49219j79882k209q5710K27174q9235N7789l740N8609K57645
$$ 2071152 2159991 2309210 2129328 2127119 2041409 2268583 2179348 2237137 2233397 2292006 2549651
14566B549651j43501j84960K73250n2041J63139j04719J29685J45018k2691N6462
$$ 2549651 2406150 2221190 2494440 2442399 2605538 2500819 2630504 2775522 2752831 2809293
14556B809293L11498K16611M11324K42310J8580Q96824O44578J745248M110909
$$ 2809293 3120791 3337402 3748726 3991036 4009616 4906440 5551018 7296266 11407175
14547A1407175J1122214J9535476N284855B1101407H196916l949683q38133o92172
$$ 11407175 22529389 42064865 47349720 21101407 8196916 4247233 3409100 2716928
14539B716928o79477j30323j68340J20560P0191K05411m2995K2993L319K50605
$$ 2716928 2037451 1907128 1738788 1859348 1929539 2134950 2091955 2114948 2118267 2368872
14529B368872k69511K6685L08185l81347K33913m8318L26427J78095k12064j38640
$$ 2368872 2099361 2126046 2434231 2052884 2286797 2238479 2564906 2743001 2530937 2392297
14519B392297P2637q0201Q1945K92619j61475Q4222K2147K73694j68839J49529
$$ 2392297 2464934 2384733 2466678 2759297 2597822 2682044 2704191 2977885 2809046 2958575
14509B958575j79765J03995k9276L13714j15162l05025K35929K65054K65180l18641
$$ 2958575 2778810 2882805 2853529 3167243 3052081 2747056 2982985 3248039 3513219 3194578
14499C194578r7549j21808L71953k30355J21853M35894M0816k02175L294k0586
$$ 3194578 3097029 2975221 3347174 3116819 3238672 3674566 3715382 3513207 3516501 3495915
14489C495915L72400m5583j63301P0901n0635M5298J71988k89334j20894P83724
$$ 3495915 3868315 3822732 3659431 3730332 3679697 3724995 3896983 3607649 3486755 4270479
14479D270479l39356M3280O5536J47671o5351J56348J54806j22277j68843L73262
$$ 4270479 3931123 3974403 4039939 4187610 4122259 4278607 4433413 4311136 4142293 4515555
14469D515555k71140N92572p72914R24358m86487Q1201q0822J78102K76647J9320
$$ 4515555 4244415 4836987 4064073 4988431 4501944 4583145 4502323 4680425 4957072 4976392
14459D976392m39400L03511N8809M13810l24118N29036J0007K3598M3368l18858
$$ 4976392 4536992 4840503 4899312 5313122 4989004 5518040 5528047 5551645 5595013 5276155
14449E276155J29187M3157L64976j61436O023J30982j11329O37303j12049j14722
$$ 5276155 5405342 5448499 5813475 5652039 5658062 5789044 5677715 6315018 6202969 6088247
14439F088247K28846j52766N58537j23379P2579K95431p0655o0909L88033k54619
$$ 6088247 6317093 6164327 6722864 6599485 6672064 6967495 6896840 6835931 7223964 6969345
14429F969345L61817k04734O14554l62325p320L79270q6003J45410J39890L1310
$$ 6969345 7331162 7126428 7740982 7378657 7371337 7750607 7664604 7810014 7949904 7981214
14419G981214k5661N28223J08718L533J90553O8869R5258r4580j29909N77940
$$ 7981214 7955553 8483776 8592494 8596027 8786580 8855449 8950707 8856127 8726218 9304158
14409I304158k63313L70306K12065K30294M26485j08113n6010J28818O42167j73022
$$ 9304158 9040845 9411151 9623216 9853510 10279995 10171882 10115872 10244690 10886857 10713835
14399A0713835O1010j4048K39027J48258O57186K056K34671P9081L5405L59751
$$ 10713835 10774845 10760797 10999824 11148082 11805268 11807324 12041995 12121076 12156481 12516232
14389A2516232l847O55857M8372N02365O0712L7422O94598j12174L96943L53626
$$ 12516232 12512385 13168242 13216614 13718979 13779691 13817113 14511711 14399537 14796480 15150106
14379A5150106m1738N37620L99615L43986J65656L22665L42911J65728N93104
$$ 15150106 15108368 15645988 16045603 16389589 16555245 16877910 17220821 17386549 17979653
14370A7979653K67155O78995M12531K70429K16240L78651M51994N47515N37929
$$ 17979653 18246808 18925803 19338334 19608763 19825003 20203654 20655648 21203163 21741092
14361B1741092J73929M63584P90140M08091N54748N22771L92740O32424Q86230
$$ 21741092 21915021 22378605 23168745 23576836 24131584 24654355 25047095 25679519 26565749
14352B6565749O23564P34862M76936Q06181P38870Q36808P60265R98729O64270
$$ 26565749 27189313 27924175 28401111 29207292 29946162 30782970 31543235 32541964 33206234
14343C3206234Q42406J154568N24989J442967O37421J233352J384783R72752J179997
$$ 33206234 34048640 35203208 35728197 37171164 37808585 39041937 40426720 41399472 42579469
14334D2579469J249199J517458J640066J155696J156984J650225J665523J783204
$$ 42579469 43828668 45346126 46986192 48141888 49298872 50949097 52614620 54397824
14326E4397824J790761K049184J705879K302770K112150K198583K309770K739019
$$ 54397824 56188585 58237769 59943648 62246418 64358568 66557151 68866921 71605940
14318G1605940K399201K651405L042749L059239L061060L497177L456899L924600
$$ 71605940 74005141 76656546 79699295 82758534 85819594 89316771 92773670 96698270
14310I6698270M084342M356496M435660N145891M769291N415365N593067O239165
$$ 96698270 100782612 105139108 109574768 114720659 119489950 124905315 130498382 136737547
14302A36737547O446899O979877P000911P805283P834069Q856345Q842802R988752
$$ 136737547 143184446 150164323 157165234 164970517 172804586 181660931 190503733 200492485
14294B00492485R890309J0666899J1207915J1883984J2718301J3133397J3720702
$$ 200492485 210382794 221049693 232257608 244141592 256859893 269993290 283713992
14287B83713992J3910172J4689356J5049413J5141803J5630422J5516846J4899924
$$ 283713992 297624164 312313520 327362933 342504736 358135158 373652004 388551928
14280C88551928J4559933J3770673J2991673J1585302J0383057Q514616O700491
$$ 388551928 403111861 416882534 429874207 441459509 451842566 460357182 467057673
14273D67057673M067213J16753m455492m142370k594282m352989p266419r450722
$$ 467057673 471124886 471241639 466786147 462643777 460049495 455696506 448430087 438979365
14265D38979365j0530099j1665908j2758081j4192912j4728518j5725483j5771292
$$ 438979365 428449266 416783358 404025277 389832365 375103847 359378364 343607072
14258C43607072j6073137j4943453j5341147j3988195j3566763j3814351j2448534
$$ 343607072 327533935 312590482 297249335 283261140 269694377 255880026 243431492
14251B43431492j1951781j1810883j0660356j0616589r481015r125882q576529
$$ 243431492 231479711 219668828 209008472 198391883 188910868 179784986 171208457
14244A71208457p892978p667480p106551p161142o225305o141813n545104n215896
$$ 171208457 163315479 155647999 148541448 141380306 135155001 129013188 123468084 118252188
14236A18252188n005907m966328m516440m325517m026947l140606l766916l566293
$$ 118252188 113246281 108279953 103763513 99437996 95411049 92270443 88503527 84937234
14228H4937234l334980l306425k844763k505567k674279k731930k388297k086013
$$ 84937234 81602254 78295829 75451066 72945499 70271220 67539290 65150993 63064980
14220F3064980j946237k044560j954763k097199j990893j498996j244499j401055
$$ 63064980 61118743 59074183 57119420 55022221 53031328 51532332 50287833 48886778
14212D8886778j953493j337841j304287j350731r58196p75104q60448j622094
$$ 48886778 46933285 45595444 44291157 42940426 41982230 41207126 40346678 38724584
14204C8724584j201947p08320j282319n95058o38133j149137j036328q22916r14636
$$ 38724584 37522637 36814317 35531998 34936940 34298807 33149670 32113342 31290426 30375790
14195C0375790j75639r90735p15176p20498p41119n23718n53623o41213o33788
$$ 30375790 30200151 29209416 28494240 27773742 27032623 26508905 25955282 25314069 24680281
14186B4680281k79641q27772m60356l10096o84956m72965j49135o17973m18482
$$ 24680281 24400640 23572868 23112512 22802416 22117460 21644495 21495360 20877387 20458905
14177B0458905l77460k22591m81881m20086l51656n66457o03693J34609n92860
$$ 20458905 20081445 19858854 19376973 18956887 18605231 18038774 17435081 17569690 16976830
14168A6976830j07687o34152m33150K06788m39785Q4813q31937j06396m75200
$$ 16976830 16869143 16234991 15801841 16008629 15568844 15653657 14821720 14715324 14240124
14159A4240124O4059L9183l54747m95890O8499l41915l16244o2612o61384j02812
$$ 14240124 14304183 14343366 13988619 13492729 13561228 13219313 12903069 12840457 12179073 12076261
14149A2076261j20100j1992j32233k11741j44211j95711j01137l09090l71368
$$ 12076261 11956161 11944169 11811936 11600195 11455984 11260273 11159136 10850046 10478678
14140A0478678J66749l36686p6561m56486M4715N2626k83786m78506J80212k84483
$$ 10478678 10645427 10308741 10232180 9775694 9820409 9873035 9589249 9110743 9290955 9006472
14130I006472j9365n3227l290m9351l41386O5551k77060j00748j53387J10042
$$ 9006472 8987107 8933880 8930590 8881239 8539853 8605404 8328344 8227596 8074209 8184251
14120H184251k46530k68621P7908k47305k29238M9736j91655J08948P1261j6499
$$ 8184251 7937721 7669100 7747008 7499703 7270465 7320201 7128546 7237494 7308755 7292256
14110G292256j93107n08986N43554l26344l05931m753M9050k22247n0023r3269
$$ 7292256 7099149 6590163 7133717 6807373 6501442 6496689 6545739 6323492 6273469 6180200
14100F180200P5847K19678j05168o35328J87913j29305J14146k51148J10494o8662
$$ 6180200 6256047 6475725 6370557 5735229 5923142 5793837 5907983 5656835 5767329 5698667
14090E698667k36729j10385j20884L98863l15036l03748J99421n28377P01475
$$ 5698667 5461938 5351553 5230669 5629532 5314496 5010748 5210169 4681792 5383267
14081E383267l67451j99106J38862J11567m40554K16087l58061j14474L87586
$$ 5383267 5015816 4816710 4955572 5067139 4626585 4842672 4484611 4370137 4757723
14072D757723q2617p8405j34020j74317m384N0467L9482k58714r7155K32336j28224
$$ 4757723 4675106 4596701 4462681 4288364 4283980 4334447 4373929 4115215 4018060 4250396 4122172
14061D122172o0480j4079L76139L18639m76358j20976k44527k2686P8740r9975
$$ 4122172 4061692 4047613 4423752 4742391 4266033 4145057 3900530 3877844 3956584 3856609
14051C856609l7432j32473k70978J62890k0361l2899J54346M9859k44620k01149
$$ 3856609 3819177 3686704 3415726 3578616 3558255 3525356 3679702 3729561 3484941 3283792
14041C283792J5286k20912L73189M2722m78544P3095k82659K85701J63553k88184
$$ 3283792 3299078 3078166 3451355 3494077 3015533 3088628 2805969 3091670 3255223 2967039
14031B967039J36042k45272m1066K56101J55096m81546K38981j07005j69472j16535
$$ 2967039 3103081 2857809 2816743 3072844 3227940 2746394 2985375 2878370 2708898 2592363
14021B592363K41831J16473l31636J5900l4034M78747o84000K54648k68504k7540
$$ 2592363 2834194 2950667 2619031 2634931 2600897 3079644 2395644 2650292 2381788 2354248
14011B354248j50917J58280R1300O6731k25753L77955m33743M3944j41464L33080
$$ 2354248 2203331 2361611 2452911 2519642 2293889 2671844 2238101 2282045 2140581 2473661
14001B473661m15930J05409K6271p4528K60935k25565N8046k94122o2348N77676
$$ 2473661 2057731 2163140 2189411 2114883 2375818 2150253 2208299 1914177 1851829 2429505
13991B429505j51352J66136R08452K704147Q855896J9529517J4218621k3109710
$$ 2429505 2278153 2444289 3352741 6056888 14912784 34442301 48660922 25551212
13983B5551212A2181262l959875k534047q04529r36993j83635m64425j52604m36295
$$ 25551212 12181262 8221387 5687340 4882811 3945818 3762183 3297758 3145154 2708859
13974B708859K02535j56963K74511l38529j24710k41892J79669k17706j74123
$$ 2708859 2911394 2754431 3028942 2690413 2565703 2323811 2503480 2285774 2111651
13965B111651K50955J2963J5300M5639r8547J9385q5450l27638O0975J09221j09339
$$ 2111651 2362606 2375569 2390869 2436508 2337961 2357346 2271896 1944258 2005233 2114454 2005115
13954B005115R4736N3943l16021j0803J64323K00538k13428m1086j76399J68539
$$ 2005115 2099851 2153794 1837773 1826970 1991293 2191831 1978403 1937317 1760918 1929457
13944A929457j98175J0615k14789J68914J53712k29494K77821l00313O9077j44074
$$ 1929457 1731282 1741897 1527108 1696022 1849734 1620240 1898061 1597748 1666825 1522751
13934A522751L82598j04559p5487o1074J5353J00656q4284k68984q958p8076m0824
$$ 1522751 1905349 1800790 1725303 1664229 1679582 1780238 1695954 1426970 1418012 1339936 1299112
13923A299112M42690j53399K85739m06989O5510L22470l25195K04471l32725m8346
$$ 1299112 1741802 1588403 1874142 1467153 1532663 1855133 1529938 1734409 1401684 1353338
13913A353338L21587N7800j97839j25992q4896J64752j16847J39849R4237p0244
$$ 1353338 1674925 1732725 1534886 1408894 1323998 1488750 1371903 1511752 1605989 1535745
13903A535745l94880O4262j8698j98800M63317k82680M46649k58450j53737k0440
$$ 1535745 1140865 1205127 1186429 987629 1450946 1168266 1614915 1356465 1202728 1182288
13893A182288L4663M51464m35308j36913J95702J62882l60388j3646M13460m75369
$$ 1182288 1216951 1668415 1233107 1096194 1291896 1454778 1094390 1080744 1494204 1018835
13883A018835J40094K67976m90483M913j29468N40825k55134p2955K92917j91284
$$ 1018835 1158929 1426905 936422 941335 811867 1352692 1097558 1024603 1317520 1126236
13873A126236k22587N14204k20446l3820j39736M2727o27k10808K11131L31232
$$ 1126236 903649 1417853 1197407 1163587 1023851 1066578 1065951 855143 1066274 1397506
13863A397506k47165l10882K79348j64388L733o3694K25314J0528o4561J21295
$$ 1397506 1150341 839459 1118807 954419 958152 894458 1119772 1130300 1065739 1187034
13853A187034o4472j90471J56860j81006J3454L32308F03872L99779J35680l33335
$$ 1187034 1122562 932091 1088951 907945 921399 1253707 603872 1003651 1139331 805996
13843H05996K95863k29568k2845L26533K6167k87100Q2329l78718K78366k16372
$$ 805996 1101859 872291 849446 1175979 1202146 915046 997375 618657 897023 680651
13833F80651J99468j09775M1952J89749j59356L1632k58394L65324R2413k88669
$$ 680651 880119 770344 812296 1002045 842689 874321 615927 981251 1073664 784995
13823G84995k1228J71870L26229n36772J03335J19987k50891K86519k43692L33298
$$ 784995 763767 935637 1261866 725094 828429 948416 697525 984044 740352 1073650
13813A073650m82791J86433k18533L12617k54096K39997O5437R4301l04972K76168
$$ 1073650 590859 777292 558759 871376 617280 857277 922714 1017015 712043 988211
13803I88211m10534M04227D69655q731O73951M7257k39396k10477J72079k22667
$$ 988211 577677 981904 469655 460924 1134875 1182132 942736 732259 904338 681671
13793F81671j24805j7659N1957M10651k55400J42429o1784m2406J7287J41166
$$ 681671 556866 539207 591164 1001815 746415 888844 827060 784654 801941 943107
13783I43107p4125j09224j30630J90328J25098k80787M7823L9542j07819n3730
$$ 943107 868982 759758 629128 819456 944554 663767 711590 751132 643313 589583
13773E89583M1201K94314j66591N30912F01350O4916Q7783J16961j81280k8618
$$ 589583 630784 925098 758507 1289419 601350 666266 754049 871010 689730 661112
13763F61112o7221J05297P6503q6116k41662J10018J71515L57953m45468J25729
$$ 661112 593891 699188 775691 689575 447913 557931 729446 1087399 641931 767660
13753G67660l0395j21342J6700K75343C22016R9240L70467Q1968l38911M12104
$$ 767660 737265 615923 632623 907966 322016 421256 791723 873691 534780 946884
13743I46884D46952K87823j9357k43803N2702M20720C61254L91151A99520L32607
$$ 946884 446952 734775 715418 471615 524317 945037 361254 752405 199520 532127
13733E32127k11198K40304J72473l00666k6907K18394k1015K93522k06952J5647
$$ 532127 320929 561233 733706 433040 406133 624527 603512 897034 690082 705729
13723G05729l15607J34510J89156l50581M06064o0928k95131J72783j94822k0890
$$ 705729 390122 524632 713788 363207 769271 708343 413212 585995 391173 370283
13713C70283K23473k1339P1066p5457k10105J72096q3829K36008k30203J11690
$$ 370283 593756 572417 643483 568026 357921 530017 446188 682196 451993 563683
13703E63683K8884o6534a05770C51546J86884m2912J00042k36904n7127K44459
$$ 563683 592567 526033 -105770 351546 538430 495518 595560 358656 301529 545988
13693E45988J8182B49525M46617C09276J14106J38289J86547j32303K26266j32348
$$ 545988 564170 249525 696142 309276 423382 561671 748218 615915 842181 709833
13683G09833P3918l85699m5888J73399Q1928N7789l26602K08819j01204K66137
$$ 709833 783751 398052 352164 525563 607491 665280 338678 547497 446293 712430
13673G12430k68131j73386J39500o3687O20344k35058j26526j42676o3124J3783
$$ 712430 444299 270913 410413 346726 967070 732012 605486 462810 399686 413469
13663D13469M2841O8292r7078K82212l43837J60852p9577J25213m2580N1439B31703
$$ 413469 456310 524602 427524 709736 365899 526751 447174 572387 529807 581246 231703
13651C74081P1602l2523A73458K05886J23109j04203j67935L17568k15412K61040
$$ 374081 445683 413160 173458 379344 502453 398250 230315 547883 332471 593511
13641E93511A92352N91773l64905K16449k22585j66098K57021l924j80351J28641
$$ 593511 192352 784125 419220 635669 413084 246986 504007 500083 319732 448373
13631D48373L2682o6310K08282j46460j03290m5386j0552O6076A44441J9076J93749
$$ 448373 481055 414745 623027 476567 373277 327891 317339 383415 144441 163517 357266
13620C57266k4639l6678K72894k35598k3832D1653J17077L27403j0301j74418
$$ 357266 332627 295949 568843 333245 309413 41653 158730 486133 475832 301414
13610C01414K96007o9051k56185L72007C03508J38577r344j76974K73529k04356
$$ 301414 597421 528370 272185 644192 303508 442085 432741 255767 529296 324940
13600C24940Q8066j22692L00135F4388M25916j1509k34167J47037Q7493B16171
$$ 324940 413006 290314 590449 64388 490304 478795 244628 391665 479158 216171
13589F22582K8168k33854o5182L4417R7488j05876j74164L13337A57630p4563
$$ 622582 650750 416896 351714 386131 483619 377743 203579 516916 157630 83067
13579H3067M80447j56173A93873K98592r5143j76471j07069l5940J68389K85908
$$ 83067 563514 407341 193873 492465 397322 220851 113782 77842 246231 532139
13569E32139j79598J03489j86051k5323L64139j75648A04361K25338M8114j67405
$$ 532139 352541 456030 269979 244656 608795 433147 104361 329699 377813 210408
13559B10408K05927A99586r8260P8712L62446B57169f6107B19441m9491J9949
$$ 210408 416335 199586 101326 180038 542484 257169 -66107 219441 169950 189899
13549A89899K55978P675N187j71718m7559J10853j55484M29531k57559A02563
$$ 189899 445877 453552 458739 287021 239462 350315 194831 624362 366803 102563
13538B73424A29252m3157K72687J20879B15892Q5506p4122K0891K12117B997L62073
$$ 273424 129252 86095 358782 479661 215892 301398 227276 248167 460284 2997 365070
13527C65070R2802l2257J3530A39218K77819j72008R02D8306N8787K98792A46427
$$ 365070 457872 425615 439145 139218 417037 245029 245931 48306 107093 405885 146427
13515B39410b42707B08311J6594M62394A16314L45979H0465J08359m1436L7755
$$ 239410 -242707 208311 224905 687299 116314 462293 80465 188824 147388 185143
13505A85143J27993j22286p6207M04255j77885j14784L47315k34688j8651A58820
$$ 185143 313136 190850 114643 518898 341013 226229 573544 338856 320205 158820
13494A31501P9439j5550b40851A70059N0242J13988j64413G8765J84656j05163
$$ 131501 210940 195390 -240851 170059 220301 334289 169876 78765 263421 158258
13484A58258k216J56640m4997n8537P4533j25330L06801o5087K14451A73574L16843
$$ 158258 156042 312682 267685 209148 283681 158351 465152 400065 614516 173574 490417
13473D90417k04385J64180B0007R3555J29141k8917k4740L17040q6127r1766K5836
$$ 490417 286032 450212 20007 113562 242703 213786 189046 506086 419959 328193 354029
13462C54029d6638A50349C6238j0315J06048K09727j44521p9320R4190R5662p9554
$$ 354029 -46638 150349 36238 25923 131971 341698 197177 117857 212047 307709 228155
13451B28155K19239A07727D4735K43832K6786n2034n5807f2570l2179E23443k31517
$$ 228155 447394 107727 44735 288567 315353 263319 207512 -62570 -94749 523443 291926
13440B91926j21025l1886f914A85847J90268A38728K24406c8840B58178h3195
$$ 291926 170901 139015 -6914 185847 376115 138728 363134 -38840 258178 -83195
13429I4163L26076d8580B95192J3981n6367a57022D46515G7101K64285j19366
$$ 94163 420239 -48580 295192 309173 252806 -157022 446515 77101 341386 222020
13419B22020Q2964b78132E09661B07500P5287P29k688A27342P9921L08711E0721
$$ 222020 304984 -278132 509661 207500 282787 283516 280828 127342 207263 515974 50721
13407A49103J11790q5737O4496H45J09050L35322j43697O8409A79959J29176E3296
$$ 149103 260893 175156 239652 845 109895 445217 301520 369929 179959 309135 53296
13395H1959M09362D2140J38208j2379G4683J85142c3372B96949F859J22879f7423
$$ 81959 491321 42140 180348 167969 74683 259825 -33372 296949 6859 129738 -67423
13383A21483J4713P9541J39970L62899A45880J13706n2518J62590e19B86909h9819
$$ 121483 136196 215737 355707 718606 145880 259586 207068 369658 -519 286909 -89819
13371D84173j11446a78743E18246j71829j37803m6392j6036a13031B58331l0684
$$ 484173 372727 -178743 518246 346417 208614 162222 146186 -113031 258331 227647
13361B27647m5599J17136b67805B53885p2920c5304B02049K25493a9020C16668
$$ 227647 182048 299184 -267805 253885 180965 -35304 202049 427542 -19020 316668
13350B74485L14058j38279A95054H2957J28931O2032I2859l2549M78236B26884
$$ 274485 588543 450264 195054 82957 211888 273920 92859 60310 538546 226884
13339D59415A65943K99376A22740L66896A47499l9355J87812K49331B15100C4000
$$ 459415 165943 465319 122740 489636 147499 108144 295956 545287 215100 34000
13328C20593E8978i2882E49317A88382E3558M2048f2847A40527E751J9306K88852
$$ 320593 58978 -92882 549317 188382 53558 95606 -62847 140527 5751 25057 313909
13317C13909j34078F8148J74813j10610b6476B54713q3049B6071L41945j65759
$$ 313909 179831 68148 242961 132351 -26476 254713 171664 26071 368016 202257
13307B02257J3561j05453M1811K59159A64177K25390j37392M3491A42971R8834
$$ 202257 215818 110365 152176 411335 164177 389567 252175 295666 142971 241805
13297B41805J9284I6453O3530j1218m1028J44387A13831L65661M6552j14508A79756
$$ 241805 261089 96453 159983 148765 107737 252124 113831 479492 526044 411536 179756
13285D04143A40842j8033a42240C4030M19353G991J55360b19692a06887B7240
$$ 404143 140842 122809 -142240 34030 453383 7991 163351 -219692 -106887 27240
13274D759L1832a15124C02865n4559g7008B29675j09355f4814H4644J06762b34441
$$ 4759 36591 -115124 302865 248306 -77008 229675 120320 -64814 84644 191406 -234441
13262C05418I3360L53251B15820J38801C4404J01239M9640k4361f0099B44762
$$ 305418 93360 446611 215820 354621 34404 135643 185283 160922 -60099 244762
13251D4787K43731a08996A88761Q8164j10706j8815a59120A46886O6127l8302
$$ 44787 288518 -108996 188761 276925 166219 147404 -159120 146886 213013 174711
13241A74711A2334P1655P315M0351C7611J39088g9499N751B20340M3390c19377
$$ 174711 12334 83989 91304 131655 37611 176699 -79499 -73748 220340 263730 -319377
13229D6340L0372L38054G0013a90181r862C95152m6474A0497J35380L84259A60586
$$ 46340 76712 414766 70013 -190181 -200043 395152 348678 10497 145877 530136 160586
13217C09988H0391A4948a0249j7040C36862a49481B52372j04781Q2111F8556f8905
$$ 309988 80391 14948 -10249 -27289 336862 -149481 252372 147591 229702 68556 -68905
13205F0492J26969q7474P7910E7046d4995C94583r5937H0345a31191c1644B05879
$$ 60492 187461 99987 177897 57046 -44995 394583 298646 80345 -131191 -31644 205879
13193I2496D5932c5441B04261J21462l68p0166q3762d4676j09405A03324L5461
$$ 92496 45932 -35441 204261 325723 325355 255189 171427 -44676 -154081 103324 138785
13182A38785b754j17572K2206D5127L3289J53287N8250C9650L0449J77986E6565
$$ 138785 -2754 -120326 -98120 45127 78416 231703 289953 39650 70099 248085 56565
13170a10541A11748l8598K43001E8835i6100B33681J50930E1443j3869J38114
$$ -110541 111748 73150 316151 58835 -96100 233681 384611 51443 37574 175688
13160A75688f6899B1586J25365b54544A52134N2438I3156k0727L4283J64728c4775
$$ 175688 -66899 21586 146951 -254544 152134 204572 93156 72429 106712 271440 -34775
13148h7412B16035R4476c94631a40931N8693c6374A79708A7179J1282J78838H8033
$$ -87412 216035 310511 -394631 -140931 -82238 -36374 179708 17179 28461 207299 88033
13136i0565A36904k7052J05686b07764A583a37008B0510M57158j89525j24212
$$ -90565 136904 109852 215538 -207764 1583 -137008 20510 477668 288143 163931
13126A63931C1966b25024F5560a18515A38260c06242b5708G5213a67841A37956
$$ 163931 31966 -225024 65560 -118515 138260 -306242 -25708 75213 -167841 137956
13115C21076j22724R1387H9616J942c49764R0762A7168J09601K8081K38798a91335
$$ 321076 198352 289739 89616 91558 -349764 -259002 17168 126769 154850 393648 -191335
13103c85423d6929A31312i2482C8739A1497a43115b7110F0221L33979c67284B56019
$$ -385423 -46929 131312 -92482 38739 11497 -143115 -27110 60221 394200 -367284 256019
13091A02846A3045a30950G4531a05469E5103K40900g991A83826b32441E25117
$$ 102846 13045 -130950 74531 -105469 55103 296003 -7991 183826 -232441 525117
13080I4643C8802j8679J86217q5473a8073k89334b1322B82792J04826j73223i1934
$$ 94643 38802 20123 206340 120867 -18073 -307407 -21322 282792 387618 214395 -91934
13068A51767L65957A38220a51921P0297B22773a55013O944A62328m8287J59162
$$ 151767 517724 138220 -151921 -81624 222773 -155013 -148069 162328 114041 273203
13058B73203J4021j02974a6370B20852A07846A8126L1796K02404K01289k25969
$$ 273203 287224 184250 -16370 220852 107846 18126 49922 252326 453615 227646
13048B27646a65618A65363e0278A70302J11785M5794j01949m0119o3229M77312
$$ 227646 -165618 165363 -50278 170302 282087 327881 225932 185813 122584 599896
13038E99896F7459K5996Q0506E9997Q1863k8033K9009a00270A76801L08950A73770
$$ 599896 67459 93455 173961 59997 141860 113827 142836 -100270 176801 485751 173770
13026H1955K48104k1278j18569g1349A36630K91862H9782J189l1611B0069J65724
$$ 81955 330059 308781 190212 -71349 136630 428492 89782 90971 59360 20069 185793
13015A85793d48623B09006J57550d6259D40802a50578c4708I2625a3675A94016
$$ 185793 -448623 209006 366556 -46259 440802 -150578 -34708 92625 -13675 194016
13004A21903a54070L1180q6260I4010J13981F058K55639a74805C20767C5878d7422
$$ 121903 -154070 -122890 -209150 94010 207991 6058 261697 -174805 320767 35878 -47422
12992d97342b1040l13139e8985j56390D9625M15568b2646F9465a83470A50185
$$ -497342 -21040 -334179 -58985 -215375 49625 465193 -22646 69465 -183470 150185
12981D07905A61706k8637P515h1977b2701P890A0145a62819A9502K5695d8129
$$ 407905 161706 133069 140584 -81977 -22701 -14811 10145 -162819 19502 45197 -48129
12969D1813K66950c61004a24671A19850R7668o8437a18119B5654L21826a64722
$$ 41813 308763 -361004 -124671 119850 217518 149081 -118119 25654 347480 -164722
12958a3924l5721A27758O3680a22700L7227A5728K0688O28830a827A55657J12429
$$ -13924 -49645 127758 191438 -122700 -85473 15728 36416 665246 -1827 155657 268086
12947B68086j12606j3161a18979G3049b59178A56717a48335q6616B4498H41a8849
$$ 268086 155480 142319 -118979 73049 -259178 156717 -148335 -234951 24498 841 -18849
12935b26038R3420I3140f886C3633J21366a12065I3242i3941A33564l0276a6192
$$ -226038 -132618 93140 -6886 33633 154999 -112065 93242 -93941 133564 103288 -16192
12923H733c06752B64640h7244c4795j24004l0092A44505L19811a572j75890b4299
$$ 8733 -306752 264640 -87244 -34795 -158799 -188891 144505 464316 -1572 -177462 -24299
12911a52348A8256e84024A81843B6217c43262c4276H2562K38460D3110J11802
$$ -152348 18256 -584024 181843 26217 -343262 -34276 82562 321022 43110 154912
12901A54912p3019J45258K47285A89854i9508R602A70764A0683a57571B67753
$$ 154912 81893 227151 474436 189854 -99508 -89906 170764 10683 -157571 267753
12890B29661J42091j34884A01580E0395J11150p212P70d1759A37151o0432l1929
$$ 229661 371752 236868 101580 50395 161545 154333 155103 -41759 137151 76719 44790
12879D4790d6590A24357J4515a11604A5008f6256p7447c7649l5900j51073A87578
$$ 44790 -46590 124357 138872 -111604 15008 -66256 -143703 -37649 -73549 -224622 187578
12867D8279b55552B1610a03423C8188M17953F3618a41194D40537j81885j05171
$$ 48279 -255552 21610 -103423 38188 456141 63618 -141194 440537 258652 153481
12857A53481N7322D0127K4427b72841I99a37484k3832a6753o8117A59061b49695
$$ 153481 210803 40127 64554 -272841 999 -137484 -161316 -16753 -84870 159061 -249695
12845A91209l6314d0248A11810a18679a7944B55093r352d672j51533O5076C99828
$$ 191209 154895 -40248 111810 -118679 -17944 255093 245741 -4672 -156205 -91129 399828
12833A37379C2795J42820b35542C798K20239C1386J72317c30598J45708Q923e7828
$$ 137379 32795 175615 -235542 3798 224037 31386 203703 -330598 -184890 -175967 -57828
12821B22964Q0847C0923J63885a41604e6651D4811J58558a88109P3779P759j74767
$$ 222964 303811 30923 194808 -141604 -56651 44811 203369 -188109 -114330 -106571 -281338
12810b81338Q7727g908B20312B5367J93063b87010A30135C8861J61643a30424
$$ -281338 -193611 -7908 220312 25367 218430 -287010 130135 38861 200504 -130424
12799A73147b83463a2208E3874b68999B3920H451J0685C637K33290e4002B93651
$$ 173147 -283463 -12208 53874 -268999 23920 8451 19136 3637 236927 -54002 293651
12787e374j02039l1950P615A23705L19194A18730e6057j46503a3758p7252B55808
$$ -5374 -107413 -139363 -131748 123705 442899 118730 -56057 -202560 -13758 -91010 255808
12775E3677L91662k03473b9936G366J39343J30541f7923C68555E6035g9407A46973
$$ 53677 445339 241866 -29936 7366 146709 277250 -67923 368555 56035 -79407 146973
12763c73122P9452C17626j04171J90762b41842A93482a46954B39363A07378b31181
$$ -373122 -293670 317626 213455 404217 -241842 193482 -146954 239363 107378 -231181
12752b3017k42670G0945M5585a37343c3504g994A546N2687L6825k7461N7339E2601
$$ -23017 -265687 70945 116530 -137343 -33504 -7994 1546 54233 91058 63597 120936 52601
12739h6311F6016J46992G0636B9180K05410E2418J66465a04513D57431m9646H3798
$$ -86311 66016 213008 70636 29180 234590 52418 218883 -104513 457431 407785 83798
12727a40601A72252K33800A89344P468P8526o2093c805C6211J5131a34962n1050
$$ -140601 172252 406052 189344 196812 275338 213245 -3805 36211 51342 -134962 -186012
12716a86012B06375a20918r3760h5487H3394b55797B71088l8866f6233B78869
$$ -186012 206375 -120918 -214678 -85487 83394 -255797 271088 232222 -66233 278869
12705D7314J34362P5847o0842L92308k59996j7594c14900A28977K21189O3245
$$ 47314 181676 257523 196681 588989 328993 311399 -314900 128977 350166 413411
12695D13411a53022j0250P6365a7655l56645A92990a37569C40903a55770c1675
$$ 413411 -153022 -163272 -86907 -17655 -374300 192990 -137569 340903 -155770 -31675
12684a216A70665j209O9550a17218D8358K38546A15249K62286a32407d043B76614
$$ -1216 170665 169456 239006 -117218 48358 286904 115249 377535 -132407 -4043 276614
12672A00076a56237A65791D6998M4741j8210a46617A95963O8029c4510A72540
$$ 100076 -156237 165791 46998 91739 73529 -146617 195963 263992 -34510 172540
12661A44529F2947J29571o3843B3279J40076J0920m1199J6753M009f9192A36986
$$ 144529 62947 192518 128675 23279 163355 174275 133076 149829 153838 -69192 136986
12649B29672K39047c612A79594b54740b4186A01981a30711A77978d9103k12802
$$ 229672 468719 -3612 179594 -254740 -24186 101981 -130711 177978 -49103 -261905
12639b61905A29421k5488A5783K2381J30930e9303B0814P0158b6730m5186B27940
$$ -261905 129421 103933 15783 38164 169094 -59303 20814 90972 -26730 -71916 227940
12627A01668N6750b76355B36518g248B86615o0177k9138G4937j6294a69015D8162
$$ 101668 158418 -276355 236518 -7248 286615 226438 197300 74937 58643 -169015 48162
12615a38905A93839a43776d5950q7638A28095k2208a2981C6681M3154L66622I8259
$$ -138905 193839 -143776 -45950 -133588 128095 105887 -12981 36681 79835 446457 98259
12603h3612A82771F1068b50786B90395A5961A224b33038l40478I6347d364j90177
$$ -83612 182771 61068 -250786 290395 15961 1224 -233038 -573516 96347 -4364 -194541
12592a94541C52517j63834J9048L3546H5380a68687I4103N7196f1585k7731A34113
$$ -194541 352517 188683 207731 241277 85380 -168687 94103 151299 -61585 -89316 134113
12580G9205a71986p911A81665J18853Q293B9675a82799q5427A81728R7756g3552
$$ 79205 -171986 -179897 181665 300518 308811 29675 -182799 -268226 181728 279484 -73552
12568a82981A62691C1878K7116a43936A26930b04231c8198C3100J09069a38286
$$ -182981 162691 31878 58994 -143936 126930 -204231 -38198 33100 142169 -138286
12557A96129b04657A27039J49613J16795A0769J38822C0700b50332g4289l47006
$$ 196129 -204657 127039 276652 393447 10769 149591 30700 -250332 -74289 -421295
12547d21295A62711b06323F893M36324k09581b32096B22981B6880G05K50265I7290
$$ -421295 162711 -206323 6893 443217 233636 -232096 222981 26880 705 250970 97290
12535A16828a54998g0973A20113l1403C1157J98730f3470l53755A64507a39785
$$ 116828 -154998 -70973 120113 88710 31157 229887 -63470 -417225 164507 -139785
12524A16816b17234A14839c3556r2880B81824a24730F4627j1757c06676R9209
$$ 116816 -217234 114839 -33556 -126436 281824 -124730 64627 52870 -306676 -207467
12514b07467B70966J057f5295B5195a7216j20674A2452J42887B9095J65199c72989
$$ -207467 270966 272023 -65295 25195 -17216 -137890 12452 155339 29095 194294 -372989
12502a07473K6605A41766B0640J55298p1870J16509B1895J63192c09576G6776
$$ -107473 -80868 141766 20640 175938 104068 220577 21895 185087 -309576 76776
12491A70569a39868a0137j08677A15544b65550D5840k0631b33654A27782e3148
$$ 170569 -139868 -10137 -118814 115544 -265550 45840 25209 -233654 127782 -53148
12480a55119k2983B47327h4392A56618a10685n1605O3016H7919a40316M9604k39603
$$ -155119 -178102 247327 -84392 156618 -110685 -162290 -99274 87919 -140316 -90712 -330315
12469c30315A84828p7848g3310J3755a4636I128b43876A45234D5737J13553R3178
$$ -330315 184828 106980 -73310 -59555 -14636 9128 -243876 145234 45737 159290 252468
12458B52468a98572H7145a67516c9819A24421l7790a98759E531a25098j48187
$$ 252468 -198572 87145 -167516 -39819 124421 86631 -198759 5531 -125098 -273285
12448b73285A80206o8439b46856A6084O8935c19145f8162J5670l1936r497q3760
$$ -273285 180206 111767 -246856 16084 85019 -319145 -68162 -52492 -84428 -93925 -177685
12437a77685O5613l4006r1717B1902b53556h7819j2679j96015D5944K04581C0478
$$ -177685 -112072 -146078 -237795 21902 -253556 -87819 -100498 -296513 45944 250525 30478
12425a00932e0133o4561j43062b8703l8987q6624i276H7852b27363A72826G6074
$$ -100932 -50133 -114694 -257756 -28703 -67690 -154314 -9276 87852 -227363 172826 76074
12413b12025E4820e9022G94a26047I1528a21602j1873o1972C19907b2725k02985
$$ -212025 54820 -59022 794 -126047 91528 -121602 -133475 -195447 319907 -22725 -225710
12402b25710d5885B4648j1079b40118e4004j42050Q1989j10198c8098E01930j66170
$$ -225710 -45885 24648 13569 -240118 -54004 -196054 -114065 -224263 -38098 501930 335760
12391C35760E6697J58458B6738b08507I44J70293e8286A57405a79918D5967a9107
$$ 335760 56697 215155 26738 -208507 944 171237 -58286 157405 -179918 45967 -19107
12379A43221b55759A87232E8289d1921C3207J25250a00022E1630O8379h6524A9979
$$ 143221 -255759 187232 58289 -41921 33207 158457 -100022 51630 120009 -86524 19979
12367c85909E0311R9822M17535C4864a56673B12155f4531B3973a97271C37158
$$ -385909 50311 150133 567668 34864 -156673 212155 -64531 23973 -197271 337158
12356B40241A14992C346J12543K9657a11330G4136A3187K02168b35821A13270
$$ 240241 114992 3346 115889 145546 -111330 74136 13187 215355 -235821 113270
12345a16569H3087L67f283C82024H9526m0721h7578D0162J09830b89177j6095
$$ -116569 83087 83454 -6283 382024 89526 48805 -87578 40162 149992 -289177 -305272
12334c05272G9062a62546A63673c6168o7743D91342a16890A51119l2288L3841
$$ -305272 79062 -162546 163673 -36168 -103911 491342 -116890 151119 118831 152672
12324A52672b412B89610d81749h8386j3404B92444a93892A18084G776d4264k89107
$$ 152672 -2412 289610 -481749 -88386 -101790 292444 -193892 118084 7776 -44264 -333371
12313c33371a5109A46246J81756a2253H0088J99317E9553M5372c03765A8330D277
$$ -333371 -15109 146246 328002 -12253 80088 279405 59553 104925 -303765 18330 4277
12301D4003b17861P5002F4629b92258g9C520c72960a4381B27214a1235C32121
$$ 44003 -217861 -142859 64629 -292258 -79 3520 -372960 -14381 227214 -11235 332121
12289B04517a24410C37999g907E0586P9f6140b6134A40313i3350G4312e704A92633
$$ 204517 -124410 337999 -7907 50586 50665 -66140 -26134 140313 -93350 74312 -5704 192633
12276B50618h6229G5552K97398K5424b0606d348H1553D521O9716J83344J17217
$$ 250618 -86229 75552 372950 398374 -20606 -4348 81553 4521 74237 257581 374798
12265C74798G9048L32381G6910R1988D2982j9003a999A6017J63415a09176m1175
$$ 374798 79048 411429 76910 168898 42982 23979 -1999 16017 179432 -109176 -150351
12254a50351D56487C0097J25572P3269j0211L70366k66534g263j72845A9970c7535
$$ -150351 456487 30097 155669 228938 218727 589093 322559 -7263 -180108 19970 -37535
12242A59334B7044b39525d0009p7655A76499A4912J5074b22575B00595J13413
$$ 159334 27044 -239525 -40009 -117664 176499 14912 29986 -222575 200595 314008
12232C14008J38000I9605J13958J30435e2682D2923M58470F4307L98614I0926
$$ 314008 452008 99605 213563 343998 -52682 42923 501393 64307 462921 90926
12221g3718b9705B40996f7415B12069L8524I9064L8318E921J84794J52985j43504
$$ -73718 -29705 240996 -67415 212069 250593 99064 137382 5921 190715 343700 200196
12210B00196g8675B27922J41911A39147K37753r8524H5493R7951k2447L5501c8202
$$ 200196 -78675 227922 369833 139147 376900 278376 85493 183444 160997 196498 -38202
12198a02073C49827H3950N5867E3789J66088I8924a56459f6749b0073A87977n8584
$$ -102073 349827 83950 139817 53789 219877 98924 -156459 -66749 -20073 187977 129393
12187A29393K59411A94178k1845a21056A42066j4893D5629L53538i7695C89044
$$ 129393 388804 194178 172333 -121056 142066 127173 45629 399167 -97695 389044
12176b6903E62708c6036a6615A80585J32248d0614B0712J20367c5575I7584D0160
$$ -26903 562708 -36036 -16615 180585 312833 -40614 20712 141079 -35575 97584 40160
12164B95133a3160F8069L56665a33202C68948I7741J01537r5067D3792N3566A5389
$$ 295133 -13160 68069 424734 -133202 368948 97741 199278 104211 43792 97358 15389
12152a99433A89133B7886p919b99198C52311k1553j13695c8603A1667J60485R0199
$$ -199433 189133 27886 19967 -299198 352311 330758 217063 -38603 11667 172152 262351
12141B62351j08152I160b71527l3406A31919g368j4593C7189f3920L0198l4943
$$ 262351 154199 9160 -271527 -304933 131919 -7368 -21961 37189 -63920 -33722 -68665
12130f8665m2295A54713L65149a52764D0250f1812l5180H6450a85662A61047h3643
$$ -68665 -110960 154713 519862 -152764 40250 -61812 -96992 86450 -185662 161047 -83643
12118E1454J52122P0737c75179O5334B26909a20925G7407Q3811a06430a8092G3416
$$ 51454 203576 274313 -375179 -309845 226909 -120925 77407 161218 -106430 -18092 73416
12106f992p9590I6603J92121a70117A10062J34450a70745c9945F3345J24607a2769
$$ -6992 -86582 96603 288724 -170117 110062 244512 -170745 -39945 63345 187952 -12769
12094b37047B37328d1062C7268d0365j55134B5711b30754h1055a1874G0013a94153
$$ -237047 237328 -41062 37268 -40365 -195499 25711 -230754 -81055 -11874 70013 -194153
12082A80605i5345j31550N0569B6479K02382c1082A141202J162133A139659E41992
$$ 180605 -95345 -226895 -176326 26479 228861 -31082 1141202 2303335 1139659 541992
12071B45664B0774e4730k23852f7812n6669B61043a38977B48454a9401A67654
$$ 245664 20774 -54730 -278582 -67812 -124481 261043 -138977 248454 -19401 167654
12060h2185A61119J57231A01913J86204h3207c710p6938B7560a04756q1740a8496
$$ -82185 161119 318350 101913 288117 -83207 -3710 -80648 27560 -104756 -186496 -18496
12048G6856k3464B5503o236a34908e0961b2353j59673I7443a22776j1174p3802
$$ 76856 53392 25503 19267 -134908 -50961 -22353 -182026 97443 -122776 -133950 -207752
12037b07752A00272N5001b58707D6622j7755a01222k72882c2962k0835D6614e3040
$$ -207752 100272 155273 -258707 46622 28867 -101222 -374104 -32962 -53797 46614 -53040
12025B8722b92894Q9333i8204I9283k2387R8668c6783j72909o8474A58717D8879
$$ 28722 -292894 -203561 -98204 99283 76896 175564 -36783 -209692 -278166 158717 48879
12013c14574c117l1465j35073A6494b80456B45576a90257F5918R3221F7519b18609
$$ -314574 -3117 -34582 -169655 16494 -280456 245576 -190257 65918 159139 67519 -218609
12001b51419E3916J18048A4907K44014a22724B58288a52027N9257C15582a1686
$$ -251419 53916 171964 14907 258921 -122724 258288 -152027 -92770 315582 -11686
11990A83056e8440Q384j46322A54590a84361I3377e73553A50674e1353F2957e98122
$$ 183056 -58440 -50056 -196378 154590 -184361 93377 -573553 150674 -51353 62957 -598122
11978h8597B85731D6511c4320l1616k45480c6539C1657J71074a23710m2546B91661
$$ -88597 285731 46511 -34320 -65936 -311416 -36539 31657 202731 -123710 -166256 291661
11966A05267a71384q4651B02433a13199D00867a11855I1170c35859J60039B10906
$$ 105267 -171384 -256035 202433 -113199 400867 -111855 91170 -335859 -175820 210906
11955A24777C8301a53004B40733I5786b59043D590a01645A53863a28195E3715
$$ 124777 38301 -153004 240733 95786 -259043 4590 -101645 153863 -128195 53715
11944B04008p2463q487o0977c31066L5503D2283b14401q3389a237B52204a13063
$$ 204008 131545 123058 62081 -331066 -295563 42283 -214401 -297790 -1237 252204 -113063
11932D3344J5164J90411a3867l542j41994J0368H1875J38976a01441E4799c32047
$$ 43344 58508 248919 -13867 -17409 -159403 -149035 81875 220851 -101441 54799 -332047
11920D0250a01691j69862A22450B6455k63a82573h551C69851p3830i2100A26183
$$ 40250 -101691 -271553 122450 26455 26192 -182573 -8551 369851 296021 -92100 126183
11908a18008G3533O151a91429A01547a94514e7890C41672d3320j10273K7936L5016
$$ -118008 73533 79684 -191429 101547 -194514 -57890 341672 -43320 -153593 -125657 -90641
11897i0641l546A77903e1461A77981a77758P9551B23640F2848g6069j18253E9814
$$ -90641 -94187 177903 -51461 177981 -177758 -98207 223640 62848 -76069 -194322 59814
11885i6237B66343a08649G6616J3976a85690H0154b70324a23265j88469a24915
$$ -96237 266343 -108649 76616 90592 -185690 80154 -270324 -123265 -311734 -124915
11874g1698n5106n8880R0573k67451J36595b9638j7592n5339A16346a23918l7830
$$ -71698 -126804 -185684 -95111 -362562 -225967 -29638 -47230 -102569 116346 -123918 -161748
11863a61748G3438A7331M2216R2054l9828D2150J47734k6072F390b00521g1172
$$ -161748 73438 17331 59547 151601 111773 42150 189884 163812 6390 -200521 -71172
11851A78351f1833j59355e240H9647f3317r397K7298k21656D1607g1404m5796
$$ 178351 -61833 -221188 -5240 89647 -63317 -72714 -45416 -267072 41607 -71404 -117200
11840a17200I0695h3854j1481C11528a80225O1892L2932C83682m6713m6095B298
$$ -117200 90695 -83854 -95335 311528 -180225 -118333 -85401 383682 336969 290874 2298
11828D4649e2184B41292D4073a66743b5009A07186b45973p0598A26851a40061
$$ 44649 -52184 241292 44073 -166743 -25009 107186 -245973 -316571 126851 -140061
11817A49727A7689O2421J60032b57322A86148G4383J39964F5127P7722a11682
$$ 149727 17689 80110 240142 -257322 186148 74383 214347 65127 142849 -111682
11806A56463b40501H7390O4895d48250e7928r7603O7378F7286J28167q1734J51177
$$ 156463 -240501 87390 152285 -448250 -57928 -155531 -88153 67286 195453 113719 264896
11795B64896F4822c645j79340H0123J04878e8642n1856A50351i5051l01511P0066
$$ 264896 64822 -3645 -182985 80123 185001 -58642 -110498 150351 -95051 -396562 -326496
11784c26496e4347k15113H0599K93548A32066J97969c70145F3218h6680A96152
$$ -326496 -54347 -269460 80599 374147 132066 330035 -370145 63218 -86680 196152
11773E8941R9771J43824g838F4295e00062a00714b6430G761J1370R0096a78329
$$ 58941 158712 302536 -7838 64295 -500062 -100714 -26430 7761 19131 109227 -178329
11761E9831i2848m6073A05438a9534j4715A80676q5790b7599j03381n3284Q8670
$$ 59831 -92848 -138921 105438 -19534 -34249 180676 94886 -27599 -130980 -184264 -95594
11750i5594n6615k52438a42420o7557d7408j9731j766a9305B72388e422j20837
$$ -95594 -152209 -404647 -142420 -209977 -47408 -67139 -68905 -19305 272388 -5422 -126259
11739a26259m5837j03158G678M6431J46566h7634K3356p6364D4657Q9699a54842
$$ -126259 -172096 -275254 7678 54109 200675 -87634 -64278 -140642 44657 134356 -154842
11727b27312A46604O5006f7060A4263a85784q560A89920q1432m8789K47243l7401
$$ -227312 146604 211610 -67060 14263 -185784 -194344 189920 108488 59699 306942 269541
11716B69541Q8738a55129C07601D5165c7320B11981I9483g3288H9776N2695d782
$$ 269541 358279 -155129 307601 45165 -37320 211981 99483 -73288 89776 142471 -4782
11704C09883d0741C0454R2339J9201g9452j43691G1400J48184a88076D4822J19604
$$ 309883 -40741 30454 122793 141994 -79452 -223143 71400 219584 -188076 44822 164426
11693A64426L8054n4912O590a38290j9877F9958J2131M0572n6564h0286E00679
$$ 164426 202480 147568 154158 -138290 -158167 69958 82089 122661 66097 -80286 500679
11681a55495j33468C02710A30813K32414j68156b19048j71088A6736c5069A38678
$$ -155495 -288963 302710 130813 363227 195071 -219048 -390136 16736 -35069 138678
11670B60157C4657J87773E036R8910A7203a71001B69815d50045b05869A60374
$$ 260157 34657 222430 5036 103946 17203 -171001 269815 -450045 -205869 160374
11659a69852k77507b4285D43723I2526J00736b59191A60802C055K020J45354C4656
$$ -169852 -447359 -24285 443723 92526 193262 -259191 160802 3055 5075 150429 34656
11647B98762D7715e6398A42146J23239J40684B01108a9643B1751c7313C44737
$$ 298762 47715 -56398 142146 265385 406069 201108 -19643 21751 -37313 344737
11636h0443o6576C7911a66014A09330J9855A8139b14332A47135D6110n94c0804
$$ -80443 -147019 37911 -166014 109330 129185 18139 -214332 147135 46110 45516 -30804
11624A62829a67583B31615r8659N3036a06930I8031c1818J4373k0973n3937A54081
$$ 162829 -167583 231615 132956 185992 -106930 98031 -31818 -17445 -38418 -92355 154081
11612A8813M7849a16555b6738A5940J4021K780e3672D72713g5839A15382a35240
$$ 18813 66662 -116555 -26738 15940 29961 32741 -53672 472713 -75839 115382 -135240
11600A08811l1499L11269I2136J40454o4994n0787C1803N5080h376A02571K5446
$$ 108811 77312 388581 92136 232590 167596 116809 31803 86883 -8376 102571 128017
11589A28017L5752M9393N0487O631j12617e9638E4412M5868D1026f6533a6548
$$ 128017 163769 213162 263649 270280 157663 -59638 54412 100280 41026 -66533 -16548
11577f7440r3269A42958j7531P4314J37602j15474G7332J25427d6014f427B71002
$$ -67440 -160709 142958 125427 199741 337343 221869 77332 202759 -46014 -6427 271002
11565c36826A04858L7962L21930g4921n6388O1334E6401L9021b35205A10434B2550
$$ -336826 104858 142820 464750 -74921 -131309 -69975 56401 95422 -235205 110434 22550
11553a56338I0450a30837B4962D04d14716g0705a15A77113k3210N6526J01013
$$ -156338 90450 -130837 24962 404 -414716 -70705 -115 177113 153903 210429 311442
11542C11442a39172B42875J58295A42622E3363h7530k22091b9149C56343a34965
$$ 311442 -139172 242875 401170 142622 53363 -87530 -309621 -29149 356343 -134965
11531B9743J56922k584m0201c6886B96058O2153a19002L659J2426p6194K3223
$$ 29743 186665 184081 143880 -36886 296058 358211 -119002 -115343 -102917 -179111 -155888
11520a55888A91025O2327J51097a4680E0280J751g901C30656b41784C05152a06702
$$ -155888 191025 253352 404449 -14680 50280 52031 -7901 330656 -241784 305152 -106702
11508A67756L9363a27467G0823L7413L9347g7918D6380K27266h4901j2008a5786
$$ 167756 207119 -127467 70823 108236 147583 -77918 46380 273646 -84901 -96909 -15786
11496G6802M9160J81916G445O7107B0610J82007p3909K61533A05952J23944r8187
$$ 76802 125962 307878 7445 74552 20610 202617 128708 390241 105952 229896 131709
11485A31709C3484K6498L8679j352A76L90024p1924D796Q5868L21835j63207N6423
$$ 131709 33484 59982 98661 97309 176 390200 318276 4796 90664 412499 249292 305715
11473C05715b87971A45952A9743J7559R6698N0466R7664a684m3531A54591J92132
$$ 305715 -287971 145952 19743 37302 134000 184466 282130 -1684 -45215 154591 346723
11462C46723L8435D3826N4275g8723A47290h5547A16222c81890c0818C37018E9432
$$ 346723 385158 43826 98101 -78723 147290 -85547 116222 -381890 -30818 337018 59432
11450a45116A3900K53198L1696d7115C57945a50032A34271j4637R8704o7353A0915
$$ -145116 13900 267098 298794 -47115 357945 -150032 134271 119634 218338 150985 10915
11438B32866C3400H89L46164B3141J96511A4981b82595N9301a06372A28241e0784
$$ 232866 33400 889 347053 23141 219652 14981 -282595 -223294 -106372 128241 -50784
11426D3507L18346g0927G9459L066J6552L76022E5436K14126h5475B860J72286
$$ 43507 361853 -70927 79459 82525 99077 475099 55436 269562 -85475 2860 175146
11415A75146c57893a06003k07190d446H4465h1927n8577B05767G2088b16160E434
$$ 175146 -357893 -106003 -313193 -4446 84465 -81927 -140504 205767 72088 -216160 5434
11403A06047k6213j6639g1330C65508b57728A77268G3393Q2758F4392a35616j01505
$$ 106047 79834 63195 -71330 365508 -257728 177268 73393 156151 64392 -135616 -237121
11392b37121E3588M3099a6811I2901l6065b37968D9322a4385A35743a71313o4421
$$ -237121 53588 96687 -16811 92901 56836 -237968 49322 -14385 135743 -171313 -235734
11381b35734R8405A70937b5I4886b21579C30816I6349a69258B58923A03247A1249
$$ -235734 -137329 170937 -25 94886 -221579 330816 96349 -169258 258923 103247 11249
11369E2912L7260b3151j67189j29426I6233a08520j1552L345C32114A57408D7166
$$ 52912 90172 -23151 -190340 -319766 96233 -108520 -120072 -116727 332114 157408 47166
11357a78108k34264A93211a64867a8761j64611d4658J7232A6535b15250B04258
$$ -178108 -412372 193211 -164867 -18761 -183372 -44658 -27426 16535 -215250 204258
11346B53533C4316a72795j36470B94849A5265Q1171K14918a64087H6968a96286
$$ 253533 34316 -172795 -309265 294849 15265 96436 311354 -164087 86968 -196286
11335a28343j23146A36364H28K01366k4911E4133a21607e6114k07935b4691q0690
$$ -128343 -251489 136364 828 202194 177283 54133 -121607 -56114 -264049 -24691 -105381
11324a05381r604B4484K5541i2458A08533a27204N2398k10550A88232a967j5497
$$ -105381 -114985 24484 50025 -92458 108533 -127204 -74806 -285356 188232 -1967 -17464
11313a7464k2550j35646M6985R110M0814c3535A49657A8927a54243A99930a18476
$$ -17464 -40014 -175660 -128675 -119565 -78751 -33535 149657 18927 -154243 199930 -118476
11301A00349d9680j30601d7477k8441q7858J232C8265b98033b7049j77083g1286
$$ 100349 -49680 -180281 -47477 -75918 -163776 -162544 38265 -298033 -27049 -204132 -71286
11289A69882i1640c6887p7952D1255b49855A1624b5114B07911C2380i3637I6260
$$ 169882 -91640 -36887 -114839 41255 -249855 11624 -25114 207911 32380 -93637 96260
11277B2483b5931k37903A66515a59715j11323Q5858G7275a33901k35925J7932
$$ 22483 -25931 -263834 166515 -159715 -271038 -185180 77275 -133901 -369826 -351894
11267c51894G8138f8794l021l76277H1155b29938F0153b79162i1324o0097e1709
$$ -351894 78138 -68794 -71815 -448092 81155 -229938 60153 -279162 -91324 -151421 -51709
11255b15830O9916A5669a81163K3078j08023m104C30915c12042h6078H3880a8294
$$ -215830 -145914 15669 -181163 -158085 -266108 -270212 330915 -312042 -86078 83880 -18294
11243A47321A6808a59328b9279B94117c31934G7856a11899A2599d1829l256j16892
$$ 147321 16808 -159328 -29279 294117 -331934 77856 -111899 12599 -41829 -45085 -161977
11232a61977O6155I453a41825m8088E3637H919a19540n4004A8905a59377B05638
$$ -161977 -95822 9453 -141825 -189913 53637 8919 -119540 -173544 18905 -159377 205638
11220b34626g8352D2713g3464k90821C04437j33455g5853b8125A51997a89372
$$ -234626 -78352 42713 -73464 -364285 304437 170982 -75853 -28125 151997 -189372
11209a63402l1055R380o444A77632a5382k8952J1851E0654b6330r346B42099e2524
$$ -163402 -194457 -185077 -191521 177632 -15382 -44334 -32483 50654 -26330 -35676 242099 -52524
11196g1121F8910g7175B1394R7610a92918P8493A21461c14951A83231E387Q6994
$$ -71121 68910 -77175 21394 119004 -192918 -114425 121461 -314951 183231 5387 92381
11185I2381J03987a95186n7947e5836r9495G0710M1969a46936A24767J8516f462
$$ 92381 196368 -195186 -253133 -55836 -155331 70710 112679 -146936 124767 143283 -6462
11173B06644J13817a63707H235M28933e6357B24278H2667E167J92271H360J85519
$$ 206644 320461 -163707 8235 437168 -56357 224278 82667 5167 197438 8360 193879
11162A93879a00481l3869A08840m2008P8597J2512a15589k14715C2597h0211j50811
$$ 193879 -100481 -134350 108840 66832 145429 157941 -115589 -330304 32597 -80211 -231022
11151b31022B99498a11556b7572B66798a76761C03222D2015a1424j86076n2473
$$ -231022 299498 -111556 -27572 266798 -176761 303222 42015 -11424 -197500 -249973
11141b49973l133A59362K07888I1159a07029A9513L00616e3164B1922F875a91824
$$ -249973 -253106 159362 367250 91159 -107029 19513 320129 -53164 21922 6875 -191824
11129B66060i651B79417a58933A1710B404a46454A61770G7944c86968A35289B1894
$$ 266060 -9651 279417 -158933 11710 2404 -146454 161770 77944 -386968 135289 21894
11117b8978H8958h3552B3245e9273j89635G1467c53384e8963A05699R1520R9521
$$ -28978 88958 -83552 23245 -59273 -248908 71467 -353384 -58963 105699 197219 296740
11106B96740H485L922L1107J34045f2416C25563p4139j3952e5273B92509j09792
$$ 296740 8485 12407 43514 177559 -62416 325563 251424 237472 -55273 292509 182717
11095A82717g1353A69372j4780r727K0108O7180P8678n9602l0534H0104B8039
$$ 182717 -71353 169372 154592 144865 164973 232153 310831 251229 220695 80104 28039
11083B16807J83225h3863B85021j10284n3994K52221j33580n329K5536D2768K38035
$$ 216807 400032 -83863 285021 174737 120743 372964 239384 234055 259591 42768 280803
11072B80803K85308k65072F5595M7437a62488A68932J79620M3084A78523K20835
$$ 280803 566111 301039 65595 113032 -162488 168932 348552 391636 178523 399358
11062C99358K18283k14990j00532K10100J48976K05493l38608L3521M4125R8966
$$ 399358 617641 402651 302119 512219 661195 866688 528080 561601 605726 704692
11052G04692O4181k9813j11340N6772m4264L06801l32094o5348j1021J43974n3845
$$ 704692 768873 739060 627720 684492 640228 947029 614935 549587 538566 682540 628695
11041F28695J86002j78955j56858K82781j30728j12343j81344L99682j64460o562
$$ 628695 814697 635742 478884 761665 630937 518594 337250 736932 572472 565910
11031E65910j13552N6769K89885k21202j70985M09234q6696q3429j25114L05662
$$ 565910 452358 509127 799012 577810 406825 816059 729363 645934 520820 826482
11021H26482j52769j62185M18028j69724j28965k60603j23005K59801L0696j9616
$$ 826482 673713 511528 929556 759832 630867 370264 247259 507060 537756 518140
11011E18140K34496j77091L6847r0773p2983R0230K73755B62509L47563Q603B32519
$$ 518140 752636 575545 612392 521619 448636 538866 812621 262509 610072 618675 232519
10999D87899N17935l96680P0147l5731K24201k2043j46431j00817k20078J78302
$$ 487899 1005834 609154 679301 643570 867771 845728 699297 598480 378402 556704
10989E56704L69697n6679m8349m5813o726K14305J3420k04909O16516k94205L68065
$$ 556704 926401 869722 821373 775560 768834 983139 996559 791650 1408166 1113961 1482026
10978A482026j44353L14901OK19321J07819K47680O23029j59827j25786j39848
$$ 1482026 1337673 1652574 1652580 1871901 1979720 2227400 2850429 2690602 2564816 2424968
10968B424968K1627m17117l44563K12142j63112j97981o3160K98713J36303Q2854
$$ 2424968 2446595 2029478 1684915 1897057 1733945 1535964 1472804 1771517 1907820 1990674
10958A990674j75794R6915k0037N4408l64702k80031k40410J68968K53144F68659
$$ 1990674 1814880 1911795 1891758 1946166 1581464 1301433 1061023 1229991 1483135 668659
10947D46766k4592j83656J30807P3569q0690P629l2666q9964G079e3495C81315
$$ 446766 422174 238518 369325 442894 362204 369833 337167 247203 7079 -53495 381315
10935C14070j32145m8971L70425A45023Q0364a96650J0844L9832A30618a62228
$$ 314070 181925 132954 503379 145023 225387 -196650 -185806 -145974 130618 -162228
10924E6660J31562a06509H0745a55840n5722c2389j08595C5974n940d77093a43174
$$ 56660 188222 -106509 80745 -155840 -211562 -32389 -140984 35974 30034 -477093 -143174
10912a19948C1774J7836b04678d9795l9913B19633D4352c9168A57819A9318a92245
$$ -119948 31774 49610 -204678 -49795 -89708 219633 44352 -39168 157819 19318 -192245
10900f2826j1733B0989a50913F1377b87126E2556c8674E5840a13421A28283a76224
$$ -62826 -74559 20989 -150913 61377 -287126 52556 -38674 55840 -113421 128283 -176224
10888b10568a5634j69826f1617B07387o7490a32169k8806l04572A2399d1632H365
$$ -210568 -15634 -185460 -61617 207387 139897 -132169 -160975 -465547 12399 -41632 8365
10876c47996L0346c6317A20206c9412o4243B18713a24278A49901a61621j13877
$$ -347996 -317650 -36317 120206 -39412 -103655 218713 -124278 149901 -161621 -275498
10866b75498I1428b33162I5969l7912K5442J63483a81228B6756J18543a80648
$$ -275498 91428 -233162 95969 58057 83499 246982 -181228 26756 145299 -180648
10855D08367c688k71631d1834A37926b13447p8365h5495G0511c17135a13720l8945
$$ 408367 -3688 -275319 -41834 137926 -213447 -291812 -85495 70511 -317135 -113720 -152665
10844a52665A17185E7486L2509J49415b53043g7282A9828L7812L00790I0618J07256
$$ -152665 117185 57486 89995 239410 -253043 -77282 19828 57640 358430 90618 197874
10833A97874e9276j11765n4872k4233N4469B19663D7264a08878c4196n3019A23954
$$ 197874 -59276 -171041 -225913 -250146 -195677 219663 47264 -108878 -34196 -87215 123954
10821a81738f0791j90358A36289a64985A91090b45673b0809A61853L7247b75202
$$ -181738 -60791 -251149 136289 -164985 191090 -245673 -20809 161853 199100 -275202
10810a68407k9528A09588m544a5694p0846j40487e5507l9683j52264C13916b47906
$$ -168407 -197935 109588 105044 -15694 -86540 -227027 -55507 -95190 -247454 313916 -247906
10798d5678A92581h9287B91753o5498a32720q0673A02762c12972k15886B6862
$$ -45678 192581 -89287 291753 226255 -132720 -213393 102762 -312972 -528858 26862
10787b52717B23960a48322p1930a05618J9172q5172n4892E3986q388b31755B20000
$$ -252717 223960 -148322 -220252 -105618 -86446 -171618 -226510 53986 45598 -231755 220000
10775I0590b0090r8881n058j78677A05041a0124G7545d9731k1242j59426L0874
$$ 90590 -20090 -118971 -124029 -302706 105041 -10124 77545 -49731 -70973 -230399 -199525
10764a99525O3464E4729a25680j14320I8080g9777E110a62341j51313a03396A54693
$$ -199525 -136061 54729 -125680 -240000 98080 -79777 5110 -162341 -313654 -103396 154693
10752d373r9413j6001j6326J8441J8548A82560F47h6162a3241j50535b7978D83
$$ -4373 -103786 -119787 -136113 -117672 -99124 182560 647 -86162 -13241 -163776 -27978 483
10739a26308n060A52559b68328J05460k7045f5181l3779A49815R4595f7639E8161
$$ -126308 -131368 152559 -268328 -162868 -189913 -65181 -98960 149815 244410 -67639 58161
10727b07688k7029I467M2756K8940K6193a58604A48982l8255a20782l88282a73030
$$ -207688 -234717 9467 52223 81163 107356 -158604 148982 110727 -120782 -509064 -173030
10715A67821a56222q0457O6029o7632H2236a08240j12482M4954N8894l7580a4087
$$ 167821 -156222 -236679 -170650 -238282 82236 -108240 -220722 -175768 -116874 -154454 -14087
10703b76529L2034B9022J08028K767j5366F0523R755J7042H756m99M6551j5816
$$ -276529 -244495 29022 137050 139817 124451 60523 70278 87320 8756 8257 54808 38992
10691C8992b32217f5968H139a90696G8724a6824l10910B05054g7115B89664b01746
$$ 38992 -232217 -65968 8139 -190696 78724 -16824 -327734 205054 -77115 289664 -201746
10679A64884b91668M2150g7134A88023c469j48914B40050A10047K3793a18569
$$ 164884 -291668 -249518 -77134 188023 -3469 -152383 240050 110047 133840 -118569
10668A87991P8227b26608k55336A74179A4401R6334b2762A63032p8520R4848f8212
$$ 187991 266218 -226608 -481944 174179 14401 110735 -22762 163032 84512 179360 -68212
10656a03930c939A29634d6039J9077D3251g0616J3007l0507A55543a18618A93412
$$ -103930 -3939 129634 -46039 -26962 43251 -70616 -57609 -88116 155543 -118618 193412
10644i3600k67400a47235e3397k5867A85435b43411J04287j8388D04785A09500
$$ -93600 -361000 -147235 -53397 -79264 185435 -243411 -139124 -157512 404785 109500
10633b48823B03231b09661A88331c09410A36589d60023F6810c18432A68906a87950
$$ -248823 203231 -209661 188331 -309410 136589 -460023 66810 -318432 168906 -187950
10622d95064g4168A33499b898j9244j8512m6401A75599c4647D8890c4664B68357
$$ -495064 -74168 133499 -2898 -22142 -40654 -87055 175599 -34647 48890 -34664 268357
10610E693d56283H051h7511D5816a23478A6833e2087I97b5018q0467A05430b41169
$$ 5693 -456283 8051 -87511 45816 -123478 16833 -52087 997 -25018 -105485 105430 -241169
10597H2444e7064B09347e4982n2881D6432K82386h9521L4839b5584l7526j22948
$$ 82444 -57064 209347 -54982 -107863 46432 328818 -89521 -54682 -25584 -63110 -186058
10586a86058K0431A08513a55455N4242k25660o1826B83M0721d0240g907k24983
$$ -186058 -165627 108513 -155455 -101213 -326873 -388699 283 41004 -40240 -7907 -232890
10575b32890f3949A18334k694G093b83642B03517D6051a22357j17574I323J5216
$$ -232890 -63949 118334 115640 7093 -283642 203517 46051 -122357 -239931 9323 24539
10564B4539a0869l56534J78558e2933b4182k21841J06403C2646L82628a14076
$$ 24539 -10869 -367403 -188845 -52933 -24182 -246023 -139620 32646 415274 -114076
10553I0766A717h4050B75281g2076b6760n3315l8642d3301H4500f5574H1776b90302
$$ 90766 1717 -84050 275281 -72076 -26760 -80075 -118717 -43301 84500 -65574 81776 -290302
10540E0192b15246l2296a13756A87330e4294J5580B3657c4556F2310c1388E03057
$$ 50192 -215246 -247542 -113756 187330 -54294 -38714 23657 -34556 62310 -31388 503057
10528a70974A03608f1336B62820a60542B2379g0613l4748L0671B23670C2196J5883
$$ -170974 103608 -61336 262820 -160542 22379 -70613 -105361 -74690 223670 32196 48079
10517D8079a45847d4022m7027I9920a46745k5637A67525a20522A87658Q0439c6267
$$ 48079 -145847 -44022 -91049 99920 -146745 -172382 167525 -120522 187658 268097 -36267
10505a87594C6227c01951A70998J79111b34152q1697l2739j31860B92263a4037
$$ -187594 36227 -301951 170998 350109 -234152 -315849 -348588 -480448 292263 -14037
10494f1818r1119m143j13382C40377c24048A43276D8516d1113G1234K26545a8382
$$ -61818 -152937 -157080 -270462 340377 -324048 143276 48516 -41113 71234 297779 -18382
10482D48141n701L38890k93454j79132m6706j03482J07769I7422i2569A51039
$$ 448141 442440 781330 487876 308744 262038 158556 266325 97422 -92569 151039
10471B16569H2490b73722i8229B1703b65804L4068d8551B04877R7903c46186A12938
$$ 216569 82490 -273722 -98229 21703 -265804 -231736 -48551 204877 302780 -346186 112938
10459A78874i9866J7156A91313k6231C8765a86848B43041b01946N1007A63320
$$ 178874 -99866 -82710 191313 165082 38765 -186848 243041 -201946 -150939 163320
10448A50577F666a72326j41233P4279A17437M0452a93940A23008J38046f7177
$$ 150577 6666 -172326 -313559 -239280 117437 157889 -193940 123008 261054 -67177
10437e5700j23471A62215c03603R7462C776a10293A89945E4314J48896g9833B4522
$$ -55700 -179171 162215 -303603 -206141 3776 -110293 189945 54314 203210 -79833 24522
10425a49068H1624a21176l1372c4282m1003m7941l7595D8448a10929j03220N6629
$$ -149068 81624 -121176 -152548 -34282 -75285 -123226 -160821 48448 -110929 -214149 -157520
10414a57520F2139d3618m6998o4599e317n3871C26892E6302a52301n3667B76388
$$ -157520 62139 -43618 -90616 -155215 -5317 -59188 326892 56302 -152301 -205968 276388
10402a26105h837E0453a87517A19085P0673a12378C70353j60716o3928R4028q2525
$$ -126105 -8837 50453 -187517 119085 189758 -112378 370353 209637 145709 239737 157212
10391A57212P3248B1816c8784q2391b4764I0910g6665C37939I899J77358A2653
$$ 157212 230460 21816 -38784 -121175 -24764 90910 -76665 337939 9899 187257 12653
10379I6042J205L34677a7515C02988r8253O556J51855l4752p6639n0461l6899
$$ 96042 97247 431924 -17515 302988 204735 211291 363146 328394 251755 201294 164395
10368A64395O5497j5410L58187j59732Q1974A10096N7002L13582J6567K56846
$$ 164395 229892 214482 572669 412937 494911 110096 167098 480680 497247 754093
10358G54093k39328A66953L5457G7848B0200L57014P8270o1928O7540r2573j74059
$$ 754093 514765 166953 202410 77848 20200 377214 455484 393556 461096 368523 194464
10347A94464J060p2431L24336l9698L8268q5708a04232D10592l5739G0603K17120
$$ 194464 195524 123093 447429 407731 445999 360291 -104232 410592 374853 70603 287723
10336B87723e54651E0998J42675F782N0628e3666A16248L32452a89009B37521
$$ 287723 -554651 50998 193673 6782 57410 -53666 116248 448700 -189009 237521
10325B0697O2974l6230a68245A03676L12051p5486A56153O7738r8246K03432q2763
$$ 20697 83671 47441 -168245 103676 415727 340241 156153 223891 125645 329077 246314
10314B46314K5942a90005F4481a05194j39569B66294j20691J49140e2375A76008
$$ 246314 272256 -190005 64481 -105194 -244763 266294 145603 294743 -52375 176008
10303a30592B3582k978J60918c4315E4844e3586r7980G6879a22979C4423J14864
$$ -130592 23582 20604 181522 -34315 54844 -53586 -151566 76879 -122979 34423 149287
10292A49287E1566d33072P6278a9800A68264a66859C684b66866i8509D9657b00419
$$ 149287 51566 -433072 -356794 -19800 168264 -166859 3684 -266866 -98509 49657 -200419
10280A1791c20479e6146j40968F0979e4270A12654c7919C02890G1154B3418b8185
$$ 11791 -320479 -56146 -197114 60979 -54270 112654 -37919 302890 71154 23418 -28185
10268b06264A15304O1426q107b26691a3708o928A53686K80892j64035l8033K82996
$$ -206264 115304 176730 168623 -226691 -13708 -20636 153686 434578 270543 232510 515506
10257E15506r6962A34897B006J72446a115j65533A10814c22538A34408P1371i8443
$$ 515506 418544 134897 2006 174452 -1115 -166648 110814 -322538 134408 205779 -98443
10245d1161B9359J93872f5681A403a05458A62886b43323a17711G9298b9069j73610
$$ -41161 29359 223231 -65681 1403 -105458 162886 -243323 -117711 79298 -29069 -202679
10234b02679Q6340k05030a15286b604H1004M7393b66656B5468b38421B33807i9792
$$ -202679 -116339 -321369 -115286 -2604 81004 128397 -266656 25468 -238421 233807 -99792
10222c3031A3954g2521n4873F0285d22813A09862d86050C5101L4620j266a30124
$$ -33031 13954 -72521 -127394 60285 -422813 109862 -486050 35101 69721 68455 -130124
10210d0081A87625b25868l5568a184F1326a23674l2021A24094f5665D4703K07269
$$ -40081 187625 -225868 -261436 -1184 61326 -123674 -155695 124094 -65665 44703 251972
10199B51972c89E5765a14976R815C33363b22972a9203C57139B1335g05908e6774
$$ 251972 -389 55765 -114976 -105161 333363 -222972 -19203 357139 21335 -705908 -56774
10187b15965B2989M8984b80434J01519f4138a846q3988D5025a82618B23788H1082
$$ -215965 22989 71973 -280434 -178915 -64138 -1846 -85834 45025 -182618 223788 81082
10175b93813A09446b61887g0867j93514a8909e730p2096E2404c3655k9448C00796
$$ -293813 109446 -261887 -70867 -264381 -18909 -5730 -77826 52404 -33655 -63103 300796
10163h2430j60714J11640M6568r4769h8162r7326g1231l65162g2368m15587E2981
$$ -82430 -243144 -131504 -84936 -179705 -88162 -185488 -71231 -436393 -72368 -487955 52981
10151i2362n254B10589e1385G9674Q1595F8413c45112J25577N1470A28689e5421
$$ -92362 -97616 210589 -51385 79674 161269 68413 -345112 -219535 -168065 128689 -55421
10139c87087J80736e9545K6071H0192K5363b67557A39964b63460k276B74779b64744
$$ -387087 -206351 -59545 -33474 80192 105555 -267557 139964 -263460 -265736 274779 -264744
10127A01085g304r062C46001a70768b4551H2931a20413L2560A4907e1400m3831
$$ 101085 -7304 -16366 346001 -170768 -24551 82931 -120413 -87853 14907 -51400 -95231
10116i5231M5436A4030J6527e0536k53685O0386J10970A78361K67326d0777k3150
$$ -95231 -49795 14030 30557 -50536 -304221 -243835 -132865 178361 445687 -40777 -63927
10105f3927C4682f7348A22465b81554H8171O470h7403A061L15135a08981e4186
$$ -63927 34682 -67348 122465 -281554 88171 94641 -87403 1061 316196 -108981 -54186
10093b37630B78530F7995a80674k04123I4574a88969b894A78153i1405j11894
$$ -237630 278530 67995 -180674 -384797 94574 -188969 -2894 178153 -91405 -203299
10083b03299l6634A13678c31477d7878l09018A12945k7870M0614J10673a2040
$$ -203299 -239933 113678 -331477 -47878 -356896 112945 85075 125689 236362 -12040
10072e7558j32101J9558A76762A3253e6921k16973A36530g0096A13987m9329a01160
$$ -57558 -189659 -170101 176762 13253 -56921 -273894 136530 -70096 113987 64658 -101160
10060B4667J32208b15623j83800d0290j42266A30008h4666L8237j11983D9745
$$ 24667 156875 -215623 -399423 -40290 -182556 130008 -84666 -46429 -158412 49745
10049e8941m198C7053b15132Q0070A19682b16528B67742a64186j24602F1066a08266
$$ -58941 -63139 37053 -215132 -135062 119682 -216528 267742 -164186 -288788 61066 -108266
10037d28155J69123c7080j13770j11912g8906B6892a24000E14303d05889a87987
$$ -428155 -259032 -37080 -150850 -262762 -78906 26892 -124000 514303 -405889 -187987
10026H4575k2238b38683B0526J03963e3797A57551a68404Q0968L654I7382c74150
$$ 84575 62337 -238683 20526 124489 -53797 157551 -168404 -87436 -83782 97382 -374150
10014A4089a96698k3988J01247B4684L33325A12553C6828c55591a33111E8132
$$ 14089 -196698 -220686 -119439 24684 358009 112553 36828 -355591 -133111 58132
10003a0031k39760A23706P9859F654N4479L4907i4868C0520i5241o7459B23585
$$ -10031 -249791 123706 203565 6654 61133 96040 -94868 30520 -95241 -162700 223585
9991d6551k0493k38267c9173G5912b77768j0492f9980l5441j59203J26803e7351
$$ -46551 -67044 -305311 -39173 75912 -277768 -288260 -69980 -105421 -264624 -137821 -57351
9979b16447c5335l320p8032b5990A3999a54250A54059a15724A71259h9891b425
$$ -216447 -35335 -38655 -116687 -25990 13999 -154250 154059 -115724 171259 -89891 -2425
9967g3508k50006L632g3183j26425R7327A22426M837a80375H6783J94825a64038
$$ -73508 -323514 -319882 -73183 -199608 -102281 122426 127263 -180375 86783 281608 -164038
9955a77778p3995J16212B4528a32583N9243r3199j02535P5460g760F0673d318
$$ -177778 -251773 -135561 24528 -132583 -73340 -166539 -269074 -193614 -7760 60673 -4318
9943c21487C9917a61422B14319c97129a93146G7970d0458l652j87880q6327k9242
$$ -321487 39917 -161422 214319 -397129 -193146 77970 -40458 -44110 -231990 -318317 -347559
9932c47559a35486k9718B65994a75276N3703j7143j0990E8590P4039R8056g3999
$$ -347559 -135486 -165204 265994 -175276 -121573 -138716 -149706 58590 132629 230685 -73999
9920b49388N8909G6658e8881H4932c68119a52158A20865i4419A3639b83432A76758
$$ -249388 -190479 76658 -58881 84932 -368119 -152158 120865 -94419 13639 -283432 176758
9908a44113M1502k40082A5623a2665e552j16757j3640p5049A10547b94742a39523
$$ -144113 -102611 -342693 15623 -12665 -5552 -122309 -135949 -210998 110547 -294742 -139523
9896C0057a65755k31057A51596b55577H24a53654b1311j0543A70674a22129f833
$$ 30057 -165755 -396812 151596 -255577 824 -153654 -21311 -31854 170674 -122129 -6833
9884E1309K66362I9623a62034B34384j17039k6849b43349A61524b27101F1294
$$ 51309 317671 99623 -162034 234384 117345 90496 -243349 161524 -227101 61294
9873a74816j59748E2812b09789A58908a1880m7195a4719f39G9974a46977g1617
$$ -174816 -334564 52812 -209789 158908 -11880 -59075 -14719 -639 79974 -146977 -71617
9861b04156C4516K25682c70305C6122K07079o0052a41883G1021a21670j54190
$$ -204156 34516 260198 -370305 36122 243201 183149 -141883 71021 -121670 -275860
9851b75860P2013R0138k01158c2266C44730a8264A2916J39576I391a24835I3194
$$ -275860 -203847 -113709 -314867 -32266 344730 -18264 12916 152492 9391 -124835 93194
9839a01939k51496A61677a9751r3308a0317r5801B2362b94564g9042H6815m1142
$$ -101939 -353435 161677 -19751 -113059 -10317 -106118 22362 -294564 -79042 86815 45673
9828D5673J43130d21882h9637c5970j37808A32755a6686m4392j5522l51174N4211
$$ 45673 188803 -421882 -89637 -35970 -173778 132755 -16686 -61078 -76600 -427774 -373563
9817c73563Q3419C546Q8662j6923c5089k74921C2173Q2969a01260k1829D2696
$$ -373563 -290144 3546 92208 75285 -35089 -310010 32173 115142 -101260 -123089 42696
9805b43532E5540D23a60736R631L560B1985g4170j44740e1766k87800K4481c8782
$$ -243532 55540 423 -160736 -151105 -147545 21985 -74170 -218910 -51766 -339566 -315085 -38782
9792F8874a20972A08356b52554B0283J6396N8444a28569j7797n014A37677a13185
$$ 68874 -120972 108356 -252554 20283 36679 95123 -128569 -146366 -151380 137677 -113185
9780A64962d10322A8473K1115M5676b47946H5001b39943a2961G3192a88312A91365
$$ 164962 -410322 18473 39588 85264 -247946 85001 -239943 -12961 73192 -188312 191365
9768h8590H5093C9170b10567J02735j0822A86762O1453A22479m064a69636n5716
$$ -88590 85093 39170 -210567 -107832 -118654 186762 248215 122479 118415 -169636 -225352
9757b25352I9220b8618O412j55755J7649C49396a71532O1308j50791h4273j65603
$$ -225352 99220 -28618 -22206 -177961 -160312 349396 -171532 -110224 -261015 -84273 -249876
9746b49876r9521B91512e4872p2748c669A34982j2137m9048b02915p1362J00266
$$ -249876 -349397 291512 -54872 -127620 -3669 134982 122845 73797 -202915 -274277 -174011
9735a74011O3052A07339a93733i146k12992G2165b35492K3113n9382J11814M9861
$$ -174011 -110959 107339 -193733 -9146 -222138 72165 -235492 -212379 -271761 -159947 -110086
9724a10086l4243M6688j59696j40135B2599f6592j35404i4567j51123A78228a76664
$$ -110086 -144329 -97641 -257337 -397472 22599 -66592 -201996 -94567 -245690 178228 -176664
9712a37973k57390J28457m1565f9253H0241c385H7930J17593H5967a68565A45804
$$ -137973 -395363 -266906 -308471 -69253 80241 -3385 87930 205523 85967 -168565 145804
9700B18215E0264c18396P6200D1410c711A72536g3272A05798n2535Q3364C2309
$$ 218215 50264 -318396 -242196 41410 -3711 172536 -73272 105798 53263 136627 32309
9688a08730J151E4180b70827P1025A59624N9050a07958j10292Q7007D0941K69834
$$ -108730 -107579 54180 -270827 -199802 159624 218674 -107958 -218250 -131243 40941 310775
9677C10775A33011a38931L4325A10905J3449b15236B35227a06927H3101g7024
$$ 310775 133011 -138931 -104606 110905 124354 -215236 235227 -106927 83101 -77024
9666A28589g6160n2550m10329b46507F1556c02061D9185O6322M878a7354E2588
$$ 128589 -76160 -128710 -539039 -246507 61556 -302061 49185 115507 120385 -17354 52588
9654A67493n9180n51b94385A5121a48207A0464c1900H5599K05109i8787j03560
$$ 167493 108313 107762 -294385 15121 -148207 10464 -31900 85599 290708 -98787 -202347
9643b02347L1968m36987b76369D1491a21319A24874c68301i2508E7496J05630
$$ -202347 -170379 -607366 -276369 41491 -121319 124874 -368301 -92508 57496 163126
9633A63126B9422R6090b68477g8669j88521O5591C0292K25295B7524N7660g9446
$$ 163126 29422 125512 -268477 -78669 -267190 -201599 30292 255587 27524 85184 -79446
9621a57753K3109E630g0528B59629I230b41521E5590b34115A07236k3425c2506
$$ -157753 -134644 5630 -70528 259629 9230 -241521 55590 -234115 107236 83811 -32506
9609b61837L9530A55603a43565B79396j19378E5025a64327h1443k09452c2522
$$ -261837 -222307 155603 -143565 279396 160018 55025 -164327 -81443 -290895 -32522
9598b1575G1653c42926B60945m6672H3312c8902j10457k4997j48649C36660c86349
$$ -21575 71653 -342926 260945 214273 83312 -38902 -149359 -174356 -323005 336660 -386349
9586b64831O4016F6350c3570j14739B24348A3807a00334m7174F1431b44772a3662
$$ -264831 -200815 66350 -33570 -148309 224348 13807 -100334 -147508 61431 -244772 -13662
9574B0453a86143L2420j84474e0954l8021G3321a03643K7581j47831B09126a23034
$$ 20453 -186143 -153723 -338197 -50954 -88975 73321 -103643 -76062 -223893 209126 -123034
9562i7825k85018b2268k7641Q309o3854k20143J50190f585j17470o00P766a7892
$$ -97825 -382843 -22268 -49909 -41600 -105454 -325597 -175407 -6585 -124055 -124655 -116889 -17892
9549a10486B23296a76200g4647A98839b36794G0092a50728O6886l39480K06754
$$ -110486 223296 -176200 -74647 198839 -236794 70092 -150728 -83842 -423322 -216568
9539b16568h9811m8108j22984j19385J821g1350l9772a5015n6391l36796f275
$$ -216568 -89811 -137919 -260903 -380288 -378467 -71350 -111122 -15015 -71406 -408202 -6275
9527A10944a88178k4776k03315a110l22050E7983A2448i9205a0963k08951I4058
$$ 110944 -188178 -212954 -416269 -1110 -323160 57983 12448 -99205 -10963 -219914 94058
9515d60484G3326b85223c8186o7556A86573A5966J46724D4274b23340f0926B42861
$$ -460484 73326 -285223 -38186 -105742 186573 15966 162690 44274 -223340 -60926 242861
9503g7774a2213q0468A2627R6972K1280a17962l9207K8478B65335E5658K9528
$$ -77774 -12213 -92681 12627 109599 130879 -117962 -157169 -128691 265335 55658 85186
9492H5186n445P0782a46477G6639i5453M5119A03297m2888J47643e8909j22536
$$ 85186 79741 150523 -146477 76639 -95453 -50334 103297 60409 208052 -58909 -181445
9481a81445A05984b03j52259p5567d2363A68829b59812a12707h253C29503a59940
$$ -181445 105984 -203 -152462 -228029 -42363 168829 -259812 -112707 -8253 329503 -159940
9469i3246j58406L8084q4106B96923r3956c44075b2940F3069A5156a5826l35738
$$ -93246 -251652 -213568 -297674 296923 202967 -344075 -22940 63069 15156 -15826 -351564
9458c51564c525E1828J8501b55505M6688h0094j48581q614j2061A39789b27932
$$ -351564 -3525 51828 70329 -255505 -208817 -80094 -228675 -237289 -249350 139789 -227932
9446a56237K9272A35387i8227k65087a24577E5000J19627j2611g5438B31082e6945
$$ -156237 -126965 135387 -98227 -363314 -124577 55000 174627 162016 -75438 231082 -56945
9434A58710b30139H2281a41644H1657a619B50475e7484k01019n6377J1471A93594
$$ 158710 -230139 82281 -141644 81657 -1619 250475 -57484 -258503 -314880 -303409 193594
9422B36694b36762F1794a41500e60l4377l24564b6063n9057i790k28011P5196
$$ 236694 -236762 61794 -141500 -560 -34937 -359501 -26063 -85120 -9790 -237801 -162605
9411a62605n3874A77565a83133j00912i5549A78598A2863M3664b4390j44594h4467
$$ -162605 -216479 177565 -183133 -284045 -95549 178598 12863 56527 -24390 -168984 -84467
9399B8868c2851j35923A8095e0135A55337m6000e1617B43246m5003a50819M4628
$$ 28868 -32851 -168774 18095 -50135 155337 109337 -51617 243246 198243 -150819 -106191
9388a06191k61881B72551a03622K6020D1885a02278r3694B02917C1979p538a09262
$$ -106191 -368072 272551 -103622 -77602 41885 -102278 -195972 202917 31979 24441 -109262
9376A88214M371b1486c877r2355E0715g0306j09105M1582f805j65033B94634a23915
$$ 188214 192585 -21486 -3877 -96232 50715 -70306 -179411 -137829 -6805 -171838 294634 -123915
9363b83357D9067a74758c3386n3940l7801J9844B0533a60945M1852A382N9724
$$ -283357 49067 -174758 -33386 -87326 -125127 -105283 20533 -160945 -119093 1382 61106
9352F1106h0194A12279c02655e6093k9512C513Q4234D0392g2459l4965j15089
$$ 61106 -80194 112279 -302655 -56093 -85605 3513 87747 40392 -72459 -107424 -222513
9341b22513j79512g0648J8769l43812b8607k10178A11317b44457E1917P6239b64864
$$ -222513 -402025 -70648 -51879 -395691 -28607 -238785 111317 -244457 51917 128156 -264864
9329b78364a5769k7746A20949g3042B32464j06349A861M7254c80237A31603B466
$$ -278364 -15769 -43515 120949 -73042 232464 126115 1861 49115 -380237 131603 2466
9317A46016g139l64289A62309a91193B68222A14090b44275b9519p111k6069G041
$$ 146016 -7139 -371428 162309 -191193 268222 114090 -244275 -29519 -36630 -62699 7041
9305b44501H7715d23678q8421A39223b01543b1722H1921a41330E6801J13697n7621
$$ -244501 87715 -423678 -512099 139223 -201543 -21722 81921 -141330 56801 170498 112877
9294A12877h7073C6779a65126B56028a0009j17737j46943Q1318N8920B24524b6314
$$ 112877 -87073 36779 -165126 256028 -10009 -127746 -274689 -193371 -134451 224524 -26314
9282A33496K3323i2983k80867A23711c98988J81493j02579A48170Q4458i1965
$$ 133496 156819 -92983 -373850 123711 -398988 -217495 -320074 148170 232628 -91965
9271D3705J25195L1550J54089j30329J2673a38673B7994K11172B0967a08818B68504
$$ 43705 168900 200450 354539 224210 236883 -138673 27994 239166 20967 -108818 268504
9259g9898A20742c7234A78011k1719h4610B37566a43594E785O780b63224L9118
$$ -79898 120742 -37234 178011 156292 -84610 237566 -143594 5785 12565 -263224 -224106
9248b24106B3880M4795a58785B9660c98851g0049k02786E005Q6175b04653B13140
$$ -224106 23880 68675 -158785 29660 -398851 -70049 -272835 5005 91180 -204653 213140
9236A07733P1766c66496a58861B47446H9990a44450O7164A37080g674m1184B09064
$$ 107733 179499 -366496 -158861 247446 89990 -144450 -77286 137080 -7674 -48858 209064
9224a88295b3396j94160B46117a95486P3814j26388a9106m28619e2083A1044Q6188
$$ -188295 -23396 -217556 246117 -195486 -121672 -248060 -19106 -447725 -52083 11044 97232
9213I7232B5537b85423J30161D0392a5347k10845j68058a35917l93304b23541
$$ 97232 25537 -285423 -155262 40392 -15347 -226192 -394250 -135917 -529221 -223541
9202f1757F1702a57445j49170A45320a31916r0528a1253o939k39017h8096G4754
$$ -61757 61702 -157445 -306615 145320 -131916 -222444 -11253 -18192 -257209 -88096 74754
9190d3197F9996b646k44476C729e0879G794i1789j96369R7527M6984j13908J02262
$$ -43197 69996 -2646 -247122 3729 -50879 7794 -91789 -288158 -190631 -143647 -257555 -155293
9178a55293A0761c7329j62900O9023k35430G5057g4425K0199j85020L283K5976
$$ -155293 10761 -37329 -200229 -131206 -366636 75057 -74425 -54226 -239246 -235963 -209987
9167b09987B16881E4599a87267q8366A29887d01212J03803a7588n1445j6344c9559
$$ -209987 216881 54599 -187267 -275633 129887 -401212 -297409 -17588 -69033 -85377 -39559
9155b88156J17935o5597b1301o667l37712B7598a96568c1054j90838B31916b15856
$$ -288156 -170221 -235818 -21301 -27968 -365680 27598 -196568 -31054 -221892 231916 -215856
9143C54300e2132k49757M7944D6626L42829b95168c0935r9854d3352F2935i8229
$$ 354300 -52132 -301889 -253945 46626 389455 -295168 -30935 -130789 -43352 62935 -98229
9131d2109P530E9768K36025J47338a27171C9511c96865H5882P6435c64312A86506
$$ -42109 -34579 59768 295793 443131 -127171 39511 -396865 85882 162317 -364312 186506
9119E6650i4356D8247M9818b22421g494q7512A82452b65523C78885j75420p6607
$$ 56650 -94356 48247 98065 -222421 -7494 -95006 182452 -265523 378885 203465 126858
9108A26858a91759l133l636F9320J47496j00545B5029r422d82551a53490b2716
$$ 126858 -191759 -194892 -198528 69320 216816 116271 25029 15607 -482551 -153490 -22716
9096b81904a11274l3747N0535J2291b6093A6126e8232B214b47304a9414n7897
$$ -281904 -111274 -145021 -94486 -82195 -26093 16126 -58232 2214 -247304 -19414 -77311
9085g7311A0247L351b02375j6645g7428j05210D4260M3244b33102A94591a90334
$$ -77311 10247 13598 -202375 -219020 -77428 -182638 44260 87504 -233102 194591 -190334
9073e3131a4681j9399k22328E6451f538j42147d4486n7325A65252A6153j807a13020
$$ -53131 -14681 -34080 -256408 56451 -6538 -148685 -44486 -101811 165252 16153 14346 -113020
9060A91751a00549C509b93793b5401j15211b7128A97393i7106k0967A37400a23185
$$ 191751 -100549 3509 -293793 -25401 -140612 -27128 197393 -97106 -118073 137400 -123185
9048A0682J71380n7768a14278k96105a26503E0638K69078a29593j95818A2821
$$ 10682 182062 124294 -114278 -410383 -126503 50638 319716 -129593 -325411 12821
9037d181I4855a58249A42423b68820d4451j12382j26125I153O5273a23489l3473
$$ -4181 94855 -158249 142423 -268820 -44451 -156833 -282958 9153 74426 -123489 -156962
9026a56962A09089l8815b7115A75772k7898h1996a3408o1595o8960B31437e8836
$$ -156962 109089 70274 -27115 175772 147874 -81996 -13408 -75003 -143963 231437 -58836
9014C36890b53284J02355k1676B54562p3879b44554i2996O435j12559d8563k2789
$$ 336890 -253284 -150929 -172605 254562 180683 -244554 -92996 -86561 -199120 -48563 -71352
9003g1352j04284d7996m5879j07154G1176a77906n4300B60902b11760g9381j93894
$$ -71352 -175636 -47996 -93875 -201029 71176 -177906 -232206 260902 -211760 -79381 -273275
8992b73275a14150B98210h2240D6053O4482a6121A69091a34629B87610F1490H497
$$ -273275 -114150 298210 -82240 46053 110535 -16121 169091 -134629 287610 61490 8497
8980b0735B4024b64502e3933n71K5680m20069h9470A40163E0284a98982C23178
$$ -20735 24024 -264502 -53933 -54504 -28824 -448893 -89470 140163 50284 -198982 323178
8968A26139d1183d077j95882k2656d2305A70583G7182h7792E3825J77686b11109
$$ 126139 -41183 -4077 -199959 -222615 -42305 170583 77182 -87792 53825 231511 -211109
8956f1395n8997b6419j65330f3666j69417M0824A65454a7966E7205a34620F0991
$$ -61395 -120392 -26419 -191749 -63666 -233083 -192259 165454 -17966 57205 -134620 60991
8944a32858A24735d91089g3155J8693B56116m2205h292m22635A27741b59189h684
$$ -132858 124735 -491089 -73155 -54462 256116 213911 -8292 -430927 127741 -259189 -8684
8932a68508c0943R941A62521g6395B87987I0424J98292J30748M82305K878414
$$ -168508 -30943 -21002 162521 -76395 287987 90424 288716 419464 901769 3780183
8922C780183N304807J008705B567781E65067q8664q3515G2124N3196P5511D6295
$$ 3780183 9084990 10093695 2567781 565067 476403 392888 72124 125320 200831 46295
8911c3637B13556a68959P6370C77759A07685a73609c3729j50369I0641N9059K07482
$$ -33637 213556 -168959 -92589 377759 107685 -173609 -33729 -184098 90641 149700 357182
8900C57182a99864i7034A16061O7152q4521a51058j86711P0068Q7149K7364B5944
$$ 357182 -199864 -97034 116061 183213 98692 -151058 -337769 -267701 -180552 -153188 25944
8888C0139b7404H5735K8550a51444n0864L5148n6152j5822i2618k03309a41016
$$ 30139 -27404 85735 114285 -151444 -202308 -167160 -223312 -239134 -92618 -295927 -141016
8876B72358B4041a08760c8308p3279e2916j40396Q3455q3412k43815a96201j41171
$$ 272358 24041 -108760 -38308 -111587 -52916 -193312 -109857 -193269 -437084 -196201 -337372
8865c37372I2117J51408b89771A8547J69264I795J94744l8215a64830e5974g691
$$ -337372 92117 243525 -289771 18547 187811 9795 204539 166324 -164830 -55974 -7691
8853c9936j81432A64538a50560K6687b0307j91512f2639I2743O2579f9117B21299
$$ -39936 -221368 164538 -150560 -123873 -20307 -211819 -62639 92743 155322 -69117 221299
$$ [...]
##END NTUPLES=NMR SPECTRUM
##END=
