##TITLE=AC1610_PANGH13340_8317028_0kdhY4ZLGg
##JCAMPDX= 6.0         $$ Bruker NMR JCAMP-DX V2.0
##DATA TYPE= NMR SPECTRUM
##DATA CLASS= NTUPLES
##ORIGIN= BRUKER
##OWNER= Administrator
$$ 1.72 TOPSPIN		Version 2.1
$$ 2013-11-10 01:36:21.133 -0800  Administrator@X
$$ Compression mode = diff/dup
##.OBSERVE FREQUENCY= 400.02188249412
##.OBSERVE NUCLEUS= ^1H
##.ACQUISITION MODE= SIMULTANEOUS (DQD)
##.ACQUISITION SCHEME= undefined
##.AVERAGES= 64
##.DIGITISER RES= 22
##SPECTROMETER/DATA SYSTEM= spect
##.PULSE SEQUENCE= noesygpps1d.comp
##.SOLVENT NAME= COFFEE_meoh
##.SHIFT REFERENCE= INTERNAL, COFFEE_meoh, 1, 14.96091
##AUDIT TRAIL= $$ (NUMBER, WHEN, WHO, WHERE, PROCESS, VERSION, WHAT)
$$ ##TITLE= Audit trail, TOPSPIN		Version 2.1
$$ ##JCAMPDX= 5.01
$$ ##ORIGIN= Bruker BioSpin GmbH
$$ ##OWNER= Administrator
$$ $$ E:\/data/COFFEE/nmr/AC1610_PANGH13340_8317028_0kdhY4ZLGg/12/pdata/1/auditp.txt
$$ ##AUDIT TRAIL=  $$ (NUMBER, WHEN, WHO, WHERE, PROCESS, VERSION, WHAT)
(   1,<2013-11-10 01:36:16.180 -0800>,<Administrator>,<X>,<go>,<TOPSPIN 2.1>,
      <created by zg
	started at 2013-11-10 01:24:46.303 -0800,
	POWCHK enabled, PULCHK disabled,
       configuration hash MD5:
       C8 4E 4E 5D D3 5C D8 9E 9F 52 82 E0 59 8A DE 15
       data hash MD5: 64K
       26 8E B6 30 DE 46 3D 07 F1 19 36 45 7F B0 17 84>)
(   2,<2013-11-10 01:36:19.118 -0800>,<Administrator>,<X>,<proc1d>,<TOPSPIN 2.1>,
      <Start of raw data processing
       efp LB = 0.3 FT_mod = 6 PKNL = 1 PHC0 = 0 PHC1 = 0 SI = 128K 
       data hash MD5: 128K
       97 02 FC AA 29 FA E9 97 3A 2D 73 80 77 C2 E9 5D>)
(   3,<2013-11-10 01:36:20.118 -0800>,<Administrator>,<X>,<proc1d>,<TOPSPIN 2.1>,
      <pk PHC0 = -87.28088 PHC1 = 0 
       data hash MD5: 128K
       14 4E E8 67 F1 A3 00 3B AA 1E AB 9D 89 6E D6 A1>)
(   4,<2013-11-10 01:36:20.586 -0800>,<Administrator>,<X>,<proc1d>,<TOPSPIN 2.1>,
      <abs ABSG = 1 
       data hash MD5: 128K
       96 F7 36 A5 F2 1D DF CB 22 54 1C DD 4D 65 37 0A>)
(   5,<2013-11-10 01:36:20.696 -0800>,<Administrator>,<X>,<proc1d>,<TOPSPIN 2.1>,
      <abs ABSG = 2 
       data hash MD5: 128K
       CD 6A DC F0 F0 1E B6 12 A8 4D DE B2 CC 14 6B DA>)
(   6,<2013-11-10 01:36:20.774 -0800>,<Administrator>,<X>,<proc1d>,<TOPSPIN 2.1>,
      <abs ABSG = 3 
       data hash MD5: 128K
       24 6B DD 24 B9 43 45 14 9A 48 0B E9 24 9F C6 34>)
(   7,<2013-11-10 01:36:20.868 -0800>,<Administrator>,<X>,<proc1d>,<TOPSPIN 2.1>,
      <abs ABSG = 4 
       data hash MD5: 128K
       F0 CD 92 29 49 4E 70 C3 0B 90 0B AB 6C 5A 12 60>)
(   8,<2013-11-10 01:36:20.961 -0800>,<Administrator>,<X>,<proc1d>,<TOPSPIN 2.1>,
      <abs ABSG = 5 
       data hash MD5: 128K
       37 D6 04 94 2E 94 C2 31 62 06 91 66 39 28 94 A5>)
$$ ##END=
$$ 
$$ $$ hash MD5
$$ $$ A8 E7 72 6C 49 66 CB A8 68 34 BF 72 81 60 BC 71
##$RELAX= 
##$RELAX= 
##$RELAX= 
##$RELAX= 
##$RELAX= 
##$RELAX= 
##$RELAX= 
##$RELAX= 
$$ Bruker specific parameters
$$ --------------------------
##$DU= <E:\>
##$EXPNO= 12
$$ [...]
##$TP07= 0
##$TPNAME0= <>
##$TPNAME1= <>
##$TPNAME2= <>
##$TPNAME3= <>
##$TPNAME4= <>
##$TPNAME5= <>
##$TPNAME6= <>
##$TPNAME7= <>
##$TPOAL= (0..7)
0.5 0.5 0.5 0.5 0.5 0.5 0.5 0.5
##$TPOFFS= (0..7)
0 0 0 0 0 0 0 0
##$TUNHIN= 0
##$TUNHOUT= 0
##$TUNXOUT= 0
##$USERA1= <user>
##$USERA2= <user>
##$USERA3= <user>
##$USERA4= <user>
##$USERA5= <user>
##$V9= 5
##$VALIST= <valist>
##$VCLIST= <CCCCCCCCCCCCCCC>
##$VD= 0
##$VDLIST= <DDDDDDDDDDDDDDD>
##$VPLIST= <PPPPPPPPPPPPPPP>
##$VTLIST= <TTTTTTTTTTTTTTT>
##$WBST= 1024
##$WBSW= 4
##$XGAIN= (0..3)
0 0 0 0
##$XL= 0
##$YL= 0
##$YMAX_a= 5922559
##$YMIN_a= -12188587
##$ZGOPTNS= <>
##$ZL1= 120
##$ZL2= 120
##$ZL3= 120
##$ZL4= 120
##$ABSF1= 14.96091
##$ABSF2= -5.597272
##$ABSG= 5
##$ABSL= 3
##$ALPHA= 0
##$AQORDER= 0
##$ASSFAC= 0
##$ASSFACI= 0
##$ASSFACX= 0
##$ASSWID= 0
##$AUNMP= <proc_prof1d_extract.lims>
##$AXLEFT= 0
##$AXNAME= <>
##$AXNUC= <1H>
##$AXRIGHT= 0
##$AXTYPE= 0
##$AXUNIT= <>
##$AZFE= 0.1
##$AZFW= 0.1
##$BCFW= 0
##$BC_mod= 0
##$BYTORDP= 0
##$COROFFS= 0
##$CY= 15
##$DATMOD= 1
##$DC= 0
##$DFILT= <>
##$DTYPP= 0
##$F1P= 0
##$F2P= 0
##$FCOR= 0.5
##$FTSIZE= 131072
##$FT_mod= 6
##$GAMMA= 0
##$GB= 0
##$INTBC= 1
##$INTSCL= 1
##$ISEN= 128
##$LB= 0.3
##$LEV0= 0
##$LPBIN= 0
##$MAXI= 10000
##$MC2= 0
##$MEAN= 0
##$ME_mod= 0
##$MI= 0
##$NCOEF= 0
##$NC_proc= -2
##$NLEV= 6
##$NOISF1= 0
##$NOISF2= 0
##$NSP= 0
##$NTH_PI= 0
##$NZP= 0
##$OFFSET= 14.96091
##$PC= 1
##$PHC0= -87.28088
##$PHC1= 0
##$PH_mod= 1
##$PKNL= yes
##$PPARMOD= 0
##$PPDIAG= 0
##$PPIPTYP= 0
##$PPMPNUM= 2147483647
##$PPRESOL= 1
##$PSCAL= 4
##$PSIGN= 0
##$PYNMP= <proc.py>
##$REVERSE= no
##$SF= 400.020009673497
##$SI= 131072
##$SIGF1= 0
##$SIGF2= 0
##$SINO= 400
##$SIOLD= 131072
##$SPECTYP= <>
##$SREGLST= <1H.CDCl3>
##$SSB= 0
##$STSI= 131072
##$STSR= 0
##$SW_p= 8223.68421052631
##$SYMM= 0
##$S_DEV= 0
##$TDeff= 65536
##$TDoff= 0
##$TI= <>
##$TILT= no
##$TM1= 0
##$TM2= 0
##$TOPLEV= 0
##$USERP1= <user>
##$USERP2= <user>
##$USERP3= <user>
##$USERP4= <user>
##$USERP5= <user>
##$WDW= 1
##$XDIM= 131072
##$YMAX_p= 444453526
##$YMIN_p= -11669
##$CURPLOT= <Network HP LaserJet P1505>
##$CURPRIN= <$Network HP LaserJet P1505>
##$DFORMAT= <normdp>
##$LAYOUT= <+/1D_H.xwp>
##$LFORMAT= <normlp>
##$PFORMAT= <normpl>
##$SURQMSG= 1
$$ End of Bruker specific parameters
$$ ---------------------------------
##NTUPLES= NMR SPECTRUM
##VAR_NAME=  FREQUENCY,     SPECTRUM/REAL,   SPECTRUM/IMAG
##SYMBOL=    X,             R,               I
##VAR_TYPE=  INDEPENDENT,   DEPENDENT,       DEPENDENT
##VAR_FORM=  AFFN,          ASDF,            ASDF
##VAR_DIM=   131072,        131072,          131072
##UNITS=     HZ,            ARBITRARY UNITS, ARBITRARY UNITS
##FACTOR=    0.0627417313425164, 1,          1
##FIRST=     8223.62146879497, 2830,         -57639
##LAST=      0,             4147,            -57949
##MIN=       0,             -11669,          0
##MAX=       8223.62146879497, 444453526,    0
$$ Real data points
##PAGE= N=1
##DATA TABLE= (X++(R..R)), XYDATA
$$ [...]
63915C988919k73558k70958k65093k55949k43152k27300k09774j91601j73083
$$ 3988919 3715361 3444403 3179310 2923361 2680209 2452909 2243135 2051534 1878451
63906A878451j54423j36157j18913j03044q8715p6091o5255n5949m7610m0003
$$ 1878451 1724028 1587871 1468958 1365914 1277199 1201108 1135853 1079904 1032294 992291
63896I92291l3617k9050k6017k3445k0845j8948j8554j9254j9976k0327k0608
$$ 992291 958674 929624 903607 880162 859317 840369 821815 802561 782585 762258 741650
63885G41650k0773k0308j9151j7848j6664j5240j3348j1247r128o810m250j746
$$ 741650 720877 700569 681418 663570 646906 631666 618318 607071 597943 591133 586883 585137
63873E85137O10L163O050Q814J0927J2302J3135J3771J4780J6540J8429J9117
$$ 585137 585747 588910 594960 603774 614701 627003 640138 653909 668689 685229 703658 722775
63861G22775J8091J6364J5194J4617J3779J2267J0387Q453O425M301K243L16j549
$$ 722775 740866 757230 772424 787041 800820 813087 823474 831927 838352 842653 844896 845212 843663
63848H43663l268m704o054p810j0157j2694j4898j6733j8539k0388k1836k2530
$$ 843663 840395 835691 829637 821827 811670 798976 784078 767345 748806 728418 706582 684052
63836F84052k2810k3323k4113k4528k4185k3525k3075k2604k1567k0039j8560
$$ 684052 661242 637919 613806 589278 565093 541568 518493 495889 474322 454283 435723
63825D35723j7253j5821j4331j3273j2721j2100j0928r361p801o492n652n470
$$ 435723 418470 402649 388318 375045 362324 350224 339296 329935 322134 315642 309990 304520
63813C04520n737n824n274m176k899j798j167j083j203j057o19j64K21N70N36
$$ 304520 298783 292959 287685 283509 280610 278812 277645 276562 275359 274302 273683 273519 273740 274310 274846
63798B74846k83j519k244k154j936k215k817l281l461l322k765j990j515j559
$$ 274846 274563 273044 270800 268646 266710 264495 261678 258397 254936 251614 248849 246859 245344 243785
63784B43785j861k279k947l578l402k197q15j70k23l35r8N51J401J765Q90q79
$$ 243785 241924 239645 236698 233120 229718 227521 226706 226536 226313 225978 225880 226431 227832 229597 230487 229608
63768B29608k026j575l01L97K26j58l76m76l20K13O03K26n98r26n59k32m02o67
$$ 229608 227582 226007 225706 226103 226329 226171 225795 225319 224999 225212 225815 226041 225443 224517 223958 223726 223324 222657
63750B22657n82l12j62j6L44P25P35L31o4K4P01J663K535L221L767L966L436K261
$$ 222657 222075 221763 221601 221585 221929 222654 223389 223720 223656 223680 224381 226044 228579 231800 235567 239533 242969 245230
63732B45230J137O04N03N26Q50J719K722L126K869K605K775L138L334L384L497
$$ 245230 246367 246971 247474 248000 248850 250569 253291 256417 259286 261891 264666 267804 271138 274522 278019
63717B78019L704L877L875L523K673J403J29n93m94Q8L21l57j506k079j667r74
$$ 278019 281723 285600 289475 292998 295671 297074 297203 296610 296116 296204 296525 296168 294662 292583 290916 289942
63701B89942q06j042j087r06r24j086p45L78J705K547K900L211L639L900L726
$$ 289942 289136 288094 287007 286101 285177 284091 283346 283724 285429 287976 290876 294087 297726 301626 305352
63686C05352L237K815K737K905K923K458J572O90J91J2k52p88j192q69J40J058
$$ 305352 308589 311404 314141 317046 319969 322427 323999 324689 324880 324892 324640 323852 322660 321791 321931 322989
63670C22989J249R14N95L64p2o42r19q07o95q82j319j906k568l026l051k953l232
$$ 322989 324238 325152 325747 326111 326039 325397 324478 323671 322976 322094 320775 318869 316301 313275 310224 307271 304039
63653C04039l754l938l763l763l911l453k234j273j441k285k746k426j605n31
$$ 304039 300285 296347 292584 288821 284910 281457 279223 277950 276509 274224 271478 269052 267447 266916
63639B66916N74J356J719K064K604K963K916K981L619M460M890M939M889M591
$$ 266916 267490 268846 270565 272629 275233 278196 281112 284093 287712 292172 297062 302001 306890 311481
63625C11481L944L597M235N495O419O742O962P418Q113R195J0792J2463J3585
$$ 311481 315425 319022 323257 328752 335171 341913 348875 356293 364406 373601 384393 396856 410441
63612D10441J4208J4922J6090J7830K0424K3818K7027K8910K9525K9818L0156
$$ 410441 424649 439571 455661 473491 493915 517733 544760 573670 603195 633013 663169
63601F63169K9978K8802K6567K3000J7685J0987M132j815o360r025r415q158o890
$$ 663169 693147 721949 748516 771516 789201 800188 804320 802505 796145 787120 777705 769547 762657
63588G62657o834p954r690j1834j4364j7042j9622k1939k3612k4132k3526k2438
$$ 762657 755823 747869 738179 726345 711981 694939 675317 653378 629766 605634 582108 559670
63576E59670k1307j9924j7977j5527j2808r982p319n096l180j180Q81K528L505
$$ 559670 538363 518439 500462 484935 472127 462145 454826 449730 446550 445370 446251 448779 452284
63563D52284M032M302M367M546N190O017O375O357O768P779Q576Q780R332J1293
$$ 452284 456316 460618 464985 469531 474721 480738 487113 493470 500238 508017 516593 525373 534705 545998
63549E45998J4436J7790K0906K3981K7139L0398L3921L7593M0444M1110L8696
$$ 545998 560434 578224 599130 623111 650250 680648 714569 752162 792606 833716 872412
63538H72412L2914K3928J2805J829o521j1139j2583j2070j0685r291q364p763
$$ 872412 905326 929254 942059 943888 937367 926228 913645 901575 890890 881599 873235 865472
63526H65472p171p027q445j2036j7125k2463k7330l1579l4821l6235l5419l3105
$$ 865472 858301 851274 842829 830793 813668 791205 763875 732296 697475 661240 625821 592716
63514E92716l0521k8151k5554k2455j9446j7170j5359j3305j1098r484q571p530
$$ 592716 562195 534044 508490 486035 466589 449419 434060 420755 409657 400173 391602 384072
63502C84072n968m705m611n279n576n140m504l945l155k070j235r56p36j5R61
$$ 384072 378104 373399 368788 363509 357933 352793 348289 344344 341189 339119 337884 336928 336192 336177 337138
63487C37138J500J431J132P45N7p94j146o34K92J114J998L246M405M689M139L530
$$ 337138 338638 340069 341201 341946 342003 341209 340063 339429 339721 340835 342833 346079 350484 355173 359312 362842
63471C62842L083K181N30j184k259k836l315l545l315l059l349l989m300l974
$$ 362842 365925 368106 368636 367452 365193 362357 359042 355497 352182 349123 345774 341785 337485 333511
63457C33511l070j552M42K197L068L257L363L440L260L161L673M534N065N373
$$ 333511 330441 328889 329331 331528 334596 337853 341216 344656 347916 351077 354750 359284 364349 369722
63443C69722O194P563Q631Q922Q818Q685Q559Q791R984J1983J3962J5823J8478
$$ 369722 375916 383479 392110 401032 409850 418535 427094 435885 445869 457852 471814 487637 506115
63430E06115K2208K5665K7127K6033K2771J7903J2283P309M092K725K853M545
$$ 506115 528323 553988 581115 607148 629919 647822 660105 667414 671506 674231 677084 681629
63418F81629Q000J2821J8105K3014K6952K9737L1839L3944L5759L5834L2994K7481
$$ 681629 689629 702450 720555 743569 770521 800258 832097 866041 901800 937634 970628 998109
63406I98109K0276J2096L652l766q928j1629j2476j2066j0969j0075j0181j1435
$$ 998109 1018385 1030481 1034133 1030367 1021439 1009810 997334 985268 974299 964224 954043 942608
63394I42608j3735j7284k2105k7283l1437l3840l4688l4445l3492l2097l0229
$$ 942608 928873 911589 889484 862201 830764 796924 762236 727791 694299 662202 631973
63383F31973k7592k4238k0837j7894j5208j2581j0537r505q741o996m079r79J542
$$ 631973 604381 580143 559306 541412 526204 513623 503086 493581 484840 477844 473765 472786 474328
63370D74328L606N548P377R002J0348J1228J1612J1942J2707J3765J4759J6041
$$ 474328 477934 483482 490859 499861 510209 521437 533049 544991 557698 571463 586222 602263
63358F02263J8396K1801K5219K7758K9426L0661L1765L2958L4279L5097L4242
$$ 602263 620659 642460 667679 695437 724863 755524 787289 820247 854526 889623 923865
63347I23865L0918K5319J8274J0743L647k362p110j0557j2365j2377j1407j0826
$$ 923865 954783 980102 998376 1009119 1012766 1010404 1003294 992737 980372 967995 956588 945762
63335I45762j1236j2299j3887j6522k0299k4322k7670l0202l1804l1732k9606
$$ 945762 934526 922227 908340 891818 871519 847197 819527 789325 757521 725789 696183
63324F96183k6418k3535k1025j7948j4109j0394p284m164o79J945J757j933p745
$$ 696183 669765 646230 625205 607257 593148 582754 575470 571306 570627 572572 574329 572396 564651
63311E64651j3356j7092j8655j8703j7956j6726j5132j3431j1830j0164q228o334
$$ 564651 551295 534203 515548 496845 478889 462163 447031 433600 421770 411606 403378 397044
63299C97044n039m270l260j640o2O17L39m13j463k884m344n246n447n281m928
$$ 397044 392005 387735 384475 382835 382773 383390 383729 383316 381853 378969 374625 369379 363932 358651 353723
63284C53723m357l867l880m140l915l188k780k955k826j752m71J0j13rL23L08
$$ 353723 349366 345499 341619 337479 333564 330376 327596 324641 321815 320063 319592 319602 319489 319480 319803 320111
63268C20111J17N03J419J928J670J326J428J702J904K313L024L563L744M076M825
$$ 320111 320228 320731 322150 324078 325748 327074 328502 330204 332108 334421 337445 341008 344752 348828 353653
63253C53653N373N136M496M238M547N154N974O965P787Q255Q849J0210J2279J4374
$$ 353653 359026 364162 368658 372896 377443 382597 388571 395536 403323 411578 420427 430637 442916 457290
63239D57290J5929J6864J7530J8527K0223K2123K3316K3764K4547K6298K8139
$$ 457290 473219 490083 507613 526140 546363 568486 591802 615566 640113 666411 694550
63228F94550K8876K8626K8337K8221K7759K7008K6789K7454K8425K9125K9618
$$ 694550 723426 752052 780389 808610 836369 863377 890166 917620 946045 975170 1004788
63217A004788L0133L0526L0496K9859K8443K6074K2649J7960J1605L692m584j1739
$$ 1004788 1034921 1065447 1095943 1125802 1154245 1180319 1202968 1220928 1232533 1236225 1231641 1219902
63205A219902j7422k2440k7349l1743l4971l6834l7303l6259l3952l1139k8328
$$ 1219902 1202480 1180040 1152691 1120948 1085977 1049143 1011840 975581 941629 910490 882162
63194H82162k5275k1638j7696j3984j0548p010l317J00K816M799O369P936R789
$$ 882162 856887 835249 817553 803569 793021 786011 782694 782794 785610 790409 796778 804714 814503
63181H14503J1907J4042J5985J7698J9124K0051K0334K0097J9605J9030J8413
$$ 814503 826410 840452 856437 874135 893259 913310 933644 953741 973346 992376 1010789
63170A010789J7694J6647J5016J2867J0645Q575O086K181l422r766j5413j9673
$$ 1010789 1028483 1045130 1060146 1073013 1083658 1092233 1098319 1100500 1097078 1087312 1071899 1052226
63158A052226k2972k6102k9333l2320l4524l5596l5427l4129l2045k9623k7225
$$ 1052226 1029254 1003152 973819 941499 906975 871379 835952 801823 769778 740155 712930
63147G12930k5000k2906k0733j8355j5993j4097j2756j1512r994q419p119n862
$$ 712930 687930 665024 644291 625936 609943 595846 583090 571578 561584 553165 546046 540184
63135E40184m278k705j894j793j463l93Q02J355J411J608K173K977M064N511P003
$$ 540184 535906 533201 531307 529514 528051 527658 528460 529815 531226 532834 535007 537984 542048 547559 554562
63120E54562Q086Q683Q966Q906Q378P512O498N257L717K280J527J484J589J365
$$ 554562 562648 571331 580297 589203 597581 605093 611591 616848 620565 622845 624372 625856 627445 628810
63106F28810Q80N18N38P89P38l1j181j747j168L4Q42Q18L17j65m63o79r16j119
$$ 628810 629690 630208 630746 631535 632273 632242 631061 629314 628146 628180 629022 629840 630157 629992 629529 628850 627934 626815
63088F26815j075p14l36l10n05m42RN60J193K306L944N525O633P484Q266Q716
$$ 626815 625740 625026 624690 624380 623875 623433 623442 624002 625195 627501 631445 636970 643603 651087 659353 668069
63072F68069Q780Q977R555J0007J0057J0428J1747J3362J4289J4871J6388J9193
$$ 668069 676849 685826 695381 705388 715445 725873 737620 750982 765271 780142 796530 815723
63060H15723K2344K5076K7673L0724L4295L8046M1674M5083M8500N2348N6647
$$ 815723 838067 863143 890816 921540 955835 993881 1035555 1080638 1129138 1181486 1238133
63049A238133O0714O3854O6074O7700O8745O9193O9467O9847O9877O9121O8128
$$ 1238133 1298847 1362701 1428775 1496475 1565220 1634413 1703880 1773727 1843604 1912725 1980853
63038A980853O7778O8080O8464O8927O9698P0076O8811O5566O0857N4622M6019
$$ 1980853 2048631 2116711 2185175 2254102 2323800 2393876 2462687 2528253 2589110 2643732 2689751
63027B689751L4798K1566O651j0104k7973m5042n9838p2268q2540r0141r4558
$$ 2689751 2724549 2746115 2752766 2742662 2714689 2669647 2609809 2537541 2455001 2364860 2270302
63016B270302r6043r4970r1268q5205p7994p0776o3449n5259m6144l6847k7957
$$ 2270302 2174259 2079289 1988021 1902816 1824822 1754046 1690597 1635338 1589194 1552347 1524390
63005A524390j9437j0987k492N759J3077J8844K3112K6438K9175L1308L2994L4577
$$ 1524390 1504953 1493966 1491474 1497233 1510310 1529154 1552266 1578704 1607879 1639187 1672181 1706758
62993A706758L5914L6324L5560L4273L3279L2755L2308L1310K9015K4946J9472
$$ 1706758 1742672 1778996 1814556 1848829 1882108 1914863 1947171 1978481 2007496 2032442 2051914
62982B051914J3414O949n44r379j8940k8418l7465m5882n3299n9544o4626o8128
$$ 2051914 2065328 2072277 2071733 2062354 2043414 2014996 1977531 1931649 1878350 1818806 1754180 1686052
62970A686052o9309o8238o6039o3561o0459n6192n1242m6646m2808l9381l6030
$$ 1686052 1616743 1548505 1482466 1418905 1358446 1302254 1251012 1204366 1161558 1122177 1086147
62959A086147l2813l0047k8143k7162k6377k4812k2540k0754k0135j9888j8992
$$ 1086147 1053334 1023287 995144 967982 941605 916793 894253 873499 853364 833476 814484
62948H14484j7696j7005j7194j7634j7802j7671j7244j6376j5038j3403j1684
$$ 814484 796788 779783 762589 744955 727153 709482 692238 675862 660824 647421 635737
62937F35737j0143r039q338p720o997o226n365m307l316k802k528j770n18L71
$$ 635737 625594 616555 608217 600497 593500 587274 581909 577602 574286 571484 568956 567186 566668 567039
62923E67039N30O51J198J575J246P99Q71Q61j91k016l473m130m434m639m602m478
$$ 567039 567569 568220 569418 570993 572239 573038 573909 574770 574579 572563 569090 564960 560526 555887 551285 546807
62907E46807m640m982n109n133n467n917n817m987l858k740j707j047r98j123
$$ 546807 542167 537185 532076 526943 521476 515559 509742 504755 500897 498157 496450 495403 494405 493282
62893D93282p63j16J1m69p44m19j35m94j092j140n43J36M40M23L93O17J095J543
$$ 493282 492519 492403 492414 491945 491201 490782 490647 490153 489061 487921 487378 487514 487954 488377 488770 489387 490482 492025
62875D92025J618J203M43l63q80r38q44j161j956k582k540k160k005j970j569
$$ 492025 493643 494846 495289 494926 494046 493108 492264 491103 489147 486565 484025 481865 479860 477890 476321
62860D76321q23k33K9K32M54N05M26N06P59Q82Q43R52J278J416J077N16K47N03
$$ 476321 475498 475265 475294 475526 475980 476485 476911 477417 478176 479058 479901 480853 482131 483547 484624 485140 485387 485890
62842D85890R88J115N06n69j413j676j640j623j523j254j126j323j453j184r42
$$ 485890 486878 487993 488499 487930 486517 484841 483201 481578 480055 478801 477675 476352 474899 473715 472773
62827D72773j239j680j414l93O17J215J711K341K878L209L575M070M410M452M427
$$ 472773 471534 469854 468440 468047 468664 469879 471590 473931 476809 480018 483593 487663 492073 496525 500952
62812E00952M503M542M479M534M976N853P008Q031Q432Q205Q029Q429R037R281
$$ 500952 505455 509997 514476 519010 523986 529839 536847 544878 553310 561515 569544 577973 587010 596291
62798E96291R489J0469J2174J3681J4583J5409J6573J7828J9147K1206K4463K8420
$$ 596291 605780 616249 628423 642104 656687 672096 688669 706497 725644 746850 771313 799733
62786G99733L2416L6610M1662M7771N4544O1501O8345P5030Q1881Q9370R7407
$$ 799733 832149 868759 910421 958192 1012736 1074237 1142582 1217612 1299493 1388863 1486270
62775A486270J05079J11361J15796J18245J18322J15421J09102R9230Q6000P0031
$$ 1486270 1591349 1702710 1818506 1936751 2055073 2170494 2279596 2378826 2464826 2534857
62765B534857N2187L3056J2849p992k8417m7305o4071p8519r0381r9349j05398
$$ 2534857 2587044 2620100 2632949 2624957 2596540 2549235 2485164 2406645 2316264 2216915 2111517
62754B111517j08724j09498j08005j04881j00861r6319r1207q5416p9042p2363
$$ 2111517 2002793 1893295 1785290 1680409 1579548 1483229 1392022 1306606 1227564 1155201
62744A155201o5797n9815n4704n0339m6224m1890l7275l2795k8963k5865k3082
$$ 1155201 1089404 1029589 974885 924546 878322 836432 799157 766362 737399 711534 688452
62733F88452k0239j7529j5429j3980j2581j0639q200n925m455l838l454k598j179
$$ 688452 668213 650684 635255 621275 608694 598055 589855 583930 579475 575637 572183 569585 568406
62720E68406K48J200J758K213K654L218M413O544R019J0923J2265J3998J6616
$$ 568406 568654 569854 571612 573825 576479 579697 584110 590654 599673 610596 622861 636859 653475
62707F53475J9501K2030K4687K8436L3283L8214M2542M6779N1847N7806O3688
$$ 653475 672976 695006 719693 748129 781412 819626 862168 908947 960794 1018600 1082288
62696A082288O8572P2435P5840P9021Q1578Q2888Q2455P9899P5055O8181N9602
$$ 1082288 1150860 1223295 1299135 1378156 1459734 1542622 1625077 1704976 1780031 1848212 1907814
62685A907814M9059L5970K0639M554j0945k5786m0278n3637o4360p1858p6905
$$ 1907814 1956873 1992843 2013482 2018036 2007091 1981305 1941027 1887390 1823030 1751172 1674267
62674A674267q0439q2654q3300q2170p9167p4519o9074o3780n8792n3718m8750
$$ 1674267 1593828 1511174 1427874 1345704 1266537 1192018 1122944 1059164 1000372 946654 897904
62663H97904m4698m1691l8719l5003l1050k7798k5276k2833k0336j8287j6891
$$ 897904 853206 811515 772796 737793 706743 678945 653669 630836 610500 592213 575322
62652E75322j5654j4036j2095j0277q913q042p612p636q064q506q307p141n430
$$ 575322 559668 545632 533537 523260 514347 506305 498693 491057 482993 474487 466180 459039 453609
62639D53609l945l008k353j707j104n71Q4R57J812K270K085J230m4j160j643j659
$$ 453609 449664 446656 444303 442596 441492 440921 441005 441962 443774 446044 448129 449359 449315 448155 446512 444853
62623D44853j827k326k579j996p31N23J302J702K105K735L499M244N122O423P904
$$ 444853 443026 440700 438121 436125 435394 435917 437219 438921 441026 443761 447260 451504 456626 463049 470953
62608D70953Q732Q578Q456R658J1988J3935J4716J5276J6828J9323K1987K4731
$$ 470953 479685 488263 496719 506377 518365 532300 547016 562292 579120 598443 620430 645161
62596F45161K8107L2247L6693M1147M5657M9928N3232N5201N6233N6680N5986
$$ 645161 673268 705515 742208 783355 829012 878940 932172 987373 1043606 1100286 1156272
62585A156272N3010M7223L9272L0285K0842J0763j19j1290k1710l0560l7647m3224
$$ 1156272 1209282 1256505 1295777 1326062 1346904 1357667 1357548 1346258 1324548 1293988 1256341 1213117
62573A213117m7567n0705n2392n2358n0724m8120m5273m2533l9850l7075l4106
$$ 1213117 1165550 1114845 1062453 1010095 959371 911251 865978 823445 783595 746520 712414
62562G12414l0934k7747k4838k2286j9926j7726j5827j4052j1866r247p059n973
$$ 712414 681480 653733 628895 606609 586683 568957 553130 539078 527212 517965 510906 504933
62550E04933n521m892m229m118m225l580k194j141q64o25LL16j38m75K64J522
$$ 504933 499412 494520 490291 486173 481948 478368 476174 475033 474169 473544 473547 473863 473725 473250 473514 475036
62534D75036J988J363M65j21m39m09K85J510K690L760N367P862J0626J2784J4245
$$ 475036 477024 478387 478852 478731 478292 477883 478168 479678 482368 486128 491495 499357 509983 522767 537012
62519E37012J5656J7631K0338K3667K7396L1137L4472L7349M0209M3433M6665
$$ 537012 552668 570299 590637 614304 641700 672837 707309 744658 784867 828300 874965
62508H74965M8985M9817M9378M8095M5905M2421L7416L0864K2849J3949N341k117
$$ 874965 923950 973767 1023145 1071240 1117145 1159566 1196982 1227846 1250695 1264644 1269985 1267868
62496A267868q693j4970k0406k3612k4108k2858k0804j7748j3188p456j440M429
$$ 1267868 1259175 1244205 1223799 1200187 1176079 1153221 1132417 1114669 1101481 1094025 1092585 1097014
62484A097014J0384J6877K4265L2481M0651M7481N2476N6379O0057O3248O4760
$$ 1097014 1107398 1124275 1148540 1181021 1221672 1269153 1321629 1378008 1438065 1501313 1566073
62473A566073O3327N7963M8227L5043K0938Q515j569j0901k1710l5085n0105o4078
$$ 1566073 1629400 1687363 1735590 1770633 1791571 1800086 1798517 1787616 1765906 1730821 1680716 1616638
62461A616638p4063p8954q0203q0066p9312p7121p2920o7409o1677n5997m9879
$$ 1616638 1542575 1463621 1383418 1303352 1224040 1146919 1073999 1006590 944913 888916 839037
62450H39037m3012l5796k9083k3493j8945j4913j1143p916n467l490j560K99J880
$$ 839037 796025 760229 731146 707653 688708 673795 662652 654736 649269 645779 644219 644518 646398
62437F46398L440N424P598R018R047P990O522M804K496o06m229p830j0969j3440
$$ 646398 649838 655262 662860 671878 680925 688915 695437 700241 702737 702131 697902 690072 679103 665663
62423F65663j5192j6195j6370j5694j4366j2844j1654j1072j0946j0875j0548
$$ 665663 650471 634276 617906 602212 587846 575002 563348 552276 541330 530455 519907
62412E19907r880q962p997p273o867o389n412m206l600l851m188l885l218k769
$$ 519907 510027 501065 493068 485795 478928 472539 467127 462921 459321 455470 451282 447397 444179 441410
62398D41410k354j425j83P50J460K489L518L569K638J983K324K836K502J570J034
$$ 441410 439056 437631 437448 438198 439658 442147 445665 449234 451872 453855 456179 459015 461517 463087 464121
62383D64121J374K400L677M532M388L722L921N550P422Q141P829P557P725Q011
$$ 464121 465495 467895 471572 476104 480492 484214 488135 493685 501107 509248 517077 524634 532359 540370
62369E40370Q356Q992R780J0477J1424J3046J4946J6464J7938K0477K4454K9118
$$ 540370 548726 557718 567498 577975 589399 602445 617391 633855 651793 672270 696724 725842
62357G25842L3710L8151M2564M6847N0866N4413N6822N7265N5551N2109M7185
$$ 725842 759552 797703 840267 887114 937980 992393 1049215 1106480 1162031 1214140 1261325
62346A261325M0601L2448K3406J4269N539k407r338j5411k1000k6144l0568l4154
$$ 1261325 1301926 1334374 1357780 1372049 1377588 1375181 1365843 1350432 1329432 1303288 1272720 1238566
62334A238566l6940l8618l8636l6883l3883l0284k6567k3183k0444j8147j5890
$$ 1238566 1201626 1163008 1124372 1087489 1053606 1023322 996755 973572 953128 934981 919091
62323I19091j3856j2723j2710j3333j4339j6208j9226k2539k4755k5335k4896
$$ 919091 905235 892512 879802 866469 852130 835922 816696 794157 769402 744067 719171
62312G19171k4224k3526k2664k1668k0617j9297j7382j4955j2491j0220p960n806
$$ 719171 694947 671421 648757 627089 606472 587175 569793 554838 542347 532127 524167 518361
62300E18361m496m485n004m761l562k409j932j596p78K57R75J533K417L602M721
$$ 518361 513865 509380 504376 499615 496053 493644 491712 490116 489338 489595 490570 492103 494520 498122 502843
62285E02843N628O281O526O591P223Q727J0272J0896J0799J0899J1508J2218J2783
$$ 502843 508471 514752 521278 527869 535092 543819 554091 564987 575786 586685 598193 610411 623194
62272F23194J3199J3184J2513J1690J1430J1548J1273J0625J0513J1350J2512
$$ 623194 636393 649577 662090 673780 685210 696758 708031 718656 729169 740519 753031
62261G53031J3389J4264J5936J8990K3539K9083L4590L9271M3289M7162N0667
$$ 753031 766420 780684 796620 815610 839149 868232 902822 942093 985382 1032544 1083211
62250A083211N3100N4373N4736N3464M9083M1345L1942K2736J4190N983j854r246
$$ 1083211 1136311 1190684 1245420 1298884 1347967 1389312 1421254 1443990 1458180 1464163 1462309 1453063
62238A453063j6767k5006l3599m1567m8304n3697n7558n9596n9777n8196n4866
$$ 1453063 1436296 1411290 1377691 1336124 1287820 1234123 1176565 1116969 1057192 998996 944130
62227I44130n0074m4704l9661l5090l0627k6285k2545j9665j7354j5210j3103
$$ 944130 894056 849352 809691 774601 743974 717689 695144 675479 658125 642915 629812
62216F29812j1045r104p592o961p210p536p063n831m749m305l821k405l88R45
$$ 629812 618767 609663 602071 595110 587900 580364 573301 567470 562721 558416 554595 552190 551802 552747
62202E52747J074R33J550K717L609M035M362M643M704M856N571O555P014O885
$$ 552747 553821 554754 556304 559021 562630 566665 571027 575670 580374 585230 590801 597356 604370 611255
62188F11255O914P481Q164Q684R339J0163J0518J0041R317R013Q869Q194O929
$$ 611255 618169 625650 633814 642498 651837 662000 672518 682559 691876 700889 709758 717952 724881
62175G24881N627M644L939L564L806M926P000R984J3667J7626K1539K5522K9926
$$ 724881 730508 735152 739091 742655 746461 751387 758387 768371 782038 799664 821203 846725 876651
62162H76651L4791L9529M3175M4939M4640M2644L9308L4607K8436K1178J3678
$$ 876651 911442 950971 994146 1039085 1083725 1126369 1165677 1200284 1228720 1249898 1263576
62151A263576O674M68m953r807j4448j9073k3456k7175l0012l1904l2654l2112
$$ 1263576 1270250 1270718 1265765 1255958 1241510 1222437 1198981 1171806 1141794 1109890 1077236 1045124
62139A045124l0562k8508k6135k3305j9967j6245j2271q463n696m485m100l328
$$ 1045124 1014562 986054 959919 936614 916647 900402 888131 879668 873972 869487 865387 862059
62127H62059k134j739k781m269m880m565m208m118l661k211J07K625M623N491
$$ 862059 859925 858186 855405 851136 846256 841691 837483 833365 829704 827493 827600 830225 834848 840339
62113H40339M741K274j303m766p012p848p887p608o922n853n131n480o656p818
$$ 840339 845080 847354 846051 841285 834273 826425 818538 810930 804008 798155 793024 787544 780888 773070
62099G73070q621r226r384q436o369m034k114n26R03J904K316K553L060L733M232
$$ 773070 764449 755223 745839 737403 731034 727000 724886 724360 725263 727167 729483 732036 735096 738829 743061
62084G43061M522M778N088N548O333P428Q578R769J1367J3503J5641J7078J7746
$$ 743061 747583 752361 757449 762997 769330 776758 785336 795105 806472 819975 835616 852694 870440
62071H70440J8210J8944J9790K0174J9925J9747K0565K2260K3617K3897K3936
$$ 870440 888650 907594 927384 947558 967483 987230 1007795 1030055 1053672 1077569 1101505
62060A101505K4916K6581K7501K6874K4992K2059J7798J2413O839J537l947r795
$$ 1101505 1126421 1153002 1180503 1207377 1232369 1254428 1272226 1284639 1291478 1293015 1289068 1279273
62048A279273j5152j9265k2629k6281l0474l4642l8188m0771m2205m2639m2503
$$ 1279273 1264121 1244856 1222227 1195946 1165472 1130830 1092642 1051871 1009666 967027 924524
62037I24524m1889m0406l7940l5134l2593l0127k7299k4320k1774j9777j7952
$$ 924524 882635 842229 804289 769155 736562 706435 679136 654816 633042 613265 595313
62026E95313j6077j4294j2709j1193r625q092o850o111n788n502n037m572m288
$$ 595313 579236 564942 552233 541040 531415 523323 516473 510362 504574 499072 494035 489463 485175
62013D85175l932l329k959l337m009l980l078k036j182j03J182J847J538J115
$$ 485175 481243 477914 474955 471618 467609 463629 460551 458515 457333 457230 458412 460259 461797 462912
61999D62912J514K585L588M149M196L612K556J577R72M81m5m06p24j604l192m827
$$ 462912 464426 467011 470599 474748 478944 482556 485112 486689 487661 488142 488097 487691 486967 485363 482171 477344
61983D77344o025p004p767p693o694n833n920o243n642m137k692j909j779k128
$$ 477344 471319 464315 456548 448855 442161 436328 430408 424165 418523 414386 411694 409785 408006 405878
61969D05878k551k378j532q63r48j189q33j52K72O46J330J764J240K17k99k59
$$ 405878 403327 400949 399417 398554 397606 396417 395584 395432 395704 396350 397680 399444 400684 400901 400602 400343
61953D00343l16m97k92K45O89J223K225L143L130K652L021M348N390N693O357
$$ 400343 400027 399530 399238 399483 400172 401395 403620 406763 409893 412545 415566 419914 425304 430997 437354
61938D37354Q194J0409J1876J2610J3165J3430J2968J2036J1308J0799R868Q293
$$ 437354 445548 455957 467833 480443 493608 507038 520006 532042 543350 554149 564017 572310
61926E72310O762O031N905N408L909J837k5j618l497n644p177p499p008o246n005
$$ 572310 579072 585103 591008 596416 600325 602162 602137 600519 597022 591378 584201 576702 569694 563448 558443
61911E58443k957n30J559L221M685N745O212O656P762R122R633Q899P423N607
$$ 558443 555486 554956 556515 559736 564421 570166 576378 583034 590796 599918 609551 618450 625873 631480
61897F31480L508J438j52j399k770m113m879n204n815o779p270o745n534m124
$$ 631480 634988 636426 636274 634875 632105 627992 623113 617909 612094 605315 598045 591300 585766 581642
61883E81642k774j960k248l427m546n211o104p839r968j1510j1883j1056r399
$$ 581642 578868 576908 574660 571233 566687 561476 555372 547533 537565 526055 514172 503116 493717
61870D93717p655o530n928n088l698k350j641j312o97M34J814L112M192N079N939
$$ 493717 486062 479532 473604 468516 464818 462468 460827 459515 458818 459252 461066 464178 468370 473449 479388
61855D79388O962Q191R611J1227J2857J4131J5047J6171J7801J9308J9929J9856
$$ 479388 486350 494541 504152 515379 528236 542367 557414 573585 591386 610694 630623 650479
61843F50479J9677J9093J7292J4419J1552R057O182K568j004l816o127q285r831
$$ 650479 670156 689249 706541 720960 732512 741569 747751 750319 749315 745499 739372 731087 721256
61830G21256j0204r610q391o232k804J163M420O526Q013R320J0286J0568R959
$$ 721256 711052 701442 693051 686819 684015 685178 689598 696124 704137 713457 723743 734311 744270
61817G44270Q223N225J416k233n085p485j0168j3149j5468j6252j5748j4887j3993
$$ 744270 752493 757718 759134 756901 751816 744331 734163 721014 705546 689294 673546 658659 644666
61804F44666j2515j0257q120p117p138p342p403p587p872p853p535p404p603p643
$$ 644666 632151 621894 613774 606657 599519 592177 584774 577187 569315 561462 553927 546523 538920 531277
61790E31277p138o273n406m627l893l176k430j738j429j656k007k009j824j920
$$ 531277 524139 517866 512460 507833 503940 500764 498334 496596 495167 493511 491504 489495 487671 485751
61776D85751k211k175j677j062n20n0J65L8L6N49J032P63K94R59K798M306M532
$$ 485751 483540 481365 479688 478626 478106 478056 478221 478259 478295 478844 479876 480639 480933 481892 484690 488996 493528
61759D93528M275M607N352N784N904O136O384O237N694N070M439L615K448P48
$$ 493528 497803 502410 507762 513546 519450 525586 531970 538207 543901 548971 553410 557025 559473 560221
61745E60221j601m147n944o523o412o354o453o410o108n568m793m013l728m060
$$ 560221 558620 554473 548529 542006 535594 529240 522787 516377 510269 504701 499908 495895 492167 488107
61731D88107m441m223l324k101r65k64n2J77R93K179K859K671K153J834J700J746
$$ 488107 483666 479443 476119 474018 473053 472789 472737 472914 473907 476086 478945 481616 483769 485603 487303 489049
61715D89049K202K784K592J398K56J63P08P69O0p71j180j177r69q23j063j698
$$ 489049 491251 494035 496627 498025 498281 498444 499152 499921 499981 499210 498030 496853 495884 495061 493998 492300
61699D92300k227k190j750j361j238j451k163l263m132m289m069m184m770n271
$$ 492300 490073 487883 486133 484772 483534 482083 479920 476657 472525 468236 464167 459983 455213 449942
61685D49942n168m503l810l715m395n271n484m797l754k911k377k100k084k100
$$ 449942 444774 440271 436461 432746 428351 423080 417596 412799 409045 406134 403757 401657 399573 397473
61671C97473j787j221q61p47m35M3Jp57j363j023o5P52J327K012K815L549M251
$$ 397473 395686 394465 393604 392857 392422 392465 392466 391709 390346 389323 389258 390010 391337 393349 396164 399713 403964
61654D03964M879M995M427L839L962M570M786M101K646Q56m98n56O53J781J555
$$ 403964 408843 413838 418265 422104 426066 430636 435422 439523 442169 443025 442527 441971 442624 444405 445960
61639D45960L46m15j08N49P45M94K20J76L87P27R04P79O73R79J459J346J71j742
$$ 445960 446306 445891 445783 446332 447077 447571 447791 447967 448354 449081 449985 450764 451437 452416 453875 455221 455392 453650
61621D53650l618m783n018m621m175m022m054m028l960m024m322m820n319n477
$$ 453650 450032 445249 440231 435610 431435 427413 423359 419331 415371 411347 407025 402205 396886 391409
61607C91409n084m407l922l767l809m121m764n102m242k345p52l90q62j394j884
$$ 391409 386325 381918 377996 374229 370420 366299 361535 356433 352191 349846 349094 348704 347842 346448 344564
61592C44564k465k856k857k791k877k732k169j761j935k197j994j692j773j778
$$ 344564 342099 339243 336386 333595 330718 327986 325817 324056 322121 319924 317930 316238 314465 312687
61578C12687j102l00m16j252j463m18J047J814J648R93L32j29m83q87j110o15
$$ 312687 311585 311285 310869 309617 308154 307736 308783 310597 312245 313238 313570 313441 312958 312071 310961 310346
61562C10346N77J628J953J983K293K561K244J683J568J711J462J021J208K060
$$ 310346 310923 312551 314504 316487 318780 321341 323585 325268 326836 328547 330009 331030 332238 334298
61548C34298K711K726K500K266J722Q06n1o09j064j382j209o10j18R8M62J143
$$ 334298 337009 339735 342235 344501 346223 347029 346978 346369 345305 343923 342714 342104 341986 342084 342546 343689
61532C43689J661J576J048M81N3j97k89l84n82o75n21m86r29j444j343q20p46
$$ 343689 345350 346926 347974 348455 348508 348311 348022 347638 347056 346381 345860 345374 344445 343001 341658 340838 340092
61515C40092j304j646j200m47l8J33N07J052J392J394J210R59O64L91K16J51J88
$$ 340092 338788 337142 335942 335495 335457 335590 336097 337149 338541 339935 341145 342104 342768 343159 343375 343526 343714
61498C43714L17N69J014J584J788J105l1k41J178L124L899L194K041J154L82k87
$$ 343714 344031 344600 345614 347198 348986 350091 350060 349819 350997 354121 358020 361214 363255 364409 364791 364504
61482C64504l94R4N93R18J625K921M095M510M490M612M784M488L615K495J379
$$ 364504 364110 364204 364797 365715 367340 370261 374356 378866 383356 387968 392752 397240 400855 403350 404729
61467D04729L65m50j075j676k230k415k025j326p74o16q56j327j677j558r98l93
$$ 404729 405094 404644 403569 401893 399663 397248 395223 393897 393123 392507 391651 390324 388647 387089 386091 385698
61451C85698j9K15M74P14P46M31k05q83j201j088q79p84n04J65P58P34L68L34
$$ 385698 385679 385894 386368 387082 387828 388259 388054 387171 385970 384882 384003 383219 382715 382880 383638 384372 384740 385074
61433C85074N54L12n29j241j317j063q58n48K4M98M95K69M26J152J946K087J369
$$ 385074 385628 385940 385411 384170 382853 381790 380932 380384 380408 380906 381401 381670 382096 383248 385194 387281 388650
61416C88650N43P90K350L860L669J776k08r95q32o84r57j408j706j666j290q81
$$ 388650 389193 389983 392333 396193 399862 401638 401430 400435 399603 398919 397962 396554 394848 393182 391892 391011
61400C91011p96r08o83J9O30O38L00K90Q68J640K031J801J182O06K88J70K41O15
$$ 391011 390215 389307 388624 388643 389273 389911 390211 390501 391369 393009 395040 396841 398023 398629 398917 399087 399328 399943
61382C99943J181J568J766K208K911L111K405J660J912K833L327L244L290L441
$$ 399943 401124 402692 404458 406666 409577 412688 415093 416753 418665 421498 424825 428069 431359 434800
61368D34800K874J595P89J083J657J595J125Q65P63N01K43L10O25J023J591K264
$$ 434800 437674 439269 440058 441141 442798 444393 445518 446383 447146 447647 447890 448200 448825 449848 451439 453703
61352D53703K644K635K681L012L268L255L375L789L889L210K215J589J301J007
$$ 453703 456347 458982 461663 464675 467943 471198 474573 478362 482251 485461 487676 489265 490566 491573
61338D91573P97Q86J043R95R34J016Q46J74m26l34L2k06j033j701k002k459l140
$$ 491573 492370 493256 494299 495294 496228 497244 498090 498264 497838 497504 497536 497330 496297 494596 492594 490135 486995
61321D86995l282k331o89Q76K088L071L878M460M884N271N629N999O703Q226J0618
$$ 486995 483713 481382 480693 481569 483657 486728 490606 495066 499950 505221 510850 516849 523552 531778 542396
61306E42396J3185J5015J5995J6936J8443J9853J9879J8146J5514J2819J0041
$$ 542396 555581 570596 586591 603527 621970 641823 661702 679848 695362 708181 718222
61295G18222O954L907J384p51k999n406p505q952r859j0511j1060j1485j1703
$$ 718222 725176 729083 730467 729716 726717 721311 713806 704854 694995 684484 673424 661939 650236
61282F50236j1726j1726j1789j1574j0519q553o376m838m176l920l428k461j352
$$ 650236 638510 626784 614995 603421 592902 584349 577973 573135 568959 565039 561611 559150 557798
61269E57798o07l06r2J47J3o12r84l82Q45J932L076M970P125P932O848N273M573
$$ 557798 557191 556885 556793 556940 556953 556341 555357 554975 555820 557752 560828 565798 572923 580855 587703 592976 597549
61252E97549M274L115J100m65o22L88J699K559K614K002J151K45q84k177l106
$$ 597549 601823 604938 606038 605573 604951 605339 607038 609597 612211 614213 615364 615609 614725 612548 609442
61237F09442l308l046k745k478k215k090k007j523m21R56K290L667N074O149O858
$$ 609442 606134 603088 600343 597865 595650 593560 591553 590030 589609 590565 592855 596522 601596 607745 614603
61222F14603P751R031J0069J0401J0522J0938J1119J0345R096Q541Q857R095Q630
$$ 614603 622354 631385 641454 651855 662377 673315 684434 694779 703875 712416 721273 730368 738998
61209G38998P803P017O100M872L770L492M212N366O107O066N709N835O689P881
$$ 738998 746801 753818 759918 764790 768560 772052 776264 781630 787737 793803 799512 805347 812036 819917
61195H19917R166J0703J2342J3373J3449J3079J2626J1464Q875N358K201O8j325
$$ 819917 829083 839786 852128 865501 878950 892029 904655 916119 924994 930352 932553 932621 931296
61182I31296k447l669n371p491r202r749r530r583j0223j0965j1515j2034j2466
$$ 931296 928849 925180 919809 912318 903116 893367 883837 874254 864031 853066 841551 829517 817051
61169H17051j2539j2400j2424j2410j1886j1186j1280j2311j3266j3365j2961
$$ 817051 804512 792112 779688 767278 755392 744206 732926 720615 707349 693984 681023
61158F81023j2642j2293j1580j0735j0188r820r052p493n170k462q9J153J041
$$ 681023 668381 656088 644508 633773 623585 613765 604713 597220 592050 589588 589499 590652 591693
61145E91693J01j027k134l274m393n387o223o728o570n674m413l140j860n49N22
$$ 591693 591794 590767 588633 585359 580966 575579 569356 562628 556058 550384 545971 542831 540971 540422 540944
61130E40944J156J656K489L683M974O343P997R807J1274J2301J3578J5809J8696
$$ 540944 542100 543756 546245 549928 554902 561245 569242 579049 590323 602624 616202 632011 650707
61117F50707K1048K2035K2072K2318K3437K5058K6353K6901K6855K6510K5946
$$ 650707 671755 693790 715862 738180 761617 786675 813028 839929 866784 893294 919240
61106I19240K5070K3847K2314K0390J7876J4773J1558Q765O286L376l77m465q111
$$ 919240 944310 968157 990471 1010861 1028737 1043510 1055068 1063833 1070119 1073495 1073118 1068653 1060542
61093A060542j1211j4171j7022j9345k0986k2216k3129k3463k3128k2430k1614
$$ 1060542 1049331 1035160 1018138 998793 977807 955591 932462 908999 885871 863441 841827
61082H41827k0685j9758j9047j8325j7023j5114j3271j1860j0450q731p139o074
$$ 841827 821142 801384 782337 764012 746989 731875 718604 706744 696294 687563 680424 674350
61070F74350n078l533j752n81j87J00Q87K287M194O362Q272R457J0016J0383J0757
$$ 674350 669272 665739 663987 663406 663219 663319 664206 666493 670687 677049 685321 694778 704794 715177 725934
61055G25934J1098J1602J2658J4311J6167J7767J8888J9649K0594K2375K4962
$$ 725934 737032 748634 761292 775603 791770 809537 828425 848074 868668 891043 916005
61044I16005K7445K9066L0176L1638L3621L5647L7543L9574M1669M3412M4910
$$ 916005 943450 972516 1002692 1034330 1067951 1103598 1141141 1180715 1222384 1265796 1310706
61033A310706M6904M9672N2537N4886N7147O0179O4070O8028P1234P3240P3821
$$ 1310706 1357610 1407282 1459819 1514705 1571852 1632031 1696101 1764129 1835363 1908603 1982424
61022A982424P3082P1824P1211P1784P3147P4739P6546P8802Q1392Q4026Q6768
$$ 1982424 2055506 2127330 2198541 2270325 2343472 2418211 2494757 2573559 2654951 2738977 2825745
61011B825745R0187R5416J04554J20630J46400J83653K34550L02994L93203N06848
$$ 2825745 2915932 3011348 3115902 3236532 3382932 3566585 3801135 4104129 4497332 5004180
61001E004180O42334P95431R58676J123618J290320J471932J672320J844147J879074
$$ 5004180 5646514 6441945 7400621 8524239 9814559 11286491 12958811 14802958 16682032
60992A6682032J670809J212006O28014J02648k34676l54689k89405q8126J71457
$$ 16682032 18352841 19564847 20192861 20295509 20060833 19706144 19416739 19328613 19500070
60983A9500070L57333L19891j1096n61640j153099j612537j856838j896914j790819
$$ 19500070 19857403 20177294 20166198 19604558 18451459 16838922 14982084 13085170 11294351
60974A1294351j601575j380555j163566r69145q01913o60922n44822m50852l74124
$$ 11294351 9692776 8312221 7148655 6179510 5377597 4716675 4171853 3721001 3346877
60965C346877l10770k59855k20721j90596j66366j46750j31076j17627j05067
$$ 3346877 3036107 2776252 2555531 2364935 2198569 2051819 1920743 1803116 1698049
60956A698049r4018q5295p7810o9894o1614n3945m6766l9688l3916l1091l0749
$$ 1698049 1604031 1518736 1440926 1371032 1309418 1255473 1208707 1169019 1135103 1104012 1073263
60945A073263l0847l0427k9888k9079k7199k4557k2545k1675k1175k0587k0203
$$ 1073263 1042416 1011989 982101 953022 925823 901266 878721 857046 835871 815284 795081
60934G95081j9907j9151j8173j7762j7683j6809j5016j3388j2324j0977q952p096
$$ 795081 775174 756023 737850 720088 702405 685596 670580 657192 644868 633891 624939 617843
60922F17843o071n424m651m011l715l377k789k341k195j915j348j039j315j739
$$ 617843 611772 606348 601697 597686 593971 590594 587805 585464 583269 581354 580006 578967 577652 575913
60908E75913j761j240j75J293K498K739K269J936J855J375M12l97r07j635k510
$$ 575913 574152 572912 572737 574030 576528 579267 581536 583472 585327 586702 587114 586717 585810 584175 581665
60893E81665k765k479k855m377n902o305o024o106o672p228p766q615r574r957
$$ 581665 578900 576421 573566 569189 563287 556982 550958 544852 538180 530952 523186 514571 504997 495040
60879D95040r379q135o959o547o900p097o303m900l992l837l645k928k050j294
$$ 495040 485661 477526 470567 464020 457120 450023 443720 438820 434828 430991 427346 424418 422368 421074
60865D21074l77P61J683K295L074M107M794M872M829M980N030M884M921N013M350
$$ 421074 420697 421458 423141 425436 428510 432617 437411 442283 447112 452092 457122 462006 466927 471940 476290
60850D76290K851J849K556M513O157O387N103K936R53M5P8J25l03q60j397k381
$$ 476290 479141 480990 483546 488059 494216 500603 505706 508642 509595 509640 509718 509843 509540 508680 507283 504902
60834E04902l899n183n647n626n535n132m196l149k443j985j704j938k698l213
$$ 504902 501003 495820 490173 484547 479012 473880 469684 466535 464092 462107 460403 458465 455767 452554
60820D52554k873k019j377j310j990l489n219o100n914n710o217o674o035m622
$$ 452554 449681 447662 446285 444975 442985 439496 434277 428177 422263 416553 410336 403662 397627 393005
60806C93005l639l592l974m204m124l797l401l129k879k284j336n55l21n10q84
$$ 393005 389366 385774 381800 377596 373472 369675 366274 363145 360266 357982 356646 356091 355770 355260 354376
60791C54376j283j289n00O58J175Q22M57P39J385J955K398K492J843R36J004K286
$$ 354376 353093 351804 351304 351962 353137 353959 354416 355155 356540 358495 360893 363385 365228 366164 367168 369454
60775C69454L491L659L454L780M270M121L440K747J980R87K89K65L33j35p50q80
$$ 369454 372945 376604 380058 383838 388108 392229 395669 398416 400396 401383 401672 401937 402270 402135 401385 400505
60759D00505q11j098j470j431j348j803k420k442k050k017k361k363j713o92M44
$$ 400505 399694 398596 397126 395695 394347 392544 390124 387682 385632 383615 381254 378891 377178 376486 376930
60744C76930J464J840J283L15m21j071k064l185l936m353m658m552l740k724k208
$$ 376930 378394 380234 381517 381832 381411 380340 378276 375091 371155 366802 362144 357592 353852 351128 348920
60729C48920k074j823j541j569j583j074l46j18l53l97m8M06Q89J405J476O89
$$ 348920 346846 345023 343482 341913 340330 339256 338910 338792 338439 338042 337994 338400 339289 340694 342170 342859
60713C42859l73o50N4J022J695K088K252K157J999K004K120K332K907L768M163
$$ 342859 342486 341836 341890 342912 344607 346695 348947 351104 353103 355107 357227 359559 362466 366234 370397
60698C70397L664K949K830L088L113L040L266L365K695J601R05N02l35j561k435
$$ 370397 374061 377010 379840 382928 386041 389081 392347 395712 398407 400008 400913 401415 401080 399519 397084
60683C97084k769k925k761j790l19P21J089J289J405R95K55N1N85J090J042P60
$$ 397084 394315 391390 388629 386839 386520 387241 388330 389619 391024 392019 392274 392325 392910 394000 395042 395802
60667C95802N20%j005k074k662k658k307k053k355l146l588l015j814p71J29J350
$$ 395802 396322 396322 395317 393243 390581 387923 385616 383563 381208 378062 374474 371459 369645 368874 369003 370353
60651C70353K572K902K247J505J380J854K763L867M412L569J533o79k443l766
$$ 370353 372925 375827 378074 379579 380959 382813 385576 389443 393855 397424 398957 398278 395835 392069
60637C92069m400l876k516j390j040j103j318j846k408k161q75N92J393J588J587
$$ 392069 387669 383793 381277 379887 378847 377744 376426 374580 372172 370011 369136 369728 371121 372709 374296
60622C74296J444J093P34N04K32j73m99n22k30K77P55P62R7q01j295j230p36K41
$$ 374296 375740 376833 377567 378071 378303 378130 377631 377109 376879 377156 377911 378673 378770 377969 376674 375444 374708 374949
60604C74949J562K443K253J492J124J162Q81K04k27k23j97j07N59J624K160J848
$$ 374949 376511 378954 381207 382699 383823 384985 385866 386070 385843 385620 385423 385316 385875 387499 389659 391507
60588C91507J394J318J285R62N88L21j23p18q90m28L9p7n27o74k11Q15K158L359
$$ 391507 392901 394219 395504 396466 397054 397375 397252 396534 395644 395216 395255 395178 394651 393977 393766 394581 396739 400098
60570D00098M108M714N690O929P907Q653R649J0770J1203J0580R283P483M821
$$ 400098 404206 408920 414610 421539 429446 438099 447748 458518 469721 480301 489584 497067 501888
60557E01888J415j738l810m933n592n829n435m438l039j499p9J264L025N307P132
$$ 501888 503303 501565 497755 492822 487230 481401 475966 471528 468489 466990 466911 468175 471200 476507 483639
60542D83639P418O609O293P257Q917J0672J2582J4516J5882J6565J7042J7085
$$ 483639 491057 497666 503959 511216 520133 530805 543387 557903 573785 590350 607392 624477
60530F24477J5622J2434Q838N930L158l96m303p320r008r792r915r330q363p542
$$ 624477 640099 652533 661371 667301 670459 670063 665760 658440 649432 639640 629725 620395 612032 604490
60516F04490o882n975m758l669k974k447j713p16K41Q37J137J594K574M087O178
$$ 604490 597608 591633 586875 583206 580232 577785 576072 575356 575597 576434 577571 579165 581739 585826 592004
60501E92004R143J2980J6998K0629K4132K7800L0949L2792L3895L5450L7188L7512
$$ 592004 601147 614127 631125 651754 675886 703686 734635 767427 801322 836772 873960 911472
60489I11472L5787L3084L0227K6532K1198J4646P678L33p491j5178k2053k8236
$$ 911472 947259 980343 1010570 1037102 1058300 1072946 1080624 1080957 1073466 1058288 1036235 1007999
60477A007999l4015l8962m2402m4191m4389m2796l9618l5914l2541k9117k4914
$$ 1007999 973984 935022 892620 848429 804040 761244 721626 685712 653171 624054 599140
60466E99140k0384j6876j4940j3768j2375j0738r533r139r114q625p356n863m855
$$ 599140 578756 561880 546940 533172 520797 510059 500526 491387 482273 473648 466292 460429 455574
60453D55574m383m053l811l914m248m353m080l640l048k250j638j633j738j063
$$ 455574 451191 447138 443327 439413 435165 430812 426732 423092 420044 417794 416156 414523 412785 411722
60439D11722J68O62j34j322j927j930j602q73PJ97n92j478j555r95m22K5M20N36
$$ 411722 411890 412552 412418 411096 409169 407239 405637 404764 404771 404968 404376 402898 401343 400348 399926 399951 400371 400907
60421D00907K87R4K61M69L74J58J10K41O40J495K395K459J608Q64Q77J031O83
$$ 400907 401194 401288 401549 402018 402392 402550 402660 402901 403541 405036 407431 409890 411498 412362 413239 414270 414953
60404D14953L43Q30J958K953L563L978M107L776L202K665K075J410J122J494K103
$$ 414953 415296 416126 418084 421037 424600 428578 432685 436461 439663 442328 444403 445813 446935 448429 450532
60389D50532K474K778L311L765L653L068K451J993J675J515J362R59N71R28K106
$$ 450532 453006 455784 459095 462860 466513 469581 472032 474025 475700 477215 478577 479536 480107 481035 483141
60374D83141L113L120K510K175K274K273J801R59J59j02K99P50O31M23J148K688
$$ 483141 486254 489374 491884 494059 496333 498606 500407 501366 501525 501423 501722 502472 503103 503526 504674 507362
60358E07362L818M153M718O039P183P521Q026R642J1570J2489J2483J2353J1826
$$ 507362 511180 515333 520051 526090 533273 540794 548820 558462 570032 582521 595004 607357 619183
60345F19183J0022P158M336J871q27l851o442q053q822q980q606p906p128o269
$$ 619183 629205 636363 640699 642570 641743 637892 631450 623397 614575 605595 596989 589083 581955 575686
60331E75686n356m731m546m396l980l625l648l691l376k969k793k531j874j208
$$ 575686 570330 565599 561053 556657 552677 549052 545404 541713 538337 535368 532575 530044 528170 526962
60317E26962r22n78M23J901L307M520N560O230O782Q171J0744J3376J4844J5275
$$ 526962 526040 525462 525885 527786 531093 535613 541173 547403 554185 562356 573100 586476 601320 616595
60303F16595J5371J4961J3539J1428R130O177K032k379n517p386r452j2496j5709
$$ 616595 631966 646927 660466 671894 681024 687201 689233 686854 681337 673951 664499 652003 636294
60290F36294j7860j8307j6966j4304j1337q786o412l897j946j448j973k222j725
$$ 636294 618434 600127 583161 568857 557520 548734 542322 538425 536479 535031 533058 530836 529111
60277E29111j056o30m28o95j776l276m351m753m738m325l566l158l663m378m209
$$ 529111 528055 527425 526997 526302 524526 521250 516899 512146 507408 503083 499517 496359 492696 488318 484109
60262D84109l352k922l123l098k534k069k051k031j705j347j192j223j507j883
$$ 484109 480757 477835 474712 471614 469080 467011 464960 462929 461224 459877 458685 457462 455955 454072
60248D54072j537k2J644K032J299Q23J007Q77l3q38p12N5P02P84R4j122j756p48
$$ 454072 452535 452513 454157 456189 457488 458311 459318 460195 460162 459324 458612 458667 459369 460153 460247 459125 457369 456621
60230D56621J319K620K328J442J228J868K923M008M664M530M037M039M516M625
$$ 456621 457940 460560 462888 464330 465558 467426 470349 474357 479021 483551 487588 491627 496143 500768
60216E00768M220M176M912N751O202O767P853Q868R194R204R618J0392J0908J0741
$$ 500768 504988 509164 514076 519827 526029 532796 540649 549517 558711 567915 577533 587925 598833 609574
60202F09574R853Q514P394P129P467P346O193M622L579L325L512L656L241J976
$$ 609574 619427 627941 635335 642464 649931 657277 663470 668092 671671 674996 678508 682164 685405 687381
60188F87381J89j406k590l718m887n682n950o178o756p450p930q236q468q390
$$ 687381 687570 686164 683574 679856 674969 669287 663337 657159 650403 642953 635023 626787 618319 609929
60174F09929p727o523n075l749k902k612k539k372k286k505k751k642k386k440
$$ 609929 602202 595679 590604 586855 583953 581341 578802 576430 574144 571639 568888 566246 563860 561420
60160E61420k731k886k934l004k654j496k40J9n61p48p0O66Q12O98P37Q09Q71
$$ 561420 558689 555803 552869 549865 547211 545715 545475 545494 544933 544185 544115 544781 545593 546291 547028 547837 548708
60143E48708J252J901K238K172K444L448M442M507L743L080L245M243N524O470
$$ 548708 549960 551861 554099 556271 558715 562163 566605 571112 574855 577935 581180 585423 590947 597417
60129E97417O904P104P136O554N207L853L246L089K780K677L480M743N361N388
$$ 597417 604321 611425 618561 625115 630322 634175 637421 640510 643290 645967 649447 654190 659551 664939
60115F64939N911P103P801P333O400N759N207M354L371K464J572Q43N27J60j092
$$ 664939 670850 677953 685754 693087 699487 705246 710453 714807 718178 720642 722214 723057 723584 723744 722652
60100G22652l042m490m950n162n569n491m426l066k333k318k685l269l754l652
$$ 722652 719610 715120 710170 705008 699439 693948 689522 686456 684123 681805 679120 675851 672097 668445
60086F68445l114k909l158l068k374j976k538l468l904l817l526k997k390k383
$$ 668445 665331 662422 659264 656196 653822 651846 649308 645840 641936 638119 634593 631596 629206 626823
60072F26823l263m384n142n750o387o521n877n291n661o590o897o131m865l894
$$ 626823 623560 619176 614034 608284 601897 595376 589499 584208 578547 571957 565060 558929 554064 550170
60058E50170l606l873m097l740l050k789l052l020k112p26M70J232J473J142Q10
$$ 550170 546564 542691 538594 534854 531804 529015 525963 522943 520831 520105 520575 521807 523280 524422 525232
60043E25232J552L684O264Q195R223R497R050Q113P200O433N418M170L329L103
$$ 525232 526784 530468 536732 544927 554150 563647 572697 580810 588010 594443 599861 604031 607360 610463
60029F10463K812J877N35q02k021k888l093l094l943n780p503q398r063j0143
$$ 610463 613275 615152 615687 614885 612864 609976 606883 603789 599846 594066 586563 578165 569102 558959
60015E58959j1211j1605j1411j0916r960q494o979n638m160k641j884k185k748
$$ 558959 547748 536143 524732 513816 503856 495362 488383 482745 478585 475944 474060 471875 469127
60002D69127k883k750k481j725p06l86q18o49P49K044J976J336J586K598L329
$$ 469127 466244 463494 461013 459288 458582 458196 457378 456729 457478 459522 461498 462834 464420 467018 470347
59987D70347L793M694N794O249O088N950N664M544K849J594J012L31q76k222l323
$$ 470347 474140 478834 484628 490877 496965 502915 508579 513123 515972 517566 518578 518909 518033 515811 512488
59972E12488m167m677m719m524m446m434m274m056l840l241k010o71Q2K83M37
$$ 512488 508321 503644 498925 494401 489955 485521 481247 477191 473351 470110 468100 467429 467511 467794 468231
59957D68231P21R94J176J097N45r1J21J349K452K467J912J837K305K613K443J921
$$ 468231 468952 469946 471122 472219 472764 472673 472794 474143 476595 479062 480974 482811 485116 487729 490172 492093
59941D92093J102K52RM10M46n22j521j227J09J043R03K93M9N42J810L515N053
$$ 492093 493195 493447 493456 493866 494312 493790 492269 491042 491151 492194 493097 493390 493439 493981 495791 499306 504359
59924E04359O238P469Q661Q815P400N364L877K813J462L2p82j029j189j124n23
$$ 504359 510597 518066 526727 535542 542942 548306 552183 554996 556458 556490 555708 554679 553490 552366 551843
59909E51843J46K68J59L91N47q9j106j531j419j612k138k213j593p12L63J832
$$ 551843 551989 552257 552416 552807 553354 553265 552159 550628 549209 547597 545459 543246 541653 540941 541304 543136
59893E43136L197L659L468L727M801N993O790P409Q041Q512Q783Q936Q799Q257
$$ 543136 546333 549992 553460 557187 561988 567981 574771 582180 590221 598733 607516 616452 625251 633508
59879F33508P801P899Q130P873P465P576P728O670M197J470n73k055l380m598
$$ 633508 641309 649208 657338 665211 672676 680252 687980 694650 698847 700317 699744 697689 694309 689711
59865F89711n722o817p663p963p865p650p098n888m390l305k734k325j976j613
$$ 689711 683989 677172 669509 661546 653681 646031 638933 633045 628655 625350 622616 620291 618315 616702
59851F16702p18R98K831M009M910O328P941Q657Q124O715M461J371j454k575k027
$$ 616702 615984 616982 619813 623822 628732 635060 643001 651658 659782 666497 670958 672329 670875 668300 666273
59836F66273j106l63P26K061K457J318n27k058l055l505l126j973o78L27J129
$$ 666273 665167 664804 665530 667591 670048 671366 670839 668781 665726 662221 659095 657122 656444 656771 657900
59821F57900J658J502N45r02k680m729o479p180o891o301n546m201k475j415j577
$$ 657900 659558 661060 661605 660703 658023 653294 646815 639635 632744 626443 620897 616696 614221 612806 611229
59806F11229k405l148l646l956l959l598l022k355j725j450j559j463q18l62j076
$$ 611229 608824 605676 602030 598074 594115 590517 587495 585140 583415 581965 580406 578943 578125 577763 576687
59791E76687k672l909m145l697k880j792r14q16j239j351r19l31K97J003J231
$$ 576687 574015 570106 565961 562264 559384 557592 556678 555862 554623 553272 552353 552022 552319 553322 554553
59776E54553L96q79j286n40M90J285K039K605K440J765J515J879K046J613J185
$$ 554553 554949 554070 552784 552244 552734 554019 556058 558663 561103 562868 564383 566262 568308 569921 571106
59761E71106J266J630K027K547L107L466L846M592N320N434N412O249P720Q450
$$ 571106 572372 574002 576029 578576 581683 585149 588995 593587 598907 604341 609753 616002 623722 632172
59747F32172P947P126O670O191N370M532L756K650J497J237J914K295J650P27
$$ 632172 640119 647245 653915 660106 665476 670008 673764 676414 677911 679148 681062 683357 685007 685734
59733F85734M18N45N89O29R22J356J734J869J291j66j376q69R96K100J297k82
$$ 685734 686152 686697 687286 687915 688837 690193 691927 693796 695087 694921 693545 692676 693672 695772 697069 696787
59717F96787j152j337j559j883k068k286k583k468j811j287j230r25K33J689K632
$$ 696787 695635 694298 692739 690856 688788 686502 683919 681451 679640 678353 677123 676198 676431 678120 680752
59702F80752L191L923M725N067M869M562M605N297O536P612P872P723Q137Q962
$$ 680752 683943 687866 692591 697658 702527 707089 711694 716991 723527 731139 739011 746734 754871 763833
59688G63833Q779O845M140J939L62j058k183k507k019j272r88j838l936o273p410
$$ 763833 772612 779457 783597 785536 785898 784840 782657 780150 778131 776859 775871 774033 770097 763824 756414
59673G56414p064o333o119o197o095n908n789n447m659l601k371r75Q4J60l29
$$ 756414 749350 743017 736898 730701 724606 718698 712909 707462 702803 699202 696831 695856 695940 696100 695771
59658F95771n7J439L168M252N004N953O841P236P290P283P115O666N954M636K246
$$ 695771 695714 697153 700321 704573 709577 715530 722371 729607 736897 744180 751295 757961 763915 768551 770797
59643G70797q06l449n443p521r794j1274j1465j1204j1239j1153j0397r244q020
$$ 770797 769991 766542 761099 753578 743784 732510 721045 709841 698602 687449 677052 667808 659788
59630F59788o415m362k613j696j226r48j430k937m635n690o259o615o332n201
$$ 659788 653373 649011 646398 644702 643476 642528 641098 638161 633526 627836 621577 614962 608630 603429
59616F03429m109l981m581n151n564o017o240n823m815l456j855l85M03O01R33
$$ 603429 599320 595339 590758 585607 580043 574026 567786 561963 557148 553692 551837 551452 551855 552456 553389
59601E53389J488J466O16j24K5O91J261J735K061J757Q88M02Q08J457J709J696
$$ 553389 554877 556343 556959 556835 556860 557551 558812 560547 562608 564365 565253 565655 566463 567920 569629 571325
59585E71325J441N47n52n90M30O14j122l216l647k745k287k867l703m244m427
$$ 571325 572766 573313 572761 572171 572601 573215 572093 568877 565230 562485 560198 557331 553628 549384 544957
59570E44957l969k814j807j711k047j902j379j120j114j035j107j533j683r97
$$ 544957 540988 538174 536367 534656 532609 530707 529328 528208 527094 526059 524952 523419 521736 520739
59556E20739p9J93O9K64N74L80K9L77J275J741J486J267J787L048M678O277P687
$$ 520739 520660 520853 520922 521186 521760 522140 522169 522546 523821 525562 527048 528315 530102 533150 537828 544105 551792
59539E51792R246J1316J3419J4750J5898J8602K2745K4882K1340J2271J520o936
$$ 551792 561038 572354 585773 600523 616421 635023 657768 682650 703990 716261 717781 710845
59527G10845j1364j2002j0059p031l998j381N20J367J493J768K141J425p62l047
$$ 710845 699481 687479 677420 670389 666391 665010 665530 666897 668390 670158 672299 673724 672962 669915
59513F69915m300n249o942q694r181q613q292q503q409p558o297m951l749l092
$$ 669915 665615 660366 653424 644730 635549 626936 618644 610141 601732 594174 587877 582926 579177 576085
59499E76085l043k956k453k067k140k004j162l04p3J91J271K630L347L566L802
$$ 576085 573042 570086 567633 565566 563426 561422 560260 559956 559883 560074 561345 563975 567322 570888 574690
59484E74690L776L277L142L986N015N521O292P945R119Q316O474N580N602N088
$$ 574690 578466 581743 584885 588871 593886 599407 605699 613644 622763 631079 637553 643133 648735 653823
59470F53823M000L541L530K533M56j248k088l018m222m592l790k848k185q58J558
$$ 653823 657823 661364 664894 667427 667883 666635 664547 661529 657307 652715 648925 646077 643892 643034 644592
59455F44592L964N331O097P187Q627R662R587Q325O679N908O258O354M839K155
$$ 644592 648556 653887 659984 667171 675798 685460 695047 703372 710051 715959 722217 728571 733410 735565
59441G35565m11k658n144p534q857r034q655p715o060m634m518n128n097m539
$$ 735565 735154 732496 727352 719818 710961 701927 693272 685557 679497 674863 670345 665217 660120 655581
59427F55581m582m995m420k822j497n41J477M927Q296J0547J2370J4456J6338
$$ 655581 650999 646004 641584 638762 637265 636724 638201 643128 651424 661971 674341 688797 705135
59414G05135J7651J8871K0114K0847K1518K3558K6511K6727K0614Q586n095j5788
$$ 705135 722786 741657 761771 782618 804136 827694 854205 880932 901546 910132 905037 889249
59402H89249k1090k1064j7308j1763n589J108Q353J5045J8565J5906O229p220
$$ 889249 868159 847095 829787 818024 812435 813543 821896 836941 855506 871412 877641 870421
59390H70421j8713k4531k5342k3693k0635j6150j1311p610m811j747J117K217
$$ 870421 851708 827177 801835 778142 757507 741357 730046 722436 717625 715878 716995 719212
59378G19212J855K165L845N225N100M332L888L320K200J278J147J126M47n68j343
$$ 719212 721067 723232 727077 732302 737402 741734 745622 748942 751142 752420 753567 754693 755140 754572 753229
59363G53229j929k353k200j494r31p18j45J120K428L284M124N390O798Q004R116
$$ 753229 751300 748947 746747 745253 744322 743604 743459 744579 747007 750291 754415 759805 766603 774607 783723
59348G83723J0249J1371J2740J4519J5967J6139J5430J5201J5692J5669J4307
$$ 783723 793972 805343 818083 832602 848569 864708 880138 895339 911031 926700 941007
59337I41007J2199J0132Q138O091M091J920q05l711n934p351q485r258r153q579
$$ 941007 953206 963338 971476 977567 981658 983578 982773 979062 973128 965777 957292 948034 938881 930302
59323I30302q647r453r993r882r738r824r792r834j0559j1679j2310j2551j3036
$$ 930302 921655 912202 902209 892327 882589 872765 862973 853139 842580 830901 818591 806040 793004
59310G93004j3208j1984j0110r549j0305j0196q280o044m494k570M81L488N482
$$ 793004 779796 767812 757702 748153 737848 727652 719372 713328 708834 706264 706745 710233 715715
59297G15715P208Q947Q731M648k330r367j4561j7506j8293j7355j5509j3128j0039
$$ 715715 722923 731870 740601 745249 742919 733552 718991 701485 683192 665837 650328 637200 627161
59284F27161o753m572l782l095j630m0J071K289M015N467O185P089Q993J1265
$$ 627161 620408 615836 612054 608959 607329 607289 608360 610649 614664 620131 626316 633405 642398 653663
59270F53663J3045J4438J5538J5612J4375J2806J1644J0313Q271O028L918J252
$$ 653663 666708 681146 696684 712296 726671 739477 751121 761434 769705 775733 779651 780903
59258G80903k139n017o543p512q652r194q539p737p786p758o335m018k254j336
$$ 780903 778764 773747 767204 759692 751040 741846 733307 725570 717784 710026 703691 699673 697419 696083
59244F96083o67j38K64J229L067M802N586O046O921P572P322P055P761Q456P475
$$ 696083 695416 695278 695542 696771 699838 704640 710226 716272 723193 730765 738087 745142 752903 761359 768834
59229G68834N050K810J328r4j702l090m396o061p636q250q102q166q606q717q269
$$ 768834 773884 776694 778022 777928 776226 773136 768740 762679 755043 746793 738691 730525 721919 713202 704933
59214G04933p751p404p005o528o146n749n215m829m809m810m514m128l764l008
$$ 704933 697182 689778 682773 676245 670099 664350 659135 654306 649497 644687 640173 636045 632281 629273
59200F29273j801q95p42p71m52j61j07M76K035L577M062M058M801O293P538Q101
$$ 629273 627472 626577 625835 625064 624612 624451 624344 624820 626855 630432 634494 638552 643353 649646 657184 665285
59184F65285Q242Q129P876P960Q580R082Q816Q048P373O854O367N946N251L698
$$ 665285 673527 681656 689532 697492 706072 715154 723970 732018 739391 746245 752612 758558 763809 767507
59170G67507J755R18J612K375J943R10K63k96j327k289k616l030m380o177p555
$$ 767507 769262 770180 771792 774167 776110 777020 777283 776987 775660 773371 770755 767725 763345 757168 749613
59155G49613q673r879j0623j0599j0736j1634j2184j1335j0028r625r627q805
$$ 749613 740940 731061 720438 709839 699103 687469 675285 663950 653922 644297 634670 625865
59143F25865p598p244p361o579n025m104m137m187l964m085m505m435l759l108
$$ 625865 618267 611023 603662 597083 592058 587954 583817 579630 575666 571581 567076 562641 558882 555774
59129E55774k592j844j020m52L58J998L778M537M468M818O052P681R457J1338
$$ 555774 553182 551338 550318 549866 550224 552222 556000 560537 565005 569823 575875 583556 593013 604351
59115F04351J2659J2759J2153J1766J1417J0356Q819P638O843N966N248M994M394
$$ 604351 617010 629769 641922 653688 665105 675461 684280 691918 698761 704727 709975 714969 719363
59102G19363K594M18o86r31j678k987l630l295k938k925k661k113k051k508k553
$$ 719363 721957 722375 721689 720758 719080 716093 712463 709168 706230 703305 700644 698531 696480 693972 691419
59087F91419j814q86j78L39K52r63k697l658l736m028m968n704n635n243n143
$$ 691419 689605 688719 688541 688880 689132 688169 685472 681814 678078 674050 669082 663378 657743 652500 647357
59072F47357n310n472n437m949m018l283l224l348k959k341k125k055j546j074
$$ 647357 642047 636575 631138 626189 622171 618888 615664 612316 609357 607016 604891 602836 601290 600216
59058F00216j603k929l852l839l318k589j697j134j374j871j678r36n70p59q20
$$ 600216 598613 595684 591832 587993 584675 582086 580389 579255 577881 576010 574332 573396 572826 572067 571247
59043E71247m52LL33N24L48j75l97o1m4r61j804j311J8P77Q77J364K458L429M098
$$ 571247 570795 570798 571131 571655 572003 571828 571431 571370 571326 570365 568561 567250 567268 568045 568922 570286 572744 576173 580271
59024E80271M985O132P184Q312R771J0976J1262J1092J1153J0911R522P508N891
$$ 580271 585256 591388 598572 606884 616655 627631 638893 649985 661138 672049 681571 689079 694970
59011F94970M379K133k54j520j935k749l835l894k815j809j252l26J150K425L346
$$ 694970 699349 701482 701228 699708 697773 695024 691189 687295 684480 682671 681419 681093 682243 684668 688014
58996F88014M529N905O695O803O654N897L921J520K47J99J30l13m09k36p52j823
$$ 688014 692543 698448 705143 711946 718600 724497 728418 729938 730185 730384 730514 730201 729792 729556 728804 726981
58980G26981j999o46J324L032M490N771O841Q311J0924J4151J6639J7921J8540
$$ 726981 724982 724336 725660 728692 733182 738953 745794 754105 765029 779180 795819 813740 832280
58967H32280J8760J8536J8312J8430J8184J6909J5326J4234J2760R787O195L480
$$ 832280 851040 869576 887888 906318 924502 941411 956737 970971 983731 993518 999713 1003193
58955A003193J034k729p227j0483j2520j5079j8156j9830j9690j9497j9991j9844
$$ 1003193 1004227 1001498 994271 983788 971268 956189 938033 918203 898513 879016 859025 839181
58943H39181j8336j6500j4955j3021j0673q996q101o815m987l840l578k999j912
$$ 839181 820845 804345 789390 776369 765696 756700 748599 741784 736797 732957 729379 726380 724468
58930G24468j518j846j400l1M64n46j395j024n55q46r22n1Q00Q47P41Q09J99j048
$$ 724468 722950 721104 719704 719673 720137 719591 718196 717172 716617 715771 714849 714798 715598 716445 717186 717995 718194 717146
58912G17146j219M07K097K264J686J818K637L598N113P522R940J1440J2384J3554
$$ 717146 715927 716334 718431 720695 722381 724199 726836 730434 735547 743069 753009 764449 776833 790387
58898G90387J4978J6265J7083J6895J5554J4328J4758J6322J7034J6510J6403
$$ 790387 805365 821630 838713 855608 871162 885490 900248 916570 933604 950114 966517
58887I66517J7513J8785J9596K0602K1624K1155J8877J6382J4442J1884Q124M434
$$ 966517 984030 1002815 1022411 1043013 1064637 1085792 1104669 1121051 1135493 1147377 1155501 1159935
58875A159935J630j167m350o710p768q953j1082j2895j3432j3557j3812j3060
$$ 1159935 1161565 1160398 1156048 1149338 1141570 1132617 1121535 1108640 1095208 1081651 1067839 1054779
58863A054779j0826q811q437q896r204j0002j1661j2737j2264j1687j2569j4057
$$ 1054779 1043953 1035142 1026705 1017809 1008605 998603 986942 974205 961941 950254 937685 923628
58851I23628j4513j3979j3309j2377j1009j0159j0415j0718j0139r495r722j0117
$$ 923628 909115 895136 881827 869450 858441 848282 837867 827149 817010 807515 797793 787676
58839G87676r769r220r210r230q849q900r822j0397r644q403p587o481m455k622
$$ 787676 777907 768687 759477 750247 741398 732498 722676 712279 702635 694232 686645 680164 675709 673087
58825F73087k017j610k6K245L977N304O843Q054Q129P453O769O033N358N643O896
$$ 673087 671070 669460 669434 671679 675656 680960 687803 695857 703986 711439 718208 724241 729599 735242 742138
58810G42138P492O428M841L888K896J139l37n00l68j366l072m332n245o362p186
$$ 742138 749630 756058 760899 764787 767683 768822 768485 767985 767617 766251 763179 758847 753602 747240 740054
58795G40054p219p193p769q311q316q521r120q607o158l423k166j663l47J513
$$ 740054 732835 725642 717873 709562 701246 692725 683605 674998 668840 665417 663251 661588 661241 662754
58781F62754K746L489M517N597O287P150Q476R121Q162O323M298J355k766o346
$$ 662754 665500 668989 673506 679103 685390 692540 701016 710137 718299 724622 728920 730275 727509 721163
58767G21163q021q860j0245j1447j1367j0926j1376j1806j0738q803p490o504
$$ 721163 713142 704282 694037 682590 671223 660297 648921 637115 626377 617574 610084 603580
58755F03580m699k545j342r57m08J84K12P6L48N28K75O09K147L712M387N279P279
$$ 603580 598881 596336 594994 594037 593629 593813 594025 594101 594449 594977 595252 595861 598008 601720 606107 611386 618665
58738F18665Q926Q659P580P571Q233Q070P239O742O187M825L549L517M026L928
$$ 618665 627591 636250 643830 651401 659634 667704 674943 681685 687872 692697 696246 699763 703789 707717
58724G07717L790M359M489L005J220J037J952K477L083M981P325Q375Q404Q793
$$ 707717 711507 715866 720355 723360 724580 725617 727569 730046 733129 738110 745435 753810 762214 771007
58710G71007R333Q915P753O468M280N88l051n109o757r610j2554j3868j4792j7473
$$ 771007 780340 789255 797008 803476 807756 808344 805293 800184 793427 783817 771263 757395 742603 725130
58696G25130k0731k1575k0036j8745j8380j7198j4750j2505j0895q922o748n708
$$ 725130 704399 682824 662788 644043 625663 608465 593715 581210 570315 561393 554645 548937
58684E48937n678n235m329m193m753m756m152l880l618k351p69m46r91n76R87
$$ 548937 543259 538024 533695 529502 524749 519993 515841 511961 508343 505992 505223 504777 503786 503210 504197
58669E04197K260K875L746M935N826O919R008J1122J1682J1075J0633R709O591
$$ 504197 506457 509332 513078 518013 523839 530758 539766 550888 562570 573645 584278 593987 600578
58656F00578J775k357m767o162o805o429n844o137o707o401n724n687n528m167
$$ 600578 602353 599996 595229 589067 582262 575833 569989 563852 557145 550744 545020 539333 533805 529638
58642E29638k715k778l446k848j497j050r67L24K083K481K092K708L685L087J593
$$ 529638 526923 524145 520699 517851 516354 515304 514337 514661 516744 519225 521317 524025 527710 530797 532390
58627E32390J423K159J472n62j699j597j867k464j890n88l24n76O22K668L265
$$ 532390 533813 535972 537444 536882 535183 533586 531719 529255 527365 526777 526453 525877 526499 529167 532432
58612E32432K920M246O927P780O146M790M929M614K931J775K352L360L649L525
$$ 532432 535352 539598 546525 554305 560451 565241 570170 574784 577715 579490 581842 585202 588851 592376
58598E92376K850R44j162j572p75r89k201k329j195o47o76O60L367N375O508Q598
$$ 592376 595226 596170 595008 593436 592661 591672 589471 587142 585947 585300 584624 585284 588651 594026 600534 609132
58582F09132J1443J2679J2066J1797J2161J1121Q718P575Q184Q018O271N281O130
$$ 609132 620575 633254 645320 657117 669278 680399 689117 696692 704876 712894 719165 724446 730576
58569G30576P001P203Q723J2344J5990J8381K0853K4249K7439K9922L2552L4684
$$ 730576 737577 744780 753503 765847 781837 800218 821071 845320 872759 902681 935233 969917
58557I69917L4137L0777K6660K2066J5265O902L62l121n678q217q916p436o269
$$ 969917 1004054 1034831 1061491 1083557 1098822 1105724 1106086 1102965 1097287 1089070 1080154 1072718 1066449
58544A066449o496o295n134n304p836j0871j3562j7494k2777k6742k8087k8385
$$ 1066449 1059953 1053658 1048524 1043220 1035384 1024513 1010951 993457 970680 943938 915851 887466
58532H87466k8237k6094k2262j9624j8748j6707j2462q925p758o738m434l013
$$ 887466 859229 833135 810873 791249 772501 755794 743332 734407 726649 719911 715477 712464
58520G12464l912m990m517m038m715m787l252k177k866l341k194j274k033k719
$$ 712464 708552 703562 699045 695007 690292 685505 682253 680076 677210 673869 671675 670401 668368 665649
58506F65649j818q11j112j508r66o89j272j127L03J113M77J67Q61Q08k10K62K678
$$ 665649 663831 663020 661908 660400 659434 658745 657473 656346 656649 657762 658239 658406 659267 660075 659865 660127 662805
58489F62805M016L037K662M784P157P878Q612J0714J2514J3093J4589J7974K0733
$$ 662805 666821 669858 672520 677304 684461 692339 700951 711665 724179 737272 751861 769835 790568
58476G90568K1410K2113K3698K3009J8083J1800P089K636l264q817j2082j4368
$$ 790568 811978 834091 857789 880798 898881 910681 917770 920406 917142 908325 896243 881875
58464H81875j6836j7504j4980j1480r014o238k047J652L728O299J0405J3452J4012
$$ 881875 865039 847535 832555 821075 812061 805823 803776 805428 809156 815455 825860 839312 853324
58451H53324J4726J7081J7939J4835J0191O504J951n053j1498j4421j5751j8098
$$ 853324 868050 885131 903070 917905 928096 934600 936551 931498 920000 905579 889828 871730
58439H71730j9707j8095j4931j2785j0644p021l905l185k693r1K725L334L398
$$ 871730 852023 833928 818997 806212 795568 788547 784642 781457 778764 778673 781398 784732 788130
58426G88130N215P308P680P996J0172J2198J1612R766Q555O429J835k926n417
$$ 788130 793345 800653 808333 816329 826501 838699 850311 860077 868632 875061 876896 873970 868553
58413H68553p122r738j1265r923q164q539r387q719q261r415r479o484l480l343
$$ 868553 861431 851693 840428 830505 822341 813802 804415 795696 787435 778020 768541 762057 758577 755234
58399G55234l648j526Q60P15J04J748L607L035K163L670N338M310K669L264M171
$$ 755234 751586 750060 750920 751635 751739 753487 757094 760129 762292 765962 771300 775610 778279 781543 785714
58384G85714K895J797L515N225L598J270K174M394M075K540L147M751M645M405
$$ 785714 788609 790406 793921 799146 802744 804014 806188 810582 814657 817197 820344 825095 829740 834145
58370H34145O504Q726Q183P176Q926J1277J0941R951J1537J3689J3432J3194J6088
$$ 834145 840649 849375 857558 864734 873660 884937 895878 905829 917366 931055 944487 957681 973769
58357I73769J9020J7663J4191J2891J2176Q437L702J872J206j752m627l433m81
$$ 973769 992789 1010452 1024643 1037534 1049710 1058147 1061849 1063721 1064927 1063175 1058548 1055115 1054634
58344A054634k21r67J294M641M963M194O458R727R691Q385J0452J4289J5434J5250
$$ 1054634 1054413 1053446 1054740 1059381 1064344 1068538 1074996 1084723 1094414 1102799 1113251 1127540 1142974 1158224
58330A158224J7563K0311J9251J6518J6611J7459J4505R921Q566Q511N058N63
$$ 1158224 1175787 1196098 1215349 1231867 1248478 1265937 1280442 1290363 1298929 1307440 1312498 1313061
58318A313061M21K757K060l08P86L979M358L355N585R135R279Q332J1331J5501
$$ 1313061 1313482 1316239 1318299 1317991 1318777 1322756 1327114 1330469 1336054 1345189 1354468 1362800 1374131 1389632
58304A389632J4850J1699J2584J6197J6682J5359J7436K0586J8906J4956J5663
$$ 1389632 1404482 1416181 1428765 1444962 1461644 1477003 1494439 1515025 1533931 1548887 1564550
58293A564550J9387J9434J7154J8796K2575K1964J8905K0339K4527K4382K1546
$$ 1564550 1583937 1603371 1620525 1639321 1661896 1683860 1702765 1723104 1747631 1772013 1793559
58282A793559K3210K7713K7610K4476K6009L0784L0896K7636K9312L5282L7405
$$ 1793559 1816769 1844482 1872092 1896568 1922577 1953361 1984257 2011893 2041205 2076487 2113892
58271B113892L5781L7713M2643M3505M1481M3901M9305N0221M8614N2545N9806
$$ 2113892 2149673 2187386 2230029 2273534 2315015 2358916 2408221 2458442 2507056 2559601 2619407
58260B619407O1557N9650O3040O9584O9477O4279O3917O7281O5134N9829O2040
$$ 2619407 2680964 2740614 2803654 2873238 2942715 3006994 3070911 3138192 3203326 3263155 3325195
58249C325195O9956P2430P0758P6029Q6836R1693R1761R8435J10161J15166J15483
$$ 3325195 3395151 3467581 3538339 3614368 3701204 3792897 3884658 3983093 4093254 4208420 4323903
58238D323903J23757J37944J44643J46019J56653J75036J85970J90237K02969
$$ 4323903 4447660 4585604 4730247 4876266 5032919 5207955 5393925 5584162 5787131
58229E787131K23468K36846K44946K64025K92121L11729L24709L49928L86363
$$ 5787131 6010599 6247445 6492391 6756416 7048537 7360266 7684975 8034903 8421266
58220H421266M15085M37983M75825N27309N71228O10208O68788P46524Q19526
$$ 8421266 8836351 9274334 9750159 10277468 10848696 11458904 12127692 12874216 13693742
58211A3693742Q90560R87980J112378J237856J369652J543031J760910J995328
$$ 13693742 14584302 15572282 16684660 17922516 19292168 20835199 22596109 24591437
58203B4591437K256013K589830L007391L487158M061017M814235N795872P027024
$$ 24591437 26847450 29437280 32444671 35931829 39992846 44807081 50602953 57629977
58195E7629977Q607335J0702226J3410806J6762446K0820513K5586821L0782004
$$ 57629977 66237312 76939538 90350344 107112790 127933303 153520124 184302128
58188A84302128L5960526M0829609M4937730M6709929M3348962L2705324J5659318
$$ 184302128 220262654 261092263 306029993 352739922 396088884 428794208 444453526
58181D44453526l700185k0599066l2309147l8693951m0902380m0136709l7381486
$$ 444453526 440753341 420154275 387845128 349151177 308248797 268112088 230730602
58174B30730602l3509800k9214963k4933278k0942807j7443386j4503709j2057436
$$ 230730602 197220802 168005839 143072561 122129754 104686368 90182659 78125223
58167G8125223j0023839q372162p057095n987292n095241m368994l789341l301066
$$ 78125223 68101384 59729222 52672127 46684835 41589594 37220600 33431259 30130193
58159C0130193k869820k507063k215643j963989j733324j539107j386350j250065
$$ 30130193 27260373 24753310 22537667 20573678 18840354 17301247 15914897 14664832
58151A4664832j117424j005322r19539q37712p48773o70377o11817n56357m95150
$$ 14664832 13547408 12542086 11622547 10784835 10036062 9365685 8753868 8197511 7702361
58142G702361m43515m08844l75224l34458l01321k84062k68992k47660k31371
$$ 7702361 7258846 6850002 6474778 6140320 5838999 5554937 5285945 5038285 4806914
58133D806914k25784k17799k00359j85066j78297j69107j52260j39435j36229
$$ 4806914 4581130 4363331 4162972 3977906 3799609 3630502 3478242 3338807 3202578
58124C202578j30831j16824j05152j02538r9313q9477q2144q2336q0377p1120
$$ 3202578 3071747 2954923 2849771 2747233 2647920 2558443 2476299 2393963 2313586 2242466
58114B242466o4424o5972o6286n9274n3594n5100n5502m9021m3597m5086m6223
$$ 2242466 2178042 2112070 2045784 1986510 1932916 1877816 1822314 1773293 1729696 1684610 1638387
58103A638387m1557l7983m0404m1823l7391l3997l6305l7231l1775k6722k7316
$$ 1638387 1596830 1558847 1518443 1476620 1439229 1405232 1368927 1331696 1299921 1273199 1245883
58092A245883k7511k2665j9039k1383k3450j9993j6418j7666j8958j6176j4292
$$ 1245883 1218372 1195707 1176668 1155285 1131835 1111842 1095424 1077758 1058800 1042624 1028332
58081A028332j7078j9232j6798j4908j7343j8999j6199j4077j6243j7554j4605
$$ 1028332 1011254 992022 975224 960316 942973 923974 907775 893698 877455 859901 845296
58070H45296j2867j5859j7673j3956j0147j1028j2021q747n562o615p784n367
$$ 845296 832429 816570 798897 784941 774794 763766 751745 742998 737436 730821 723037 717670
58058G17670l718o458q979p392o179r249j2016j0196q059r981j1935r408o042
$$ 717670 713952 707494 698515 691123 684944 675695 663679 653483 645424 635443 623508 614100 608058
58045F08058o487p932o444m675n759o498l897j716l488n736m889m079o286p795
$$ 608058 601571 593639 587195 582520 576761 570263 566366 564650 561162 555426 550537 546458 540172 532377
58031E32377n500l696o406r705r013p384r135j1630j0840r058r609r850o699l544
$$ 532377 526877 523181 516775 507070 498057 490673 481538 469908 459068 450010 440401 430551 423852 420308
58017D20308m239n751l919j267j842l531k631j143k343l937k533m14j024k244
$$ 420308 416069 410318 406399 405132 403290 399759 397128 395985 393642 389705 387172 386758 385734 383490
58003C83490p95J151K49j452o96O28l99j661l58J078l35j940l73J740M90k166
$$ 383490 382695 383846 384095 382643 381947 382575 382176 380515 380157 381235 380900 378960 378587 380327 380817 378651
57987C78651k454j726k866l879j822P28j33k562k616j408k116l318j951K65l7
$$ 378651 376197 374471 371605 367726 365904 366632 366499 363937 361321 359913 357797 354479 352528 352793 352756
57972C52756j314m6K580L133K328K924L958L029J616K279L273J671q70j119k78
$$ 352756 351442 351396 353976 357109 359437 362361 366319 369348 370964 373243 376516 378187 377317 376198 375920
57957C75920j273k969k753k070l533n354m508k705l283m845m009j950k036l268
$$ 375920 374647 371678 368925 366855 363322 357968 353460 350755 347472 342627 338618 336668 334632 331364
57943C31364k283K12J052P56K117M446M979M365N168O603O256N265O364Q374Q141
$$ 331364 329081 329293 330345 331101 333218 337664 342643 347008 352176 358779 365035 370300 376664 385038 393179
57928C93179O184N135M311J363k439m041m171n651p769p799o563o997q503q198
$$ 393179 399363 404498 408809 410172 407733 403692 399521 393870 386101 378302 371739 364742 356239 348041
57914C48041o500o090o557n359l008k043j956l33K060K478J357J214J573J10k209
$$ 348041 341541 335451 328894 323535 320527 318484 316528 316195 318255 320733 322090 323304 324877 324987 322778
57899C22778k455j211j518l150l115j239j29j11Q25K515K824J972K081K954K669
$$ 322778 320323 319112 317594 314444 311329 310090 309961 309850 310675 313190 316014 317986 320067 323021 325690
57884C25690J682J968K853K183P21Q85K047J632j4n06j51j097k716k642j497j739
$$ 325690 327372 329340 332193 334376 335097 335982 338029 339661 339647 339141 338990 337893 335177 332535 331038 329299
57868C29299k737j992l44p86k779l024j430j044k259k372q38J80N34K325N146
$$ 329299 326562 324570 324226 323440 320661 317637 316207 315163 312904 310532 309694 309874 310408 312733 317879
57853C17879O033M567L408L457L014J907J903K734K210N64K65J343J323J3k10
$$ 317879 323912 328479 331887 335344 338358 340265 342168 344902 347112 347676 347941 349284 350607 350620 350410
57838C50410Q94R83k77o31L22N52j65J61J452J319l60r59J86Q31K10N8O57J32
$$ 350410 351304 352287 352010 351379 351701 352253 352088 352249 353701 355020 354660 353701 353887 354718 354928 354986 355643 355775
57820C55775j547k027q75l37j052j064M5Q0j685l261l765m812p033q737r043r030
$$ 355775 354228 352201 351326 350989 349937 348873 348918 348998 347313 344052 340287 335475 328442 319705 310662 301632
57804C01632r114q462p496p561p840o144k990j196j255r76J21J60r02p86P39J220
$$ 301632 292518 284056 276560 268999 261159 255015 252025 250829 249574 248598 248719 248879 247977 247191 247930 249150
57788B49150O1m01O75J231M45K86J739L126L395L575M027L711L007L696N423N768
$$ 249150 249211 248810 249485 250716 251161 251447 253186 256312 259707 263282 267309 271020 274027 277723 283146 288914
57772B88914M520M051M835M599K787J653J916J427o05k057j877j709k240j801
$$ 288914 293434 297485 302320 306919 309706 311359 313275 314702 314097 312040 310163 308454 306214 304413
57758C04413j9R93M65K73J049R12n49r58N58J619Q01q4L33P62L88N95J691J552
$$ 304413 304394 305387 305852 306125 307174 308086 307537 306579 307137 308756 309557 309473 309806 310568 310956 311551 313242 314794
57740C14794m98k028j547q71j546k323k140k196l098l160j586j59J7L46J490J735
$$ 314794 314296 312268 310721 309850 308304 305981 303841 301645 298547 295387 293801 293642 293659 294005 295495 297230
57724B97230M06l98M80J211N75K50J294J824N22p20j64Q82R08R06J766J911K22
$$ 297230 297636 297238 297718 298929 299504 299754 301048 302872 303394 302674 302510 303392 304300 305206 306972 308883 309105
57707C09105j459j256k54j29k72L54Q92L88k69k09j56m10J82J576J631l25k032
$$ 309105 307646 306390 306136 306007 305735 306089 306981 307369 307100 306891 306735 306325 306507 308083 309714 309389 307357
57690C07357k242k898n193o749n459l078k156k105j204M7N21J077K736M492N601
$$ 307357 305115 302217 297024 290275 284816 281738 279582 277477 276273 276320 276841 277918 280654 285146 290747
57675B90747P840J2762J8838K4057K9263L6139M3929N1128N8524O7362P5577P8312
$$ 290747 298587 311349 330187 354244 383507 419646 463575 514703 573227 640589 716166 794478
57663G94478P1357N2819K3801j0143m0298o0402p0259p2736o9567o1980n2651
$$ 794478 865835 918654 942455 932312 892014 831612 761353 688617 619050 557070 504419
57652E04419m4085l6513k9554k4146k0799j7979j4449j1235r271p400m846l238
$$ 504419 460334 423821 394267 370121 349322 331343 316894 305659 296388 288988 284142 280904
57640B80904l664m150k730q35p08j549j213Q9O94M95L33j41j351k118j558j025
$$ 280904 277240 273090 270360 269525 268817 267268 266055 266144 266838 267333 267666 267525 266174 264056 262498 261473
57624B61473j838k873k776k571l429l903k357k67q5j378k047j892k016k144j439
$$ 261473 259635 256762 253986 251415 247986 244083 241726 241459 241374 239996 237949 236057 234041 231897 230458
57609B30458o92q94j038o1O43m95j992j473L07P78l18j216j422j668j608o58j32
$$ 230458 229766 228872 227834 227773 228416 227921 225929 224456 224763 225541 225223 224007 222585 220917 219309 218651 218519
57592B18519j511l443l506k091j525k102k149j415j182j422p82O65J419J204J102
$$ 218519 217008 213565 210059 207968 206443 204341 202192 200777 199595 198173 197391 198056 199475 200679 201781
57577B01781J233O99l60q97r55j502k511l146l357l518l134j799n81n94j045o58
$$ 201781 203014 203713 203353 202456 201501 199999 197488 194342 190985 187467 184333 182534 181953 181359 180314 179656
57561A79656M6q3n27j91L12k34j200j158l57L7K32J035J935K154K472L583M011
$$ 179656 179702 179619 179092 178901 179213 178979 177779 176621 176264 176301 176533 177568 179503 181657 184129 187712 191723
57544A91723K239l00j110l80j21n78m21L71P54R72J837K442J372n12j236r15j016
$$ 191723 193962 193662 192552 192172 192051 191473 191052 191423 192177 193149 194986 197428 198800 198288 197052 196137 195121
57527A95121j341o70L80J85q22r14k85m59j070m43J073J581J092J387K564K927
$$ 195121 193780 193110 193490 193675 192853 191939 191654 191195 190125 189682 190755 192336 193428 194815 197379 200306
57511B00306K261K110K691K533J386N91M12k46j306j460q14q32j511j297k6O35
$$ 200306 202567 204677 207368 209901 211287 211878 212290 212044 210738 209278 208464 207632 206121 204824 204798 205433
57495B05433Mq60j388k094k810k686j999j733j501l14R65O17q08j206n32o68j746
$$ 205433 205437 204577 203189 201095 198285 195599 193600 191867 190366 190052 191017 191634 190826 189620 189088 188420 186674
57478A86674j799l99N15J7n42k72l6k81k05K63J7r89j470j157j141j525j117J14
$$ 186674 184875 184476 184991 185008 184466 184194 184158 183877 183672 183935 183952 182963 181493 180336 179195 177670 176553 176667
57460A76667P50M38L50P14L77p25j107k71N95R18J370J885J446K74j37L15Q9j183
$$ 176667 177417 177855 178205 178919 179296 178571 177464 177193 177788 178706 180076 181961 183407 183681 183544 183859 183948 182765
57442A82765k041j782j316r69J15J778K497J881J272J340J275Q00P12J009P50
$$ 182765 180724 178942 177626 176657 176772 178550 181047 182928 184200 185540 186815 187615 188327 189336 190086
57427A90086J58M71J452J527O63N15J349J523N54j06M3l12j493j938r62O7K68
$$ 190086 190244 190715 192167 193694 194357 194872 196221 197744 198298 198192 198235 197923 196430 194492 193530 193597 193865
57410A93865M48J043J344J483K575M154M104K012m1q44j460k432k510j305l99
$$ 193865 194313 195356 196700 198183 200758 204912 209016 211028 210987 210143 208683 206251 203741 202436 202037
57395B02037n61m52O43J483J468J836K920L001J424K66J102K602L083L087L563
$$ 202037 201476 201024 201667 203150 204618 206454 209374 212375 213799 214065 215167 217769 220852 223939 227502
57380B27502L815L108K407K581K705J900J076J231J620J223M63M4l61r88j157
$$ 227502 231317 234425 236832 239413 242118 244018 245094 246325 247945 249168 249631 249675 249314 248326 247169
57365B47169p60r37k111l006k720k066j798j385n72k79q33j127n84j26k37j14
$$ 247169 246409 245472 243361 240355 237635 235569 233771 232386 231814 231535 230702 229575 228991 228865 228628 228514
57349B28514L88J66p64p02Q02J794J101K81Q78J982K143J588R67n1j400j808q74
$$ 228514 228902 229068 228304 227602 228404 230198 231299 231580 232458 234440 236583 238171 239138 239087 237687 235879 235005
57332B35005k0j8K67J359J774P08k95p0J05q57j598q28J49k84j160o99O53J283
$$ 235005 234985 234967 235234 236593 238367 239075 238780 238710 238815 237958 236360 235532 235681 235397 234237 233538 234191 235474
57314B35474J059P82M50m8J63J427K355J939J323J740K294J679O07N03J132J423
$$ 235474 236533 237315 237765 237717 237880 239307 241662 243601 244924 246664 248958 250637 251244 251747 252879 254302
57298B54302J421J663J830J604J635K191K250J386Q88J650K540K420K027K299
$$ 254302 255723 257386 259216 260820 262455 264646 266896 268282 269170 270820 273360 275780 277807 280106
57284B80106K606K317K269K971L186K051Q14P30J039Q10P97J575J921J077N82
$$ 280106 282712 285029 287298 290269 293455 295506 296320 297050 298089 298899 299696 301271 303192 304269 304851
57269C04851J713L061K956K321K748L667L875M009M925N416M282K972L339M363
$$ 304851 306564 309625 312581 314902 317650 321317 325192 329201 334126 339542 343824 346796 350135 354498
57255C54498L979K725K570L373L516L103L562M690M950M170L478L076K327J508
$$ 354498 358477 361202 363772 367145 370661 373764 377326 382016 386966 391136 394614 397690 400017 401525
57241D01525J349J447J135J040J962L136L546L805M753N498M954L996L912M049
$$ 401525 402874 404321 405456 406496 408458 411594 415140 418945 423698 429196 434150 438146 442058 446107
57227D46107L346K796L835N542O017N477N473O065O304O397O956P173O283N639
$$ 446107 449453 452249 456084 461626 467643 473120 478593 484658 490962 497359 504315 511488 517771 523410
57213E23410O839Q947J0137J0800J2300J3963J4262J3783J3971J4102J2741J1157
$$ 523410 530249 539196 549333 560133 572433 586396 600658 614441 628412 642514 655255 666412
57201F66412J1880J4597J6835J8111J9945K2347K3724K4122K5186K6901K7618
$$ 666412 678292 692889 709724 727835 747780 770127 793851 817973 843159 870060 897678
57190H97678K7345K7849K9333L0020K9330K8653K8741K9001K9549L1241L3386
$$ 897678 925023 952872 982205 1012225 1041555 1070208 1098949 1127950 1157499 1188740 1222126
57179A222126L4034L2766L0810K8435K4817K0634J8078J7935J8902K0005K1500
$$ 1222126 1256160 1288926 1319736 1348171 1372988 1393622 1411700 1429635 1448537 1468542 1490042
57168A490042K3327K4863K6190K7602K8132K6774K4677K3700K3417K2115K0184
$$ 1490042 1513369 1538232 1564422 1592024 1620156 1646930 1671607 1695307 1718724 1740839 1761023
57157A761023J9576K0262K0361J9613J9651K0737K1262K0781K0538K0797K0405
$$ 1761023 1780599 1800861 1821222 1840835 1860486 1881223 1902485 1923266 1943804 1964601 1985006
57146A985006J9332J8835J8800J7700J5429J3462J1934R509O410M670M838N372
$$ 1985006 2004338 2023173 2041973 2059673 2075102 2088564 2100498 2110007 2116417 2121087 2125925 2131297
57134B131297N959Q635J4613K2439L0092L6989M3478N0364N9075P0143Q1459R0310
$$ 2131297 2137256 2145891 2160504 2182943 2213035 2250024 2293502 2343866 2402941 2473084 2554543 2644853
57122B644853R6940J03650J10886J17111J22331J28387J35653J42713J49612J58294
$$ 2644853 2741793 2845443 2956329 3073440 3195771 3324158 3459811 3602524 3752136 3910430
57112C910430J69358J81474J94575K10612K30690K54331K81838L14340L51345
$$ 3910430 4079788 4261262 4455837 4666449 4897139 5151470 5433308 5747648 6098993
57103F098993L91762M37939M95749N70459O65896P87848R44485J142725J387566
$$ 6098993 6490755 6928694 7424443 7994902 8660798 9448646 10393131 11535856 12923422
57094A2923422J684924K040654K455191K921654L428190L957256M482568M972511
$$ 12923422 14608346 16649000 19104191 22025845 25454035 29411291 33893859 38866370
57086C8866370N398617N737990N969928O077270O047996N860785N463883M785225
$$ 38866370 44264987 50002977 55972905 62050175 68098171 73958956 79422839 84208064
57078H4208064L785530K508117J072427l82006j746856k957429l979133m793671
$$ 84208064 87993594 90501711 91574138 91192132 89445276 86487847 82508714 77715043
57070G7715043n392393n773349n941880n914308n719458n395047m981938m519217
$$ 77715043 72322650 66549301 60607421 54693113 48973655 43578608 38596670 34077453
57062C4077453m039980l568755l122447k712958k347867k029625j756371j524286
$$ 34077453 30037473 26468718 23346271 20633313 18285446 16255821 14499450 12975164
57054A2975164j328724j164224j025160r06754q05028p16694o39751n73221n15507
$$ 12975164 11646440 10482216 9457056 8550302 7745274 7028580 6388829 5815608 5300101
57045E300101m64065m17335l75459l38319l04486k73085k44812k19835j96582
$$ 5300101 4836036 4418701 4043242 3704923 3400437 3127352 2882540 2662705 2466123
57036B466123j73939j52815j33956j16097r7887p9854o2772m5941k8687j1357
$$ 2466123 2292184 2139369 2005413 1889316 1791429 1711575 1648803 1602862 1574175 1562818
57026A562818O746K7110M6286N3067L6507k635n1025r2984j19622j29753j26726
$$ 1562818 1569564 1596674 1642960 1696027 1732534 1729899 1678874 1585890 1466268 1336515 1209789
57015A209789j15940j02593q9507p7201o5885n6221m8389m1944l6701l2699k9381
$$ 1209789 1093849 991256 901749 824548 758663 702442 654053 612109 575408 542709 513328
57004E13328k5972k2547j9791j7979j7003j6899j7353j7264j5896j3946j2550
$$ 513328 487356 464809 445018 427039 410036 393137 375784 358520 342624 328678 316128
56993C16128j1711j0688r293p712n641k625J036M562P625J0449J3375J6469J8770
$$ 316128 304417 293729 284436 276724 271083 268458 269494 274056 281681 292130 305505 321974 340744
56980C40744J7920J1932J897q354j5816k0227k2219k1682j8968j5824j3523j1445
$$ 340744 358664 370596 372493 364139 348323 328096 305877 284195 265227 249403 235880 224435
56968B24435q716n885l657j405J637M984Q092J1660J6295K1122K5167K8860L2500
$$ 224435 215719 209834 206177 204772 206409 211393 219485 231145 247440 268562 293729 322589 355089
56955C55089L4230L1178K2237Q826o195j9437k8156l1807l1902k9733k5502k0001
$$ 355089 389319 420497 442734 451560 445365 425928 397772 365965 334063 304330 278828 258827
56943B58827j5230j2189r767o883m007j350K427Q168J4589K0240K5461L0905L5807
$$ 258827 243597 231408 221641 214758 210751 209401 211828 219996 234585 254825 280286 311191 346998
56930C46998L9073M0202L7626K8483J2343o483k2481l3348l9333m0589l7709l3200
$$ 346998 386071 426273 463899 492382 504725 498242 475761 442413 403080 362491 324782 291582
56918B91582k9440k6146k2070j7942j5340j3879j1969r532p620o355n291m786
$$ 291582 262142 235996 213926 195984 180644 166765 154796 145264 137644 131289 125998 121212
56906A21212m903m180j749N34N53p16q95q0j60j115r70Q05K696L863N097P017
$$ 121212 116309 112129 110380 110914 111467 110751 109856 109776 109616 108501 107531 108336 111032 114895 119992 127009
56890A27009R400J2272J5855J9582K2728K5443K7536K7046K2025J3227L310n937
$$ 127009 136409 148681 164536 184118 206846 232289 259825 286871 308896 322123 325433 319496
56878C19496j3775j9011k0622j9371j6787j3199q563m204j443P16M286R332J4485
$$ 319496 305721 286710 266088 246717 229930 216731 208168 203964 202521 203237 207523 216855 231340
56865B31340J9730K6255L4071M1989M9615N7211O3804O7147O5048N5459L6836
$$ 231340 251070 277325 311396 353385 403000 460211 524015 591162 656210 711669 748505
56854G48505J0977j5563l5641m6919n1395n1086m6822m0151l3021k5639j7185
$$ 748505 759482 743919 708278 661359 609964 558878 512056 471905 438884 413245 396060
56843C96060q288l27P200J6008K6237L6895M8392O1767P5994Q8855R9767J08102
$$ 396060 387772 387445 394645 410653 436890 473785 522177 583944 659938 748793 848560 956662
56831I56662J09025R5167O3976K1201k3271o0884q6268r7785r8025r1749q2149
$$ 956662 1065687 1160854 1224830 1246031 1222760 1161876 1075608 977823 879798 788049 705900
56820G05900p0211n7164m4930l3949k3152j2490l159N079J4289K5420L7162M8334
$$ 705900 635689 578525 533595 499646 476494 464004 460845 465924 480213 505633 542795 591129
56808E91129N9259O9927P8276Q0691P3138N2689K0572j6074m7880o9379q0525
$$ 591129 650388 720315 798591 879282 952420 1005109 1025681 1009607 961727 892348 811823
56797H11823q3261p9307p0981o1090n1150m1493l2953k6307k0365j3192n154J835
$$ 811823 728562 649255 578274 517184 466034 424541 391588 365281 344916 331724 326570 328405
56785C28405P813J4669K2593K9697L5272M0114M3034M0282K9708J3197n636k3690
$$ 328405 336218 350887 373480 403177 438449 478563 521597 561879 591587 604784 599148 575458
56773E75458l7891m5710m7499m6155m3553l9440l4115k9393k5989k2565j8414
$$ 575458 537567 491857 444358 398203 354650 315210 281095 251702 225713 203148 184734
56762A84734j4755j2435j0699r148q575q865q399o593m925m480m493m111l564
$$ 184734 169979 157544 146845 137697 129122 120257 111858 105265 100340 95860 91367 87256 83692
56749H3692k962j962j154j575k475j993m08j5j286k081j338n60o37l20R03J383
$$ 83692 80730 78768 77614 76039 73564 71571 71163 71148 69862 67781 66443 65883 65246 64926 65829 67212
56733F7212L20n86r5N62K23j78K32N01l8j94Q62J959K107K141K682K698J714J155
$$ 67212 67532 66946 66851 67413 67636 67458 67690 68191 68153 67959 68821 70780 72887 75028 77710 80408 82122 83277
56715H3277J798K124J048L5N46J484J291O07O91R57L31m44j6J179J747J491J105
$$ 83277 85075 87199 88247 88282 88828 90312 91603 92210 92901 93858 94189 93745 93729 94908 96655 98146 99251
56698I9251P34K79J04K23q1p91p77J95P23J53k08N40J165N35l18m9P35Q35O69
$$ 99251 99985 100264 100368 100591 100510 99719 98942 99137 99860 100013 99805 100345 101510 102045 101727 101678 102413 103248 103917
56679A03917J315K541L340L411K912J825O34L18O70J85j457k499j831p47o64r21
$$ 103917 105232 107773 111113 114524 117436 119261 119895 120213 120883 121068 119611 117112 115281 114534 113870 112949
56663A12949l94M12M80J16R8L00M29Q35J459J417O82N65J454J873R45q7j09Mp43
$$ 112949 112555 112967 113447 113563 113661 113961 114390 115225 116684 118101 118783 119348 120802 122675 123620 123533 123424 123428 122685
56644A22685j553j353o00r4M03J040J040L09J72J126J683P81m95r62j146j649
$$ 122685 121132 119779 119179 119085 119488 120528 121568 121877 122049 123175 124858 125639 125144 124182 123036 121387
56628A21387j704r59o62j454j914j054j36l15n47K35Q72Q8j129j355j185j683
$$ 121387 119683 118724 118062 116608 114694 113640 113504 113189 112642 112877 113749 113837 112708 111353 110168 108485
56612A08485k128j464l77R8M89J296J306k73j673r21J075K051J664J056N41j55
$$ 108485 106357 104893 104516 104614 105103 106399 107705 107432 105759 104838 105913 107964 109628 110684 111225 111070
56596A11070m92n5K88n4p4Q72J510R01L96J183J853Q09o62m38Q73J207N32L29
$$ 111070 110578 110523 110811 110757 110683 111555 113065 113966 114362 115545 117398 118207 117545 117107 117980 119187 119719 120048
56578A20048P02P20O79J382K094J663Q90J337K579L047K782L044L866M286M416
$$ 120048 120750 121470 122149 123531 125625 127288 128178 129515 132094 135141 137923 140967 144833 149119 153535
56563A53535N145O391P525Q867J0959J3205J4766J5720J5748J3202P531J243k738
$$ 153535 158680 165071 172596 181463 192422 205627 220393 236113 251861 265063 272594 273837 271099
56550B71099m372n205n330m139k640k425l223l771m171n075n714n051l915l667
$$ 271099 266727 261522 256192 252053 249413 246988 243765 239994 235823 230748 225034 219983 216068 212401
56536B12401l817l158k109j696j492p65m71j598k923k889k340k809l509k770j234
$$ 212401 208584 205426 203317 201621 200129 199364 198893 197295 194372 191483 189143 186334 182825 180055 178821
56521A78821o81q72m53J63l21j336j575j784l329n031m661k795j848k013j426
$$ 178821 178140 177268 176815 176978 176657 175321 173746 171962 168633 163602 158941 156146 154298 152285 150859
56506A50859P2P13R7l93m09q55j422q06O40J163M62k63q09j900k884k285n44L91
$$ 150859 150931 151644 151741 151348 150939 150084 148662 147856 148496 149659 150121 149858 149049 147149 144265 141980 141436 141827
56488A41827J02j13J33L3l02R0R77J282J137J400J538N11r14j126m26k92n31J96
$$ 141827 141929 141816 141949 141982 141680 141770 142747 144029 145166 146566 148104 148615 147701 146575 146149 145857 145326 145522
56470A45522J601K224K112K333K468J403lK9R82Q46l05o01J50L37l01m27J45L05
$$ 145522 147123 149347 151459 153792 156260 157663 157660 157689 158671 159517 159212 158611 158761 159098 158797 158370 158515 158820
56452A58820O7L27N87k27j118k14J772K484J939K215L383L288J514J10m7l03j241
$$ 158820 158887 159214 159801 159574 158456 158242 160014 162498 164437 166652 170035 173323 174837 174947 174900 174597 173356
56435A73356j716j417j473j961j673o19j65l39J82J299J508Q14P52J371J122j
$$ 173356 171640 170223 168750 166789 165116 164497 164332 163993 164175 165474 166982 167796 168548 169919 171041 171040
56419A71040k32P21J126M18M1O68J213J070Q81P53J87j62Q10K213K032M08n99
$$ 171040 170808 171529 172655 173073 173114 173782 174995 176065 176946 177699 177886 177724 178534 180747 182779 183187 182588
56402A82588l64o0K4O85J480J152K35K88Q94M34n81k46J010R78k78n31M88P88
$$ 182588 182224 182164 182188 182873 184353 185505 185740 186028 186922 187356 186775 186529 187539 188517 188239 187708 188196 188984
56384A88984Qq7P52Q22k3l1R24J047J94J78J214J587J181J661K872K834J626J438
$$ 188984 188992 188905 189657 190479 190456 190425 191349 192396 192590 192768 193982 195569 196750 198411 201283 204117 205743 207181
56366B07181K329J981J37p33J18O57K04N34J988K523J660J474K600L103K314J915
$$ 207181 209510 211491 211628 210895 211013 211670 211874 212408 214396 216919 218579 220053 222653 225756 228070 229985
56350B29985K268J596j69p39K53M00r49j418j10Q05L59N20K108L059K340J784
$$ 229985 232253 233849 233680 232941 233194 233594 232645 231227 231117 231922 232281 232801 234909 237968 240308 242092
56334B42092K421K787K355K744M112M277K859K353L603M380L830L977N212M818
$$ 242092 244513 247300 249655 252399 256511 260788 263647 266000 269603 273983 277813 281790 287002 291820
56320B91820K000j10L05R01j45r16K18J417J014N11J292J932J340J128K453L807
$$ 291820 293820 293710 294015 294916 294771 293855 294073 295490 296504 297015 298307 300239 301579 302707 305160 308967
56304C08967M198M960O375O292M368L773O134Q540Q234O582N821N432M463M037
$$ 308967 313165 318125 324500 330792 335160 338933 345067 353607 361841 368423 374244 379676 384139 388176
56290C88176M846N324M673M480N315N294M064M318P070R414R430R313J0956J2557
$$ 388176 393022 398346 403019 407499 412814 418108 422172 426490 433560 442974 452404 461717 472673 485230
56276D85230J2419J2212J3466J4573J4275J4435J6376J8140J8291J8772K1104
$$ 485230 497649 509861 523327 537900 552175 566610 582986 601126 619417 638189 659293
56265F59293K3461K4497K6299L0494L5121L8388M1889M7130N2703N7823O4772
$$ 659293 682754 707251 733550 764044 799165 837553 879442 926572 979275 1037098 1101870
56254A101870P4710Q5029R4110J04669J18994J34832J49469J63929J79551J94293
$$ 1101870 1176580 1261609 1355719 1460388 1579382 1714214 1863683 2027612 2207163 2401456
56244B401456K06179K16667K26899K34175K35661K32008K23927K09169J86507
$$ 2401456 2607635 2824302 3051201 3285376 3521037 3753045 3976972 4186141 4372648
56235D372648J58824J28567R4120N4355J2704k7092o5122j01400j32337j55447
$$ 4372648 4531472 4660039 4754159 4808514 4821218 4794126 4729004 4627604 4495267 4339820
56225D339820j73429j89137k00581k05345k05659k04426k00268j91505j81066
$$ 4339820 4166391 3977254 3776673 3571328 3365669 3161243 2960975 2769470 2588404
56216B588404j72321j63672j52321j39830j28995j18873j07896r8324r2344q7170
$$ 2588404 2416083 2252411 2100090 1960260 1831265 1712392 1604496 1506172 1413828 1326658
56206A326658p9339p0525o4060n8982n2836m6971m3613m0903l6197l1249k8805
$$ 1326658 1247319 1176794 1112734 1053752 1000916 953945 910332 869429 833232 801983 773178
56195G73178k7157k3507j9553j8254j8077j5966j3097j2211j2107j0309q244q316
$$ 773178 746021 722514 702961 684707 666630 650664 637567 625356 613249 602940 594696 586380
56183E86380q716o670l984l836m970m514l586m480n388l662j309j466k405r53
$$ 586380 577664 570994 567010 563174 558204 553690 550104 545624 540236 536574 535265 533799 531394 530441
56169E30441J224Q21n93M57K677K600J192J696L412L767L955O316Q778Q119O269
$$ 530441 531665 532486 531893 532350 535027 537627 538819 540515 543927 547694 551649 557965 566743 574862 581131
56154E81131P166R907J1173J1701J4117J7040J7887J8775K3158K9187L3003L6059
$$ 581131 588297 598204 609377 621078 635195 652235 670122 688897 712055 741242 774245 810304
56142H10304M2426N1313N8868O4982P1857P8325Q1914Q3777Q5240Q2694P2691
$$ 810304 852730 904043 962911 1027893 1099750 1178075 1259989 1343766 1429006 1511700 1584391
56131A584391N9077M8191M0292L2582K6845K6131K7152K4125J7516J1289M811
$$ 1584391 1643468 1691659 1731951 1764533 1791378 1817509 1844661 1868786 1886302 1897591 1902402
56120A902402m479j3522j7425j8150k1294k7008l2380l9495n1985o6241p5188
$$ 1902402 1897923 1884401 1866976 1848826 1827532 1800524 1768144 1728649 1676664 1610423 1535235
56109A535235p8495q0336p9901p3521o3649n6087n0277m1733l1917k6135k3703
$$ 1535235 1456740 1376404 1296503 1222982 1159333 1103246 1052969 1011236 979319 953184 929481
56098I29481j9730j4681j2575j1894q093l020j945l355j770J627J583l59J581
$$ 929481 909751 895070 882495 870601 862508 859488 857543 854188 852418 854045 855628 855269 856850
56085H56850O054O828M546N089P938P565M885N757R416R945Q017R420J3237J3374
$$ 856850 862904 869732 874278 879367 887305 894870 899755 905512 914928 924873 932890 942310 955547 968921
56071I68921J0725J1642J5427J5701J3210J4579J9123J9770J6557J6265J9067
$$ 968921 979646 991288 1006715 1022416 1035626 1050205 1069328 1089098 1105655 1121920 1140987
56060A140987J8745J5781J6791K1049K1191J7385J7069K0439K0109J5628J4267
$$ 1140987 1159732 1175513 1192304 1213353 1234544 1251929 1268998 1289437 1309546 1325174 1339441
56049A339441J6771J6432J2954J3100J6869J7254J4392J5439J9983K0443J7345
$$ 1339441 1356212 1372644 1385598 1398698 1415567 1432821 1447213 1462652 1482635 1503078 1520423
56038A520423J8896K4865K6640K3922K5212L0978L2984L1195L4188M1541M3435
$$ 1520423 1539319 1564184 1590824 1614746 1639958 1670936 1703920 1735115 1769303 1810844 1854279
56027A854279L9357L9221M4248M4961M0262L9785M4963M6618M3854M6018N3383
$$ 1854279 1893636 1932857 1977105 2022066 2062328 2102113 2147076 2193694 2237548 2283566 2336949
56016B336949N5638N2252N4085O2039O5042O2169O5087P5153Q0390P8865Q2233
$$ 2336949 2392587 2444839 2498924 2560963 2626005 2688174 2753261 2828414 2908804 2987669 3069902
56005C069902R2130R6609R4253R7584J08045J12714J10617J16129J31027J40271
$$ 3069902 3162032 3258641 3352894 3450478 3558523 3671237 3781854 3897983 4029010 4169281
55995D169281J41184J48763J65811J77021J79655J89806K10698K26014K32765
$$ 4169281 4310465 4459228 4625039 4802060 4981715 5171521 5382219 5608233 5840998
55986E840998K48236K75627K96753L08158L29126L63856L92880M12715M44912
$$ 5840998 6089234 6364861 6661614 6969772 7298898 7662754 8055634 8468349 8913261
55977H913261M94094N38303N73593O24630O97394P67716Q31741R18288J034790
$$ 8913261 9407355 9945658 10519251 11143881 11841275 12608991 13440732 14359020 15393810
55968A5393810J154095J273173J428037J630506J852172K093826K403875K803476
$$ 15393810 16547905 17821078 19249115 20879621 22731793 24825619 27229494 30032970
55960C0032970L268582L816032M527553N459539O624919Q102452J0056825J2605693
$$ 30032970 33301552 37117584 41645137 47104676 53729595 61832047 71888872 84494565
55952H4494565J5781933J9646797K4241243K9345001L4515292L9446988M3830780
$$ 84494565 100276498 119923295 144164538 173509539 208024831 247471819 291302599
55945B91302599M6384521M4390354L5201550J8816692j229138j9861349l3408413
$$ 291302599 337687120 382077474 417279024 436095716 434866578 415005229 381596816
55938C81596816m0854598m3054534m1490216l7659304l2861886k7991099k3475195
$$ 381596816 340742218 297687684 256197468 218538164 185676278 157685179 134209984
55931A34209984j9483437j6110873j3360387j1119732r272182p773295o584157
$$ 134209984 114726547 98615674 85255287 74135555 64863373 57090078 50505921
55924E0505921n617946m803614m132415l597871l151279k753893k415098k142747
$$ 50505921 44887975 40084361 35951946 32354075 29202796 26448903 24033805 21891058
55916B1891058j906841j684205j490634j337984j203407j069173r51411q62494
$$ 21891058 19984217 18300012 16809378 15471394 14267987 13198814 12247403 11384909
55908A1384909p83553o99730o26273n75304n30733m79318m34384m06419l80627
$$ 11384909 10601356 9901626 9275353 8700049 8169316 7689998 7255614 6849195 6468568
55899F468568l45150l12881k94582k77626k51402k27774k16849k07045j87997
$$ 6468568 6123418 5810537 5515955 5238329 4986927 4759153 4542304 4335259 4147262
55890D147262j69930j62241j55097j39739j25746j21279j16590j03431r1282q8692
$$ 4147262 3977332 3815091 3659994 3520255 3394509 3273230 3156640 3053209 2961927 2873235
55880B873235q7484q0521p6393q1612q6231q1899p6726p8088p7998o9749o2263
$$ 2873235 2785751 2705230 2628837 2547225 2460994 2379095 2302369 2224281 2146283 2076534 2014271
55869B014271o3407o5111n9299n3034n3777n4584m8100m1079m0977m1626l5976
$$ 2014271 1950864 1885753 1826454 1773420 1719643 1665059 1616959 1575880 1534903 1493277 1457301
55858A457301l0081l1006l3178k9801k5978k7742k9664k5838k1964k4255k7242
$$ 1457301 1427220 1396214 1363036 1333235 1307257 1279515 1249851 1224013 1202049 1177794 1150552
55847A150552k4639k1635k4476k8152k6314k3399k5245k7330k3915j9608k0391
$$ 1150552 1125913 1104278 1079802 1051650 1025336 1001937 976692 949362 925447 905839 885448
55836H85448k2055j8741j4338j4473j5491j2253q730j0181j2582j0307o783p336
$$ 885448 863393 844652 830314 815841 800350 788097 779367 769186 756604 746297 739514 732178
55824G32178q844o563m086o494j0462j0764r956j2301j4712j2930j0185j0821
$$ 732178 723334 716771 712685 706191 695729 684965 675009 662708 647996 635066 624881 614060
55812F14060j1781r107o213p108q109m955j458k292l876j285K357K296J486M421
$$ 614060 602279 593172 586959 579851 571742 566787 565329 563037 559161 557876 560233 562529 564015 568436
55798E68436P906P081M685N250N972K430k279l185k755n522q792p943n759p221
$$ 568436 576342 583423 588108 593358 599330 601760 599481 596296 593541 588019 579227 571284 565525 558304
55784E58304r754p959l730k594m054m332m676q086j1566j0249n841k852j59N556
$$ 558304 548550 540591 536861 534267 530213 525881 521205 513119 501553 491304 485463 482611 482452 488008
55770D88008J1956J4981J6796K1158K4302J9396P464m415j3246k0519k5225k4839
$$ 488008 499964 514945 531741 552899 577201 596597 604061 599646 586400 565881 540656 515817
55758E15817k1393j9072j7572j4528j1864j2632j4243j2191q170p268r419j0597
$$ 515817 494424 475352 457780 443252 431388 418756 404513 392322 384152 376884 367465 356868
55746C56868j0169j0150r497o164k609k424l722k481M0N9j219o7K131J073k501
$$ 356868 346699 336549 327052 320888 318279 315855 312133 309652 309692 309751 308532 308465 310596 311669 309168
55731C09168m227l845m517o083n850m688n558p331o619m368m185n520m942k746
$$ 309168 304941 301096 296579 290496 284646 279958 274400 267069 260450 256082 251897 246377 241435 238689
55717B38689j938j991o5K941L886L577N154P711P980O940Q084J0230Q923M220
$$ 238689 236751 234760 234695 237636 241522 245099 250253 257964 265944 272884 280968 291198 300121 304341
55703C04341M73j147l390o672q437q630r748j1435j0848q265o756o561n210k890
$$ 304341 304814 303667 300277 293605 285168 276538 266790 255355 244507 236242 229486 222925 217715 214825
55689B14825k199k932k528j248j479k447j165J774K961K270K661M247M249K677
$$ 214825 212626 209694 207166 205918 204439 201992 200827 202601 205562 207832 210493 214740 218989 221666
55675B21666K335L080J756j796m162m157m135m989m920l644l117l548l075j661
$$ 221666 224001 227081 228837 227041 222879 218722 214587 209598 204678 201034 197917 194369 191294 189633
55661A89633j042r09N24K437K375R42R12K140K131J207K002M097M310K402J407
$$ 189633 188591 187682 188206 190643 193018 193960 194872 197012 199143 200350 202352 206449 210759 213161 214568
55646B14568K123K237J235J127J926J267r57k248k264l277n483o480n856n843
$$ 214568 216691 218928 220163 221290 223216 224483 223526 221278 219014 215737 210254 203774 197918 192075
55632A92075o871o896n638n064n282m306k227j267j370k75J742J860j3p13P09
$$ 192075 185204 178308 172670 167606 162324 158018 155791 154524 153154 152879 154621 156481 156468 155755 156464
55617A56464J487J13j490j800j759k040j980j852k635l311k062j69o13k878l529
$$ 156464 157951 158064 156574 154774 153015 150975 148995 147143 144508 141197 139135 138966 138353 135475 131946
55602A31946j975j019j470j082N92J129q6p13O2L45l19r6R64M56j644k325p92
$$ 131946 129971 128952 127482 126400 126992 128121 128035 127322 127384 127729 127410 127314 128278 128734 127090 124765 123973
55585A23973O7j206k440k166j808k064j327O84J696R57O89J936K759K106J735
$$ 123973 124040 122834 120394 118228 116420 114356 113029 113713 115409 116366 117055 118991 121750 123856 125591
55570A25591K756L760L893M296N116M650K743J535J606R25j203k801k920l020
$$ 125591 128347 132107 136000 140296 145412 150062 152805 154340 155946 156871 155668 152867 149947 146927
55556A46927l549k998j520j468l099l701k423j745k688k831r96L58m17j305n93
$$ 146927 143378 140380 138860 137392 134293 130592 128169 126424 123736 120905 119909 120267 119850 118545 117952
55541A17952J86l45n76P98K034J481M95P13J144L93p59j156j282j584j217r3L07
$$ 117952 118138 117793 117217 118015 120049 121530 122025 122738 123882 124275 123516 122360 121078 119494 118277 118184 118491
55524A18491l98o33L7j32j711k749k235j751k184k039o89J3q38j417o72l27j414
$$ 118491 118093 117460 117497 117365 115654 112905 110670 108919 106735 104696 104007 104020 103182 101765 101093 100766 99352
55507I9352k121j168j29k56j45J191K021J086K9K52K89j116k199j210L72L68o05
$$ 99352 97231 96063 95934 95678 95533 96724 98745 99831 99860 100112 100401 99285 97086 95876 96248 96616 96011
55490I6011q27m65m62l66L46P02K2n80l06k00q80r45N02K058K401K239K267J677
$$ 96011 95184 94719 94257 93891 94237 94939 94961 94381 94075 93875 92995 92050 92552 94610 97011 99250 101517 103194
55472A03194L79O8J217J698K31j456j752j663k187k186r70j62p11r06L33J153
$$ 103194 103573 103641 104858 106556 106787 105331 103579 101916 99729 97543 96573 96411 95700 94794 95127 96280
55456I6280K05o23K95J150m0j690j427j16J72j26L61P41m17j949j901q56n10o12
$$ 96280 96485 95862 96157 97307 97267 95577 94150 94034 94206 94080 94441 95182 94765 92816 90915 90059 89549 88937
55438H8937k21j94j427k336j154Q34J377R68J416K206J576N7l36M36P18J48l05
$$ 88937 88716 88522 87095 84759 83605 84439 85816 86784 88200 90406 91982 92039 91703 92139 92857 93005 92700
55421I2700n63j145j413n60N54O81L30N51Q28L37o9N62J129L66n81n6R51L81j311
$$ 92700 92137 90992 89579 89019 89573 90254 90584 91135 91963 92300 92231 92793 93922 94288 93707 93651 94602 94983 93672
55402I3672k045j555j226j245o65K85M94P1p8j41p44j182n16M22K87l24R8J301
$$ 93672 91627 90072 88846 87601 86936 87221 87715 87786 87708 87567 86823 85641 85125 85547 85834 85510 85608 86909
55384H6909J824J433R89O31J26Q8Q82J313L87o99m31L83J04q22r19n18r72j949
$$ 86909 88733 90166 91155 91786 91912 92000 92882 94195 94582 93883 93452 93835 93939 93117 92198 91680 90708 88759
55366H8759k008j188o38m06J31M55j93r43n58K91K36k86p0L66j59r52n86L28J79
$$ 88759 86751 85563 84925 84519 84650 85105 84912 83969 83411 83702 83938 83652 83582 83948 83789 82837 82251 82579 82758
55347H2758o01k99R21J375Q37M95L72m51j442j094L80J306J239J030O71m44j473
$$ 82758 82157 81858 82779 84154 84991 85486 85858 85407 83965 82871 83251 84557 85796 86826 87497 87053 85580
55330H5580r94L89P71O2k19J15j92j082j076n4M47j01n74m41l47l60J84R58R50
$$ 85580 84586 84975 85746 85808 85589 85704 85512 84430 83354 83300 83747 83646 83072 82631 82284 81924 82108 83066 84016
55311H4016N24R59J983K008R04J82K98J58m58m24M16P42R3m07k25k38q20j068
$$ 84016 84540 85499 87482 89490 90394 90576 90874 91032 90574 90150 90566 91308 91401 90994 90769 90531 89711 88643
55293H8643n38RJ19K92O66O60L08L83Q77Q75K35j80j18k62p60r29n97l28k26L2
$$ 88643 88105 88114 88233 88525 89191 89851 90159 90542 91419 92294 92529 92349 92231 91969 91209 90280 89683 89355 89129 89161
55273H9161J20n06j213q83J74O40L56L26P33P63L60K74L94j23r97j033k08K96
$$ 89161 89281 88775 87562 86679 86853 87493 87849 88175 88908 89671 90031 90305 90699 90576 89579 88546 88338 88634
55255H8634J78L02P08M47m33o37J67P48L61k54l92l14k42Q3N25O01N50R63J369
$$ 88634 88812 89114 89822 90269 89836 89199 89366 90114 90475 90221 89829 89515 89273 89356 89881 90482 91032 91995 93364
55236I3364P65m64q01N1P91N96l9o45j291j623j064k13l05j124j114J34J240J163
$$ 93364 94129 93665 92864 92915 93706 94302 94263 93618 92327 90704 89640 89427 89122 87998 86884 87018 88258 89421
55218H9421L55m82j141j168k8J557K037J132J36j62k95o72q33n74l57k57J74Q01
$$ 89421 89776 89294 88153 86985 86957 88514 90551 91683 91819 91657 91362 90690 89857 89283 88926 88669 88843 89644
55200H9644R26N29K94L64L62M19Q03Q42j97j435j342k08K40m41j037r47q44r22
$$ 89644 90570 91099 91393 91757 92119 92538 93341 94183 93986 92551 91209 91001 91241 90800 89763 88816 87972 87050
55182H7050m98L32N45Qk69N1K53K00N39J215J497J486J796J833M89j441j770j26
$$ 87050 86552 86884 87429 87437 87168 87219 87472 87672 88211 89426 90923 92409 94205 96038 96527 95086 93316 93190
55164I3190J477J605Q25k8q46j178l48Q84R05j37n18Q7J76o28q37M2M55l67j028
$$ 93190 94667 96272 97097 97069 96223 95045 94697 95581 96486 96349 95831 95918 96094 95466 94629 94671 95126 94759 93731
55145I3731m60M33P14Q16R61L77p68r04L25J127M86k47J0J33r09j954j689q81
$$ 93731 93271 93704 94418 95234 96195 96572 95804 94900 95225 96352 96838 96591 96601 96734 95825 93871 92182 91301
55127I1301p33o95J95J287J462J056R42Q80L71j2L08N84K9o29l63L89N34Q6k28
$$ 91301 90568 89873 90068 91355 92817 93873 94815 95695 96066 96054 96362 96946 96975 96346 95983 96372 96906 96992 96764
55108I6764l15m65n27l49k20j05O14J843K403J856J318J595J831J261Q19J511
$$ 96764 96449 95984 95457 95108 94888 94783 95397 97240 99643 101499 102817 104412 106243 107504 108323 109834
55092A09834K370J699l76k071k159r39N51J317Q83k96j249j659j858j602k15J775
$$ 109834 112204 113903 113527 111456 109297 108358 108909 110226 111109 110813 109564 107905 106047 104445 104230 106005
55076A06005K669J876P16K47q7q61j415j225r76j049n15J124K555K403J162J50
$$ 106005 108674 110550 111266 111513 111426 110565 109150 107925 106949 105900 105385 106509 109064 111467 112629 112779
55060A12779l20m99j87N71Q97L70j58m0Q5k62k49O44J234L44j319k355k625k573
$$ 112779 112459 111960 111773 112344 113241 113611 113453 113413 113498 113236 112987 113631 114865 115209 113890 111535 108910 106337
55042A06337j835j91J165R60k40r94j039j031r82m84J78M67N75P98O35k47r58
$$ 106337 104502 104311 105476 106436 106196 105202 104163 103132 102150 101666 101844 102311 102886 103684 104319 104072 103114
55025A03114o03K07L22j96m99m49l72k8Q62J582J223P3q33j135j144r70o18l58
$$ 103114 102511 102718 103040 102844 102345 101896 101524 101496 102358 103940 105163 105236 104403 103268 102124 101154 100536 100178
55007A00178k55J17P90J029N28O0K09M94N08O99J222J310P70O75J486J953J234
$$ 100178 99923 100040 100830 101859 102387 102447 102656 103150 103658 104357 105579 106889 107659 108334 109820 111773 113007
54990A13007N59J152J911J057r58k172j931j162n32m3O9k93l13O53J729J697Q85
$$ 113007 113566 114718 116629 117686 116728 114556 112625 111463 110931 110888 110957 110664 110351 111004 112733 114430 115315
54973A15315N05O47M84r8n17o80q62q37l92o2k35k13N32J061L70p51q11K6L82
$$ 115315 115820 116467 116951 116853 116336 115656 114794 113957 113565 113503 113268 113055 113587 114648 115018 114267 113456 113482 113864
54954A13864j21o17n58j76K92N99K83m79n48M65J219O83q0K34P51mj287j211N1
$$ 113864 113743 113126 112568 112392 112684 113283 113566 113087 112539 113004 114223 114906 114826 115060 115811 115807 114520 113309 113360
54935A13360N97n1n44l24k93o95n60L60J044J018J026J551K179K783L833N190
$$ 113360 113957 113906 113362 113038 112745 112050 111490 111850 112894 113912 114938 116489 118668 121451 125284 130474
54919A30474N998O097O301P010P649P708P271O355M835L012J298n68k970n303
$$ 130474 136472 142569 148870 155880 163529 171237 178508 184863 189698 192710 194008 193440 190470 185167
54905A85167o584o895p056p102o395n035l817k885j737n04J9l71j134j926k693
$$ 185167 178583 171688 164632 157530 151135 146100 142283 139398 137661 137157 137176 136805 135671 133745 131052
54890A31052l047k640j918j416p89L85J485J756J696K152K657K345J810K386L977
$$ 131052 128005 125365 123447 122031 121242 121627 123112 124868 126564 128716 131373 133718 135528 137914 141891
54875A41891N344O105O715P016O699O637P603Q138O061J941j448l100m613o785
$$ 141891 147235 153340 160055 167071 173770 180407 188010 196148 202209 204150 202702 199602 194989 188204
54861A88204q167p766o711o123n494m411l842m401m951m368l293k865k893k563
$$ 188204 180037 172271 165560 159437 153943 149532 145690 141289 136338 131970 128677 125812 122919 120356
54847A20356j922j499j227p64k30R1K01J16k00l26K89J183J130j43j528k107k022
$$ 120356 118434 116935 115708 114944 114714 114805 115006 115122 114922 114596 114885 116068 117198 117055 115527 113420 111398
54830A11398j531m71Q34J402R74M89N69O11M3o23p12m77m77o20m64M2O75J253
$$ 111398 109867 109396 110230 111632 112606 113095 113664 114275 114318 113695 112983 112506 112029 111409 110945 110987 111662 112915
54812A12915J513J231O73L51K53Ok72q6M84Q98J087J328J331O29k39k57L79M34
$$ 112915 114428 115659 116332 116683 116936 116942 116670 116584 117068 117966 119053 120381 121712 122341 122102 121845 122224 122658
54794A22658l67r75q30o08p98r65q09o95o72l06J97M3o24o66J92R08J043J467
$$ 122658 122291 121316 120486 119878 119080 118115 117306 116611 115939 115633 115830 115873 115249 114583 114775 115683 116726 118193
54776A18193K525L114K523J718J760K191K158K004K575L757M802N463N962O414
$$ 118193 120718 123832 126355 128073 129833 132024 134182 136186 138761 142518 147320 152783 158745 165159
54762A65159O979P907Q862Q942P864O330M783K718k02l314n849p756r032r268
$$ 165159 172138 180045 188907 197849 205713 212043 216826 219544 219342 216028 210179 202423 193391 184123
54748A84123q434p311o414n409m114l129k826k648k119j686j808k123k174k140
$$ 184123 175689 168378 161964 156555 152441 149312 146486 143838 141719 140033 138225 136102 133928 131788
54734A31788k151j675m39Q17J254J053R64J289J858K440K782K797K946L762M868
$$ 131788 129637 127962 127523 128340 129594 130647 131611 132900 134758 137198 139980 142777 145723 149485 154353
54719A54353N324N112N184N819O149N635M736L689J931o32l039m637n770o600
$$ 154353 159677 164789 169973 175792 181941 187576 192312 196001 197932 197300 194261 189624 183854 177254
54705A77254o539n607m965n125n051l970k774k387k106r86K55K44q48j669j677
$$ 177254 170715 165108 160143 155018 149967 145997 143223 140836 138730 137744 137999 138243 137395 135726 134049
54690A34049j446j343j187r08o10k51J6l30j272j866j517r35r95j348j215q06
$$ 134049 132603 131260 130073 129165 128555 128304 128320 127990 126718 124852 123335 122400 121405 120057 118842 118036
54674A18036q64j284j304p09L1N18N23j49j164j505o87M56Q85P71Q66J146J009
$$ 118036 117172 115888 114584 113875 113906 114424 114947 114798 113634 112129 111442 111898 112783 113554 114420 115566 116575
54657A16575M10j51n25q91j143r98n25J2N01P70N75J85L25J022J291O60Q9N72
$$ 116575 116985 116834 116309 115418 114275 113277 112752 112764 113265 114035 114610 114795 115120 116142 117433 118093 118182 118754
54639A18754J577J887J295N22l8n13q83r99r66q61n27j08j44n74n24K94Q85N28
$$ 118754 120331 122218 123513 124035 123997 123484 122601 121602 120636 119775 119248 119140 118996 118422 117898 118192 119077 119605
54621A19605K1L47J024R94M04J29J57j67p23p68k87j0j99m87o62p67o20j43J63
$$ 119605 119626 119973 120997 121991 122395 122524 122681 122514 121791 121023 120736 120726 120527 120040 119378 118611 117991 117848 118011
54602A18011n6k43K01Q25Q40M47L08K48k64p57l28O62Q82Q1n22j68L79J57n63
$$ 118011 117955 117712 117913 118738 119578 120025 120333 120581 120317 119560 119232 119894 120776 120857 120335 120167 120546 120703 120140
54583A20140p61K4J245J920J509N10L1M93J062P64k01q81q74n19r1L77O65M60
$$ 120140 119379 119403 120648 122568 124077 124587 124618 125111 126173 126937 126736 125855 124981 124462 124371 124748 125413 125873
54565A25873j95r74j622j857j349k90M74M37N8p0q2k34j80L66Q69P84N27P43J178
$$ 125873 125678 124704 123082 121225 119876 119586 120060 120497 120555 120485 120403 120169 119989 120355 121224 122008 122535 123278 124456
54546A24456J224J046J138J265R26M21L44M75L06K57J096K397K829J970P18n0
$$ 124456 125680 126726 127864 129129 130055 130476 130820 131295 131601 131858 132954 135351 138180 140150 140868 140818
54530A40818k58j03K00J76m50j143j185p78o31o94l53K86M03k38r93j371j460
$$ 140818 140560 140457 140657 140833 140383 139240 138055 137277 136646 135952 135599 135885 136288 136050 135057 133686 132226
54513A32226j291p44j27N7n6J23N35M64l33j219j576j378q27n4O91J125J203R71
$$ 132226 130935 130191 130064 130121 130065 130188 130723 131187 130854 129635 128059 126681 125854 125800 126491 127616 128819 129790
54495A29790L38m95q06j45Q89J338J021M03j95n54k99M83R00L87l15k62K31K60
$$ 129790 130128 129633 128827 128682 129571 130909 131930 132333 132138 131584 131285 131768 132668 133055 132740 132478 132709 132969
54477A32969o5MM22N81O21J065J526J213M98M82J096J182N20J93P21J319J367
$$ 132969 132904 132908 133330 133911 134532 135597 137123 138336 138834 139316 140412 141594 142114 142307 143028 144347 145714
54460A45714J286J524J829J935J898J479L16j083j672j477j594k324k609j830
$$ 145714 147000 148524 150353 152288 154186 155665 155981 154898 153226 151749 150155 147831 145222 143392
54446A43392q68o32p17l59J81R5o93j481j678j215m47M0j02n48p01m79j84J87
$$ 143392 142524 141892 141175 140816 140997 141092 140399 138918 137240 136025 135578 135618 135516 134968 134267 133788 133604 133791
54428A33791P75J177Q70K70K80Q54J061P11O75J299J696J093k3o81n65K8O06N88
$$ 133791 134566 135743 136613 136883 137163 138017 139078 139789 140464 141763 143459 144552 144529 143848 143283 143311 143917 144505
54410A44505l06j385j499m45P19J037N93pl01j1P88J392J170M95J75N8n42j185
$$ 144505 144199 142814 141315 140870 141589 142626 143219 143212 142911 142900 143688 145080 146250 146745 146920 146978 146436 145251
54392A45251n50J355K774K549J536R58O46j26j108j445r67k30K32J49m38r75p69
$$ 145251 144701 146056 148830 151379 152915 153873 154519 154393 153285 151840 150873 150643 150875 151024 150586 149611 148842
54375A48842J1N19N67Q69J571J750R94L87J049K556L722M150M174M025L880M165
$$ 148842 148853 149372 149939 150808 152379 154129 155123 155510 156559 159115 162837 166987 171161 175186 179066 183231
54359A83231M832M867L440J213l37o07k70k92j116k535l787m061l369k625k482
$$ 183231 188063 192930 196370 197583 197246 196639 196369 196077 194961 192426 188639 184578 181209 178584 176102
54344A76102k598k423k193k488l209l617l193k101r44l02l37o35p38p67j086j424
$$ 176102 173504 171081 168888 166400 163191 159574 156381 154280 153336 153034 152697 152062 151324 150557 149471 148047
54328A48047j023J53J167J328R60P06P17Q78J128J229Q77L18J56L30L1j007j966
$$ 148047 147024 147177 148344 149672 150632 151338 152055 152933 154061 155290 156167 156485 156641 156971 157002 155995 154029
54311A54029k078j536q44j23N09O15Q0n63q51q42n93K5O67N89k28q86r34r01j069
$$ 154029 151951 150415 149571 149448 149957 150572 150652 150089 149238 148396 147803 147828 148495 149084 148856 147970 147036 146135 145066
54292A45066r09l08j02n97p05L77J683J886J225Q93J133J309J232J202J093N34
$$ 145066 144157 143849 143747 143150 142445 142822 144505 146391 147616 148509 149642 150951 152183 153385 154478 155012
54276A55012k33o73q19r89r86n55k23o33j372j439p18M7M97R04J353J587J653
$$ 155012 154779 154106 153287 152298 151312 150757 150534 149901 148529 147090 146372 146419 146916 147820 149173 150760 152413
54259A52413J824J953J658J095P90P54N51J82J33M91O91L04m67j180j592j716
$$ 152413 154237 156190 157848 158943 159733 160487 161038 161220 161353 161844 162535 162839 162372 161192 159600 157884
54243A57884j711j738j624r77O6O20J16p09n53Q64K449K908J871O1j286j386o58
$$ 157884 156173 154435 152811 151834 151900 152520 152636 151927 151374 152238 154687 157595 159466 159527 158241 156855 156197
54226A56197k71p17j184p47L76J238J397J164R06O68L71r6p43j307j502j569j943
$$ 156197 155926 155209 154025 153278 153654 154892 156289 157453 158359 159027 159398 159302 158559 157252 155750 154181 152238
54209A52238k273j653j74P34K35o63o27J09M34J84O2K88M86O26R59J239J048O76
$$ 152238 149965 148312 148138 148872 149107 148444 147817 147926 148360 148544 148606 148894 149380 150006 150965 152204 153252 153928
54191A53928O39O58J67m46k25P75J525J556J372J283R75M36K36N73R83J246J748
$$ 153928 154567 155225 155392 154946 154721 155496 157021 158577 159949 161232 162207 162643 162879 163452 164435 165681 167429
54174A67429K517K773J931M68o70j028q00m36l91q49j505j827j650j186o53k53
$$ 167429 169946 172719 174650 175118 174448 173420 172620 172184 171793 170944 169439 167612 165962 164776 164123 163870
54158A63870l12q87j338j004j85K05j31o54j014j350j519r48L17J208Q88p7m08
$$ 163870 163558 162671 161333 160329 160144 160349 160218 159564 158550 157200 155681 154733 155050 156258 157146 157069 156661
54141A56661L11J236J344M92o10j186j077o65l32j47o5j06j80l5M28J008J505
$$ 156661 156972 158208 159552 160044 159434 158248 157171 156506 156174 156027 155962 155856 155676 155641 156069 157077 158582
54124A58582J912K073J618N56m21n94J3Q44J419J456Q16j56o70l21L89P42O75
$$ 158582 160494 162567 164185 164741 164320 163726 163739 164583 166002 167458 168274 168118 167448 167127 167516 168258 168933
54107A68933N47N08N84Q83J264J276R65J136K153L140L189K746K843L428L612
$$ 168933 169480 169988 170572 171455 172719 173995 174960 176096 178249 181389 184578 187324 190167 193595 197207
54092A97207L203K725K151Q55j110k794l606l824l748l261k466j860j580j251
$$ 197207 200410 203135 205286 206141 205031 202237 198631 194807 191059 187798 185332 183472 181892 180641
54078A80641p28l22r1K89Q33J101R96R95J382J935K497L163L693L523K645J809
$$ 180641 179913 179591 179500 179789 180622 181723 182719 183714 185096 187031 189528 192691 196384 199907 202552 204361
54062B04361J474J249O43k22j029j813k626l059k641j519m49r8m51p83l39P86
$$ 204361 205835 207084 207727 207505 206476 204663 202037 198978 196337 194818 194369 194271 193820 193037 192698 193484
54046A93484J651J632J280J540K480L428M068M574M850M606M199M474N486O308
$$ 193484 195135 196767 198047 199587 202067 205495 209563 214137 218987 223593 227792 232266 237752 244060
54032B44060O316N978N867N720M978L774K744K158J690J013K85N6O16J478J716
$$ 244060 250376 256354 262221 267941 272919 276693 279437 281595 283285 284298 284583 284639 285255 286733 288449
54017B88449J047K01k10o57j855l360m061l925m185n502o943p284o503n451m600
$$ 288449 289496 289697 289487 288830 286975 283615 279554 275629 271444 265942 258999 251715 245212 239761 235161
54002B35161l767k755j762j167j123j369j467j282j127j235j352j212j028j133
$$ 235161 231394 228639 226877 225710 224587 223218 221751 220469 219342 218107 216755 215543 214515 213382
53988B13382j411j578j655j643j180k35L40j05q11n65M54R57N12q5l95q93j681
$$ 213382 211971 210393 208738 207095 205915 205680 206020 205915 205104 204539 204993 205950 206462 206377 205982 205089 203408
53971B03408j991j448o53n4O39J404J431M70l67K2J314K528L429M378N330N956
$$ 203408 201417 199969 199316 199262 199901 201305 202736 203206 202839 202861 204175 206703 210132 214510 219840 225796
53955B25796O412P204Q355R150Q711O610L258j85k617l821m222l962k907j398
$$ 225796 232208 239412 247767 256917 265628 272238 275496 275311 272694 268873 264651 260689 257782 256384
53941B56384j41P42J636K393K422K018K286L357L934L303K485K590L087K819J780
$$ 256384 256243 256985 258621 261014 263436 265454 267740 271097 275031 278334 280819 283409 286496 289315 291095
53926B91095Q06K84K66J089K749M179M402L947M060M887N665O263P242Q439Q846
$$ 291095 291901 292185 292451 293540 296289 300468 304870 308817 312877 317764 323429 329692 336934 345373 354219
53911C54219Q111P063O415N843M732L108J433n0j348k380k904k699j878j077j046
$$ 354219 362330 369393 375808 381651 386383 389491 390924 390874 389526 387146 384242 381543 379665 378588 377542
53896C77542j785k471k563k658l654n405o895p574p839q224q693q824q226o820
$$ 377542 375757 373286 370723 368065 364411 359006 352111 344537 336698 328474 319781 310957 302731 295911
53882B95911n104m064m297n236n687n097l887k697j825j394j484j917k365k708
$$ 295911 290807 286743 282446 277210 271523 266426 262539 259842 258017 256623 255139 253222 250857 248149
53868B48149l058l384l505l436l359l222k804k243k019k238k343j811q94l85p14
$$ 248149 245091 241707 238202 234766 231407 228185 225381 223138 221119 218881 216538 214727 213833 213448 212734
53853B12734j514j988j621o20K60L30l97j181j260o38k6N3r1R9M45K10o05r78
$$ 212734 211220 209232 207611 206991 207251 207581 207184 206003 204743 204105 204079 204132 204041 204140 204585 204795 204190 203212
53835B03212l11M42N6j079j401m07P11Q86N38O26J177J478J192O53L35M99J048
$$ 203212 202901 203343 203399 202320 200919 200512 201223 202109 202647 203273 204450 205928 207120 207773 208108 208607 209655
53818B09655J480J332Q77Q29J215J221N18k5M48J579K451K866L207L532L671L906
$$ 209655 211135 212467 213344 214173 215388 216609 217127 217102 217550 219129 221580 224446 227653 231185 234856 238762
53802B38762M656N661O140N778M918L934L013K436K463K926L367L548L443L011
$$ 238762 243418 249079 255219 260997 265915 269849 272862 275298 277761 280687 284054 287602 291045 294056
53788B94056K407K193K653L102K560J036m98j353j750k126k482k666k815l270
$$ 294056 296463 298656 301309 304411 306971 308007 307509 306156 304406 302280 299798 297132 294317 291047
53774B91047m252n662o957p324o457n112m426m528m395l259j692r16j357k281
$$ 291047 286795 281133 274176 266852 260395 255283 250857 246329 241934 238675 236983 236067 234710 232429
53760B32429k834k976l205l625l681k907j608n36j6K24M35N64N61N67N32J45o28
$$ 232429 229595 226619 223414 219789 216108 213201 211593 211057 211041 211265 211700 212264 212825 213392 213924 214069 213441
53743B13441j300j405j004m12K03P01P99M11j21m43n64n94l51L49J268J939K132
$$ 213441 212141 210736 209732 209320 209523 210224 211023 211434 211313 210870 210306 209712 209361 209710 210978 212917 215049
53726B15049J968J736J747K070K238J682N62k21j34L59N81N66P49J092J142P21
$$ 215049 217017 218753 220500 222570 224808 226490 227052 226831 226697 227056 227637 228203 228952 230044 231186 231907
53710B31907K08J71R34K212L118K965K181J923K544L170L055K592K503K772L045
$$ 231907 232115 232286 233220 235432 238550 241515 243696 245619 248163 251333 254388 256980 259483 262255 265300
53695B65300L397L934M228L896L345L052K707J809P12O5k31o08p42r1P67O32m81
$$ 265300 268697 272631 276859 280755 284100 287152 289859 291668 292380 292445 292214 291606 290864 290773 291540 292172 291691
53678B91691j274j066o29o99q27l44M10N89M0o69j100j269j345j422j523j522
$$ 291691 290417 289351 288722 288023 287196 286852 287262 287851 287891 287222 286122 284853 283508 282086 280563 279041
53662B79041j196n19J71M91L78J06j0R6K26J69l9j55p9J41M98R36J089O62Q7J51
$$ 279041 277845 277326 277497 277988 278366 278472 278462 278558 278784 278953 278914 278759 278680 278821 279319 280255 281344 282006 282093 282244
53642B82244Q09J134P94O98J540K629K937K605K341J991R69k60m52O79K110L019
$$ 282244 283053 284187 284981 285679 287219 289848 292785 295390 297731 299722 300691 300431 299979 300658 302768 305787
53626C05787L582M133M463M301L801L255K941L216M115M851M507L330K518K656
$$ 305787 309369 313502 317965 322266 326067 329322 332263 335479 339594 344445 348952 352282 354800 357456
53612C57456L193L558L868M176M071L477L162L732M680M983M287L101K127J775
$$ 357456 360649 364207 368075 372251 376322 379799 382961 386693 391373 396356 400643 403744 405871 407646
53598D07646K034K475K531J990J059m1j113j759j594q89m31n56p23l66K65L68
$$ 407646 409680 412155 414686 416676 417735 417694 416581 414822 413228 412339 411908 411352 410629 410263 410528 410896
53582D10896n01j989l259l649l171k428j947j791j890k287k737k577j671j021
$$ 410896 410395 408406 405147 401498 398327 395899 393952 392161 390271 387984 385247 382670 380999 379978
53568C79978j620k903l339k434j263q49j027j071o35K40J281J884J487L96m02
$$ 379978 378358 375455 372116 369682 368419 367570 366543 365472 364837 365077 366358 368242 369729 370125 369723
53553C69723m16l9L68R70J740K058J579R10Q55J401J906J942J707J794K702M160
$$ 369723 369307 369268 369636 370606 372346 374404 375983 376893 377748 379149 381055 382997 384704 386498 389200 393360
53537C93360N043M518L263K849L808N138N918O459P389Q492R133R251R315R626
$$ 393360 398403 402921 406184 409033 412841 417979 423897 430356 437745 446237 455370 464621 473936 483562
53523D83562J0235J1115J2028J2587J2800J3182J3981J4846J5496J6259J7424
$$ 483562 493797 504912 516940 529527 542327 555509 569490 584336 599832 616091 633515
53512F33515J8678J9656K0587K1840K3212K4212K4761K5174K5612K5974K6124
$$ 633515 652193 671849 692436 714276 737488 761700 786461 811635 837247 863221 889345
53501H89345K5950K5411K4688K4007K3209K1947K0378J9119J8371J7729J7079
$$ 889345 915295 940706 965394 989401 1012610 1034557 1054935 1074054 1092425 1110154 1127233
53490A127233J6848J7102J7191J6844J6769J7440J8079J7702J6677J6272J6995
$$ 1127233 1144081 1161183 1178374 1195218 1211987 1229427 1247506 1265208 1281885 1298157 1315152
53479A315152J8239J9254J9644J8991J6951J3798J0313P112M417K396J042j74
$$ 1315152 1333391 1352645 1372289 1391280 1408231 1422029 1432342 1439454 1443871 1446267 1447309 1447135
53467A447135j929m287o706q861j0902j2900j4471j5151j4918j4214j3657j3723
$$ 1447135 1445206 1440919 1434213 1425352 1414450 1401550 1387079 1371928 1357010 1342796 1329139 1315416
53455A315416j4476j5602j6801j8025j9255k0260k0769k0769k0411j9823j9113
$$ 1315416 1300940 1285338 1268537 1250512 1231257 1210997 1190228 1169459 1149048 1129225 1110112
53444A110112j8434j7813j7098j6189j5081j3602j1452q692n895l651k075r94
$$ 1110112 1091678 1073865 1056767 1040578 1025497 1011895 1000443 991751 985856 982205 980130 979136
53432I79136k83J25L20L83N75J478L479N975P763Q371Q486Q818R281R723J0700
$$ 979136 978853 978978 979298 979681 980256 981734 985213 991188 998951 1007322 1015808 1024626 1033907 1043630 1054330
53417A054330J2783J5512J7789J9088J9827K0731K2285K4526K6925K8707K9713
$$ 1054330 1067113 1082625 1100414 1119502 1139329 1160060 1182345 1206871 1233796 1262503 1292216
53406A292216L0665L2234L4185L5840L7050L8203L9624M1431M3684M6167M8294
$$ 1292216 1322881 1355115 1389300 1425140 1462190 1500393 1540017 1581448 1625132 1671299 1719593
53395A719593M9783N1109N2783N4473N5403N5440N5111N4746N4207N3371N2299
$$ 1719593 1769376 1820485 1873268 1927741 1983144 2038584 2093695 2148441 2202648 2256019 2308318
53384B308318N0946M9252M7485M5990M4587M2628L9768L6283L2613K8839K4716
$$ 2308318 2359264 2408516 2456001 2501991 2546578 2589206 2628974 2665257 2697870 2726709 2751425
53373B751425K0052J5035J0141N599R49m503j0784j7193k3241k9083l4813l9988
$$ 2751425 2771477 2786512 2796653 2802252 2803201 2798698 2787914 2770721 2747480 2718397 2683584 2643596
53361B643596m4214m7563m9999n1024n0549m9536m9092m9149m8742m7256m4883
$$ 2643596 2599382 2551819 2501820 2450796 2400247 2350711 2301619 2252470 2203728 2156472 2111589
53350B111589m2188l9790l8220l7547l7360l7459l8055l8912l9001l7726l5867
$$ 2111589 2069401 2029611 1991391 1953844 1916484 1879025 1840970 1802058 1763057 1725331 1689464
53339A689464l4428l3202l1359k8907k6445k3932k1001j8184j6456j5572j4333
$$ 1689464 1655036 1621834 1590475 1561568 1535123 1511191 1490190 1472006 1455550 1439978 1425645
53328A425645j2595j1770j2764j4628j5865j6268j6684j7563j8346j8145j6681
$$ 1425645 1413050 1401280 1388516 1373888 1358023 1341755 1325071 1307508 1289162 1271017 1254336
53317A254336j4666j3257j2870j2709j1859j0413q929p263n007k738j535j253
$$ 1254336 1239670 1226413 1213543 1200834 1188975 1178562 1169633 1162370 1157363 1154625 1153090 1151837
53305A151837n73J004K547L474M590O625Q976J0819J2476J4613J6866J8363J9177
$$ 1151837 1151264 1152268 1154815 1158289 1162879 1169504 1178480 1189299 1201775 1216388 1233254 1251617 1270794
53292A270794K0216K1904K3858K5643K7026K7610K7018K5480K3665K1945K0212
$$ 1270794 1291010 1312914 1336772 1362415 1389441 1417051 1444069 1469549 1493214 1515159 1535371
53281A535371J8314J6238J4003J1707R529P335M625J192k397n508q239j0945j3343
$$ 1535371 1553685 1569923 1583926 1595633 1605162 1612497 1617122 1618314 1615917 1610409 1602170 1591225 1577882
53268A577882j4869j5812j7216j9534k2097k4132k5595k6693k7213k6901k6146
$$ 1577882 1563013 1547201 1529985 1510451 1488354 1464222 1438627 1411934 1384721 1357820 1331674
53257A331674k5701k5793k5966k5768k5234k4608k3961k3306k2872k2974k3567
$$ 1331674 1305973 1280180 1254214 1228446 1203212 1178604 1154643 1131337 1108465 1085491 1061924
53246A061924k4135k4157k3631k3034k2771k2717k2350k1339j9967j8926j8609
$$ 1061924 1037789 1013632 990001 966967 944196 921479 899129 877790 857823 838897 820288
53235H20288j8668j8357j7305j5737j3987j2066r896p746o181n626o101p253q521
$$ 820288 801620 783263 765958 750221 736234 724168 714272 706526 700345 694719 688618 681365 672844
53222F72844r465j0142j1000j2296j3729j4870j5641j6107j6107j5470j4429j3382
$$ 672844 663379 653237 642237 629941 616212 601342 585701 569594 553487 538017 523588 510206
53210E10206j2360j1203j0093r460r308r185q795q215p555o852o392o594p444
$$ 510206 497846 486643 476550 467090 457782 448597 439802 431587 424032 417180 410788 404194 396750
53197C96750q493r445j0244j0549r833q263o880o409o416o053n229m512m235m270
$$ 396750 388257 378812 368568 358019 348186 339923 333043 326634 320218 314165 308936 304424 300189 295919
53183B95919m416m469m061l051k005j708k095k229j497l85K41J77j28l66o27r69
$$ 295919 291503 287034 282973 279922 277917 276209 274114 271885 270388 270003 270244 270421 270293 269927 269300 268331
53167B68331j161j088r69j032j106r15n88n13p18q03o00m31n53p41p15o21o91
$$ 268331 267170 266082 265113 264081 262975 262060 261472 260959 260241 259438 258838 258407 257854 257113 256398 255777 255086
53150B55086p17m24q1k23p53r91o87l88n84r55q98l54J88L63K26N2P4M12J008
$$ 255086 254369 253945 253864 253641 252888 251897 251210 250822 250238 249283 248385 248031 248219 248582 248808 248860 248934 249346 250354
53131B50354J582J767J329L63o13r17l14O19J075J000J104J803K524K399J393
$$ 250354 251936 253703 255032 255395 254782 253865 253551 254170 255245 256245 257349 259152 261676 264075 265468
53116B65468L51O0N51J339J951K118J729Q82m0o02p28p55j046j591k109k400k407
$$ 265468 265819 265879 266430 267769 269720 271838 273567 274449 274409 273807 273079 272324 271278 269687 267578 265178 262771
53099B62771k095j581j274j471j794j501n53J43j09q75j264j118r28q48n52M2
$$ 262771 260676 259095 257821 256350 254556 253055 252502 252645 252536 251661 250397 249279 248351 247503 246951 246993
53083B46993M83M00j04p55j304j428r15j67K0o29j428j546r24k21m6m76j109j382
$$ 246993 247476 247876 247772 247017 245713 244285 243370 243203 243223 242594 241166 239620 238696 238475 238429 237953 236844 235462
53065B35462j005j90M92O03J47m58o67k34M68P17L02q8K84J186J695J378O58R3
$$ 235462 234457 234267 234759 235362 235509 235051 234384 234150 234618 235335 235637 235549 235833 237019 238714 240092 240750 240843
53047B40843j42kN60J215J302N48n42j281j490j439j421j600j971k206j847q85
$$ 240843 240701 240699 241259 242474 243776 244324 243782 242501 241011 239572 238151 236551 234580 232374 230527 229642
53031B29642N0L34N6j65M9M19L64l24j167j416q12J75R60J457J888K241K260J898
$$ 229642 229692 230026 230082 229917 229966 230385 230749 230425 229258 227842 227030 227205 228165 229622 231510 233751 236011 237909
53013B37909J355Q06L79K50L17L1r28j948k067j244m04k02l94n07m84m52l96l29
$$ 237909 239264 240070 240449 240699 241016 241047 240119 238171 236104 234860 234456 234254 233860 233353 232869 232417 232021 231692
52995B31692k52J04R86J939K095J294L34j32k05r4L09Q38Q82M11L46J267K385
$$ 231692 231440 231544 232530 234469 236564 237858 238192 238060 237855 237761 238070 238908 239790 240201 240547 241814 244199
52978B44199K605K037J590J585J661J702J848J773J007m3m10PK85j5j55N51J548
$$ 244199 246804 248841 250431 252016 253677 255379 257227 259000 260007 259964 259554 259561 259846 259831 259676 260227 261775
52961B61775J881J560J358J512J450P57k49j092j663j999j999j765j784k328k867
$$ 261775 263656 265216 266574 268086 269536 270293 270044 268952 267289 265290 263291 261526 259742 257414 254547
52946B54547k609j582o09k21j61j18l51j093j871k002j500r05m87j62l0k91o75
$$ 254547 251938 250356 249747 249526 249365 249247 248896 247803 245932 243930 242430 241525 241038 240876 240846 240555 239880
52929B39880n40K79J242J787J778J257L23o41j085q68l80%J99K37J22L8J64L08
$$ 239880 239340 239619 240861 242648 244426 245683 246006 245365 244280 243412 243032 243032 243231 243468 243590 243628 243792 244100
52911B44100J78n0L2K52pp67j236q68k5O46R35R12O42L28J79o4q22j734j760o79
$$ 244100 244278 244228 244260 244512 244505 243738 242502 241634 241609 242255 243190 244102 244744 245072 245251 245187 244365 242631 240871 240192
52891B40192L61L01m52p18o1J045K030K497K121J012k2k02L73J017J300J145N07
$$ 240192 240553 240854 240402 239684 239623 240668 242698 245195 247316 248328 248306 248104 248477 249494 250794 251939 252446
52874B52446m15q91k90J064K083K054J229L91J14M72J149J832K483L164L685L793
$$ 252446 252031 251140 250850 251914 253997 256051 257280 257671 257785 258257 259406 261238 263721 266885 270570 274363
52858B74363L595L346K854J684j4j558k695l754m690m881m225l571l533l704l552
$$ 274363 277958 281304 284158 285842 285828 284270 281575 277821 273131 268250 264025 260454 256921 253217 249665
52843B49665l260l116k874k446k347k736k797j999j132j075j273o55N63J280J277
$$ 249665 246405 243289 240415 237969 235622 232886 230089 228090 226958 225883 224610 223955 224518 225798 227075
52828B27075J314J653J765J449J057N94k99j382j856j539j070q08m30J99N95L80
$$ 227075 228389 230042 231807 233256 234313 234907 234608 233226 231370 229831 228761 227953 227523 227722 228317 228697
52812B28697j59m99l61K83J178J762J690J308J114J011N81j55r49j944l228m133
$$ 228697 228538 228039 227678 227961 229139 230901 232591 233899 235013 236024 236605 236450 235501 233557 230329 226196
52796B26196l917k920k009j198kJ041P13q55j900j304N8P90O98M26L08L33N32
$$ 226196 222279 219359 217350 216152 216150 217191 217904 217049 215149 213845 213903 214693 215391 215817 216125 216458 216990
52779B16990P51N71nl67j92P1P1J53N87R12O55J09k40n39j080j433q97L45J269
$$ 216990 217741 218312 218307 217940 217748 217819 217890 218043 218630 219542 220197 220306 220066 219527 218447 217014 216117 216462 217731
52760B17731J236O79L97N72P30M95J62K99Q83J234R84O32P59J106J080P38N72
$$ 217731 218967 219646 220043 220615 221345 221840 222002 222301 223184 224418 225402 226034 226793 227899 228979 229717 230289
52743B30289N86N07O41J519K648K817J729M23j98k71j99J8K48L7n50p77l39J97
$$ 230289 230875 231382 232023 233542 236190 239007 240736 241159 240961 240690 240491 240509 240757 240794 240244 239467 239128 239325
52725B39325M85Q95J431J232l5j251j245l94J05j33o69j196j567j371m88L22K97
$$ 239325 239810 240705 242136 243368 243333 242082 240837 240443 240548 240415 239746 238550 236983 235612 235124 235446 235743
52708B35743k50n54p12j362k326k627j770k67J079J709J366L39m60m25q6k92q77
$$ 235743 235493 234939 234227 232865 230539 227912 226142 225875 226954 228663 230029 230368 229908 229483 229397 229105 228228
52691B28228r19k47L40L32J61L98J013J592J758J333O52N37J351K176J819N18
$$ 228228 227309 227062 227402 227734 227895 228293 229306 230898 232656 233989 234641 235178 236529 238705 240524 241042
52675B41042k66Q8N88K27o56j124r36m75K8M97P44P49Q83J314J593J305Q22P80
$$ 241042 240776 240864 241452 241679 241023 239899 238963 238488 238516 239013 239757 240506 241389 242703 244296 245601 246423 247203
52657B47203J172J534J828K385L109L462L330L148L025K349P31j129k100j881
$$ 247203 248375 249909 251737 254122 257231 260693 264023 267171 270196 272545 273276 272147 270047 268166
52643B68166j223r71j323j942k404k452k085j556j098o15R8Q09R34L47j70L27
$$ 268166 266943 265972 264649 262707 260303 257851 255766 254210 253112 252497 252595 253404 254338 254685 254515 254842
52627B54842J821L299L815L337K593K211K101J600L37j140j865j690j531k043
$$ 254842 256663 259962 263777 267114 269707 271918 274019 275619 275956 274816 272951 271261 269730 267687
52613B67687k550j962m25P94J057J030J406J794J486O57Q6Kp3m17o51l37L57Q18
$$ 267687 265137 263175 262750 263544 264601 265631 267037 268831 270317 270974 271060 271062 270989 270572 269921 269584 269941 270759
52595B70759O30Jm40k78K97P96J043J223J424J470J295J080Q83M89j50o46o42
$$ 270759 271389 271390 270950 270672 270969 271765 272808 274031 275455 276925 278220 279300 280183 280672 280522 279876 279234
52578B79234k54J63M19N00M52M46O49Q14L81o74j497j317m76O8l5k75k06l4k08
$$ 279234 278980 279143 279562 280062 280514 280960 281609 282423 282804 282130 280633 279316 278840 278908 278873 278598 278392 278358 278150
52559B78150q51j691k300k330j823j256j012r20n65n1M6m87j082j021k31P45J322
$$ 278150 277299 275608 273308 270978 269155 267899 266887 265967 265402 265351 265397 264910 263828 262807 262576 263321 264643
52542B64643J288Q02K79J31L51M78J48k49P7J212K142J903Q71L46Q69J584J512
$$ 264643 265931 266733 267012 267143 267494 267972 268120 267871 267948 269160 271302 273205 274076 274422 275291 276875 278387
52525B78387Q32L86M07M26J45k35n25p52q33o54l96k27K19J372K741L268K870
$$ 278387 279219 279605 280012 280438 280583 280348 279823 279071 278238 277584 277188 276961 277180 278552 281293 284561 287431
52508B87431K715L583M757N053M244K863J213n72j998k560k551k750l366l850
$$ 287431 290146 293729 298486 303539 307783 310646 311859 311287 309289 306729 304178 301428 298062 294212
52494B94212l754l238k704k333k067j797j459j133q98n64J78J171J672J218L02
$$ 294212 290458 287220 284516 282183 280116 278319 276860 275727 274829 274265 274443 275614 277286 278504 278806
52479B78806k01mN46J134J676K013J937J568J287J182R27K64n59r18l17J174K856
$$ 278806 278605 278601 279147 280281 281957 283970 285907 287475 288762 289944 290871 291135 290576 289658 289341 290515 293371
52462B93371L922M100L751L306K900K488J962J042m98k301l556l901l791l772
$$ 293371 297293 301393 305144 308450 311350 313838 315800 316842 316344 314043 310487 306586 302795 299023
52448B99023l832l711l414k978k283j419q14n69k29L69O40K22k27mM51K16o02
$$ 299023 295191 291480 288066 285088 282805 281386 280572 280003 279774 280143 280783 281005 280778 280774 281225 281441 280839
52431B80839j073q82n89m93k12M31R96J157J141J136R02K71m44p85n78J39J209
$$ 280839 279766 278884 278295 277802 277590 278021 279017 280174 281315 282451 283353 283624 283180 282395 281817 281956 283165
52414B83165K273K956L236L285L064K500K041K428L792N445O731P657Q548R435
$$ 283165 285438 288394 291630 294915 297979 300479 302520 304948 308740 314185 320916 328573 337121 346556
52400C46556R914R364P257L656n05m021o342p657q173p809o666n289m204l460
$$ 346556 356470 365834 373091 376747 376242 372221 365879 358222 350049 342240 335574 330285 326081 322621
52386C22621k748j848q93l19m15p78n10O85J973K437K361K741L768M612M712M441
$$ 322621 319873 318025 317132 316813 316398 315620 315110 315795 317768 320205 322566 325307 329075 333687 338399 342840
52370C42840M364M562M954N579O128N870M507K672J188J76p18j596k181k265j866
$$ 342840 347204 351766 356720 362299 368427 374297 378804 381476 382664 382840 382122 380526 378345 376080 374214
52355C74214j130l54J39K41J12j24m27n29pJ127K245K832L064L384L831M168M417
$$ 374214 373084 372730 372869 373110 373222 373098 372671 372142 372135 373262 375507 378339 381403 384787 388618 392786 397203
52338C97203M833N353N589N501N741P018R203J1375J2857J3924J5253J6856J8069
$$ 397203 402036 407389 412978 418479 424220 431238 440441 451816 464673 478597 493850 510706 528775
52325E28775J8592J9000J9953K1388K2877K4320K5683K6413K5852K4171K2321
$$ 528775 547367 566367 586320 607708 630585 654905 680588 707001 732853 757024 779345
52314G79345K1019K0298J9988K0058K0336K0433K0163J9657J8991J8073J6976
$$ 779345 800364 820662 840650 860708 881044 901477 921640 941297 960288 978361 995337
52303I95337J6031J5382J4767J3857J2552J0953R229P580O046M430K558M78j822
$$ 995337 1011368 1026750 1041517 1055374 1067926 1078879 1088108 1095688 1101734 1106164 1108722 1109200 1107378
52290A107378m608p880j0929j2888j3637j3638j3113j1974j0414q889p454n788
$$ 1107378 1102770 1094890 1083961 1071073 1057436 1043798 1030685 1018711 1008297 999408 991954 986166
52278I86166l866k021l01J602L758N938Q176J0705J3309J5414J6889J8064J8798
$$ 986166 982300 980279 979978 981580 985338 991276 999452 1010157 1023466 1038880 1055769 1073833 1092631
52265A092631J8473J7148J5913J5557J5631J5368J4851J4607J4533J4054J3113
$$ 1092631 1111104 1128252 1144165 1159722 1175353 1190721 1205572 1220179 1234712 1248766 1261879
52254A261879J2335J2160J2245J1837J0482Q337N861L259L63k880o046q702j1006
$$ 1261879 1274214 1286374 1298619 1310456 1320938 1329275 1335136 1338395 1338758 1335878 1329832 1321130 1310124
52241A310124j3429j5942j8024j9343j9908j9634j8431j6761j5528j5137j5179
$$ 1310124 1296695 1280753 1262729 1243386 1223478 1203844 1185413 1168652 1153124 1137987 1122808
52230A122808j5034j4390j3225j1838j0884j0666j0498r424p502n615m149k804
$$ 1122808 1107774 1093384 1080159 1068321 1057437 1046771 1036273 1026849 1019347 1013732 1009583 1006779
52218A006779j654j221j255o61R11K465L143L352L789M312M512M591M972N574
$$ 1006779 1005125 1003904 1002649 1001988 1002899 1005364 1008507 1011859 1015648 1019960 1024472 1029063 1034035 1039609
52204A039609O095O447O447N760M598L747L514L454L447M039N148N671N183M801
$$ 1039609 1045704 1052151 1058598 1064358 1068956 1072703 1076217 1079671 1083118 1087157 1092305 1097976 1103159 1107960
52190A107960N396O112N841N121N025N133M226K384O51r27l198n933p821q593
$$ 1107960 1113356 1119468 1125309 1130430 1135455 1140588 1144814 1147198 1147849 1146922 1143724 1137791 1129970 1121377
52176A121377r448j0965j2071j1717j0311q778p272n645m326l802l672l006j474
$$ 1121377 1111929 1100964 1088893 1077176 1066865 1058087 1050815 1045170 1040844 1037042 1033370 1030364 1028890
52163A028890L90J867K692L159L810M885N978O429O014N063L936K689J248l35
$$ 1028890 1029280 1031147 1033839 1036998 1040808 1045693 1051671 1058100 1064114 1069177 1073113 1075802 1077050 1076715
52149A076715j738k378j812l80R05J483J833K565L389L622L282K923K761K709
$$ 1076715 1074977 1072599 1070787 1070407 1071312 1072795 1074628 1077193 1080582 1084204 1087486 1090409 1093170 1095879
52135A095879L022M019N366O551P844R931J2655J5163J7279J9677K2553K5194
$$ 1095879 1098901 1102920 1108286 1114837 1122681 1132612 1145267 1160430 1177709 1197386 1219939 1245133
52123A245133K7172K9007L1214L3503L5325L6481L6819L6021L4154L1817K9366
$$ 1245133 1272305 1301312 1332526 1366029 1401354 1437835 1474654 1510675 1544829 1576646 1606012
52112A606012K6594K3573K0960J9016J6916J3795R891O083K752j87k442l466l311
$$ 1606012 1632606 1656179 1677139 1696155 1713071 1726866 1736757 1742840 1745592 1745405 1742963 1739497 1736186
52099A736186k802k708l193m110n412p123r117j1132j3000j4854j7036j9633k2180
$$ 1736186 1733384 1730676 1727483 1723373 1717961 1710838 1701721 1690589 1677589 1662735 1645699 1626066 1603886
52086A603886k3987k4776k4708k3815k1832j8723j5030j1444q190n045j794J429
$$ 1603886 1579899 1555123 1530415 1506600 1484768 1466045 1451015 1439571 1431381 1426336 1424542 1425971
52074A425971M179O099P418Q974J1428J4471J7124J8837J9887K0680K1129K0972
$$ 1425971 1430150 1436249 1443667 1452641 1464069 1478540 1495664 1514501 1534388 1555068 1576197 1597169
$$ [...]
##END NTUPLES=NMR SPECTRUM
##END=
