##TITLE=AC1611_BRAAN13341_8317122_LOeVKP9LAG
##JCAMPDX= 6.0         $$ Bruker NMR JCAMP-DX V2.0
##DATA TYPE= NMR SPECTRUM
##DATA CLASS= NTUPLES
##ORIGIN= BRUKER
##OWNER= Administrator
$$ 1.72 TOPSPIN		Version 2.1
$$ 2013-11-13 18:19:51.937 -0800  Administrator@X
$$ Compression mode = diff/dup
##.OBSERVE FREQUENCY= 400.02188249412
##.OBSERVE NUCLEUS= ^1H
##.ACQUISITION MODE= SIMULTANEOUS (DQD)
##.ACQUISITION SCHEME= undefined
##.AVERAGES= 64
##.DIGITISER RES= 22
##SPECTROMETER/DATA SYSTEM= spect
##.PULSE SEQUENCE= noesygpps1d.comp
##.SOLVENT NAME= COFFEE_meoh
##.SHIFT REFERENCE= INTERNAL, COFFEE_meoh, 1, 14.96094
##AUDIT TRAIL= $$ (NUMBER, WHEN, WHO, WHERE, PROCESS, VERSION, WHAT)
$$ ##TITLE= Audit trail, TOPSPIN		Version 2.1
$$ ##JCAMPDX= 5.01
$$ ##ORIGIN= Bruker BioSpin GmbH
$$ ##OWNER= Administrator
$$ $$ E:\/data/COFFEE/nmr/AC1611_BRAAN13341_8317122_LOeVKP9LAG/12/pdata/1/auditp.txt
$$ ##AUDIT TRAIL=  $$ (NUMBER, WHEN, WHO, WHERE, PROCESS, VERSION, WHAT)
(   1,<2013-11-13 18:19:46.437 -0800>,<Administrator>,<X>,<go>,<TOPSPIN 2.1>,
      <created by zg
	started at 2013-11-13 18:08:16.591 -0800,
	POWCHK enabled, PULCHK disabled,
       configuration hash MD5:
       C8 4E 4E 5D D3 5C D8 9E 9F 52 82 E0 59 8A DE 15
       data hash MD5: 64K
       C6 CB 93 6B 8A 7F 25 E9 3A CE DF 16 12 5C 58 04>)
(   2,<2013-11-13 18:19:49.640 -0800>,<Administrator>,<X>,<proc1d>,<TOPSPIN 2.1>,
      <Start of raw data processing
       efp LB = 0.3 FT_mod = 6 PKNL = 1 PHC0 = 0 PHC1 = 0 SI = 128K 
       data hash MD5: 128K
       24 96 89 69 C6 FC E9 AE 65 1B E8 AD 97 D7 B8 6F>)
(   3,<2013-11-13 18:19:50.843 -0800>,<Administrator>,<X>,<proc1d>,<TOPSPIN 2.1>,
      <pk PHC0 = -82.21619 PHC1 = 0 
       data hash MD5: 128K
       35 74 7F F9 BE 52 95 90 A0 43 48 BD 9E 23 85 50>)
(   4,<2013-11-13 18:19:51.452 -0800>,<Administrator>,<X>,<proc1d>,<TOPSPIN 2.1>,
      <abs ABSG = 1 
       data hash MD5: 128K
       22 92 7D 49 13 A4 82 71 06 75 8A C4 0A 9D 74 58>)
(   5,<2013-11-13 18:19:51.546 -0800>,<Administrator>,<X>,<proc1d>,<TOPSPIN 2.1>,
      <abs ABSG = 2 
       data hash MD5: 128K
       B0 13 18 95 F2 75 7F 71 99 AE 92 47 EC 65 37 90>)
(   6,<2013-11-13 18:19:51.624 -0800>,<Administrator>,<X>,<proc1d>,<TOPSPIN 2.1>,
      <abs ABSG = 3 
       data hash MD5: 128K
       97 02 8C 40 D5 2F 0E 28 5A 19 D2 49 23 11 D8 05>)
(   7,<2013-11-13 18:19:51.702 -0800>,<Administrator>,<X>,<proc1d>,<TOPSPIN 2.1>,
      <abs ABSG = 4 
       data hash MD5: 128K
       42 9E F2 23 C6 1E 95 E3 8A 42 CA BC 2C 7B B0 54>)
(   8,<2013-11-13 18:19:51.780 -0800>,<Administrator>,<X>,<proc1d>,<TOPSPIN 2.1>,
      <abs ABSG = 5 
       data hash MD5: 128K
       A0 E9 12 D4 F1 FD 40 5F 1C 50 8C D4 53 FC FB 8E>)
$$ ##END=
$$ 
$$ $$ hash MD5
$$ $$ 04 C8 9B 83 6E 5E AC 16 45 A5 9B 33 85 92 75 E1
##$RELAX= 
##$RELAX= 
##$RELAX= 
##$RELAX= 
##$RELAX= 
##$RELAX= 
##$RELAX= 
##$RELAX= 
$$ Bruker specific parameters
$$ --------------------------
##$DU= <E:\>
##$EXPNO= 12
$$ [...]
##$TP07= 0
##$TPNAME0= <>
##$TPNAME1= <>
##$TPNAME2= <>
##$TPNAME3= <>
##$TPNAME4= <>
##$TPNAME5= <>
##$TPNAME6= <>
##$TPNAME7= <>
##$TPOAL= (0..7)
0.5 0.5 0.5 0.5 0.5 0.5 0.5 0.5
##$TPOFFS= (0..7)
0 0 0 0 0 0 0 0
##$TUNHIN= 0
##$TUNHOUT= 0
##$TUNXOUT= 0
##$USERA1= <user>
##$USERA2= <user>
##$USERA3= <user>
##$USERA4= <user>
##$USERA5= <user>
##$V9= 5
##$VALIST= <valist>
##$VCLIST= <CCCCCCCCCCCCCCC>
##$VD= 0
##$VDLIST= <DDDDDDDDDDDDDDD>
##$VPLIST= <PPPPPPPPPPPPPPP>
##$VTLIST= <TTTTTTTTTTTTTTT>
##$WBST= 1024
##$WBSW= 4
##$XGAIN= (0..3)
0 0 0 0
##$XL= 0
##$YL= 0
##$YMAX_a= 6162224
##$YMIN_a= -13298991
##$ZGOPTNS= <>
##$ZL1= 120
##$ZL2= 120
##$ZL3= 120
##$ZL4= 120
##$ABSF1= 14.96094
##$ABSF2= -5.597241
##$ABSG= 5
##$ABSL= 3
##$ALPHA= 0
##$AQORDER= 0
##$ASSFAC= 0
##$ASSFACI= 0
##$ASSFACX= 0
##$ASSWID= 0
##$AUNMP= <proc_prof1d_extract.lims>
##$AXLEFT= 0
##$AXNAME= <>
##$AXNUC= <1H>
##$AXRIGHT= 0
##$AXTYPE= 0
##$AXUNIT= <>
##$AZFE= 0.1
##$AZFW= 0.1
##$BCFW= 0
##$BC_mod= 0
##$BYTORDP= 0
##$COROFFS= 0
##$CY= 15
##$DATMOD= 1
##$DC= 0
##$DFILT= <>
##$DTYPP= 0
##$F1P= 0
##$F2P= 0
##$FCOR= 0.5
##$FTSIZE= 131072
##$FT_mod= 6
##$GAMMA= 0
##$GB= 0
##$INTBC= 1
##$INTSCL= 1
##$ISEN= 128
##$LB= 0.3
##$LEV0= 0
##$LPBIN= 0
##$MAXI= 10000
##$MC2= 0
##$MEAN= 0
##$ME_mod= 0
##$MI= 0
##$NCOEF= 0
##$NC_proc= -2
##$NLEV= 6
##$NOISF1= 0
##$NOISF2= 0
##$NSP= 0
##$NTH_PI= 0
##$NZP= 0
##$OFFSET= 14.96094
##$PC= 1
##$PHC0= -82.21619
##$PHC1= 0
##$PH_mod= 1
##$PKNL= yes
##$PPARMOD= 0
##$PPDIAG= 0
##$PPIPTYP= 0
##$PPMPNUM= 2147483647
##$PPRESOL= 1
##$PSCAL= 4
##$PSIGN= 0
##$PYNMP= <proc.py>
##$REVERSE= no
##$SF= 400.020009661242
##$SI= 131072
##$SIGF1= 0
##$SIGF2= 0
##$SINO= 400
##$SIOLD= 131072
##$SPECTYP= <>
##$SREGLST= <1H.CDCl3>
##$SSB= 0
##$STSI= 131072
##$STSR= 0
##$SW_p= 8223.68421052631
##$SYMM= 0
##$S_DEV= 0
##$TDeff= 65536
##$TDoff= 0
##$TI= <>
##$TILT= no
##$TM1= 0
##$TM2= 0
##$TOPLEV= 0
##$USERP1= <user>
##$USERP2= <user>
##$USERP3= <user>
##$USERP4= <user>
##$USERP5= <user>
##$WDW= 1
##$XDIM= 131072
##$YMAX_p= 305330899
##$YMIN_p= -12878
##$CURPLOT= <Network HP LaserJet P1505>
##$CURPRIN= <$Network HP LaserJet P1505>
##$DFORMAT= <normdp>
##$LAYOUT= <+/1D_H.xwp>
##$LFORMAT= <normlp>
##$PFORMAT= <normpl>
##$SURQMSG= 1
$$ End of Bruker specific parameters
$$ ---------------------------------
##NTUPLES= NMR SPECTRUM
##VAR_NAME=  FREQUENCY,     SPECTRUM/REAL,   SPECTRUM/IMAG
##SYMBOL=    X,             R,               I
##VAR_TYPE=  INDEPENDENT,   DEPENDENT,       DEPENDENT
##VAR_FORM=  AFFN,          ASDF,            ASDF
##VAR_DIM=   131072,        131072,          131072
##UNITS=     HZ,            ARBITRARY UNITS, ARBITRARY UNITS
##FACTOR=    0.0627417313425164, 1,          1
##FIRST=     8223.62146879497, 2916,         -63136
##LAST=      0,             4706,            -62593
##MIN=       0,             -12878,          0
##MAX=       8223.62146879497, 305330899,    0
$$ Real data points
##PAGE= N=1
##DATA TABLE= (X++(R..R)), XYDATA
$$ [...]
$$ plain form
61689 495006 493380 491562 489540 487569 485650 483490 480934 478057 474862 471337 467848 464992 462889 460929
61675 460929 458504 455649 452747 449920 447126 444611 442752 441511 440474 439437 438535 437758 436808 435617 434562
61660 434562 433973 433736 433631 433716 434074 434517 434858 435262 435946 436782 437544 438354 439464 440774 441982 443119 444487
61643 444487 446117 447703 449076 450290 451210 451434 450821 449786 448943 448640 448879 449490 450266 451044 451614 451526 450353
61626 450353 448403 446792 446193 445768 444072 440975 437873 435909 434813 433768 432559 431315 429770 427580 425021
61611 425021 422679 420561 418026 414496 409853 404306 398298 392464 387289 382791 378750 375089 371816 368829
61597 368829 366074 363682 361578 359196 356003 352193 348461 345238 342538 340440 339184 338706 338489 337946 336724
61582 336724 334645 331773 328609 325968 324459 324193 324786 325441 325215 323731 321638 320005 319237 318903 318595 318422
$$ packed form
61689D95006j626j818k022j971j919k160k556k877l195l525l489k856k103j960
61675D60929k425k855k902k827k794k515j859j241j037j037r02p77r50j191j055
61660D34562n89k37j05Q5L58M43L41M04O84Q36P62Q10J110J310J208J137J368
61643D44487J630J586J373J214R20K24o13j035q43l03K39O11P76P78N70q8j173
61626D50353j950j611n99m25j696l097l102j964j096j045j209j244j545k190k559
61611D25021k342k118k535l530m643n547o008n834n175m498m041l661l273k987
61597C68829k755k392k104k382l193l810l732l223k700k098j256m78k17n43j222
61582C36724k079k872l164k641j509k66N93O55k26j484k093j633p68l34l08j73
$$ plain form
61566 318422 318564 318860 319135 319543 320255 321037 321476 321485 321312 321148 320981 320790 320753 321217 322486 324515 326793 328733
61548 328733 330225 331653 333286 334886 336013 336506 336509 336265 336085 336300 336981 337799 338445 339061 340002 341236 342368
61531 342368 343295 344493 346398 348672 350394 350955 350573 349844 349004 347811 346098 344202 342722 341948 341657 341410
61515 341410 340925 340192 339392 338756 338409 338278 338197 338077 337891 337550 336925 336037 335034 333972 332804 331751 331412 332226
61497 332226 333887 335593 336870 337878 338842 339563 339722 339461 339325 339637 340243 340861 341414 341933 342398 342864 343572
61480 343572 344728 346272 347989 349742 351409 352715 353395 353496 353315 353078 352876 352894 353377 354313 355365 356192 356663
61463 356663 356721 356312 355579 354848 354300 353809 353272 352823 352567 352352 352022 351706 351552 351386 350972 350444 350175 350318 350865
61444 350865 352039 354109 356749 359079 360591 361660 362862 364124 364990 365598 366833 369335 372625 375408 376706
$$ packed form
61566C18422J42K96K75M08P12P82M39Rj73j64j67j91l7M64J269K029K278J940
61548C28733J492J428J633J600J127M93Lk44j80K15O81Q18O46O16R41J234J132
61531C42368R27J198J905K274J722N61l82p29q40j193j713j896j480p74k91k47
61515C41410m85p33q00o36l47j31q1j20j86l41o25q88j003j062j168j053l39Q14
61497C32226J661J706J277J008R64P21J59k61j36L12O06O18N53N19M65M66P08
61480C43572J156J544J717J753J667J306O80J01j81k37k02J8M83R36J052Q27M71
61463C56663N8m09p33p31n48m91n37m49k56k15l30l16j54j66m14n28k69J43N47
61444C50865J174K070K640K330J512J069J202J262Q66O08J235K502L290K783J298
$$ plain form
61429 376706 376604 376026 375992 377080 379358 382526 385989 388950 390760 391353 391383 391788 393081 394954 396580 397360
61413 397360 397406 397324 397575 398094 398519 398624 398461 398177 397792 397196 396269 395048 393761 392747 392249 392269 392517 392562 392126
61394 392126 391336 390646 390457 390827 391569 392443 393194 393629 393840 394178 394748 395124 394959 394669 395046 396205 397495 398509
61376 398509 399560 400907 402123 402737 403094 403997 405719 407859 410031 412246 414611 417076 419450 421460 422869
61361 422869 423811 424890 426624 428872 431092 433078 435158 437765 441066 444906 448826 452284 455252 458460
61347 458460 462682 467778 472760 476745 479567 481616 483538 486021 489396 493319 497111 500416 503298 505902
61333 505902 508465 511495 515356 519648 523478 526347 528325 529444 529617 529254 529272 530193 531727 533451 535375
61318 535375 537606 540004 542544 545598 549547 554473 560466 567697 575883 584220 592389 601129 611264 622468
$$ packed form
61429C76706j02n78l4J088K278L168L463K961J810N93L0M05J293J873J626P80
61413C97360M6q2K51N19M25J05j63k84l85n96r27j221j287j014m98K0K48M5m36
61394C92126p90o90j89L70P42Q74P51M35K11L38N70L76j65k90L77J159J290J014
61376C98509J051J347J216O14L57R03J722K140K172K215K365K465K374K010J409
61361D22869R42J079J734K248K220J986K080K607L301L840L920L458K968L208
61347D58460M222N096M982L985K822K049J922K483L375L923L792L305K882K604
61333E05902K563L030L861M292L830K869J978J119J73l63J8R21J534J724J924
61318E35375K231K398K540L054L949M926N993P231Q186Q337Q169Q740J0135J1204
$$ plain form
61304 622468 633645 644307 654941 666041 677285 687776 696759 703986 709548 713394 715093 714328 711629
61291 711629 708149 704431 699858 693688 686171 678142 669902 661222 652186 643300 634775 626404 618232 610788
61277 610788 604454 599105 594568 591009 588583 587007 585727 584360 582871 581543 580873 581272 582705 584748 587104
61262 587104 589936 593593 598185 603488 609161 614931 620550 625683 630009 633632 637259 641604 646445 650694
61248 650694 653658 655861 658250 660992 663620 666034 668569 671030 672532 672653 672204 672387 673479 674746 675454
61233 675454 675622 675856 676765 678573 681127 684158 687510 691178 695290 700151 706068 712898 719926 726515 732765
61218 732765 739210 745992 752810 759679 767129 775394 783800 791357 797809 803756 809837 815961 821407 825628
61204 825628 828977 832536 837103 842470 847895 853066 858239 863654 869415 875985 884122 894020 904924 915812
$$ packed form
61304F22468J1177J0662J0634J1100J1244J0491Q983P227N562L846J699p65k699
61291G11629l480l718m573o170p517q029q240q680r036q886q525q371q172p444
61277F10788o334n349m537l559k426j576j280j367j489j328o70L99J433K043K356
61262E87104K832L657M592N303N673N770N619N133M326L623L627M345M841M249
61248F50694K964K203K389K742K628K414K535K461J502J21m49J83J092J267P08
61233F75454J68K34R09J808K554L031L352L668M112M861N917O830P028O589O250
61218G32765O445O782O818O869P450Q265Q406P557O452N947O081O124N446M221
61204H25628L349L559M567N367N425N171N173N415N761O570Q137R898J0904J0888
$$ plain form
61190 915812 926015 935007 942218 947596 951916 955958 959524 961758 962273 961473 959874 957527 954077 949011
61176 949011 941921 932971 923116 913474 904327 894965 884556 872980 860839 848968 837917 827616 817421
61163 817421 806716 795537 784465 773893 763644 753315 742734 731977 721197 710697 701055 692908
61151 692908 686502 681441 676988 672736 669007 666423 665023 664005 662484 660313 657891 655408 652711 649858
61137 649858 647300 645314 643656 642075 640972 641190 643144 646365 650023 653808 658240 664123 671817 681126
61123 681126 691829 704013 717742 732702 748485 765108 782874 801811 821594 842022 863136
61112 863136 884847 906869 929149 951841 974596 996318 1016028 1033729 1050042 1065240 1079028
61101 1079028 1091028 1100951 1108372 1112854 1114343 1113033 1108827 1101329 1090469 1076718 1060630 1042593 1023176
$$ packed form
61190I15812J0203Q992P211N378M320M042L566K234N15q00j599k347l450n066
61176I49011p090q950r855r642r147r362j0409j1576j2141j1871j1051j0301j0195
61163H17421j0705j1179j1072j0572j0249j0329j0581j0757j0780j0500r642q147
61151F92908o406n061m453m252l729k584j400j018j521k171k422k483k697k853
61137F49858k558j986j658j581j103K18J954L221L658L785M432N883P694R309
61123F81126J0703J2184J3729J4960J5783J6623J7766J8937J9783K0428K1114
61112H63136K1711K2022K2280K2692K2755K1722J9710J7701J6313J5198J3788
61101A079028J2000R923P421M482J489j310m206p498j0860j3751j6088j8037j9417
$$ plain form
61088 1023176 1003179 982985 962243 940577 918347 896262 874515 852838 831378 810910 792023
61077 792023 774511 757888 742197 728000 715627 704773 694901 685831 677775 670905 665153 660531 657401
61064 657401 656075 656226 657093 658360 660435 663688 667871 672670 678410 685563 693779 702166 710610 720119 731593
61049 731593 744780 758813 773319 788572 804911 822563 841878 863176 886242 910271 934485
61038 934485 958827 984062 1011183 1040556 1071608 1103513 1136091 1169680 1204287 1239569 1275878
61027 1275878 1314575 1356675 1401721 1448618 1497179 1548101 1601826 1658509 1719186 1786088 1861553
61016 1861553 1947258 2044634 2155364 2281359 2425121 2590621 2783034 3006782 3263776 3553563
61006 3553563 3874643 4225603 4606383 5020064 5474195 5980863 6556408 7221123 7996936
$$ packed form
61088A023176j9997k0194k0742k1666k2230k2085k1747k1677k1460k0468j8887
61077G92023j7512j6623j5691j4197j2373j0854r872r070q056o870n752m622l130
61064F57401j326J51Q67J267K075L253M183M799N740P153Q216Q387Q444R509J1474
61049G31593J3187J4033J4506J5253J6339J7652J9315K1298K3066K4029K4214
61038I34485K4342K5235K7121K9373L1052L1905L2578L3589L4607L5282L6309
61027A275878L8697M2100M5046M6897M8561N0922N3725N6683O0677O6902P5465
61016A861553Q5705R7376J10730J25995J43762J65500J92413K23748K56994K89787
61006C553563L21080L50960L80780M13681M54131N06668N75545O64715P75813
$$ plain form
60997 7996936 8902082 9945671 11125017 12422925 13800355 15188960 16497513 17639762
60989 17639762 18570209 19301570 19890318 20402963 20887429 21360741 21805981 22171279 22377030
60980 22377030 22340704 22012190 21396774 20549342 19546314 18456258 17324419 16172437 15007075
60971 15007075 13831593 12654549 11492424 10366596 9298651 8307045 7404983 6598739
60963 6598739 5887382 5264771 4722596 4252415 3846131 3495859 3193954 2933332 2707912
60954 2707912 2512845 2344233 2198565 2072423 1962669 1866720 1782633 1708894 1643984 1586061
60944 1586061 1533331 1484928 1441083 1402032 1367055 1334998 1305278 1277710 1251652 1226348 1202146
60933 1202146 1180366 1161637 1145184 1130079 1116297 1103965 1092441 1081035 1070127 1060705 1053043 1046586
$$ packed form
60997G996936R05146J043589J179346J297908J377430J388605J308553J142249
60989A7639762R30447P31361N88748N12645M84466M73312M45240L65298K05751
60980B2377030l6326l28514o15416q47432j003028j090056j131839j151982j165362
60971A5007075j175482j177044j162125j125828j067945r91606r02062q06244
60963F598739p11357o22611n42175m70181m06284l50272l01905k60622k25420
60954B707912j95067j68612j45668j26142j09754r5949q4087p3739o4910n7923
60944A586061n2730m8403m3845l9051l4977l2057k9720k7568k6058k5304k4202
60933A202146k1780j8729j6453j5105j3782j2332j1524j1406j0908r422p662o457
$$ plain form
60921 1046586 1040921 1036009 1031497 1026591 1020848 1014610 1008473 1002634 996840 990687 983982 977049 970616 965057
60907 965057 959885 954283 947995 941288 934277 926894 919401 912238 905172 897213 887726 877187 866582 856404
60893 856404 846531 836785 827234 818121 809717 802101 794870 787239 778654 769239 759525 749921 740606 731728
60879 731728 723416 715562 707774 699637 691088 682580 674806 668108 662149 656276 650110 643617 636800 629708
60865 629708 622743 616489 611040 605905 600785 596140 592662 590429 588886 587448 585795 583746 581221 578384
60851 578384 575551 572862 570144 567116 563641 559833 556042 552674 549880 547383 544613 541011 536314 530811
60837 530811 525333 520684 516907 513258 509065 504329 499342 494073 488392 482730 477968 474650 472614 471436
60823 471436 470858 470682 470577 470236 469559 468539 467241 465978 465254 465201 465245 464636 463295 461849 460879 460453 460420 460758
$$ packed form
60921A046586n665m912m512m906n743o238o137n839n794o153o705o933o433n559
60907I65057n172n602o288o707p011p383p493p163p066p959r487j0539j0605j0178
60893H56404r873r746r551r113q404p616p231p631q585r415r714r604r315q878
60879G31728q312p854p788q137q549q508p774o698n959n873o166o493o817p092
60865F29708o965o254n449n135n120m645l478k233j543j438j653k049k525k837
60851E78384k833k689k718l028l475l808l791l368k794k497k770l602m697n503
60837E30811n478m649l777l649m193m736m987n269n681n662m762l318k036j178
60823D71436n78j76j05l41o77j020j298j263p24n3M4o09j341j446r70m26l3L38
$$ plain form
60805 460758 461330 461613 461116 460008 458925 458168 457441 456416 455086 453412 451127 448264 445393 442851 440123
60790 440123 436653 433017 430441 429223 428418 427203 425667 423987 421759 418773 415736 413414 411524 409213
60776 409213 406362 403644 401482 399696 398104 396760 395633 394667 394179 394589 395723 397023 398513 400804 403966
60761 403966 407033 409040 409971 410368 410524 410576 410968 412211 414240 416405 418040 418830 418853 418562 418609 419398 420829
60744 420829 422520 424084 425101 425167 424295 423048 421998 421177 420239 418979 417405 415440 412868 409613 405886
60729 405886 402122 398800 396111 393650 390630 386608 381941 377452 373853 371521 370442 370077 369555 368348 366642
60714 366642 364876 363188 361625 360563 360424 361086 361954 362571 362813 362639 362087 361547 361559 362231 363089 363553 363406 362854
60696 362854 362371 362477 363370 364784 366405 368288 370596 373081 375245 376951 378463 379878 380975 381762 382752
$$ packed form
60805D60758N72K83m97j108j083p57p27j025j330j674k285k863k871k542k728
60790D40123l470l636k576j218q05j215j536j680k228k986l037k322j890k311
60776D09213k851k718k162j786j592j344j127r66m88M10J134J300J490K291L162
60761D03966L067K007R31L97J56N2L92J243K029K165J635P90K3k91M7P89J431
60744D20829J691J564J017O6q72j247j050q21r38j260j574j965k572l255l727
60729D05886l764l322k689k461l020m022m667m489l599k332j079l65n22j207j706
60714C66642j766j688j563j062j39O62Q68O17K42j74n52n40J2O72Q58M64j47n52
60696C62854m83J06Q93J414J621J883K308K485K164J706J512J415J097P87R90
$$ plain form
60681 382752 384464 386903 389663 392353 394846 397296 399954 402772 405333 407463 409782 413114 417286 421073
60667 421073 423498 424726 425480 426096 426483 426514 426016 424756 422920 421252 420253 419468 418149 416398 415075 414645
60651 414645 414685 414554 414001 413047 411862 410986 411123 412280 413470 413696 412995 412077 411085 409322 406268 402385 398549
60634 398549 395042 391549 388047 385208 383680 383251 383031 382344 381194 379989 379062 378522 378243 377927 377361 376760
60618 376760 376637 377217 378127 378829 379198 379505 379944 380444 380875 381200 381421 381564 381792 382368 383413 384729 385926 386742
60600 386742 387238 387700 388347 389119 389807 390360 390977 391832 392810 393619 394088 394345 394751 395733 397555 400130 403035 405780
60582 405780 408067 409872 411405 413026 415003 417261 419473 421476 423452 425620 427954 430375 433053 436353
60568 436353 440599 446082 453059 461370 470187 478527 486074 493203 500217 506925 513051 518647 523791 528169
$$ packed form
60681C82752J712K439K760K690K493K450K658K818K561K130K319L332M172L787
60667D21073K425J228P54O16L87L1m98j260j836j668r99p85j319j751j323m30
60651D14645M0j31n53r54j185q76J37J157J190K26p01r18r92j763l054l883l836
60634C98549l507l493l502k839j528m29k20o87j150j205r27n40k79l16n66o01
60618C76760j23N80R10P02L69L07M39N00M31L25K21J43K28N76J045J316J197Q16
60600C86742M96M62O47P72O88N53O17Q55R78Q09M69K57M06R82J822K575K905K745
60582D05780K287J805J533J621J977K258K212K003J976K168K334K421K678L300
60568D36353M246N483O977Q311Q817Q340P547P129P014O708O126N596N144M378
$$ plain form
60554 528169 531310 533136 534006 534295 534184 533833 533514 533484 533929 535010 536784 539023 541385 543941 547378 552462
60538 552462 559327 567473 576467 586421 597644 609953 622470 634153 644448 653435 661371 668120 673074
60525 673074 675704 676182 675322 673864 671864 668903 664760 659773 654635 649988 646150 642979 640086 637417 635629
60510 635629 635537 637097 639355 641646 644523 649082 655604 663453 672289 682767 695785 711494 729497 749727
60496 749727 772532 797904 825151 853599 883266 914436 946749 979116 1010544 1040587 1068808
60485 1068808 1094137 1115213 1131211 1141872 1146741 1144879 1135685 1119736 1098427 1072858 1043433 1010513
60473 1010513 975054 938359 901421 864755 828819 794214 761395 730391 701035 673409 647845
60462 647845 624504 603246 583975 566883 552078 539170 527571 517156 508248 500884 494462 488317
$$ packed form
60554E28169L141J826Q70K89j11l51l19l0M45J081J774K239K362K556L437N084
60538E52462O865Q146Q994R954J1223J2309J2517J1683J0295Q987P936O749M954
60525F73074K630M78q60j458k000k961m143m987n138m647l838l171k893k669j788
60510F35629r2J560K258K291K877M559O522P849Q836J0478J3018J5709J8003K0230
60496G49727K2805K5372K7247K8448K9667L1170L2313L2367L1428L0043K8221
60485A068808K5329K1076J5998J0661M869j862r194j5949k1309k5569k9425l2920
60473A010513l5459l6695l6938l6666l5936l4605l2819l1004k9356k7626k5564
60462F47845k3341k1258j9271j7092j4805j2908j1599j0415q908p364o422o145
$$ plain form
60450 488317 482353 476866 471977 467575 463598 459985 456438 452615 448612 444909 441840 439445 437843 437261
60436 437261 437432 437403 436331 434297 431970 429731 427596 425899 425347 426178 427636 428630 428680 428011 427069 426289 426065
60419 426065 426436 426876 426890 426845 427732 429906 432507 434393 435271 435603 435741 435653 435372 435202 435396 435943 436764 437842
60401 437842 439117 440424 441645 442763 443823 444990 446568 448732 451255 453753 456133 458573 461082 463445
60387 463445 465608 467779 470071 472414 474860 477622 480678 483718 486648 489764 493208 496626 499605 502073
60373 502073 503989 505087 505392 505634 506552 507978 509117 509638 509897 510140 510150 509875 509903 510925 513008 515672 518477
60356 518477 521274 524020 526640 529079 531380 533687 536190 538974 541888 544685 547309 550018 553111 556567
60342 556567 559976 562807 564736 565743 565950 565477 564473 563145 561493 559096 555445 550634 545505 540949 537204
$$ packed form
60450D88317n964n487m889m402l977l613l547l823m003l703l069k395j602n82
60436D37261J71k9j072k034k327k239k135j697n52Q31J458R94N0o69r42p80k24
60419D26065L71M40J4m5Q87K174K601J886Q78L32J38q8k81j70J94N47Q21J078
60401D37842J275J307J221J118J060J167J578K164K523K498K380K440K509K363
60387D63445K163K171K292K343K446K762L056L040K930L116L444L418K979K468
60373E02073J916J098L05K42R18J426J139N21K59K43J0k75K8J022K083K664K805
60356E18477K797K746K620K439K301K307K503K784K914K797K624K709L093L456
60342E56567L409K831J929J007K07m73j004j328j652k397l651m811n129m556l745
$$ plain form
60327 537204 533892 530503 526709 522485 518247 514708 512374 511172 510616 510094 508993 507008 504707 503395 503898
60312 503898 505706 507767 509967 513227 518193 524396 530904 537410 544565 553422 564613 577779 591777
60299 591777 605599 618957 631713 643057 651790 657369 660089 660272 657901 653207 647002 640099 632740
60286 632740 624808 616254 607147 597688 588381 579866 572385 565704 559654 554293 549334 543931 537430 530060
60272 530060 522654 515972 510529 506588 503843 501313 498064 494022 489890 486401 483826 481971 480379 478669
60258 478669 476877 475324 474066 472756 471208 469683 468401 467141 465732 464595 464380 465211 466607 467955 468855
60243 468855 469260 469609 470477 471778 472687 472777 472766 473534 474826 475728 476256 477528 480228 483684 486810 489354 491902
60226 491902 495043 498925 503330 507895 512365 516781 521311 525915 530440 534949 539614 544305 548724 553001
$$ packed form
60327E37204l312l389l794m224m238l539k334j202n56n22j101j985k301j312N03
60312E03898J808K061K200L260M966O203O508O506P155Q857J1191J3166J3998
60299E91777J3822J3358J2756J1344Q733N579K720J83k371m694o205o903p359
60286F32740p932q554r107r459r307q515p481o681o050n361m959n403o501p370
60272E30060p406o682n443l941k745k530l249m042m132l489k575j855j592j710
60258D78669j792j553j258j310j548j525j282j260j409j137k15Q31J396J348R00
60243D68855M05L49Q68J301R09R0j1P68J292R02N28J272K700L456L126K544K548
60226D91902L141L882M405M565M470M416M530M604M525M509M665M691M419M277
$$ plain form
60212 553001 557736 563303 569516 576079 582957 590077 597167 604160 611390 619041 626712 633866 640439 646633
60198 646633 652369 657393 661798 666064 670509 674945 678870 681835 683736 684909 685815 686414 686034 684120 680962
60183 680962 677379 673789 670012 665874 661573 657343 653186 649086 645141 641317 637387 633322 629421 625772
60169 625772 621919 617450 612680 608292 604449 600792 597289 594449 592558 591249 590182 589576 589591 589668 589209 588663
60153 588663 589131 590807 592573 593396 593539 593993 595238 597029 599045 601167 603317 605526 608118 611380 615082
60138 615082 618655 621864 624955 628175 631583 635335 639740 644824 650155 655360 660568 666090 671790 677042
60124 677042 681317 684664 687598 690573 693589 696310 698502 700242 701691 702897 703992 705374 707358 709664
60110 709664 711635 712945 713822 714473 714612 713726 711600 708415 704545 700413 696404 692737 689486 686746 684583
$$ packed form
60212E53001M735N567O213O563O878P120P090O993P230P651P671P154O573O194
60198F46633N736N024M405M266M445M436L925K965J901J173R06N99l80j914l158
60183F80962l583l590l777m138m301m230m157m100l945l824l930m065l901l649
60169F25772l853m469m770m388l843l657l503k840j891j309j067o06J5P7m59n46
60153E88663M68J676J766Q23J43M54J245J791K016K122K150K209K592L262L702
60138F15082L573L209L091L220L408L752M405N084N331N205N208N522N700N252
60124F77042M275L347K934K975L016K721K192J740J449J206J095J382J984K306
60110G09664J971J310Q77O51J39q86k126l185l870m132m009l667l251k740k163
$$ plain form
60095 684583 682709 680503 677537 673951 670149 666373 662809 659847 657814 656516 655417 654304 653432 653030 652997
60080 652997 653214 653737 654432 654726 654106 652686 650905 648756 645810 642003 637916 633973 629750 624497 618181
60065 618181 611537 605155 598919 592451 585704 578930 572342 566125 560570 555882 551928 548413 545348 543060
60051 543060 541682 540800 539803 538604 537895 538548 540741 543801 547030 550516 554817 559925 564999 569304 573019
60036 573019 576748 580538 583815 586191 587864 589147 589979 590056 589246 587716 585754 583538 580972 577786 573862
60021 573862 569384 564512 559104 553037 546730 540964 536058 531554 526829 521829 517050 512985 509743 507053
60007 507053 504451 501541 498218 494679 491294 488508 486708 485880 485404 484484 482936 481323 480321 480231 481193 483396
59991 483396 486717 490395 493522 495886 498036 500584 503685 507169 510796 514287 517355 519871 521843 523115
$$ packed form
60095F84583j874k206k966l586l802l776l564k962k033j298j099j113q72m02l3
60080F52997K17N23O95K94o20j420j781k149k946l807m087l943m223n253o316
60065F18181o644o382o236o468o747o774o588o217n555m688l954l515l065k288
60051E43060j378q82r97j199p09O53K193L060L229L486M301N108N074M305L715
60036E73019L729L790L277K376J673J283Q32P7q10j530j962k216k566l186l924
60021E73862m478m872n408o067o307n766m906m504m725n000m779m065l242k690
60007E07053k602k910l323l539l385k786j800q28m76r20j548j613j002r0R62K203
59991D83396L321L678L127K364K150K548L101L484L627L491L068K516J972J272
$$ plain form
59977 523115 523358 522570 521398 520630 520392 520096 519189 517695 515988 514357 513023 512254 512084 512106 511944 511912 512740 514583
59959 514583 516697 518341 519702 521618 524574 528195 531608 534079 535424 536017 536358 536617 536727 536915 537696 539083
59943 539083 540264 540538 540315 540656 541955 543606 544980 546157 547547 549232 550928 552299 553117 553420 553702 554703
59927 554703 556721 559213 561265 562526 563632 565676 569184 573575 577790 581513 585514 590573 596371 601827
59913 601827 606281 609893 613027 615877 618697 621827 625221 628328 630607 631865 632114 631548 630704 630198 630075
59898 630075 629841 629288 628816 628801 629146 629737 630825 632556 634540 636333 638029 640010 642404 645189 648529 652535
59882 652535 656890 661162 665336 669639 673964 677915 681439 684990 688995 693289 697120 699631 700522 700357 700006
59867 700006 699600 698313 695389 691041 686039 680791 675334 669930 665050 660758 656651 652538 648801 645947
$$ packed form
59977E23115K43p88j172p68k38k96r07j494j707j631j334p69j70K2j62l2Q28J843
59959E14583K114J644J361J916K956L621L413K471J345N93L41K59J10J88P81J387
59943E39083J181K74k23L41J299J651J374J177J390J685J696J371Q18L03K82J001
59927E54703K018K492K052J261J106K044L508M391M215L723M001N059N798N456
59913F01827M454L612L134K850K820L130L394L107K279J258K49n66q44n06j23
59898F30075k34n53m72j5L45N91J088J731J984J793J696J981K394K785L340M006
59882F52535M355M272M174M303M325L951L524L551M005M294L831K511Q91j65l51
59867G00006m06j287k924m348n002n248n457n404m880m292m107m113l737k854
$$ plain form
59853 645947 644042 642658 641259 639735 638703 639156 641523 645191 649187 653103 657101 661255 665361 669236
59839 669236 672707 675429 677247 678690 680591 683096 685538 687304 688336 688704 688339 687429 686461 685410 683354
59824 683354 679445 674000 668169 662700 657532 652426 647379 642366 637202 631952 627109 623094 619762 616649
59810 616649 613520 610443 607460 604543 601838 599581 597674 595619 593067 590207 587462 585010 582821 580847
59796 580847 578951 576848 574567 572708 571752 571190 569995 567944 565837 564262 562905 561457 560472 560605 561416
59781 561416 561704 560952 559823 559204 559239 559374 559049 558251 557552 557518 557972 558123 557628 557197 557763 559366 561338 563280
59763 563280 565301 567470 569784 572633 576612 581661 586886 591456 595390 599401 604281 610435 617616 625070
59749 625070 632231 639235 646425 653568 660135 666207 672357 678594 684171 688689 692682 696753 700697 703880
$$ packed form
59853F45947j905j384j399j524j032M53K367L668L996L916L998M154M106L875
59839F69236L471K722J818J443J901K505K442J766J032L68l65r10r68j051k056
59824F83354l909n445n831n469n168n106n047n013n164n250m843m015l332l113
59810F16649l129l077k983k917k705k257j907k055k552k860k745k452k189j974
59796E80847j896k103k281j859r56n62j195k051k107j575j357j448r85J33Q11
59781E61416K88p52j129o19L5J35l25p98o99l4M54J51m95m31N66J603J972J942
59763E63280K021K169K314K849L979N049N225M570L934M011M880O154P181P454
59749F25070P161P004P190P143O567O072O150O237N577M518L993M071L944L183
$$ plain form
59735 703880 705955 706844 706497 705159 703455 701778 699956 697914 696171 695146 694356 692949 690755 688217 685554
59720 685554 682772 680411 679406 679941 681074 681824 682154 682533 682962 682951 682349 681727 681846 682977 684839 687048 689443
59703 689443 692004 694596 697005 699199 701422 703916 706691 709675 713010 716949 721450 725990 729896 732786
59689 732786 734722 736013 736981 737839 738601 739026 738734 737544 735694 733605 731418 728906 725878 722452 718787
59674 718787 714746 710096 704979 699911 695216 690659 685704 680124 674349 669179 665086 661798 658762 655972
59660 655972 654008 653105 652677 652114 651703 652233 653919 656252 658780 661422 664010 666147 667658 668745 669537 669934
59644 669934 669939 669629 668710 666610 663198 658891 653947 648265 642146 636622 632477 629290 625890 621486 616111
59629 616111 610392 605244 601377 598565 595659 591686 586729 581461 576298 571444 567273 563994 561148 558062
$$ packed form
59735G03880K075Q89l47j338j704j677j822k042j743j025p90j407k194k538k663
59720F85554k782k361j005N35J133P50L30L79M29j1o02o22J19J131J862K209K395
59703F89443K561K592K409K194K223K494K775K984L335L939M501M540L906K890
59689G32786J936J291R68Q58P62M25k92j190j850k089k187k512l028l426l665
59674G18787m041m650n117n068m695m557m955n580n775n170m093l288l036k790
59660F55972j964r03m28n63m11N30J686K333K528K642K588K137J511J087P92L97
59644F69934Nl10r19k100l412m307m944n682o119n524m145l187l400m404n375
59629F16111n719n148l867k812k906l973m957n268n163m854m171l279k846l086
$$ plain form
59615 558062 554628 551123 547480 543449 539354 536006 533778 532375 531580 531629 532654 534254 535883 537267 538250
59600 538250 538634 538525 538541 539278 540593 541603 541513 540471 539618 540082 541762 543278 543374 542167 540675 539405 538002
59583 538002 536301 534884 534225 533791 532582 530382 528010 526315 525254 524020 521857 518658 514955 511519 508919
59568 508919 507325 506581 506386 506359 506028 504913 502872 500417 498459 497521 497312 497272 497357 497886 498805 499775 501064 503595
59550 503595 507656 512124 515620 518052 520369 523136 526153 529442 533693 539426 546265 553492 561052 569712
59536 569712 580362 593207 607286 620620 631136 637946 641813 644354 646756 649137 650918 651671 651634 651441
59522 651441 651368 651055 650054 648395 646429 644338 642051 639428 636241 632247 627580 622780 618002 612574 605945
59507 605945 598774 592290 586648 580823 574246 567634 561834 556654 551482 546451 542304 539385 537385 535929
$$ packed form
59615E58062l434l505l643m031m095l348k228j403p95M9J025J600J629J384R83
59600E38250L84j09J6P37J315J010r0j042q53M64J680J516R6j207j492j270j403
59583E38002j701j417o59m34j209k200k372j695j061j234k163l199l703l436k600
59568E08919j594p44j95k7l31j115k041k455j958r38k09m0Q5N29R19R70J289K531
59550E03595M061M468L496K432K317K767L017L289M251N733O839P227P560Q660
59536E69712J0650J2845J4079J3334J0516O810L867K541K402K381J781P53l7j93
59522F51441p3l13j001j659j966k091k287k623l187l994m667m800m778n428o629
59507F05945p171o484n642n825o577o612n800n180n172n031m147k919k000j456
$$ plain form
59493 535929 534885 534141 533517 532994 532784 533087 533881 534939 536099 537577 539851 543025 546431 549295 551690 554345
59477 554345 557534 560849 564144 567967 572649 577650 582296 586590 590739 594393 597060 598887 600429 601954
59463 601954 603631 606019 609497 613361 616385 618428 620784 624789 630522 636981 642960 647769 651689 655867
59449 655867 661254 667491 673255 677740 681196 684014 686020 686961 686942 686013 683954 680926 677746 674865 671608
59434 671608 667133 661783 656688 652328 648369 644887 642756 642479 643355 644336 645290 646910 649696 653549 658283
59419 658283 664045 671121 679594 689286 699897 711194 723277 736700 752001 768789 785255 798909
59407 798909 808041 812619 813885 813278 811735 809707 807403 804971 802671 800911 799824 798646 795813 790001
59393 790001 781073 769947 757832 745834 734884 725292 716262 706471 695542 684581 674976 666979 659909
$$ packed form
59493E35929j044p44o24n23k10L03P94J058J160J478K274L174L406K864K395K655
59477E54345L189L315L295L823M682N001M646M294M149L654K667J827J542J525
59463F01954J677K388L478L864L024K043K356M005N733O459N979M809L920M178
59449F55867N387O237N764M485L456K818K006R41j9r29k059l028l180k881l257
59434F71608m475n350n095m360l959l482k131k77Q76R81R54J620K786L853M734
59419F58283N762P076Q473R692J0611J1297J2083J3423J5301J6788J6466J3654
59407G98909R132M578J266o07j543k028k304k432k300j760j087j178k833n812
59393G90001q928j1126j2115j1998j0950r592r030r791j0929j0961r605p997p070
$$ plain form
59380 659909 653443 648082 644334 642014 640560 639674 639430 640068 641897 645109 649365 653788 657701 661279 665178
59365 665178 669730 674935 681095 688675 697273 705361 711723 716960 722915 730671 739654 748853 758258 768665
59351 768665 780482 793346 806803 820710 834804 848397 860894 872439 883711 895128 906433
59340 906433 916954 926047 933327 938781 942741 945589 947317 947422 945337 941030 935128 928344 920734 911629
59326 911629 900538 888127 875989 865251 855648 846167 836357 826631 817467 808866 800696 793079 786222
59313 786222 780161 774929 770710 767496 764797 761994 758996 756321 754554 753820 753743 753782 753723 753974 755322 758229
59297 758229 762413 767204 772160 777166 782024 786212 789143 790544 790491 789079 786157 781526 775458 768771 762153
59282 762153 755505 748393 741137 734911 730551 727752 725854 724996 725956 729031 733727 739456 746018 753261 760785
$$ packed form
59380F59909o466n361l748k320j454q86k44O38J829L212M256M423L913L578L899
59365F65178M552N205O160P580Q598Q088O362N237N955P756Q983R199R405J0407
59351G68665J1817J2864J3457J3907J4094J3593J2497J1545J1272J1417J1305
59340I06433J0521R093P280N454L960K848J728J05k085m307n902o784p610r105
59326I11629j1091j2411j2138j0738r603r481r810r726r164q601q170p617o857
59313G86222o061n232m219l214k699k803k998k675j767p34p7L9n9K51J348K907
59297G58229M184M791M956N006M858M188K931J401n3j412k922m631o068o687o618
59282G62153o648p112p256o226m360k799j898q58R60L075M696N729O562P243P524
$$ plain form
59267 760785 768195 775353 782186 788497 794078 798793 802440 804759 805622 805046 802951 799218 794053 788043 781666
59252 781666 774994 768032 761149 754874 749351 744203 738968 733580 728413 723926 720303 717460 715339 714034
59238 714034 713536 713551 713760 714137 714790 715616 716354 716911 717315 717445 717131 716468 715615 714258 711714 707801 703279 699192
59220 699192 695950 693201 690382 687234 683958 681024 678746 676994 675507 674342 673713 673382 672703 671450 670175
59205 670175 669480 669255 668974 668513 668356 669074 670780 672944 674658 675333 675269 675320 675873 676537 676927 677200 677565 677819
59187 677819 677938 678595 680411 682983 685430 687718 690600 694233 697728 700408 702816 706033 710387 715274 719892
59172 719892 723808 727022 729953 733200 737093 741495 746251 751575 757715 764370 770794 776440 781206 785109
59158 785109 788069 790095 791327 791710 790865 788549 785133 781332 777454 773150 767952 761841 755169 748218 741072
$$ packed form
59267G60785P410P158O833O311N581M715L647K319Q63n76k095l733n165o010o377
59252G81666o672o962o883o275n523n148n235n388n167m487l623k843k121j305
59238G14034m98J5K09L77O53Q26P38N57M04J30l14o63q53j357k544l913m522m087
59220F99192l242k749k819l148l276k934k278j752j487j165o29l31o79j253j275
59205F70175o95k25k81m61j57P18J706K164J714O75o4N1N53O64L90K73L65K54
59187F77819J19O57J816K572K447K288K882L633L495K680K408L217M354M887M618
59172G19892L916L214K931L247L893M402M756N324O140O655O424N646M766L903
59158G85109K960K026J232L83q45k316l416l801l878m304n198o111o672o951p146
$$ plain form
59143 741072 733735 726084 717744 708458 698741 689812 682506 676367 670179 663391 656671 651042 646851 643828
59129 643828 641773 640675 640202 639698 639025 639032 640675 643792 647248 650424 654042 659268 666403 674831 683840 692924
59113 692924 701556 709379 716695 724135 731693 738626 744505 749822 755246 760803 766077 770709 774225 775961
59099 775961 775862 775047 774756 774892 774298 772403 769784 767066 764194 761158 758535 756581 754412 750955 746493 742418
59083 742418 739429 736726 733200 728698 723661 718106 711669 704540 697595 691407 685573 679370 672742 666280
59069 666280 660357 654716 648946 643056 637437 632419 628030 624096 620484 617219 614393 611965 609731 607520
59055 607520 605230 602543 598907 594203 589355 585734 583815 582746 581424 579663 578106 577347 577496 578373 579722
59040 579722 581296 583006 584949 587096 589089 590628 591965 593721 596204 599184 602385 606003 610593 616522
$$ packed form
59143G41072p337p651q340r286r717q929p306o139o188o788o720n629m191l023
59129F43828k055j098m73n04o73PJ643L117L456L176L618N226P135Q428R009R084
59113F92924Q632P823P316P440P558O933N879N317N424N557N274M632L516J736
59099G75961r9q15k91J36n94j895k619k718k872l036k623j954k169l457m462m075
59083G42418k989k703l526m502n037n555o437p129o945o188n834o203o628o462
59069F66280n923n641n770n890n619n018m389l934l612l265k826k428k234k211
59055F07520k290k687l636m704m848l621j919j069j322j761j557p59J49Q77J349
59040E79722J574J710J943K147J993J539J337J756K483K980L201L618M590N929
$$ plain form
59026 616522 623561 631052 638531 646172 654506 663747 673637 683972 694855 706167 717057 726349 733383
59013 733383 738269 741562 743957 746050 747959 749194 749252 748255 746693 744750 742385 740063 738813 739298 741186
58998 741186 743589 745830 747644 749018 750197 751615 753456 755308 756556 757115 757556 758433 759688 760851 761690
58983 761690 762424 763331 764481 766054 768575 772371 776947 781439 785759 790731 796963 804235 812350 821874 833278
58968 833278 845760 857791 868765 879393 890502 902124 913829 925235 935871 945065 952310 957424
58956 957424 960280 960832 959559 957322 954361 949769 942327 931711 918738 904698 890646 877016 863653
58943 863653 850348 837369 825204 813814 802685 791801 782032 774165 768046 763069 759047 756036 753658
58930 753658 751296 748849 746750 745243 744180 743434 743008 742693 742139 741363 740746 740374 739852 738955 738081 737759 738031
$$ packed form
59026F16522P039P491P479P641Q334R241R890J0335J0883J1312J0890R292P034
59013G33383M886L293K395K093J909J235N8r97j562j943k365k322j250M85J888
58998G41186K403K241J814J374J179J418J841J852J248N59M41Q77J255J163Q39
58983G61690P34R07J150J573K521L796M576M492M320M972O232P272Q115R524J1404
58968H33278J2482J2031J0974J0628J1109J1622J1705J1406J0636R194P245N114
58956I57424K856N52j273k237k961m592p442j0616j2973j4040j4052j3630j3363
58943H63653j3305j2979j2165j1390j1129j0884r769p867o119m977m022l011k378
58930G53658k362k447k099j507j063p46m26l15n54p76o17l72n22q97q74l22K72
$$ plain form
58913 738031 738609 739407 740548 742023 743657 745408 747429 749860 752844 756795 762396 770122 779778 790575
58899 790575 801697 812856 824466 837278 851685 867204 882749 897557 911879 926606 942272
58888 942272 958638 975292 992330 1010086 1028254 1045632 1060898 1073510 1083776 1092204 1098999 1104082
58876 1104082 1107343 1108691 1107923 1104726 1098895 1090557 1080209 1068585 1056508 1044697 1033470 1022546 1011235
58863 1011235 999007 985945 972715 960121 948613 938101 928203 918717 909760 901391 893236 884789
58851 884789 876015 867335 859028 850992 843148 835636 828378 820861 812686 804006 795058 785611 775413 765003
58837 765003 755543 747746 741309 735358 729126 722316 715224 708517 702532 696827 690824 684897 680371 678345
58823 678345 678841 681102 684238 687450 690145 692265 694307 696805 699899 703458 707332 711289 714923 717826
$$ packed form
58913G38031N78P98J141J475J634J751K021K431K984L951N601P726R656J0797
58899G90575J1122J1159J1610J2812J4407J5519J5545J4808J4322J4727J5666
58888I42272J6366J6654J7038J7756J8168J7378J5266J2612J0266Q428O795N083
58876A104082L261J348p68l197n831q338j0348j1624j2077j1811j1227j0924j1311
58863A011235j2228j3062j3230j2594j1508j0512r898r486q957q369q155q447
58851H84789q774q680q307q036p844p512p258p517q175q680q948r447j0198j0410
58837G65003r460p797o437n951o232o810p092o707n985n705o003n927m526k026
58823F78345M96K261L136L212K695K120K042K498L094L559L874L957L634K903
$$ plain form
58809 717826 719817 720978 721604 722032 722327 722182 721367 720129 718758 716846 713598 708961 703920 699411 695380
58794 695380 691216 686667 681968 677358 672908 668660 664666 660925 657498 654539 652113 650136 648596 647655
58780 647655 647466 648122 649821 652717 656521 660540 664265 667588 670370 672235 672972 672673 671246 668263 663660
58765 663660 658134 652469 646846 641242 636090 631962 628829 626149 623585 621173 619005 617230 616221 616246 617011
58750 617011 618005 619243 621210 624099 627573 631309 635357 639838 644672 649713 654918 660254 665648 671070
58736 671070 676572 682251 688263 694686 701207 707224 712602 718044 724222 730731 736473 740963 744598 747584
58722 747584 749398 749661 748980 748356 748147 748106 748161 748538 749115 749229 748320 746469 744128 741631 739153 736874 734810
58705 734810 732571 729612 725708 720861 714785 706955 697400 686989 676525 665820 654159 641489 628568
$$ packed form
58809G17826J991J161O26M28K95j45q15j238j371j912l248m637n041m509m031
58794F95380m164m549m699m610m450m248l994l741l427k959k426j977j540r41
58780F47655j89O56J699K896L804M019L725L323K782J865P37k99j427k983m603
58765F63660n526n665n623n604n152m128l133k680k564k412k168j775j009K5P65
58750F17011R94J238J967K889L474L736M048M481M834N041N205N336N394N422
58736F71070N502N679O012O423O521O017N378N442O178O509N742M490L635K986
58722G47584J814K63o81o24k09m1N5L77N77J14r09j851k341k497k478k279k064
58705G34810k239k959l904m847o076p830r555j0411j0464j0705j1661j2670j2921
$$ plain form
58692 628568 616030 603929 592368 581913 573049 565650 559301 553777 548872 544130 539163 534052 529177
58679 529177 524848 521338 518960 517779 517463 517647 518168 518757 519027 519204 520425 523703 528855 534984 541678 549006
58663 549006 556594 563609 569803 575768 581836 587282 590971 592420 591999 590467 588600 586860 585063 582498
58649 582498 578699 574000 569137 564455 559736 554719 549528 544524 539841 535257 530622 526383 523486 522512
58635 522512 522989 523733 523907 523637 523628 524359 525741 527419 529182 530980 532634 533830 534588 535462 536902 538555 539711
58618 539711 540481 541904 544658 548170 551401 554100 556876 560415 565063 570765 576815 581927 585211 587069
58604 587069 588680 590725 593057 595319 597268 598586 599094 599211 599628 600411 600987 601140 601432 602444 604147 606335
58588 606335 609233 613268 618542 624905 632388 641141 650929 660961 670417 679189 687994 697609 708045 718682
$$ packed form
58692F28568j2538j2101j1561j0455q864p399o349n524m905m742m967n111m875
58679E29177m329l510k378j181l16J84N21N89K70J77J221L278N152O129O694P328
58663E49006P588P015O194N965O068N446L689J449m21j532j867j740j797k565
58649E82498l799m699m863m682m719n017n191n004m683m584m635m239k897r74
58635E22512M77P44J74k70rP31J382J678J763J798J654J196P58Q74J440J653J156
58618E39711P70J423K754L512L231K699K776L539M648N702O050N112L284J858
58604E87069J611K045K332K262J949J318N08J17M17P83N76J53K92J012J703K188
58588F06335K898M035N274O363P483Q753R788J0032R456Q772Q805R615J0436J0637
$$ plain form
58574 718682 729176 739875 751119 762630 773940 785077 796382 808009 820144 833430 848501
58563 848501 865236 883097 902058 922448 943883 965114 985083 1003461 1020043 1034407 1046506
58552 1046506 1056901 1065907 1072977 1077367 1079075 1078739 1076908 1073744 1069113 1062638 1053921 1043043 1030549
58539 1030549 1016659 1000826 982543 962414 941979 922475 904044 886040 867848 849409 831259
58528 831259 814217 798919 785493 773574 762599 752245 742752 734723 728446 723446 718917 714504 710408
58515 710408 706809 703594 700664 698175 696262 694762 693281 691452 689181 686875 685316 684916 685128 684928 683940
58500 683940 682685 681755 681197 680898 681036 681767 682773 683571 684214 685406 687881 691828 696905 702680 708961 715768
58484 715768 723184 731428 740953 752071 764426 777242 790269 804028 818771 833632 847288 859065
$$ packed form
58574G18682J0494J0699J1244J1511J1310J1137J1305J1627J2135J3286J5071
58563H48501J6735J7861J8961K0390K1435K1231J9969J8378J6582J4364J2099
58552A046506J0395R006P070M390J708l36j831l164m631o475q717j0878j2494
58539A030549j3890j5833j8283k0129k0435j9504j8431j8004j8192j8439j8150
58528H31259j7042j5298j3426j1919j0975j0354r493q029o277n000m529m413m096
58515G10408l599l215k930k489j913j500j481j829k271k306j559m00K12k00r88
58500F83940j255r30n58k99J38P31J006P98O43J192K475L947N077N775O281O807
58484G15768P416Q244R525J1118J2355J2816J3027J3759J4743J4861J3656J1777
$$ plain form
58472 859065 868840 876270 880951 883207 883938 883644 882236 879820 876926 873857 870465 866730 862992 859532 856573
58457 856573 854790 855050 857301 860424 863607 867323 872437 878792 885126 890056 892729 892847 890654 886882 882366
58442 882366 877566 872466 866838 860605 854060 847716 841793 836076 830554 825935 823049 821896 821779 822257 823403
58427 823403 825218 827489 830234 833676 837668 841755 845793 849881 853633 856318 857871 859016 860086 860379
58413 860379 859026 855935 851612 846572 841167 835490 829243 822212 814940 808343 802653 797454 792815 789407
58399 789407 787252 785357 783085 780998 779845 779558 779871 781069 783337 785997 788264 790251 792543 795146 797599
58384 797599 799753 801804 803825 805908 808474 811904 816091 820789 826128 832298 839047 846022 853362 861463
58370 861463 870303 879452 888655 898047 907895 918330 929200 940121 950821 961430 972107 982478
$$ packed form
58472H59065R775P430M681K256P31k94j408k416k894l069l392l735l738l460k959
58457H56573j783K60K251L123L183L716N114O355O334M930K673J18k193l772m516
58442H82366m800n100n628o233o545o344n923n717n522m619k886j153j17M78J146
58427H23403J815K271K745L442L992M087M038M088L752K685J553J145J070K93
58413H60379j353l091m323n040n405n677o247p031p272o597n690n199m639l408
58399G89407k155j895k272k087j153k87L13J198K268K660K267J987K292K603K453
58384G97599K154K051K021K083K566L430M187M698N339O170O749O975P340Q101
58370H61463Q840R149R203R392R848J0435J0870J0921J0700J0609J0677J0371
$$ plain form
58358 982478 991951 1000589 1009048 1017570 1025736 1033303 1040534 1047446 1053479 1058313 1062424 1066519 1070915 1075656
58344 1075656 1080672 1085689 1090616 1096093 1102912 1110896 1119249 1128000 1137934 1148994 1160091 1170962 1182819
58331 1182819 1196442 1210854 1224695 1237811 1250562 1262587 1273267 1282649 1291039 1298398 1304875 1311139
58319 1311139 1317392 1322930 1327451 1331947 1337446 1343713 1350048 1356532 1363563 1370975 1378562 1386758 1395949 1405864
58305 1405864 1416402 1428199 1441531 1455600 1469800 1484727 1500964 1517856 1534592 1551554 1569438
58294 1569438 1587884 1606194 1624646 1643903 1663800 1683812 1704083 1725020 1746630 1769131 1793290
58283 1793290 1819126 1845242 1870532 1895552 1921159 1946940 1972270 1997828 2024689 2052909 2082334
58272 2082334 2113785 2148067 2184845 2223893 2266368 2313350 2364175 2417695 2474103 2534008 2596867
$$ packed form
58358I82478R473Q638Q459Q522Q166P567P231O912O033M834M111M095M396M741
58344A075656N016N017M927N477O819P984Q353Q751R934J1060J1097J0871J1857
58331A182819J3623J4412J3841J3116J2751J2025J0680R382Q390P359O477O264
58319A311139O253N538M521M496N499O267O335O484P031P412P587Q196R191R915
58305A405864J0538J1797J3332J4069J4200J4927J6237J6892J6736J6962J7884
58294A569438J8446J8310J8452J9257J9897K0012K0271K0937K1610K2501K4159
58283A793290K5836K6116K5290K5020K5607K5781K5330K5558K6861K8220K9425
58272B082334L1451L4282L6778L9048M2475M6982N0825N3520N6408N9905O2859
$$ plain form
58261 2596867 2661914 2729474 2799712 2871293 2942947 3015184 3088809 3163235 3238021 3314490 3393772
58250 3393772 3474893 3557085 3642314 3732958 3828428 3926854 4028818 4136646 4251244 4372496
58240 4372496 4501523 4639584 4785797 4938951 5100573 5273361 5457836 5653604 5862603
58231 5862603 6087678 6329111 6586099 6860638 7156481 7475459 7818591 8189739 8594297
58222 8594297 9035414 9515451 10040144 10617462 11253865 11956156 12735827 13607378 14584411
58213 14584411 15682670 16925529 18341720 19960405 21815097 23950868 26421986 29286159
58205 29286159 32608960 36467886 40934439 46042600 51775958 58083233 64903863 72195656
58197 72195656 79970296 88323442 97436498 107560733 119009964 132142444 147287599
$$ packed form
58261B596867O5047O7560P0238P1581P1654P2237P3625P4426P4786P6469P9282
58250C393772Q1121Q2192Q5229R0644R5470R8426J01964J07828J14598J21252
58240D372496J29027J38061J46213J53154J61622J72788J84475J95768K08999
58231E862603K25075K41433K56988K74539K95843L18978L43132L71148M04558
58222H594297M41117M80037N24693N77318O36403P02291P79671Q71551R77033
58213A4584411J098259J242859J416191J618685J854692K135771K471118K864173
58205B9286159L322801L858926M466553N108161N733358O307275O820630P291793
58197G2195656P774640Q353146R113056J0124235J1449231J3132480J5145155
$$ plain form
58190 147287599 164635444 184153444 205521544 228006133 250312452 270645052 287141793
58183 287141793 298500732 304381761 305330899 302348150 296408241 288157694 277852167 265498573
58175 265498573 251098533 234849160 217203254 198799500 180334121 162429237 145532629
58168 145532629 129885616 115568636 102577533 90872243 80390779 71057684 62795710
58161 62795710 55526564 49162560 43607508 38768068 34559306 30901333 27719312 24948647
58153 24948647 22534944 20428468 18583439 16962205 15534568 14272590 13150498 12149134
58145 12149134 11255251 10455860 9737247 9089149 8505091 7978018 7499563 7063828 6667822
58136 6667822 6307563 5977233 5672475 5391077 5130108 4885839 4656865 4444032 4246725
$$ packed form
58190A47287599J7347845J9518000K1368100K2484589K2306319K0332600J6496741
58183B87141793J1358939N881029R49138k982749n939909q250547j0305527j2353594
58175B65498573j4400040j6249373j7645906j8403754j8465379j7904884j6896608
58168A45532629j5647013j4316980j2991103j1705290j0481464r333095q261974
58161F2795710p269146o364004n555052m839440m208762l657973l182021k770665
58153B4948647k413703k106476j845029j621234j427637j261978j122092j001364
58145A2149134q93883p99391p18613o48098n84058n27073m78455m35735l96006
58136F667822l60259l30330l04758k81398k60969k44269k28974k12833j97307
$$ plain form
58127 4246725 4062213 3888882 3727025 3575992 3433612 3298956 3172856 3055188 2944345
58118 2944345 2839851 2742728 2652671 2567470 2485945 2409019 2337277 2269774 2205871 2145913 2089439
58107 2089439 2034934 1982122 1932409 1886442 1843211 1802135 1763928 1728636 1694796 1661344 1628559
58096 1628559 1596359 1563517 1529509 1495550 1462920 1431601 1401251 1372098 1344119 1316621 1289334
58085 1289334 1262845 1237473 1212844 1188861 1165850 1143473 1120819 1097958 1076067 1055619 1035657
58074 1035657 1015192 994125 972575 950652 929214 909498 891519 874053 856486 839497 823669
58063 823669 808782 794806 782157 770576 759060 747314 736034 725384 714601 703528 693189
58052 693189 684205 675940 667761 659914 652503 644821 636411 627779 619476 611481 604020 597815 592873 588100
$$ packed form
58127D246725j84512j73331j61857j51033j42380j34656j26100j17668j10843
58118B944345j04494r7123r0057q5201q1525p6926p1742o7503o3903n9958n6474
58107B089439n4505n2812m9713m5967m3231m1076l8207l5292l3840l3452l2785
58096A628559l2200l2842l4008l3959l2630l1319l0350k9153k7979k7498k7287
58085A289334k6489k5372k4629k3983k3011k2377k2654k2861k1891k0448j9962
58074A035657k0465k1067k1550k1923k1438j9716j7979j7466j7567j6989j5828
58063H23669j4887j3976j2649j1581j1516j1746j1280j0650j0783j1073j0339
58052F93189q984q265q179p847p411p682q410q632q303p995p461o205m942m773
$$ plain form
58038 588100 582793 577547 573021 568791 564117 558933 553398 547265 540413 533272 526133 518668 510674 502604
58024 502604 494971 487876 481407 475758 470649 465471 460264 455646 451600 447388 442984 439383 436985 434892
58010 434892 432450 430309 429127 428322 427036 425405 423888 422200 419980 417897 416978 417216 417750 418091 418378 418622
57994 418622 418482 417634 415926 413437 410805 409079 408753 409138 409102 408142 406494 404629 402978 401739 400613 399014
57978 399014 396713 393902 390604 386749 382937 380313 379286 379017 378498 377477 376054 374232 372302 370861 369896
57963 369896 368609 366723 365131 364515 364122 362828 360918 359808 360210 361402 362225 362117 361153 359643 357873 356109
57947 356109 354773 354489 355581 357574 359685 361854 364692 368395 372433 376547 381230 386922 393380 400218
57933 400218 407318 414349 420702 426368 432111 438179 443537 447003 448510 448703 447969 446521 444730 442599 439460
$$ packed form
58038E88100n307n246m526m230m674n184n535o133o852p141p139p465p994q070
58024E02604p633p095o469n649n109n178n207m618m046m212m404l601k398k093
58010D34892k442k141j182q05j286j631j517j688k220k083r19K38N34L41K87K44
57994D18622j40q48j708k489k632j726l26L85l6r60j648j865j651j239j126j599
57978C99014k301k811l298l855l812k624j027k69n19j021j423j822j930j441r65
57963C69896j287j886j592o16l93j294j910j110M02J192Q23j08r64j510j770j764
57947C56109j336k84J092J993K111K169K838L703M038M114M683N692O458O838
57933D00218P100P031O353N666N743O068N358L466J507J93p34j448j791k131l139
$$ plain form
57918 439460 434966 429883 425151 420704 416039 411408 407491 404210 400874 397329 394090 391378 388868 386452
57904 386452 384473 383024 381530 379270 376011 372077 368013 364207 360646 357136 353821 351217 349583 348584
57890 348584 347735 346825 345826 344872 344506 345368 347310 349402 351080 352699 354567 356259 357403 358421 359710 360693
57874 360693 360517 359254 357687 356288 355198 354779 355294 356241 356798 356754 356331 355382 353686 351893 351220 352002 353221
57857 353221 353704 353328 352901 353229 354418 355890 357063 358072 359495 361274 362437 362316 361493 360948 360732 360157
57841 360157 358946 357407 355687 353656 351426 349292 347157 344623 341682 338781 336212 333933 331913 330219
57827 330219 328800 327590 326671 326014 325325 324609 324517 325522 327058 328090 328342 328312 328331 328284 328136 327990 327702 327052
57809 327052 326174 325163 323450 320358 316221 312194 309014 306633 304971 304090 303520 302273 299948 297243 295173
$$ packed form
57918D39460m494n083m732m447m665m631l917l281l336l545l239k712k510k416
57904C86452j979j449j494k260l259l934m064l806l561l510l315k604j634r99
57890C48584q49r10r99r54l66Q62J942K092J678J619J868J692J144J018J289R83
57874C60693j76j263j567j399j090m19N15R47N57m4m23r49j696j793o73P82J219
57857C53221M83l76m27L28J189J472J173J009J423J779J163j21q23n45k16n75
57841C60157j211j539j720k031k230k134k135k534k941k901k569k279k020j694
57827C30219j419j210r19o57o89p16r2J005J536J032K52l0J9m7j48j46k88o50
57809C27052q78j011j713l092m137m027l180k381j662q81n70j247k325k705k070
$$ plain form
57794 295173 294254 294463 295437 296584 297605 298940 301131 303772 305838 307090 308357 310287 312667 315253 318341
57779 318341 322012 325556 328282 330424 332680 335226 337627 339365 340097 339748 338738 337750 336946 335807 334092
57764 334092 332458 331598 331146 330104 328183 326102 324520 323164 321225 318381 315247 312852 311732 311600 311877
57749 311877 312404 313368 314714 316109 317514 319303 321587 323860 325682 327400 329663 332342 334428 335131 334774
57734 334774 334363 334403 334452 333887 332822 331959 331628 331450 331075 330757 330814 330936 330575 329795 329157 328830 328337 327174 325166
57715 325166 322273 318664 315045 312304 310593 309179 307348 304936 301975 298580 295526 294051 294372 294904 293800
57700 293800 291045 288330 286987 286772 286751 286580 286531 286790 287256 287792 288195 288003 286877 285392 285092 287329 292030
57683 292030 297923 304004 310513 318354 327904 338776 350660 363995 379661 398138 419179 442371
$$ packed form
57794B95173r19K09R74J147J021J335K191K641K066J252J267J930K380K586L088
57779C18341L671L544K726K142K256K546K401J738P32l49j010r88q04j139j715
57764C34092j634q60m52j042j921k081j582j356j939k844l134k395j120j32K77
57749C11877N27R64J346J395J405J789K284K273J822J718K263K679K086P03l57
57734C34774m11M0M9n65j065q63l31j78l75l18N7J22l61p80o38l27m93j163k008
57715C25166k893l609l619k741j711j414j831k412k961l395l054j475L21N32j104
57700B93800k755k715j343k15k1j71m9K59M66N36M03j92j126j485l00K237M701
57683B92030N893O081O509P841R550J0872J1884J3335J5666J8477K1041K3192
$$ plain form
57671 442371 468101 497866 533346 574915 620924 668213 712963 751200 779462 795969 801310 797599
57659 797599 786874 770391 748991 723387 693935 660728 624318 586198 548362 512422 479178
57648 479178 448880 421690 397878 377505 360041 344618 330808 318861 309009 300874 293970 288438
57636 288438 284687 282451 280755 278873 276881 275131 273664 272236 270616 268658 266351 263951 261922 260637
57622 260637 260127 259982 259489 258094 255981 253916 252280 250620 248488 246291 244756 243862 243029 242103 241363 240657
57606 240657 239414 237689 236360 235954 235897 235286 233931 232247 230554 228794 226711 224040 220738 217129 213620
57591 213620 210317 207145 204266 201900 199882 197876 195948 194320 192708 190626 188351 186693 185732 184654
57577 184654 183052 181438 180067 178274 175565 172516 169860 167437 164841 162408 160599 158950 156726 154332
$$ packed form
57671D42371K5730K9765L5480M1569M6009M7289M4750L8237K8262J6507N341l711
57659G97599j0725j6483k1400k5604k9452l3207l6410l8120l7836l5940l3244
57648D79178l0298k7190k3812k0373j7464j5423j3810j1947r852q135o904n532
57636B88438l751k236j696j882j992j750j467j428j620j958k307k400k029j285
57622B60637n10j45m93j395k113k065j636j660k132k197j535q94q33r26p40p06
57606B40657j243j725j329m06n7o11j355j684j693j760k083k671l302l609l509
57591B13620l303l172k879k366k018k006j928j628j612k082k275j658r61j078
57577A84654j602j614j371j793k709l049k656k423k596k433j809j649k224k394
$$ plain form
57563 154332 153011 153136 153733 153788 153219 152409 151525 150636 149984 149774 149946 150332 150803 151257 151740 152590 154122 156082
57545 156082 157781 158823 159420 159947 160560 161388 162684 164461 166230 167490 168399 169565 171109 172303 172360 171383
57529 171383 170184 169329 168821 168680 169218 170426 171656 172466 173355 175036 177225 178902 179616 179732 179453 178515 177053
57512 177053 175876 175507 175646 176016 176946 178567 180161 181002 181387 182069 183034 183524 183020 181545 179246 176363 173484
57495 173484 171164 169247 167140 164736 162615 161273 160587 160049 159168 157635 155485 153117 150957 149183 147916
57480 147916 147438 147761 148216 147951 146807 145319 143985 142930 142191 141746 141302 140510 139512 138774 138301 137453 135767
57463 135767 133620 131855 130957 130755 130743 130524 130063 129620 129432 129551 130027 131039 132602 134270 135463 136005 136088
57446 136088 135806 135062 133952 132862 132150 131997 132598 134113 136268 138306 139583 140124 140431 140850 141331 141777 142346
$$ packed form
57563A54332j321J25N97N5n69q10q84q89o52k10J72L86M71M54M83Q50J532J960
57545A56082J699J042N97N27O13Q28J296J777J769J260R09J166J544J194N7r77
57529A71383j199q55n08j41N38J208J230Q10Q89J681K189J677P14J16k79r38j462
57512A77053j177l69J39L70R30J621J594Q41L85O82R65M90n04j475k299k883k879
57495A73484k320j917k107k404k121j342o86n38q81j533k150k368k160j774j267
57480A47916m78L23M55k65j144j488j334j055p39m45m44p92r98p38m73q48j686
57463A35767k147j765q98k02j2k19m61m43j88J19M76J012J563J668J193N42Q3
57446A36088k82p44j110j090p12j53O01J515K155K038J277N41L07M19M81M46N69
$$ plain form
57429 142346 143230 144212 144777 144836 144985 145723 146563 146530 145472 144275 143595 143074 142215 141393 141306 141879 142458 142879 143560
57410 143560 144554 145271 145287 144878 144556 144528 144802 145347 145927 146156 145951 145657 145561 145613 145891 146950 149268 152442 155298
57391 155298 156895 157282 157233 157374 157683 157835 157849 158216 159300 160862 162378 163652 164868 166098 167116 167695 167834
57374 167834 167578 166870 165763 164599 163855 163794 164359 165259 166089 166462 166177 165297 163995 162398 160694 159382 159095
57357 159095 159917 161058 161649 161873 162772 164698 166559 167115 166565 166100 166217 166436 166600 167308 168710 169889 170131
57340 170131 170042 170655 172005 173370 174470 175499 176261 176246 175558 174960 174887 175094 175378 175938 176752 177264 177093 176646
57322 176646 176590 176971 177284 177290 177370 177996 179090 180034 180280 179831 179171 178855 179199 180134 181166 181672 181587 181711 182918
57303 182918 185131 187520 189649 191812 194206 196560 198913 201967 206075 210502 214394 217983 222086 226739
$$ packed form
57429A42346Q84R82N65N9J49P38Q40l3j058j197o80n21q59q22q7N73N79M21O81
57410A43560R94P17J6m09l22k8K74N45N80K29k05k94r6N2K78J059K318L174K856
57391A55298J597L87m9J41L09J52J4L67J084J562J516J274J216J230J018N79J39
57374A67834k56p08j107j164p44o1N65R00Q30L73k85q80j302j597j704j312k87
57357A59095Q22J141N91K24Q99J926J861N56n50m65J17K19J64P08J402J179K42
57340A70131q9O13J350J365J100J029P62j5o88n98p3K07K84N60Q14N12j71m47
57322A76646n6L81L13OQ0O26J094R44K46m49o60l16L44R35J032N06q5J24J207
57303A82918K213K389K129K163K394K354K353L054M108M427L892L589M103M653
$$ plain form
57289 226739 231161 234929 238473 242382 246841 251770 256978 262119 266921 271497 276128 280836 285502 290203
57275 290203 295053 299937 304829 310111 316056 322187 327752 332796 338201 344702 352296 360506 368740 376484
57261 376484 383658 390785 398385 406343 414271 422261 430721 439588 448343 456755 465102 473721 482833 492688
57247 492688 503328 514312 525239 536437 548561 561619 574955 588084 600976 613697 626481
57236 626481 639982 654745 670466 686422 702534 719300 736901 755241 774753 796216 819716
57225 819716 844718 871236 899976 931160 964198 998759 1035227 1073735 1113604 1154106 1194953
57214 1194953 1235656 1275221 1312889 1348449 1381441 1410965 1436873 1460500 1483662 1507574 1533242
57203 1533242 1562142 1595727 1634638 1678903 1728324 1782034 1838164 1894632 1950075 2003654 2054503
$$ packed form
57289B26739M422L768L544L909M459M929N208N141M802M576M631M708M666M701
57275B90203M850M884M892N282N945O131N565N044N405O501P594Q210Q234P744
57261C76484P174P127P600P958P928P990Q460Q867Q755Q412Q347Q619R112R855
57247D92688J0640J0984J0927J1198J2124J3058J3336J3129J2892J2721J2784
57236F26481J3501J4763J5721J5956J6112J6766J7601J8340J9512K1463K3500
57225H19716K5002K6518K8740L1184L3038L4561L6468L8508L9869M0502M0847
57214A194953M0703L9565L7668L5560L2992K9524K5908K3627K3162K3912K5668
57203A533242K8900L3585L8911M4265M9421N3710N6130N6468N5443N3579N0849
$$ plain form
57192 2054503 2102052 2146721 2189699 2232082 2274468 2317102 2360088 2403591 2448034 2493905 2541385
57181 2541385 2590613 2642322 2697544 2756439 2818057 2881539 2946898 3014142 3082214 3149357 3214154
57170 3214154 3275738 3333400 3386583 3435164 3479456 3520053 3557736 3593142 3626414 3657576 3687263
57159 3687263 3716499 3745602 3773943 3800986 3826921 3852055 3876358 3900022 3923780 3948164 3972907
57148 3972907 3997469 4021692 4045716 4069870 4094956 4121958 4151046 4181319 4211765 4241880 4271246
57137 4271246 4299339 4326111 4351966 4376807 4399893 4421045 4441168 4461162 4481207 4501615 4523544
57126 4523544 4548293 4576626 4609169 4646517 4688347 4733379 4780994 4832188 4888574 4951487 5022671
57115 5022671 5104803 5200654 5312872 5445456 5604529 5796659 6026769 6297348 6607470 6951360
$$ packed form
57192B054503M7549M4669M2978M2383M2386M2634M2986M3503M4443M5871M7480
57181B541385M9228N1709N5222N8895O1618O3482O5359O7244O8072O7143O4797
57170C214154O1584N7662N3183M8581M4292M0597L7683L5406L3272L1162K9687
57159C687263K9236K9103K8341K7043K5935K5134K4303K3664K3758K4384K4743
57148C972907K4562K4223K4024K4154K5086K7002K9088L0273L0446L0115K9366
57137D271246K8093K6772K5855K4841K3086K1152K0123J9994K0045K0408K1929
57126D523544K4749K8333L2543L7348M1830M5032M7615N1194N6386O2913P1184
57115E022671Q2132R5851J12218J32584J59073J92130K30110K70579L10122L43890
$$ plain form
57105 6951360 7319810 7705517 8107700 8532122 8988979 9492110 10058064 10703091 11440765
57096 11440765 12283146 13243217 14335738 15578098 16992447 18605615 20444651 22532147
57088 22532147 24884971 27513424 30418255 33588905 37004631 40635269 44444645 48404613
57080 48404613 52506957 56736148 60993173 65031200 68485606 71002707 72374604 72587042
57072 72587042 71775307 70148426 67927075 65299934 62397083 59289929 56016464 52609830
57064 52609830 49111225 45569294 42036796 38567176 35209414 32003765 28981298 26164619
57056 26164619 23566701 21190081 19029340 17074915 15314996 13736042 12323954 11065253
57048 11065253 9946834 8955292 8077343 7300764 6614473 6008136 5472205 4998157 4578448
$$ packed form
57105F951360L68450L85707M02183M24422M56857N03131N65954O45027P37674
57096A1440765Q42381R60071J092521J242360J414349J613168J839036K087496
57088B2532147K352824K628453K904831L170650L415726L630638L809376L959968
57080D8404613M102344M229191M257025M038027L454406K517101J371897K12438
57072G2587042q11735j626881k221351k627141k902851l107154l273465l406634
57064E2609830l498605l541931l532498l469620l357762l205649l022467k816679
57056B6164619k597918k376620k160741j954425j759919j578954j412088j258701
57048A1065253j118419r91542q77949p76579o86291o06337n35931m74048m19709
$$ plain form
57039 4578448 4206497 3876857 3584984 3326604 3097535 2894128 2713537 2553501 2412213
57030 2412213 2288278 2180400 2087185 2007688 1941933 1890209 1851926 1825579 1809337 1800331 1793215
57019 1793215 1780809 1757496 1722234 1678292 1630417 1582008 1533734 1483800 1429637 1370040 1306038
57008 1306038 1239881 1173570 1108427 1045578 986266 931618 882228 837974 798232 762397 730231
56997 730231 701704 676682 654992 636637 621586 609315 598913 589768 581958 575919 571858 569577
56985 569577 568696 568939 570135 571846 573063 572607 570026 565835 560666 554441 546648 537141 526274 514437
56971 514437 501913 489044 476133 463277 450706 439185 429693 422683 418029 415574 415368 417432 421755
56958 421755 428436 437215 446737 454830 459895 461841 461568 459868 457016 453019 447869 441595 434323 426304
$$ packed form
57039D578448l71951l29640k91873k58380k29069k03407j80591j60036j41288
57030B412213j23935j07878r3215p9497o5755n1724l8283k6347j6242r006p116
57019A793215j2406k3313l5262m3942m7875m8409m8274m9934n4163n9597o4002
57008A306038o6157o6311o5143o2849n9312n4648m9390m4254l9742l5835l2166
56997G30231k8527k5022k1690j8355j5051j2271j0402r145p810o039m061k281
56985E69577q81K43J196J711J217m56k581m191n169o225p793r507j0867j1837
56971E14437j2524j2869j2911j2856j2571j1521r492p010m654k455k06K064M323
56958D21755O681Q779R522Q093N065J946k73j700k852l997n150o274p272q019
$$ plain form
56944 426304 417832 409192 400721 392803 385814 380153 376359 375032 376573 381075 388517 398924 412192 427672
56930 427672 443950 459140 471538 480133 484589 484919 481365 474423 464668 452470 438075 421934 404641
56917 404641 386554 367874 349194 331499 315367 300555 286611 273586 261823 251406 242179 234043
56905 234043 226905 220585 215156 211075 208618 207426 207008 207395 208849 211212 214116 217712 222588 229032 236932
56890 236932 246404 257930 271658 286918 302644 318013 332538 345803 357318 366655 373759 379089
56878 379089 383240 386298 387824 387635 386316 384721 383381 382727 383521 386492 391790 399289 409269 422333 438887
56863 438887 459201 483692 512385 544136 576927 608838 638187 663036 681657 693763 700575 703434
56851 703434 702959 699705 694738 688970 682461 674938 666776 659074 653116 650088 651103 657137 669007 687463
$$ packed form
56944D26304q472q640q471p918o989n661l794j327J541M502P442J0407J3268J5480
56930D27672J6278J5190J2398Q595M456L30l554o942r755j2198j4395j6141j7293
56917D04641j8087j8680j8680j7695j6132j4812j3944j3025j1763j0417r227q136
56905B34043p138o320n429m081k457j192m18L87J454K363K904L596M876O444P900
56890B36932R472J1526J3728J5260J5726J5369J4525J3265J1515R337P104N330
56878C79089M151L058J526j89j319j595j340o54P94K971N298P499R980J3064J6554
56863D38887K0314K4491K8693L1751L2791L1911K9349K4849J8621J2106O812K859
56851G03434m75l254m967n768o509p523q162p702n958l028J015O034J1870J8456
$$ plain form
56837 687463 713002 745485 784269 828642 877341 927217 973046 1009638 1034373 1047713 1051639 1048076
56825 1048076 1038399 1023553 1004124 980422 952643 921156 886857 851444 817167 786135 759879
56814 759879 739492 725828 719380 720275 728571 744225 766348 792615 819689 844148 863073 874396
56802 874396 877471 873361 863951 850515 833241 812027 787226 759483 729321 697318 664558 632538
56790 632538 602600 575661 552501 533966 520683 512714 509726 511441 517558 527110 538109 548079 554931
56777 554931 557412 555171 548815 539742 529314 517865 504598 488541 469466 447934 424755 400627
56765 400627 376176 352100 329151 307931 288699 271399 255946 242359 230568 220244 211043 202895
56753 202895 195870 189844 184568 179990 176220 173171 170524 168011 165531 163023 160533 158338 156712 155522
$$ packed form
56837F87463K5539L2483L8784M4373M8699M9876M5829L6592K4735J3340L926l563
56825A048076r677j4846j9429k3702k7779l1487l4299l5413l4277l1032k6256
56814G59879k0387j3664o448Q95Q296J5654K2123K6267K7074K4459J8925J1323
56802H74396L075m110r410j3436j7274k1214k4801k7743l0162l2003l2760l2020
56790F32538k9938k6939k3160j8535j3283p969k988J715O117R552J0999R970O852
56777E54931K481k241o356r073j0428j1449j3267j6057j9075k1532k3179k4128
56765D00627k4451k4076k2949k1220j9232j7300j5453j3587j1791j0324r201q148
56753B02895p025o026n276m578l770l049k647k513k480k508k490k195j626j190
$$ plain form
56739 155522 154390 153195 152072 150960 149641 148311 147614 147886 148785 149798 150684 151199 151010 150302 149935 150454
56723 150454 151297 151649 151767 152689 154695 156897 158500 159725 161148 162713 163903 164487 164555 164132 163375 163003 163869
56706 163869 165954 168304 170149 171592 172961 174036 174510 174795 175610 176841 177596 177560 177508 178074 178676 178329 177061
56689 177061 175773 174940 174270 173655 173581 174288 175186 175569 175501 175549 175983 176669 177552 178700 179884 180594 180598 180313 180408 181157
56669 181157 182243 183117 183475 183402 183157 182917 182809 183045 183843 185178 186755 188267 189548 190469 190904 190970 191208 192263
56651 192263 194263 196539 198127 198640 198659 199151 200530 202407 204227 205790 207055 207850 208138 208314 208776 209315
56635 209315 209412 209055 208789 208921 209226 209536 210015 210581 210537 209242 206843 203987 201122 198493 196524 195541 195111
56618 195111 194232 192393 190170 188578 188046 188169 188265 187954 187262 186357 185282 183931 182290 180629 179363 178690
$$ packed form
56739A55522j132j195j123j112j319j330o97K72Q99J013Q86N15j89p08l67N19
56723A50454Q43L52J18R22K006K202J603J225J423J565J190N84O8m23p57l72Q66
56706A63869K085K350J845J443J369J075M74K85Q15J231P55l6n2N66O02l47j268
56689A77061j288q33o70o15p4P07Q98L83o8M8M34O86Q83J148J184P10Mk85R5P49
56669A81157J086Q74L58p3k45k40j08K36P98J335J577J512J281R21M35O6K38J055
56651A92263K000K276J588N13J9M92J379J877J820J563J265P95K88J76M62N39
56635B09315R7l57k66J32L05L10M79N66m4j295k399k856k865k629j969r83m30
56618A95111q79j839k223j592n32J23R6l11o92r05j075j351j641j661j266o73
$$ plain form
56602 178690 178476 178537 178877 179515 180195 180497 180322 180086 180298 181069 182120 183063 183455 182835 181209 179507 179039 180237
56584 180237 182255 184117 185878 188233 191280 194199 196129 196872 196727 196106 195563 195839 197453 200193 203173
56569 203173 205540 207247 209117 211978 215697 219360 222523 225935 230692 236937 243823 250545 256879 262788
56555 262788 268139 272900 277134 280563 282530 282693 281511 279855 278276 276752 274945 272587 269829 267230
56541 267230 265212 263451 261105 257842 254377 251830 250635 250242 249753 248709 247299 245929 244680 243255 241405
56526 241405 239240 237071 235212 234033 233845 234428 234982 234982 234822 235211 236084 236637 236319 235299 234028 232812 231788
56509 231788 230818 229472 227621 225930 225161 224993 224247 222380 220069 218165 216817 215909 215624 216032 216636 216814
56493 216814 216461 215781 214835 213620 212342 211238 210311 209497 208900 208711 209070 210066 211558 212980 213764 214002 214232
$$ packed form
56602A78690k14O1L40O38O80L02j75k36K12P71J051R43L92o20j626j702m68J198
56584A80237K018J862J761K355L047K919J930P43j45o21n43K76J614K740K980
56569B03173K367J707J870K861L719L663L163L412M757O245O886O722O334N909
56555B62788N351M761M234L429J967J63j182j656j579j524j807k358k758k599
56541B67230k018j761k346l263l465k547j195l93m89j044j410j370j249j425j850
56526B41405k165k169j859j179j88N83N54%j60L89Q73N53l18j020j271j216j024
56509B31788r70j346j851j691p69j68p46j867k311j904j348r08k85M08O04J78
56493B16814l53o80r46j215j278j104r27q14n97j89L59R96J492J422P84K38K30
$$ plain form
56476 214232 214515 214372 213786 213564 214262 215287 215566 214764 213520 212833 213461 215473 218035 220016 221045 221601 221972
56459 221972 221803 221016 220380 220600 221381 221990 222284 222582 222924 223121 223206 223328 223488 223811 224643 225881 226740 226743 226455
56440 226455 226572 226833 226650 226289 226429 226897 226950 226641 226831 227769 228666 228908 228776 228671 228444 227905 227344 227072 226884
56421 226884 226398 225604 224774 224126 223828 224017 224542 224940 224955 224940 225557 227142 229430 231815 233829 235425 236829
56404 236829 238094 238962 239255 239200 239206 239483 240033 240791 241544 241948 241928 241900 242351 243340 244643 246151 247799 249268 250112
56385 250112 250155 249618 249017 249009 250024 251844 253828 255654 257416 258938 259661 259592 259648 260520 261772 262667 263289 264163
56367 264163 265298 266451 267883 269867 271736 272376 271602 270282 269251 268907 269627 271571 274094 276266 278057
56352 278057 280181 282726 284829 285886 286270 286687 287585 289286 291907 294852 297178 298747 300371 302605 305048
$$ packed form
56476B14232K83j43n86k22O98J025K79q02j244o87O28K012K562J981J029N56L71
56459B21972j69p87o36K20P81O09K94K98L42J97Q5J22J60L23Q32J238Q59Lk88
56440B26455J17K61j83l61J40M68N3l09J90R38Q97K42j32j05k27n39n61k72j88
56421B26884m86p94q30o48k98J89N25L98J5j5O17J585K288K385K014J596J404
56404B36829J265Q68K93n5OK77N50P58P53M04k0k8M51R89J303J508J648J469Q44
56385B50112M3n37o01qJ015J820J984J826J762J522P23o9N6Q72J252Q95O22Q74
56367B64163J135J153J432J984J869O40p74j320j031l44P20J944K523K172J791
56352B78057K124K545K103J057L84M17Q98J701K621K945K326J569J624K234K443
$$ plain form
56337 305048 307087 308617 309782 310733 311973 314250 317636 321237 324219 326659 329101 331782 334677 337783
56323 337783 340943 343845 346534 349567 353184 356687 359060 360036 360267 360569 361261 362156 363050 364167 365980 368473
56307 368473 370947 372915 374844 377468 380664 383744 386682 390158 394438 399073 403815 408930 414422 419814
56293 419814 424968 430317 435938 441294 446287 451752 458380 465882 473777 482255 491588 501272 510588 519644
56279 519644 529256 540051 552169 565486 579622 594100 609042 625408 644073 664921 687306 711038
56267 711038 736425 763608 792487 823317 856976 894608 937066 984424 1035927 1090845 1149667
56256 1149667 1214147 1285910 1365358 1452128 1546092 1647473 1756458 1873214 1997981 2130675
56246 2130675 2270595 2416889 2568904 2725554 2884544 3042802 3197627 3347043 3489101
$$ packed form
56337C05048K039J530J165R51J240K277L386L601K982K440K442K681K895L106
56323C37783L160K902K689L033L617L503K373R76K31L02O92Q95Q94J117J813K493
56307C68473K474J968J929K624L196L080K938L476M280M635M742N115N492N392
56293D19814N154N349N621N356M993N465O628P502P895Q478R333R684R316R056
56279E19644R612J0795J2118J3317J4136J4478J4942J6366J8665K0848K2385K3732
56267G11038K5387K7183K8879L0830L3659L7632M2458M7358N1503N4918N8822
56256A149667O4480P1763P9448Q6770R3964J01381J08985J16756J24767J32694
56246B130675J39920J46294J52015J56650J58990J58258J54825J49416J42058
$$ plain form
56237 3489101 3621230 3740389 3843747 3929237 3995511 4041343 4065282 4066288 4044666 4001861 3939316
56226 3939316 3858143 3760067 3647938 3524799 3392861 3253838 3109817 2963258 2816403 2671102
56216 2671102 2528990 2391399 2259202 2132980 2013150 1899781 1792635 1691673 1597226 1509464
56206 1509464 1428047 1352571 1282980 1219235 1160884 1107302 1058099 1013116 972275 935567 902827
56195 902827 873398 846442 821683 799324 779154 760419 742880 727265 714178 703135 693127
56184 693127 683674 674883 666976 660204 654727 650107 645418 640349 635705 632316 629936 627780 625713 624252
56170 624252 623798 624387 625926 628112 630490 633046 636414 641000 646341 651908 658145 666017 675798 686888
56156 686888 698642 710899 723978 738672 755991 776374 799307 824036 850385 878627 909158
$$ packed form
56237C489101J32129J19159J03358Q5490O6274M5832K3939J006k1622m2805o2545
56226C939316q1173r8076j12129j23139j31938j39023j44021j46559j46855j45301
56216B671102j42112j37591j32197j26222j19830j13369j07146j00962r4447q7762
56206A509464q1417p5476o9591o3745n8351n3582m9203m4983m0841l6708l2740
56195I02827k9429k6956k4759k2359k0170j8735j7539j5615j3087j1043j0008
56184F93127r453q791p907o772n477m620m689n069m644l389k380k156k067j461
56170F24252m54N89J539K186K378K556L368M586N341N567O237P872R781J1090
56156F86888J1754J2257J3079J4694J7319K0383K2933K4729K6349K8242L0531
$$ plain form
56145 909158 942836 981113 1025051 1074460 1128561 1187153 1250546 1318684 1390988 1466698 1544606
56134 1544606 1622684 1698745 1771510 1840591 1905727 1966680 2023638 2076859 2125794 2168977 2204884
56123 2204884 2232659 2252271 2264439 2270247 2270375 2264641 2252429 2233153 2205957 2169514 2122912 2066825
56111 2066825 2003489 1935615 1865480 1794643 1723995 1654097 1585667 1519584 1456432 1396540 1340583
56100 1340583 1289622 1244311 1204563 1170170 1141026 1116542 1095654 1077881 1063577 1052738 1044416
56089 1044416 1037816 1033053 1030180 1028454 1027444 1027934 1030667 1034903 1039287 1043591 1048589 1054724 1061901 1070163
56075 1070163 1079512 1089378 1099202 1109307 1120407 1132589 1145493 1159050 1173277 1187805 1202434 1217707
56063 1217707 1234150 1251382 1268701 1286034 1303507 1320722 1337328 1353789 1370713 1387880 1404645
$$ packed form
56145I09158L3678L8277M3938M9409N4101N8592O3393O8138P2304P5710P7908
56134A544606P8078P6061P2765O9081O5136O0953N6958N3221M8935M3183L5907
56123B204884K7775J9612J2168N808J28n734j2212j9276k7196l6443m6602n6087
56111B066825o3336o7874p0135p0837p0648o9898o8430o6083o3152n9892n5957
56100A340583n0961m5311l9748l4393k9144k4484k0888j7773j4304j0839q322
56089A044416o600m763k873j726j010M90K733M236M384M304M998O135P177Q262
56075A070163R349R866R824J0105J1100J2182J2904J3557J4227J4528J4629J5273
56063A217707J6443J7232J7319J7333J7473J7215J6606J6461J6924J7167J6765
$$ plain form
56052 1404645 1420773 1436216 1450801 1464861 1479341 1494557 1509810 1524987 1541279 1559263 1577631
56041 1577631 1595240 1613194 1633211 1654935 1676683 1698039 1719929 1742903 1767231 1794087 1824686
56030 1824686 1858581 1894475 1932370 1973274 2017282 2063656 2112380 2163971 2218101 2273996 2331730
56019 2331730 2391626 2453087 2515682 2580560 2648929 2719981 2792410 2867202 2946549 3030608 3117701
56008 3117701 3207260 3300153 3396549 3496074 3599983 3710660 3828888 3953725 4084853 4222815
55998 4222815 4367314 4517826 4675769 4843748 5022836 5212883 5415004 5631226 5862180
55989 5862180 6107927 6370629 6653644 6958497 7285748 7638286 8020678 8436014 8886927
55980 8886927 9379155 9920502 10516967 11174075 11901826 12714546 13626751 14653849 15816657
$$ packed form
56052A404645J6128J5443J4585J4060J4480J5216J5253J5177J6292J7984J8368
56041A577631J7609J7954K0017K1724K1748K1356K1890K2974K4328K6856L0599
56030A824686L3895L5894L7895M0904M4008M6374M8724N1591N4130N5895N7734
56019B331730N9896O1461O2595O4878O8369P1052P2429P4792P9347Q4059Q7093
56008C117701Q9559R2893R6396R9525J03909J10677J18228J24837J31128J37962
55998D222815J44499J50512J57943J67979J79088J90047K02121K16222K30954
55989E862180K45747K62702K83015L04853L27251L52538L82392M15336M50913
55980H886927M92228N41347N96465O57108P27751Q12720R12205J027098J162808
$$ plain form
55971 15816657 17141033 18654506 20389192 22387889 24702428 27388207 30507653 34135575
55963 34135575 38345606 43180290 48633416 54659207 61195506 68190955 75639239 83610353
55955 83610353 92257949 101808482 112556850 124856164 139057488 155403267 173933841
55948 173933841 194415309 216217399 238149839 258458839 275190252 286822762 292771467
55941 292771467 293424427 289743922 282752472 273201402 261510592 247896413 232551707 215772422
55933 215772422 197994202 179761725 161664492 144253640 127957099 113031901 99578806
55926 99578806 87594908 77018288 67749874 59668252 52645463 46556046 41278942 36701801
55918 36701801 32727559 29274386 26270076 23650576 21362643 19362209 17609131 16066803
$$ packed form
55971A5816657J324376J513473J734686J998697K314539K685779L119446L627922
55963C4135575M210031M834684N453126O025791O536299O995449P448284P971114
55955H3610353Q647596R550533J0748368J2299314J4201324J6345779J8530574
55948A73933841K0481468K1802090K1932440K0309000J6731413J1632510N948705
55941B92771467O52960l680505o991450r551070j1690810j3614179j5344706j6779285
55933B15772422j7778220j8232477j8097233j7410852j6296541j4925198j3453095
55926I9578806j1983898j0576620r268414q081622p022789o089417n277104m577141
55918C6701801l974242l453173l004310k619500k287933k000434j753078j542328
$$ plain form
55910 16066803 14705834 13503256 12437560 11488098 10639012 9879381 9198794 8586060 8032271
55901 8032271 7531336 7076779 6661201 6279509 5929651 5609427 5315165 5043942 4794368
55892 4794368 4564489 4351318 4152958 3969006 3798521 3639830 3492579 3357525 3233742
55883 3233742 3118254 3009034 2906454 2811304 2723238 2641512 2565294 2492796 2421928 2352298 2284920
55872 2284920 2219713 2155169 2090868 2028433 1969285 1912988 1858475 1805491 1754318 1705300 1659071
55861 1659071 1616154 1576038 1537619 1500595 1465358 1431739 1399037 1366997 1335358 1302891 1268620
55850 1268620 1233810 1200877 1170343 1140650 1110973 1082206 1054948 1028534 1002586 977701 954009
55839 954009 930706 907581 885398 864223 843002 821519 801218 783337 767583 753299 740424
$$ packed form
55910A6066803j360969j202578j065696r49462q49086p59631o80587o12734n53789
55901H032271n00935m54557m15578l81692l49858l20224k94262k71223k49574
55892D794368k29879k13171j98360j83952j70485j58691j47251j35054j23783
55883C233742j15488j09220j02580r5150q8066q1726p6218p2498p0868o9630o7378
55872B284920o5207o4544o4301o2435n9148n6297n4513n2984n1173m9018m6229
55861A659071m2917m0116l8419l7024l5237l3619l2702l2040l1639l2467l4271
55850A268620l4810l2933l0534k9693k9677k8767k7258k6414k5948k4885k3692
55839I54009k3303k3125k2183k1175k1221k1483k0301j7881j5754j4284j2875
$$ plain form
55828 740424 728563 716563 704067 692304 682363 673645 664847 655570 646202 637046 628220 619682 610931
55815 610931 601537 592252 584515 578489 572827 566816 561426 557550 554546 551431 548399 546217 545064 544870
55801 544870 545897 548043 550303 551787 552638 553266 553494 553070 552120 550328 546680 541018 534970 530172 526264
55786 526264 521803 516570 511701 507762 503967 499340 493702 487413 480912 474743 469500 465534 462829 461110
55772 461110 459946 459071 458810 459806 462014 464365 465706 465694 464499 462142 458577 454016 448664 442418 435211
55757 435211 427339 419092 410372 401045 391424 382055 373224 364869 356760 348610 340371 332496 325524 319359
55743 319359 313481 307883 303119 299276 295754 292367 289794 288345 287043 284702 281363 277996 275147 272599
55729 272599 270079 267595 265206 262921 260763 258643 256413 254260 252657 251596 250317 248259 245867 243957
$$ packed form
55828G40424j1861j2000j2496j1763r941q718q798r277r368r156q826q538q751
55815F10931r394r285p737o026n662o011n390l876l004l115l032k182j153j94
55801E44870J027K146K260J484Q51O28K28m24r50j792l648n662o048m798l908
55786E26264m461n233m869l939l795m627n638o289o501o169n243l966k705j719
55772D61110j164q75k61R96K208K351J341j2j195k357l565m561n352o246p207
55757D35211p872q247q720r327r621r369q831q355q109q150q239p875o972o165
55743C19359n878n598m764l843l522l387k573j449j302k341l339l367k849k548
55729B72599k520k484k389k285k158k120k230k153j603j061j279k058k392j910
$$ plain form
55715 243957 242618 241318 239864 238710 238358 238908 240107 241611 243200 244886 246656 248133 248821 248773 248505 248111
55699 248111 246993 244731 241708 238529 235347 232174 229283 226795 224278 221343 218334 215933 214353 213359
55685 213359 212828 212820 213311 214283 215892 218203 221014 224166 227716 231481 234903 237754 240520 243538 246163 247474
55669 247474 247521 247193 247008 246721 246159 245782 246210 247518 249168 250496 251234 251654 252159 252730 253010 252916 252740 252543
55651 252543 251978 250943 249863 248934 247686 245771 243658 241848 239895 236955 233022 228779 224434 219540 214016
55636 214016 208514 203591 199170 195036 191265 187895 184579 180974 177228 173864 171294 169544 168270 166943
55622 166943 165222 163202 161254 159664 158565 158099 158367 159182 160061 160501 160200 159091 157352 155329 153303 151373
55606 151373 149613 148142 146864 145317 143073 140279 137608 135665 134562 134013 133679 133451 133460 133910 134869 136224
$$ packed form
55715B43957j339j300j454j154l52N50J199J504J589J686J770J477O88m8k68l94
55699B48111j118k262l023l179l182l173k891k488k517k935l009k401j580r94
55685B13359n31qM91R72J609K311K811L152L550L765L422K851K766L018K625J311
55669B47474M7l28j85k87n62l77M28J308J650J328P38M20N05N71K80r4j76j97
55651B52543n65j035j080r29j248j915k113j810j953k940l933m243m345m894n524
55636B14016n502m923m421m134l771l370l316l605l746l364k570j750j274j327
55622A66943j721k020j948j590j099m66K68Q15Q79M40l01j109j739k023k026j930
55606A51373j760j471j278j547k244k794k671j943j103n49l34k28RM50R59J355
$$ plain form
55590 136224 137685 138795 139186 139072 139271 140353 141925 143193 144072 145203 146883 148655 150125 151545 153353
55575 153353 155632 158310 161401 164799 168290 172000 176354 181347 186372 191007 195434 199772 203598 206459
55561 206459 208259 208807 207712 205211 202376 199848 196974 192903 187913 182957 178462 174435 171225 169161
55547 169161 167727 166041 163971 162015 160298 158570 156986 155915 155058 153690 151831 150340 149790 150052 151007
55532 151007 152770 154955 156572 157054 156745 156110 155058 153374 151281 149191 147226 145256 143086 140458 137238
55517 137238 133733 130479 127629 124861 121974 119176 116793 115029 114028 113657 113282 112302 111019 110417 110859
55502 110859 111544 111490 110609 109516 108645 107932 107101 105991 104696 103621 103263 103824 105018 106248 106929 106864 106515
55485 106515 106726 107876 109426 110598 111272 111896 112734 113618 114242 114286 113473 112009 110705 110077 109562 108295 106495
$$ packed form
55590A36224J461J110L91j14J99J082J572J268Q79J131J680J772J470J420J808
55575A53353K279K678L091L398L491L710M354M993N025M635M427M338L826K861
55561B06459J800N48j095k501k835k528k874m071m990m956m495m027l210k064
55547A69161j434j686k070j956j717j728j584j071q57j368j859j491n50K62R55
55532A51007J763K185J617M82l09o35j052j684k093k090j965j970k170k628l220
55517A37238l505l254k850k768k887k798k383j764j001l71l75r80j283o02M42
55502A10859O85n4q81j093q71p13q31j110j295j075l58N61J194J230O81o5l49
55485A06515K11J150J550J172O74O24Q38Q84O24M4q13j464j304o28n15j267j800
$$ plain form
55468 106495 105279 105152 105523 105764 105984 106487 107161 107619 107486 106445 104612 102870 102203 102549 102949 102825 102353
55451 102353 101550 100055 98104 96757 96649 97328 98305 99849 102018 103720 103740 102318 100878 100411 100730 101123
55435 101123 101094 100641 100277 100605 101559 102277 102097 101312 100649 100438 100714 101611 102995 104111 104323 103955 103771 103868 103759
55416 103759 103370 103218 103625 104411 105400 106617 107880 108781 109247 109631 110063 110099 109285 107795 106309 105400 105152 105212
55398 105212 105123 104639 103764 102582 101223 100026 99352 99064 98544 97547 96693 96658 97190 97466 97235 96964 96888 96660 96092
55379 96092 95611 95612 95872 96047 96374 97236 98216 98206 96659 94297 92321 91245 90896 91232 92454 94188 95214 94593
55361 94593 92790 91164 90468 90383 90395 90497 90888 91506 92154 92693 92912 92588 91857 91232 91114 91674 93169 95721
55343 95721 98521 100031 99547 98066 97027 96705 96487 96183 96132 96255 96001 95304 94757 94633 94474 93924 93352 93297
$$ packed form
55468A06495j216j27L71K41K20N03O74M58j33j041j833j742o67L46M00j24m72
55451A02353q03j495j951j347j08O79R77J544K169J702K0j422j440m67L19L93
55435A01123k9m53l64L28R54P18j80p85o63k11K76Q97J384J116K12l68j84R7j09
55416A03759l89j52M07P86R89J217J263R01M66L84M32L6q14j490j486r09k48O0
55398A05212q9m84q75j182j359j197o74k88n20r97q54l5N32K76k31k71p6k28n68
55379I6092m81JK60J75L27Q62R80j0j547k362j976j076l49L36J222J734J026o21
55361I4593j803j626o96q5J2J02L91O18O48N39K19l24p31o25j18N60J495K552
55343I5721K800J510m84j481j039l22k18l04n1J23k54o97n47j24j59n50n72n5
$$ plain form
55325 93297 93779 94519 95460 96706 98165 99615 100980 102345 103712 104833 105218 104418 102555 100542 99422 99408
55309 99408 99854 100190 100457 100803 100985 100754 100371 100293 100500 100620 100610 100850 101503 102223 102694 103056 103570 104183 104827 105852
55289 105852 107617 109646 110835 110719 110023 109605 109311 108408 106864 105439 104611 104070 103416 102710 102125 101591 101135
55272 101135 101058 101403 101656 101430 101118 101405 102361 103500 104500 105390 106125 106400 106007 105116 104216 103894 104425 105406
55254 105406 106042 106028 105823 105763 105397 104261 102966 102728 103888 105618 107108 108345 109558 110521 110810 110307 109178
55237 109178 107692 106309 105591 105692 106139 106351 106165 105658 104763 103432 102003 101050 100819 100969 100973 100642 100242 100145
55219 100145 100437 100875 101186 101324 101443 101712 102215 102910 103585 103998 104143 104216 104265 104062 103447 102521 101416 100246 99487
55200 99487 99931 101718 103772 104794 104643 104172 103931 103784 103709 104029 104601 104594 103592 102360 101958 102443 103013 103143
$$ packed form
55325I3297M82P40R41J246J459J450J365J365J367J121L85q00j863k013j120j4
55309I9408M46L36K67L46J82k31l83p8K07J20j0K40O53P20M71L62N14O13O44J025
55289A05852J765K029J189j16o96m18k94r03j544j425q28n41o54p06n85n34m56
55272A01135p7L45K53k26l12K87R56J139J000Q90P35K75l93q91r00l22N31R81
55254A05406O36j4k05o0l66j136j295k38J160J730J490J237J213R63K89n03j129
55237A09178j486j383p18J01M47K12j86n07q95j331j429r53k31J50Ml31m00r7
55219A00145K92M38L11J38J19K69N03O95O75M13J45P3M9k03o15r26j105j170p59
55200I9487M44J787K054J022j51m71k41j47p5L20N72pj002j232m02M85N70J30
$$ plain form
55182 103143 103077 103227 103582 103788 103559 102912 102126 101537 101348 101615 102312 103270 104168 104806 105379 106206 107246 108147 108742
55163 108742 109128 109258 108923 108270 107867 107987 108219 108066 107575 107086 106723 106496 106581 107012 107306 106915 106023 105437 105646
55144 105646 106352 106917 106956 106404 105367 104150 103255 103122 103875 105335 107160 108866 109830 109571 108220 106597 105587
55127 105587 105323 105169 104622 103980 103867 104318 104796 105079 105597 106719 108088 108989 109094 108602 107864 107141 106584 106198
55109 106198 105906 105801 106109 106743 107147 106972 106714 107297 108999 111145 112853 113809 114183 114143 113727 113177 113061 113859
55091 113859 115404 116932 117870 118430 119156 120025 120470 120402 120620 121777 123277 123836 123075 122039 121991 123132 124661
55074 124661 125785 126312 126481 126568 126712 126874 126757 125883 124049 121888 120760 121689 124249 126765 127854 127617 127161
55057 127161 127126 127084 126341 124885 123315 122067 121083 120187 119470 119146 119222 119544 120057 120727 121210 120973 119994 119039 118862
$$ packed form
55182A03143o6J50L55K06k29o47p86n89j89K67O97R58Q98O38N73Q27J040R01N95
55163A08742L86J30l35o53m03J20K32j53m91m89l63k27Q5M31K94l91q92n86K09
55144A05646P06N65L9n52j037j217q95j33P53J460J825J706R64k59j351j623j010
55127A05587k64j54n47o42j13M51M78K83N18J122J369R01J05m92p38p23n57l86
55109A06198k92j05L08O34M04j75k58N83J702K146J708R56L74m0m16n50j16P98
55091A13859J545J528R38N60P26Q69M45o8K18J157J500N59p61j036m8J141J529
55074A24661J124N27J69Q7J44J62j17q74j834k161j128R29K560K516J089k37m56
55057A27161l5m2p43j456j570j248r84q96p17l24P6L22N13O70M83k37r79r55j77
$$ plain form
55038 118862 119265 119353 118681 117677 116899 116343 115732 115057 114473 113908 113155 112313 111805 111969 112724 113624 114152 114165 114123
55019 114123 114673 115876 117080 117734 118043 118559 119376 120098 120420 120349 119957 119315 118655 118291 118314 118612 119132 119873 120670
55000 120670 121329 121973 122913 124088 124950 125049 124522 123878 123469 123328 123367 123635 124370 125763 127584 129120 129726 129413
54982 129413 128731 128102 127530 127020 126893 127452 128485 129385 129778 129860 130030 130304 130292 129776 129093 128695 128480 127958 127133
54963 127133 126719 127219 128254 129218 130209 131665 133291 134111 133689 132662 131865 131486 131312 131336 131678 132275 132978 133742
54945 133742 134382 134436 133655 132489 131712 131666 132142 132828 133568 134261 134883 135663 136943 138791 140903 142912 144655
54928 144655 146198 147767 149690 152245 155491 159271 163330 167408 171436 175733 180795 186601 192323 196989
54914 196989 200367 202898 204870 206036 206106 205163 203417 200885 197583 193843 190107 186439 182523 178192 173831
$$ packed form
55038A18862M03Q8o72j004p78n56o11o75n84n65p53q42n08J64P55R00N28J3m2
55019A14123N50J203J204O54L09N16Q17P22L22p1l92o42o60l64K3K98N20P41P97
55000A20670O59O44R40J175Q62R9n27o44m09j41L9K68P35J393J821J536O06l13
54982A29413o82o29n72n10j27N59J033R00L93Q2J70K74j2n16o83l98k15n22q25
54963A27133m14N00J035R64R91J456J626Q20m22j027p97l79j74K4L42N97P03P64
54945A33742O40N4p81j166p77m6M76O86P40O93O22P80J280J848K112K009J743
54928A44655J543J569J923K555L246L780M059M078M028M297N062N806N722M666
54914A96989L378K531J972J166P0r43j746k532l302l740l736l668l916m331m361
$$ plain form
54899 173831 170108 167333 165100 162635 159535 156162 153337 151702 151384 152086 153247 154258 154796 155042 155396
54884 155396 155992 156735 157816 159807 163027 167111 171484 176057 181117 186663 192254 197455 202082 206005 209089
54869 209089 211402 213140 214193 214084 212568 209955 206647 202599 197667 192290 187354 183307 179728 175943
54855 175943 171804 167717 164079 160887 157794 154392 150507 146435 142847 140318 138839 137844 136756 135463
54841 135463 134211 133106 131897 130318 128504 126866 125559 124343 123099 122300 122670 124320 126424 127888 128282
54826 128282 128022 127732 127591 127428 127345 127926 129551 131608 132792 132397 131072 130028 129698 129481 128685 127300 125866
54809 125866 124918 124663 124902 125149 125119 125202 126143 128061 130055 131054 130892 130309 130028 130139 130339 130518 130913 131766 132881
54790 132881 133692 133900 133915 134364 135228 135866 136070 136587 138252 140937 143790 146248 148327 150112 151546 152782
$$ packed form
54899A73831l723k775k233k465l100l373k825j635l18P02J161J011N38K46L54
54884A55396N96P43J081J991L220M084M373M573N060N546N591N201M627L923L084
54869B09089K313J738J053j09j516k613l308m048m932n377m936m047l579l785
54855A75943m139m087l638l192l093l402l885m072l588k529j479r95j088j293
54841A35463j252j105j209j579j814j638j307j216j244p99L70J650K104J464L94
54826A28282k60k90j41j63q3N81J625K057J184l95j325j044l30k17p96j385j434
54809A25866r48k55K39K47l0Q3R41J918J994R99j62n83k81J11K00J79L95Q53J115
54790A32881Q11K08J5M49Q64O38K04N17J665K685K853K458K079J785J434J236
$$ plain form
54774 152782 154215 155983 157823 159605 161693 164589 168424 172934 177778 182794 188088 193897 200124 206036
54760 206036 210768 214172 216786 218898 220101 220034 219089 217898 216412 214039 210536 206305 201808 197208 192667
54745 192667 188515 184858 181341 177533 173413 169314 165621 162768 161294 161507 163029 164851 165985 166060 165460
54730 165460 165003 165386 166676 168291 169614 170656 172034 174367 177819 182131 186794 191238 195180 198849 202595
54715 202595 206197 208944 210566 211609 212485 212579 210902 207384 202910 198139 193070 187856 183191 179456 176052
54700 176052 172205 168051 164419 161760 159843 158336 157124 156021 154649 152762 150417 147850 145375 143401
54686 143401 142188 141548 141006 140235 139184 137915 136647 135822 135646 135614 134986 133843 133182 133692 134808 135308 134576
54669 134576 133024 131468 130484 130229 130522 130918 130841 129860 127942 125524 123275 121677 120868 120921 122027 124113 126494
$$ packed form
54774A52782J433J768J840J782K088K896L835M510M844N016N294N809O227N912
54760B06036M732L404K614K112J203o7r45j191j486k373l503m231m497m600m541
54745A92667m152l657l517l808m120m099l693k853j474K13J522J822J134P5o00
54730A65460m57L83J290J615J323J042J378K333L452M312M663M444L942L669L746
54715B02595L602K747J622J043Q76R4j677l518m474m771n069n214m665l735l404
54700A76052l847m154l632k659j917j507j212j103j372j887k345k567k475j974
54686A43401j213o40n42p71j051j269j268q25j76l2o28j143o61N10J116N00p32
54669A34576j552j556r84k55K93L96p7r81j918k418k249j598q09N3J106K086K381
$$ plain form
54652 126494 128357 129620 130797 131938 132246 131126 129213 127885 127916 128990 130334 131341 131635 131078 130004
54637 130004 129147 129093 129840 130991 132242 133514 134697 135506 135702 135360 134793 134232 133762 133558 133898 134691 135244 134884
54619 134884 133834 133157 133669 135144 136663 137518 137671 137565 137626 137818 137607 136510 134722 132962 131654 130617
54603 130617 129656 129112 129476 130759 132571 134581 136533 137996 138614 138656 138888 139689 140563 140709 139963 138956 138337
54586 138337 137994 137285 136046 135071 135239 136312 137120 137012 136618 136851 137680 138394 138729 139086 139734 140373 140640 140568
54568 140568 140434 140438 140681 141185 141756 142033 141774 141014 140029 139304 139420 140599 142334 143742 144386 144488 144362 143980
54550 143980 143174 141993 140696 139641 139269 139888 141307 142941 144451 146065 148057 150133 151621 152203 152227 152358
54534 152358 153021 154073 154902 154963 154379 153882 153993 154383 154226 153131 151504 150017 148954 148124 147247 146270 145374
$$ packed form
54652A26494J863J263J177J141L08j120j913j328L1J074J344J007K94n57j074
54637A30004q57n4P47J151J251J272J183Q09J96l42n67n61m70k04L40P93N53l60
54619A34884j050o77N12J475J519Q55J53j06O1J92k11j097j788j760j308j037
54603A30617r61n44L64J283J812K010J952J463O18M2K32Q01Q74J46p46j007o19
54586A38337l43p09j239r75J68J073Q08j08l94K33Q29P14L35L57O48O39K67p2
54568A40568j34MK43N04N71K77k59p60r85p25J16J179J735J408O44J02j26l82
54550A43980q06j181j297j055l72O19J419J634J510J614J992K076J488N82K4J31
54534A52358O63J052Q29O1n84m97J11L90j57j095j627j487j063q30q77r77q96
$$ plain form
54517 145374 144839 144904 145641 146817 147895 148343 148037 147322 146674 146394 146595 147185 147725 147624 146803 145941 145676 145718 145272
54498 145272 144264 143534 143638 144060 143953 143216 142419 141988 141993 142507 143616 145028 146097 146368 145914 145161 144578 144490
54480 144490 144900 145473 145886 146151 146415 146591 146515 146418 146823 147900 149232 150377 151359 152477 153872 155461 157077
54463 157077 158499 159502 160052 160323 160386 160055 159162 157847 156372 154838 153323 152152 151727 152078 152834 153609 154180
54446 154180 154326 153900 153169 152782 153083 153612 153588 152845 152025 151799 152123 152406 152280 151971 151927 152256 152668 152926 153161
54427 153161 153595 154055 154042 153404 152735 152767 153442 153943 153796 153619 154429 156379 158539 159898 160198 159729 158767 157539
54409 157539 156472 156033 156325 157051 157827 158367 158510 158462 158932 160597 163236 165719 167124 167623 168051 168885 169971
54392 169971 171054 172087 173019 173669 173991 174183 174429 174687 174813 174692 174152 172992 171249 169294 167577 166383
$$ packed form
54517A45374n35O5P37J176J078M48l06p15o48k80K01N90N40j01q21q62k65M2m46
54498A45272j008p30J04M22j07p37p97m31NN14J109J412J069K71m54p53n83q8
54480A44490M10N73M13K65K64J76p6r7M05J077J332J145R82J118J395J589J616
54463A57077J422J003N50K71O3l31q93j315j475j534j515j171m25L51P56P75N71
54446A54180J46m26p31l87L01N29k4p43q20k26L24K83j26l09m4L29M12K58K35
54427A53161M34M60j3o38o69L2O75N01j47j77Q10J950K160J359L00m69r62j228
54409A57539j067m39K92P26P76N40J43m8M70J665K639K483J405M99M28Q34J086
54392A69971J083J033R32O50L22J92K46K58J26j21n40j160j743j955j717j194
$$ plain form
54376 166383 165869 166008 166405 166463 166017 165538 165447 165546 165489 165542 166282 167700 169235 170742 172725 175323 177704 179049
54358 179049 179785 181243 184106 187665 190675 192648 194192 196278 199274 202596 205264 206814 207644 208501 209801
54343 209801 211452 213009 213837 213439 211989 210422 209490 208803 207189 204124 200412 197313 195283 193809 192254
54328 192254 190504 188822 187372 186039 184640 183143 181621 180135 178848 178194 178585 179721 180448 179591 176895
54313 176895 173039 168975 165594 163695 163632 164798 165950 166299 165973 165350 164435 163231 162278 162283 163289 164633 165665
54296 165665 166169 166096 165298 163738 161745 159892 158671 158349 159025 160631 162838 165038 166660 167585 168187 168797
54280 168797 169240 169121 168470 167761 167296 166991 166898 167418 168644 169917 170623 171144 172392 174435 176220 176794 176250
54263 176250 175307 174504 174119 174391 175278 176213 176618 176605 176773 177368 178039 178445 178720 179182 179876 180586 181132 181499 181775
$$ packed form
54376A66383n14J39L97N8m46m79r1R9n7N3P40J418J535J507J983K598K381J345
54358A79049P36J458K863L559L010J973J544K086K996L322K668J550Q30Q57J300
54343B09801J651J557Q28l98j450j567r32o87j614l065l712l099k030j474j555
54328A92254j750j682j450j333j399j497j522j486j287o54L91J136P27q57k696
54313A76895l856m064l381j899o3J166J152L49l26o23r15j204r53NJ006J344J032
54296A65665N04p3p98j560j993j853j221l22O76J606K207K200J622R25O02O10
54280A68797M43j19o51p09m65l05r3N20J226J273P06N21J248K043J785N74n44
54263A76250r43q03l85K72Q87R35M05j3J68N95O71M06K75M62O94P10N46L67K76
$$ plain form
54244 181775 182106 182541 182812 182418 181142 179349 177574 175893 173985 171826 170015 169240 169553 170336 170923 171137
54228 171137 171313 171887 172955 174150 174931 175026 174556 173781 172919 172174 171705 171410 170989 170411 170088 170292 170650 170655 170493
54209 170493 170806 171606 172082 171662 170689 169740 168851 167961 167545 168029 168818 168786 167810 167042 167382 168367 168974 168983 168956 169181
54189 169181 169273 168793 167801 166677 165748 165243 165355 166120 167282 168359 168917 168878 168644 168785 169513 170488 171287 171912
54171 171912 172681 173695 174668 175267 175380 175043 174314 173337 172370 171626 171179 170994 170944 170819 170489 170117 170006 170200 170444
54152 170444 170567 170654 170740 170672 170481 170609 171400 172521 173216 173054 172154 170827 169372 168216 167799 168203 169148 170383
54134 170383 171788 173057 173720 173691 173495 173690 174221 174532 174150 173091 171919 171526 172525 174618 176796 178353 179481
54117 179481 180681 181979 183073 183933 184789 185667 186359 186786 187044 187251 187677 188786 190646 192456 193266 193095 192744
$$ packed form
54244A81775L31M35K71l94j276j793j775j681j908k159j811p75L13P83N87K14
54228A71137J76N74J068J195P81R5m70p75q62p45m69k95m21n78l23K04L58Nj62
54209A70493L13Q00M76m20r73r49q89q90m16M84P89l2r76p68L40R85O07Rk7K25
54189A69181R2m80r92j124r29n05J12P65J162J077N58l9k34J41P28R75P99O25
54171A71912P69J014R73N99J13l37p29r77r67p44m47j85n0j25l30l72j11J94K44
54152A70444J23Q7Q6o8j91J28P91J121O95j62r00j327j455j156m17M04R45J235
54134A70383J405J269O63k9j96J95N31L11l82j059j172l93R99K093K178J557J128
54117A79481J200J298J094Q60Q56Q78O92M27K58K07M26J109J860J810Q10j71l51
$$ plain form
54100 192744 192590 192276 191698 191431 191795 192201 191981 191345 190947 190849 190553 189814 188867 187992 187360 187165 187458 187919 188258
54081 188258 188766 190025 192127 194662 197432 200609 204115 207366 209922 211965 213955 216208 219083 223154
54067 223154 228658 234902 240668 245191 248502 250890 252380 252845 252313 250973 249078 247035 245412 244513 243847
54052 243847 242352 239487 236065 233707 233367 234552 236083 237399 238859 240937 243534 246241 249027 252379
54038 252379 256747 262092 268020 274190 280409 286410 291877 296808 301671 306958 312690 318550 324412 330424
54024 330424 336582 342502 347704 351926 355118 357349 358796 359615 359834 359518 359017 358603 357863 355914 352474 348323
54008 348323 344429 340961 337471 333682 329654 325423 320932 316202 311241 305980 300600 295678 291594 288043
53994 288043 284587 281516 279561 278880 278855 278869 278772 278571 278221 277823 277536 277216 276536 275483 274279 272790 270598
$$ packed form
54100A92744j54l14n78k67L64M06k20o36l98r8k96p39r47q75o32j95K93M61L39
54081A88258N08J259K102K535K770L177L506L251K556K043J990K253K875M071
54067B23154N504O244N766M523L311K388J490M65n32j340j895k043j623q99o66
54052B43847j495k865l422k358l40J185J531J316J460K078K597K707K786L352
54038B52379M368N345N928O170O219O001N467M931M863N287N732N860N862O012
54024C30424O158N920N202M222L192K231J447Q19K19l16n01m14p40j949l440m151
54008C48323l894l468l490l789m028m231m491m730m961n261n380m922m084l551
53994B88043l456l071j955o81k5J4r7k01l50l98k87l20o80j053j204j489k192
$$ plain form
53977 270598 267757 264882 262343 259893 257344 254990 253037 251132 248891 246488 244322 242456 240815 239622
53963 239622 239254 239845 241314 243503 246030 248276 249901 251130 252303 253473 254682 256200 258070 259812 261083
53948 261083 262334 264295 267112 270459 274219 278388 282574 286293 289777 293854 299023 305089 311643 318246
53934 318246 324222 329055 333230 338013 344056 350710 356987 362704 368390 374575 381609 389762 398883 408199
53920 408199 417029 425741 435514 447096 460103 473580 486913 499923 512285 523251 532120 538901
53908 538901 544278 548840 552465 554565 554800 553375 550769 547410 543630 539619 535334 530546 525034 518707
53894 518707 511665 504249 496828 489261 480793 470905 460177 449802 440241 430900 421224 411480 402168 393335
53880 393335 385023 377852 372338 367836 362982 357286 351544 346434 341383 335387 328529 322006 316633 311879
$$ packed form
53977B70598k841k875k539k450k549k354j953j905k241k403k166j866j641j193
53963B39622l68N91J469K189K527K246J625J229J173J170J209J518J870J742J271
53948B61083J251J961K817L347L760M169M186L719L484M077N169O066O554O603
53934C18246N976M833M175M783O043O654O277N717N686O185P034Q153R121R316
53920D08199Q830Q712R773J1582J3007J3477J3333J3010J2362J0966Q869O781
53908E38901N377M562L625K100K35j425k606l359l780m011m285m788n512o327
53894E18707p042p416p421p567q468r888j0728j0375r561r341r676r744r312q833
53880C93335q312p171n514m502m854n696n742n110n051n996o858o523n373m754
$$ plain form
53866 311879 306612 300434 294005 288211 283405 279403 275867 272487 269033 265498 262153 259254 256763 254544
53852 254544 252714 251467 250627 249779 248911 248485 248596 248484 247351 245415 243633 242450 241420 240167 239137 238947
53836 238947 239325 239274 238302 237023 236391 236651 237295 237800 238072 238252 238511 239108 240223 241485 242021 241466 240802 241603
53818 241603 244260 247364 249124 249130 248520 248700 250327 253302 257131 261104 264566 267451 270447 274364 279289
53803 279289 284516 289332 293751 298406 303842 309990 316276 322130 327334 331989 336284 340374 344405 348552
53789 348552 352848 356894 359918 361398 361741 362103 363316 365113 366509 366759 365689 363363 359986 356156 352626
53774 352626 349525 346164 341930 337025 331982 326809 321167 315249 309833 305360 301395 297262 292895 288794
53760 288794 285341 282400 279504 276301 272837 269467 266480 263808 261201 258566 255925 253137 250055 247048
$$ packed form
53866C11879n267o178o429n794m806m002l536l380l454l535l345k899k491k219
53852B54544j830j247q40q48q68m26J11j12j133j936j782j183j030j253j030j90
53836B38947L78n1r72j279o32K60O44N05K72J80K59N97J115J262N36n55o64Q01
53818B41603K657L104J760Oo10J80J627K975L829L973L462K885K996L917M925
53803B79289N227M816M419M655N436O148O286N854N204M655M295M090M031M147
53789C48552M296M046L024J480L43L62J213J797J396K50j070k326l377l830l530
53774C52626l101l361m234m905n043n173n642n918n416m473l965m133m367m101
53760B88794l453k941k896l203l464l370k987k672k607k635k641k788l082l007
$$ plain form
53746 247048 244944 244138 244016 243602 242635 241687 241308 241416 241536 241334 240796 240094 239456 238983 238543 237909 237048 236154
53728 236154 235345 234544 233790 233551 234484 236747 239641 242038 243269 243566 243577 243488 242878 241562 240297 240249 241752
53711 241752 243981 246027 247952 250485 253870 257413 260203 261978 263156 264187 265134 265897 266659 267876 269779
53696 269779 272036 274193 276375 279233 283071 287298 290986 293760 295916 297878 299914 302184 304666 306956
53682 306956 308560 309400 309801 309984 309994 310105 310711 311575 311697 310380 308113 305988 304494 303331 302188 301153
53666 301153 300366 299793 299450 299458 299708 299748 299209 298227 297380 297217 297747 298217 297627 295823 293951 293409 294362 295717 296506
53647 296506 296704 296625 296305 295987 296628 299120 303074 306939 309392 310305 310389 310281 310129 309823 309466 309594 310793 313018
53629 313018 315505 317511 318956 320128 321081 321749 322463 323842 326152 329162 332604 336253 339576 341971 343737
$$ packed form
53746B47048k104q06j22m14r67r48l79J08J20k02n38p02o38m73m40o34q61q94
53728B36154q09q01p54k39R33K263K894K397J231K97J1q9o10j316j265m8J503
53711B41752K229K046J925K533L385L543K790J775J178J031R47P63P62J217J903
53696B69779K257K157K182K858L838M227L688K774K156J962K036K270K482K290
53682C06956J604Q40M01J83J0J11O06Q64J22j317k267k125j494j163j143j035
53666C01153p87n73l43QK50M0n39r82q47j63N30M70n90j804j872n42R53J355P89
53647B96506J98p9l20l18O41K492L954L865K453R13Q4j08j52l06l57J28J199K225
53629C13018K487K006J445J172R53O68P14J379K310L010L442L649L323K395J766
$$ plain form
53614 343737 346265 350675 356440 361785 365423 367605 369546 372140 375327 378465 381193 383876 387135 390986
53600 390986 394783 398150 401632 406008 411102 415770 419080 421066 422202 422646 422384 421807 421565 421837 422089 421654
53584 421654 420305 418170 415429 412343 409422 407204 405826 405021 404541 404335 404207 403605 402051 399714 397272
53569 397272 395213 393474 391801 390176 388834 388086 388213 389253 390648 391357 390757 389430 388703 389345 390936 392578
53553 392578 393912 395246 396901 398744 400324 401262 401496 401325 401266 401737 402823 404369 406272 408568 411255 414212
53537 414212 417421 421123 425578 430700 436108 441594 447369 453722 460598 467701 475011 482962 492017 502133
53523 502133 512728 523118 533017 542787 553243 565038 578107 591828 605822 620379 635903 652208
53511 652208 668763 685526 703078 721829 741484 761490 781641 802008 822553 843138 863781
$$ packed form
53614C43737K528M410N765N345L638K182J941K594L187L138K728K683L259L851
53600C90986L797L367L482M376N094M668L310J986J136M44k62n77k42K72K52m35
53584D21654j349k135k741l086k921k218j378q05m80k06j28o02j554k337k442
53569C97272k059j739j673j625j342p48J27J040J395P09o00j327p27O42J591J642
53553C92578J334J334J655J843J580R38K34j71n9M71J086J546J903K296K687K957
53537D14212L209L702M455N122N408N486N775O353O876P103P310P951R055J0116
53523E02133J0595J0390R899R770J0456J1795J3069J3721J3994J4557J5524J6305
53511F52208J6555J6763J7552J8751J9655K0006K0151K0367K0545K0585K0643
$$ plain form
53500 863781 884589 905510 926383 947171 967945 988799 1009923 1031525 1053371 1074528 1094077
53489 1094077 1112081 1129467 1146885 1164104 1180714 1196973 1213556 1230620 1247526 1263576 1278767
53478 1278767 1293603 1308209 1321892 1333828 1344125 1353813 1363574 1372853 1380561 1386338 1390553 1393270 1393990
53465 1393990 1392513 1389393 1385193 1379841 1373062 1364934 1355632 1345125 1333565 1321591 1309679 1297500 1284493
53452 1284493 1270784 1256947 1243056 1228665 1213628 1198262 1182695 1166728 1150498 1134731 1120102
53441 1120102 1106706 1094210 1082158 1070177 1058441 1047989 1039888 1033984 1029069 1024489 1020795 1018460
53429 1018460 1016847 1015188 1013994 1014551 1017280 1021434 1026315 1031937 1038413 1045448 1052831 1061026 1070890 1082995
53415 1082995 1097324 1113407 1130663 1148806 1168012 1188532 1210253 1232920 1256794 1282602 1310668
$$ packed form
53500H63781K0808K0921K0873K0788K0774K0854K1124K1602K1846K1157J9549
53489A094077J8004J7386J7418J7219J6610J6259J6583J7064J6906J6050J5191
53478A278767J4836J4606J3683J1936J0297R688R761R279P708N777M215K717P20
53465A393990j477l120m200n352o779q128r302j0507j1560j1974j1912j2179j3007
53452A284493j3709j3837j3891j4391j5037j5366j5567j5967j6230j5767j4629
53441A120102j3396j2496j2052j1981j1736j0452q101n904m915m580l694k335
53429A018460j613j659j194N57K729M154M881N622O476P035P383Q195R864J2105
53415A082995J4329J6083J7256J8143J9206K0520K1721K2667K3874K5808K8066
$$ plain form
53404 1310668 1340474 1371340 1403303 1436985 1472703 1510033 1548290 1587196 1626974 1667879 1709793
53393 1709793 1752388 1795624 1839955 1885894 1933447 1982043 2030910 2079330 2126610 2172220 2216172
53382 2216172 2259065 2301414 2342896 2382423 2419045 2452654 2483744 2512606 2538969 2562347 2582457
53371 2582457 2599127 2612018 2620714 2625036 2625006 2620539 2611468 2597946 2580491 2559512 2535048 2507202 2476539
53358 2476539 2443786 2409277 2372980 2334971 2295659 2255667 2215677 2176213 2137335 2098691 2060126
53347 2060126 2022044 1984863 1948352 1912003 1875820 1840166 1804851 1769191 1733234 1698255 1665446
53336 1665446 1634518 1604198 1573972 1544769 1517891 1493720 1471601 1450607 1430191 1410244 1390765
53325 1390765 1371565 1352284 1332795 1313617 1295766 1279987 1266065 1252960 1239737 1226296 1213202
$$ packed form
53404A310668K9806L0866L1963L3682L5718L7330L8257L8906L9778M0905M1914
53393A709793M2595M3236M4331M5939M7553M8596M8867M8420M7280M5610M3952
53382B216172M2893M2349M1482L9527L6622L3609L1090K8862K6363K3378K0110
53371B582457J6670J2891Q696M322l0m467r071j3522j7455k0979k4464k7846l0663
53358B476539l2753l4509l6297l8009l9312l9992l9990l9464l8878l8644l8565
53347B060126l8082l7181l6511l6349l6183l5654l5315l5660l5957l4979l2809
53336A665446l0928l0320l0226k9203k6878k4171k2119k0994k0416j9947j9479
53325A390765j9200j9281j9489j9178j7851j5779j3922j3105j3223j3441j3094
$$ plain form
53314 1213202 1200962 1189733 1179701 1171335 1164898 1159918 1155509 1151277 1147641 1145262 1144450 1145206 1147527 1151427
53300 1151427 1156789 1163412 1171179 1180093 1190190 1201529 1214227 1228473 1244458 1262190 1281238 1300785
53288 1300785 1320149 1339255 1358359 1377428 1396127 1414475 1432985 1451818 1470059 1486269 1499706
53277 1499706 1510718 1519931 1527417 1532796 1536012 1537640 1538280 1537727 1535042 1529628 1521973 1513033 1503038 1491353
53263 1491353 1477499 1461741 1444517 1425916 1406088 1385630 1364988 1343785 1321410 1298130 1274905
53252 1274905 1252110 1229117 1205340 1181122 1157243 1133966 1111005 1088176 1065701 1043930 1023023
53241 1023023 1002860 983086 963350 943579 923929 904346 884450 864076 843783 824543 806978
53230 806978 791049 776356 762446 748887 735397 721989 708900 696374 684654 674007 664350 654824
$$ packed form
53314A213202j2240j1229j0032q366o437m980m409m232l636k379q12P56K321L900
53300A151427N362O623P767Q914J0097J1339J2698J4246J5985J7732J9048J9547
53288A300785J9364J9106J9104J9069J8699J8348J8510J8833J8241J6210J3437
53277A499706J1012R213P486N379L216J628O40n53k685n414p655q940r995j1685
53263A491353j3854j5758j7224j8601j9828k0458k0642k1203k2375k3280k3225
53252A274905k2795k2993k3777k4218k3879k3277k2961k2829k2475k1771k0907
53241A023023k0163j9774j9736j9771j9650j9583j9896k0374k0293j9240j7565
53230H06978j5929j4693j3910j3559j3490j3408j3089j2526j1720j0647r657r526
$$ plain form
53218 654824 644163 631724 617984 603948 590346 577412 564997 552541 539380 525605 512400
53207 512400 500964 491186 481941 472597 463521 454975 446355 437073 427651 419240 412239 405953 399500 392568
53193 392568 385387 378453 372262 366839 361546 355813 350110 345549 342337 339256 335158 330490 326733 324499
53179 324499 322857 320605 317672 314937 313008 311642 310293 308837 307500 306312 305013 303496 302022 300841
53165 300841 299889 299057 298448 297972 296935 294616 291335 288459 287151 287393 288315 289085 289311 289004 288470 288016 287507
53148 287507 286432 284604 282514 280735 279321 278075 277144 276875 277246 277828 278242 278277 277718 276551 275352 274995
53132 274995 275709 276725 277036 276415 275572 275459 276485 278241 279887 280874 281381 282006 283061 284291 285285 286025 286916
53115 286916 288249 289726 290694 290932 291075 291943 293441 294456 293935 291829 288885 285902 283461 281935 281293 280982
$$ packed form
53218F54824j0661j2439j3740j4036j3602j2934j2415j2456j3161j3775j3205
53207E12400j1436r778r245r344r076q546q620r282r422q411p001o286o453o932
53193C92568p181o934o191n423n293n733n703m561l212l081m098m668l757k234
53179C24499j642k252k933k735j929j366j349j456j337j188j299j517j474j181
53165C00841r52q32o09m76j037k319l281k876j308K42R22P70K26l07n34m54n09
53148B87507j075j828k090j779j414j246r31k69L71N82M14L5n59j167j199l57
53132B74995P14J016L11o21q43j13J026J756J646R87N07O25J055J230R94P40Q91
53115B86916J333J477R68K38J43Q68J498J015n21k106k944k983k441j526o42l11
$$ plain form
53099 280982 280425 279600 278853 278282 277642 276769 275786 274879 274161 273684 273340 272866 272198 271634 271327 270878 269892 268780
53081 268780 268421 269061 270104 270993 271709 272325 272633 272482 272014 271357 270556 269988 270302 271552 272823 273160 272561 271671
53063 271671 270796 269720 268324 266896 265755 264916 264200 263602 263419 263978 265174 266389 267127 267593 268298 269196 269708
53046 269708 269618 269349 269221 269068 268869 269037 269608 269822 269202 268515 268857 270088 271020 270985 270407 269875 269509 269316 269384
53027 269384 269459 269014 268096 267554 268044 269225 270260 270763 270932 271115 271584 272474 273565 274310 274371 274033 273880 274224
53009 274224 274978 275880 276621 276987 277088 277325 277947 278800 279626 280340 280834 280911 280721 280920 281927 283256 284053 284175
52991 284175 284205 284489 284830 285187 286017 287511 289001 289638 289394 288995 289029 289547 290424 291611 292972 294341 295922
52974 295922 298245 301485 304976 307697 309171 309753 310146 310785 311605 312188 312201 311832 311706 312183 312823 312843 312066 311134
$$ packed form
53099B80982n57q25p47n71o40q73r83r07p18m77l44m74o68n64l07m49r86j112
53081B68780l59O40J043Q89P16O16L08j51m68o57q01n68L14J250J271L37n99q90
53063B71671q75j076j396j428j141q39p16n98j83N59J196J215P38M66P05Q98N12
53046B69708r0k69j28j53j99J68N71K14o20o87L42J231R32l5n78n32l66j93O8
53027B69384P5m45r18n42M90J181J035N03J69J83M69Q90J091P45O1l38j53L44
53009B74224P54R02P41L66J01K37O22Q53Q26P14M94P7j90J99J007J329P97J22
52991B84175L0K84L41L57Q30J494J490O37k44l99L4N18Q77J187J361J369J581
52974B95922K323L240L491K721J474N82L93O39Q20N83J3l69j26M77O40K0p77r32
$$ plain form
52956 311134 310698 310758 310965 311210 311578 311823 311397 310037 308074 305987 303934 301870 299919 298284 296814 294991
52940 294991 292541 289885 287759 286472 285762 285356 285340 285823 286439 286503 285629 284042 282337 281068 280504 280562 280985
52923 280985 281672 282710 283936 284717 284594 284028 283914 284322 284327 283375 282214 281997 282845 283929 284735 285545 286678 287862
52905 287862 288608 288788 288612 288252 287710 286907 285793 284430 283060 281960 281266 281015 281224 281707 282001 281827 281611
52888 281611 282131 283485 284789 285059 284172 282797 281678 281215 281528 282535 283930 285302 286354 286962 287116 286902
52872 286902 286609 286716 287646 289360 291286 292867 294259 296151 298706 301050 302274 302626 303104 304012 304681 304676 304390
52855 304390 304155 303525 302035 300014 297955 295617 292589 289410 287125 285766 284170 281520 278319 275543 273530
52840 273530 272075 271008 270118 268889 266976 264810 263281 262790 262899 262857 262213 260985 259516 258176 257120 256325
$$ packed form
52956C11134m36O0K07K45L68K45m26j360j963k087k053k064j951j635j470j823
52940B94991k450k656k126j287p10m06j6M83O16O4q74j587j705j269n64N8M23
52923B80985O87J038J226P81j23n66j14M08Nr52j161k17Q48J084Q06Q10J133J184
52905B87862P46J80j76l60n42q03j114j363j370j100o94k51K09M83K94j74k16
52888B81611N20J354J304K70q87j375j119m63L13J007J395J372J052O08J54k14
52872B86902k93J07R30J714J926J581J392J892K555K344J224L52M78R08O69nk86
52855C04390k35o30j490k021k059k338l028l179k285j359j596k650l201k776k013
52840B73530j455j067q90j229j913k166j529m91J09m2o44j228j469j340j056p95
$$ plain form
52824 256325 255947 256341 257506 258718 259101 258561 257807 257464 257516 257690 257991 258610 259496 260270 260495 259939 258744 257487
52806 257487 256955 257553 258914 260228 260949 261114 261033 260888 260673 260337 259894 259403 258907 258330 257450 256093 254419 252953
52788 252953 252205 252264 252708 252864 252261 250999 249767 249265 249503 249847 249919 250213 251470 253588 255532 256413 256297 255861
52770 255861 255645 255847 256463 257210 257487 256901 255870 255375 256004 257468 258994 259884 259753 258691 257422 256902 257353
52753 257353 257957 257862 257321 257371 258430 259715 260229 259887 259433 259547 260427 262043 264337 267161 270295 273626 276990
52736 276990 279837 281500 282074 282713 284586 287603 290518 292272 292876 292974 293048 293292 293839 294599 295070 294788 293947
52719 293947 293179 292695 292125 291318 290786 290992 291528 291507 290624 289399 288387 287581 286647 285391 283808 282001 280276
52702 280276 279126 278869 279307 279890 280142 279940 279584 279673 280683 282420 284040 284844 284961 285059 285472 285897 285934 285625
$$ packed form
52824B56325l78L94J165J212L83n40p54l43N2J74L01O19Q86P74K25n56j195j257
52806B57487n32N98J361J314P21J65q1j45k15l36m43m91m96n77q80j357j674j466
52788B52953p48N9M44J56o03j262j232n02K38L44P2K94J257K118J944Q81j16m36
52770B55861k16K02O16P47K77n86j031m95O29J464J526Q90j31j062j269n20M51
52753B57353O04r5n41N0J059J285N14l42m54J14Q80J616K294K824L134L331L364
52736B76990K847J663N74O39J873L017K915J754O04R8P4K44N47P60M71k82q41
52719B93947p68m84n70q07n32K06N36k1q83j225j012q06r34j256j583j807j725
52702B80276j150k57M38N83K52k02l56Q9J010J737J620Q04J17R8M13M25L7l09
$$ plain form
52684 285625 285440 285876 287060 288520 289401 289144 288071 287082 286708 286666 286364 285584 284547 283586 282903 282466 282000 281249
52666 281249 280400 279982 280218 280731 281163 281741 282848 284264 285307 285690 285818 286200 286996 288195 289777 291507 292924
52649 292924 293786 294314 294840 295436 296078 296845 297694 298309 298479 298469 298652 298931 298879 298442 298076 298133 298427 298537 298301 297870
52629 297870 297494 297442 297936 298961 300161 301110 301639 301839 301777 301343 300361 298784 296814 294940 293758 293543 293949
52612 293949 294306 294295 294184 294282 294372 293996 293260 292960 293711 295206 296620 297555 298226 298787 299002 298710 298222 297911 297646
52593 297646 297081 296406 296369 297453 299310 301159 302490 303265 303666 303894 304082 304144 303755 302699 301275 300186 299976
52576 299976 300619 301645 302535 303022 303162 303221 303458 303953 304608 305229 305574 305418 304712 303646 302420 301004 299299
52559 299299 297601 296595 296743 297746 298775 299125 298592 297373 295871 294528 293606 293053 292668 292351 292126 291990
$$ packed form
52684B85625j85M36J184J460Q81k57j073r89l74m2l02p80j037r61o83m37m66p51
52666B81249q49m18K36N13M32N78J107J416J043L83J28L82P96J199J582J730J417
52649B92924Q62N28N26N96O42P67Q49O15J70j0J83K79n2m37l66N7K94J10k36m31
52629B97870l76n2M94J025J200R49N29K00o2m34r82j577j970j874j182k15M06
52612B93949L57j1j11R8R0l76p36l00P51J495J414R35O71N61K15k92m88l11k65
52593B97646n65o75l7J084J857J849J331P75M01K28J88O2l89j056j424j089k10
52576B99976O43J026Q90M87J40N9K37M95O55O21L45j56p06j066j226j416j705
52559B99299j698j006J48J003J029L50n33j219j502j343r22n53l85l17k25j36
$$ plain form
52543 291990 291918 291887 291733 291162 290259 289846 290761 292700 294216 294177 292863 291432 290753 291138 292689 295161 297625
52526 297625 299015 299221 299127 299461 300059 300443 300625 300964 301591 302392 303388 304736 306405 308139 309775 311475 313623
52509 313623 316514 319962 323177 325350 326527 327592 329074 330268 329936 327723 324467 321209 318388 315951
52495 315951 313690 311362 308911 306838 305863 305990 306255 305766 304668 303724 303221 302846 302465 302413 302913 303635 304088
52478 304088 304136 303986 303880 304017 304563 305596 307099 308990 310996 312563 313312 313730 315009 317853 321689 325319
52462 325319 328113 330182 331690 332595 332983 333118 333004 332406 331439 330713 330594 330661 330167 328791 326687 324055 321017
52445 321017 317775 314592 311652 309085 306989 305262 303620 302038 300954 300702 300926 300927 300496 300030 299824 299639
52429 299639 299085 298136 297143 296454 296137 295943 295607 295235 295297 296105 297458 299043 300958 303519 306655 309923 313007
$$ packed form
52543B91990p2l1j54n71r03m13R15J939J516l9j314j431o79L85J551K472K464
52526B97625J390K06r4L34N98L84J82L39O27Q01R96J348J669J734J636J700K148
52509C13623K891L448L215K173J177J065J482J194l32k213l256l258k821k437
52495C15951k261k328k451k073r75J27K65m89j098r44n03l75l81n2N00P22M53
52478C04088M8j50j06J37N46J033J503J891K006J567P49M18J279K844L836L630
52462C25319K794K069J508R05L88J35j14n98r67p26j19O7m94j376k104k632l038
52445C21017l242l183k940k567k096j727j642j582j084k52K24Jm31m66k06j85
52429B99639n54r49r93o89l17j94l36l72O2Q08J353J585J915K561L136L268L084
$$ plain form
52412 313007 315794 317996 319264 319806 320484 322069 324687 328118 332263 337138 342705 348867 355385 361706 367206
52397 367206 371701 375375 378088 379188 378257 375688 372318 368815 365634 363130 361330 359840 358221 356241
52383 356241 353725 350661 347728 346102 346260 347421 348655 350003 351918 354071 355681 356808 358444 361219
52369 361219 364735 368308 371742 375183 378682 382097 385039 386944 387626 387797 388531 390070 391596 392232 391813
52354 391813 390647 389141 387841 387356 387905 389243 391112 393403 395860 398197 400646 403810 407698 411531 414825
52339 414825 418120 422165 426936 432022 437575 444187 452028 460657 469679 479194 489649 501523 514917
52326 514917 529160 543086 556178 569232 583500 599385 616417 634210 652704 671569 690152
52315 690152 708260 726460 745365 765036 785272 805975 826886 847392 867026 885988 904843
$$ packed form
52412C13007K787K202J268N42O78J585K618L431M145M875N567O162O518O321N500
52397C67206M495L674K713J100r31k569l370l503l181k504j800j490j619j980
52383C56241k516l064k933j626J58J161J234J348J915K153J610J127J636K775
52369C61219L516L573L434L441L499L415K942J905O82J71P34J539J526O36m19
52354C91813j166j506j300m85N49J338J869K291K457K337K449L164L888L833L294
52339D14825L295M045M771N086N553O612P841Q629R022R515J0455J1874J3394
52326E14917J4243J3926J3092J3054J4268J5885J7032J7793J8494J8865J8583
52315F90152J8108J8200J8905J9671K0236K0703K0911K0506J9634J8962J8855
$$ plain form
52304 904843 923860 942943 962037 981169 1000053 1018013 1034399 1048940 1061665 1072723 1082404 1091073
52292 1091073 1098814 1105235 1109878 1112849 1114709 1115655 1115140 1112654 1108682 1104403 1100441 1096310 1091288 1085440
52278 1085440 1079551 1074403 1070466 1068036 1067203 1067673 1069022 1071185 1074495 1079218 1085323 1092683 1101214 1110762
52264 1110762 1121180 1132604 1145334 1159227 1173462 1187226 1200569 1214286 1228910 1244032 1258757
52253 1258757 1272715 1286419 1300542 1314954 1328606 1340436 1350226 1358487 1365607 1371343 1375219 1377227
52241 1377227 1377882 1377640 1376428 1373896 1369973 1364931 1358892 1351619 1343048 1333833 1324956 1316788 1308934 1301125
52227 1301125 1293884 1287937 1283200 1278738 1273730 1268194 1262749 1257911 1253755 1250090 1246853 1244333 1243013 1243166
52213 1243166 1244593 1246780 1249211 1251562 1253829 1256430 1260035 1265032 1271170 1277827 1284579 1291300 1297849 1303965
$$ packed form
52304I04843J9017J9083J9094J9132J8884J7960J6386J4541J2725J1058R681Q669
52292A091073P741O421M643K971J860R46n15k486l972m279l962m131n022n848
52278A085440n889n148l937k430q33M70J349K163L310M723O105P360Q531R548
52264A110762J0418J1424J2730J3893J4235J3764J3343J3717J4624J5122J4725
52253A258757J3958J3704J4123J4412J3652J1830R790Q261P120N736L876K008
52241A377227O55k42j212k532l923n042o039p273q571r215q877q168p854p809
52227A301125p241n947m737m462n008n536n445m838m156l665l237k520j320J53
52213A243166J427K187K431K351K267K601L605M997O138O657O752O721O549O116
$$ plain form
52199 1303965 1309590 1315100 1321073 1327866 1335364 1342991 1350026 1356089 1361444 1366773 1372592 1378886 1385191 1390923
52185 1390923 1395653 1399191 1401424 1402050 1400666 1397255 1392441 1386985 1381081 1374370 1366697 1358616 1351045 1344518
52171 1344518 1338749 1332830 1325988 1318380 1311057 1304943 1299930 1295329 1291076 1287985 1286664 1286681 1287153 1287779 1288836
52156 1288836 1290300 1291480 1291639 1290755 1289494 1288540 1288004 1287450 1286462 1285178 1284134 1283603 1283284 1282787 1282296 1282497 1283851
52139 1283851 1286095 1288500 1290520 1292115 1293503 1294786 1296000 1297585 1300516 1305664 1313002 1321705 1331103 1341211
52125 1341211 1352299 1364427 1377853 1393552 1412586 1434790 1458531 1482094 1505117 1528448 1552845
52114 1552845 1578074 1603190 1627304 1650057 1671600 1692342 1712555 1732089 1750506 1767553 1783401
52103 1783401 1798307 1812221 1824998 1836918 1848579 1860058 1870457 1878625 1884195 1887620 1889284 1888949
$$ packed form
52199A303965N625N510N973O793P498P627P035O063N355N329N819O294O305N732
52185A390923M730L538K233O26j384l411m814n456n904o711p673q081p571o527
52171A344518n769n919o842p608p323o114n013m601m253l091j321J7M72O26J057
52156A288836J464J180J59q84j261r54n36n54r88j284j044n31l19m97m91K01J354
52139A283851K244K405K020J595J388J283J214J585K931N148P338Q703R398J0108
52125A341211J1088J2128J3426J5699J9034K2204K3741K3563K3023K3331K4397
52114A552845K5229K5116K4114K2753K1543K0742K0213J9534J8417J7047J5848
52103A783401J4906J3914J2777J1920J1661J1479J0399Q168N570L425J664l35
$$ plain form
52091 1888949 1886143 1880724 1872939 1863237 1852256 1840717 1828962 1816657 1803237 1788715 1773908 1759930
52079 1759930 1747586 1737138 1728314 1720524 1713440 1707511 1703695 1702496 1703436 1705673 1708976 1713803 1720530 1728966
52065 1728966 1738702 1749552 1761417 1773977 1786884 1800138 1813904 1827961 1841634 1854449 1866533
52054 1866533 1878137 1888998 1898512 1906406 1912842 1917794 1920703 1920998 1918723 1914327 1907903 1898997 1887246
52041 1887246 1872963 1856907 1839671 1821544 1802858 1784019 1765063 1745586 1725436 1705318 1686289
52030 1686289 1668700 1652002 1635638 1619614 1604007 1588414 1572415 1556363 1541111 1526889 1512902
52019 1512902 1498251 1482946 1467778 1453371 1439588 1425824 1411662 1397185 1382747 1368521 1354313
52008 1354313 1339794 1324815 1309471 1293923 1278239 1262275 1245623 1227746 1208360 1187701 1166352
$$ packed form
52091A888949k806n419p785r702j0981j1539j1755j2305j3420j4522j4807j3978
52079A759930j2344j0448q824p790p084n929l816j199R40K237L303M827O727Q436
52065A728966R736J0850J1865J2560J2907J3254J3766J4057J3673J2815J2084
52054A866533J1604J0861R514P894O436M952K909K95k275m396o424q906j1751
52041A887246j4283j6056j7236j8127j8686j8839j8956j9477k0150k0118j9029
52030A686289j7589j6698j6364j6024j5607j5593j5999j6052j5252j4222j3987
52019A512902j4651j5305j5168j4407j3783j3764j4162j4477j4438j4226j4208
52008A354313j4519j4979j5344j5548j5684j5964j6652j7877j9386k0659k1349
$$ plain form
51997 1166352 1144847 1123474 1102358 1081566 1061208 1041526 1022738 1004754 987202 969884 952940
51986 952940 936361 919696 902673 885822 869898 854792 839669 824142 808635 793434 778176
51975 778176 762682 747636 733894 721544 710217 699885 690734 682582 675253 669393 666088 665514 666611
51962 666611 668270 670195 672396 674482 675995 677029 677917 678551 678502 677685 676419 674803 672490 669237 665434
51947 665434 662042 660126 660357 662586 665885 669333 672869 677071 682120 687527 693102 699558 707523 716319
51933 716319 724450 731129 736587 740892 743321 743224 740803 736615 730878 723768 715842 707550 698733 689241 679658
51918 679658 670655 661937 652768 643478 635486 629559 624936 620604 616796 614756 615421 618744 623888 629659
51904 629659 635084 639928 644479 648643 651658 652930 652664 651331 648905 645055 639674 632695 623785 612831
$$ packed form
51997A166352k1505k1373k1116k0792k0358j9682j8788j7984j7552j7318j6944
51986I52940j6579j6665j7023j6851j5924j5106j5123j5527j5507j5201j5258
51975G78176j5494j5046j3742j2350j1327j0332r151q152p329n860l305n74J097
51962F66611J659J925K201K086J513J034Q88O34m9q17j266j616k313l253l803
51947F65434l392j916K31K229L299L448L536M202N049N407N575O456P965Q796
51933G16319Q131O679N458M305K429r7k421m188n737p110p926q292q817r492r583
51918F79658r003q718r169r290p992n927m623m332l808k040O65L323N144N771
51904F29659N425M844M551M164L015J272k66j333k426l850n381o979q910j0954
$$ plain form
51890 612831 600564 588092 575945 564078 552678 542361 533544 526086 519653 514136 509703 506725 505579
51877 505579 506216 508054 510617 514065 518626 523692 528124 531470 534329 537364 540410 542722 543735 543493 542676
51862 542676 542247 542660 543313 543177 542023 540633 539738 539203 538433 537229 536034 535565 536191 537379 537804 536497 533851
51845 533851 531001 528277 525030 520990 516793 512738 507956 501610 494302 487523 482083 477873 474736 472662
51831 472662 471250 469931 468826 468673 469704 471167 472129 472238 471592 470429 469150 468172 467399 466233 464344 462153
51815 462153 460328 459193 458868 459590 461360 463487 464957 465349 465105 464871 464768 464364 463195 461258 459058 457179
51799 457179 455804 454686 453623 452822 452666 453196 453948 454334 454093 453362 452406 451408 450546 450118 450314 450785 450781 450056
51781 450056 449457 450150 452112 453871 453976 452442 450481 449140 448656 448984 450309 452833 456430 460738 465458
$$ packed form
51890F12831j2267j2472j2147j1867j1400j0317q817p458o433n517m433k978j146
51877E05579O37J838K563L448M561N066M432L346K859L035L046K312J013k42q17
51862E42676m29M13O53j36j154j390q95n35p70j204j195m69O26J188M25j307k646
51845E33851k850k724l247m040m197m055m782o346p308o779n440m210l137k074
51831D72662j412j319j105j53J031J463R62J09o46j163j279r78p73j166j889k191
51815D62153j825j135l25P22J770K127J470L92k44k34j03m04j169j937k200j879
51799D57179j375j118j063q01j56N30P52L86k41p31r56r98q62m28J96M71mp25
51781D50056n99O93J962J759J05j534j961j341m84L28J325K524L597M308M720
$$ plain form
51766 465458 470416 475555 481008 486995 493410 499631 504914 508927 511792 513741 514891 515192 514357 511977 508039
51751 508039 503240 498410 493652 488467 482788 477355 472785 468814 464985 461682 459687 458840 457960 456385 454914
51736 454914 454768 456131 458283 460804 463873 467483 471127 474461 477620 480570 482727 483770 484393 485642 487649
51721 487649 489638 491074 492115 492832 492787 491815 490665 490164 490036 489167 486996 484077 481224 478642 476114 473585
51705 473585 471269 469377 468019 467194 466735 466318 465694 464870 464068 463589 463622 463955 463993 463345 462349 461690 461527 461478 461362
51686 461362 461316 460982 459410 456226 452395 449194 446820 444632 442404 440589 439536 439124 439134 439357 439422 439137 439018
51669 439018 439806 441420 443038 444352 446062 448887 452690 456891 461187 465441 469273 472237 474237 475538
51655 475538 476520 477495 478439 478864 478410 477710 478141 480436 483951 487438 490042 491297 490884 488974 486356 483623
$$ packed form
51766D65458M958N139N453N987O415O221N283M013K865J949J150L01q35k380l938
51751E08039m799m830m758n185n679n433m570l971l829l303j995q47q80j575j471
51736D54914j46J363K152K521L069L610L644L334L159K950K157J043O23J249K007
51721D87649J989J436J041P17m5r72j150n01j28q69k171k919k853k582k528k529
51705D73585k316j892j358q25m59m17o24q24q02m79L3L33L8o48r96o59j63m9j16
51686D61362m6l34j572l184l831l201k374k188k228j815j053m12J0K23O5k85j19
51669D39018P88J614J618J314J710K825L803M201M296M254L832K964K000J301
51655D75538R82R75R44M25m54p00M31K295L515L487K604J255m13j910k618k733
$$ plain form
51639 483623 480583 476946 473147 469808 466690 462867 457800 451650 444795 437788 431724 427763 425999 425350
51625 425350 424753 424073 423679 423709 424037 424592 425316 425961 426198 425860 424987 423717 422220 420674 419327 418605 418938 420270
51607 420270 421899 423090 423776 424454 425544 427120 429051 431055 432743 434066 435627 438165 441832 446361 451724
51592 451724 457957 464463 470277 475187 479864 484591 488572 490954 491940 492327 492435 492157 491828 492291 494015 496603
51576 496603 499368 502183 505696 510855 518204 527618 538769 551802 567210 584932 603951 623121 642110
51563 642110 661220 680522 699721 718815 738401 759127 781135 804123 827641 851035 873256
51552 873256 892986 909059 920742 927677 929735 927013 919895 908886 894296 876239 855044 831548
51540 831548 806789 781462 755891 730395 705430 681410 658730 637881 619188 602378 586782
$$ packed form
51639D83623l040l637l799l339l118l823n067o150o855p007o064l961j764o49
51625D25350n97o80l94L0L28N55P24O45K37l38q73j270j497j546j347p22L33J332
51607D20270J629J191O86O78J090J576J931K004J688J323J561K538L667M529N363
51592D51724O233O506N814M910M677M727L981K382R86L87J08k78l29M63J724K588
51576D96603K765K815L513N159P349R414J1151J3033J5408J7722J9019J9170J8989
51563F42110J9110J9302J9199J9094J9586K0726K2008K2988K3518K3394K2221
51552H73256J9730J6073J1683O935K058k722p118j1009j4590j8057k1195k3496
51540H31548k4759k5327k5571k5496k4965k4020k2680k0849j8693j6810j5596
$$ plain form
51529 586782 572071 558437 546002 534538 523997 514831 507403 501456 496507 492364 488839 485332 481309
51516 481309 477016 473159 470043 467537 465729 464934 465057 465583 466258 467197 468210 468685 468420 467998 467916 467793 466912
51499 466912 465226 463352 461787 460542 459408 458152 456541 454503 452257 450036 447770 445326 442889 440731
51485 440731 438684 436269 433344 430236 427212 424314 421795 420149 419362 418592 417070 415023 413182 411572 409456
51470 409456 406500 403366 400838 398806 396577 393898 391198 388867 386754 384588 382594 381402 381401 382347 383614
51455 383614 384703 385455 385985 386695 388294 391403 395787 400174 403294 405145 406941 409772 413757 418614 424496
51440 424496 431755 440175 448952 457368 465022 471544 476641 480519 483793 486744 488973 489916 489347 487260 483698
51425 483698 479034 474078 469445 464978 460104 454652 448967 443299 437659 432350 428169 425688 424535 423806
$$ packed form
51529E86782j4711j3634j2435j1464j0541r166p428n947m949m143l525l507m023
51516D81309m293l857l116k506j808p95J23N26O75R39J013M75k65m22q2j23q81
51499D66912j686j874j565j245j134j256j611k038k246k221k266k444k437k158
51485D40731k047k415k925l108l024k898k519j646p87p70j522k047j841j610k116
51470D09456k956l134k528k032k229k679k700k331k113k166j994j192jR46J267
51455C83614J089P52N30P10J599L109M384M387L120J851J796K831L985M857N882
51440D24496P259Q420Q777Q416P654O522N097L878L274K951K229R43n69k087l562
51425D83698m664m956m633m467m874n452n685n668n640n309m181k481j153p29
$$ plain form
51411 423806 423186 423262 424589 426835 429193 431396 433790 436478 439048 441390 444153 447831 451855 455275 458149
51396 458149 461543 466150 471631 477398 483397 489893 497181 505813 516492 529240 543120 557261 571877
51383 571877 587953 606347 627548 651789 678783 707655 737730 769109 802025 835942 869887
51372 869887 903240 935333 964490 988444 1005896 1016947 1021903 1020371 1011858 996600 975482 949620
51360 949620 920254 888571 855251 820587 785269 750632 717784 686900 657620 629815 603667
51349 603667 579443 557544 538395 521905 507372 494294 482944 473713 466187 459430 452945 446853
51337 446853 441251 436003 431153 427029 423731 420846 417840 414515 411004 407454 403864 400220 396767 394001
51323 394001 392106 390408 387838 384190 380546 378124 377070 376762 376869 377478 378469 379522 380657 382084 383565
$$ packed form
51411D23806o20P6J327K246K358K203K394K688K570K342K763L678M024L420K874
51396D58149L394M607N481N767N999O496P288Q632J0679J2748J3880J4141J4616
51383E71877J6076J8394K1201K4241K6994K8872L0075L1379L2916L3917L3945
51372H69887L3353L2093K9157K3954J7452J1051M956j532q513j5258k1118k5862
51360I49620k9366l1683l3320l4664l5318l4637l2848l0884k9280k7805k6148
51349F03667k4224k1899j9149j6490j4533j3078j1350r231p526o757o485o092
51337D46853n602n248m850m124l298k885l006l325l511l550l590l644l453k766
51323C94001j895j698k570l648l644k422j054l08J07O09R91J053J135J427J481
$$ plain form
51308 383565 384647 385615 387381 390212 393250 395646 397493 399234 400812 402009 403084 404392 405666 406310 406132
51293 406132 405250 403618 401351 399207 397902 397024 395467 392991 390499 388655 387105 385496 384363 384436 385664
51278 385664 387624 390303 393759 397364 400309 402668 405139 407777 409851 411133 412435 414459 416739 418284
51264 418284 418856 419054 419388 419848 420305 420882 421762 422902 423960 424444 424035 422914 421630 420436 418917 416580
51248 416580 413631 410798 408360 405821 402715 399403 396816 395586 395636 396437 397315 397582 396762 394999 393071 391763
51232 391763 391155 390628 389611 388171 386891 386347 386769 387960 389255 389738 388898 387153 385443 384314 383645 383323
51216 383323 383695 385121 387385 389881 392169 394132 395819 397455 399433 401962 404879 408001 411332 414625
51202 414625 417143 418530 419698 422089 426022 430382 434032 436828 438996 440364 440718 440434 440072 439591 438526
$$ packed form
51308C83565J082R68J766K831L038K396J847J741J578J197J075J308J274O44j78
51293D06132q82j632k267k144j305q78j557k476k492j844j550j609j133P3J228
51278C85664J960K679L456L605K945K359K471K638K074J282J302K024K280J545
51264D18284N72J98L34M60M57N77Q80J140J058M84m09j121j284j194j519k337
51248D16580k949k833k438k539l106l312k587j230N0Q01Q78K67q20j763j928j308
51232C91763o08n27j017j440j280n44M22J191J295M83q40j745j710j129o69l22
51216C83323L72J426K264K496K288J963J687J636J978K529K917L122L331L293
51202D14625K518J387J168K391L933M360L650K796K168J368L54k84l62m81j065
$$ plain form
51187 438526 436783 434768 432772 430752 428775 427258 426551 426483 426468 426006 424980 423524 421708 419555 417373 415810
51171 415810 415212 415082 414607 413705 413032 412930 413049 413257 414153 416130 418487 420258 421529 423156 425356 427451
51155 427451 428944 430047 431016 431665 431802 431540 430926 429811 428371 427254 426857 426863 426824 426822 427197 427917 428578 428829 428545
51136 428545 427824 427019 426544 426386 426079 425303 424143 422616 420512 418096 416399 416104 416524 416400 415599 415213 416004
51119 416004 417497 418874 420174 422229 425710 430474 435615 440001 443035 445075 446985 449307 452047 455115
51105 455115 458427 461528 463747 465035 466221 468029 470109 471459 471633 471204 471124 471872 473114 473999 473933 473235
51089 473235 472862 473278 473874 473761 472821 471571 470250 468647 466795 465307 464809 465355 466521 467781 468746 469356
51073 469356 470018 471285 473205 475244 476999 478755 481143 484394 488093 491616 494723 497900 502179 508418
$$ packed form
51187D38526j743k015j996k020j977j517p07o8j5m62j026j456j816k153k182j563
51171D15810n98j30m75r02o73j02J19K08Q96J977K357J771J271J627K200K095
51155D27451J493J103R69O49J37k62o14j115j440j117l97Ol9kL75P20O61K51k84
51136D28545p21q05m75j58l07p76j160j527k104k416j697k95M20j24q01l86P91
51119D16004J493J377J300K055L481M764N141M386L034K040J910K322K740L068
51105D55115L312L101K219J288J186J808K080J350J74m29q0P48J242Q85o6o98
51089D73235l73M16N96j13r40j250j321j603j852j488m98N46J166J260R65O10
51073D69356O62J267J920K039J755J756K388L251L699L523L107L177M279O239
$$ plain form
51059 508418 516632 526148 536438 547506 559299 571097 581876 591170 599366 607312 615876 625725 637022
51046 637022 649175 661074 671677 680384 687014 691720 694877 696780 697388 696552 694464 691575 688049 683585
51032 683585 677923 671218 663723 655385 646125 636395 627077 618727 611212 604216 597864 592633 588704 585704
51018 585704 583134 580904 579347 578912 580020 583099 588347 595283 602808 610049 617125 624902 633999 644200
51004 644200 654800 665257 675357 684988 694054 702681 711324 720468 730177 740026 749504 758421 766890
50991 766890 775051 783027 791036 799209 807208 814398 820600 826459 832800 839924 847878 857103 868166 880905
50977 880905 894526 908758 924383 942262 962257 983606 1006055 1030087 1056155 1084325 1114817
50966 1114817 1148391 1185807 1227089 1271612 1318895 1369020 1422258 1478488 1537149 1597628 1659437
$$ packed form
51059E08418Q214R516J0290J1068J1793J1798J0779R294Q196P946Q564R849J1297
51046F37022J2153J1899J0603Q707O630M706L157J903O08q36k088k889l526m464
51032F83585n662o705p495q338r260r730r318q350p515o996o352n231l929l000
51018E85704k570k230j557m35J108L079N248O936P525P241P076P777R097J0201
51004F44200J0600J0457J0100R631R066Q627Q643R144R709R849R478Q917Q469
50991G66890Q161P976Q009Q173P999P190O202N859O341P124P954R225J1063J2739
50977H80905J3621J4232J5625J7879J9995K1349K2449K4032K6068K8170L0492
50966A114817L3574L7416M1282M4523M7283N0125N3238N6230N8661O0479O1809
$$ plain form
50955 1659437 1721991 1784498 1846227 1906746 1965623 2021992 2074737 2123206 2167512 2208060 2244971
50944 2244971 2278053 2307169 2332511 2354677 2374533 2392763 2409332 2423510 2434588 2442527 2447804 2450728
50932 2450728 2451026 2447979 2440847 2429260 2413290 2393073 2368389 2338810 2304275 2265114 2221396 2172694
50920 2172694 2118974 2061422 2001805 1941081 1879136 1815995 1752728 1690866 1631251 1573764 1518049
50909 1518049 1464217 1412908 1364895 1320693 1280434 1243943 1210786 1180261 1151570 1124302 1098786
50898 1098786 1075688 1055263 1037124 1020766 1006068 993145 981896 971950 963058 955411 949497 945595
50886 945595 943364 941974 940772 939818 939711 940955 943594 947394 952109 957481 963253 969383 976179 984089 993304
50871 993304 1003663 1014892 1026953 1040179 1055137 1072368 1092213 1114817 1140170 1168088 1198406
$$ packed form
50955A659437O2554O2507O1729O0519N8877N6369N2745M8469M4306M0548L6911
50944B244971L3082K9116K5342K2166J9856J8230J6569J4178J1078P939N277K924
50932B450728K98l047p132j1587j5970k0217k4684k9579l4535l9161m3718m8702
50920B172694n3720n7552n9617o0724o1945o3141o3267o1862n9615n7487n5715
50909A518049n3832n1309m8013m4202m0259l6491l3157l0525k8691k7268k5516
50898A098786k3098k0425j8139j6358j4698j2923j1249r946q892p647n914l902
50886I45595k231j390j202r54j07J244K639L800M715N372N772O130O796P910R215
50871I93304J0359J1229J2061J3226J4958J7231J9845K2604K5353K7918L0318
$$ plain form
50860 1198406 1231340 1267589 1307813 1352061 1399956 1451473 1507345 1568647 1636190 1710336 1791085
50849 1791085 1878146 1971121 2069846 2174514 2285309 2402001 2524058 2651097 2782974 2919260
50839 2919260 3058663 3199106 3338424 3474960 3607364 3733907 3852333 3960615 4057675 4143138
50829 4143138 4216679 4278072 4327788 4367019 4397013 4418896 4434330 4445684 4454986 4462935 4469373 4474469
50817 4474469 4478836 4482507 4484272 4482111 4473927 4457853 4432335 4396161 4348234 4287265 4212081 4122492
50805 4122492 4019639 3905285 3781016 3648284 3508837 3364679 3217687 3069693 2922860
50796 2922860 2779559 2641770 2510817 2387689 2273246 2167950 2071772 1984615 1906560 1837444
50786 1837444 1776428 1722392 1674689 1633180 1597584 1567185 1541142 1518678 1498868 1480696 1463643
$$ packed form
50860A198406L2934L6249M0224M4248M7895N1517N5872O1302O7543P4146Q0749
50849A791085Q7061R2975R8725J04668J10795J16692J22057J27039J31877J36286
50839B919260J39403J40443J39318J36536J32404J26543J18426J08282R7060Q5463
50829D143138P3541O1393M9716L9231K9994K1883J5434J1354R302P949O438N096
50817D474469M367L671J765k161q184j6074k5518l6174m7927o0969p5184q9589
50805D122492j02853j14354j24269j32732j39447j44158j46992j47994j46833
50796B922860j43301j37789j30953j23128j14443j05296r6178q7157p8055o9116
50786A837444o1016n4036m7703m1509l5596l0399k6043k2464j9810j8172j7053
$$ plain form
50775 1463643 1447944 1433994 1421645 1410248 1399125 1387803 1376043 1363959 1351927 1340052 1327848
50764 1327848 1314800 1301095 1287463 1274360 1261685 1249236 1237035 1225176 1213805 1203343 1194369
50753 1194369 1187104 1181343 1177036 1174641 1174710 1177399 1182619 1190418 1201049 1214848 1232239 1253628 1279063
50740 1279063 1308163 1340554 1376230 1415368 1458079 1504590 1555420 1610927 1670730 1733871 1799590
50729 1799590 1867679 1938055 2010228 2083312 2156488 2229280 2301342 2372085 2440703 2506606 2569496
50718 2569496 2628694 2682522 2728928 2766862 2796706 2819303 2835018 2843924 2846408 2843204 2835270 2823979
50706 2823979 2811090 2798014 2785326 2773433 2763345 2756157 2751835 2749107 2746483 2742840 2737044 2727717 2713632
50693 2713632 2693824 2667135 2632177 2588193 2535685 2475926 2410146 2339435 2265153 2188934 2112246
$$ packed form
50775A463643j5699j3950j2349j1397j1123j1322j1760j2084j2032j1875j2204
50764A327848j3048j3705j3632j3103j2675j2449j2201j1859j1371j0462q974
50753A194369p265n761m307k395O9K689N220P799J0631J3799J7391K1389K5435
50740A279063K9100L2391L5676L9138M2711M6511N0830N5507N9803O3141O5719
50729A799590O8089P0376P2173P3084P3176P2792P2062P0743O8618O5903O2890
50718B569496N9198N3828M6406L7934K9844K2597J5715Q906K484l204p934j1291
50706B823979j2889j3076j2688j1893j0088p188m322k728k624l643n796r327j4085
50693B713632j9808k6689l4958m3984n2508n9759o5780p0711p4282p6219p6688
$$ plain form
50682 2112246 2036148 1961427 1888910 1819681 1755091 1696396 1644241 1598516 1558779 1524699 1496167
50671 1496167 1473249 1456123 1444807 1438786 1437010 1438471 1442625 1449140 1457401 1466595 1476247 1486412 1497244
50658 1497244 1508520 1519778 1530886 1542282 1554475 1567386 1580466 1593521 1607162 1622168 1638677
50647 1638677 1656315 1674956 1694874 1716185 1738700 1762535 1788474 1817403 1849558 1884462 1921379
50636 1921379 1959599 1998578 2038114 2078254 2118842 2159305 2199087 2238171 2276905 2315421 2353454
50625 2353454 2390525 2425834 2457843 2484315 2503196 2513747 2516936 2514734 2508839 2499936 2488113 2473823
50613 2473823 2458153 2442096 2425920 2409524 2393151 2377337 2362164 2346998 2331056 2313901 2295158
50602 2295158 2273982 2249172 2219880 2186093 2148349 2107136 2062679 2015207 1965162 1913031 1859158
$$ packed form
50682B112246p6098p4721p2517o9229o4590n8695n2155m5725l9737l4080k8532
50671A496167k2918j7126j1316o021j776J461M154O515Q261R194R652J0165J0832
50658A497244J1276J1258J1108J1396J2193J2911J3080J3055J3641J5006J6509
50647A638677J7638J8641J9918K1311K2515K3835K5939K8929L2155L4904L6917
50636A921379L8220L8979L9536M0140M0588M0463L9782L9084L8734L8516L8033
50625B353454L7071L5309L2009K6472J8881J0551L189k202n895q903j1823j4290
50613B473823j5670j6057j6176j6396j6373j5814j5173j5166j5942j7155j8743
50602B295158k1176k4810k9292l3787l7744m1213m4457m7472n0045n2131n3873
$$ plain form
50591 1859158 1804036 1748718 1694624 1642753 1593241 1545830 1500630 1458258 1419384 1384314 1352924
50580 1352924 1324694 1298799 1274424 1251220 1229423 1209550 1192064 1177361 1165898 1158007 1153514 1151668
50568 1151668 1151682 1153325 1156831 1162223 1169000 1176718 1185684 1196773 1210494 1226472 1243847 1261957 1280592
50555 1280592 1299900 1320261 1342071 1365381 1389748 1414555 1439428 1464240 1488764 1512502 1535008
50544 1535008 1556409 1577495 1599187 1621960 1645978 1671774 1700324 1732234 1767249 1804985 1845832
50533 1845832 1890543 1939157 1991130 2046512 2106160 2170526 2239086 2311322 2387423 2467278 2549508
50522 2549508 2632437 2715648 2799655 2884211 2967871 3049093 3126762 3199447 3265172 3322463 3370945
50511 3370945 3410415 3439853 3457991 3464466 3459848 3444731 3419474 3384904 3342749 3295136 3243845 3190225
$$ packed form
50591A859158n5122n5318n4094n1871m9512m7411m5200m2372l8874l5070l1390
50580A352924k8230k5895k4375k3204k1797j9873j7486j4703j1463p891m493j846
50568A151668J4J643L506N392O777P718Q966J1089J3721J5978J7375J8110J8635
50555A280592J9308K0361K1810K3310K4367K4807K4873K4812K4524K3738K2506
50544A535008K1401K1086K1692K2773K4018K5796K8550L1910L5015L7736M0847
50533A845832M4711M8614N1973N5382N9648O4366O8560P2236P6101P9855Q2230
50522B549508Q2929Q3211Q4007Q4556Q3660Q1222P7669P2685O5725N7291M8482
50511C370945L9470K9438J8138O475m618j5117k5257l4570m2155m7613n1291n3620
$$ plain form
50499 3190225 3135747 3082415 3032436 2987417 2947920 2913915 2885579 2863451 2847831 2838288 2833755 2832771
50487 2832771 2833385 2833071 2829120 2819284 2802115 2776803 2742813 2699755 2647623 2587147 2519745 2446925
50475 2446925 2369770 2289111 2206043 2122023 2038559 1957078 1878995 1805395 1736492 1671777 1610896
50464 1610896 1554186 1502255 1455421 1413761 1377361 1346189 1319906 1298166 1280941 1268282 1259873
50453 1259873 1255061 1253296 1254313 1257906 1263700 1271168 1279836 1289613 1300950 1314384 1329729 1345915 1361834
50440 1361834 1377184 1392262 1407182 1421643 1435271 1447823 1459085 1468944 1477528 1485015 1491330 1496357
50428 1496357 1500384 1504030 1507747 1511758 1516447 1522270 1529150 1536424 1543820 1552166 1562787 1576297 1592318
50415 1592318 1610281 1630160 1652385 1677284 1704766 1734368 1765542 1797884 1831176 1865238 1899801
$$ packed form
50499C190225n4478n3332m9979m5019l9497l4005k8336k2128j5620r543m533r84
50487B832771O14l14l951r836j7169k5312l3990m3058n2132o0476o7402p2820
50475B446925p7155q0659q3068q4020q3464q1481p8083p3600o8903o4715o0881
50464A610896n6710n1931m6834m1660l6400l1172k6283k1740j7225j2659q409
50453A259873m812j765J017L593N794P468Q668R777J1337J3434J5345J6186J5919
50440A361834J5350J5078J4920J4461J3628J2552J1262R859Q584P487O315N027
50428A496357M027L646L717M011M689N823O880P274P396Q346J0621J3510J6021
50415A592318J7963J9879K2225K4899K7482K9602L1174L2342L3292L4062L4563
$$ plain form
50404 1899801 1934561 1969267 2003674 2037367 2069625 2099472 2125960 2148446 2166599 2180038 2188086
50393 2188086 2190048 2185682 2175167 2158637 2136081 2107843 2074869 2038195 1998462 1956346 1913247 1871020
50381 1871020 1830932 1793335 1758467 1727067 1699819 1676595 1656851 1640686 1628915 1621868 1618464 1616707
50369 1616707 1614876 1611980 1607336 1600160 1589667 1575346 1557062 1535030 1509740 1481719 1451252 1418482
50357 1418482 1383865 1348378 1313072 1278467 1244475 1210860 1177612 1145004 1113594 1084317 1058266
50346 1058266 1035958 1016853 999873 984570 971552 961644 954899 950816 949338 951105 956464 964609 974052
50333 974052 983805 993855 1004662 1016509 1029216 1042090 1054069 1064314 1072814 1080240 1087163 1093637
50321 1093637 1099548 1104972 1109980 1114439 1118313 1121956 1125761 1129635 1133126 1136002 1138414 1140546 1142372 1143837
$$ packed form
50404A899801L4760L4706L4407L3693L2258K9847K6488K2486J8153J3439Q048
50393B188086J962m366j0515j6530k2556k8238l2974l6674l9733m2116m3099m2227
50381A871020m0088l7597l4868l1400k7248k3224j9744j6165j1771p047l404j757
50369A616707j831k896m644p176j0493j4321j8284k2032k5290k8021l0467l2770
50357A418482l4617l5487l5306l4605l3992l3615l3248l2608l1410k9277k6051
50346A058266k2308j9105j6980j5303j3018r908o745m083j478J767N359Q145R443
50333I74052R753J0050J0807J1847J2707J2874J1979J0245Q500P426O923O474
50321A093637N911N424N008M459L874L643L805L874L491K876K412K132J826J465
$$ plain form
50307 1143837 1145044 1146202 1147536 1149301 1151727 1154952 1159041 1164008 1169645 1175576 1181804 1189089 1198272 1209133
50293 1209133 1220439 1231450 1243047 1256967 1274206 1294539 1317295 1341820 1366974 1390712 1410609
50282 1410609 1424754 1432143 1432753 1427681 1418967 1408622 1397569 1385575 1372147 1357290 1341551 1325781
50270 1325781 1310915 1297562 1285605 1274502 1264185 1255291 1248282 1242678 1237657 1233125 1229688 1227623 1226404
50257 1226404 1225299 1223991 1222525 1221002 1219470 1217840 1215932 1214006 1213243 1215105 1219922 1226568 1233846 1241783
50243 1241783 1251268 1262841 1276359 1291466 1307866 1325246 1343444 1362582 1382656 1403096 1423087
50232 1423087 1442185 1460271 1477132 1492526 1506447 1518781 1528836 1535738 1539156 1539052 1534881 1525854
50220 1525854 1512071 1494624 1474454 1451834 1427195 1401549 1375659 1349496 1323148 1297577 1273729
$$ packed form
50307A143837J207J158J334J765K426L225M089M967N637N931O228P285R183J0861
50293A209133J1306J1011J1597J3920J7239K0333K2756K4525K5154K3738J9897
50282A410609J4145P389O10n072q714j0345j1053j1994j3428j4857j5739j5770
50270A325781j4866j3353j1957j1103j0317q894p009n604n021m532l437k065j219
50257A226404j105j308j466j523j532j630j908j926p63J862M817O646P278P937
50243A241783R485J1573J3518J5107J6400J7380J8198J9138K0074K0440J9991
50232A423087J9098J8086J6861J5394J3921J2334J0055O902L418j04m171r027
50220A525854j3783j7447k0170k2620k4639k5646k5890k6163k6348k5571k3848
$$ plain form
50209 1273729 1251295 1229129 1206616 1183998 1161522 1139095 1116772 1094930 1073830 1053405 1033570
50198 1033570 1014337 995609 977236 959407 942700 927717 914809 904022 894964 886832 878881 870903
50186 870903 863037 855318 847743 840511 833652 826621 818878 810798 803372 796922 790787 784397 778016 772126
50172 772126 766703 761482 756480 751794 747323 743083 739469 736787 734819 733232 732108 731684 731824 732198 732756
50157 732756 733615 734736 736158 738313 741558 745597 749985 755015 761369 768826 776101 782299 787871 793714
50143 793714 799819 805412 810150 814549 819237 824286 829494 834994 841376 849311 859248 871420 885987 903054
50129 903054 922590 944427 968395 994437 1022586 1052948 1085708 1120969 1158394 1197101 1236158
50118 1236158 1275207 1314447 1354038 1393695 1432906 1471313 1508678 1544585 1578251 1608596 1634486
$$ packed form
50209A273729k2434k2166k2513k2618k2476k2427k2323k1842k1100k0425j9835
50198A033570j9233j8728j8373j7829j6707j4983j2908j0787r058q132p951p978
50186H70903p866p719p575p232o859p031p743q080p426o450o135o390o381n890
50172G72126n423n221n002m686m471m240l614k682j968j587j124m24J40L74N58
50157G32756Q59J121J422K155L245M039M388N030O354P457P275O198N572N843
50143G93714O105N593M738M399M688N049N208N500O382P935R937J2172J4567J7067
50129I03054J9536K1837K3968K6042K8149L0362L2760L5261L7425L8707L9057
50118A236158L9049L9240L9591L9657L9211L8407L7365L5907L3666L0345K5890
$$ plain form
50107 1634486 1655034 1669797 1678726 1681895 1679324 1671008 1657074 1637898 1614072 1586165 1554559 1519741
50095 1519741 1482908 1445952 1410451 1376718 1344151 1312469 1282246 1254346 1229295 1207306 1188386
50084 1188386 1172161 1157976 1145490 1134869 1126199 1119126 1113412 1109455 1107668 1107587 1108137 1108756 1109703 1111284
50070 1111284 1113265 1115157 1116662 1117708 1118443 1119291 1120559 1121780 1121884 1120276 1117433 1114125 1110408 1105837 1100380
50055 1100380 1094589 1088851 1082936 1076441 1069408 1062378 1056018 1050780 1046788 1043916 1041984 1040939 1040883 1042061
50041 1042061 1044805 1049305 1055267 1062042 1069311 1077485 1087101 1097937 1109157 1120236 1131292 1142392 1153049
50028 1153049 1162704 1171323 1179141 1186138 1192154 1197313 1201847 1205600 1208202 1209696 1210542 1210923 1210509 1208977 1206378
50013 1206378 1202849 1198437 1193562 1189275 1186628 1185960 1187029 1189535 1193176 1197497 1202281 1208042 1215719 1225886
$$ packed form
50107A634486K0548J4763Q929L169k571q316j3934j9176k3826k7907l1606l4818
50095A519741l6833l6956l5501l3733l2567l1682l0223k7900k5051k1989j8920
50084A188386j6225j4185j2486j0621q670p073n714l957j787q1N50O19R47J581
50070A111284J981J892J505J046P35Q48J268J221J04j608k843l308l717m571n457
50055A100380n791n738n915o495p033p030o360n238l992k872j932j045n6J178
50041A042061K744M500N962O775P269Q174R616J0836J1220J1079J1056J1100J0657
50028A153049R655Q619P818O997O016N159M534L753K602J494Q46L81m14j532k599
50013A206378l529m412m875m287k647o68J069K506L641M321M784N761P677J0167
$$ plain form
49999 1225886 1238596 1253764 1271100 1289606 1307824 1324941 1341251 1357262 1372732 1386817 1398750
49988 1398750 1407933 1413598 1414832 1410897 1401368 1386201 1366029 1342117 1315604 1286791 1255470 1221829
49976 1221829 1186720 1151190 1116143 1082392 1050583 1020949 993392 967857 944415 923039 903622
49965 903622 886215 870882 857330 845030 833792 823844 815304 807978 801800 797048 793883 792004 791071
49952 791071 791190 792669 795393 798761 802183 805521 809059 813111 817587 821938 825669 828817 831606 833686
49938 833686 834169 832593 829434 825432 820825 815536 809658 803204 795682 786499 775841 764680 753883 743590
49924 743590 733501 723479 713827 705151 697924 692090 687232 683269 680661 679620 679417 679015 678261 677984 678894
49909 678894 680894 683483 686363 689538 693240 697870 703620 710049 716479 722960 730357 739231 749035 758743
$$ packed form
49999A225886J2710J5168J7336J8506J8218J7117J6310J6011J5470J4085J1933
49988A398750R183N665J234l935r529j5167k0172k3912k6513k8813l1321l3641
49976A221829l5109l5530l5047l3751l1809k9634k7557k5535k3442k1376j9417
49965I03622j7407j5333j3552j2300j1238r948q540p326o178m752l165j879r33
49952G91071J19J479K724L368L422L338L538M052M476M351L731L148K789K080
49938H33686M83j576l159m002m607n289n878o454p522r183j0658j1161j0797j0293
49924G43590j0089j0022r652q676p227n834m858l963k608j041k03m02p54k77R10
49909F78894K000K589K880L175L702M630N750O429O430O481P397Q874R804R708
$$ plain form
49895 758743 767866 776435 784272 790820 795645 798735 800258 800297 798875 796059 791995 786866 780776 773659 765411
$$ packed form
49895G58743R123Q569P837O548M825L090J523L9j422k816m064n129o090p117q248
$$ [...]
##END NTUPLES=NMR SPECTRUM
##END=
